##TITLE=1H_Pr-Q
 CDCl3
 8 sc, 
 13.3.2023
##JCAMPDX= 6.0         $$ Bruker NMR JCAMP-DX V2.0
##DATA TYPE= NMR FID
##DATA CLASS= NTUPLES
##ORIGIN= UXNMR, Bruker Analytische Messtechnik GmbH
##OWNER= root
$$ XWIN-NMR		Version 3.5
$$ Mon Mar 13 16:07:46 2023 Russian Standard Time (UT+4h)  she@DPX200
##.OBSERVE FREQUENCY= 200.13135
##.OBSERVE NUCLEUS= ^1H
##.DELAY= (6, 6)
##.ACQUISITION MODE= SIMULTANEOUS
##.ACQUISITION SCHEME= undefined
##.AVERAGES= 8
##.DIGITISER RES= 18
##SPECTROMETER/DATA SYSTEM= spect
##.PULSE SEQUENCE= zg30
##.SOLVENT NAME= CDCl3
##.SHIFT REFERENCE= (INTERNAL, CDCl3, 0, 15.7039)
##AUDIT TRAIL= $$ (NUMBER, WHEN, WHO, WHERE, WHAT)
$$ ##TITLE= Audit trail, XWIN-NMR		Version 3.5
$$ ##JCAMPDX= 5.01
$$ ##ORIGIN= Bruker BioSpin GmbH
$$ ##OWNER= she
$$ F:/spectra/data/she/nmr/H-F/1/audita.txt
$$ ##AUDIT TRAIL=  $$ (NUMBER, WHEN, WHO, WHERE, WHAT)
(   1,<2023-03-13 16:06:07.03 +0400>,<she>,<DPX200>,
      <created by zg, POWCHK disabled, PULCHK disabled
       configuration hash MD5:
       00 E9 B6 7A A2 85 ED C7 34 08 36 98 17 FE 4E 26
       data hash MD5: 16K
       47 2B 67 E6 5D 86 7E A6 EA 22 BA CA 7F F4 B2 FA>)
$$ ##END=
$$ 
$$ hash MD5
$$ 14 FB B6 8F 1A 48 68 A0 B3 0B 38 CA 31 68 8F 5C
##$RELAX= 
##$RELAX= 
##$RELAX= 
##$RELAX= 
##$RELAX= 
##$RELAX= 
$$ Bruker specific parameters
$$ --------------------------
##$DU= <F:/spectra>
##$EXPNO= 1
##$NAME= <H-F>
##$PROCNO= 1
##$TYPE= <nmr>
##$USER= <she>
##$AMP= (0..31)
100 100 100 100 100 100 100 100 100 100 100 100 100 100 100 100 100 100 
100 100 100 100 100 100 100 100 100 100 100 100 100 100 
##$AQSEQ= 0
##$AQ_mod= 1
##$AUNM= <au_zg>
##$AUTOPOS= <>
##$BF1= 200.13
##$BF2= 200.13
##$BF3= 200.13
##$BF4= 200.13
##$BF5= 200.13
##$BF6= 200.13
##$BF7= 200.13
##$BF8= 200.13
##$BYTORDA= 1
##$CFDGTYP= 0
##$CFRGTYP= 5
##$CHEMSTR= <none>
##$CNST= (0..31)
1 1 145 1 1 1 1 1 1 1 1 1 1 1 1 1 1 1 1 1 1 1 1 1 1 1 1 1 1 1 1 1 
##$CPDPRG= <>
##$CPDPRG1= <>
##$CPDPRG2= <>
##$CPDPRG3= <>
##$CPDPRG4= <mlev>
##$CPDPRG5= <mlev>
##$CPDPRG6= <mlev>
##$CPDPRG7= <mlev>
##$CPDPRG8= <mlev>
##$CPDPRGB= <>
##$CPDPRGT= <>
##$D= (0..31)
0 1.2 0 0 0 0 0 0 0 0.06 0 0.03 0 0 0 0 0.0002 0 0 0 0 0 0 0 0 0 0 0 0 
0 0 0 
##$DATE= 1678709166
##$DBL= (0..7)
120 120 120 120 120 120 120 120 
##$DBP= (0..7)
150 150 150 150 150 150 150 150 
##$DBP07= 0
##$DBPNAM0= <>
##$DBPNAM1= <>
##$DBPNAM2= <>
##$DBPNAM3= <>
##$DBPNAM4= <>
##$DBPNAM5= <>
##$DBPNAM6= <>
##$DBPNAM7= <>
##$DBPOAL= (0..7)
0.5 0.5 0.5 0.5 0.5 0.5 0.5 0.5 
##$DBPOFFS= (0..7)
0 0 0 0 0 0 0 0 
##$DE= 6
##$DECBNUC= <off>
##$DECIM= 32
##$DECNUC= <off>
##$DECSTAT= 4
##$DIGMOD= 1
##$DIGTYP= 9
##$DL= (0..7)
0 120 120 120 120 120 120 120 
##$DP= (0..7)
150 150 150 150 150 150 150 150 
##$DP07= 0
##$DPNAME0= <>
##$DPNAME1= <>
##$DPNAME2= <>
##$DPNAME3= <>
##$DPNAME4= <>
##$DPNAME5= <>
##$DPNAME6= <>
##$DPNAME7= <>
##$DPOAL= (0..7)
0.5 0.5 0.5 0.5 0.5 0.5 0.5 0.5 
##$DPOFFS= (0..7)
0 0 0 0 0 0 0 0 
##$DQDMODE= 0
##$DR= 18
##$DS= 0
##$DSLIST= <SSSSSSSSSSSSSSS>
$$ [...]
##$SUBNAM2= <"">
##$SUBNAM3= <"">
##$SUBNAM4= <"">
##$SUBNAM5= <"">
##$SUBNAM6= <"">
##$SUBNAM7= <"">
##$SUBNAM8= <"">
##$SUBNAM9= <"">
##$SW= 18.05172834244
##$SWIBOX= (0..15)
0 0 2 0 0 0 0 0 0 0 0 0 0 0 0 0 
##$SW_h= 3612.71676300578
##$TD= 16384
##$TD0= 1
##$TE= 0
##$TE2= 300
##$TE3= 300
##$TEG= 300
##$TL= (0..7)
0 120 120 120 120 120 120 120 
##$TP= (0..7)
150 150 150 150 150 150 150 150 
##$TP07= 0
##$TPNAME0= <>
##$TPNAME1= <>
##$TPNAME2= <>
##$TPNAME3= <>
##$TPNAME4= <>
##$TPNAME5= <>
##$TPNAME6= <>
##$TPNAME7= <>
##$TPOAL= (0..7)
0.5 0.5 0.5 0.5 0.5 0.5 0.5 0.5 
##$TPOFFS= (0..7)
0 0 0 0 0 0 0 0 
##$TUNHIN= 0
##$TUNHOUT= 0
##$TUNXOUT= 0
##$USERA1= <user>
##$USERA2= <user>
##$USERA3= <user>
##$USERA4= <user>
##$USERA5= <user>
##$V9= 5
##$VALIST= <valist>
##$VCLIST= <CCCCCCCCCCCCCCC>
##$VD= 0
##$VDLIST= <DDDDDDDDDDDDDDD>
##$VPLIST= <PPPPPPPPPPPPPPP>
##$VTLIST= <TTTTTTTTTTTTTTT>
##$WBST= 1024
##$WBSW= 4
##$XGAIN= (0..3)
0 0 0 0 
##$XL= 0
##$YL= 0
##$YMAX_a= 134579
##$YMIN_a= -169914
##$ZGOPTNS= <>
##$ZL1= 120
##$ZL2= 120
##$ZL3= 120
##$ZL4= 120
##$ABSF1= 10
##$ABSF2= 0
##$ABSG= 5
##$ABSL= 3
##$ALPHA= 0
##$AQORDER= 0
##$ASSFAC= 0
##$ASSFACI= 0
##$ASSFACX= 0
##$ASSWID= 0
##$AUNMP= <proc_1d>
##$AZFE= 0.1
##$AZFW= 0.1
##$BCFW= 1
##$BC_mod= 2
##$BYTORDP= 1
##$COROFFS= 0
##$CY= 11.3945322036743
##$DATMOD= 1
##$DC= 2
##$DFILT= <>
##$DTYPP= 0
##$F1P= 2.36226072786647
##$F2P= -0.459571619588291
##$FCOR= 0.5
##$FTSIZE= 0
##$FT_mod= 4
##$GAMMA= 1
##$GB= 0.15
##$INTBC= 1
##$INTSCL= 1
##$ISEN= 128
##$LB= 0.24
##$LEV0= 0
##$LPBIN= 0
##$MAXI= 10000
##$MC2= 0
##$MEAN= 0
##$ME_mod= 0
##$MI= 1.114404
##$NCOEF= 0
##$NC_proc= 0
##$NLEV= 6
##$NOISF1= 3.799351
##$NOISF2= 2.8
##$NSP= 1
##$NTH_PI= 0
##$NZP= 0
##$OFFSET= 15.70392
##$PC= 1
##$PHC0= -19110.5
##$PHC1= 17.40074
##$PH_mod= 1
##$PKNL= yes
##$PPARMOD= 0
##$PSCAL= 0
##$PSIGN= 0
##$REVERSE= no
##$SF= 200.130013532006
##$SI= 16384
##$SIGF1= 3
##$SIGF2= 2
##$SINO= 400
##$SIOLD= 16384
##$SREGLST= <1H.CDCl3>
##$SSB= 0
##$STSI= 0
##$STSR= 0
##$SW_p= 3612.71676300578
##$SYMM= 0
##$S_DEV= 0
##$TDeff= 0
##$TDoff= 0
##$TI= <>
##$TILT= no
##$TM1= 0
##$TM2= 0
##$TOPLEV= 0
##$USERP1= <user>
##$USERP2= <user>
##$USERP3= <user>
##$USERP4= <user>
##$USERP5= <user>
##$WDW= 1
##$XDIM= 8192
##$YMAX_p= 0
##$YMIN_p= 0
$$ End of Bruker specific parameters
$$ ---------------------------------
##NTUPLES= NMR FID
##VAR_NAME=  TIME,          FID/REAL,        FID/IMAG
##SYMBOL=    X,             R,               I
##VAR_TYPE=  INDEPENDENT,   DEPENDENT,       DEPENDENT
##VAR_FORM=  AFFN,          ASDF,            ASDF
##VAR_DIM=   8192,          8192,            8192
##UNITS=     SECONDS,       ARBITRARY UNITS, ARBITRARY UNITS
##FACTOR=    0.0002768,     1,               1
##FIRST=     0,             0,               0
##LAST=      2.2672688,     0,               0
##MIN=       0,             -169914,         0
##MAX=       2.2672688,     134579,          0
$$ Real data points
##PAGE= N=1
##DATA TABLE= (X++(R..R)), XYDATA
0@%%%%%%%%%%%%%Qj6J6j6J6k4L2l9M7n5O3p2Q8j04J20j36J54j78K04k30K60k95
35a57L35l79M25m73N28n90O55p25Q03q89R85j087J199j323J456j603J767j950
53a023K151k372K623k909L234l609M049m573N208n996P006q359J0267j3177J8233
68A0753k9461J00447o0232j73121J50677J12732p2836j01578N1390M1082k2025
79G828k5491K907j8358K6094N1610k6646r8046J4869J18030K5100j08866m1527
91g2496P7960M8623m5527l1467K1720K0663q089j3996j4460P000L3602O531m5149
104a5085k4221L1883K9919o623j2596j4921j5432K3027L9696k0167m7918K0983
116a1455M9855k7869n6093L0233O2194k2201o1294O462M1428j270j3757J0539
$$ plain form
0 0 0 0 0 0 0 0 0 0 0 0 0 0 0 8 -8 8 -8 8 -16 16 -23 24 -31 32 -40 48 -56 64 -72 82 -96 108 -122 138 -157
35 -157 178 -201 224 -249 279 -311 344 -381 422 -467 518 -569 630 -693 763 -840 927 -1023
53 -1023 1128 -1244 1379 -1530 1704 -1905 2144 -2429 2779 -3217 3789 -4570 5697 -7480 10753
68 10753 -18708 81739 21507 -151614 -937 111795 38959 -62619 -11229 29853 7828
79 7828 -17663 -14756 -33114 -7020 44590 17944 -80102 -65233 52797 77897 -30969 -72496
91 -72496 5464 54087 8560 -22907 -1187 19476 11387 -2609 -17069 -10069 23533 30064 -15085
104 -15085 -39306 -7423 22496 15873 3277 -11644 -27076 -4049 35647 15480 -32438 -11455
116 -11455 38400 10531 -45562 -15329 46865 24664 -36630 -30168 11260 9990 -3767 6772
128F772p121k5841J8631L6508k2426l3699L5536L3092m8711l6624N6047M3053
140E5217m9989m2079L4695K7884k8027j5045K3476M848k2977n862J2580M284R96
153AL761q785j3764J1462K1852m917j8110N121J5786q331j2906J2004J5627q516
167A0285j6479j791P456Q872L242j1976j3004Q049J2408r227p963J5018O360k0473
181i223q952K0662J1675j4559o395J0771k637j1631P099J6014n506j6226J446
194g462R525j833j237P419k302j2271L222J3145l647r040Q740P714j4496j0686
208a3209J5868J3215j2427j3511M584O554j899j706J964j688l014P05M24Q58M696
223A414L034n237n407M794P419q99k699J793j132n069K425P695j295q526r04L868
$$ plain form
128 6772 -349 -26190 -7559 28949 6523 -27176 8360 41452 -7259 -43883 12164 55217
140 55217 5228 -36851 -2156 25728 -2299 -17344 6132 10980 -11997 -17859 -5279 -995 1
153 1 3762 -5023 -18787 -7325 14527 9610 -8500 -3379 12407 4076 -8830 3174 18801 10285
167 10285 -6194 -7985 -529 8343 11585 -391 -13395 -5346 7062 -2165 -10128 4890 11250 -9223
181 -9223 -18175 2487 14162 -397 -6792 3979 1342 -10289 -3190 12824 7318 -8908 -7462
194 -7462 2063 230 -1007 6412 4110 -8161 -4939 8206 4559 -4481 4259 11973 -2523 -13209
208 -13209 2659 15874 3447 -10064 -5480 1074 -825 -2531 -567 -2255 -5269 -4564 -4140 -3282 1414
223 1414 4448 -789 -6196 -1402 6017 5118 2419 4212 3080 -1989 436 8131 6836 -1690 -2594 1274
239A274j059k060K134k60l984L65J842k543N0P700O72j0949k322J2125O015r421
255d21n320P338M246o071k695N652K352l546k466J66j38K997K430l753n598L021
271a806N912k866m775K601L359l534l100L041K508k162j813O19L52l73J846O89
287D98j534n40J619J16l07K193J385k876j137L515J646l301j098L535l26m163
303g75o69L599q09l095j49R11r33n34J687q63j867J566K199j245k003K660K578
320B258k244j845K676K382k092j104J897N36j624J9J213q87j542O21N13j139m85
337h47N96J54j266J96O45j132j71J325Qj430L20J804j50j560N64J641M9n86J39
356B99L01j65O16O68j002o51J343P18j237r45R77N22j363m17K35m9o23K17p2j232
$$ plain form
239 1274 215 -1845 289 29 -3955 -3590 -1748 -4291 -4241 3459 4131 -6818 -9140 2985 9000 -421
255 -421 -5741 1597 5843 -228 -2923 2729 5081 1535 -931 -765 -903 2094 4524 771 -4827 -1806
271 -1806 4106 1240 -3535 -934 2425 -1109 -4209 -1168 1340 -822 -2635 -2016 -1664 -2037 -191 498
287 498 -1036 -1576 43 159 -148 2045 3430 554 -583 2932 4578 1277 179 3714 3388 -775
303 -775 -1444 2155 1346 -1749 -1898 -987 -1920 -2454 -767 -1630 -3497 -1931 268 -977 -2980 -320 2258
320 2258 14 -1831 845 3227 1135 31 1928 2464 840 859 2072 1185 -357 264 777 -362 -847
337 -847 -251 -97 -1363 -1167 -522 -1654 -1825 -500 -492 -1922 -1602 202 52 -1508 -944 697 746 160 299
356 299 600 435 1051 1719 717 66 1409 2127 890 -55 922 1444 81 -336 -101 -150 -773 -556 -628 -1860
376a860q70J724R48j707q65J160J677m13j252N29J309J217j77j233k12J942J634
393C551j794k320J043K635j067k255j155J608J336j659k111r9J473J265j350k270
409c169P58K777O80l129j157L085K631k096k076J100K238K09j439o59P81P55M24
426A713p46p77R5J082k26j251o43R14P05j097j479R17J312r72j219K37Q62p76
444a349p29J708J255j250j465N87K588l6j157n58J797L07j019k05O27J76J80K78
462A735k432j723K776L081k401n038Q14M878K04m202j598L585K134k844k727K268
478a490K843L38j750j752l94L278L867k333n893L74P373J448o678k945M955L937
494E178m308n319K284O339l17o689k586L259M033Q05l023m493P2N977K829n881
$$ plain form
376 -1860 -2730 -1006 -58 -1765 -2630 -1470 207 -206 -1458 -929 380 1597 1420 187 -25 1917 3551
393 3551 1757 -563 480 3115 2048 -207 -1362 246 1582 -77 -2188 -2287 -814 451 -899 -3169
409 -3169 -2411 366 1046 -2083 -3240 -155 2476 380 -1696 -596 1642 1851 412 -247 534 1289 1713
426 1713 967 190 285 1367 1141 -110 -753 161 866 -231 -1710 -793 519 -453 -1672 -1435 -573 -1349
444 -1349 -2078 -370 885 -365 -1830 -1243 1345 1309 152 -406 1391 1698 679 474 1101 1277 1457 1735
462 1735 -697 -2420 356 3437 1036 -4002 -3188 1690 1894 -2308 -3906 -321 1813 -1031 -3758 -1490
478 -1490 1353 1691 -59 -1811 -2205 1073 4940 2607 -3286 -2912 4461 5909 -769 -3714 1241 5178
494 5178 870 -4449 -2165 4174 3857 -2832 -5418 -2159 1874 2679 -344 -4837 -4765 1212 4041 -1840
510a840l344N795M247n504n698M807Q091j896p643j888N721M147k339k483m84
525c11j00Q08J704j049k573J537K475k677m021K214N124p85n522j378L605K821
541A872j337j931N07k4k90J079K668q51l043Q62K691j494j476K759K178l381m107
558c318J773M197J70k837j229R7l73l37K956Q87l709j850K901J240k825O07M431
575B781j122n393L67M823J329k073k77J20j722K66L382J483l357k245K002J914
591B278k052k155L257J722l498l708K594L534l91k231j899k08J992K193r21k115
607a608M23J469m89o95O96J876Q29k550k800J593N037P47m575k214K058J464r64
624B97K7J744q58l119o80K038J991m60j341j060o71l64K523K033j632k200O86
$$ plain form
510 -1840 -5184 611 4858 -646 -6344 -1537 6554 4658 -2985 -4873 848 4995 2656 173 -311
525 -311 -411 397 2101 1052 -1521 16 2491 -186 -4207 -1993 3131 2346 -3176 -4554 -949 1872
541 1872 535 -1396 -889 -913 -1203 -124 2544 1693 -1350 -488 2203 709 -767 1992 4170 789 -3318
558 -3318 -1545 2652 2822 -15 -1244 -1147 -1520 -1857 1099 1986 -1723 -3573 -672 568 -2257 -1650 2781
575 2781 1659 -3734 -3367 1456 2785 712 435 555 -1167 -901 2481 3964 607 -1638 364 2278
591 2278 226 -1929 1328 3050 -448 -4156 -1562 1972 1581 -650 -2549 -2757 -765 1428 507 -1608
607 -1608 -1185 284 -205 -900 -204 1672 2501 -49 -2849 -1256 3781 4528 -47 -2261 -203 1261 297
624 297 324 2068 1210 -1909 -2589 -551 1440 980 -361 -1421 -2092 -2456 67 2100 468 -1732 -1046
641a046K38k94J910K657j955m157J148L137N19j335k5L44j418r00J822J580q37
658A388j974p79l70J098J544Q51j976k732N36K018J005n65j03j002o22M76J727
675E20O20K9k32j702j456K113L316m42k140j503o6J259J288J82j716q72M98j81
693d85m51R56J507n31l071j516K844K708j021k093l49P70M48O09P06j25o11k21
711G4m78k16J813K002k080k423N73J856M65q59k09m50o96k11O11P60k27q17o90
730a202o25O65J411L80j298o89N84M89K19P95O47j263j275N42J507M17j98l81
748G25m16p99L99J172R8m60p08q59R1R04O64o09j024l12K93J93M04O52n21q53
768i66n73J220P53J12l00j49o00L25P56N53N4p89j21m31K86Q41K82o95r39j31
$$ plain form
641 -1046 -808 -1102 808 3465 1510 -2647 -1499 1638 2157 822 797 1141 -277 -1177 645 2225 1388
658 1388 -586 -1365 -1735 -637 907 1758 -218 -2950 -2414 -396 609 44 -59 -1061 -1683 -1207 520
675 520 1140 1169 937 -765 -2221 -108 3208 2766 626 -877 -943 316 1604 1786 70 -802 -304 -485
693 -485 -936 20 1527 996 -2075 -3591 -747 1961 940 -1153 -1502 -732 -284 325 1031 906 295 74
711 74 -404 -620 1193 3195 1115 -1308 -735 1121 1586 727 518 68 -628 -839 -228 532 305 -512 -1202
730 -1202 -1827 -1162 249 629 -669 -1358 -774 -285 -66 729 1376 113 -1162 -620 887 1304 1106 725
748 725 309 -490 -91 1081 1179 719 11 -848 -757 147 811 202 -822 -1134 -841 -648 -244 408 -113 -966
768 -966 -1539 -319 434 546 246 97 -503 -178 578 1131 1185 396 275 -156 130 971 1253 558 -381 -512
788e12L15K95P7j2n05o75l76O60P51rl85k08k16M48Q64P2p67M4K29J9J59M10M26
811A104m60q64M9P62J13n6l33m87p6j70N73K7l21m65j66J23q5L36K93m28k7r3
833f51N2M99L29K12n64J20J76M45L1j28m3o2p1j79L41J39l35k51n10K96M58L46
855F50r07l55M1K08K08p0k36P9j00j08K77K64K04N9P2l58P0J64K55M24m30Qj25
878B94j10L07j73j92j92L25l27Oj90m0j13Q7j88n9M9L61j20l32K01L59M41m05
900a1j79K52J07L02j42j35K0J24K73K29n17m38N25J44o33l52N37J54l30o92L76
921c86M75j52m10o3%K21J00j97j47K28K24L36k63m59O20P21k09p70J76R88l81
942F52n68P1N49l60m28R3Q8k87J16K98l74m52J65M85q3p47q7P82L84r85j6J084
$$ plain form
788 -512 -197 98 175 163 -342 -1017 -1393 -733 18 9 -376 -584 -800 -352 512 584 -183 -139 90 109 268 678 1104
811 1104 644 -220 -171 591 704 648 315 -172 -248 -418 155 182 -139 -604 -770 -647 -732 -396 -103 -531 -558 -651
833 -651 -599 -100 229 441 -123 -3 173 618 649 521 478 416 345 166 507 646 311 60 -450 -154 304 650
855 650 -257 -612 -571 -363 -155 -225 -461 -382 -482 -590 -313 -49 155 214 286 -72 -2 162 417 841 411 419 294
878 294 184 491 318 126 -66 259 -68 -62 -252 -292 -405 -318 -506 -565 -516 -155 -275 -607 -406 -47 394 -11
900 -11 -190 62 169 471 329 194 214 338 611 840 323 -115 410 554 -79 -431 106 260 -70 -762 -386
921 -386 89 -63 -473 -536 -536 -315 -215 -412 -559 -331 -107 229 -34 -493 127 848 639 -131 45 1033 652
942 652 84 155 704 344 -84 9 97 -190 -74 224 -150 -602 -437 48 -35 -782 -869 -87 297 -688 -704 380
964C80k63k72n3N37Ml84Q55l66l74M06j61m0l5k32M2M41m5q05L27K43l30m48N58
987a5q1l54rJ63J45n99J89Q93k37m23j63O35P83o91q4K26L27m11o5L27N9o53N78
1010E40Q8r09k80J011K16j030m83R63K12m89r07O40N70l87k96M79J11m36K33M52
1030B98l78l77N34O45k68p78Q31K24l19n09J43K67J45l99j8pJ38j47n17P3K32
1051a87J21n2j28j48l12O40K60o12K16M68j63n31M02J78M16k43l65R9J17J52j69
1072A59N52k0r23L04N71l26n29K00L92q90l38O42M49l45j80J71j43K9m6L80j99
1093i0k49k2M76M00l11j15K77l8k41J97M69n25r8m6j29j73L33K15j79p06M1K96
1115b18L26J6m57k31j6N99l15J71M24m51l72K01N37K09L6j44l56J13J73L86j53
$$ plain form
964 380 117 -155 -208 329 333 -51 804 438 64 470 309 269 234 2 44 485 440 -365 -38 205 -125 -573 -15
987 -15 -96 -450 -459 -296 -151 -750 -561 332 95 -328 -491 144 927 236 152 378 705 294 229 556 615 -38 540
1010 540 628 -281 -561 450 666 -364 -847 116 328 -161 -1068 -428 142 -245 -541 -62 49 -387 -154 298
1030 298 -80 -457 77 722 454 -324 507 731 412 -97 46 313 458 59 41 34 172 25 -492 -419 -187
1051 -187 -66 -118 -246 -394 -706 -66 194 -418 -202 266 103 -428 -26 152 568 325 -40 59 176 328 159
1072 159 711 691 -232 72 643 317 -212 -12 380 -510 -848 -206 243 -102 -282 -111 -254 -225 -271 109 -90
1093 -90 -339 -361 115 515 204 89 366 328 87 284 753 228 130 84 -45 -218 115 330 151 -555 -514 -218
1115 -218 108 124 -333 -564 -580 19 -296 -125 299 -152 -524 -323 214 423 459 315 -41 72 245 631 478
1136D78j54k63j01K3R5K41J6q6n73l22N97J05m1l09j1j94L9M74J49l30j28J23
1158a72K7J93J69oJ81m88j3L87J66k6N0l04m00K59L72k68j40R4j11l13K55M66
1180C78l56m10On1M5J08J75L04o76P8L11K99j90L66j53k47J65J79J50j02M5m08
1202A6p1K1J2K89Ql17l49J4L63j67K91j86k94J0j9J51K0O48n99m38M78L16K02
1225C99j30m59J86l5J13L38N0m37j52J70J24m9J37j4m5o82O2P73l2m22k02k9m01
1248g37J81O51J94k61j47J8j41K94L20J38o20oJ32K74j14K30k32l65o1L94K64
1269D06k82K27n60j85O0M18J85l08k69O3km9k0M41k56l48J48L58J02k14K28k22
1291g9k84J93L57K41j94L3P1n44M00J59j31k67j57K3K78k17K22o2j78l02L21j64
$$ plain form
1136 478 324 61 -40 -17 78 319 335 249 -324 -646 -49 56 15 -294 -305 -499 -460 14 163 -167 -295 -172
1158 -172 -145 48 217 211 392 -96 -109 278 444 418 468 164 -236 23 395 127 -13 81 -30 -343 -88 378
1180 378 22 -388 -382 -433 -388 -280 -105 199 -477 -399 -88 211 21 387 234 -13 152 331 481 379 424 16
1202 16 -55 -34 -22 267 275 -42 -391 -377 -14 -181 110 -76 -370 -360 -379 -228 -208 440 -159 -597 -119 197 399
1225 399 269 -190 -4 -39 74 412 462 25 -127 43 167 118 255 241 196 -486 -424 349 317 -105 -307 -336 -737
1248 -737 -556 95 289 28 -119 -101 -242 52 372 510 -110 -116 16 290 176 406 174 -191 -252 142 406
1269 406 124 351 -209 -394 -334 84 269 -39 -308 -245 -247 -296 -316 125 -131 -479 -331 27 129 -85 143 -79
1291 -79 -363 -170 187 428 234 267 338 -206 194 353 222 -45 -202 -179 99 -118 104 42 -136 -438 -117 -281
1313b81J75Q3P3j64k8n7J12K18k1j70k41K68p9N53l59J7m9J24k20J43J71l47J7
1336f2J8n4j07K37j85O8k52J7Q6K06J44j11j89J58k63K07J18j5r9l0j09J91K96
1359B70j42J59k44J68J99k00n4k9j61l28K24K0K30p9j92J67k23L61k51K48j19
1380B4l42J03O2J77J19Nq8j63j2J51R0M7j30J28K2k54P9K17p2k91J26nl8m3J22
1405C4q8j45j43M6J01K81j66k19N5J78K81J05J5k22m4k55L90J10j72k9Q0pj82
1428Dq3Q2J54k22j14M4q1K35j29j19J47P8O9J9Nl62L0J42K67j08o5j12J4K02p7
1453B0po5J16l0k1J14k55q1N42j64k02p5O4R9j38j06N9J3k0J51j58j23j3J85n0
1478a45J97k00K47L53n62K94o5q4J90l69K27J29j73J33k54K04k83P7L43l14J41
$$ plain form
1313 -281 -106 -23 50 -114 -142 -199 -87 131 110 -60 -301 -33 -112 441 82 99 50 174 -46 97 268 -79 -62
1336 -62 -44 -98 -205 32 -153 -85 -337 -320 -234 -28 116 5 -184 -26 -289 -82 36 21 -78 -108 -217 -26 270
1359 270 128 287 43 211 410 210 156 127 -34 -362 -138 -118 112 33 -159 8 -215 146 -105 143 24
1380 24 -318 -215 -153 24 143 148 60 -103 -115 36 126 173 43 171 193 -61 18 235 163 -128 -2 -7 -45 -88 34
1405 34 -54 -199 -342 -296 -195 86 -80 -299 -244 -66 215 320 335 113 69 -186 204 314 142 113 193 186 4
1428 4 -79 3 157 -65 -179 -135 -216 19 -110 -229 -82 -4 65 84 89 -273 -243 -101 166 58 -7 -119 -105 97 20
1453 20 13 -52 64 34 13 127 -128 -209 333 169 -33 -108 -44 55 -83 -189 -130 -117 -137 14 -144 -267 -280 -95 -145
1478 -145 52 -148 99 452 -110 184 119 35 225 -144 83 212 39 172 -82 122 -161 -84 259 -55 86
1499H6k2l00J2o3K08R9O0m03Q2J05K11M6j20K23j96k7J51J48n51M56J28k27j17
1522a1K11n9p6J24j35K0r5l8k03K98p9k05J7L52o0j78k0MJ97j09K3r4p5N00k42
1547F7Q0O3l88L01J16n8j83J53N2l59K1L40M9m46J26j6j96L02k56L42q2k36J30
1570g8J10m63K48j13J49J59j87L14j65j16rj9J44J0j75M29k13O4l5j13J95lp8
1593E5Qj02j19P5K37j37M0l63K35J65k02k35L00k43kM75o1j87K14k23L10l9p9
1616A22j44j4L16l20J64k89M98k31k33J94j14k8m8R5OL4J98j94L8J89k52k62K58
1639a7q2K43k18J88J17k26K6j65K05R5J6o8k8K13k47p4K46l78K24j98K0%j53J42
1663a19R1N6j81J75j45J84j55k0K49k29kK58j15M0P2j01Q4j79r5J09K77l25M5
$$ plain form
1499 86 64 -236 -224 -287 -79 20 80 -323 -241 -136 75 121 1 224 28 1 152 300 -251 205 333 106 -11
1522 -11 200 141 65 189 54 74 -21 -59 -262 36 -43 -248 -231 121 61 -117 -137 -133 64 -45 -22 -116 -191 309 67
1547 67 147 210 -178 123 239 181 -2 151 203 -156 -135 205 254 -192 -66 -82 -278 24 -232 110 28 -208 -78
1570 -78 32 -431 -183 -296 -147 12 -175 139 -26 -142 -151 -170 -26 -16 -191 238 25 89 54 -59 136 133 55
1593 55 63 -39 -158 -83 154 17 57 -306 -71 94 -108 -343 -43 -286 -288 187 126 -61 153 -70 240 201 122
1616 122 -22 -36 280 -40 124 -165 333 102 -131 63 -51 -79 -127 -32 -26 8 206 12 50 239 -13 -275 -17
1639 -17 -99 144 -74 114 231 5 31 -134 71 166 182 114 86 299 52 -22 224 -154 70 -128 -108 -108 -261 -119
1663 -119 -28 28 -153 22 -123 61 -94 -114 135 -94 -96 162 47 87 159 58 142 -37 -132 -23 254 -71 -26
1686b6K00m8l18l0L73k65J88j68n7Q8l2K47n0k16K48m29K20J95k16O2j80K90K95
1709C71m24K39j48j28R6K18j88K63l16J49j94K09j20J79j73j57j3R2J8q7j7J23
1731hn3j17K45j09K19p1j15m9r1J92K0p3nJ16J38j65j98P8K37K3k75L6Jo7K35
1756A44j94R6j26n7j83L27k5j2j3m3rJ29L6R2l91k5M39j56OJ61j27p2K05j4j24
1781F4K4l6k10qJ86n5l46J57M4P3J21j13j37K35J34j52r3J10K13k14k24L75j6
1804A32M%j63K40j60n2Q7J31r9J18q6l42J60p5J16k7K28l89J04p2J00K20k4m9
1828A02k95K02j71M06K8l31j57J76K32j32j0Pl1j27N6J92k65o9J16P1J7q8J36
1851F5j57J78q2L2m2j17Nn4p0L92p1j3n2P5m17L34j77P9L01j82m2K35k69o6K5
$$ plain form
1686 -26 174 126 -192 -222 151 -114 74 -94 -151 -63 -95 152 102 -114 134 -295 -75 120 -96 -34 -214 76 371
1709 371 -53 186 38 -90 6 224 36 299 -17 132 -62 147 27 206 33 -124 -137 -45 -27 -114 -131 -8
1731 -8 -61 -178 67 -42 177 106 -9 -58 -149 43 63 -10 -15 101 239 74 -124 -46 191 214 -61 -25 -24 -91 144
1756 144 -50 46 -80 -137 -320 7 -18 -30 -43 -86 -95 34 70 162 -229 -254 185 29 35 196 69 -3 202 188 64
1781 64 88 52 -158 -166 20 -35 -381 -224 -180 -107 14 -99 -236 -1 133 -19 -112 -2 211 -3 -227 148 132
1804 132 136 136 -27 213 53 1 88 219 120 238 152 -190 -30 -105 11 -16 212 -177 -73 -145 -45 175 151 102
1828 102 -193 9 -162 244 272 -59 -216 -40 192 60 50 57 26 -101 -45 147 -118 -187 -71 0 17 -71 65
1851 65 -92 86 4 36 -6 -123 -118 -172 -242 150 79 66 14 89 -328 6 -171 -92 209 27 -15 220 -49 -115 -90
1876i0M29l02J06j42m1L12j86n8n3k82J40l2J56M9j7k38M14j07l6j29L15o3l02
1899a57q8K22J11O8N3k59k3J00m0L6j5q4L2j2n1o0L43j96n5k8r6J09l7J28K69
1924B70k73q4O0o1L4J79l24L01L8l8K70l88j6m0N0K54j05k36P4J66r1M2k06K76
1948A52l64M56j88k35J58K31k41jP8j48K32m46M5J15K86j99J11o7J73M9j16l05
1970b24L16j17q8Q7J83k89L91l58J61l7j09j58P3J20R3j13J17j6p9k45J14K97
1992A19j49J52j66J34l3O%j27kL9L34j88kj34J07j04O4L4O0Q6k03k35J69J04j21
2017e6k02J75k65M12k20J61k83K01K00o9q7jj13K95j61p7K87j91L5k09K44q1K08
2040B03m65K41M3K1O0m7k00K60q5j02J16k5k82Q2J95j18j25jO6L83m60L63p2Q0
$$ plain form
1876 -90 339 37 143 1 -40 272 86 28 -25 -307 -167 -199 -43 6 -11 -249 165 58 22 -107 208 145 -157
1899 -157 -245 -23 88 156 209 -50 -73 27 -13 23 8 -76 -44 -56 -107 -167 176 -20 -75 -103 -199 -90 -127 1 270
1924 270 -3 -87 -27 -88 -54 125 -199 102 140 102 372 -16 -32 -72 -22 232 127 -109 -35 131 40 82 -124 152
1948 152 -212 244 56 -179 -21 210 -31 -32 46 -102 130 -316 -271 -156 130 -69 42 -25 148 197 81 -224
1970 -224 92 -25 -113 -26 157 -132 259 -99 62 25 -84 -242 -169 -49 44 -69 48 32 -47 -292 -178 119
1992 119 -30 122 -44 90 57 63 63 -64 -66 -27 307 119 117 -17 90 -14 50 84 144 230 27 -208 -39 65 -56
2017 -56 -258 -83 -348 64 -156 5 -278 -77 123 54 -33 -34 -147 148 -13 -90 197 6 41 -168 76 -5 203
2040 203 -262 -21 22 43 103 56 -144 116 31 -71 45 20 -262 -180 15 -103 -228 -229 -163 220 -240 123 51 131
2064A31j89J78j14O3r2j91K24N8J04n3o3j12l2L3N4M2Q6k55K89Om24L80j89J05
2088C9ol30K34R6p8J62J18m10J73K8j17pQ3n6K51q6k21J42j33M4K53J9j56o5j42
2113a65J70R4k55M13l91qJ51k41L61j75m3L8%q1n8M5N8J08j71K20k40L78K3m20
2137a89J49K04l20J52qO8k41L58l74Q8K59j66J98j26l4j33k5K62R4J8l58j7K20
2160G9K1o9N8j37K35R2l92J95j48o0K0J20l6j47K02k12K73J18q4q1k58J83j72
2183b00J41L6j82O9J39j00N2J66j45j36J78J14R1o3k12o7L20j58m8m6J45J58k2
2206B30k09q0J87k4j54K82j83j53K00j77K05l04L3K80l27J20K08j78K0J85j32
2227B9JJ06l9kk22K0J33Jj31K40M8k31k37L93j55k30L77k26J14q3k2J35j79r2
$$ plain form
2064 131 -58 120 6 69 -23 -214 10 68 172 119 56 -56 -88 -55 -1 41 127 -128 161 167 -257 123 -66 39
2088 39 33 -297 -63 33 -45 117 235 -175 -2 26 -91 -98 -15 -71 180 94 -127 15 -118 -74 179 198 42 -23 -165
2113 -165 5 99 -156 257 -134 -142 9 -232 129 -46 -89 -51 -51 -132 -190 -145 -87 21 -150 70 -170 208 231 -189
2137 -189 -40 164 -156 -4 -12 56 -185 173 -201 -113 146 -20 178 52 18 -115 -140 122 216 234 -124 -141 79
2160 79 100 31 89 -48 187 279 -113 82 -66 -126 -106 14 -22 -169 33 -179 94 212 128 47 -211 -28 -200
2183 -200 -59 -23 -205 -136 3 -97 -45 121 -24 -160 18 132 223 160 -52 -119 201 43 -5 -51 94 252 230
2206 230 21 -59 128 104 -50 232 49 -104 96 -81 124 -180 -147 133 -194 -74 134 -44 -24 161 29
2227 29 30 136 97 95 -127 -107 26 27 -104 136 184 -47 -284 109 -46 -276 101 -125 -11 -94 -116 19 -160 -252
2251b52K91J11l98M34J12m75M0J04R0l6l07L77k67J87l6R2J3j49L0K60k70p7M9
2274g7P3J29r4k88OK17J6J85j71j36J45N0j75K12J36k02J36l46R0K36k35L1q0
2297a42J77p1N2k64K65o7P3j63K14J07j27j57J78o6k3j96K22lJ04j02qK42l27
2320h2p3r1J87R3j6k01J00K56k88K4j0j11n1K5L70j90m3O5J43q7k58Q3N4J98j67
2345g0R6K5J1k17J18J72k65KJ11Q7j68K52k83K80j63L8N9N2J18j34m48L68o8Q7
2369F0Q3j47K7j43J39N3j91J92l36L01O6q9k58J24J81j08qK13r5J12L1k58J69
2392A18j8j2j64J06J81j83j57K41k09J83j18k35J68L20m19j3K72k04j30K21K0
2413c2P6j10R4r2p3K48q0j34O9K45k33O5K74m95kl5N3N26l81j39L38m32K20K89
$$ plain form
2251 -252 39 150 -248 186 298 -177 -137 -33 57 21 -286 91 -176 11 -25 67 80 -69 -39 221 -49 -126 -77
2274 -77 -4 125 31 -257 -251 -34 -18 167 -4 -140 5 55 -120 92 228 26 162 -184 -94 142 -93 -62 -142
2297 -142 35 -36 16 -248 17 -50 23 -140 74 181 54 -103 75 9 -14 -210 12 9 113 11 3 245 -82
2320 -82 -155 -246 -59 34 18 -183 -83 173 -115 -91 -101 -212 -263 -238 132 -58 -101 -36 107 20 -238 -155 -101 97 -70
2345 -70 26 51 62 -155 -37 135 -130 -128 -17 70 -98 154 -129 151 -12 26 85 137 255 121 -327 41 -27 60
2369 60 143 -4 23 -120 19 72 -119 73 -263 38 104 15 -243 -119 62 -46 -54 159 64 176 207 -51 118
2392 118 100 88 -76 30 211 28 -129 112 -97 86 -32 -267 -99 221 -198 -211 61 -143 -273 -52 -32
2413 -32 44 -66 28 -64 -137 111 31 -103 -34 211 -22 43 317 -178 -180 -215 -162 364 -17 -156 182 -250 -30 259
2437B59j92j12K2K9n6K83l23%J34Jj50oK36j51l66L52L2M9K88m77O6j19K04O4
2461F7R6J62m49O8m6P2p8J3L15j22l57M07l96J40L22j22k94Q7R5n3j23L41k73
2484a28n2J20M44j51k82K83k92O9j83J42o7k02N97k51n7Q2k0k24J66L59l52m1
2506d0m3j22J45j8J21l2k1O5K78m16Q2m4l7j42K34p2P9l5J62k60J10M2j74L17
2530A79j44q4J84k23rK00l5J05l4j62m4j5J92j18j22K9J85Qk14K71j34J40K2l35
2554a58K44r0K9l2O1r1q8K72k56L4P6R8J8j50J9m6k63K12J65j69K13q1j57J57
2578A7R5l77M05m5r9j0P9pKk54K29n9L50j17j19j30J78k13j00K0J81m2q5J36k6
2603Ip0J9k1j69L90j74j81K78j45K17k10j66K67J74jm22K29J36j43rj37O3L19
$$ plain form
2437 259 67 -45 -23 6 -50 233 -90 -90 44 45 -105 -111 125 -26 -392 -40 -8 41 329 -148 -82 -201 3 67
2461 67 163 325 -124 -56 -102 -30 -108 -95 220 98 -259 148 -248 -108 214 92 -202 -115 -20 -73 -196 145 -128
2484 -128 -180 -60 384 233 -49 234 -58 11 -172 -30 -97 -299 298 47 -10 72 52 -172 -6 353 1 -40
2506 -40 -83 -205 -60 -78 43 11 -10 55 333 -83 -1 -45 -82 -224 10 -62 17 -18 144 -116 -6 36 -138 179
2530 179 35 -49 135 -88 -97 103 68 173 139 -23 -67 -82 110 -8 -130 -101 84 92 -122 149 15 155 177 -158
2554 -158 86 -4 25 -7 54 -37 -125 147 -109 -75 1 99 117 -33 -14 -60 -323 -111 54 -115 98 17 -140 17
2578 17 112 -265 140 95 -4 -14 65 58 60 -194 35 -24 326 209 90 -40 138 -75 -175 -155 26 -16 -101 35 9
2603 9 -61 -42 -63 -232 158 -16 -197 81 -64 153 -57 -223 44 218 217 -205 24 160 17 8 -129 -66 253
2626B53l43j6n0M40l86O1M3O4q9J56k19J40mj28J2J89K68o11J01L27l37K38j61
2649e2K44j42%j66K09q3k31K24l11M72k44M49m45j79n1J96r1J11j2J52k3k36K25
2672A6M2k49j10M38k16P0L81l96r2J81j21j04K0J39k86L14N1j52O1N5K07l15J54
2695H8J34m43K55q8J28j62J23K1M8l4%R0j51RJ39k18j03K96j45j09KK39M6J12
2719B77l02J9K13k43L2j94j0K57j01r3k8J45p3O9mJ34m1J72k89K35l90K46p0J41
2743A02k4L0o4l7l7M4J06j93J90k99R8J9l8J28K2j87N9j70L98nL0k14O5j2k09
2768a98P0O3J92J49l33J97K5k05J02k11O5K39j30Mj41J24P6k22K74j09J2J71k58
2791d4j05J72j23m3oRJ83Q7k11N5J01J35j90j56J06K76l20k16M38k9o8K29j81
$$ plain form
2626 253 -90 -106 -156 284 -102 -41 2 66 -23 133 -86 54 50 -78 -66 123 391 -220 -119 208 -129 109 -52
2649 -52 192 50 50 -116 93 10 -221 3 -308 164 -80 369 -76 -255 -306 -110 -201 -90 -102 50 27 -209 16
2672 16 58 -191 -301 137 -79 -9 372 -24 -116 65 -56 -160 -140 -1 -287 27 78 -74 -13 42 249 -66 88
2695 88 222 -221 34 -54 74 -88 35 56 104 70 70 160 9 18 157 -61 -164 132 -13 -122 -120 119 165 277
2719 277 -25 -6 207 -36 -4 -198 -208 49 -52 -145 -173 -28 -101 -32 -36 98 57 229 -60 175 -215 31 -39 102
2743 102 78 108 44 7 -30 14 120 -73 117 -182 -84 -65 -103 25 47 -140 -81 -251 147 142 172 -42 23 11 -198
2768 -198 -128 -65 127 276 -57 140 165 -40 62 -149 -84 155 25 29 -112 12 88 -134 140 31 43 214 -44
2791 -44 -149 23 -100 -143 -149 -140 43 130 -81 -26 75 210 20 -136 -30 246 -74 -290 148 119 51 280 99
2814I9j10kq6Q2k33P3K03J08j95j6j92K52P7k60J98kj33j1J63k44K30J0J32k16
2838g3J75j9k56J7J04J4j07p1K35M6M6k25J3l4J03J68n9l3R6k0j19j55L63l30
2862a21J66l2p3j46L10j17P4M3o2l5j04J4pJ83J18l84K65J39m70K64k29K71n8
2885IJ2p1mL9K80l06o4J59n7kk8N7l63M72k23J97k28p4J41R4o1K00l18l4J57%
2911a6K6k54M31l77m3K35M10l71k5R0P5j14J15j36Ol39L25j60K73j36J3L0n4k74
2935b70L77q9k00L37k14j6L8j5K20k87L19k34M1L8j4k57J27J16j35K88j11Q8M3
2958A90k08J31l65M09j30k23K49j20J42o6j40M67j93j11J3J53l92K12J5j50Q6
2979c1J02Pk7N4j54J17j36L07j84m9l30M25j25K36n6j24rL9j06j13K35p9K16m06
$$ plain form
2814 99 -11 -13 -99 -17 -250 -177 26 134 -61 -77 -269 -17 60 -200 -2 -4 -137 -148 15 -229 1 11 143 -73
2838 -73 102 83 -173 -156 -52 -38 -145 -216 19 65 111 -114 -101 -135 -32 136 77 44 140 120 1 -154 209 -121
2862 -121 45 13 -60 -206 104 -13 61 104 42 7 -97 -83 -90 93 211 -173 92 231 -239 25 -204 67 9
2885 9 21 -50 -54 -15 265 -41 -105 54 -3 -5 -33 24 -339 133 -90 107 -121 -195 -54 40 -21 179 -139 -173 -16 -16
2911 -16 10 -244 187 -190 -233 2 412 41 16 106 181 67 182 46 52 -287 38 -122 151 15 28 58 4 -270
2935 -270 107 18 -182 155 -59 -75 -37 -52 168 -119 200 -34 7 45 31 -226 -99 17 -118 170 59 147 190
2958 190 -18 113 -252 157 27 -196 53 -67 75 9 -131 336 143 32 45 198 -194 18 33 -117 -31
2979 -31 71 78 51 105 -49 68 -68 239 55 6 -324 101 -24 212 156 32 23 62 -44 -157 78 -1 215 -191
3003a91J32m5K12j70j56L57k61Q1n3K84k4j97n0L2M12m54%q8J46J61j42kj4K17
3027A87J3n78P49n60J69M5j7j38K35k04K06j89J31p9n7J04k15K53k9Mj84K51K8
3050A25l02Q6J54j4N3j19p3L04k19N6l03M97l05l4K28j75k80K69K14R4j66j04
3072a4Nj43M5K96j87n2l7J13L01l21k28L55K1l31L52j26N4o6n9J89j05j90P7J19
3096F8m6N8O9m27K35j72M35k30J33K6j22rk8j43l3J21J63j63n8j08J47Lj81N9
3120b03N3K94m1J94j61O5j68J38j98r7K64j93j08K57M1k16K21j84k9K94l18L49
3142B54j92j60K03j35J57k20J57r7J91o8k42P9J16P9k87K87n6n0j33J05J23k6
3164H5j97m6K65j08J3j54K47K3j62J27l33L30j48J26J37k12j95L01j94J16j18
$$ plain form
3003 -191 -59 -104 108 -62 -218 139 -122 -41 -94 190 166 -31 -81 -49 363 -91 -91 -179 -33 128 -14 -16 -30 187
3027 187 200 -378 371 -189 -20 25 8 -130 105 -99 107 -82 49 -30 -87 17 -198 55 26 30 -154 97 125
3050 125 -177 -91 63 49 102 -17 -90 214 -5 51 -252 245 -60 -94 134 -41 -321 -52 162 256 90 -14
3072 -14 -9 -152 -107 189 2 -50 -87 26 327 6 -222 133 154 -177 175 49 103 37 -22 167 62 -128 -51 68
3096 68 22 80 149 -278 -43 -215 220 -10 123 149 27 18 -10 -153 -186 -65 98 -65 -123 -231 -84 -81 -262 -203
3120 -203 -150 144 103 297 136 201 33 171 -27 -124 140 -53 -161 96 137 -79 142 -42 -71 223 -95 254
3142 254 62 -98 105 -30 127 -93 64 -33 158 90 -152 -73 43 122 -165 122 66 16 -117 -12 111 85
3164 85 -112 -158 107 -1 12 -142 105 128 -34 93 -240 90 -58 68 205 -7 -202 99 -95 21 -97
3185i7J20PLl22L94j91q2p0M25K1l15J74m35L83k13K72O9j56m1j17k1M53j86k07
3209a32L5J74P0k09L28l67N8J35O1j47R7j46K19n7j06R9k65m6R8L06l21J64M1
3232H9RLJ8l29J93J08p9j04J82j08k8N4J66l1K2j43l6L0m0qK1j04J26j37J44j3
3258EL71m32j10L15l41M20j54m5j68J16o7J91k87K99l55J59k45L42p6p5J28J24
3280A15k84J52M6k8R3j48L6N7j93J66j0K51l34j7K3Q0K9j31Q5L3k48L09l26K11
3304c3J20j59m0q9L16j31j11J65k58J00J11n8J31K2J44O9j40k61Oj26N2K77R1
3327A98j17k85K12R8k83q6K55n5J20p3R7q5j81J23O8J97j85n4l23J61K06J99k14
3350gk26J98l3J1J33k04j02J92J73l49P1L76q4q2m5J13l33J03O5K39m64K87OP5
$$ plain form
3185 -97 23 30 33 -289 105 -86 -168 -238 187 208 -107 67 -368 15 -198 74 143 -13 -54 -171 -192 261 75 -132
3209 -132 -97 77 147 -62 266 -101 -43 92 153 6 103 -43 176 119 13 112 -153 -199 -101 205 -116 48 89
3232 89 98 101 119 -210 -17 91 12 -92 90 -18 -46 8 174 143 165 22 -14 16 -24 -32 -11 -115 11 -126 18 5
3258 5 376 -56 -166 149 -192 228 74 29 -139 -23 -90 101 -186 113 -242 -83 -328 14 -62 -137 -9 115
3280 115 -169 -17 29 1 94 -54 -18 39 -154 12 2 253 -81 -98 -75 5 34 -97 -12 21 -227 82 -244 -33
3304 -33 87 -72 -112 -201 115 -16 -127 38 -220 -120 -9 -67 64 86 230 299 159 -102 -96 -222 -170 107 198
3327 198 81 -204 8 106 -177 -263 -8 -63 57 -16 81 -4 -185 -62 6 203 18 -36 -359 -198 8 207 -7
3350 -7 -233 -35 -68 -57 76 -128 -230 -38 135 -214 -143 233 149 67 22 135 -198 -95 -30 209 -255 32 38 113
3374A13j3k46L08k81J5K35k6j85l9P1Q8q4J2J8K97j63j29M9k01K73l0o0p8J55
3398I9k28J81J26k17j4O1l7K5J8j53K36m29K49J04K7J00j82R9m36L40Q5n4P6j96
3422a20R4K52r3j70q0L4j13%L16k60P3L9K86k43J65j0j26lR2p9k40J69K23j41
3446F5j31r6J01J03j96N43l01J96q2k45j10J44J3k2J13O9j03j38J48j36J80N1
3468A66j90J28J73j05l11Q3P5N6k5J63k50K77k11j65K72J9j20J37j37n8o0j4J88
3491I1j15K95j92k27K74j12QJ6J00P4l3P3j91l1l2%j32J84k11P9J04N9k50L21
3515A52j67Q5L04l18J13j57n4J46j66K53lk10j1J15k74K22l8j13J33j20J02J29
3537A23j30J15m0J7j21O8L7l0J39j18J96k84J36p9Q7l04L19k9k0k4j27K11Kn4
$$ plain form
3374 113 100 -146 162 -119 -104 131 105 -80 -119 -48 40 -44 -32 -14 283 120 -9 40 -161 112 82 22 -56 99
3398 99 -129 52 178 -39 -53 8 -29 -4 14 -139 97 -332 -83 21 48 148 -34 65 -371 -31 54 0 76 -120
3422 -120 -26 226 133 -37 -117 -83 -196 -196 120 -140 -67 -28 258 15 180 170 44 41 133 54 -186 -17 206 65
3446 65 -66 -162 -61 42 -154 389 88 284 202 -43 -153 -9 4 -18 95 164 61 -77 71 -65 115 166
3468 166 -24 104 277 172 -139 -56 19 75 50 213 -37 240 29 -136 136 155 35 172 35 -23 -83 -97 91
3491 91 -24 271 79 -148 126 14 22 38 138 212 179 252 61 30 -2 -2 -134 50 -161 -82 22 81 -169 152
3515 152 -15 70 374 56 169 12 -42 104 -62 191 188 -22 -33 82 -192 30 -8 -121 12 -108 -6 123
3537 123 -7 108 68 85 -36 32 69 39 178 60 256 -28 108 29 116 -188 131 102 82 58 -69 142 144 90
3561I0o3J67j05op3k9k5L37l17K85J19l59k1j09K04j29j32K08o1K6J80j84j78
3584a75K47j10j93L65k15J43m4o2K54j51j55jj3k2J95k9j89m3J58r2L50k30k39
3607b51J49K67p5k01p3L60R0j09p9J26j85K1l4P1k52L60j53J10j70J18o9J0J03
3630A34j68o8l1K95k13J19l3l1r6L6J23m1j69R9P8j33J52k7k53L70l11J25l2l5
3654a10L36j66J02q8j57O7m5j23L4K62j76j78L20k83J94J82j71o6L18l85K03j68
3676i8K81r6k44M16J6m01J44J01q8k18l6J64n3r1K28p7J95k47j2RJ87MP0j11O5
3701A08m3j63K42j87O3k8N0k72P3J17M2n6J04j02p2k3J65o0J7q5M1K81j78l9l3
3726c8M3J64j28m6k43K80P1j93J08L4j30P3j8j69J80J55p0n6j00r0K66L8j64K6
$$ plain form
3561 90 27 194 89 83 10 -19 -44 293 -24 261 380 21 0 -109 95 -34 -166 42 -19 7 187 3 -175
3584 -175 72 -38 -231 134 -81 62 18 -44 210 59 -96 -97 -110 -132 63 34 -155 -198 -40 -132 218 -12 -251
3607 -251 -102 165 90 -111 -184 176 266 157 78 204 19 40 6 77 -175 185 32 142 -28 90 21 31 134
3630 134 -34 -102 -133 162 -51 68 35 4 -92 -56 67 26 -143 -44 34 -99 53 26 -227 143 -168 -43 -75 -110
3654 -110 226 60 162 74 -83 -16 -61 -184 -150 112 -64 -242 78 -205 -11 171 0 -66 252 -133 70 -98
3676 -98 183 87 -157 259 275 -126 18 119 31 -187 -223 -59 -112 -203 25 -52 143 -104 -116 -107 80 84 154 43 108
3701 108 65 -98 144 -43 20 -8 42 -230 -157 -40 2 -54 50 -52 -124 -147 18 -42 -25 -110 -69 212 34 -5 -38
3726 -38 5 169 41 -5 -248 32 103 -90 18 52 -78 -5 -23 -192 -12 143 73 17 -83 -173 93 131 -33 -7
3750gj34OJ73j4L4O9L6k96J48q9K27l9k02L8j19L34l08J92j24P2J45r4J37k83
3774i8J17J3j95J62Q4k03J84Mj66K9J78q1k5j14m4L5nL77m97K76M9J68j50J4R4
3799B06k61L0OJ51k60k71M56o3J09j06M2J9r0J65j4k54J89q2J86j22l2o9j30K84
3823H9K1k34J00M7j00j24L76j84L32l89j92K48K0J97k38M7j0K4Q6j3j67J43j93
3846a14K15Q6O0n58J05J19L02k82rJ53j71n6L49p6k90q5O27r9J6k9k34p2mJ55
3870A08J4j92q6oJ76j68k0L37k38j69L83o3N4jo0j00K68n39K75J7KJ9j11k42K01
3895a41K11j38R3r6r1N4j60K17m7n5K77k93Q5N8P5o4l13J21K37k7l40L34K53n24
3919b74K77m6J00n3Nj0K32j36R6k34k7K16j38J95m37K66N2j95R5l55L34J37k03
$$ plain form
3750 -7 -141 -135 38 24 58 127 163 -133 15 -74 153 114 -88 -50 -169 165 -143 49 -75 -3 142 48 185 -98
3774 -98 19 32 -163 -1 83 -120 64 68 -98 -69 109 28 3 -111 -155 -120 -125 252 -245 31 80 248 98 112 206
3799 206 -55 -25 -19 132 -128 -399 57 -6 103 -3 39 58 -32 133 119 -135 54 -28 158 36 4 -65 -195 89
3823 89 110 -124 -24 23 -77 -201 175 -9 323 -66 -258 -10 10 207 -31 16 6 30 116 103 -64 79 -114
3846 -114 101 187 247 -311 -206 -87 215 -67 -76 77 -94 -150 199 123 -167 -252 375 276 292 263 29 -43 -47 108
3870 108 122 -70 -156 -162 14 -154 -174 163 -75 -244 139 76 130 129 69 -31 237 -302 -27 -10 -8 11 -100 -342 -141
3895 -141 70 -68 25 -71 -162 -108 -268 -51 -98 -153 124 -169 -84 -26 49 -15 -328 -207 30 3 -337 -3 250 -274
3919 -274 3 -43 57 4 9 -1 231 95 191 -43 -70 146 8 203 -234 32 84 -111 -16 -371 -37 100 -103
3942a03J23m8J91k07K39l28K86j1k80j83L10J05j74O1j42J03J84k82J06L35m40
3963a55J24j01J80j98J76k45O6J32J06j48J64k67J93M9J84Nk61j3k10L81j84J68
3985A46m4K2nn9k10l2J03R8k45K66K78l43J56p0j31Q4m1j5LK5L52k98r8J21r6
4010c3n2K6R6j74L82k89J1R3J41j92J96j67P5m7l15J91q6J20J93o5k52P8r9J89
4034B0k91L39N4Q9N4q4k43j59J69N6J15k10J05L1j32L29m54M23k60J88K2j70j59
4057a68K37j67ML0k8J16j45K5Q7r7M46l01k15L39j81RmO4M5J57k22mK28n45M08
4082A18m3J17r1j50N6Q1m6l11l8J57K14P0q4j2N9j84P1l5R4r0J09Mj16n3n1K3
4108a31J64K7Op9jk48K41K17j22m07K18p8J14R5j31o6K58m8L9K4k3l21J91J2j72
$$ plain form
3942 -103 20 -28 163 -44 195 -133 153 142 -138 -321 -11 94 -80 -19 -161 -58 126 -156 -50 285 -155
3963 -155 -31 -132 48 -150 26 -219 -153 -21 85 -63 101 -166 27 76 260 265 4 -9 -219 162 -22 146
3985 146 102 124 119 60 -150 -182 -79 19 -226 40 318 -25 131 61 -70 14 -27 -42 -39 -14 338 40 -58 63 -33
4010 -33 -85 -59 37 -137 245 -44 -33 60 201 9 205 38 113 66 -249 -58 -144 -24 169 104 -148 -70 -169 20
4034 20 -271 68 122 211 265 181 -62 -221 -52 4 119 -91 14 45 -87 242 -212 211 -49 139 161 -9 -168
4057 -168 69 -98 -94 -64 -92 24 -121 -96 -9 -106 340 39 -176 163 -18 -9 -13 51 96 253 31 27 255 -290 118
4082 118 75 192 101 -49 7 88 42 -269 -307 -150 64 134 50 38 97 -87 -16 -51 43 -47 62 66 -50 -103 -154 -131
4108 -131 33 60 66 -13 -14 -262 -21 196 74 -333 -115 -193 -79 16 -115 -181 77 29 68 92 69 -252 -61 -49 -221
4133b21K82j59n5p4K51O9K33k99j24J75k3j95P5l4L05j50l4O4O8q8l22L33l03
4156b26L94l6j71ML9j01J54j12K79j85r9J86R0m01J38L02j89M6l07J00K06j30
4178a9J4n0Q8J88j23N4k19J67l18J10L4M8j87J26P7K5j08Q5J64j03j09OL31l80
4202i9L18p6j55J61J3j39r3M8j52j4K20qLN1Nj6j62RJ76j15P9j08L5j27p8L13
4228H9p6o0K5P5k4j1j28R0q1J15k7K00n01M42j02M90n57J74j15Q6m8o6l9J23l8
4253C6j08J2O0l2J56j56K65j99K5J37j37m7QQ9l70L49Q5K6kj09k4k77J35P3r4
4278i9J23J19j08J94j76p3K9qMmJ48j46Q8r1r5K6J62j43J56N2m0k96J22K8j49
4303a77J76k30j36M11k30K74l6k52L29j2n8R0k77K71j00q9K22m51K30N2J6q4J80
$$ plain form
4133 -221 61 -98 -153 -227 24 93 326 27 -97 78 55 -140 -65 -99 206 56 22 86 154 66 -256 77 -226
4156 -226 168 132 -39 -35 4 -97 57 -55 224 39 -60 126 216 -185 -47 255 66 112 -195 -95 111 -19
4178 -19 -5 -55 33 221 98 152 -67 100 -218 -108 -74 -26 -213 -87 -10 15 -93 -8 156 53 -56 -50 281 -99
4202 -99 219 143 -12 149 162 23 -70 -22 -174 -188 32 24 27 78 83 67 -95 -86 90 -25 54 -54 -19 -146 -224 89
4228 89 13 -47 -22 53 29 18 -110 -20 -101 14 -13 187 -314 128 26 516 -41 133 18 104 56 -10 -49 74 36
4253 36 -72 -60 0 -32 124 -32 233 34 59 196 59 12 20 109 -261 88 173 199 197 88 64 -213 -78 -5 -99
4278 -99 24 143 35 229 53 -20 9 1 5 1 149 3 91 0 -95 -69 93 -50 106 158 118 -178 -56 -28 -177
4303 -177 -1 -231 -367 44 -186 88 52 -200 129 117 59 149 -128 143 43 -46 176 -275 -45 7 23 -61 119
4326A19K8m02J73J24k06J37j03O1J34k63K87no8o0N2l3M9m3j91K24m0N9J78l85
4350a74K66J3j15k7k66J95J91j51K23j84O6J32k14Q3M7l27J37J13r9J09J39l33
4372a76M5kQ4J88R1l58J10J42j37j5K35j93m2J88j05J16k08p1j1M11k68J19k10
4395f7L4j38J08M7j51L14k04P6J32j95L7R9j96J66j10P4M9m9q4R1n6J35o8N8o
4420I6p1j58N6m1M15l65J94m8n4j05p0L03j25o0P2M5R7R2l63K08k2k33K33N9l3
4445A22j3kpr2N7Ko9R9j63J71P4o8k71J88j21J90q6J19j70k50M6K0mJ23L26j98
4471B3J00n8j77J01R7k38J97O4Q5j60K0l3Ol1k84K70O9k05m6K45J07K18l79R2
4495H3j59K40l1m85J58J24Q0q9j13P4J8r1K72l6k42J37q0J76k42K17j18J66j89
$$ plain form
4326 119 147 -255 -82 42 -164 -27 -130 -69 65 -198 89 84 16 -44 8 -25 24 -19 -210 14 -26 33 211 -174
4350 -174 92 105 -10 -37 -303 -108 83 -68 155 -29 37 169 -45 38 85 -242 -105 8 -91 18 157 -176
4372 -176 -131 -133 -49 139 230 -128 -18 124 -13 -28 207 14 -28 160 55 171 -37 -108 -119 292 24 143 -67
4395 -67 -33 -171 -63 -16 -167 147 -57 19 151 -44 -7 92 -104 62 -48 26 75 26 -58 33 -23 112 44 102 96
4420 96 25 -133 -77 -118 297 -68 126 78 24 -81 -151 152 27 -33 39 84 181 273 -90 118 96 -137 96 155 122
4445 122 109 107 100 8 65 67 -2 97 -66 105 179 111 -160 28 -93 97 11 130 -40 -290 -244 -224 -228 -105 221 23
4471 23 123 65 -112 -11 86 -152 45 109 194 34 54 21 27 -4 -288 -18 51 -154 -200 45 152 370 -9 83
4495 83 -76 164 133 -352 -194 -70 10 -79 -192 -118 -100 -191 81 45 -197 -60 -140 36 -206 11 -107 59 -130
4518a30K33j75J9J47q1j42M16k39j74O7L06l12R0L23k00k40Q8rj62K55M3J11m04
4541a70K09j76J80j39q5K79J76k42p8k83K01K5J12j10K08k44L56j92R1J2K14l44
4563@k20L51l18K94J14k04O6l35K51J50k72J46J35j95J46o1q5J09P5r3k41J78
4585iP1M8j9m8m6j26L38m89K22R0j23J11oP0p1j16o3J17k6O2J26q7j6l53K24N0
4611f9K42Rj82q2l0M77l90R2K0j3J77l00M5QJ73p0l05L02l01J33K74k38p0Q8J52
4636A42k26J8n2j70P8J0Q0K14k48J33N0j24P9R6Nk20J31m0K33l8j67J06J03j33
4660F0l36K75J15m2KJ22jk84o7j24J72j93L09n6q9Q9K17k76K88k28M0k0l8J03
4684C8K24m03J68L7j08L0L1R4l77K29J4N9r4Q0M7K8k37J72J59l8l38Q1R9O6n2
$$ plain form
4518 -130 103 -72 -53 94 13 -129 287 48 -126 -59 247 -65 25 348 148 -92 -4 -13 -175 80 123 234 -170
4541 -170 39 -137 43 -96 -181 98 274 32 -46 -329 -128 -103 9 -101 107 -137 219 27 118 130 344 0
4563 0 -220 131 -187 107 221 17 83 -252 -1 149 -123 23 158 -37 109 48 -37 72 147 54 -187 -9
4585 -9 62 110 91 43 -3 -129 209 -280 -58 32 -91 20 14 84 13 -103 -166 -49 -75 -13 113 26 10 -343 -119 -69
4611 -69 173 182 0 -82 -112 365 -25 67 87 74 251 -49 -4 4 177 107 -198 104 -197 -64 210 -28 -98 -10 142
4636 142 -84 -66 -118 -288 -210 -200 -120 94 -154 -21 29 -95 -16 80 85 -135 -4 -44 189 151 -16 90 193 60
4660 60 -276 -1 114 72 74 196 195 -89 -156 -280 -108 -301 8 -48 -137 -48 169 -107 181 -47 -7 -27 -65 38
4684 38 262 -141 27 64 -44 -14 17 111 -266 -37 -23 36 -58 22 69 97 -140 32 191 153 -185 -104 -5 61 9
4709IK40m94M6M4K23J9m41M58j26J19l78J40K50r7QK31j79J00j06n3k55K36l0
4732c6oN2L0J59l61J65j10J80M4k24K8j55J53J25k54K20O9N2J5k66K31k8l3j74
4756a24K61j03k6m4J47M7q8j2j54k7L6O9J20R1q8j84M5j53L3L21j35K54k44j23
4780h1k94L82O7n8r3J55l1J07k65J72R9r4j34K44p8K49m16J69j44J34k15J79k24
4803a70Nj5O6L04k83K20K50m72J01KJ54j99OK08j20K6l06J71Q0J20j65p2M1j83
4827b31Q5K49k7k92J30N3j56K05R2J62n03L01k56K7K95K5l3k21J20j80J44j80
4849a91K58J3j47J13J3lJ0o5qr8O6r7K1LM14m00J35K31k04k85J36K35k49J04j04
4874i9P2K3J18L8m6l6k46n1K45j87L58k58M2n5p5K64j45J29lJ97k03J11q5M1J20
$$ plain form
4709 9 249 -245 -199 -155 68 87 -354 104 -22 97 -281 -141 109 12 20 251 72 172 66 13 -242 -6 -36
4732 -36 -42 10 40 199 -162 3 -107 73 117 -107 -79 -234 -81 44 -210 10 79 131 146 -120 111 83 50 -124
4756 -124 137 34 8 -36 111 158 70 58 -96 -123 -87 -18 102 193 105 -79 -34 -187 -154 167 32 286 42 -81
4780 -81 -375 7 74 16 -77 78 47 154 -111 61 160 66 -68 176 98 347 -69 100 -44 90 -125 54 -170
4803 -170 -165 -180 -114 190 -93 127 377 -95 6 8 162 -37 -31 177 57 83 -223 -52 28 148 -17 -89 -48 -231
4827 -231 -146 103 76 -216 -86 -33 -189 16 108 270 -233 68 -188 -161 134 159 126 -95 25 -155 -11 -191
4849 -191 67 80 -67 46 59 56 66 1 -7 -105 -39 -136 -115 -112 302 -98 37 268 64 -221 -85 150 -99 5 -99
4874 -99 -27 -4 114 152 106 70 -176 -227 18 -169 189 -69 -27 -82 -157 107 -38 91 88 285 82 193 108 149 269
4899B69o16M10LK65k60k65L9K61j12J2j21J76Nk00K8J34J52k11L14j01j81k12
4921b11L61m44K79P3J65j41p2R0n7m8J30k24J14M4m0j03K66R5l19J88k62kK59
4944A41j64R0L5l16K20k60K80k57K63m9j3P3L2j64K56k86K4Q6J9j77K44o8k9K05
4968A85j93R0L2j75J4p3O6P6o6J89j72N5K16l10J30j76j2K17r1No9J25k28K40
4992G5l42K00Q2o6J1k07N70l62l5K68l01J66j00P3K1k8N5j71J98q7P3J93m24R2
5016d6J6j30J81l4J14k02LJ01k31K08q3Q3L7p8K15j61Q0l37K5N9P9J62k5K0J23
5041A79k35J0J16j16K67j19r4J6j04J05K8MKj97J59k31K37P4Jj07J43n8Q9j09
5065F0j11KN3P6k49J03p8N7K68o9Qj31k53n3J46K81Q3j80q6N8J52M8l09J20N3
$$ plain form
4899 269 -347 63 66 331 71 -194 -155 106 -6 6 -115 61 66 -134 -106 28 180 -31 283 182 1 -211
4921 -211 150 -294 -15 58 223 82 10 100 43 -5 125 -99 15 59 19 -84 182 277 -42 146 -116 -118 141
4944 141 -23 67 102 -214 6 -254 26 -231 32 -17 -30 43 75 -89 167 -119 -95 -9 10 -167 77 9 -20 185
4968 185 -8 82 114 -61 -47 -120 -54 22 -44 145 -27 28 244 -66 64 -112 -124 93 2 7 -62 63 -165 75
4992 75 -267 -67 15 -51 -40 -247 323 -39 -74 194 -107 59 -41 32 53 25 80 -91 107 20 93 286 -138 -46
5016 -46 -30 -160 21 -13 101 -101 -98 3 -228 -20 -103 -20 17 -61 154 -7 73 -264 -239 -180 -101 61 36 56 179
5041 179 -56 -46 70 -46 221 102 8 24 -80 25 53 57 59 -138 21 -210 27 101 102 -5 138 80 169 60
5065 60 -51 -49 4 80 -169 -66 -144 -87 181 112 120 -11 -264 -317 -171 110 193 13 -73 -15 137 185 -124 -4 49
5090D9k03Q8QJ58M6o5p1j03k12M42l9k30J1L57m18K61j49J7M8j42K74L29m89K3
5114a0J4J83l04K24j20k5J21l6N2m7j23K08P1k62m6J7K92n38J98R7J34Q7k51K82
5138B18j85j34J69M7k57K03j41J38K0m79M48jj42j9J13K8n0J10l06K10J47k18
5160h1P2l1k45J87lK40l99N00j98l2M4l07K35j06K22K0k52J45N5j31K83l32m4
5183a58m6J11m4J13m1K4p3R7j59J6K94j94O8J28j20r9J29K88l58P2l35M41k05
5206e1op2R8K01j04J2N2jj67J50k30K9M9K0l07N27l88J70J3N9k27M9J25p9K04
5231A26k94K21k05O7Q7j49J89j11J18J36p8r9J3r1J07l51K88R2q0P7q8L0J56j60
5255AJ04k05P8O3q8P1R9n6j50j80L05n4K1k9R1j6k44J68p0j5M3J73j98Q8k09Q9
$$ plain form
5090 49 -154 -66 -58 100 146 81 10 -93 -305 137 98 -132 -121 236 -182 79 -70 -53 -5 -147 127 456 -33 -10
5114 -10 4 187 -117 107 -13 -38 83 47 99 52 -71 137 208 -54 -100 -83 209 -329 -131 -34 100 187 -64 218
5138 218 33 -101 68 115 -142 61 -80 58 78 -401 47 46 -96 -115 -2 26 -24 86 -220 -10 137 -81
5160 -81 -9 -40 -285 -98 -101 139 -260 240 42 10 54 -253 -18 -124 98 118 -134 11 66 -65 218 -114 -158
5183 -158 -204 -93 -137 -24 -65 -41 -114 -17 -176 -160 134 -60 8 136 16 -83 46 334 -24 48 -287 154 -51
5206 -51 -57 -129 -31 170 66 78 130 129 -38 112 -118 -89 -40 -20 -327 200 -188 -18 -5 54 -173 -124 1 -78 126
5231 126 -168 53 -152 -85 2 -147 42 -69 49 185 107 8 21 -70 37 -314 -26 66 -14 63 -25 5 161 1
5255 1 105 -100 -22 41 -47 24 123 67 -83 -263 42 -12 9 -20 71 55 -189 -21 -91 -106 -63 110 -88 0 -209 -120
5281a20j01K15J13k18J82j18J77l86K23j44K17J09k60O6r3N5J87p2L1n4k47R5
5303a43J32OPM1j42J99r4j64Q9K5K07k38N6K64l17J89j57M9K76m32K38j67K02
5326A26l67J57O6j98L2L96r5l55L17q6M6P0n6j18j33K53o6J88j91q7lj5J53J0
5350D4k5r2j1R0J50j68L9k2J34j37j01J84l37J68N7l3j11j36M36j31j62L61k43
5373d6J08J59j93j74J75J44j14j03J1J5l4m2n9K10J42r4n6k13M29l45m1J16L2
5396B7j46K28j33lj38P0l7K67j32P5k6k88J47K15P6k41J3j2J13N9j34J39k04J74
5420A09J14k20J7M2j53K91j42k11K37j51K6J53j50OJ05j00qn7J1J66j93M6l0P8
5444a4J24j77l7J3J71m55M15J6K7n5o6j21J4K09L5k9r7P0k41J54N2j42J51l46
$$ plain form
5281 -120 -221 -6 107 -111 71 -47 130 -256 -33 -177 40 149 -111 -45 -138 -83 104 32 63 9 -238 -143
5303 -143 -11 -5 2 43 -99 100 6 -158 -69 -44 163 -75 -19 245 -72 117 -40 9 285 -147 91 -76 126
5326 126 -241 -84 -18 -216 -184 212 117 -238 79 -7 39 109 53 -65 -198 55 -11 177 -14 -101 -104 -119 34 44
5350 44 19 -73 -84 6 156 -12 27 5 139 2 -99 85 -252 -84 -27 -60 -171 -307 129 -2 -164 197 -46
5373 -46 62 221 28 -146 29 173 59 -44 -33 -18 -52 -94 -153 57 199 105 49 -164 265 -80 -121 -5 27
5396 27 -119 109 -24 -27 -165 -95 -132 135 3 78 52 -236 -89 126 202 -39 -26 -38 75 134 0 139 -65 109
5420 109 223 3 20 62 -91 200 58 -153 84 -67 -41 112 -38 -32 73 -27 -35 -92 -81 85 -108 -62 -92 -14
5444 -14 110 -67 -104 -91 80 -375 40 56 83 28 -38 -159 -145 64 99 70 -27 43 -198 -44 8 -134 17 -329
5468c29M17k58L0J20k9K50k78L5l6P3L0L5q6K82k25M6J1j42k2J02orp9j9J81k85
5494a91K96Q2k77N0j47K32j78J28j5l0K3K0J03k13J32j41J77j09K8j40L16k66
5516a20J10kk2O8k18J91J48n2q2R1j46P0j59J01J78k87QL19j3k19k44R5K80j03
5540hJ08j85K76k17J61P1k06l2R9P5j2N5m82K56K04k87J30k76L91j74N3k8MQ1
5564E7q7K03m38L44M0r5J44N1k74J08j45jr0J64K3k56N0J89O7j0M5Rl02J55J54
5589A05J2j85J47%p8j43J83j57q9P5p7L18k20K72K2k63K32j95q9o8L6J29N2k15
5613a96K16m0m4J75k12j67L14j41q9K66M8j89k65N16k78K04k5M3k41R5J0j42J54
5636A2K99l60m6n7P7O2J50j05j99K26k6k39L49j52k19J57K0M05k04k01M6j03J12
$$ plain form
5468 -329 88 -170 -140 -20 -49 201 -77 -42 -78 -5 25 60 -26 256 31 77 88 -54 -76 26 20 11 -68 -87 94 -191
5494 -191 105 187 -90 -40 -187 45 -133 -5 -20 -50 -27 -7 96 -117 15 -126 51 -58 -30 -170 146 -120
5516 -120 -10 -12 -34 34 -184 7 155 103 21 112 -34 36 -123 -22 156 -131 -123 196 183 -36 -280 -185 95 -8
5540 -8 100 -85 191 -26 135 206 0 -32 67 142 130 185 -297 -41 163 -124 6 -270 121 -53 0 -28 -24 57
5564 57 -30 173 -265 79 119 24 168 219 -55 53 -92 -93 -183 -19 4 -252 -202 -13 54 44 89 98 -204 -49 105
5589 105 117 -68 79 79 1 -142 41 -116 -205 -130 -207 111 -109 163 185 -78 154 -41 -130 -198 -162 -33 19 -196
5613 -196 20 -20 -64 111 -101 -268 46 -95 -184 82 130 -59 -324 192 -86 118 93 136 -105 -10 0 -142 12
5636 12 311 -49 -95 -152 -75 -13 137 32 -167 59 33 -206 143 -9 -228 -71 -51 354 150 -51 -5 -108 4
5659Doj94J75r4l2k7P9J97M2k62J19j74K27J9k1k34L01N9l53L02Oj16q8J43J84
5684B56l83K6j8Q4q7K10L1j18k40j00K95k1n0rO3R1J06K15l14N2q6j87L2J42J52
5709A42j70M2p3q6o2K75P1j4l56P8L18j60J18k22P4M3o4N4n5J24j63N9L5k86K75
5734cn8J77P2k3j31m0M9r8J92l40K20r2j84M44k81J24M7j69K85P8j99k6N8k90
5758a88K28r6K52k38R9j74L02j78p6L03l8k60l4J41k25K27K96j15m35K07o1K38
5780A75k73j35J67K91j13j06j27J70o5l2l4J72P4j06j75Q0J88r2nK9j10j84J20
5803i1K46k67P7j92j3K28J35j19l7N9l1k4J2n3j05M7o3L14q4l9KK25l78K27n8
5828A8m4J58Q0l23K85j36K31n90Q2K26J37l56L22Qj2r3Q4k18J4P0J16k1k92J41
$$ plain form
5659 4 -2 -196 -21 -115 -147 -174 -95 102 144 -118 1 -173 54 73 52 -182 119 178 -175 127 133 17 -71 72 256
5684 256 -127 -101 -119 -35 -122 88 119 1 -239 -339 -44 -65 -115 -124 -61 30 136 351 37 89 3 -184 -152 -10 142
5709 142 -28 14 -59 -145 -207 68 139 125 -231 -153 165 5 123 -99 -25 18 -46 8 -47 77 -86 -27 8 -278 -3
5734 -3 -61 116 188 165 34 -6 43 -55 137 -203 17 -75 -259 185 -96 28 75 -94 191 269 70 44 102 -188
5758 -188 40 -56 196 -42 57 -117 185 7 -69 234 196 -64 -98 43 -182 45 341 226 -209 -2 -63 175
5780 175 -98 -233 -66 225 112 6 -121 49 -16 -48 -82 90 164 58 -117 -37 151 59 54 83 -27 -211 -91
5803 -91 155 -112 -35 -227 -240 -12 123 4 -33 26 -5 -29 -17 -70 -175 -128 -191 123 39 0 2 227 -151 76 18
5828 18 -26 132 212 -111 174 38 269 -321 -239 -13 124 -232 90 98 86 -7 77 -141 -127 -57 59 38 -254 -113
5852a13K87k20J21j43J3K56l68K25n29M16Kj71K27k25O9J51K42m53K14J75l98
5873b22N1K02k16J79j5r0J50m2k77K16J17j16J63p2o4o7J72j62K24l02J51K02
5895A82k09O6q8M6J8J75j34k24K28Rl4Q4j96J47L8k49L59j66R2k31K10Q4k32P7
5919E2j52J83O3r3N7j63rJ42k63J77j10K0P1r3K84PR0j83J15j11j53K32k73QJ42
5944D0j47J7n1J25J4K71j27j44j36J17J21J56m29K69l64J9K83O1l11J96j14K29
5966I5j39J84%o5j58Q9J09r7j63J07rK17r6P7j10j30J18P4j07M8j79L5J45LJ12
5991A60k84Q4j5j05K77n5l09K25J08j78O2j35J19K85m46L98k27p1jj54L00k39
6013b01J6K25R0j83J3M5k7k3j6O8j2O9p2k4j97K38l8r7N4m6L40m21K35N3Q6k72
$$ plain form
5852 -113 174 -46 75 -68 -55 201 -167 58 -471 -55 -53 -224 3 -222 -153 -2 240 -213 1 176 -222
5873 -222 -171 31 -185 -6 -21 -111 39 -3 -280 -64 53 -63 100 28 -36 -103 69 -93 131 -171 -20 182
5895 182 -27 39 -49 -3 15 190 56 -168 60 69 35 119 -77 70 108 -141 218 52 144 -87 123 207 -25 52
5919 52 -100 83 146 53 110 -53 -62 80 -183 -6 -116 -96 -25 -118 166 173 263 80 195 84 -69 163 -110 -102 40
5944 40 -107 -90 -141 -16 -2 269 142 -2 -138 -21 100 256 -173 96 -268 -249 34 95 -216 -20 -134 95
5966 95 -44 140 140 75 -83 6 115 18 -145 -38 -47 170 74 151 41 -89 29 103 -4 44 -135 -100 45 48 160
5991 160 -124 -40 -55 -160 117 62 -247 -22 86 -92 -30 -165 -46 239 -207 191 -36 -107 -108 -262 38 -201
6013 -201 -185 40 130 -53 -40 5 -22 -45 -61 7 -5 64 -8 -32 -229 9 -29 -126 -72 -118 222 -199 36 89 175 -97
6039i7M2k11M60m9j96J10j89K23j42n3J00L9j68O5m1j62R2K89j85q0J74k32L85
6062A74j32J0o7N4nj4J09r7k8M8k06L37k81k18J96J12L57j62J8k40r2L21k72m0
6086a18J12J46q2j55r7O7P8M12k94J10k44K5m1K01j76r7J88j14N9J03k1k03O5
6109g6j20J49M5J96j94J57l65M13l81K14j62K26N4k66K19k36J11O6j37J89j88
6130h6R6j35m4M8J90k83J78M8K34k38j2J39rl66L95l7j24j9J42q2Nj9k76L22j98
6155a31L0J01J57q2J1j44K60k23j06K60n12L01K20l0J66j17k13J50m45L65r8R5
6177A5o7L5J24pl3k63K21L8N9j37N7r7R0l03N78m03J96k08J07q3R3L7l35N68k23
6202E9k31K16j66J44K06q7O9j97MM7j76p2J72J97k27J51l8j77K51k04J51j96P9
$$ plain form
6039 -97 -55 -266 194 145 -51 59 -130 93 -49 -102 -2 37 -131 -66 -107 -269 -177 112 -73 -153 21 -211 174
6062 174 42 52 -15 39 34 20 129 32 4 52 -154 183 -98 -316 -120 -8 349 187 205 -35 -127 194 -78 -118
6086 -118 -6 140 58 -97 -194 -127 -49 363 69 179 -65 -40 -81 120 -56 -153 35 -79 -20 83 62 -141 -76
6109 -76 -196 -47 -2 194 0 157 -208 205 -176 38 -124 102 156 -110 109 -127 -16 50 -87 102 -86
6130 -86 10 -125 -169 -121 69 -214 -36 12 246 8 -4 135 126 -240 155 118 -6 -25 117 35 40 21 -255 67 -131
6155 -131 -101 0 157 75 86 -58 202 -21 -127 133 -379 -78 142 112 278 161 -52 98 -347 18 -80 15
6177 15 -52 -17 107 100 67 -196 25 63 122 -15 42 -55 35 -268 310 -93 103 -105 2 -81 12 49 -286 282 59
6202 59 -172 44 -122 22 228 141 210 13 17 64 -112 -184 -12 185 -42 109 71 -106 145 -59 92 -104 -25
6225b5j92J15M7j71K24R8m3L7j95K69j99P6k29K59m4j76J69m40M68m2r4K04j17
6248aNJ28j24Q2o0k1J32k31j45K30k1j64L07Jk89K99m33K86P5K2Pm9J0k8K7m6
6274aj29J14N3j76j5K03L9k02K01j60N8K3mJ14l2l6QJ18j30l4R6j54N8r2m5j9
6300a44M7K51Q3l49J07Qj09m2K11j39J25J07r7J00k22J4MJ42j42O8k06p8J36K82
6324A57k48R4r7J90j40R9j51K32j87K41k19N4j03M1K42k36q5J38j36oJ1K48j17
6347B2j03n1j26Q1p7L39p0J95M5k95n5K24j69J38l4k3Q8pj93K13k22J75n9o7j30
6372a61M3k11O94l37M1j50K59j85n3M64n66K24J0k39L58m14L58O2p8k03J59N5
6394A30j45k6k43L48L8j55q6K95l14K79j63J78q4K31k99J42k96j23K70K48p0k59
$$ plain form
6225 -25 -217 -102 -55 -226 -2 96 53 90 -105 164 -35 41 -188 71 27 -149 20 -420 48 6 -88 116 -1
6248 -1 4 132 8 90 30 9 141 -90 -235 -5 -26 -190 117 118 -171 128 -305 -19 56 78 85 36 46 18 45 -1
6274 -1 -130 -16 37 -139 -154 49 88 -114 87 -73 -15 8 4 118 86 50 58 176 46 12 108 -46 12 -80 -125 -144
6300 -144 -97 154 237 -112 -5 3 -106 -148 63 -76 49 156 59 159 -63 -49 -45 97 -45 23 -183 -261 -125 157
6324 157 -91 3 -94 96 -44 55 -96 136 -51 190 -29 25 -78 -37 205 -31 -116 22 -114 -120 -109 139 22
6347 22 -81 -132 -258 -177 -254 85 15 210 255 -40 -95 129 -40 98 64 41 129 122 -71 142 -80 95 36 -31 -161
6372 -161 -118 -329 365 28 69 -81 178 -7 -60 404 -162 62 72 -167 191 -223 135 197 119 -84 75 130
6394 130 -15 -41 -284 64 102 -53 -139 156 -158 121 -42 136 52 283 -16 126 -170 -293 -23 225 155 -104
6416a04o1L45j50J05q7m9J23k85J95j57N5K48j8r4j57J46J53l32j5K17n6k56K96
6439F2k44K49j39N9k4K08l58N37l85J51j31k85J86K27p4J58l71OK41p6o4Q4l1
6462a4K40j90j48J48q0k22K63j4J21k19M1J5J2J30l7Q5K05m53J67l1j64jK56l48
6486b38Q6K95l53J09K2J95m4k50K35K63j95j75k1L02k63K53l74J92k7k4k46P8
6508a80J12J23R9J9ml03N9k7K07QJ0N1m21J97J43R9Jj30q5J74j81m0j54K05P4
6533E6J8l11q0K68J12l6j22N3kJ9J28k90K59q8n3N2Mk17QJ34R3K3p8K3K04k03
6559b6k1LJ35q1j12N3m2P7R5M1pj59j29J91l73L78j31K14j13M8J32m7M5j77l12
6584c18L29q4N6Q4r8j10J51N7j47j42K56O7k79L93l39K64m1j65l0O8j18N2K18
$$ plain form
6416 -104 -165 180 30 135 48 -1 122 -163 32 -125 -70 178 160 66 -91 55 208 -124 -139 78 22 -234 62
6439 62 -182 67 -72 -13 -37 171 -187 350 -35 116 -15 -300 -114 113 39 197 -174 -168 73 -3 -67 17 -14
6462 -14 226 36 -112 36 -44 -266 -3 -17 104 -115 -74 -59 -47 83 46 131 336 -117 50 19 -145 -146 110 -238
6486 -238 -152 143 -210 -101 -79 116 72 -178 57 320 125 -50 -71 231 -32 221 -153 39 12 -12 -258 -180
6508 -180 -68 55 154 173 169 -134 -75 -102 105 113 123 174 -247 -50 93 192 193 63 -22 152 -29 -69 -223 -18 56
6533 56 74 -237 -317 -49 63 27 -95 -42 -44 -25 103 -187 72 -16 -69 -17 -13 -230 -222 -88 5 28 -50 -27 177 -26
6559 -26 -47 -44 91 10 -102 -49 -91 -14 81 122 115 -44 -173 18 -355 23 -108 106 -7 41 173 126 171 -6 -318
6584 -318 11 -73 -17 67 -31 -141 10 67 -80 -222 34 101 -178 215 -124 140 99 -66 -96 -28 -146 -94 124
6607A24k39j6J15j07K16k02j35L64k36L82m26K59o0j79J57M2l1n4p6K12l95L32
6629D7J07p1p2L6J12m4J29k16j53K9J7j55M15r1k41K44R3l42J67Rk06K45j47J17
6653B9O2J28m13J14p6J10j38J13J83j64M4J63j19k5j15J01J6N3k71K15N5J04n8
6676A11l16L39l97J13om0K31R1j56N7j94J47m8kJ04K4k65M98j9l20j22K20k53
6699b03J62k0n1K32l15J54p2j05K90j89j13L95J49m06k1q6K24J90k02j52L0j5
6721a24J65q6J86Q4m10Q7K34k24q5J88L7k80J23K0j01K37j49J18J56k15p5k6R9
6744d1n3J37k7R7j64j15L21r1j00j37J2p7K91q1j44J76n8j31J46N2l5K40m29K78
6768F7J09j10j50N0l12J00J81J94j78K35j41j5P5k1K7k76K67n8Q7l63K03J50m8
$$ plain form
6607 124 -115 -131 -16 -123 93 -109 -244 120 -116 266 -160 99 39 -140 17 59 28 -26 -102 110 -285 47
6629 47 154 83 11 47 159 115 244 28 -125 -96 -79 -234 181 90 -151 93 186 -156 11 20 -186 59 -88 29
6653 29 91 219 -194 -80 -156 -46 -184 -71 112 -52 -8 155 36 11 -104 -3 13 66 -205 10 65 169 111
6676 111 -205 134 -263 -150 -156 -196 35 126 -30 27 -167 -20 -68 -70 34 58 -207 291 272 -48 -170 50 -203
6699 -203 -41 -61 -112 120 -195 -41 -113 -218 72 -117 -230 165 314 -92 -113 -199 25 215 13 -139 -109 -124
6721 -124 41 -45 141 225 -185 -98 136 -88 -173 15 52 -228 -105 -85 -186 51 -98 20 176 -39 -114 -140 -41
6744 -41 -94 43 16 113 -51 -166 155 64 -36 -173 -161 -238 53 -28 -172 4 -54 -185 -39 13 -22 218 -211 67
6768 67 176 66 -84 -34 -346 -246 -65 129 -49 186 45 30 105 84 111 -165 102 44 131 -232 -29 121 73
6791G3j13k8j42J19L7n9J0m0J23J78j73J74j0k00J14j11J44m3p5l5j73R4mJ35
6815ej38J03J15J08m23J66J7R0q1k3P2k06K79J6k35K57Qj0J41n03M01l03K01n9
6839a2qk18J75k2J58Ln8L4k41K95N9k84L22k03j32J98j16n4J93J53j71P9q0J07
6863A77k4j41n6kO4o9P8r5r3KL27j11p7K9k05K30j90j06L21k67K49j4NP7j39j51
6889a81J50J0n9K2j0J55k92K38j44L98n33K97j7k79M2MK05k88L28k5K16l4m26
6912b23k02L53j1j2j4R5k40K00N9j44J58J4j1NMk49J48j25L84k05L48o01K24m7
6936i2K21k55M28l72J4R8j12m0N1N9l3j34l4M27k46j52K95Mj41mm5j71Q6K92k50
6961a06j32J28K6j08RO4K16L0o0k25J69m4P5j3j37J7M9M5J36j48J21J2j51k35
$$ plain form
6791 73 -40 -68 -210 -91 -54 -113 -103 -143 -20 158 -15 159 149 -51 63 -48 96 53 -22 -57 -230 -136 -140 -5
6815 -5 -143 -40 75 183 -240 -74 -57 33 -48 -71 1 -205 74 90 -145 112 120 110 251 -252 149 -154 47 -12
6839 -12 -20 -238 -63 -85 73 76 18 52 -189 106 165 -119 203 0 -132 66 -50 -104 89 242 71 150 70 177
6863 177 153 12 -44 -46 18 -51 27 -68 -161 -159 168 57 -20 9 -196 34 -156 -262 59 -208 41 27 32 109 -30 -181
6889 -181 -31 -21 -80 -58 -68 87 -205 33 -111 287 -246 51 34 -245 -203 -199 6 -282 46 21 237 203 -223
6912 -223 -425 -72 -83 -95 -109 -14 -254 -54 5 -139 19 33 22 27 31 -218 -70 -195 189 -16 332 -269 -45 -92
6936 -92 129 -126 302 -70 -56 42 -70 -110 -59 0 -33 -167 -201 226 -20 -172 123 127 -14 -18 -63 -234 -148 144 -106
6961 -106 -238 -110 -84 -192 -183 -119 97 127 67 -158 11 -33 42 29 -108 -91 -42 3 139 -9 112 124 -27 -262
6985b62J61Q6J17O0j65J02j04j53L2J43O8j29O6j67K09J36l6j95J02k0j84K16
7007H3l9j50oK7M4Q6k28K36K32l30k44K97n0j87J51K5K13j68J12j31K90l50j82
7030b69j25L77m9K2R5j4j75L88m32O4L28j91j19J36O8r4N7j88J10K6J08o1k03
7053a41J87j46L22l66J9N31o42R7J62K50l43K59j38j17J29l4P8o9p6J20J05j23
7075F4j92p1M87k59q0K08j41J42k23l6K56J5l96q4M93J6p1L6j67J34j87L33l65
7098h8n6J5k08M47q0j26q5K17j87K20j78K9q3Q1j64J93k59P4K46K2n7j67J11%
7122h3j95N99l37p2K45mk85L31m0l86J11J92k73m4L92j43j68K31m4k52J51L3M1
7145@J08qJ16k89K14k0k27J51J4o4O6j08J71k70J43N0r5Q5NJ16K1k57J41l78K86
$$ plain form
6985 -262 -101 -15 102 162 -3 99 -5 -158 -126 17 85 -44 22 -145 64 200 164 -31 71 51 -133 83
7007 83 44 -106 -112 -85 -41 45 -183 53 285 -45 -289 8 -42 -229 -78 -53 160 -8 104 -27 263 -87 -269
7030 -269 -394 -17 -66 -44 51 37 -138 250 -182 -118 210 19 -100 36 104 10 67 -121 -11 15 123 62 -141
7053 -141 46 -100 222 -144 -125 406 -236 -139 23 273 -70 189 51 -66 63 29 107 38 -38 82 187 64
7075 64 -128 -199 288 29 -51 157 16 158 -65 -101 155 170 -226 -310 183 199 128 164 -3 131 -56 277 -88
7098 -88 -144 -129 -337 110 30 -96 -181 36 -151 69 -109 -80 -163 -82 -246 -53 -312 -238 8 30 -27 -194 -83 -83
7122 -83 -278 321 -16 -88 157 153 -132 199 159 -227 -116 76 -197 -241 151 8 -160 71 27 -225 -74 -41 0
7145 0 108 100 216 -73 141 121 -106 45 59 -5 61 -47 124 -146 -3 47 -48 37 42 158 179 -78 63 -315 -29
7170b9J98k95L20k04J72j60n2K08l18J38k37K20j27q8M41l16j9M8J32O9j06J98
7192A93q4j70o5q1L47j0j08J0j79K66Jk55K36j48j76K69j83J05J10K0j9k47J33
7215c5j25J29l6K75k24L00k51N0j54J97j33o1j9j1K8q5L00J5j52q5K35M2j28j30
7239e8J86m1rj7j2K14k06j14rN3J09j61J10oL3j28Q7r1o2K82k24J38l37M51k10
7264b2K36j42k32L73k26J25p6l1K27j99o5j43K38M2rO7j87J4j10J50j58j9J62
7287A5J68M4j20O2j07n9l35O11l70M1q1J44J7j29k57L64O7o4Lo8jl2Q7o8J84j5
7313A01j89Q9J04j96K32k39J85p1k0j2n6K60Pl25Q0K15j78j14M3QN6J39j62J61
7337A18j21j87K63q7n3J34m98M52K8m8j95J92L1k03pL70M4k36KJ81j32m5m0p5
$$ plain form
7170 -29 169 -126 194 -10 162 2 -50 158 -160 -22 -259 -39 -166 -254 187 -129 -148 -100 32 101 -5 193
7192 193 109 -61 -126 -207 140 130 22 32 -147 119 120 -135 101 -47 -223 46 -137 -32 78 98 79 -168 -35
7215 -35 -160 -31 -67 208 -16 284 33 83 -71 126 -7 -68 -87 -98 -70 -155 145 160 8 -77 158 200 72 -58
7239 -58 128 87 78 61 49 263 57 -57 -66 -13 96 -65 45 39 72 -56 31 -60 -122 160 -64 74 -263 188 -22
7264 -22 214 72 -160 213 -13 112 36 5 232 33 -32 -175 63 105 96 163 -24 -10 -120 30 -128 -147 15
7287 15 183 227 107 169 62 3 -332 279 -91 -50 -131 13 30 -99 -356 8 75 11 14 -54 -55 -87 0 -68 116 101
7313 101 -88 1 105 -91 141 -98 87 16 -4 -16 -72 188 195 -130 -50 165 -13 -127 -84 -76 -20 119 -43 118
7337 118 -3 -190 73 -14 -67 67 -431 21 49 1 -194 -2 29 -174 -181 189 233 -3 -1 180 48 3 -37 -112
7361a12J47k85J42k7L55J68l19p6j33p5K99m20O17r3k71Q4k35L12j55J21J37j60
7383B1R5M1k19MJ56J8j05k23L60J04k66J59o3k3j13l0P7j68K77L7l55N0L59k96
7407a03J90r9j70K34j63L16j04k61J16J15O9N5j94kk08J00K2J73Q8o5k58J77Q5
7430A13j75J26j83l0M4r9M58k58n8R8J49K1k23k1o9L50l17j21k6Q7O7K25P1j93
7454C6j34k3R5j54N48k20j50O4K3Q4K6n3j54j29J73J55lq7j83K34j46M1j67J09
7478a5n3K9K6J59j42J8J84n9k81M4K79p8J03j29L7j80M8m6J86k49P6Q5k67P6J47
7503bJ53j58Q3l10P0J39K56m9j63Lk4o1k1K09j53k3NM4p1J0J85k64Q0L26k71n7
7529f4r8K15k45J66m1M3j23O5Kj53M13r0j36J39J38k69N0QN7p8l9K82m09K11j36
$$ plain form
7361 -112 35 -250 -108 -135 220 388 69 -7 -140 -215 84 -336 281 188 -83 1 -234 78 -77 44 181 21
7383 21 116 157 -62 -58 98 116 11 -212 148 252 -14 145 82 59 -54 -84 -7 -175 102 139 -216 -166 193 -103
7407 -103 87 -12 -182 52 -111 205 101 -160 -44 71 140 195 1 -1 -209 -109 -87 86 174 109 -149 28 113
7430 113 -62 64 -119 -149 -105 -204 254 -4 -62 36 185 206 -17 -38 -107 243 -74 -195 -221 -134 -67 158 229 36
7454 36 -98 -121 -26 -180 368 148 -2 62 85 169 195 142 -12 -141 32 187 184 97 -86 148 2 43 -124 -15
7478 -15 -68 -39 -13 146 4 22 206 147 -134 -90 189 111 214 85 122 -58 -10 -56 130 -119 -43 42 -225 -149 -2
7503 -2 151 -7 76 -234 -164 -25 231 182 19 22 -2 -63 -84 125 -28 -51 -46 -2 -73 -63 122 -142 -62 264 -7 -64
7529 -64 -162 53 -192 -26 -67 -24 -147 -82 -80 -233 180 90 -46 93 231 -38 12 20 77 -1 -40 242 -167 44 -92
7554i2N9J39J8j01k4L49n21OJ19J9J24k8pMk34K98j78l3M2l0rJ67k32K89k6j36
7580a8J58o3k05K76j27J13k29L14j24k48J17O9O8r3J11j15m1q4O1J57n1pk3pp1
7605f2pj6J4J50n6k63J50K35k22K04k69J45k50J26J32p7J39K0j17J73k61m0J29
7628b3k1N4K61m46J56J46J83m95J20J31K2j29Q8r2m2J09j57J46J6l12L69j14m4
7651g4J73ml86L05%j85K92j27j46j07J82j28J89k4J6J2k10J41J9J71k3j0L4j09
7675AJ54k56nJ07J43j18j40k3n9K75k7lmj09m7J72m4k5l3po2J53j60J34j37J99
7701G9j08J46n1j10J9R9k5j38R1L1n1j35k6k9K61k41P5K91J7K7k01k84R5MK48
7726H4l33L2J58J47j92k6j27K76R8kp6r3N1p5M8j02N6K55k11Q4J08l16Q0O0K93
$$ plain form
7554 -92 -33 106 124 23 -1 348 -173 -167 -48 -29 95 67 60 64 -170 128 -50 -83 -41 -71 -80 87 -145 144 118 -18
7580 -18 140 77 -128 148 21 134 -95 219 95 -153 -36 33 101 8 119 4 -37 -121 -60 97 46 39 16 9 -62
7605 -62 -69 -85 -71 79 23 -240 -90 145 -77 127 -142 3 -247 -121 11 -66 73 93 -24 149 -112 -152 -23
7628 -23 -44 10 271 -175 -19 127 310 -185 -65 66 88 -41 47 -45 -87 22 -135 11 27 -285 84 -30 -74
7651 -74 99 95 -291 14 14 -171 121 -6 -152 -259 -77 -205 -16 -40 -24 -12 -222 -81 -62 109 86 76 110 1
7675 1 155 -101 -106 1 144 26 -114 -137 -196 79 52 49 45 -64 -111 61 17 -8 -41 -48 -110 43 -117 17 -120 79
7701 79 -29 117 66 -44 -25 74 49 -89 2 33 -18 -153 -179 -208 53 -188 -113 178 195 222 21 -263 -168 -164 84
7726 84 -249 -217 -59 88 -104 -130 -257 19 117 115 39 -54 -3 -78 -30 -132 -76 179 -32 52 160 -156 -76 -16 277
7751B77j75j87n3J71J27j20j54K46k51J44Q7l03K20L3o7p5J95m22K23J33L9J9
7773A07K7k65K93j19j89j58L12L4M4l24K32J26l7J9r9K32j95q5O7l2J65j0k92
7796a47K80j42J63j92j6j38J27jP7L1k6j20n3J91k92M34q5P1k03K68j27j93J6
7819g7L7K35k11j62Q7K80n6j6p1J0j7J43p1m3m48J97L54l43J87k28L97j47J31
7842A68l5j63k83L95j49R4J50l82J26J32O4k67J68n5K07j64Q2l87K25K58k94O5
7864d5m9K95l59K88q2Q9k30K67k42L9K95l51j0K07k05J04p5K7J77k33K27j39J86
7887A81j59j6j35m8qm4O0K01j34O8O5J51J9j93j8N7j5l57M79j16m8k80K84M1n7
7912b2q6J01J9K8J11l04L8P4N1R3j5k51K61J33j08j13L04p6j62q1l4q3J39o7k73
$$ plain form
7751 277 102 -85 -138 33 160 40 -114 132 -119 25 112 -191 29 62 -5 -80 115 -307 -84 49 88 107
7773 107 134 -131 162 43 -146 -304 8 42 86 -238 -6 120 83 102 3 235 40 -45 22 -10 155 145 -147
7796 -147 133 -9 154 -38 -54 -192 -65 -66 11 42 16 -104 -157 34 -258 176 91 162 -41 227 100 -93 -77
7819 -77 -40 195 -16 -178 -91 189 133 117 46 56 39 182 111 68 -380 -183 171 -172 15 -213 184 37 168
7842 168 133 -30 -313 82 -67 27 177 -205 -79 53 117 -150 18 -37 170 6 88 -299 -74 184 -110 -45
7864 -45 -94 201 -158 130 48 137 -93 174 -68 -29 266 -85 -95 112 -93 11 -64 -37 140 -93 134 -5 181
7887 181 22 6 -129 -177 -185 -229 -169 32 -102 -34 31 182 201 8 -10 47 32 -325 154 38 -10 -290 -6 35 -22
7912 -22 -108 -7 12 40 151 -153 -115 -41 10 103 88 -163 98 231 123 10 314 238 76 -5 -39 -122 17 -50 -323
7937c23M35k6j59l7M0L53k47n9Q0j84k71M68Q4q4j52P6j20O7P2j6K3r6j07J95
7961A2j18L11r8M1R2j69m7K28k41j65M9j7Q4Q7m8k06K59k74O3oJ23J36o3K8j71
7986a10J21k48L99k59j12L1L42j84k55M29n22O63m17J44k12p6L71o5j94L13m27
8007b68K61J03j16n5j6J34j88J84l45M51j97R0k43K26m3L6n4J89k95K18j73J76
8029G5N2m10K64k29J07k0j05k03N15q9k5j33M33K0l75R4M03k30j31j3O9l6n2k73
8053b92L25J57m10J90J18J0k43K03k81L70l28O6K81L6l49K44j48j99K49n8K48
8074A89j75J02l7j42J59k94K48N4j40k45L82N6p0p4J13L0j37kO5K00k36o5J05
8097H6jN9l9j38j27J26J25J90q4k04k8O2O8r5j61O9l5j10K54k05J65K12l19J11
$$ plain form
7937 -323 112 86 -73 -110 -70 283 36 -23 57 -127 -398 70 154 70 -82 -6 -126 -59 13 -3 20 -76 -183 12
7961 12 -106 205 107 148 240 71 24 252 11 -154 -105 -122 -38 49 1 -205 54 -220 -157 -163 -40 96 33 61 -110
7986 -110 11 -237 162 -97 -209 -178 164 -20 -275 154 -368 295 -122 22 -190 -266 105 40 -154 159 -268
8007 -268 -7 96 -20 -75 -91 43 -145 39 -306 145 -52 38 -205 21 -22 14 -40 149 -146 72 -101 75
8029 75 127 -283 -19 -248 -141 -161 -266 -469 46 -43 -68 -201 232 252 -123 -29 374 144 13 0 69 33 -19 -292
8053 -292 33 190 -220 -30 88 98 -145 58 -223 147 -181 -115 166 202 -147 97 -51 -250 -1 -59 189
8074 189 14 116 79 -63 96 -198 50 104 -36 -281 101 157 87 13 126 156 19 17 82 282 46 -19 86
8097 86 85 144 105 -33 -160 -34 91 281 197 -7 -35 27 95 0 -161 -92 -127 -237 17 -188 -23 189 -130 -19
8121a9Q9l7j0k42K26rj44J01J54k94K83j62R6l02N1L22j97K09o8j19ON1L07m64
8145a72P8j4M9k03L71Jk49J12q9L6O2j79J57J58k63J9O3J39l97J40Q5O4M4L2j13
8170f9K08l80Q6n4l5K67J39k44K84p4k01J8m6L37%l07M2mj17K67p
$$ plain form
8121 -19 70 33 23 -219 7 -2 -146 -45 109 -185 98 -64 32 -270 -219 103 -94 115 47 -72 -66 -15 292 -172
8145 -172 -94 -108 -59 -262 109 110 -139 -27 -116 -80 -18 -197 -40 118 -145 -126 -63 76 -321 -181 -96 -32 12 44 -69
8170 -69 139 -241 -155 -209 -244 23 162 -82 202 128 -73 -55 -101 236 236 -71 -29 -33 -150 117 110
8191A10
$$ Imaginary data points
##PAGE= N=2
##DATA TABLE= (X++(I..I)), XYDATA
0@%%%%%%%%%%%%%%%%%%Oj4J6j6J6j6K0k8L2l2L8m6N2o0O8p6Q4r4J05j16J30j46
40g7J62j80K01k22K45k72K99l28L61l99M42m88N37n90O52p24Q07r02J011j142
60f07J302j501J755k093K568l280M453o718J2594n3506j24881J65471J39022j01531
74C3048j10920O5136O8284l4929l5039J3195J335J0895L0352l1599p9177K2460
86d6959J09375L826j18605l5180R5262M8873n9700l8911L3949K7373j3498j4705
98h900j747J2937K4442j365m2216j6376M0369K8666k1248k4418o854j241K0390
111B439K8837k1523m4696K0446M9924k3853n1577L1177N9683k7399o3687J3823
123b6406N2668k936k8935K726O73j9378J2564L2021k0629l5989K8690L3234m1021
$$ plain form
0 0 0 0 0 0 0 0 0 0 0 0 0 0 0 0 0 0 0 0 6 -8 8 -8 8 -8 12 -16 16 -16 22 -24 28 -32 36 -40 44 -50 55 -61 69 -77
40 -77 85 -95 106 -116 129 -143 156 -172 189 -210 232 -256 281 -309 343 -381 426 -476 535 -607
60 -607 695 -806 949 -1144 1424 -1856 2597 -4121 8473 -45033 -169914 -4443 134579 33048
74 33048 -77872 -12736 55548 20619 -14420 -1225 110 11005 41357 9758 -69419 -46959
86 -46959 62416 66242 -52363 -87543 7719 56592 -3108 -42019 -8070 19303 5805 -8900
98 -8900 -10647 2290 26732 25367 -16849 -33225 7144 35810 14562 -9856 -16710 -17951 2439
111 2439 31276 9753 -34943 -14497 35427 11574 -40003 -8826 50857 23458 -40229 -26406
123 -26406 26262 23326 -5609 -2883 -2210 -21588 -9024 22997 2368 -33621 -4931 28303 -12718
136a2718l2663N5476M1685n2693m3093M4055L6766k9830k0994K5213Q055k4612
148e353n977J7113M225p426k485p209r651J0614J8471q279k1087N021J8042n724
162B95j2544J1963J5376j0662j5699M316J3715O191k411j1334r205R060J3168
175A2229q418j0490J0466O432j8645p754K1485J0788j7893r655J1965J875j0087
188g702N437J4389p446j6839L479J2963r61n118L953j504j0184L049J3586k552
202D550j1182O178Q628j1211q333J6505J2674j4291j3897Q341J0624l109m248
215A229J301j421l388O79J117m86J161L10n286m681N490O985k416m819J612J375
231a238k287K632P974j405q154Q63O178N42k648J137M86m368q1K155j882j279
$$ plain form
136 -12718 -45381 10095 51780 -913 -44006 49 36815 6985 -14009 11204 19259 -5353
148 -5353 -11330 5783 10008 2582 97 -7112 -16763 -6149 12322 4043 -17044 -12023 6019 295
162 295 -12249 -286 15090 4428 -11271 -6955 6760 12951 10540 -794 -9999 -939 12229
175 12229 3811 -6679 3787 10219 -8426 -16180 5305 16093 -1800 -11455 510 2385 -7702
188 -7702 -2265 12124 4678 -12161 -8682 4281 3320 -1798 2155 651 -9533 -6484 7102 4550
202 4550 -6632 -454 8174 -3037 -11370 5135 17809 3518 -10379 -2038 8586 5477 1229
215 1229 2530 1109 -2279 -1600 -483 -969 192 502 -4784 -9465 -3975 3010 594 -4225 -2613 -1238
231 -1238 -3525 -893 7081 5676 -2478 -1615 4563 5105 2457 3594 4080 -288 -369 1786 -96 -1375
247a375M531q41r991j755J1998M426j0903o009Q598N129o167l021N981K903m256
262g52k298K155J580J658J123l185m303L655N880k758m985K167L921k900l138
277b180L200K873k878k562J360N56r01P97J27j657j268J495j06q82J162Q15k251
294b300j170L703J917l162p86L908Q72l489K50L993p0l188k11K157p35j279J254
311A664j113k341O30J812j539k858J702K212k507j965K596K391j883j732K652
326b79J168r80k09K115k01j308R60J103r53l27N52K18j459R4N96q86m46O49n1
345C56j015l74J258l15j500P1J368j30j166R9M02ML10M57n69j04Q53J032q23p34
365e20J347J287j036p20J024N10o32n4L52j037p28R51M55j937j509J404J382j521
$$ plain form
247 -1375 3156 2315 -7676 -9431 2567 6993 -3910 -9919 -1321 3808 -2359 -5380 601 3504 -752
262 -752 -3050 -895 685 2343 3466 281 -4022 -367 5513 2755 -2230 -63 3858 958 -2180
277 -2180 1020 3893 1015 -1547 -187 369 -532 265 392 -1265 -2533 -1038 -1144 -2026 -864 -49 -2300
294 -2300 -3470 233 2150 -1012 -1798 2110 2982 -507 -257 3736 3666 478 267 2424 1689 410 1664
311 1664 551 -1790 -1160 652 -887 -3745 -2043 169 -2338 -4303 -1707 684 -1199 -2931 -279
326 -279 889 -91 -300 1815 1614 306 1266 2369 1416 1089 1641 1859 400 494 1090 204 -242 407 356
345 356 -659 -1033 225 -90 -1590 -1519 -151 -281 -1447 -1348 -946 -942 -632 -175 -744 -848 5 1037 214 -520
365 -520 827 2114 1078 358 1382 1892 1260 1206 1558 521 -207 744 1199 -738 -2247 -843 539 -982
383i82j411L54R11N30n93r38K51K043J150j729j437J832K658o50k368P0K499R92
401C182j640k030M43J873N07j852k224J052K030p1l149j201L076J520k682k509
417c675J667K504n49j325l40J252J140L33j254j65P98R77J22p75l49Q43O73p98
435A079j368R13J092p15j728L80J001j083m96P19P41j451j686P44J978Q9k319
452b110k09J883M45j084N6J543Q4O3K64j359n09L082K220k746m020J835M627k85
470C780m808j368M051J172l417k763K143L030j386k920p73N97K895K323k962m840
486e246J749O648J517o940k562O250L660m483m521L362O041j665o454j389N082
501A049L637j474l998l393K109N059J269o183l397N519M037o080m687N266P002
$$ plain form
383 -982 -2393 -2039 -1128 -598 -1191 -2129 -1878 165 1315 -414 -1851 -19 2639 1989 -379 -309 2190 3182
401 3182 1542 -488 -45 1828 2335 483 -1741 -689 1341 1270 -1879 -3080 -4 1516 -1166 -3675
417 -3675 -2008 496 -53 -1378 -1718 -466 674 1007 -247 -412 386 1363 1485 710 361 1204 1877 1079
435 1079 -289 624 1716 1001 -727 -347 654 -429 -925 -206 535 -916 -2602 -1858 120 209 -2110
452 -2110 -2319 -436 9 -1075 -1019 524 608 671 935 -424 -933 2149 4369 1623 -2397 -562 4065 3780
470 3780 -1028 -2396 1655 2827 -590 -3353 -1210 1820 434 -2486 -3259 -2662 233 2556 -406 -5246
486 -5246 -3497 3151 4668 -2272 -4834 1416 5076 593 -3928 -566 5475 3810 -2644 -4033 1049
501 1049 4686 3212 -786 -4179 -2070 2989 4258 -1925 -5322 197 4234 -1846 -6533 -1267 5735
516E735l228q129k98P129L847m087l212R44J474R29J053q16k106J495K390k267
532H53l190K315N058k442n726l06M308K244k830k478K58J111j32K21J604j050
548a82k716P40K848o10j873K268K038l167l121L211M491m42l710q95J428M44k9
565G23J592L75l529j960L384J544k701p90L205r85n091N78N237Q33l417j003P95
582a210n43P64K835K78l230j743L133K334j998j572K513J691l481k620L174L731
598D056j488l678q86J008J946J107j343k786L99J429k5r87N62J090j31k149j640
615c516K460M124m46m482j490L382K137j327j62J034l46k488j47K748J936j878
631A539k100m60k3O24J468J052k209k713J035J420m66R34J573k217l607J799M149
$$ plain form
516 5735 2507 -5622 -5920 1209 5056 969 -2243 -1299 175 1104 2157 1341 -765 730 3120 853
532 853 -2337 -22 5036 2594 -3132 -3438 870 3114 284 -2194 -1936 -825 -957 -736 868 -182
548 -182 -2898 -2158 690 80 -1793 475 2513 -654 -3775 -564 3927 3485 -225 -1120 308 752 723
565 723 2315 2690 -839 -2799 585 2129 -572 -1362 1843 858 -4233 -3655 1582 2415 -1002 -2005 -1210
582 -1210 -1753 -989 1846 2124 -1106 -2849 284 2618 620 -952 1561 3252 -229 -2849 325 4056
598 4056 2568 -1110 -1996 -988 958 2065 722 -2064 -1665 -236 -261 -1248 -686 404 273 -1876 -3516
615 -3516 -1056 3068 2622 -1860 -3350 32 2169 842 680 1714 1368 -1120 -1267 1481 3417 1539
631 1539 -561 -1021 -1044 -420 1048 2100 -109 -2822 -1787 -367 -833 101 1674 -543 -4150 -2351 1798
648A798M6k324j90N36k80n08K152J302j157j789m76Q40J462Q30k37k381k032J543
666h65K173K80j420q41l87p33Q79J237K54j010m48j390j57K242K757r92l235m43
684b099J367J870P88k54j729m95P45N33o8N37O29o95k574l70K845J800k272k653
702b095O6J653J83RJ4l74p21Q4K50j54J853J062k245j966J295K766l1j332l38
721b1J17k70L32J076L68j018p01m45j49R38J163m55j834q49J002P39J4N3j67j161
741a268l60J059J182m8n20k11n29j12R90J628o12j014l30r6N19J045P6n30j336
760d67M4O86r5K09Q5l74j267j82J272M42o65l52l24J25rJ072J3j05m66j93K06
781c45N98N35L43q36q95O54P81K95j36q7p75n33n9J038M34o83o94k67j99M09M30
$$ plain form
648 1798 1844 -480 -670 -134 -414 -922 1230 2532 1375 -414 -890 -50 1412 2242 2005 -376 -2408 -865
666 -865 1308 1588 168 -673 -1060 -1793 -914 323 577 -433 -881 -2271 -2428 -186 2571 1579 -1656 -2099
684 -2099 -732 1138 1926 1672 -57 -552 193 726 658 1195 1824 1129 -1445 -1815 1030 2830 558 -2095
702 -2095 -2029 -376 -193 -184 -170 -544 -1265 -1181 -931 -1085 768 1830 -415 -2381 -1086 1680 1649 317 -21
721 -21 96 -174 158 1234 1602 584 -117 -562 -711 227 1390 935 -899 -1748 -746 -7 7 60 -107 -1268
741 -1268 -1628 -569 613 565 45 -166 -695 -807 183 1811 1199 185 -145 -241 278 1323 1399 869 -467
760 -467 -423 263 168 377 462 88 -1179 -1361 -89 353 -312 -664 -988 -863 -872 200 213 108 -358 -551 -345
781 -345 253 788 1131 295 -600 54 835 1130 994 907 132 -401 -460 578 1012 329 -365 -632 -831 -422 8
802Hk22m17l23K89J3M26K63K44p69l27P68O83K77l53n96J17pK77M63N6l29m17
824A24j10J00K83J70k22p34l03N48k6k0K07m42l78o7L94R25m20j96j55M04j23
845d1J80M27j34k52O2N1K27K25r6j48o95M12K72l51j30j91N9j88RK3Q1L9j77m90
869h26K47K61j18L99j77J96k06L17j26K63J70m14J9J23N25ml16J14l3m8k3j02
891B41p9K28m59l16k35M67K37m45l96M32k14L42j65l1J98J87j26oj30O34j17K49
913D96n94J36M87L63n71j86J35J72J58o95j45K35K81n00j15k19K05N1K51n35k91
934h81O67N71o24n83M00P29R2r95N30O45j46k55j02L44r7J51K43m47m07J67O31
955F33k55p69j51O51J61r14r2P97j99m26ML30n1k62K45K03K8j10L42J07l49j87
$$ plain form
802 8 -214 -631 -954 -665 -652 -226 37 281 -488 -815 -47 636 913 560 -36 81 74 351 814 870 541 124
824 124 14 114 397 567 345 -389 -692 -144 -170 -190 17 -425 -803 -870 -476 449 29 -167 -322 82 -41
845 -41 139 566 432 180 242 293 520 745 649 501 -194 218 490 139 9 -182 -123 -311 -302 -279 -198 -159 -336 -826
869 -826 -579 -318 -436 -37 -214 -18 -224 93 -33 230 400 -14 5 128 653 649 333 447 414 366 343 241
891 241 162 390 -69 -385 -620 -153 84 -361 -757 -325 -539 -197 -362 -393 -195 -8 -134 -140 -270 364 247 496
913 496 -98 38 525 888 317 131 266 438 596 -99 -244 -9 272 -228 -343 -562 -357 -306 -55 -590 -881
934 -881 -214 357 -267 -850 -450 279 371 -624 -94 551 405 150 48 392 295 446 689 242 -165 2 633
955 633 378 -391 -542 109 270 -644 -736 61 -138 -564 -560 -230 -281 -543 -298 -95 -67 -177 165 272 -77 -264
977b64N08M57l75m08K22L21Q2n54K32R2m28L7Q3o8j87k70N68Q5p12l22Q83L79
999C61p31o15R14J22j33k31P83j64m97K46M70m67l40J206J00r80m40O99N54m71
1019C86p86L97M20l53k77j72M48j87k83j5N4l20L28O02n15n60N90Q84n54o67M83
1040i7N69j58l77j82N12O58o70j39L41jj98j98P9k22j13J80n3k61k91N87n9l96
1062d89l08R78m7k51k76O5L76J66k15J56K20n66J7R08Q2p79r1P56o10m04P14m8
1084C54m55k44M8J11j9Q5J23j75m60lP40j13n18n0N86p0k24J59M43q3l32R8J42
1107A43K16m9J27%n80K21L53K07k63j79l25R6K02k38p8k0j18m67M58L35J82n74
1129c51R0l03OM61M78n7k81k44N2M06M2l0L45j93o11KP09ll87l96L01k25j77N10
$$ plain form
977 -264 244 701 326 -82 140 461 543 -11 221 313 -115 -78 5 -63 -250 -520 48 133 -579 -901 -18 361
999 361 -370 -985 -71 51 -82 -313 470 306 -191 55 525 58 -282 924 1024 44 -396 303 857 386
1019 386 -400 -3 417 64 -213 -385 63 -124 -407 -422 -368 -688 -360 242 -273 -833 -243 641 87 -580 -97
1040 -97 472 314 -63 -245 267 925 255 116 457 456 258 60 139 -83 -196 -16 -69 -330 -621 -34 -93 -489
1062 -489 -797 181 134 -117 -393 -328 48 214 -1 155 375 -191 -174 734 816 37 -54 702 92 -312 402 354
1084 354 -101 -345 -297 -186 -205 -120 3 -172 -632 -635 105 -8 -526 -576 10 -60 -284 -125 318 235 -97 1 143
1107 143 359 310 437 437 -143 78 431 638 375 196 -129 -33 169 -69 -147 -167 -285 -752 -294 41 223 -351
1129 -351 -261 -564 -558 -97 381 324 43 -201 -149 257 299 269 614 421 -190 -188 521 518 131 -265 36 -189 -366 144
1153A44L7n09Q4l0J15j62L58k33j59M0J97J89K57k78O7k97L02j24N61j67o3j24
1175B05j66J36J7J13K46m92l53L68k71K64j04J45m69J1j31N13J00m38N5l7q6L18
1197e6rK98j3l26J47j30M63J96k03m52J26J84J79o7p1j06n39L74K27l82K72q9
1219B3j98n19O57K03k03m07j44L21J30k33L92K21m9n58K63M31K14q7j62m71J6
1240a60L35K22K16l92o08J65j1L59K55k55m06J73K34l67L93r1j42j33j54K7L50
1261A0L83l79o9k2j44M49K00Om50k02k8K36O22mm06l41k0r3K47J2J03j72k63Q
1285c17K8N37k85k86p9K36q0R1M10k13l3j04J4J96K05j08J36l03N4Q5K52j08j09
1308B19Nj61j89K22j42j76K32l04k17K68M53j94k24p2j51K04J70K58l26q0J1K33
$$ plain form
1153 144 181 -328 -244 -274 -159 -321 37 -196 -355 -315 -118 71 328 50 117 -180 122 -2 559 392 329 205
1175 205 39 175 192 305 551 59 -294 74 -197 67 -37 108 -361 -350 -481 32 132 -306 -251 -288 -374 -56
1197 -56 -65 233 220 -106 41 -89 374 570 367 -85 41 225 404 337 266 160 -379 -5 222 -160 112 23
1219 23 -175 -694 -37 166 -37 -444 -588 -267 -137 -370 22 243 194 -364 -101 330 544 457 295 -176 -160
1240 -160 175 397 613 221 -387 -222 -233 126 381 126 -280 -107 127 -240 153 62 -80 -213 -367 -340 10
1261 10 393 14 -55 -77 -221 228 428 434 -16 -218 -246 -10 612 608 202 -139 -159 -252 -5 7 110 -62 -325 -317
1285 -317 -289 248 -37 -323 -402 -166 -246 -155 255 42 9 -95 -81 115 320 212 348 45 99 184 436 328 219
1308 219 224 63 -126 96 -46 -222 10 -294 -511 -243 210 16 -208 -280 -431 -227 -57 201 -125 -205 -194 39
1330C9K87j6l16OK89k20K24O0j09J21l55K60m52K76J06j56n9l95J12K22m0J51
1352C5J07n34Q3j14K31M24l71J56j06o8L13J23j66p0k27J06K54j24M17m18j6j58
1374a23K67m18K17m2j79J19j47J18K80j91k80K53j31J06K26J58j74j21j64Q1L00
1395A55N4J02K6l88K77Q2k08J6k6j40K34k92L33l44J24j82j8L4J20n9j2j31J40
1418a03k82L44j96K26J10l3P2j16P5O9L4j68N0J39N0m4o0M3p4m1Q9j58n4j92L00
1443H0k54%n3k45K90pR6j28O8J9PK85rk63m7J66K58j80j3j02K87J19l1l41j7K98
1469B83k53j19J06L4n7L7k1R0j21r9k0j08K56j30N5J13l18J49K15j0m3q0j71L62
1493A50n4J90l6k65J94J8J2j67M6p2P8j97J87k3j66K1LJ46L3K9k29J29l36Q4K21
$$ plain form
1330 39 326 310 -6 0 289 69 293 353 244 365 10 270 -182 94 200 44 -15 -410 -298 -76 -116 35
1352 35 142 -392 -309 -423 -192 232 -139 17 -89 -157 156 279 113 43 -184 -78 176 52 469 51 35 -123
1374 -123 144 -274 -57 -99 -278 -159 -306 -188 92 -99 -379 -126 -257 -151 75 233 59 -62 -226 -145 155
1395 155 209 311 337 -51 226 308 100 116 90 -50 184 -108 225 -119 5 -177 -195 -161 -41 -100 -112 -243 -103
1418 -103 -385 -41 -237 -11 99 66 138 22 97 166 200 32 82 221 271 227 167 210 136 95 184 26 -28 -220 80
1443 80 -174 -174 -227 -472 -182 -189 -93 -221 -153 -134 -127 158 149 -114 -161 5 263 83 70 -32 255 374 343 2 -15 283
1469 283 30 -89 17 51 -6 31 10 100 -21 -120 -140 -248 8 -122 -67 46 -272 -123 92 82 39 -41 -212 150
1493 150 96 286 250 -15 179 197 209 42 88 16 94 -103 84 61 -105 -84 -81 65 98 127 -102 27 -309 -225 -4
1518dJ39q8k30K45J64o2j79j98J94O3l05K41L30M9m45j6L21k65MJ51j41j9L0j37
1542a58J2j4n0R4k6J10j61J7J17o9K33l0J61j79j55L21r1o8Q7J24n5p8J9o7k0
1567G4j18J61j41j00K95l98L20k17P5P6j35qj75K92J29j20j51Q8L01j60J26J07
1589C21m56K77o0J03k78K1L8K46%k72Q5j51Q3l1m6K41k57j82o5L46j8LK66n31
1613c17K5J92QK95k24J31J8j91J12O0K97m77K18L0k4J33o8L0On35L93K4l40R8
1637a06K93r9k77L67k57j49n4L36j54j4J7J91R5l17K10j39J21p8J01Q6j12p6J40
1660A25N7R3o8l14J33n1RJ12j96j54J29J38k61J98Q5oN9j37j33ML36j70K52k41
1684aJ28J02l96J91N2K7Q0j36k19J20J51k06K40o5k6k23M5J09m9jl82L39n3K60
$$ plain form
1518 -4 135 47 -183 62 226 164 -15 -213 -19 44 -261 -20 310 359 -86 -102 219 -46 -42 109 -32 -51 -21 -158
1542 -158 -146 -160 -210 -116 -142 -32 -193 -176 -59 -128 105 75 236 57 -98 223 132 64 151 275 220 142 161 94 74
1567 74 -44 117 -24 -124 171 -227 93 -124 -49 27 -108 -116 -291 1 130 10 -141 -53 248 88 214 321
1589 321 -135 142 82 185 -93 -72 -34 212 212 -60 25 -126 -43 -74 -120 121 -136 -318 -383 -37 -55 -52 214 -317
1613 -317 -292 -100 -92 203 -21 110 128 -63 49 109 406 -71 147 177 153 286 218 248 254 -281 112 136 -204 -106
1637 -106 187 88 -189 178 -79 -228 -282 54 -100 -114 -97 94 189 -128 82 -57 64 -14 87 173 61 -15 125
1660 125 182 275 207 -107 26 -25 -16 96 -100 -254 -125 13 -248 -50 35 29 88 -49 -182 -178 158 -12 240 -1
1684 -1 127 229 -167 24 76 103 183 47 -172 -52 99 -107 133 68 42 -181 -136 -27 -76 -77 -459 -120 -173 87
1708H7K8j37o8R3j04J64j65K32m8K6l00R9K68j37J19j19K6r6Q3K0j49Q6J1k62
1732b43K72j79J65k21r5M8oR8L17k35l9J15K3j10N80m14l30K48l9k4J67K42k59
1755H1k48P5k2P0J45Mo7J98k04n8M0j63j52Qk8M29j74J40J9k78K72J19l61K93
1779A38j34J83k58L6k97L42M21k05j58j8j27K81N0k05j40O3k55K49q9Q0P1o2k58
1802b92K43K48j83j35M0p0K2K38k72l2J47J52j13m2QL08j66j62J7J47j51n1K20
1825A21mk00M2j45K20j32K16j7j3P2j31k14Q8j4j5J07O8L28q9m18J45J7J8J63
1849B13j42k04Q0K29q7J19l27L0K0J05p7J12k9j54o8K18mk36j60L15J26p1M7N5
1873A10k34r6J30K43o0P2J35k67j05L11k46J03j39K0J23K11k25R2n5p4P1j66K45
$$ plain form
1708 87 115 -22 -90 3 -101 63 -102 130 82 108 -192 -93 175 38 157 38 64 -32 51 71 -78 8 19 -243
1732 -243 29 -150 15 -206 -301 -253 -259 -161 156 -79 -118 -3 20 -90 490 76 -254 -6 -45 -69 98 340 81
1755 81 -167 -92 -114 -44 101 105 38 236 32 -26 14 -149 -301 -293 -321 108 -66 74 93 -185 87 206 -155 138
1779 138 4 187 -71 -35 -332 10 431 226 68 50 -77 204 254 49 -91 -28 -283 -34 -123 -43 28 -34 -292
1802 -292 -49 199 16 -119 -79 -149 -127 111 -161 -193 -46 106 -7 -49 -41 267 101 -61 -44 103 -48 -99 121
1825 121 117 -83 -41 -186 34 -98 118 101 88 160 29 -185 -97 -111 -126 -19 49 377 288 -130 15 32 50 213
1849 213 71 -133 -53 176 89 208 -119 -89 -69 36 -41 71 42 -112 -180 38 34 -202 -362 -47 79 8 55 110
1873 110 -124 -220 -90 153 93 165 300 33 -72 239 -7 96 -43 -23 100 311 86 178 123 49 120 -46 199
1896A99l2k44K03J40m02K2L41l36j37J29J45P8Pk34J88l9j60J06L96l94Q4O7j58
1919c1n5K9O8lJ34j66J46J5Lk36K83k59j36L09k69K12L6j14O9j75J32l56M24M8
1943A08j52Q8L4Q5j18K09O7o1j04j35j52J78j29j08K45j92J60K2j23J20nk70K16
1966a7J37l83M57R3l83J93j24K96k63j36K44k19L55L4j05j36L19j42O1n3j29k28
1988a29j3l0m0K95k65L08k89J41j10k8LJ73o6K96o7j38n1l7K12n5M2j00J1j50
2012h7L5n2K17M4n3j84J86k83K81o6r4J30k84K88k70R5j53K40J75k91KL55k09
2035B2j56K90j22M9o6j71K83l15K14j54J24N7J50k21P4O7J7r2o7L46j37m06L50
2058A36k06O0L4k58J17Q9q9N7L1P8q4j81L2N81n17o9J13J08N8l19K08L7j89K59
$$ plain form
1896 199 167 -77 126 266 -136 -114 227 -109 -246 -117 28 106 113 -121 67 28 -132 -26 370 -24 60 127 -31
1919 -31 -86 -57 11 8 142 -24 122 137 140 -96 187 -72 -208 101 -168 44 80 -34 35 -140 -8 -364 60 108
1943 108 -44 44 78 163 45 254 321 260 156 21 -131 47 -82 -190 55 -137 23 45 -78 42 37 -233 -17
1966 -17 120 -263 194 287 -96 97 -27 269 6 -130 114 -105 250 284 179 43 362 220 281 228 99 -129
1988 -129 -142 -172 -212 83 -182 126 -163 -22 -132 -160 -157 16 -50 246 179 41 -10 -47 165 110 152 52 63 -87
2012 -87 -52 -104 113 157 104 -80 106 -177 104 38 -56 74 -210 78 -192 -97 -250 -10 165 -126 -124 231 22
2035 22 -134 156 34 83 17 -154 129 -186 28 -126 -2 55 205 -16 58 125 142 50 -17 329 192 -214 136
2058 136 -70 -10 24 -234 -117 -28 -117 -60 -29 49 -35 -216 -184 397 -120 -189 -76 32 90 -229 -21 16 -173 86
2082H6M6j79j03oJ86k31J02J16m1M9l37Q2qM35o4k40K5k6O7K4K07k76K6K35r6
2107G9J75l37J7J48n0k6j71N6l3j20L07J05j86K11p9M8l07K04k07K34LJ10p4j14
2131gM4L0J15j61j71K28k75M44O7k03j99M4K2J6N7J31r7r4K5J25N4k24J35j1j87
2156i2R4k4j46K08j26r1p3J55O0J33j62J35j91oK11j91R8M7j4l00K95J12j38j56
2180a62Q3J56k6l5o1mM3j64m9K06JN3j52J60j75K60q8k65K83o6K22k68l5K63j36
2205D4J17k17K10j36j54J57o5L6P9k49K11m11M92j23J35k12r6J08l2J31q4J3j0
2228e6q1J41n3K48k65p2J72j26L72l50R4j24J63n5J00n3j20J19j0j93m1J82j46
2251a54j22N23q1k12r2K64k10J64J03j16L76m11j02R1l5J7K57l56P2L7J05o7k81
$$ plain form
2082 86 132 -47 -150 -156 30 -201 -99 17 -24 25 -312 -230 -238 197 133 -107 -82 -108 -41 -17 190 -86 -60 175 79
2107 79 254 -83 -66 82 32 6 -165 -109 -142 -262 45 150 -36 175 96 144 -163 41 -166 68 71 181 107 -7
2131 -7 37 67 182 21 -150 78 -197 247 314 111 -88 -44 -22 -6 51 182 85 -9 16 141 195 -29 106 95 -92
2156 -92 2 -22 -168 40 -86 -177 -250 -95 -35 98 -64 71 -120 -126 85 -106 -8 39 25 -275 20 132 -6 -162
2180 -162 -79 77 51 16 -45 -49 -6 -170 -219 -13 -12 41 -111 49 -126 134 46 -219 64 -2 220 -48 -83 180 44
2205 44 161 -56 154 18 -136 21 -44 -8 71 -178 33 -378 114 -9 126 -86 -182 -74 -106 25 -59 -46 -56
2228 -56 -137 4 -49 199 -66 -138 34 -92 280 -70 24 -100 63 8 108 55 -65 54 44 -149 -190 -8 -154
2251 -154 -276 247 166 -46 -138 126 -84 80 183 67 443 32 -70 21 -14 3 260 -96 -24 13 118 51 -230
2274b30M30Q3k30J66p0j40J28l02K28%j42L9K77k05j70J74P7J67k63k19N2k32
2296c82L63K6l0K9j07K18j15l9K22m98L91N0j39J9J91k07k4j67J90j23L30k49
2318e1j39J60m6m9K49p5j62K4j6K10l26M46n62K70Q9J7J59Kk35K26r9n2j12j01
2342a73J86K8j63K79j95j22Q9J53j38J35j11k07K11k13L16q6j05m7mK44p9r2J88
2365I4J2j30J5J43j02J39m8k49K3Q9Q6k10L04k43J65j17P1rq2k34L9M06k43j06
2389a87K74k11J73p1J11k3lK9j66J32j19L64k40J31kj59K1r9j02j66K20J41j63
2412a15o2J4J18l4K40j77k62M81k23q8J02K0J48K00k40j82J26j06K51j87j45J92
2434G1o5n6r2N09m39K30k69K07j90o2J19K29j46K2N1r9k55K00J86m7l9p0O4j33
$$ plain form
2274 -230 200 283 53 219 149 9 137 -165 63 63 -79 -40 237 32 -138 36 113 280 17 -202 -150 -382
2296 -382 -19 7 -23 6 -101 117 2 -37 185 -313 78 128 -11 8 199 -8 -32 -199 -9 -132 198 -51
2318 -51 -190 -30 -76 -125 124 49 -113 -89 -105 105 -221 225 -337 -67 22 39 198 200 -35 191 92 40 -72 -173
2342 -173 13 41 -122 157 -38 -160 -71 82 -56 79 -32 -239 -28 -241 75 -11 -116 -163 -167 77 -2 -94 94
2365 94 106 -24 -9 134 32 171 123 -126 -103 -14 72 -138 166 -77 88 -29 42 33 -49 -283 -244 162 -81 -187
2389 -187 87 -124 49 -22 89 66 63 92 -74 58 -61 303 63 194 192 33 54 -45 -147 -313 -93 48 -115
2412 -115 -177 -163 -45 -79 161 -16 -278 203 -20 -108 -6 14 162 362 122 -60 66 -40 211 24 -121 71
2434 71 6 -50 -142 367 -72 158 -111 96 -94 -156 -37 192 46 68 119 20 -235 -35 151 104 65 -5 59 -74
2458g4K87k93jJ26l2J03r8k6J63m9lj63j79K83j61p5M0J79j66%l4J51J84j89R2
2483F5j38r9K14m5n9o9J52n8l9R5j21K06m8j42j4K6Q6J03j22o3Pl7k03Q7M87m09
2509a38l3J61n5K7n0K1J6K05l31j5J53k69J83L04j14J4k44L42q3p5%J35j13j46
2533a05R7J00j79J04l1k65L43O3P9j75K8J08j30j59K4N6J33j93K4Pn1n6K21P4
2557A17o0k98J66R7Q2o5j7J89o9k85K90l15K04l5p7nK9J62K69k85k23L11j85j64
2581a67K21p3j34L1J62j36ml1j4J52O7p5P6o1K10k35K8o2R8P3j70L81n99M01p3
2606F6M9o0j75J58j25n1k4K24j76K27j86N03n84J69J56j82K8o7J63r8J08j53l9
2629f9k4K1J63j51k8N1m2J76j27j34L11j03k15K80k82J13J33O3j71j15Q0N2J04
$$ plain form
2458 -74 213 -80 -81 45 13 116 18 -8 155 106 103 -60 -239 44 -117 -192 -152 27 -139 -139 -173 -22 162 -27 65
2483 65 -73 -172 42 -3 -62 -131 21 -37 -76 19 -102 104 56 -86 -100 -74 12 115 -7 -70 -63 -100 -303 -216 271 -138
2509 -138 -171 -10 -65 -38 -88 -67 -51 154 -177 -192 -39 -308 -125 179 65 79 -165 177 94 19 19 154 41 -105
2533 -105 -8 92 -87 17 -14 -279 64 127 206 31 59 167 37 -122 -98 -42 91 -102 -78 -71 -122 -178 43 117
2557 117 57 -241 -75 22 104 39 22 211 142 -143 147 -168 36 1 -76 -81 -52 110 379 94 -129 182 -3 -167
2581 -167 54 -19 -153 -122 40 -96 -100 -131 -145 7 74 -1 75 14 224 -11 17 -45 53 126 -44 337 -262 139 66
2606 66 115 55 -120 38 -87 -138 -162 62 -114 113 -73 430 -154 15 171 -11 17 -50 113 15 123 -30 -69
2629 -69 -93 -72 91 -60 -88 -37 -79 97 -30 -164 147 44 -171 109 -173 -60 73 136 -35 -150 -70 -18 86
2652H6j91J75j42J4M42m93Q7L9m7N5j57R3J65j8k55J29j64J83J66K6k21J08K2
2675A02k2j86j9NJ81K1J30m02K59k47M18j00k07J35J94ml77L98k67L77m31M1l
2698dj82J76Q2m25K90J46l15P6K18R2j86J36ml84K80rr6J60j69J34N3k23Q5M9
2722b0j20J10p1j18K60j68M10l80P7k84K31K84k22j5Q4r5J56R9k34j00N7N6O3
2745F0q7j13J15k9j32K34N4j57K0J37n5n8q5l26K90J97L4J57l0nl08K88j24m0
2769C7nj92K77l21K01k1j3P6n8j8j84L16j86j70OK98K59j5l21L0K56j1j73j13
2793d5p7o9j3J98J76p0q0M5n9q3Q7k55J40j67j07M98n5l46L22l29N00q9N9l66
2817a85K6j1n4J59J23n1mk2l8P1J06m6r7k0l1J26N1j0l5j19k8R3k30K77J49k32
$$ plain form
2652 86 -105 70 -72 -58 384 -109 -22 17 -30 25 -132 -39 126 108 -147 -18 -182 1 167 193 -28 80 102
2675 102 80 -106 -125 -120 61 82 212 -190 69 -178 240 140 -67 68 262 258 -119 279 12 389 -42 -1 -4
2698 -4 -186 -10 72 -353 -63 83 -232 -156 62 154 -32 104 100 -284 -4 -13 -109 51 -118 16 69 -154 -69 -20
2722 -20 -140 -30 -101 -219 41 -127 283 -97 -20 -304 -73 211 -11 -26 58 -37 119 218 -16 -116 -59 -3 60
2745 60 -27 -140 -25 -54 -186 48 102 -55 -35 102 47 -11 -96 -422 -132 65 99 256 226 221 -87 201 77 37
2769 37 32 -160 117 -204 -3 -24 -37 39 -19 -37 -221 95 -91 -261 -255 43 302 287 -34 -4 252 241 68 -45
2793 -45 -122 -191 -204 -6 170 100 20 65 6 -77 10 -245 -105 -272 -379 119 64 -282 40 -289 211 122 181 -185
2817 -185 -159 -170 -224 -65 58 7 3 -19 -57 14 120 74 -23 -43 -74 52 103 93 58 -61 -89 4 -226 51 200 -32
2843c2r9J24k2K21l31l0l3J72J63k33K65k7L6l4l33K36m6p5L61k78k95M11j72
2866e1K07k54K48q7R5k96N0N3O1K1o8O4l73M28l83N20k79K69l6j85M0K16m25O9
2890i6l6P9Q3j69J2P3Q7K8l81K74N6k69J11L28l21Q2K23k8k79J54j05O5R5j32
2914f6jK74k63R2j53P5Q6J7J17k14K01j84J6jr0K4N8j16Q8J0j76M07l79K17j54
2939a15L31m61J23K00J15j30j05m8l2K67j44j51l1K35l6K18k10M1n9J05k77J61
2961cJ52j98J38k82J56k14J25Q2J52j06J95j60M7K51l15R8j99M4J23N0p0p5RJ02
2985A02J12j92j15M7k7l8N9J23l3j75K76k67K20j75Q3R2j68J85j91o2K31j4j81
3008a08NK8p0J59J52k80J99q3j15K16J18l53K19l7Q9M5k93OJ16j22j40M45k31
$$ plain form
2843 -32 -131 -7 -29 192 -139 -169 -202 -30 133 -100 165 138 174 140 -193 43 -3 -78 283 5 -290 121 -51
2866 -51 156 -98 150 63 158 -138 -88 -35 26 47 -21 43 -330 98 -285 235 -44 225 189 4 44 260 -165 -96
2890 -96 -132 -53 30 -139 -127 -54 33 61 -320 -46 10 -259 -148 180 -141 -59 164 136 -143 11 -94 -29 66 -66
2914 -66 -67 207 -56 36 -117 -42 44 61 178 -36 165 -19 -3 -4 -94 -70 -12 -128 -40 -30 -206 201 -178 39 -115
2939 -115 216 -245 -122 78 193 63 -42 -90 -122 145 1 -150 -181 54 18 236 26 67 8 113 -164 -3
2961 -3 149 -49 89 -193 -37 -251 -126 -44 108 2 197 37 84 335 20 118 -81 -37 86 136 66 -9 0 102
2985 102 214 22 -93 -46 -73 -111 -52 71 38 -137 139 -128 92 -83 0 92 -76 109 -82 -144 87 73 -108
3008 -108 -103 -75 -145 14 166 -114 85 2 -113 103 221 -132 87 50 139 184 -109 -103 13 -109 -249 196 -35
3031c5K79k72m3P4o7j2L20n8k28J18j63l6r4J70mJ34P2n9r6K00l06J99jJ65l91
3056a34J29L0Q6k13P5n5r5J66lJ50r4N6%n8M7l0M7l18L86lk68J79o6j09J81j3
3082G3M3q7j12J67M7j06j00RQ3K18m52J33%J24K29j61o6nk11K90N0l20J90l2p1
3107f7P7J32l30N10k33k24J99M2j19J37q2j32M8J01l21K42J88kk97K68j22J3j
3130B7L7M6k4q1k4K10N0j48r1j70K58j03j33K1j66M12j63J18j38ln5J52J32k09
3154d5R8j43J86l7lK4q2j11K5K10q3K1n0J11n6m0P3k17K96j70J19k84J87N6j75
3179i0J34j28J05j41K02o4K7K6k5m4J13j22j03K34k69PL2N4J55k28O3J41o4K2
3203C7QJ58j78j75M05J20j31l33J55j05J56mj02J28n9pR3j99K27j25l10L81j10
$$ plain form
3031 -35 244 -28 -71 3 -64 -76 244 186 -42 76 -87 -123 -217 -47 -51 83 155 96 0 200 -106 93 92 257 -134
3056 -134 -5 25 111 -102 -27 -82 -177 -11 -14 136 42 98 98 40 87 57 104 -214 172 169 -99 80 14 -95 86 73
3082 73 116 29 -83 84 131 25 -75 -66 17 235 -217 -84 -84 40 269 108 42 37 -174 116 166 -154 36 4 -67
3107 -67 10 142 -188 322 89 -135 64 106 -13 124 42 -90 -42 59 -262 -20 168 166 -131 137 15 28 27
3130 27 64 110 86 5 -19 191 241 93 2 -168 90 -13 -146 -125 -291 121 -42 76 -62 -65 -120 32 164 -45
3154 -45 53 -90 96 59 56 80 -2 -113 -88 122 39 60 10 121 65 25 98 -119 177 7 126 -158 29 85 -90
3179 -90 44 -84 21 -120 82 18 45 71 46 2 115 -7 -110 124 -145 -138 -106 -52 103 -125 -62 79 15 37
3203 37 45 203 25 -150 255 375 244 -89 66 -39 117 113 11 139 80 73 166 -33 194 69 -241 140 30
3226C0N3n1qo6Q3m8J59N1j90K29k85J29q3N7l24M38l0j97J3j9j11K69k45J9K89
3251A62Rm11K53o2L23k88R9nk10J62k7J26j36o0K10k41L08k82L3K06k78K02j51
3274e8K19k80N39n67P1q4R1j3K00j60k40L72Rj58n0o7J04K14k27m7J30j44J70
3297B4J35j18J6Q2j74p2K67j11l75M08k7j33j0L58m10j83L41M8k07J85J4J6kk05
3321a33R3J11M1K4j46j17K04N4m03L72J54j35k9k04K27M6j68J6j81K38K55l90
3343g1K6j48L0N91k69n60N29N4k63L5j54K67k02P7j09K88Rj14l5j48M3m7J89K4
3367D2R6m19L04q3m2P6m2K2Q0p4R1j19K24k59j1K06o9n8K19j30QK8j85K66k02
3392c1J2j17J16j2j22M47n09K65j6m1J16J19l95J62P7j76n1R1J04j92J24J78O2
$$ plain form
3226 30 83 32 24 -42 41 -7 152 203 13 242 -43 86 3 60 -264 174 144 -53 -40 -59 -170 99 -146 -127 162
3251 162 171 -240 13 -49 274 -14 85 80 -130 32 5 131 -5 -65 145 -96 212 -70 -37 169 -109 93 -58
3274 -58 161 -119 420 -147 -76 -160 -69 -82 118 -42 -282 90 99 -59 -109 -176 -72 142 -85 -132 -2 -146 24
3297 24 159 41 57 139 -35 -107 160 49 -326 82 55 -78 -88 270 -140 -323 18 66 -141 44 58 74 72 -133
3321 -133 -40 71 112 136 -10 -127 77 131 -272 100 254 119 90 -114 113 159 -9 7 -174 64 319 -71
3343 -71 -45 -193 -163 428 159 -401 128 182 -81 -46 -200 67 -135 -58 -167 121 130 16 -19 -167 -124 -171 18 42
3367 42 138 -281 23 -60 -102 -26 -68 -46 34 -40 51 -68 156 -103 -114 92 23 -35 184 54 62 90 -95 171 -31
3392 -31 -19 -136 -20 -32 -154 293 -216 49 33 -8 108 227 -168 -6 71 -105 -156 -65 39 -153 -29 149 211
3415B11j61o2j4K20n17L71J10l82J71q1K14l6k7J87l45LK30j24n2J38Po6K24q2
3439A37l46J76K16q7r5K49l63J24O2l00J79J25j71J95j28k28L91k11J04l5k61
3460b67J33k7J27L9J88l0jj74j08J56L73l03j96J6P4m07L65n2k43M70j86K39m23
3483b37K14K5J20q8J26r9j03Rj9K62n7j07Q3M2k79J61j71L29j88K50k58J9m9p9
3507i4j43J98j01L78q2j47K24k33p5l7L8K20r0m3K4Q2J9j11J9l3k03r3M45l02
3531a40J34O0j68J8rL4pJ23pm1J59k05l2qJ35J10k79L34j10J16p1j63J4r4k9R3
3557c3J27m7L1k88N00l40N3P3j21Q5j60J66l3jk11L38k47q6K29l1O9o8j79R9J96
3582A21l73L29k23M3J37j0k9J54q3L35n7m06op3K51o1R8l6pl42K98m3k78L70j65
$$ plain form
3415 211 50 -12 -26 194 -323 48 158 -224 -53 -134 80 44 17 204 -141 -138 92 -32 -84 54 61 -5 219 137
3439 137 -209 -33 183 96 1 250 -113 11 73 -227 -48 77 -94 101 -27 -255 136 -75 29 -6 -267
3460 -267 -134 -161 -34 5 193 163 162 -12 -120 36 409 106 -90 -74 0 -407 -42 -94 -337 133 -53 186 -237
3483 -237 -23 2 122 34 160 61 -42 -33 -52 210 153 46 129 171 -108 53 -118 211 23 273 15 34 -15 -94
3507 -94 -237 -39 -140 238 156 9 233 0 -75 -112 -74 146 56 13 37 119 138 27 46 13 -190 -283 162 -140
3531 -140 -6 54 -114 -96 -105 -71 -78 45 38 -3 156 -49 -81 -89 46 156 -123 211 101 217 146 -17 -3 -97 -126 -33
3557 -33 94 47 78 -210 290 -50 3 76 -45 40 -120 46 13 12 -199 139 -108 -194 35 4 73 5 -174 -75 121
3582 121 -252 77 -146 -103 34 24 -5 149 66 401 344 -62 -68 -141 110 49 147 111 104 -238 60 17 -261 109 -56
3607e6n8K64m1k06N9J31j49J73N6l37j13K37K4l3j41K70j46J34K23k65n9lJ07
3630G1o7k31Q5J09Q8K10m36P9M2k20P7O4nl2K10m6l04M81r6J9K0j78J02M8j89
3655i9L85l62qJ05j63o2J07K11k07J82k50M38l76Q3Rj71K75l7J13j56r1M11o10
3678b73L89R1j39j33K08k51l1J80m5K7k79J17J75N7j79Q8j25J23O6J07m03lJ82
3701e1M9KK0j71J77Ml47J73L3q4L36M8j61k13L77j62k97L92k05L1p6p0M01l67
3725a61K67m3J92j74j97P2K55J4k31R3j59rm3K23k84J69N7M0k32L01k10P7P5N9
3749A51j85j25J7M83m56J89j06J34k58K44k05J26k55K84K2l3j52K81k32L6n1K11
3771A20n5k79k01K55K28l8J12k5j58j5Mq4J26K24M5j24j42k45J01P6K63l1k89
$$ plain form
3607 -56 -114 150 109 -97 -38 93 -56 117 173 -164 -277 -40 -16 -49 -190 80 -66 68 291 26 -33 -36 71
3630 71 4 -227 -142 -33 55 265 -171 -92 -50 -270 -193 -129 -134 -166 44 -2 -306 175 79 98 118 -60 42 90 -99
3655 -99 286 -76 -84 21 -142 -204 -97 114 -93 89 -161 277 -99 -16 -7 -178 97 60 173 17 -74 337 -273
3678 -273 116 207 68 -65 143 -108 -139 41 -4 23 -256 -139 36 93 -86 2 -123 0 66 173 -230 -233 -51
3701 -51 -2 0 20 -151 26 30 -317 -144 -111 -195 141 189 28 -185 192 30 -267 125 -80 -49 -125 -195 206 -161
3725 -161 106 63 255 81 -116 -44 211 225 -6 87 -72 -81 -124 99 -185 -16 41 81 -151 150 -60 17 92 151
3749 151 -34 -159 -142 341 -115 74 -32 102 -156 88 -117 9 -246 38 60 27 -125 156 -76 -40 -91 120
3771 120 65 -214 -415 -160 68 30 142 117 -41 -56 -52 -136 -10 214 259 135 -7 -252 -151 -75 188 157 -132
3794a32j64L74p8j22J62J73k04R6J11l32Q9R2m6p7k05M60J2k17Q3j65m5L9J05
3817Ij67O2k44K06M93j98j55m9J51j03P5l21o0K32LK05m55M39q9J7O8k6N2k29
3841h4N2M3N9j47L88l08J03k10L47j80m14L95J30j48j74K30j72m3K07n3k0J3k20
3864b06K51n7Mj17N1j04N9K93k7j91J18k42K53k75J50j07N9O8J91j21l25K25k01
3887b51M47j88J90k03M9k16N8J33j76j5%J98M7J03j43K12k32R2J21k19J86j93
3909@K09k21K78j09k36J25J25j93O5K00r6l39j09M76k39P7k63J12L2J92l38K67
3931A5j95L59k33j55R4k33K82J18k8O6J41m24K52Lj24j15L66j68k15K19pj71k8
3954a81O4R3n7J62L1k23l9K10j84L9J24j51K14J60k29j75J91m7p2J14J93m8l52
$$ plain form
3794 -132 -296 78 0 -122 40 213 9 105 216 -116 -27 65 19 -58 -263 197 209 -8 75 -90 -135 -96 9
3817 9 -158 -96 -340 -134 359 161 6 -43 108 5 80 -241 -301 -69 -66 139 -316 123 34 51 119 93 145 -84
3841 -84 -32 11 70 -77 311 3 106 -104 243 63 -351 44 174 26 -148 82 -90 -133 74 21 1 14 -206
3864 -206 45 -12 -8 -125 -74 -178 -119 174 147 -44 74 -168 85 -190 -40 -147 -88 -20 171 50 -275 -50 -251
3887 -251 196 8 198 -5 44 -172 -114 19 -157 -172 -172 26 73 176 33 245 13 105 226 7 193 0
3909 0 209 -12 266 157 -79 46 171 -22 43 243 147 -192 -301 175 -64 13 -250 -138 -106 86 -252 15
3931 15 -180 179 -54 -209 -115 -348 -66 52 24 90 231 -193 59 62 -62 -177 189 21 -194 25 18 -153 -181
3954 -181 -117 -24 -81 81 112 -111 -150 60 -124 -85 39 -112 102 262 33 -142 49 2 -70 44 237 189 -163
3977a63K26o2j31j4o0J0J63J44l85K13J69k34L2J54o4j53J23m4P8N6J92m12K12
4000E0J26j75L0j18j04J0J05N9j0j94R3L4R0L88l95M4J9p3j42j01K34k82M01P3
4024A62K6l89L24k26J39J17j61J27m01M51j30k77K71j23j4J02MJ15j21J43J6q9
4046F6K5j25J82k63K37k4l13J24R1j20L7R6O2J0K5l10J64J49L0j02m8O4l24J52
4070a15K21k27K13l28K40k09K08k7R0l6j55k1J29O4j54J77l3q0K68m00J10P9J69
4093A83k92j10J42K29p9k2q7j01K33k62K76J25k12r5J43k54L44m7j26j11L24k62
4115f1K28j72k8K43j90k80L87J12k0l00M7Om3J07k41oL44q8k59J72J24o1o0m7
4139h6L1j6Q4LM0k06J32J25K0l5P7r2r7q3J92o2j67r3J04J24J96J4m33K23j30
$$ plain form
3977 -163 63 1 -130 -144 -204 -194 -31 113 -272 -59 110 -124 -92 62 -2 -155 -32 -76 2 58 250 -162 50
4000 50 176 1 31 -87 -191 -181 -76 -17 -27 -221 -128 -94 -4 384 -11 33 52 -21 -163 -264 -30 -312 89 162
4024 162 188 -201 123 -103 36 153 -8 119 -282 169 39 -238 33 -90 -104 -2 2 117 -4 139 155 66
4046 66 91 -34 148 -115 122 98 -215 -91 0 -120 -83 13 75 85 110 -200 -36 113 143 41 -7 57 -267 -115
4070 -115 106 -121 92 -236 4 -205 3 -24 66 30 -125 -146 -17 47 -107 70 37 -43 225 -175 -65 14 183
4093 183 -109 -219 -77 152 73 51 -36 -137 96 -166 110 235 23 -72 71 -183 161 114 -12 -123 201 -61
4115 -61 167 -5 -33 210 20 -260 127 239 219 -81 -34 -28 -71 36 -205 -211 133 45 -214 -42 82 21 -39 -86
4139 -86 -55 -71 13 16 56 -150 -18 107 127 92 169 77 -20 -103 89 27 -140 -233 -129 -5 191 205 -228 -5 -135
4164a35J02J9j88J76N4p8J87k85K83m6M8k61K11k09K25m6P6m1l6P8j33o6KJp8
4189a40K56n9J77k90J25k7J16j43l6O1n6K22k38J59j99k25K38J45l79P8P5M01
4211B61k65j8j11J86j4k70L84k38J29p3j47N3K14q8J62j10J68J84j69j77p2k35
4233b46K24M1O1L1l6j00J29r4q0L77k79p8J17o2J5J21l62P8k8K17kr6J78j01l7
$$ plain form
4164 -135 -33 -14 -202 -26 28 -50 137 -148 135 89 137 -124 87 -122 103 57 133 92 56 134 1 -65 -63 -62 -140
4189 -140 116 57 234 -56 69 42 158 15 -21 40 -16 206 -32 127 -72 -297 -59 86 -293 -215 -140 261
4211 261 -4 -22 -133 53 39 -231 153 -85 44 -29 -176 -123 91 3 165 55 223 407 238 61 -11 -246
4233 -246 -22 19 80 111 75 -25 104 10 -70 307 28 -50 67 5 20 141 -221 -143 -171 46 44 -52 126 25 -12
$$ [...]
8191b2
##END NTUPLES=NMR FID
##END=
