##TITLE=1H_Pr POX-1
 200.13Hz,CDCl3.
 8 sc
 3.6.2026
##JCAMPDX= 6.0         $$ Bruker NMR JCAMP-DX V2.0
##DATA TYPE= NMR FID
##DATA CLASS= NTUPLES
##ORIGIN= UXNMR, Bruker Analytische Messtechnik GmbH
##OWNER= pz
$$ XWIN-NMR		Version 3.5
$$ Wed Jun  3 16:06:07 2026 Russian Standard Time (UT+4h)  she@DPX200
##.OBSERVE FREQUENCY= 200.131
##.OBSERVE NUCLEUS= ^1H
##.DELAY= (6, 6)
##.ACQUISITION MODE= SIMULTANEOUS
##.ACQUISITION SCHEME= undefined
##.AVERAGES= 8
##.DIGITISER RES= 18
##SPECTROMETER/DATA SYSTEM= spect
##.PULSE SEQUENCE= zg30
##.SOLVENT NAME= CDCl3
##.SHIFT REFERENCE= (INTERNAL, CDCl3, 0, 14.3821)
##AUDIT TRAIL= $$ (NUMBER, WHEN, WHO, WHERE, WHAT)
$$ ##TITLE= Audit trail, XWIN-NMR		Version 3.5
$$ ##JCAMPDX= 5.01
$$ ##ORIGIN= Bruker BioSpin GmbH
$$ ##OWNER= she
$$ F:/spectra/data/she/nmr/H-C/1/audita.txt
$$ ##AUDIT TRAIL=  $$ (NUMBER, WHEN, WHO, WHERE, WHAT)
(   1,<2026-06-03 16:04:28.26 +0400>,<she>,<DPX200>,
      <created by zg, POWCHK disabled, PULCHK disabled
       configuration hash MD5:
       00 E9 B6 7A A2 85 ED C7 34 08 36 98 17 FE 4E 26
       data hash MD5: 16K
       F4 C5 28 C1 D4 AA EA 91 B0 AB E0 6E 0E BD 94 EF>)
$$ ##END=
$$ 
$$ hash MD5
$$ 74 EB 41 88 4E B7 E6 84 EE 77 E2 3E 78 7B 94 E0
##$RELAX= 
##$RELAX= 
##$RELAX= 
##$RELAX= 
##$RELAX= 
##$RELAX= 
$$ Bruker specific parameters
$$ --------------------------
##$DU= <F:/spectra>
##$EXPNO= 1
##$NAME= <H-C>
##$PROCNO= 1
##$TYPE= <nmr>
##$USER= <she>
##$AMP= (0..31)
100 100 100 100 100 100 100 100 100 100 100 100 100 100 100 100 100 100 
100 100 100 100 100 100 100 100 100 100 100 100 100 100 
##$AQSEQ= 0
##$AQ_mod= 1
##$AUNM= <au_zg>
##$AUTOPOS= <>
##$BF1= 200.13
##$BF2= 200.13
##$BF3= 200.13
##$BF4= 200.13
##$BF5= 200.13
##$BF6= 200.13
##$BF7= 200.13
##$BF8= 200.13
##$BYTORDA= 1
##$CFDGTYP= 0
##$CFRGTYP= 5
##$CHEMSTR= <none>
##$CNST= (0..31)
1 1 145 1 1 1 1 1 1 1 1 1 1 1 1 1 1 1 1 1 1 1 1 1 1 1 1 1 1 1 1 1 
##$CPDPRG= <>
##$CPDPRG1= <>
##$CPDPRG2= <>
##$CPDPRG3= <>
##$CPDPRG4= <mlev>
##$CPDPRG5= <mlev>
##$CPDPRG6= <mlev>
##$CPDPRG7= <mlev>
##$CPDPRG8= <mlev>
##$CPDPRGB= <>
##$CPDPRGT= <>
##$D= (0..31)
0 0.7 0 0 0 0 0 0 0 0 0 0.03 0 0 0 0 0 0 0 0 0 0 0 0 0 0 0 0 0 0 0 0 
##$DATE= 1780488267
##$DBL= (0..7)
120 120 120 120 120 120 120 120 
##$DBP= (0..7)
150 150 150 150 150 150 150 150 
##$DBP07= 0
##$DBPNAM0= <>
##$DBPNAM1= <>
##$DBPNAM2= <>
##$DBPNAM3= <>
##$DBPNAM4= <>
##$DBPNAM5= <>
##$DBPNAM6= <>
##$DBPNAM7= <>
##$DBPOAL= (0..7)
0.5 0.5 0.5 0.5 0.5 0.5 0.5 0.5 
##$DBPOFFS= (0..7)
0 0 0 0 0 0 0 0 
##$DE= 6
##$DECBNUC= <off>
##$DECIM= 32
##$DECNUC= <off>
##$DECSTAT= 4
##$DIGMOD= 1
##$DIGTYP= 9
##$DL= (0..7)
0 120 120 120 120 120 120 120 
##$DP= (0..7)
150 150 150 150 150 150 150 150 
##$DP07= 0
##$DPNAME0= <>
##$DPNAME1= <>
##$DPNAME2= <>
##$DPNAME3= <>
##$DPNAME4= <>
##$DPNAME5= <>
##$DPNAME6= <>
##$DPNAME7= <>
##$DPOAL= (0..7)
0.5 0.5 0.5 0.5 0.5 0.5 0.5 0.5 
##$DPOFFS= (0..7)
0 0 0 0 0 0 0 0 
##$DQDMODE= 0
##$DR= 18
##$DS= 0
##$DSLIST= <SSSSSSSSSSSSSSS>
##$DSPFIRM= 0
$$ [...]
##$SUBNAM0= <"">
##$SUBNAM1= <"">
##$SUBNAM2= <"">
##$SUBNAM3= <"">
##$SUBNAM4= <"">
##$SUBNAM5= <"">
##$SUBNAM6= <"">
##$SUBNAM7= <"">
##$SUBNAM8= <"">
##$SUBNAM9= <"">
##$SW= 18.0517599122864
##$SWIBOX= (0..15)
0 0 2 0 0 0 0 0 0 0 0 0 0 0 0 0 
##$SW_h= 3612.71676300578
##$TD= 16384
##$TD0= 1
##$TE= 0
##$TE2= 300
##$TE3= 300
##$TEG= 300
##$TL= (0..7)
0 120 120 120 120 120 120 120 
##$TP= (0..7)
150 150 150 150 150 150 150 150 
##$TP07= 0
##$TPNAME0= <>
##$TPNAME1= <>
##$TPNAME2= <>
##$TPNAME3= <>
##$TPNAME4= <>
##$TPNAME5= <>
##$TPNAME6= <>
##$TPNAME7= <>
##$TPOAL= (0..7)
0.5 0.5 0.5 0.5 0.5 0.5 0.5 0.5 
##$TPOFFS= (0..7)
0 0 0 0 0 0 0 0 
##$TUNHIN= 0
##$TUNHOUT= 0
##$TUNXOUT= 0
##$USERA1= <user>
##$USERA2= <user>
##$USERA3= <user>
##$USERA4= <user>
##$USERA5= <user>
##$V9= 5
##$VALIST= <valist>
##$VCLIST= <CCCCCCCCCCCCCCC>
##$VD= 0
##$VDLIST= <DDDDDDDDDDDDDDD>
##$VPLIST= <PPPPPPPPPPPPPPP>
##$VTLIST= <TTTTTTTTTTTTTTT>
##$WBST= 1024
##$WBSW= 4
##$XGAIN= (0..3)
0 0 0 0 
##$XL= 0
##$YL= 0
##$YMAX_a= 1027190
##$YMIN_a= -740829
##$ZGOPTNS= <>
##$ZL1= 120
##$ZL2= 120
##$ZL3= 120
##$ZL4= 120
##$ABSF1= 10
##$ABSF2= 0
##$ABSG= 5
##$ABSL= 3
##$ALPHA= 0
##$AQORDER= 0
##$ASSFAC= 0
##$ASSFACI= 0
##$ASSFACX= 0
##$ASSWID= 0
##$AUNMP= <proc_1d>
##$AZFE= 0.1
##$AZFW= 0.1
##$BCFW= 1
##$BC_mod= 2
##$BYTORDP= 1
##$COROFFS= 0
##$CY= -3
##$DATMOD= 1
##$DC= 2
##$DFILT= <>
##$DTYPP= 0
##$F1P= 0
##$F2P= 0
##$FCOR= 0.5
##$FTSIZE= 0
##$FT_mod= 4
##$GAMMA= 1
##$GB= 0.15
##$INTBC= 1
##$INTSCL= 1
##$ISEN= 128
##$LB= 0.25
##$LEV0= 0
##$LPBIN= 0
##$MAXI= 10000
##$MC2= 0
##$MEAN= 0
##$ME_mod= 0
##$MI= 1.114404
##$NCOEF= 0
##$NC_proc= 0
##$NLEV= 6
##$NOISF1= 3.799351
##$NOISF2= 2.8
##$NSP= 1
##$NTH_PI= 0
##$NZP= 0
##$OFFSET= 14.38212
##$PC= 1
##$PHC0= -4217.633
##$PHC1= 9.39229
##$PH_mod= 1
##$PKNL= yes
##$PPARMOD= 0
##$PSCAL= 0
##$PSIGN= 0
##$REVERSE= no
##$SF= 200.129724274929
##$SI= 16384
##$SIGF1= 3
##$SIGF2= 2
##$SINO= 400
##$SIOLD= 16384
##$SREGLST= <1H.CDCl3>
##$SSB= 0
##$STSI= 0
##$STSR= 0
##$SW_p= 3205.1282051282
##$SYMM= 0
##$S_DEV= 0
##$TDeff= 0
##$TDoff= 0
##$TI= <>
##$TILT= no
##$TM1= 0
##$TM2= 0
##$TOPLEV= 0
##$USERP1= <user>
##$USERP2= <user>
##$USERP3= <user>
##$USERP4= <user>
##$USERP5= <user>
##$WDW= 1
##$XDIM= 8192
##$YMAX_p= 0
##$YMIN_p= 0
$$ End of Bruker specific parameters
$$ ---------------------------------
##NTUPLES= NMR FID
##VAR_NAME=  TIME,          FID/REAL,        FID/IMAG
##SYMBOL=    X,             R,               I
##VAR_TYPE=  INDEPENDENT,   DEPENDENT,       DEPENDENT
##VAR_FORM=  AFFN,          ASDF,            ASDF
##VAR_DIM=   8192,          8192,            8192
##UNITS=     SECONDS,       ARBITRARY UNITS, ARBITRARY UNITS
##FACTOR=    0.0002768,     1,               1
##FIRST=     0,             0,               0
##LAST=      2.2672688,     0,               0
##MIN=       0,             -740829,         0
##MAX=       2.2672688,     1027190,         0
$$ Real data points
##PAGE= N=1
##DATA TABLE= (X++(R..R)), XYDATA
0 0 0 0 0 0 0 0 0 -4 0 0 8 -4 8 -8 8 -16 16 -20 24 -28 36 -44 50 -61 73 -82 100 -116 129 -150 174 -197 225
33 225 -253 288 -323 365 -408 457 -511 571 -633 705 -779 863 -953 1053 -1161 1279 -1412
50 -1412 1554 -1712 1887 -2079 2295 -2538 2814 -3125 3489 -3914 4417 -5024 5779 -6740 8014
65 8014 -9792 12446 -16848 25595 -75298 574307 1027190 376603 -401368 -580670 -75848
76 -75848 345429 292348 -34006 -110193 42348 59473 -245814 -460832 -199582 375473 617027
87 617027 221133 -423557 -601125 -117879 504402 585355 85787 -417409 -412085 -27986 236725
98 236725 127840 -109039 -132294 59246 149613 -19261 -214650 -120121 194088 344183 122865
109 122865 -222660 -305396 -55929 213912 198169 -56699 -232448 -138718 78922 153287 33128
120 33128 -97709 -71105 78516 172549 92756 -88327 -179496 -84499 83312 137752 33104
131 33104 -102238 -124443 -29635 61975 53761 -8982 -8584 66794 94561 -1262 -122905 -115191
143 -115191 29727 155974 114828 -67219 -204824 -146771 52969 190218 136091 -33926
153 -33926 -141258 -93315 41788 116739 64098 -34826 -56276 417 23649 -35118 -81702 -20632
165 -20632 94089 110794 -20387 -156290 -114340 86485 215334 107004 -118991 -198919 -53662
176 -53662 131015 145489 -3064 -129197 -98132 25606 81248 19697 -47952 -19453 55839
187 55839 62718 -16216 -78748 -38376 64315 98530 279 -127613 -122591 28527 153968 104747
199 104747 -60238 -151069 -68997 84875 135762 38339 -79194 -82411 1078 45988 10779
210 10779 -23619 3045 42236 17456 -55868 -84839 -13131 93844 111486 8013 -106047
221 -106047 -106151 511 97019 93842 7331 -74529 -80045 -16717 43824 47586 13369 -10708 -14195
234 -14195 -17175 -19843 -6683 26875 53656 34946 -31087 -82731 -53064 36422 88114 45788
246 45788 -37769 -74714 -38124 25279 54705 32272 -8390 -26900 -20498 -9713 1162 18163
258 18163 26203 8634 -20748 -33138 -18259 11670 36256 32219 -2631 -37132 -35602 -1060 31493
271 31493 35328 7666 -27139 -34278 -6657 22204 21909 3030 -8188 -8724 -7994 -4589 4868 12611
285 12611 9803 -2561 -15902 -15710 4219 23873 16761 -11183 -25730 -13237 8805 20845 16526
298 16526 -2363 -22215 -22341 -1394 19329 23697 12072 -9114 -26230 -23549 -761 21690 27133
311 27133 15472 -8233 -32395 -33048 -1808 33750 37715 10127 -21927 -34577 -20215 9088 27273
324 27273 21715 4078 -10174 -19380 -20062 -3607 19284 25576 8474 -13476 -22624 -14458 6264
337 6264 21834 15232 -4575 -14797 -8898 1711 7171 8342 3382 -5788 -7592 -3406 -199 648
351 648 6542 8828 667 -9635 -9552 -3 7711 10681 5583 -6752 -12490 -4424 5019 5608 2024 1843
367 1843 1102 -2606 -4126 -3081 -1094 5076 9792 4967 -8743 -13785 -3713 9113 10359 4706 -4417
382 -4417 -9506 -5154 2375 3586 321 1007 3173 -2249 -7528 -3442 6202 9898 3488 -5305 -10334
397 -10334 -6260 6434 12384 4539 -7845 -10231 -7054 1385 10952 14596 2596 -12508 -15116 -5463
411 -5463 5279 12130 11942 1785 -11556 -15906 -8031 5367 17164 17737 422 -20273 -21127 -1108
425 -1108 16612 17770 6512 -7541 -16861 -13297 1451 13916 14675 5229 -9227 -18773 -10876 9302
439 9302 20200 10523 -6027 -14010 -12524 -3057 11455 18451 8214 -10569 -20108 -13328 5842 22822
453 22822 19829 -2393 -21227 -19148 -3867 11095 19147 16100 -1690 -22590 -24010 -3226 20548
466 20548 26375 9367 -15688 -26899 -13582 8968 19463 15107 3754 -10709 -21839 -14620 10028
479 10028 27220 17906 -7625 -25908 -21807 1179 22377 22060 2761 -15786 -20729 -12431 6004
492 6004 25792 25838 99 -27651 -29487 -6013 20903 29840 14547 -13742 -30861 -22787 753
505 753 24008 31783 15735 -16941 -37513 -22277 13679 35094 26339 -914 -26988 -34160 -15377
518 -15377 15192 32765 23706 -4252 -30979 -32342 -1656 33959 38240 9539 -21843 -31475 -19341
531 -19341 4426 23831 24594 2344 -24324 -33280 -15315 18759 41196 30046 -7153 -33499 -27341
544 -27341 -586 23119 29709 13005 -19514 -41573 -30002 7162 37364 35628 4829 -27570
556 -27570 -31055 -4130 24375 28502 13055 -6591 -23402 -28734 -12947 14750 28758 15417 -13107
569 -13107 -30646 -20468 12399 37427 29945 -1599 -27402 -27280 -5402 21119 29051 6426 -28949
582 -28949 -39696 -14958 18598 31380 18884 -2498 -15929 -13313 -929 11757 21499 21863 515
595 515 -34656 -48252 -17857 30805 47637 17200 -29799 -47344 -17262 33379 55990 30002
607 30002 -15582 -39880 -30659 -2417 20673 22431 4214 -16034 -24873 -21925 -7261 20696 46297
620 46297 38930 -6276 -49772 -46222 5837 57503 53227 -9389 -67221 -60420 -1184 45205 40773
633 40773 6881 -18223 -20028 -8591 3710 14129 24098 25918 3693 -33517 -50008 -21009 27556
646 27556 47384 19171 -29907 -53305 -24417 32422 59987 31777 -18472 -39155 -18015 13360
658 13360 23086 6749 -12799 -16169 -8977 -7804 -9989 2196 25123 28302 1703 -26387 -21827
671 -21827 11807 38998 27262 -16388 -48869 -35691 7663 35581 24653 -8280 -30264 -22357
683 -22357 7403 31646 28954 6196 -12113 -16088 -13458 -8457 1903 13851 16326 1721 -23449
696 -23449 -35183 -13142 29561 49037 21593 -24655 -42021 -16312 23231 38702 17393 -19054
708 -19054 -35104 -20058 4736 15258 11266 3002 -3413 -6245 -5862 -2211 6105 18617 22294 2271
722 2271 -28608 -36703 -8258 28096 34143 2518 -33505 -34695 1913 36212 30699 -3058 -22228
735 -22228 -11748 6000 9459 -200 -7191 -2363 4654 1043 -11740 -12766 6082 22182 14068 -11143
749 -11143 -23530 -8370 19140 28947 6125 -27901 -34148 -3003 30376 28985 -1739 -26983 -23977
762 -23977 -535 17581 15534 3634 -33 1505 -5567 -18387 -13591 11615 31281 19890 -14750
775 -14750 -39197 -28266 11612 39980 28666 -7880 -30712 -21108 3892 20311 17554 1852
787 1852 -11341 -12537 -7399 -3575 2266 12824 16651 2881 -17579 -23150 -5143 20672 29919 9793
801 9793 -22137 -32690 -10587 17861 24993 10128 -8603 -16796 -11259 586 8702 9556 7065 2268
815 2268 -7700 -14575 -8726 6568 16266 11591 -2494 -14826 -14215 238 14436 13237 -1863 -12733
829 -12733 -10407 -372 9156 10267 2297 -6474 -7204 -1329 2558 3610 3840 1407 -5145 -8554 -3380
844 -3380 4571 9212 7567 -458 -10114 -10309 332 10670 10721 2084 -8059 -12989 -7952 4694 13513
859 13513 9223 -1911 -8830 -8732 -3193 5437 10170 6607 -1188 -7362 -8849 -5173 3577 11333 8350
874 8350 -2817 -10161 -8238 -267 7648 10235 3135 -6477 -8442 -2206 4179 5384 3076 -1920 -6191
889 -6191 -5572 -391 4163 4713 4064 87 -6234 -7459 801 10231 10452 733 -10138 -14434 -6414 7261
905 7261 13585 6531 -4207 -8669 -6448 -1065 5817 10279 7721 -245 -8094 -12354 -9062 2825 13135
920 13135 11279 -1866 -11756 -10112 225 9437 11717 3534 -5996 -7228 -2108 1019 1144 1225 1217 -1675
936 -1675 -4474 -3100 1459 5931 7460 1191 -8325 -9278 1046 11346 9868 -346 -10049 -11765 -4871
951 -4871 6028 10671 6014 -2050 -6221 -7190 -4099 3224 9837 9069 743 -7190 -10333 -5759 4171
966 4171 11167 6344 -4936 -10290 -6326 2422 8255 9010 2164 -5865 -6944 -2107 2541 5373 4848
981 4848 -562 -7984 -9636 -1947 6624 9333 4329 -3766 -9148 -5438 4357 10214 7242 -643 -7430
996 -7430 -10043 -5994 3718 11052 8830 -523 -8983 -10744 -3860 7430 12866 6193 -5434 -10082 -6934
1011 -6934 586 7398 8456 2096 -6243 -8858 -4329 2231 7631 8219 1422 -7945 -10345 -3136 6144
1026 6144 10668 6544 -3253 -11519 -8452 2526 10148 7964 28 -6897 -9252 -4653 4442 9744 6869
1041 6869 -292 -7174 -10096 -5298 6066 12586 7459 -4201 -10934 -8942 -359 8741 10381 2611
1055 2611 -7316 -10040 -5230 2947 9733 9873 1267 -8897 -11042 -3958 4601 9706 7614 -1057 -9700
1070 -9700 -9695 -1465 6742 9057 5005 -3167 -9099 -6760 2647 8469 6149 5 -6207 -9189 -4279 5405
1086 5405 10661 6570 -2900 -9392 -8982 -1080 8617 10528 2524 -6582 -8722 -4735 2188 8305 8525
1101 8525 1046 -8356 -10464 -4018 5146 11360 8881 -1851 -11190 -10196 -771 7954 9674 4641 -4236
1116 -4236 -10545 -6972 2560 9181 7414 698 -6242 -9271 -3753 5140 9611 6149 -1866 -8705 -9655
1131 -9655 -2756 8217 12015 4724 -5697 -9660 -6030 1953 8816 7855 -107 -7469 -8262 -3675 3459
1146 3459 9118 7593 -1856 -10018 -8514 470 7569 9079 3981 -4249 -9608 -6319 1252 6769 7074
1161 7074 2014 -5893 -9755 -3791 6278 10028 4950 -2914 -7460 -6579 -56 7375 8243 2639 -4953
1176 -4953 -9053 -6801 568 8779 8713 1254 -6276 -7147 -2935 3681 8698 7344 -1072 -9148 -9485 -2654
1192 -2654 5602 9550 4956 -4579 -9263 -5104 2099 6877 6979 3597 -2950 -7455 -5748 1369 6141
1207 6141 5430 -37 -6683 -7365 -1021 6145 6865 2393 -2397 -5681 -5124 427 7047 7344 9 -6740
1223 -6740 -7479 -3068 3339 7045 4699 -1743 -5567 -5119 -1586 4115 8734 6296 -3000 -9711 -6974
1238 -6974 1312 7226 6702 1179 -5515 -7320 -3166 2449 5829 5972 2101 -4482 -7551 -2776 5122
1253 5122 7102 2540 -3344 -6748 -5765 12 5915 6941 2765 -3359 -6749 -4574 2743 8553 5527
1268 5527 -1989 -6746 -5522 -1682 2194 5317 4843 11 -5183 -6075 -1838 4802 8501 4229 -4538
1283 -4538 -8224 -4106 1995 4550 4150 1003 -3331 -5139 -2649 1736 4477 3840 341 -3607 -4015 -433
1299 -433 3175 3328 1730 -489 -3670 -4865 -683 5465 5711 180 -4856 -5555 -1054 4487 5641 1851
1315 1851 -2882 -3988 -2355 -539 1887 4252 2986 -2230 -5735 -3923 962 5399 6201 1943 -4658
1330 -4658 -6702 -3408 2041 5837 5292 145 -6157 -6439 264 6096 5627 896 -2903 -4192 -3179 -39
1346 -39 2877 3864 2540 -1083 -5014 -5299 1049 7462 6341 -1096 -6667 -6582 -1131 4778 6762 3223
1362 3223 -3376 -6405 -4087 915 5450 6168 1956 -4274 -6143 -3592 273 3837 6363 3572 -2792
1377 -2792 -7803 -5224 2471 7384 6541 -882 -6852 -6459 22 4998 4009 988 -1084 -2623 -2457 -181
1393 -181 2816 3291 1150 -2299 -4101 -3037 1645 5509 3648 -1792 -4902 -4080 -366 4406 5911 1803
1409 1803 -4700 -6253 -2270 2775 5359 4368 -42 -4405 -4736 -1852 1327 4149 4394 850 -4932 -6302
1425 -6302 -1400 4888 6329 3318 -2211 -5994 -4751 502 4518 4143 206 -3497 -5675 -2922 3069
1440 3069 6868 4172 -1343 -4674 -3819 -565 3531 5066 1815 -3343 -6193 -4660 280 6085 7708
1455 7708 2045 -4913 -7119 -2874 3559 7047 5548 -1280 -7014 -7650 -2029 3879 6177 3955 -1283
1470 -1283 -6033 -5484 -157 5219 6198 3402 -2079 -6263 -5784 272 5530 5137 -213 -5739 -6386 -1770
1486 -1770 4619 6874 3395 -2360 -4213 -2545 1148 4254 4403 472 -4771 -6600 -3847 1292 5902
1501 5902 5978 6 -5422 -5854 19 6248 8319 3839 -3395 -8111 -5817 240 4995 4507 648 -3451
1517 -3451 -5827 -3234 3001 6608 5537 920 -3869 -5588 -2872 3290 5881 2299 -3890 -7215 -5097
1532 -5097 914 6083 6142 679 -4273 -4673 -1146 3699 6447 4514 -926 -6779 -7221 -2800 2958 6341
1548 6341 3945 -2855 -7194 -5068 1838 7132 7225 2505 -3439 -6997 -4057 1662 5351 3494 -1654
1563 -1654 -5750 -5739 -1451 4368 6314 3329 -585 -3477 -3557 -84 4665 5318 603 -5219 -6574 -3221
1579 -3221 2290 5908 4015 -1368 -4960 -3230 539 4341 5855 3638 -2496 -6205 -4536 481 4371
1594 4371 3951 507 -4368 -5599 -2154 3111 5607 4698 531 -4130 -5137 -1245 4325 5137 1168 -3716
1610 -3716 -5489 -3452 943 4304 4101 649 -2834 -4029 -1665 2797 5712 3661 -1776 -5524 -4374
1625 -4374 -264 2609 3606 1690 -2354 -4523 -2872 1158 4868 5370 1002 -4336 -5854 -1263 3479
1640 3479 4559 2018 -1439 -4191 -4017 -1127 2941 5199 3117 -1352 -4556 -4521 290 4895 4492 400
1656 400 -2741 -3837 -2652 294 3946 3935 -262 -3909 -3345 -826 2946 3884 1245 -1772 -2680 -1286
1672 -1286 212 1320 2528 1011 -2251 -4416 -1875 2472 4561 2744 -1375 -4155 -2944 778 3008
1687 3008 3190 1134 -798 -3581 -3417 -512 3507 3853 935 -2500 -3149 -1334 1441 2844 1818 -341
1703 -341 -1979 -2399 -1391 1407 3759 1638 -2300 -3508 -1367 1469 2556 1559 -42 -1461 -2288 -721
1719 -721 998 2635 2342 -441 -3806 -3269 288 3418 2754 282 -1573 -2230 -2139 -126 2365 2762 1441
1736 1441 -1585 -3584 -2462 1008 3104 1695 -689 -1465 -1115 -562 411 2015 1978 -121 -2319 -2189 -26
1753 -26 1969 2014 -307 -2094 -1256 427 542 510 1220 487 -1222 -2235 -678 1915 2420 944 -1612 -2581
1771 -2581 -1012 937 1633 1236 525 11 -1614 -1872 -39 2187 2064 5 -1165 -1385 -308 617 705
1788 705 416 293 -15 -800 -1352 533 1988 1253 -1243 -1578 -290 763 555 212 -260 -207 203 -163 25
1807 25 540 1134 188 -1429 -1084 601 980 329 -159 -81 -184 -612 -254 493 1231 1045 -415 -1908 -1309
1826 -1309 536 992 348 -339 228 136 -615 -999 332 1490 604 -581 -1525 -1137 175 996 560 139
1844 139 -160 -175 -931 -468 1077 1398 325 -948 -886 -176 698 849 172 -528 -509 -284 -266 518 1303 1379 -943
1865 -943 -2453 -1112 981 1864 1081 -144 -1175 -1228 -506 205 1013 1231 588 -1598 -2175 -568 1916 1748
1883 1748 276 -790 -1213 -633 -153 886 1038 413 -625 -1438 -1083 533 2405 1145 -685 -1823 -713
1900 -713 146 751 1184 1005 -751 -1722 -1092 379 1870 1930 224 -2102 -2124 -412 1128 1499 1326 279
1918 279 -1284 -2068 -924 1426 2480 1701 -860 -2432 -1667 362 2031 1652 78 -738 -1592 -1435 108
1935 108 2167 1993 -100 -1317 -1449 -503 1388 1983 566 -760 -1394 -1078 184 1282 2017 699 -1536
1952 -1536 -2359 -874 1428 2204 1524 -342 -1820 -1896 171 1368 2248 996 -882 -2589 -2311 6 2305
1969 2305 2469 344 -1185 -2024 -1202 675 2340 2205 -23 -2117 -2679 -1024 1329 2504 1151 -1471
1985 -1471 -2112 -1282 990 1944 2214 472 -1768 -2315 -1011 551 1868 1630 -661 -2701 -2151 101 2372
2002 2372 2535 1226 -984 -2742 -2171 749 2812 2518 228 -2173 -3009 -1529 1213 2380 1499 -277
2018 -277 -1581 -2168 -877 1840 2868 1692 -830 -2480 -2218 -50 1918 2169 -69 -1903 -2196 -517
2034 -517 1471 2565 2223 -305 -2678 -2082 -7 1837 2048 346 -1691 -2981 -2019 602 2428 2571
2050 2571 1129 -1239 -2550 -1246 1511 3387 2073 -878 -2608 -3277 -1035 1727 2651 1005 -1460
2065 -1460 -2404 -1414 847 2531 2564 536 -1795 -2318 -1150 713 2114 1762 -755 -2646 -2635 -385 2339
2082 2339 3079 1508 -1123 -2455 -1359 1432 2416 1784 -421 -2829 -3085 -1249 1466 2409 1493 -397
2098 -397 -2092 -1645 221 2901 3151 686 -1865 -3115 -2207 129 2086 1947 -382 -2620 -2326 -424
2114 -424 1934 2883 1961 -15 -2368 -1654 -259 1701 1721 587 -1745 -2741 -1645 691 2190 1857 561
2131 561 -1542 -1904 -203 2358 2960 1140 -1213 -2743 -2240 -43 1931 1873 13 -1624 -2279 -1039 1119
2148 1119 3091 2831 96 -2374 -2636 -680 1464 2151 848 -1078 -2937 -2096 24 1751 2641 1321
2164 1321 -1004 -2077 -582 1215 2172 1299 -800 -2124 -2207 -453 1140 1903 1132 -496 -1618 -1631 645
2181 645 2361 1996 144 -1646 -2091 -1138 613 1921 1404 -978 -2432 -1826 -213 1901 2660 1161 -1066
2198 -1066 -1959 -848 53 1594 1703 537 -1301 -2291 -1330 444 2017 1611 -193 -1636 -1528 482 1643
2215 1643 1822 498 -899 -1841 -1541 379 1344 1146 -84 -1244 -1400 -452 1143 1673 1381 -330 -1375
2232 -1375 -1617 -558 957 1752 750 -1405 -1898 -1298 543 1657 1498 432 -1145 -1443 -323 440 1025
2249 1025 1192 214 -1566 -1662 -395 1057 1328 541 -710 -1248 -861 288 1374 1160 338 -854 -1364 -802
2267 -802 730 1325 355 -669 -1375 -697 -171 1111 1191 776 -570 -1369 -836 270 1465 1466 30 -1194
2285 -1194 -1120 -27 812 890 746 -610 -1026 -1075 89 1077 1149 625 -799 -1253 -866 422 1103 582 35
2304 35 -689 -1033 -218 607 1064 777 -340 -1030 -869 348 714 1077 -89 -1010 -703 -659 117 695 922 91
2324 91 -1134 -1128 -177 625 845 450 -140 -827 -374 -211 459 950 569 -244 -966 -850 347 593 93 -165
2344 -165 -816 -468 -238 441 185 -1 -169 -333 -311 3 906 627 -307 -634 -433 45 276 544 301 -77
2364 -77 -743 -604 -24 358 901 444 -404 -460 -472 299 147 117 264 -170 -442 -239 -117 38 352 167 -532
2385 -532 -668 -420 198 476 -179 -52 130 -171 -302 235 359 180 -140 -14 -171 102 225 151 -105 -60 132
2406 132 -246 -135 436 360 64 -300 -438 -295 -64 251 350 -85 -336 -362 -225 73 247 487 281 -420 -849
2427 -849 -87 273 258 696 200 -271 -224 -25 -99 267 473 318 -431 -415 108 87 135 308 226 -243 -262 -111 320
2450 320 411 220 -234 -436 -190 144 394 118 -326 -216 -304 -231 -137 524 268 -321 -715 -273 -137 713 785 297
2472 297 -517 -658 131 141 361 383 71 -281 -865 -136 -47 484 503 19 -395 -417 61 -12 265 362 -194 -389
2494 -389 -491 84 611 490 33 -176 -544 -19 382 651 -6 -398 -276 -485 -228 375 771 212 -278 -539
2514 -539 -292 76 561 659 132 -493 -647 -435 369 441 775 -104 -577 -639 -2 330 508 443 -265 -476 -453 143
2536 143 401 501 338 -246 -521 -636 305 756 324 -316 -269 -412 1 388 903 371 -383 -630 -661 -112 494
2557 494 662 10 -625 -554 -254 -28 699 754 -75 -701 -858 -137 762 695 311 -354 -830 -687 -82 607 515
2578 515 426 -504 -588 -383 520 535 51 -47 -395 -646 -275 438 632 80 -374 -740 -610 66 744 891 -42
2599 -42 -640 -922 -136 198 668 650 -88 -895 -770 -289 626 897 191 -180 -745 -93 263 514 249 304 -645
2620 -645 -845 -519 238 833 546 -233 -665 -967 69 946 637 154 -206 -507 -408 107 612 566 18 -580
2640 -580 -479 -340 155 838 612 -286 -760 -480 38 611 905 467 -602 -1243 -795 -310 617 408 231 -568
2660 -568 -944 -419 447 898 345 342 -599 -464 -427 409 401 203 -155 -828 -550 -177 397 376 242 -352 -352 -260 528
2683 528 581 208 -418 -1201 -633 -28 667 519 635 -431 -668 -319 264 724 550 -134 -517 -771 -145 591
2703 591 538 450 -85 -436 -861 -156 648 677 342 -175 -249 -656 -51 129 441 -49 -485 -229 -399 363 539
2724 539 216 -621 -532 -355 207 441 469 121 -473 -524 -633 104 633 499 -166 -729 -398 197 675 813 162
2745 162 -230 -517 -594 -288 323 311 91 -313 -467 -395 134 426 346 -55 -92 -538 -430 175 486 318 -271 -503
2767 -503 -325 4 142 600 304 -242 -316 -284 84 549 354 166 -482 -418 -255 53 381 214 -184 -695 -471
2788 -471 387 729 456 119 89 -346 -420 174 403 125 -363 -217 -559 -100 -145 276 157 -241 -185 -196 159 198
2810 198 359 53 -376 -385 44 245 224 132 -181 -366 -336 106 405 458 253 -183 -337 -226 -55 424 171 129
2832 129 -29 -550 -281 165 474 452 -63 -146 -396 -227 97 679 365 -142 -168 -103 24 251 481 28 -80
2853 -80 -408 -322 267 250 -19 124 -92 -257 -268 106 255 -93 -511 -206 38 -83 209 292 -11 -194 -572 91
2875 91 47 261 -28 21 -595 -464 -83 167 465 461 -17 -243 -281 146 247 166 457 61 -230 85 100 23 94
2898 94 92 -225 56 -205 115 123 165 94 -265 -30 37 62 117 -46 -93 -86 -183 -53 388 107 184 -823 -997 63
2922 63 -69 392 140 54 -258 75 -98 61 367 152 -53 -164 153 -155 -166 202 35 -345 216 -27 -127
2943 -127 103 -130 -126 -132 -171 -197 101 189 -40 -355 -176 213 -133 -121 151 273 -304 -126 59 151 51 240 32
2966 32 -200 -147 -139 -231 119 -63 -7 -113 -157 -167 130 269 19 -228 -184 -119 -204 163 66 -226 -37 -5 -146 63
2990 63 199 49 -232 -288 -382 -542 212 -110 154 -199 -41 -159 -44 217 -4 95 -476 -309 30 -15 -134 93
3012 93 -3 -102 -405 182 -32 -30 116 -70 -296 -154 33 28 138 -107 -121 -145 -161 -181 174 85 -115 -15 -255 36
3036 36 79 14 -93 136 -38 -88 -15 427 156 278 -208 -217 -273 234 -19 30 141 149 -80 -99 -152 -33 149 -89
3060 -89 -187 -88 -219 83 250 75 15 12 -138 -120 409 139 -160 179 4 -60 112 163 502 54 -139 178 28
3083 28 -65 -61 176 -177 -148 123 90 -59 14 -71 -138 -18 -213 -151 46 -61 -17 172 -124 199 20 188 -62 -137
3107 -137 -177 -88 -150 460 148 47 68 -444 -45 54 20 231 45 -54 -157 -111 -121 20 -25 -244 -114 6 9 -99
3131 -99 128 197 205 -114 -252 94 192 260 -137 -49 -360 -49 146 270 -42 62 108 200 30 78 21 160 -24 -382
3155 -382 -154 118 285 28 101 4 144 56 53 120 189 148 70 -193 -334 95 -127 -4 64 -45 -51 -53 45 203 104
3180 104 -44 -57 54 -33 89 180 -85 272 -93 -99 46 142 124 4 78 29 137 67 184 -64 -113 -323 -140 -165
3204 -165 74 87 51 40 124 -20 163 126 -267 -154 143 100 -64 -196 -188 150 89 -213 -112 -134 -329 392 -168
3227 -168 -193 -84 -33 -65 50 57 -161 -90 -214 -42 81 -56 -17 343 -32 -126 -7 21 -60 -99 2 -15 162 128
3251 128 69 191 -94 -388 -415 333 -143 -260 456 577 24 -621 -78 -690 98 -141 275 64 -372 80 374
3272 374 502 331 359 -17 261 95 218 -116 -98 126 -177 -74 125 208 156 129 117 -151 213 -109 33 -9
3294 -9 11 -237 -133 -99 -18 114 -102 -269 -126 -153 56 41 -56 -64 -72 -60 -14 -213 37 83 -401 -3 -171 -44 182
3319 182 -288 181 206 -212 368 51 -9 140 -45 -210 -73 -194 -57 -17 226 -317 -180 -241 279 -182 -90 907
3341 907 228 -94 40 -123 7 -320 -399 131 -534 264 -191 2 -116 174 214 -8 -19 49 88 -63 -96 33
3363 33 -106 86 -9 104 224 -48 -173 46 -109 -72 -49 -44 -235 -187 30 -196 20 138 -12 -155 6 25 -79
3386 -79 73 -296 35 56 133 -161 55 158 102 45 -256 -15 -123 31 157 150 -157 -56 -98 1 -145 -122 -129 -1
3410 -1 105 -44 -56 265 -137 -77 -6 -176 -151 -106 -110 -48 -142 -13 242 -35 16 88 33 -157 144 77 -81 28 -227
3435 -227 30 -372 107 -202 -110 -221 24 143 -35 -302 -107 -3 -98 -15 -169 90 2 -118 198 -21 -212
3456 -212 -79 -204 -114 352 -258 -38 86 62 -143 -57 -201 84 -99 -29 159 9 -60 -27 48 118 -74 58 -103
3479 -103 -75 120 -84 -113 -251 -118 -67 -133 -40 202 -262 5 -222 -87 151 49 -93 -131 -161 3 409 -26
3501 -26 237 106 3 -299 -224 -82 88 -202 89 102 -161 -310 -44 -158 94 -272 -96 29 57 -235 -45
3522 -45 88 -256 -166 -254 207 -201 63 -11 84 -15 44 163 369 142 -13 -252 22 49 159 153 -23 -85 -246 25
3546 25 -146 -2 129 188 133 187 301 -64 -122 153 -135 -27 41 -279 88 295 52 -293 -126 123 55 -45
3568 -45 -40 -104 87 -75 -21 85 -12 4 -19 12 -137 -102 106 286 17 -111 28 55 137 22 43 27 -304 102 -10
3593 -10 -143 340 79 18 -72 13 226 -139 -145 141 -162 271 -304 263 -203 -169 14 -95 23 44 -12 29 -84
3616 -84 83 109 238 132 -27 110 -34 50 105 -37 71 68 -25 -246 -213 -70 146 -104 138 -76 -52 -60 -61 -13 118
3641 118 -62 -43 -68 161 -163 -227 -59 15 -106 125 -95 9 37 152 64 -95 168 -155 76 -117 26 145
3663 145 -274 -144 181 -45 -169 -118 266 -324 -31 -71 78 107 -211 40 -67 10 32 -92 -155 260 -95 47
3685 47 4 97 207 -64 37 8 -319 109 -15 54 -88 185 -172 -96 -157 5 11 -100 9 249 -54 23 235
3708 235 238 -61 119 -97 22 -100 183 273 -241 -112 -106 49 114 109 292 115 -189 195 237 -14 -28 -55 13 82
3732 82 178 241 280 10 -80 -118 174 -7 -185 -28 -21 -104 46 116 -5 60 -97 -135 -73 201 236 326 138 -357 -98
3757 -98 -87 -27 -7 99 -55 -173 27 51 -208 -62 -228 -103 56 -188 -95 53 55 287 141 -6 -118 -43 63
3780 63 3 200 127 -114 -111 60 129 347 195 -39 86 -163 79 275 278 71 422 22 31 106 -40 148 -220 93
3804 93 2 -59 114 -197 49 -203 105 -136 126 249 82 -172 -204 -123 -82 99 -75 0 -125 -211 85 -9 -182
3827 -182 -41 -4 -322 -66 -164 208 141 199 146 -318 -122 -55 92 -87 -130 26 -215 249 89 45 168 52 -47
3850 -47 186 143 -147 -171 248 -113 -130 180 17 -94 -87 -154 -33 -125 322 -112 35 -196 79 -216 191 -34 -19
3873 -19 -76 -88 -103 16 2 64 67 163 -17 -185 -25 -208 97 -173 -9 -76 266 132 32 105 203 -98 -140 85
3897 85 38 -266 245 -73 -35 -9 151 85 48 -198 -18 56 165 121 -82 -8 -82 -56 220 177 -345 99 -429 253
3921 253 4 64 -8 -40 -10 257 78 84 161 53 230 341 94 283 96 -105 113 -117 -93 245 153 10 -199
3944 -199 50 17 121 -114 -67 314 -214 -303 -138 59 -47 -67 -110 -46 -68 -67 -265 260 176 28 -88 315 -150
3967 -150 -61 47 281 5 -137 -3 191 -75 124 53 8 204 87 -26 232 114 -316 -189 -263 -12 -95 106
3989 106 -84 -168 -202 27 176 -19 253 42 -79 230 290 274 -65 61 94 -184 -179 94 -36 240 179 80 -161
4012 -161 -7 198 166 89 -100 -177 -83 67 89 71 122 -241 233 -33 -82 -46 -288 127 -2 127 -301 -265 191
4035 191 141 -109 -177 -137 -29 -237 193 77 19 -355 -53 214 98 36 -176 153 74 80 -35 313 163 -41 79
4058 79 -243 -193 77 260 159 -44 -35 -75 34 190 -41 377 -76 -35 143 -27 59 -285 12 46 106 -15 -66
4081 -66 93 34 -133 94 19 -156 110 -37 -57 -175 -355 -94 -187 -103 -88 302 -59 -16 60 -55 -82 11 -26 -120
4105 -120 -66 -9 135 -37 98 -11 91 106 -56 80 234 -102 19 -109 -225 264 -118 -177 51 -79 -31 33
4127 33 7 -14 24 -31 -81 -18 -208 222 236 101 205 -191 -282 -46 172 191 -123 -153 -19 -50 -108 254 -38 67
4151 67 91 71 8 -101 26 -199 -143 31 -10 198 -10 -277 17 -323 9 -93 -60 53 113 329 -38 73 -146
4174 -146 -22 143 -47 57 -93 -85 -41 65 60 17 64 230 -68 -15 32 -55 -68 93 60 -1 -40 54 104 -189 -318
4199 -318 -295 -106 -114 187 114 106 -179 -324 -21 -133 104 347 -367 -127 159 -98 157 17 -168 -53 -198 157
4221 157 150 67 54 -365 174 45 -70 180 130 -45 38 -270 -92 -100 -275 106 27 -240 319 -164 124 -184 143
4244 143 3 -135 116 109 -88 -67 -70 -182 89 309 87 65 -186 -34 -134 -165 -62 -16 -75 95 14 -8 -76 -16
4268 -16 112 238 155 -112 143 104 254 50 -25 169 102 198 -138 88 -214 17 7 -319 -43 179 -17 148
4290 148 -16 -132 -255 -40 200 -268 -24 -105 8 86 -168 213 24 -185 30 62 -111 -37 -81 -175 -166 -215 -46
4313 -46 177 -44 28 119 -325 -107 -208 -17 263 -171 148 268 281 -70 -54 83 -71 47 -65 -106 16 -3
4335 -3 48 -69 -200 86 239 63 84 149 -40 -202 -211 121 -5 -73 -69 -118 -162 -58 -120 83 -65 289 19 93 -108
4360 -108 141 -232 -3 -330 -26 147 168 276 55 -141 138 -221 53 163 38 -47 -124 -4 -16 284 60
4381 60 105 -153 176 -176 -164 50 -172 25 121 82 -61 62 -80 -63 -138 -283 23 12 82 -153 -183 101 101 110 -73
4406 -73 121 -229 61 75 -159 275 235 173 113 -124 -4 -62 -158 22 -113 32 25 -131 -81 -100 -12 245 -59 85
4430 85 103 234 -44 -200 177 10 251 -120 45 101 13 220 113 -109 -155 -192 -95 8 -126 220 -182 91
4452 91 -169 104 -159 43 37 310 120 -379 193 -60 23 31 65 50 -84 87 20 -48 -184 51 104 131 -363 2
4476 2 -136 177 -44 -78 40 -130 218 188 214 -332 124 212 95 -109 168 94 -151 74 88 378 227 82 52
4499 52 131 46 -112 -95 -157 -210 -142 -162 -176 174 -115 76 -19 315 35 217 -57 43 -3 -54 -83 -11 16 -8 -143
4524 -143 -131 38 -78 -127 119 22 108 231 102 -51 -66 -279 8 31 -152 50 49 377 -58 -22 -24 -237 -306 -113
4548 -113 -46 160 136 -89 -69 -173 42 209 125 -21 -139 -121 -178 -66 101 -268 193 113 94 -265 39 54 -22
4571 -22 42 -64 -73 -124 193 -125 -162 -10 -231 -168 20 1 -46 142 -269 55 -113 -74 96 -127 -129 -151 87 -259
4595 -259 11 67 52 119 -61 -214 -203 126 25 51 -105 57 5 -51 -135 24 -39 267 67 129 -4 62 -59 120
4619 120 24 -302 206 52 55 -60 -9 50 290 61 36 -65 -76 -178 -107 -46 -28 -52 137 -91 -84 245 -105 -91 193
4644 193 44 -94 168 156 86 271 398 -122 -145 -19 -99 389 79 -70 115 -27 128 132 -37 97 -222 145
4666 145 -413 179 -345 51 -108 -91 73 27 -171 -46 -159 -183 -111 120 -10 -72 116 1 26 -108 24 -207
4688 -207 28 -176 54 -218 -101 -59 -92 55 56 84 9 -130 213 114 -169 -172 -142 -331 47 205 29 -417 -52
4711 -52 -152 -132 -109 107 -123 260 -130 -33 -127 -35 73 240 -32 -12 -45 -21 127 201 258 22 -108 375 -124 70
4735 70 86 194 160 156 -236 -352 -159 259 76 -39 -90 -346 -26 67 108 13 -128 -319 173 -98 170 359 46
4758 46 49 55 203 -1 -8 28 -126 -21 351 -161 130 151 -371 -82 -153 105 -19 -28 -11 -160 -52 -34 1 -17 104
4783 104 -120 12 154 -240 -15 -24 -190 -67 45 37 -32 0 -53 36 -115 -85 -241 81 -15 -36 -42 -125 33 -177 81
4808 81 -138 163 -414 7 152 -211 81 -96 -157 42 -73 -24 -181 -58 158 -164 -139 -116 38 -28 213 -258
4830 -258 221 -19 -173 -219 -33 178 -124 -93 -23 -165 -136 279 -8 -111 -66 -163 -215 -34 -292 44 -117 27
4852 27 -7 -18 60 104 -85 59 56 -63 -42 -130 45 6 224 59 29 -175 -356 123 236 -77 -108 200 19 34
4876 34 84 -9 27 136 -41 230 87 42 -54 -86 -120 90 -56 9 -22 -48 61 106 6 -94 31 -202 -56 -194
4900 -194 21 -206 22 273 59 138 78 -23 255 20 -88 34 -153 55 110 121 305 75 -9 -5 59 -25 154
4923 154 44 -136 31 -42 194 112 115 -340 62 40 -97 142 77 -139 21 41 252 114 10 44 -12 130 -145
4946 -145 -91 -111 -10 -52 267 -227 -133 -8 54 137 -38 151 -162 -188 111 -106 -99 27 218 53 125 -96 108
4969 108 -88 313 110 158 -222 -229 150 -165 24 20 -82 153 243 -51 160 -196 -19 -92 158 -204 -165 -305 -32
4992 -32 2 -91 -64 113 123 -29 20 -218 107 250 93 -190 34 -55 -170 385 -56 276 -199 92 124 109 71
5015 71 -80 78 -288 -23 -397 -23 -55 142 -210 -85 -197 -74 -270 -164 38 147 -92 -99 70 -81 127
5036 127 -156 -299 -89 -199 344 -47 235 -193 -168 307 -22 -86 -152 47 55 -15 -212 -71 -297 -83 63 262
5058 262 95 -129 179 261 150 -75 119 86 44 3 -118 -318 -105 -71 -125 121 145 62 -7 -7 19 10 -91 -151 -43
5083 -43 45 -18 -150 94 -71 38 -22 -124 150 233 -175 84 -90 5 251 -107 -55 208 135 -281 3 -9 -198
5106 -198 184 -284 123 -91 177 148 -41 -220 8 -143 65 -76 -177 -220 -65 -195 -1 -35 -51 96 -163
5127 -163 73 264 84 -15 236 39 -170 -180 -183 135 193 1 -75 -203 -236 -151 161 4 -11 214 -17 -261 53
5150 53 72 256 -79 -163 -312 48 111 204 85 133 143 -111 151 36 -69 -275 305 21 -239 78 -162 -187 6
5173 6 -170 -238 212 -125 15 252 22 -110 45 152 -45 208 -11 -48 207 -24 -107 -189 208 226 -128 246
5195 246 95 -101 -176 -145 -193 135 112 22 -56 -44 4 56 13 -41 95 106 17 -78 -218 106 188 -279 -67 59 -103
5220 -103 18 45 234 141 116 67 -86 61 348 -21 57 84 -48 -114 193 28 -21 255 -104 17 -181 59 59
5243 59 -136 181 -170 109 253 35 -96 44 -208 -93 0 -111 -67 71 38 -69 -75 -22 80 230 15 41 -24
5266 -24 322 -22 199 26 65 -19 314 -102 -205 150 -62 57 181 -106 -31 -167 84 66 -276 158 11 215
5288 215 -58 64 121 86 -13 -256 -12 232 -121 -21 -79 -74 -52 25 -36 293 -137 -211 43 100 -166 -156 -67 -129 55
5313 55 -60 -230 45 337 -12 -231 -229 106 50 24 -41 75 -3 14 -161 9 -144 59 -275 -4 87 72 173
5336 173 -229 27 24 -57 -176 -218 -44 -185 -192 -30 27 34 121 231 194 45 -55 50 21 98 294 -82 39 -9 31
5361 31 144 -30 15 -325 14 133 173 -54 8 48 198 -9 -150 43 -233 -11 83 -218 127 229 31 284
5383 284 215 109 168 83 -195 -55 159 30 -187 -142 -93 -151 174 4 58 -14 -260 -220 -176 -34 174 -12 11 78
5407 78 -187 -97 -70 23 -96 -66 -5 64 -45 28 -154 238 4 -194 72 220 -112 -58 -121 -36 -105 208 66 -35
5431 -35 -267 -207 -56 -108 83 227 134 28 -3 8 -73 -46 -19 -68 -218 23 -221 13 129 33 -148 122 -120 -205
5455 -205 77 -271 327 111 -76 142 -59 -42 84 -124 -77 139 -111 -13 -34 -50 -93 -214 310 -65 -42 -5 -250
5478 -250 167 -200 7 11 53 8 -93 91 -130 164 230 172 88 -224 86 -57 -81 43 397 202 -2 48 -169
5501 -169 109 13 -179 -67 269 -86 -117 -108 135 -52 -99 -19 -224 24 -78 -51 -69 -182 -74 121 177 185 14 -129
5525 -129 -49 -53 17 37 75 334 127 -137 -165 0 -360 -86 201 -160 -298 -222 -410 -259 115 -95 -82 63 53
5548 53 -19 -25 -90 100 -58 31 -116 -31 3 -45 -92 128 53 -202 -31 66 -176 -116 -87 -56 182 -150 169 340 157
5573 157 -247 74 126 205 -4 -64 -30 122 117 -209 194 230 84 -124 104 -316 25 -6 218 -55 107 -30 17
5596 17 -139 -150 50 120 49 -16 18 -112 -145 -167 -137 0 -138 63 13 -6 -54 -50 342 241 251 11 80 -185 142
5621 142 -143 111 -255 110 66 -86 -236 -69 21 207 69 12 -52 75 48 -150 -44 87 104 172 126 260 144
5644 144 146 199 -64 -93 -1 72 183 238 -139 -105 271 2 134 82 -230 -35 27 0 267 33 71 -191 -124 -86 -231
5669 -231 18 -75 164 46 -220 -32 158 27 -150 -155 -12 12 46 -127 170 -54 -186 -7 -68 -134 31 -51 -155
5692 -155 33 -43 -121 -24 -180 187 -102 -154 -41 84 -34 94 -73 -8 -235 -16 -6 -160 -46 -30 -8 32 5
5715 5 73 96 27 14 182 -23 -80 245 56 0 38 -14 -172 -64 -9 -206 133 -41 -180 -132 -197 -186 70 36 9
5740 9 -83 112 216 -26 -10 -196 194 64 -15 -15 310 22 -280 39 -237 69 117 -90 -163 14 202 -9 74
5763 74 27 -141 9 191 -20 -75 -152 -61 -153 103 30 -107 -191 -172 22 2 62 -40 -88 -68 -159 -249 -87 -38 -168
5788 -168 149 -67 -1 -14 108 -73 47 193 73 -56 -117 11 -278 95 98 -25 -22 -76 153 80 -20 41 309
5811 309 -135 16 -118 -82 -35 145 -84 137 21 -202 -97 26 17 22 100 -336 -123 2 2 -324 90 -201 53
5834 53 -93 -76 -87 -125 63 -171 160 -61 205 -46 -22 -99 127 21 -348 -200 -152 200 -284 -15 110 37 -187
5857 -187 165 -20 54 -81 160 -2 -201 -164 1 -71 -135 -95 68 -267 36 -50 46 273 33 -89 -67 -53 -29
5880 -29 -146 -170 225 2 -291 -93 148 -82 32 -61 -198 -3 -161 -130 -46 55 176 155 -193 241 -200 96
5902 96 -224 12 321 -80 80 43 -219 197 243 -6 -6 -22 -132 -193 -52 -1 21 -143 -172 16 0 -303 81 -131
5926 -131 259 -143 25 -8 -150 -74 21 -114 50 -29 80 -121 53 -161 25 56 114 136 -192 30 134 -195
5948 -195 101 -244 -23 64 258 33 -36 -45 -48 225 157 211 -81 153 -71 -28 26 77 -39 -194 -181 -251 187 -37
5972 -37 134 -199 266 -151 115 81 -90 69 261 230 -234 96 90 161 -65 -57 -46 131 236 -82 -160 152 -118
5995 -118 267 56 48 4 230 23 297 -100 131 49 226 -22 -92 55 -215 106 -45 -105 163 -175 202 76
6017 76 -211 -120 -126 174 -167 119 77 -261 120 39 -187 22 300 73 -9 -41 145 185 215 82 -180 -397 -79
6040 -79 -101 71 -191 257 52 119 332 -245 29 -23 -103 7 422 130 199 0 -64 -30 44 -246 302 -75 192
6063 192 118 -18 126 -116 71 225 -107 145 255 1 164 -138 113 158 -247 84 289 94 -33 -27 190
6084 190 60 -15 118 -20 -130 -26 -10 169 -1 33 -95 -47 -222 54 -22 48 128 356 136 -61 86 74 56
6107 56 -74 30 79 -130 -98 176 37 -131 157 116 -112 210 91 42 -12 203 196 -68 55 91 -77 -135 24
6130 24 -82 -21 -225 -194 -110 157 75 72 -305 -21 102 74 -62 123 7 -18 30 219 9 -8 87 -35 116 -146
6154 -146 74 90 -90 -111 83 -154 -191 162 218 -14 21 -103 -16 -107 382 27 122 -22 -1 -225 234 -96 -133
6177 -133 34 246 93 -113 -16 -118 115 -76 305 -8 161 179 -45 -61 -173 35 -23 99 57 -295 -107 -16
6199 -16 -58 -94 -261 79 61 -96 1 -147 51 153 115 129 -68 -212 35 180 -177 381 21 215 -47 3 139
6222 139 90 178 -103 154 -24 -115 10 -315 14 -85 -54 -50 -458 -152 34 83 196 -152 182 15 14 280 -252
6245 -252 -18 -245 203 77 -261 -63 76 37 81 -19 75 -240 35 -38 -114 -100 -169 0 -77 3 109 -123 -108
6268 -108 -93 -167 -64 -69 -68 -70 -281 3 -118 136 -72 228 59 120 -68 -73 -7 -71 -116 -381 196 102 -169 97 162
6293 162 -127 -51 -88 218 -236 -145 138 -58 -315 31 100 7 171 -312 59 40 108 -104 -38 19 33 104 -206 -129
6317 -129 -71 -209 116 -117 54 -408 94 -18 -126 -15 -95 -19 -108 13 -19 -22 86 -138 22 -101 77 74 -92
6340 -92 -127 -391 29 -24 38 -217 157 -240 92 75 65 209 -103 -61 -67 -49 147 -150 -121 -36 -151 220 -11 -86
6364 -86 -308 251 131 -19 -130 -211 156 -52 4 -122 18 -57 83 80 -64 -6 -451 44 -54 39 -114 179 1
6387 1 62 -125 -281 45 212 123 -40 -104 30 9 -117 -14 -56 182 -35 253 289 -29 -171 -58 -103 -297 -92
6410 -92 223 -117 -32 -185 46 26 -108 -123 26 108 -49 329 -101 -151 -22 11 118 60 176 -168 135 163 102
6433 102 -284 -180 233 -63 173 -3 121 -23 -53 -141 79 15 -279 31 191 63 -103 -60 101 -246 138
6454 138 -352 111 -23 35 213 -192 -44 -106 98 -116 -101 -316 -30 204 -189 295 179 -210 -73 -20 -2 102
6476 102 -76 112 -59 -25 17 -114 -6 -304 -98 -181 152 89 10 -38 104 421 -23 44 92 -323 -44 248 -99
6499 -99 97 95 243 -130 -114 -16 202 61 -11 81 197 2 2 -129 130 94 -88 264 129 -120 -171 131 87 366
6523 366 390 -190 -239 173 169 0 -244 -71 -21 -42 -178 -12 47 23 29 442 97 24 57 -74 31 -2 108 -56
6547 -56 -51 55 202 -128 -23 -71 125 -171 -131 -84 -115 -300 -266 -150 -46 -139 -86 307 87 157 -91 106 50 138
6571 138 59 57 -136 -261 179 73 -19 74 35 36 -5 -140 -281 -64 110 235 -58 -92 -66 -98 -41 -128 15 -24 -176
6596 -176 -73 -401 9 -85 34 -60 -106 120 -80 132 31 -25 -33 -50 213 325 -120 -98 252 -126 -447 -11 -105
6619 -105 -60 -44 -200 -120 -228 -154 142 249 190 121 -112 71 -135 337 -170 169 -49 -17 69 -78 123 -155 -102
6642 -102 78 -175 -72 -5 233 189 5 315 -111 183 -42 -89 169 -189 49 -49 4 -298 219 223 -187 186
6664 186 103 195 71 -165 -150 130 -66 79 122 104 -63 -304 58 -303 -160 82 -18 -76 -46 88 227 0
6686 0 76 -342 -73 67 -147 -17 -121 0 -122 -176 -158 -250 -54 380 64 -129 82 247 180 -63 136 -58
6708 -58 -260 -118 -65 310 -47 -29 32 387 -136 126 35 -108 -48 14 -366 -159 -3 -122 95 80 26 93 -174
6731 -174 382 376 -149 617 -23 192 -39 54 191 -1143 -90 369 -431 -39 10 -611 27 149 -524 46 -2
6752 -2 309 -182 498 -66 49 -66 -213 -236 -371 17 -377 -24 -174 46 -336 -224 -262 -355 705 -12 -248
6773 -248 -919 -801 75 -885 102 -378 151 48 -152 -46 346 90 -28 -78 -226 -15 -78 37 100 104 195 11
6795 11 -37 -111 115 112 161 111 188 -78 74 178 -274 -103 81 160 14 -56 -31 -304 259 487 93 53 -87 213
6819 213 -95 -117 -2 -188 80 -31 -148 -224 239 -57 -24 -253 -40 86 -27 238 -188 72 -38 -199 -207 -140
6841 -140 -45 -63 -241 -132 -80 48 -175 1 -121 -29 -4 139 -219 -54 134 -98 72 -71 -40 53 130 -66 4
6864 4 150 -28 -242 339 117 -94 356 -71 -162 95 78 46 -4 -286 364 -239 -207 284 -48 -131 227 70 296
6887 296 45 -147 -107 75 -107 -61 9 -49 -6 -177 -22 -62 217 18 30 -35 31 -194 235 56 4 -163 234
6910 234 85 96 68 90 71 136 -210 -34 21 77 183 -21 -40 135 -10 -215 -88 6 132 182 89 -229 416 -60
6934 -60 -62 -288 -205 159 157 -146 -220 43 -42 -44 -170 -110 117 -202 -35 -269 60 -10 221 -1 -244 -380 69 -24
6958 -24 -195 390 -97 -205 -305 -184 9 69 2 30 26 -170 -19 46 -37 -274 -118 150 152 13 35 26 122 70 -100
6983 -100 -127 -152 128 -37 -67 -28 -106 120 200 2 -192 -3 91 57 179 394 27 277 2 159 -194 -154 147
7006 147 55 66 -30 -76 45 -132 157 -3 -109 -252 -6 -271 150 165 72 87 114 -145 230 188 -21 -7 -4 211
7030 211 -305 -138 142 14 -17 155 -251 -44 -117 221 197 -243 -457 43 7 -16 277 35 -154 22 -69 157
7052 157 25 -188 -247 -53 46 -41 303 16 88 33 -61 196 257 180 -15 -172 -341 -85 -102 94 60 -287 89
7075 89 -52 92 195 6 0 94 -43 192 -67 -128 -125 -197 336 15 284 -127 13 29 90 -51 -93 -204 -30 185
7099 185 242 -267 161 7 -157 -72 68 -5 183 -214 -314 106 -89 95 -56 123 -126 -120 159 -73 89 -9
7121 -9 51 -1 -64 213 65 296 -216 -96 -81 4 156 45 -266 -310 35 129 19 107 -54 1 180 367 143 -111
7145 -111 51 -174 -5 -132 86 33 -33 7 50 -1 4 287 -114 -49 13 4 -293 -52 -20 240 68 -42 112 364
7169 364 131 125 -6 -122 -2 -84 -63 -83 253 105 -99 65 -46 -56 149 -97 31 -45 -125 -9 123 -30 -6
7192 -6 -120 98 -63 38 143 -235 -171 259 105 -90 1 -111 65 -103 -169 32 -34 -89 53 -181 62 -128
7214 -128 258 66 -114 78 6 -247 119 51 -35 -290 86 216 28 26 -154 -98 216 -324 -103 206 -126 256
7236 256 27 -12 -24 -87 -138 -91 45 178 24 195 -319 -267 85 -99 192 -211 84 132 66 -15 130 -131 14
7259 14 225 74 -41 -340 -95 -82 -187 -13 198 -73 -39 287 -164 41 -105 73 -265 145 -135 -104 47
7280 47 161 235 -61 90 -19 -19 327 65 -64 153 147 74 -186 -352 57 25 45 -77 87 168 -53 31 71 107
7304 107 -55 33 -135 -164 -103 -253 -48 -336 -7 62 104 -42 229 45 -20 86 -123 39 -269 -34 11 186
7326 186 71 -24 243 24 110 -78 258 201 -107 17 -58 -44 102 160 221 47 -93 -150 14 -12 37 -372 -276 -21
7350 -21 -56 396 -32 125 187 26 41 -317 19 129 70 -61 -250 194 -59 -39 -81 -163 -178 125 52 161 -40
7373 -40 70 -65 -123 121 237 116 82 56 -105 -120 -114 -120 -224 -103 152 174 81 93 178 53 183 74 -510 -108
7397 -108 -43 199 138 74 94 148 -187 -300 -117 243 5 73 29 104 50 88 -61 -226 217 -134 -131 341 38 -61
7421 -61 -165 -41 -300 87 -101 -30 -28 56 -236 6 -122 -251 137 -16 -34 11 74 -17 -181 -37 -113 -22 -34 -338
7445 -338 11 95 84 -32 126 46 36 101 -88 -231 -59 -127 -138 -107 192 64 -277 270 -193 -131 -301 56 -7
7468 -7 -86 -15 -88 -170 36 -18 -48 122 17 52 226 -291 7 122 97 -185 -164 60 -75 -179 -103 -146 157 -46
7492 -46 -80 213 19 -162 10 -211 100 -89 -205 9 -141 246 -250 132 -95 204 -305 177 89 1 153
7513 153 27 35 -305 -192 141 203 39 53 -272 68 13 117 -94 -53 -272 -149 -47 -35 126 -82 -108 29 -4
7536 -4 -196 -94 -168 54 -24 11 20 -18 42 39 -196 -428 70 5 -207 43 129 -21 156 -44 90 110 131 -16 35
7561 35 152 116 -265 38 103 260 -111 -25 105 -92 254 -275 108 -22 151 -48 50 197 -157 66 -61 47
7583 47 -87 -271 245 -69 -122 9 -45 82 -4 66 -81 -18 -125 -29 37 -29 163 -218 -50 -9 -34 -213 42 -29
7607 -29 230 164 -253 45 -207 -110 -296 74 -134 27 -150 -95 245 -104 15 10 -52 -233 -103 -28 136 -168 -75
7630 -75 132 62 -41 40 57 -17 188 83 -2 211 4 283 -13 171 -25 -230 119 -73 -165 -12 -40 -131 36
7653 36 -36 79 -171 -8 -135 -112 53 -31 10 1 12 -227 -31 61 67 -130 -10 176 164 -164 23 -32 -32 -40 -16 16
7679 16 -143 -8 76 69 274 -30 33 -177 128 -49 208 -104 -32 -40 -216 -73 -53 -143 -389 -111 -231 -113 196
7702 196 -68 32 276 -136 13 243 -9 27 -250 32 201 -70 -259 -74 145 88 -176 176 27 -190 188
7723 188 171 85 53 18 -143 201 -390 -139 103 -85 56 372 187 -9 157 -241 249 154 -244 -71 175 -66
7745 -66 -110 -338 -90 52 -41 -228 103 131 345 49 254 131 77 -228 46 -109 -161 -136 -89 93 135 32 -283
7768 -283 -213 -139 326 -201 -123 -67 -384 414 74 -301 7 -44 -128 67 -244 -57 -175 351 389 223 -161 166
7790 166 93 -166 2 -80 244 -7 -388 93 91 295 -69 -357 18 20 -187 -532 86 -112 152 -136 201 -289
7812 -289 -370 -189 179 274 128 -107 -399 186 206 93 -16 -225 -322 -51 9 86 86 -61 -44 -106 14 53 204 64
7836 64 -258 -63 207 -29 -46 219 -188 -142 -201 -2 16 290 -107 -149 313 68 -108 -212 -175 -42 128 -269
7858 -269 37 -187 108 44 -225 -24 -150 6 -90 -207 -68 93 -189 -11 65 -86 321 -93 -264 -181 -44
7879 -44 58 45 -106 -79 -17 -32 155 329 110 326 43 -102 -220 -324 17 -159 156 42 7 262 -173 -46
7901 -46 -235 149 223 58 -26 193 304 -73 38 -193 114 2 -95 -42 56 -37 95 -21 -48 62 -142 21 103
7924 103 -58 -47 98 19 -170 39 -137 -73 -135 29 111 -207 70 -174 151 48 159 -39 -288 -179 -53 117
7946 117 0 -126 15 -209 219 28 -46 142 63 -36 -7 115 -188 -123 -87 142 29 -76 -57 40 25 194 292
7969 292 -116 -143 144 -186 -18 -336 -30 59 76 121 -131 19 113 107 -50 -4 -16 -206 183 144 125 92 -202 112
7993 112 -70 200 -54 112 -213 96 18 39 253 122 96 -34 -8 35 -48 143 -204 -42 -85 -62 -184 -274 96
8016 96 -198 29 -137 141 -185 -61 90 198 -76 286 80 58 -50 214 -73 -84 -262 -85 146 -71 -72 251
8038 251 168 -18 -291 -327 15 -35 31 122 -48 150 27 125 238 -156 -173 220 32 179 -125 -32 -142 -43 -111
8061 -111 -210 134 235 -199 -51 49 7 77 -189 42 47 -383 32 -334 99 -171 15 24 252 -258 107 600
8083 600 451 16 327 -979 -56 -364 57 -252 312 -31 -641 251 175 437 -13 -407 -33 94 341 161
8103 161 -173 -214 -120 107 -125 -143 -117 -12 113 24 244 -13 75 -17 29 110 -60 -32 112 39 2 21 226 202 -172
8128 -172 -81 -27 -147 146 122 -145 -75 -60 137 176 -310 172 -97 10 123 35 -117 39 168 -89 -126 -287 -194
8151 -194 213 39 -218 8 111 -97 243 34 -9 84 216 -86 16 -175 -216 64 -56 92 -34 128 219
8172 219 -105 129 -74 -58 -102 -13 -281 -49 37 -95 -125 38 149 -51 -55 -101 -56 184 164
8191A64
$$ Imaginary data points
##PAGE= N=2
##DATA TABLE= (X++(I..I)), XYDATA
0 0 0 0 0 0 0 0 -8 0 0 8 -8 8 -16 24 -24 32 -40 56 -64 80 -96 111 -130 157 -179 210 -248 282 -326 376 -427
31 -427 488 -555 626 -708 797 -894 999 -1118 1247 -1387 1540 -1709 1893 -2091 2312 -2550
47 -2550 2810 -3099 3412 -3759 4144 -4567 5040 -5573 6172 -6855 7644 -8562 9646 -10954
61 -10954 12570 -14617 17310 -21030 26521 -35472 52592 -97263 473891 983481 -96615
72 -96615 -740829 -611754 134079 465308 240628 -194802 -232512 -46810 13834 -204694 -247402
83 -247402 92298 534609 480097 -78839 -592316 -460536 167994 628821 402763 -227762
93 -227762 -587024 -328536 162643 345158 110222 -148550 -119938 92417 144415 -37842
103 -37842 -177447 -28476 237099 252899 -52355 -328819 -257183 71021 270134 134966
113 134966 -147665 -234478 -43254 178611 177508 -2262 -120602 -48836 97288 129370 -1458
124 -1458 -156853 -165231 -12108 135275 119528 -26793 -130679 -85947 43482 112869 63181
135 63181 -19890 -23749 38466 44009 -48922 -123854 -62758 81231 140307 32885 -135091 -178582
147 -178582 -34129 160012 203638 55011 -125597 -162235 -39743 102792 125002 20744
157 20744 -84374 -80327 -3242 26475 -20156 -43012 25345 103781 67936 -69796 -146504 -42849
169 -42849 144436 188548 12273 -189360 -180081 22081 173242 110851 -67538 -147650 -55377
180 -55377 80572 100094 5444 -60105 -16378 56283 43388 -38977 -76315 -15236 68917 62045
192 62045 -43658 -122375 -57204 96325 156545 40254 -122738 -144262 -4106 136048 122208
203 122208 -19120 -121377 -80115 28659 65178 13567 -25262 1271 31160 -1074 -58970
214 -58970 -54239 30948 106075 72494 -47514 -124034 -68633 54523 112623 55062 -47651 -95104
226 -95104 -52842 29170 69857 39289 -13524 -32525 -18115 -3702 1418 12255 29111 28684 -5526
239 -5526 -54884 -65726 -5678 73978 81518 3291 -75912 -73528 -2169 61522 62193 11326 -36711
252 -36711 -42409 -17196 5601 16623 23081 18410 -5941 -30738 -28337 -1170 26967 35166 15286
265 15286 -20274 -40490 -21551 16497 35555 21153 -11253 -32002 -21598 10981 29666 13680
277 13680 -12243 -17292 -5878 2764 5967 8987 7804 -1274 -12060 -14745 -3913 16198 24608 5717
291 5717 -23907 -28357 -4194 20463 24116 9579 -11599 -24452 -15339 8536 23539 17590 -649
304 -649 -17004 -22931 -10673 12638 24950 16536 -2810 -20059 -26777 -12507 18408 37131 20658
317 20658 -14669 -34463 -24647 3630 27492 27853 5123 -17027 -21704 -13817 -2033 13878 24493
330 24493 15042 -10266 -25755 -18814 1827 21184 24166 5662 -17733 -21792 -6304 8855 12877
343 12877 8910 -39 -8793 -10112 -2952 2481 5388 9123 8143 -2320 -13056 -9607 2205 7836
357 7836 8662 1601 -8382 -10256 -2055 6605 3477 -1419 357 1965 -412 -2970 -2854 -1356 2346 5784
373 5784 2413 -7416 -7164 3451 11039 4287 -5048 -8145 -5529 2257 9067 5305 -3798 -5266 -1408
388 -1408 -2122 -2666 3334 11177 5461 -5365 -13244 -10572 1157 12296 13377 600 -12771 -13027 -2817
403 -2817 6787 13668 11122 -3050 -15852 -13084 673 9755 11118 6147 -3690 -12342 -10387 781
417 781 10305 13066 6350 -8827 -19228 -10108 11369 19885 8127 -8267 -15297 -11713 379 13416
431 13416 16136 5022 -9089 -16736 -13401 2737 20042 20522 -299 -18543 -18666 -6205 7986
444 7986 17989 16203 -1089 -19064 -20540 -4142 15464 23392 11502 -11646 -23991 -12876 7000
457 7000 16745 14320 5068 -10786 -21540 -12889 10074 23769 15167 -6837 -23387 -19149 2949
470 2949 21846 18990 1816 -12020 -16713 -12803 2480 21887 23815 1003 -24686 -28419 -7748
483 -7748 19411 30091 14463 -12695 -25937 -17907 1183 18759 26780 13740 -15187 -34178 -21102
496 -21102 9916 29411 23779 -784 -24217 -27426 -7519 16804 27641 18877 -3848 -27223 -29521
509 -29521 -2971 27943 31493 5441 -22656 -32126 -18532 9462 31321 28204 2745 -24333 -32406
522 -32406 -12944 22177 41797 23241 -17974 -41369 -29666 110 24582 30376 13840 -14411
534 -14411 -32052 -23010 6898 34900 38825 9729 -28678 -40864 -17228 14961 29043 19188 -5004
547 -5004 -29060 -32116 -5984 28540 40002 18678 -15695 -33437 -19609 12528 29836 16151
559 16151 -9668 -24009 -23302 -12094 8941 27266 23645 -1630 -25248 -24961 624 30536 36898
572 36898 10212 -26519 -39176 -19617 11229 30011 21904 -8857 -35623 -29083 6719 35714
584 35714 32923 7083 -15618 -20685 -9513 5143 13056 11901 2779 -16122 -34971 -27640 10734
597 10734 45671 37862 -6134 -40526 -31965 12175 49230 41586 -5511 -47141 -45973 -12005 21945
610 21945 31893 15500 -11122 -25813 -19414 -335 19172 35078 36032 7849 -36881 -56758 -25518
623 -25518 31865 60322 26497 -40424 -72469 -33652 35478 63561 32742 -13249 -30236 -17280
635 -17280 2486 12527 14296 12324 4108 -16688 -37917 -32158 6656 43760 38481 -4045 -41716
648 -41716 -36475 9020 52740 49413 -1306 -47460 -44411 -3325 28580 24097 -3746 -23107 -18596
661 -18596 -1528 6236 7359 15293 25292 14767 -16112 -33062 -14434 21132 33747 6834 -34492
674 -34492 -47272 -14985 29981 41914 14169 -19385 -26900 -5947 22131 30995 12010 -15603
686 -15603 -25953 -16325 -3140 3898 8693 11340 5618 -9470 -21883 -16005 12554 41271 35684
699 35684 -7112 -45156 -37718 4713 38542 32752 -4299 -37025 -35715 -4556 23379 26073 10808
712 10808 -3234 -8961 -8064 -3377 3018 9692 14214 8235 -13249 -32955 -25259 10067 36433 25732
726 25732 -11531 -34669 -18712 20224 39389 16204 -21045 -29629 -6369 14624 11002 -4633
738 -4633 -10949 -3667 5210 2784 -5428 -3155 12050 18404 2038 -20258 -20354 3589 25672 20964
752 20964 -9201 -34748 -25189 12804 37045 20815 -15062 -30410 -14190 12471 22903 11279
764 11279 -4838 -7553 -2684 -5468 -12420 -3900 16722 24189 3190 -26055 -32467 -5877 29851
777 29851 38656 9552 -27356 -33574 -7424 20477 25126 7714 -12775 -20223 -10796 2571 8858
790 8858 10089 10952 5921 -9677 -22162 -14165 10051 28304 21126 -7997 -33061 -27498 4621 29908
804 29908 24489 -453 -17987 -17294 -5274 7295 11786 8202 1908 -3803 -9630 -11141 -1755 11449
818 11449 14799 3742 -9474 -13996 -6624 7460 14576 5957 -9478 -13635 -3320 9138 12507
831 12507 5287 -5772 -11660 -6149 3823 7918 4685 600 -3964 -7988 -6857 1926 10049 10075 2933
846 2933 -6674 -12111 -7325 4989 12840 7724 -3380 -10675 -10093 -1735 9145 12356 3729 -6668
860 -6668 -9167 -4008 2450 6554 6406 697 -6358 -7169 -3466 1889 7057 8278 1154 -8636 -9902 -1347
876 -1347 7618 10340 5098 -4726 -11470 -7388 3384 9187 5925 -863 -6437 -8140 -3502 4261 8119
891 8119 5813 1172 -3868 -7908 -5719 3498 10715 6407 -4725 -12164 -9955 797 11317 11674 1126
906 1126 -8325 -7437 -851 3935 6301 5475 33 -6608 -9289 -6819 284 8413 11854 3893 -8723
921 -8723 -11952 -2742 8714 12091 5966 -5472 -12170 -7556 2160 6255 3205 171 -1580 -3635 -4269
936 -4269 -31 5807 7790 4123 -3871 -10685 -7726 4585 12130 6200 -6055 -11910 -7957 1478 9444
951 9444 9273 1478 -5760 -6281 -2948 935 5384 7394 2853 -4997 -8705 -5765 1219 7771 7844 -183
967 -183 -9251 -8344 1160 9178 9464 3015 -5561 -10128 -5732 2673 7467 5524 723 -5784 -9753 -5976
983 -5976 4712 11799 8980 -174 -7945 -9500 -2723 7161 10090 3238 -5544 -9276 -7113 -397 7536
998 7536 10489 3901 -5372 -9423 -5365 2867 9463 8503 -1034 -10016 -8666 171 6776 7880 3117
1013 3117 -4712 -9367 -5471 3104 8479 7777 2317 -5869 -11388 -6771 4516 11607 9356 -116 -9897
1028 -9897 -12632 -4496 8401 12751 5136 -5054 -9617 -7293 118 7971 9407 3252 -4838 -8370
1042 -8370 -6785 405 8682 10105 1660 -8453 -10033 -3094 5497 9477 5570 -3900 -9872 -6172 2757
1057 2757 8730 8710 2786 -6786 -12103 -6686 4461 10818 8557 420 -8464 -11817 -5371 6305 11654
1072 11654 7505 -1301 -8862 -10145 -2839 7239 10399 3659 -4711 -8652 -6593 114 8068 9924
1086 9924 2168 -6580 -9456 -4597 3985 9044 6607 -2680 -8882 -5871 1477 6298 6774 2352 -5112
1101 -5112 -9426 -5521 3792 10038 8563 375 -9747 -12648 -4120 8056 12227 6531 -2816 -10037
1115 -10037 -10322 -1511 8860 11330 3920 -5427 -9742 -7587 870 9383 9428 1905 -6819 -9793 -6346
1130 -6346 2589 10707 9678 -391 -9070 -8423 -1607 5672 7675 2935 -4471 -8081 -3867 2745 6755
1145 6755 6377 1115 -6925 -9349 -2199 7223 9836 4415 -3864 -9426 -8465 -403 7761 9187 3755
1160 3755 -4043 -9063 -7637 1735 10941 9962 309 -8278 -9306 -3935 3859 9202 6374 -1785 -8044
1175 -8044 -7607 -2375 4887 9343 5655 -3197 -7633 -4658 1357 5336 5668 1624 -5823 -9090 -4300
1190 -4300 4134 8422 6266 -1676 -8110 -7237 973 8061 7912 2185 -3344 -7447 -7095 -836 6322 7679
1206 7679 2201 -4846 -7972 -4643 3847 9236 6497 -887 -6095 -6343 -2739 3347 7586 4969 -3048
1221 -3048 -8016 -5592 903 5681 6004 1618 -3580 -4999 -2226 2144 5020 4978 516 -6962 -8618 -1545
1237 -1545 6475 7741 2005 -4539 -7362 -4188 2985 7394 6475 1459 -3693 -7830 -5705 2234 8286
1252 8286 5862 -1673 -7106 -6985 -2101 4466 8425 5904 -1078 -6673 -7134 -1873 5165 7894 2918
1267 2918 -5126 -7271 -3199 1620 3887 4448 2066 -2233 -4634 -3177 1773 5601 4978 -783 -7145
1282 -7145 -6125 863 5960 4705 534 -2945 -4506 -3467 1661 5252 4575 328 -3749 -5161 -2511
1297 -2511 2867 5425 3065 -894 -3845 -4493 -3013 2437 6672 4693 -2318 -6360 -4531 1272 5307
1312 5307 4652 -23 -4255 -3524 -469 1191 1766 2755 833 -3040 -4038 -700 3802 4795 2138 -2404
1328 -2404 -5868 -4303 1438 5689 5199 921 -4227 -6842 -3166 4495 8081 3272 -3430 -6192 -4252
1343 -4252 -101 3714 5215 3328 -621 -4268 -5458 -2604 4442 8150 3914 -4621 -8309 -4314 2073
1358 2073 6233 5642 127 -5413 -5711 -1100 3678 5229 3088 -1664 -5396 -4767 135 3654 4136 2940
1374 2940 -391 -4857 -5839 -575 5879 6777 1322 -5596 -7838 -2900 4881 7446 2487 -2601 -4010
1389 -4010 -2784 -718 2343 4351 2526 -1324 -4333 -4019 -757 4024 5588 1770 -3775 -5227 -2169
1404 -2169 1567 5027 4086 -837 -5534 -4535 846 4861 4184 874 -3111 -4370 -2455 1391 3353 3131
1420 3131 1142 -2263 -5136 -2986 3324 6875 3862 -1652 -6137 -5852 -1036 4360 6096 2171 -3333
1435 -3333 -5773 -3729 1322 6307 6760 986 -4904 -6284 -2884 1814 4621 4307 -256 -4986 -5330 -1321
1451 -1321 3926 6618 5053 -1303 -6585 -5501 728 5338 5137 787 -4955 -7031 -3469 2969 6681
1466 6681 4604 -468 -4537 -5451 -1362 4301 6543 3158 -2064 -6159 -6330 -1875 4762 6977 2474
1481 2474 -4160 -7153 -3942 2781 7957 6673 -63 -5696 -5125 -1174 2567 4142 2434 -2089 -5648
1496 -5648 -4567 67 4725 6229 3569 -2396 -5898 -3033 3323 6331 4060 -2006 -7345 -6926 -1393
1511 -1393 4834 6097 1947 -2870 -5067 -3214 1860 6499 6317 1327 -4309 -6716 -4602 980 5591
1526 5591 5196 -1001 -6551 -6690 -1034 5488 8328 4609 -2790 -6736 -4263 1569 5012 4660 659 -4381
1542 -4381 -7200 -4707 1284 5831 5673 1018 -4349 -5735 -901 5410 6804 3003 -3146 -6631 -5570
1557 -5570 -548 4937 4878 -71 -4611 -5105 -2052 3569 7293 5290 -294 -5008 -4970 -1796 2562 5352
1573 5352 2616 -3052 -7618 -5281 894 5780 6900 2269 -3397 -5279 -2384 2438 4729 3435 -505
1588 -505 -4784 -5921 -2277 3047 4651 2519 -1832 -4513 -2644 1488 5522 4567 346 -3317 -4887
1603 -4887 -2938 1855 5130 2869 -2617 -5828 -4204 776 4698 5459 2270 -2456 -4875 -3133 1188
1618 1188 4700 4928 235 -5266 -6482 -2345 2741 4593 3261 19 -3042 -3595 -1100 2988 4787
1633 4787 2708 -2018 -5500 -4105 1189 4733 3288 -768 -3381 -3062 -1461 2273 4202 3415 -585
1648 -585 -4268 -4349 -1365 3599 5006 1584 -3179 -4924 -2781 630 3367 4516 1539 -3059 -4600 -2373
1664 -2373 2095 4827 3438 -246 -3660 -3350 -792 1588 2096 1642 138 -2599 -3604 -146 3622 3962
1680 3962 794 -2821 -3763 -1002 2481 3205 947 -1429 -2375 -2637 -1091 2121 3996 1879 -2100 -3579
1696 -3579 -1893 1284 2991 2627 -219 -2618 -3010 -1254 1071 3342 3210 -276 -4020 -3634 354 3072
1712 3072 3077 1078 -1293 -2346 -2006 -59 1639 2397 1111 -1615 -3529 -2034 1750 3432 1453 -1193
1728 -1193 -2229 -1471 -299 1146 2206 1371 -485 -2300 -2404 -435 3002 2713 -87 -2118 -1937 -19
1744 -19 1112 1364 1637 153 -1689 -2792 -671 1935 2937 1362 -1770 -2907 -1198 1007 1553 946
1760 946 793 -357 -2124 -1830 65 2159 2370 -14 -1686 -2064 -343 1655 1313 399 -204 -243 -1120 -890
1778 -890 1043 1910 511 -1375 -1474 -193 915 988 531 -594 -564 -80 -471 -51 851 1466 -29 -2327
1796 -2327 -2084 238 1764 1409 134 -793 -772 -592 -155 366 839 1042 -63 -1922 -1314 661 1226 474
1814 474 -59 219 217 -843 -630 422 1142 978 -389 -1205 -761 917 907 -293 -876 274 736 -103 -260
1833 -260 227 1077 169 -1093 -974 277 1125 1531 -267 -1037 -861 -81 8 684 1368 947 -828 -2049 -767
1852 -767 690 1413 1074 -170 -1220 -557 -233 82 562 1618 710 -1048 -2096 -762 1504 1836 431
1869 431 -666 -1114 -852 67 600 729 568 -147 -1126 -1205 326 1862 799 -1300 -1350 -808 270 514 894
1888 894 631 -673 -1365 -1085 53 1738 2217 356 -2119 -2424 -285 1477 1471 940 26 -1707 -1697 -759
1906 -759 1272 2254 1594 -665 -2008 -2038 71 1714 1370 426 -229 -1320 -1512 -1 1745 1835 53 -1629
1924 -1629 -2003 -313 1615 2023 316 -1039 -1407 -846 -394 1228 1948 750 -1518 -2289 -947 1181 2246
1941 2246 1669 -755 -1918 -1892 -120 972 1894 1472 -332 -2552 -2289 387 2360 2092 397 -1263 -2498
1958 -2498 -1109 794 2074 1551 -166 -1507 -2182 -948 1616 2677 1239 -918 -1778 -1028 286 1599
1974 1599 1907 320 -1787 -2524 -1166 780 2697 2239 -382 -2689 -2032 209 2037 2011 783 -1624
1990 -1624 -2351 -1768 331 2193 2488 973 -1912 -2955 -1596 1595 2812 2047 -118 -2017 -2368 -1075
2006 -1075 1729 2628 1280 -1276 -2652 -1896 121 2227 2550 446 -1346 -1873 -676 800 1914 1515
2022 1515 -603 -2444 -2400 -493 1577 2665 1173 -1108 -2542 -1371 1325 3322 2800 651 -1997 -3381
2038 -3381 -1582 1171 2382 1540 -672 -2413 -2560 -503 2426 3228 1974 -666 -1998 -2453 -475 1998
2054 1998 2311 334 -2321 -2947 -1341 904 2820 2040 -125 -2042 -1762 563 2044 2272 708 -1615
2070 -1615 -3049 -1898 439 1970 1824 28 -2191 -2929 -869 2225 3453 2592 -201 -2684 -2695 -461
2086 -461 2146 2275 104 -2012 -2884 -1998 660 2634 2692 545 -1367 -1650 -816 1313 2196 1520 -1262
2103 -1262 -2804 -2768 -565 1786 2364 618 -1699 -2539 -826 1837 3048 2326 -242 -2253 -2715 -1138
2119 -1138 1233 2096 1061 -976 -2803 -2393 200 2930 2911 1199 -946 -2176 -1448 647 2555 1654
2135 1654 -406 -2561 -2729 -992 958 2487 1115 -724 -1864 -986 792 2061 2278 702 -1518 -2775
2151 -2775 -1168 502 1946 1396 -610 -2267 -2129 -142 1906 2711 1590 -579 -2415 -2096 247 2081
2167 2081 1604 -114 -2210 -2416 -1313 801 2406 1940 345 -1204 -1599 -695 1235 2254 1047 -1157
2183 -1157 -2142 -1242 -3 1297 1597 340 -1504 -1871 -322 1347 1851 1590 -251 -1816 -1652 50 1437
2200 1437 1561 244 -881 -1736 -1508 82 2145 2190 649 -1374 -2034 -974 1508 2093 1070 -681 -1861
2217 -1861 -1907 -827 1216 1865 744 -587 -1562 -896 438 1542 1688 178 -1245 -1296 -895 -3 1163
2234 1163 1374 186 -1739 -1349 122 1576 1336 609 -736 -1573 -758 642 1095 892 -55 -1243 -1706
2251 -1706 -1086 1132 1872 1014 -633 -1373 -1145 -309 1081 1440 716 -910 -1530 -1426 -230 1359 1505 61
2269 61 -917 -1127 -288 471 1028 964 -201 -1134 -953 -353 599 1078 396 -1088 -1468 -730 1147 1404 595 -164
2289 -164 -1048 -959 -552 905 1340 669 -559 -1516 -1366 71 1210 1280 143 -986 -1125 -607 265 1167 1197
2308 1197 178 -847 -1287 -432 669 1217 729 -413 -1022 -668 38 258 676 624 -173 -839 -472 434 723
2327 723 370 -302 -604 -646 -135 527 787 299 -183 -613 -580 200 1005 815 -150 -942 -555 -233 439 844 633
2348 633 -286 -464 -367 -97 8 574 658 -152 -757 -268 8 542 276 -53 33 -428 -274 238 114 450 416
2369 416 -162 -542 -114 401 47 -82 -76 -93 -186 218 331 404 -15 10 -357 -308 196 343 411 -385 -488 -113 15
2392 15 -95 202 604 -136 -460 -241 -158 -4 449 486 -107 -171 -121 83 -218 378 503 195 -496 -542 53 226
2414 226 441 455 131 -378 87 -9 -67 286 173 -87 -272 -260 86 273 247 -138 158 -340 -96 245 27 237
2436 237 138 -196 -490 32 582 593 144 -300 -389 -268 -434 243 461 362 -197 -299 -353 -250 55 614 141 -320
2458 -320 -322 16 181 15 482 285 -269 -492 -251 370 526 93 -29 -429 -133 118 107 261 -58 170 -457
2479 -457 -704 396 415 250 -117 -260 -422 -222 384 701 282 42 -317 -440 -390 461 605 350 -378 -550
2499 -550 -441 -145 801 662 11 -141 -598 -154 400 416 578 61 -456 -588 108 613 448 665 -104 -744
2519 -744 -388 64 272 524 80 -417 -620 -36 590 717 24 -58 -486 -759 60 650 698 217 -425 -681 -604
2540 -604 -120 535 653 366 -348 -723 -398 -46 722 570 256 -778 -513 -153 202 846 590 -204 -665 -686
2560 -686 -84 517 401 245 -326 -537 -462 407 513 488 -297 -648 -644 -99 432 730 182 -375 -599 -478 69
2581 69 700 887 -14 -800 -682 -317 482 905 734 90 -714 -544 -260 575 952 580 -66 -549 -482 316 513
2602 513 460 112 -503 -788 -541 536 477 418 -29 -633 -633 -33 585 828 88 -447 -937 -629 312 500 794
2623 794 86 -914 -909 -464 725 861 479 -3 -923 -562 -363 212 526 606 -477 -1102 -476 40 899 906 289
2644 289 -541 -768 -524 313 544 -166 3 -833 -874 64 672 479 281 -261 -536 -584 136 982 527 241 -338
2665 -338 -826 -425 191 554 400 -541 -834 -351 38 331 685 831 -382 -657 -516 -18 478 441 133 -818
2685 -818 -1123 -383 459 777 232 15 -401 -620 113 478 775 228 -477 -702 -575 269 760 270 -217 -358
2705 -358 -72 25 322 506 473 -61 -624 -669 -247 844 650 168 -341 -598 -254 -70 664 495 178 -438 -648
2726 -648 -150 409 379 551 -202 -583 -455 -41 169 265 -136 -74 -314 -373 552 781 387 47 -416 -359 -375 230
2748 230 791 141 -135 -617 -283 -138 434 592 290 -243 -186 -305 4 445 486 -97 -397 -577 -99 286 583
2769 583 417 31 -552 -424 189 523 380 263 -37 -311 -106 -340 608 209 180 -135 -252 -79 546 503 258
2790 258 -177 -236 -317 -152 280 126 360 -431 -421 -29 122 259 388 2 -595 -201 -61 -56 330 561 -186 -349
2812 -349 -497 260 328 355 288 -224 -122 -295 374 465 79 -92 -147 -593 -108 457 358 223 -239 -367 -426 -85
2834 -85 318 403 1 -311 -400 -164 -70 334 331 104 80 -196 -137 41 213 176 -425 -403 -464 21 176 517 167 -262
2858 -262 -211 -212 121 441 433 -53 -229 -322 -237 57 427 156 -236 -327 -475 -38 417 164 164 -263 -241 -265 -80 254
2882 254 -73 -123 -350 -152 -145 -160 133 165 -136 -291 -306 14 312 472 134 169 -333 -206 230 153 388 96 -115
2905 -115 -315 -254 378 56 31 8 51 -70 -111 -134 105 302 -36 -95 -229 -79 63 16 5 -350 -157 -231 -74
2928 -74 438 -92 140 -65 -248 -125 465 333 145 -231 -192 -368 12 3 199 121 -208 -14 -241 -126 282 355
2950 355 -122 -10 -510 -113 52 344 95 -49 -137 -370 -156 211 2 221 -137 -178 46 -165 249 100 120
2971 120 -464 56 36 -108 94 386 -17 1 -233 -169 237 363 -228 -87 -89 -124 32 -29 -24 297 85 -285 -113
2994 -113 -127 234 158 297 92 -44 -121 208 214 272 -150 -3 -192 -236 -26 310 133 -77 72 70 -48 323 257
3017 257 14 -126 -247 -53 99 191 143 352 -88 -192 -101 23 -93 -186 -154 -251 -124 -96 220 104 -171 -57
3039 -57 0 -208 83 244 -16 41 -325 -63 -369 193 228 259 42 -141 -68 -269 142 24 178 -125 -140 -254
3061 -254 -166 -24 195 -16 -246 159 5 202 -88 -28 261 98 88 61 86 210 -71 162 -84 129 140 193
3083 193 -104 -66 -512 -443 69 303 146 322 88 109 -40 -111 33 163 23 229 -102 -111 25 72 264 192 -203
3106 -203 -38 -44 -144 272 291 347 5 0 172 63 16 239 59 167 -205 7 194 69 15 -195 5 -87 262
3129 262 110 232 -114 -178 -267 76 254 253 62 129 -152 28 -7 -127 -19 -150 126 104 -24 -289 142 111 -17
3152 -17 26 192 -74 27 -5 279 -35 -153 -51 123 120 -142 46 15 217 189 -73 373 7 -265 237 1
3174 1 -40 55 -368 -89 -162 -395 -108 -100 -65 28 281 201 -32 -30 -295 -25 378 6 -148 -319 115 74 403 78
3198 78 147 -24 55 -37 -57 191 -99 3 -299 21 210 -110 -69 -288 232 45 274 -11 -11 177 -10 179 27
3221 27 -368 234 -9 111 86 204 -197 -124 -135 -48 -33 -196 244 -147 165 197 -88 -214 -51 48 280 -12 133
3244 133 -107 90 -92 245 -252 19 -7 225 -325 1074 98 496 260 101 -170 -325 92 -173 -251 -501
3264 -501 287 -563 390 -103 -725 123 -441 643 -483 -50 219 -215 513 148 149 27 -55 -34 34 168 98
3285 98 148 -41 -193 142 -87 -18 -293 89 -123 197 39 16 98 25 69 177 -243 -18 27 121 23 108 -23 -159
3309 -159 -289 123 27 -82 224 334 -162 -72 -41 47 32 -44 397 -42 -134 86 52 -73 -339 -244 167 -86 308
3332 308 -165 -199 54 565 315 -642 127 -39 99 -235 166 137 -132 18 -117 -96 -214 26 156 -230 -6
3353 -6 -253 -266 -182 -164 55 159 12 -51 -69 -68 50 -159 -214 -336 119 6 -94 285 100 37 3 -149 31 59
3377 59 -35 41 211 -51 -41 31 -119 -179 46 -106 78 57 -26 117 191 -181 152 82 -58 47 -9 350 112 116
3401 116 -64 247 -6 -165 66 58 -302 -195 -152 -202 -225 -55 1 -142 -98 -158 185 -186 61 96 -60 -32 -108 273
3425 273 179 -116 22 -119 -21 348 42 -43 -91 94 -356 98 269 -98 -13 132 145 -233 -327 -51 -37 -103 55
3448 55 -24 170 47 0 -137 130 34 201 -168 98 199 216 -50 -80 -144 -39 -90 144 164 -255 -1 -204 140
3471 140 -158 167 173 174 211 -167 -79 -65 -238 14 -223 -98 -122 11 34 106 56 -146 -2 21 166 -3 259 -183
3495 -183 80 -149 49 148 44 118 -94 220 187 71 -54 -212 244 169 1 -127 103 -246 48 151 20
3516 20 -1 -221 250 34 -276 -54 -132 -169 114 -220 65 150 -153 45 7 -123 -58 356 68 94 5 -2 98 207
3540 207 -198 -28 -43 -44 -14 -81 64 79 -241 -228 -23 -105 23 16 -27 36 -89 16 39 65 -141 68 -284 307 -125
3565 -125 121 256 -85 -35 -64 -130 -83 -160 -35 -35 -98 -124 372 1 25 1 173 -58 40 398 -181 34 306 -31
3589 -31 -45 224 63 190 274 -193 199 -11 73 250 -68 -84 -209 30 -57 93 61 -26 -94 -109 -138 100 -97 159
3613 159 8 189 -21 23 51 58 184 91 -236 -340 231 1 151 247 69 -220 65 -72 254 162 107 117 -250
3636 -250 -261 77 43 -4 -81 142 107 238 -125 84 90 277 18 7 76 7 263 99 72 97 50 -177 -95 -29 196
3661 196 50 -70 177 179 183 154 238 227 -111 -93 77 -259 -158 111 140 -91 0 -161 70 147 59 -158 -48 197
3685 197 60 -130 -26 18 -11 116 61 -2 -55 -17 156 366 22 231 19 226 -286 -380 -114 95 19 91 -122
3708 -122 176 -135 -93 -23 -83 -105 -138 121 -83 -55 16 155 15 -39 42 -206 -76 -14 138 130 -176 136 58 -107
3732 -107 -81 69 -39 82 128 8 143 -124 -230 -144 -138 -42 26 185 214 54 -98 188 -126 66 39 -22 -5 -151
3756 -151 -131 255 -11 -175 5 -294 65 -95 177 -112 115 -99 46 -140 -165 147 49 12 90 -130 -166 -194
3778 -194 -106 157 63 -42 -98 139 40 35 144 70 13 -334 182 45 188 -149 125 -83 130 185 323 118 -125
3801 -125 -226 154 77 -25 -128 133 26 76 -35 -107 299 14 -94 33 -7 58 -28 84 71 -107 -56 134 -28
3824 -28 330 -85 -366 -50 8 16 106 224 100 -97 37 68 -158 -99 -147 -156 -42 85 36 -227 228 208 -171 -119
3848 -119 -192 8 2 -200 -129 112 14 155 276 -284 136 111 -238 -7 331 80 -82 -77 -27 16 7 243 93 -80
3872 -80 -49 -132 208 56 -26 73 111 272 -340 -1 -34 47 -22 27 -42 112 -52 82 -317 78 91 158 -125 61
3896 61 -194 9 20 -178 -23 -30 -74 -55 -178 88 -67 -121 -20 6 -13 -39 -16 -10 -85 -128 -176 -217 -56 -116 44 -6
3922 -6 -137 -163 214 -102 250 -105 -146 259 64 3 -191 35 -232 -52 91 -14 78 68 24 -89 61 -17 -113
3945 -113 -106 -34 -186 128 -32 -114 17 -208 -52 149 -82 -316 -210 20 -143 168 87 -91 116 86 203 171
3967 171 265 -54 -25 -148 21 -80 109 -2 -46 -73 -152 -68 191 -59 154 157 142 48 -268 -90 334 259 179 49
3991 49 42 30 271 115 -58 -95 -16 -42 132 -245 -348 -19 -47 -137 62 142 69 179 -90 -77 -95 43 -138 92
4015 92 42 -118 -16 13 150 231 58 109 -337 -75 -59 62 126 -274 -279 141 219 31 -18 216 217 -67 -46 215 91
4040 91 148 102 -33 -40 -214 -101 221 -108 -163 67 -35 284 134 34 -9 -340 -217 3 -184 112 -93 -58 281
4063 281 -115 186 24 -180 73 -140 -31 -162 185 85 50 273 -4 108 -40 52 12 -192 -201 -50 -32 10
4085 10 -7 20 120 257 10 -56 171 41 -24 102 39 -169 -103 13 96 -112 27 16 38 208 99 43 -130 280
4109 280 156 131 -344 126 145 24 -77 36 -108 -79 -142 101 357 165 -39 -97 170 -69 308 104 79 -240
4131 -240 112 88 149 -212 100 111 -252 85 -172 -22 88 -170 32 186 -105 300 1 237 8 -58 -101 198
4153 198 43 -98 -89 23 -50 -64 -27 125 137 -124 121 180 56 -4 477 31 263 -150 219 0 -1 -91 127 -149
4177 -149 52 194 -51 -70 -139 -182 179 -150 -230 16 -247 223 16 55 298 -15 5 145 -170 -388 -150 -31
4199 -31 -61 154 20 -326 33 -161 163 282 198 236 -54 -178 63 97 -207 22 80 -238 -110 -132 176 145 141
4222 141 -154 -279 61 -9 -21 -20 -61 123 90 -237 -2 12 -61 94 -109 -233 -53 -386 155 -4 2 -67 6 -181
4246 -181 48 -96 -101 -122 -112 -58 -56 186 -144 8 190 -77 335 135 88 -179 127 -15 113 90 -11 -319 -160
4269 -160 -300 290 44 127 -37 106 -174 -20 5 81 -84 -25 -154 -46 -95 -297 113 98 90 -214 -79 107 61
4292 61 -89 -4 -169 97 132 191 196 -130 149 215 -54 -152 -35 3 21 -251 -50 174 -92 89 -127 -43 68 -49
4316 -49 -108 206 61 12 -8 -61 127 62 -33 61 250 -9 -268 -59 261 -82 52 21 -339 146 -48 360 101
4339 101 43 -80 -57 -42 -70 313 140 -35 230 193 116 -242 17 -128 92 133 -65 227 -149 96 239 74
4361 74 -75 -32 -85 -15 26 -219 231 49 -136 -58 31 -23 -101 -39 4 -17 130 -29 -18 158 -109 -255 -193 -128 -55
4386 -55 6 46 197 -32 -283 -111 142 475 -10 -224 104 -142 89 181 -228 -12 -88 -250 37 209 26 85
4408 85 -52 328 -27 70 22 217 -93 -147 113 84 220 92 -158 -76 -1 -69 -174 -163 -131 -132 102 -103 -55 -32 402
4433 402 -216 -154 73 8 53 -167 157 -57 -131 -123 40 -99 41 -56 177 -20 21 -38 -73 -33 163 -256 -84 -48
4457 -48 44 -90 -77 189 -223 -71 454 159 154 143 172 9 -290 -43 53 97 31 -42 34 157 -278 -53 44 80 219
4482 219 70 -167 -73 129 -6 73 -168 -96 -125 -25 249 -23 -3 21 -58 252 196 208 129 166 -118 -106 27 89
4506 89 -305 -101 -134 -31 203 10 259 -126 -84 -119 8 57 40 17 -224 23 -59 -171 94 64 -147 -186 -64
4529 -64 -267 -19 132 -155 34 -114 -28 26 -75 -110 -81 -153 -48 240 3 303 113 211 47 229 212 -123 -61
4552 -61 -77 102 48 34 0 -283 -214 32 108 -80 -176 -26 -155 -179 -76 8 -84 -195 -178 75 -24 331 -214 191
4576 191 75 -95 82 -76 181 263 -21 -84 -185 0 20 88 0 -58 45 -333 -6 -93 -55 312 -57 -184 20
4599 20 89 137 8 -41 -55 -82 -30 7 269 -58 -12 -87 182 322 222 160 144 -11 -22 15 304 -118 41 62 40
4624 40 -182 -164 90 46 -95 -143 146 188 135 -65 197 -44 -209 23 6 -105 122 -270 -313 -152 244 90 -292
4647 -292 41 107 -103 -172 64 -40 125 66 -141 143 -70 -239 4 44 -73 81 132 -88 73 260 54 125
4669 125 -204 80 -80 3 -93 188 -362 -121 72 133 219 -55 -42 -62 -64 8 -99 -192 -70 -75 170 -378 -87 45
4693 45 -99 0 -6 -112 163 144 -97 0 158 -186 -20 154 -38 96 191 -58 156 160 79 -100 74 -150 251
4716 251 210 -210 368 57 -136 -173 219 129 213 193 119 -136 -125 -133 -82 46 -35 49 -248 -145 130 62 46 -149 311
4741 311 23 82 75 -52 226 67 -199 116 -168 3 -91 -170 77 -99 178 -130 190 9 -231 28 328 54
4763 54 -49 22 280 287 86 -207 105 -242 96 -189 111 52 -191 201 63 40 168 218 -285 -407 46 214
4785 214 221 133 136 15 -39 -160 184 92 259 -61 -157 -158 -129 46 -106 49 251 39 -112 54 -143 38 233 -93
4809 -93 95 22 31 282 21 -328 40 1 -218 -63 65 115 -44 -333 114 -211 9 402 93 51 -171 -76 -221
4832 -221 113 65 -108 107 -58 -214 17 -221 -49 0 -42 -121 -148 -58 -217 11 -86 16 27 -34 11 67 50 -75
4856 -75 233 -96 -140 -20 103 29 25 13 295 292 223 -57 -65 -138 149 -54 -33 -211 115 -122 69 -11 -106 -9 128
4881 128 -94 73 -66 9 143 -97 -145 -33 16 -3 84 277 -131 -13 56 -151 203 -225 111 203 -163 -83 -175
4904 -175 -59 103 14 -112 140 -468 76 104 -17 -210 -31 -67 -101 -74 -152 -90 344 190 -58 21 -12 69 267
4927 267 161 -177 -73 -87 212 -61 9 128 -129 -61 -119 -110 82 120 -192 -121 -255 53 112 -63 162 -22 -120
4950 -120 -99 -79 -68 164 -155 137 99 130 -216 -42 -59 -121 31 13 177 -92 92 145 67 -47 -87 -5 -32 58 48
4975 48 -14 -182 53 184 227 283 96 74 -59 196 9 1 -43 85 156 -144 303 248 -1 -235 -141 -121 -25 -158
4999 -158 -157 -262 -45 -25 -31 -91 -70 -164 -10 -151 151 376 105 -20 361 331 -57 -235 -350 181 115 7 -12 -52
5023 -52 -76 -47 -2 37 189 48 33 -89 68 213 132 -143 220 94 -65 147 115 -3 79 42 48 -160 -16 122
5047 122 71 219 -173 153 148 71 89 -1 -273 49 -59 286 -143 149 173 11 10 -6 156 66 -64 65 143 -275
5071 -275 -61 106 269 7 -22 -11 14 42 178 -26 276 -119 -99 232 380 -143 33 123 -20 78 -74 143
5093 143 -51 139 -203 -58 187 194 219 108 -20 169 294 88 -14 37 -43 -354 -176 -9 -66 -111 66 -174
5115 -174 70 13 -22 158 -40 -106 -114 36 -161 -44 -40 68 -90 114 -32 207 -38 -123 -93 -66 -138 118 18 16
5139 16 168 -229 294 -197 -25 92 -16 -42 134 216 -187 -13 -117 128 80 181 134 204 57 -43 -186 -92
5161 -92 -149 -25 60 23 -1 -76 -68 129 -6 -11 -122 20 -248 270 10 -70 -281 335 -5 42 201 -248 122 119 -139
5186 -139 65 195 -36 115 193 -142 177 -7 -91 125 -74 116 -68 0 -61 -105 -298 1 100 -111 52 61 -129
5209 -129 -141 -208 -124 -147 243 90 -192 -198 73 -14 -129 -20 123 96 7 -32 -3 91 107 80 -47 -82 -162 -114 41 -26
5235 -26 85 191 -176 -32 64 176 11 -163 -36 -212 -41 -200 246 258 -56 -147 -92 -132 -20 68 -99 -272
5257 -272 -131 346 -86 61 86 57 54 -168 135 -40 125 136 28 -162 69 242 277 -116 -59 75 -52 -163
5279 -163 141 234 282 -47 75 62 215 121 -96 76 -12 31 -43 157 -76 -27 182 108 42 51 39 165 180 -156 -26
5304 -26 -56 -50 -85 -52 -139 -108 154 8 59 -134 144 13 -232 -11 -187 61 262 -33 -153 137 -276 151 135
5327 135 -54 96 276 326 41 -51 -40 -83 157 -41 -83 -130 2 0 -55 192 -57 -261 -30 174 -43 -107 46
5350 46 170 -299 -96 55 248 -122 2 -123 236 174 -113 -62 -128 -48 -39 -20 117 180 185 -38 -252 -141 146 -79
5374 -79 -166 483 95 -142 -103 213 166 -47 -56 -105 -37 -22 -139 38 62 -23 57 -260 -123 160 139 16 -35 62 -67
5399 -67 50 242 71 111 22 -63 238 114 35 28 -230 -174 -95 -233 64 -125 81 -23 -214 -27 -228 -78 257
5422 257 -64 -143 29 100 -52 -2 75 -79 187 55 138 -99 -55 -58 50 -143 163 31 195 107 65 150 -118 -58
5446 -58 -322 83 95 -89 75 -244 179 -2 -132 -30 -61 62 76 42 109 -96 100 167 39 -61 58 44 105
5469 105 163 93 -157 127 -86 43 174 -140 -35 73 136 -86 232 243 41 -7 159 -90 177 4 -186 -97
5491 -97 168 103 135 118 40 228 -85 -124 -79 54 19 75 -186 -28 -110 132 -10 31 18 -140 100 38 39 -102 28
5516 28 -142 54 473 103 40 143 -101 -265 32 -114 -7 -15 229 128 -82 -145 -7 -9 39 -161 -159 -102 77 78
5540 78 -2 -49 -58 74 187 -29 230 -14 54 26 -111 37 17 95 -87 -162 447 95 115 107 -229 166 60 21 73
5565 73 75 -220 -61 127 -98 21 -69 -180 -36 44 -24 56 -325 -64 69 -29 -72 -42 62 70 77 189 -175 32 -66
5590 -66 -47 -57 45 126 63 -21 -56 -159 -228 -146 145 124 143 14 -180 80 -299 -18 32 40 97 -340 67 164 -178
5615 -178 154 81 13 78 -58 35 100 -34 -53 -141 -135 144 -174 -67 65 170 -247 -20 -83 -118 -168 154 -9 -128
5639 -128 -15 31 137 71 45 -212 -144 179 167 -340 188 -86 -137 191 -136 274 102 103 289 122 -55 -292 -84
5662 -84 104 -15 14 -317 -78 -99 -99 13 -92 -54 199 147 -197 82 -119 -255 -46 152 257 -180 177 -24
5684 -24 296 -343 -143 -195 -49 -15 109 203 -114 -22 -240 204 -46 -23 30 50 177 -72 162 202 -23 -298 108
5707 108 -130 -133 91 -287 -148 29 -70 70 -134 -13 -20 258 -65 -96 356 148 148 -235 -79 -119 177 308 -230
5730 -230 -38 -17 84 311 -55 48 -110 -72 161 206 -138 127 30 -117 90 -46 125 -190 -20 76 80 107 162
5753 162 -165 -406 127 199 84 -30 97 321 -173 187 -7 -173 205 -15 -190 -242 16 -12 24 180 78
5774 78 -106 267 -39 -153 -277 -6 165 159 48 -45 -136 -36 32 119 -136 33 220 109 50 107 26 50 167 -116
5798 -116 149 4 42 -170 110 -139 -142 -202 81 6 -14 375 -107 -71 -54 -108 -44 270 -263 43 83 116 -6 81
5822 81 -121 -79 574 35 -78 -16 84 -31 -47 -61 -14 -89 213 -135 24 46 18 -80 -203 39 -27 -213 -58 -19
5846 -19 -298 81 120 -83 41 108 150 255 87 48 127 -189 97 143 40 42 202 111 -199 -39 -214 -16 -99 143
5870 143 253 283 79 -2 -247 -127 193 46 76 -241 95 33 -120 -48 19 15 24 -52 96 481 177 -116 63 83
5894 83 138 106 -91 -186 364 62 216 0 -115 -104 -81 64 83 -76 -102 -250 -33 -15 68 -20 -134 241 -76 31
5918 31 68 -87 68 -117 -117 134 114 9 -127 -213 35 -54 -157 -279 112 61 16 -313 168 178 -165 13 -218
5941 -218 71 -226 186 -138 102 -38 -231 102 150 152 7 65 -193 -278 37 32 -130 -70 17 -63 -29 77 -119 -13
5965 -13 -25 112 166 -25 75 91 11 25 -8 315 -209 80 -135 -33 -137 -92 41 87 147 87 -72 -52 -35 -33 -85
5990 -85 -20 -123 18 1 275 -116 180 -248 -69 90 -77 202 -6 -42 192 299 -76 -104 78 60 29 -59 46
6013 46 -127 257 -26 71 -184 373 -115 -93 -273 141 -74 29 96 -163 22 -41 -62 142 -57 201 3 -199
6035 -199 -64 -10 3 -8 -20 -165 127 -352 189 69 173 -524 113 88 -38 -29 -199 415 51 -96 -207 241
6057 241 -128 121 -8 152 74 -61 206 -32 30 102 181 352 -178 66 152 61 -89 -37 101 91 -29 12 95
6080 95 -291 -95 99 -7 -35 140 146 43 -26 136 69 -62 -64 60 -63 -140 249 81 -95 130 40 64 175 -146
6104 -146 16 21 -108 40 -6 -9 140 -75 179 -64 173 100 67 -180 -4 80 -70 113 115 197 153 181 -168 195
6128 195 23 17 128 116 -347 84 78 62 -75 -173 138 -259 30 -37 -142 -2 6 156 7 24 -53 2 -11 -142 -21
6153 -21 127 119 134 -35 -160 -383 -190 -124 34 -249 -132 400 156 132 -87 -152 -87 -186 216 -333 42 88 -86
6176 -86 -69 192 -168 -114 187 181 -36 -144 -94 25 -82 -222 -9 460 153 -225 48 -141 98 211 98 -75
6198 -75 45 -82 -44 352 -275 -19 -40 16 264 -35 61 60 21 84 -308 11 -76 30 -17 242 96 225 -211 -140
6222 -140 -14 -83 -21 44 131 -29 151 -25 189 190 154 59 -6 -41 66 -137 -125 -46 75 -51 18 -104 -56 0 -293
6247 -293 -305 -105 16 -126 7 125 45 -257 50 -101 56 -98 12 -140 -10 250 -185 -38 109 88 -11
6268 -11 -230 -112 199 69 -90 45 111 -12 -21 53 -107 123 298 111 37 -52 81 -143 -104 136 -233 64 137
6291 137 99 -25 -154 -167 -61 22 -87 -37 141 114 -11 361 22 244 -1 99 -12 145 101 -30 -125 -68 -89
6314 -89 -190 2 -156 -24 24 -75 -93 -272 -19 -71 -36 -74 -54 162 262 97 16 -186 -194 125 -208 209 -40 -17
6338 -17 45 6 103 -13 57 1 -181 331 -31 -228 72 -57 -17 35 66 -329 -74 86 231 149 223 89 -10 84
6362 84 331 59 272 268 -42 -177 -16 235 -96 -32 121 -211 0 -44 56 63 -55 83 -138 112 117 -23 161
6385 161 -40 -212 -32 -64 -304 79 -113 45 54 213 6 -3 355 -30 52 -35 -99 181 59 -99 -15 38 -78
6408 -78 111 84 79 19 -37 49 182 -182 30 -65 -35 -36 89 -191 -78 81 13 56 170 69 50 -166 -258 204 -184
6433 -184 235 138 -29 172 -140 194 219 66 -169 214 -145 -319 -219 -131 164 -232 -11 -106 26 32 -162 -296
6455 -296 -29 99 -47 283 59 8 -222 -96 -104 -73 209 -237 54 -178 -62 -146 141 -160 48 164 127 -69
6477 -69 154 -54 -179 235 63 -110 -180 133 334 -27 -199 16 24 -97 -463 -70 241 -219 -117 11 69 -301
6499 -301 -33 -52 -159 50 291 -178 149 -152 105 79 -120 158 -38 -321 132 0 -148 57 136 -185 95
6520 95 48 2 -43 -138 65 132 40 45 -28 142 207 82 18 71 -3 -70 31 -3 -137 -139 -39 69 80 2 -142 125 106
6547 106 111 365 224 -66 394 -168 -6 -106 -265 -20 -35 146 30 28 -17 -111 -135 -149 -83 75 4 -97 -133 98
6571 98 48 74 261 -112 -12 6 -18 80 116 -97 105 1 173 -193 -212 209 241 -15 171 44 -157 71 -173
6594 -173 -14 111 165 32 70 56 -60 -169 9 93 218 63 236 168 97 182 -67 132 -97 4 164 124 -782
6617 -782 -127 24 -32 83 -73 14 117 160 155 287 6 -177 72 -5 51 153 207 -76 -189 -45 154 16 -135
6640 -135 40 -33 -198 -27 28 -40 230 -194 66 -204 81 25 -129 223 -7 -48 -147 -230 -15 -105 -141 -11 88
6663 88 46 22 -84 78 29 -185 180 120 -11 64 324 56 85 91 389 -46 -156 5 -122 -211 -69 223 -68
6686 -68 -308 109 -257 156 26 50 43 94 -37 134 50 -137 342 -1 68 -236 190 84 33 -14 -292 57 -38
6709 -38 114 300 -63 -131 268 -51 187 186 24 32 -22 41 -261 -70 326 89 150 -77 -234 -10 22 238 84
6732 84 -406 -120 102 -231 -803 -4 35 -44 15 -136 353 -734 30 374 -21 -400 229 -69 -34 -263 -409
6753 -409 -217 34 62 -530 86 -600 -499 -420 602 -334 165 -411 298 -354 318 472 117 -38 160 -514
6773 -514 821 -332 50 227 -21 562 -171 -302 -504 50 436 404 124 141 263 211 -400 360 -139 60
6793 60 -105 -222 -420 251 -74 145 62 -169 -19 -211 -6 -163 -86 -249 3 72 190 -190 -284 -2 131 130
6815 130 -105 58 235 131 112 67 -76 -79 -135 20 23 -17 -3 44 -3 32 -85 -13 114 79 46 103 -26 10 12 -63 193
6842 193 -118 93 72 104 -83 -116 -112 -245 -125 28 -33 -128 -149 -186 -12 169 -151 -398 35 79 183 -75 -102 125
6866 125 -118 -40 89 -236 -224 42 -393 -167 74 19 193 27 93 -131 -229 -203 -8 15 -92 5 51 -37 -72 -122
6890 -122 66 -15 28 159 86 -268 67 -182 122 -39 -299 15 -76 -7 -50 321 48 37 83 132 -54 -313 -13
6913 -13 -195 -70 -16 31 -231 -231 -53 -89 -91 113 -87 223 -123 53 87 -283 109 -96 73 -110 -49 -126 46 52
6937 52 -107 -119 93 80 -109 -68 91 -49 -111 -44 -111 -162 -3 173 36 -115 34 -108 -282 155 145 -49 123
6960 123 -46 285 18 -62 54 -82 99 -31 -217 -92 167 -129 -214 77 110 -61 51 44 -36 217 64 84
6982 84 27 -16 107 178 -14 -72 68 -195 285 43 63 -3 5 -162 -7 -63 36 224 154 75 144 297 247 95 -185
7007 -185 -166 -222 71 95 57 174 198 -55 -13 218 -142 52 225 -334 80 126 -3 195 2 -126 1 -91 -174
7030 -174 103 -80 124 33 -66 -80 -129 -46 -35 -137 11 -214 78 -1 -245 -31 -193 -77 93 64 -202 64 -1
7053 -1 -258 -57 240 24 153 87 9 58 79 -312 102 290 -125 -220 -96 -134 96 -101 136 -38 -163 189 113
7076 113 64 -131 181 -34 -87 -53 -1 455 -54 70 -103 13 -219 110 104 -84 -88 -255 -22 -125 -160 -12 141
7099 141 58 76 -103 -171 -16 199 -88 -5 120 -5 28 -195 -141 -192 -130 -74 52 -15 8 -24 26 -12 -42 62 147
7124 147 -166 134 -189 181 204 -4 162 -177 3 -106 235 -94 -117 22 132 85 46 4 -24 -271 307 50
7146 50 181 166 54 -49 -177 312 -229 70 34 -14 -113 -145 -147 20 132 -175 229 40 85 205 161 -26 -46 198
7170 198 -226 19 -2 29 219 295 104 136 -11 86 -116 43 -30 88 -100 -24 -162 191 -43 26 -133 168 107
7193 107 67 -125 11 -60 197 106 -100 -135 56 -63 213 -165 -94 99 2 163 46 -40 -93 256 -20 95 84
7216 84 54 -129 -195 -25 88 -3 -8 -1 4 188 -207 -14 -29 -60 -110 264 -366 -147 224 194 87 -27 -91 -64 12 -2
7242 -2 -1 -42 -59 -111 86 97 -15 -99 258 288 -149 -241 -55 -10 -158 -128 330 -2 59 133 98 -206 -176 154 -374 -159
7268 -159 206 -27 7 95 11 15 41 -300 22 -85 -111 157 -150 -1 246 86 -72 -57 -91 -164 39 97 -48 -115
7292 -115 -36 -4 -169 199 -146 305 13 -3 -58 234 192 33 58 69 -82 -77 119 30 -227 -237 -170 84 115 -176
7316 -176 92 -95 -131 -36 132 -172 -42 4 8 136 -173 241 100 81 107 193 32 -11 -35 -15 33 -57 23 -70 101
7341 101 -64 6 -138 165 19 -85 167 -30 -49 -166 -7 -65 70 19 -166 15 -49 327 -52 -240 -166 91
7363 91 -200 160 238 360 145 57 68 83 35 -71 -80 -118 119 29 74 -24 223 25 -30 77 -93 -186 12 -8 -29
7388 -29 52 33 -152 55 -193 134 -13 -452 -228 336 -80 113 66 27 -10 108 -140 -160 54 48 121 -8 24 117
7412 117 -63 1 53 -52 -2 -129 -86 113 134 -170 258 -153 -232 -46 -69 -130 305 -225 -30 -24 -199 -46 26 6
7436 6 65 172 231 -80 59 34 -175 58 144 -19 45 -8 59 -15 52 -141 6 42 64 -34 56 -136 238 296 -232
7461 -232 0 20 149 208 267 -44 207 3 31 95 -160 -420 66 -246 -138 -101 -2 104 66 -124 -269 55 197
7484 197 -19 -152 -153 40 19 34 -342 -4 -101 -67 -262 -166 99 146 -83 240 40 -53 -53 -25 -58 60 -121 -75 37
7509 37 35 -100 208 -8 158 95 -136 -157 -205 26 -106 -58 -329 4 15 -225 -12 -147 -81 24 -1 -84 244 127
7533 127 -43 -76 -141 2 123 57 -182 -174 -115 -144 -16 -17 -144 -80 8 70 50 300 -227 -183 31 -16 -20 61 24 163
7559 163 82 75 -56 121 143 -32 93 -13 -37 -219 -40 -88 -6 48 141 131 -112 -103 211 46 74 -16 -83 336 2
7584 2 -203 -162 -69 -153 -50 -18 -330 -98 207 -99 -37 -548 29 278 106 52 -15 -84 -98 19 252 187 -99 155
7608 155 -178 -23 124 28 145 30 59 -71 -5 -256 87 148 139 143 -16 -346 -110 5 -84 169 58 -200 69
7631 69 465 127 58 14 15 164 60 -326 -23 -38 -21 1 -130 -100 88 50 -43 -1 333 61 152 73 125 147 143 -103
7657 -103 -86 106 35 -11 46 202 32 -153 -154 -165 -112 42 -64 -167 289 122 44 197 -87 166 101 64 -50 -20
7681 -20 194 92 -305 77 -34 -11 75 -89 64 79 125 -101 172 27 92 -176 93 -113 12 -7 -14 205 93
7704 93 -20 -129 22 -102 89 280 79 -80 106 6 -349 -36 -220 158 -98 38 -313 -157 158 -300
7724 -300 -121 -50 -49 146 147 -187 352 -43 -138 -103 -112 32 -132 484 -89 -253 -357 -45 99 258 -55 65 -51
7747 -51 -62 0 -48 300 -33 -431 -208 -82 206 324 -146 -43 -215 186 9 -104 -418 -25 -4 21 -29 -88 -174
7770 -174 280 112 216 6 466 208 -159 -96 149 59 371 -537 128 306 -13 -403 -101 247 33 -13 56
7791 56 -655 22 38 -276 469 5 -89 224 514 336 54 -74 285 159 109 86 177 76 524 270 -138 60
7813 60 -66 -5 -2 58 -216 98 194 -90 130 -244 -239 103 -3 -90 47 254 64 -127 82 29 257 107 191 2
7837 2 -64 27 375 133 -91 83 41 374 -68 128 110 53 -277 76 -143 196 -78 124 -88 -16 -307 -104 66
7860 66 118 135 -221 121 6 133 -120 -135 -247 35 -102 -132 205 37 -257 173 -207 159 -235 -208 90 -304
7882 -304 -16 46 -88 175 43 130 -27 61 115 -159 -87 12 54 -103 -13 7 28 41 62 5 4 -31 159 172 -21 47
7908 47 -240 57 -169 -191 -15 -107 210 -71 285 153 -121 132 41 45 157 -87 111 -251 311 84 143 -11
7930 -11 152 94 57 152 -123 124 -340 -162 -48 192 -222 -82 165 6 -157 169 -316 161 195 42 -103 106
7952 106 -144 -84 -68 4 40 -134 -13 140 158 -12 -206 -108 -45 -162 -229 -107 -36 126 -155 17 163 -67 -385
7975 -385 -76 -50 -249 -68 -60 92 45 216 62 210 75 58 13 88 21 -104 -150 151 -73 -283 -317 51 190
7998 190 128 -216 11 148 -115 -17 -110 -44 -108 304 -64 -27 245 -148 80 -187 -131 133 -9 -105 32 104 108 42
8022 42 -248 -7 164 11 -104 -80 -73 101 34 -54 -55 67 -88 36 -143 -11 -343 116 256 -146 -119 -209 -31
8045 -31 69 -26 -269 -64 -145 -61 235 104 -41 119 -45 -176 -5 105 52 250 -92 12 196 -13 -121 -186
8067 -186 89 -25 175 24 -149 233 69 -218 248 92 -139 225 -403 -295 -198 251 -293 -453 -153 562
8087 562 742 537 -662 347 109 534 282 -40 -122 -320 118 -163 -274 -142 616 -116 -39 62 -142 -139 -103
8108 -103 -68 243 80 222 -163 225 -205 203 94 49 60 -11 -92 -22 194 -88 -105 33 -79 -151 16 -109 -132
8131 -132 -90 -101 85 164 145 136 179 -277 54 -214 -294 372 85 24 -268 -35 -73 -283 -46 53 -62 12 -137 -11
8155 -11 64 -112 -12 -182 85 200 44 62 -57 108 -144 -48 -297 22 -41 -28 268 -37 42 -80 207 90
8177 90 -75 -14 11 175 53 168 -82 -274 -29 -100 190 49 -104 42
8191D2
##END NTUPLES=NMR FID
##END=
