##TITLE=1H_Pr-D
 DMSO,100 sc, 
 11.02.2021
##JCAMPDX= 6.0         $$ Bruker NMR JCAMP-DX V2.0
##DATA TYPE= NMR FID
##DATA CLASS= NTUPLES
##ORIGIN= UXNMR, Bruker Analytische Messtechnik GmbH
##OWNER= root
$$ XWIN-NMR		Version 3.5
$$ Thu Feb 11 12:54:19 2021 Russian Standard Time (UT+4h)  she@DPX200
##.OBSERVE FREQUENCY= 200.1315066352
##.OBSERVE NUCLEUS= ^1H
##.DELAY= (6, 6)
##.ACQUISITION MODE= SIMULTANEOUS
##.ACQUISITION SCHEME= undefined
##.AVERAGES= 100
##.DIGITISER RES= 18
##SPECTROMETER/DATA SYSTEM= spect
##.PULSE SEQUENCE= zg30
##.SOLVENT NAME= DMSO
##.SHIFT REFERENCE= (INTERNAL, DMSO, 0, 15.7039)
##AUDIT TRAIL= $$ (NUMBER, WHEN, WHO, WHERE, WHAT)
$$ ##TITLE= Audit trail, XWIN-NMR		Version 3.5
$$ ##JCAMPDX= 5.01
$$ ##ORIGIN= Bruker BioSpin GmbH
$$ ##OWNER= she
$$ F:/spectra/data/she/nmr/H-F/1/audita.txt
$$ ##AUDIT TRAIL=  $$ (NUMBER, WHEN, WHO, WHERE, WHAT)
(   1,<2021-02-11 12:45:20.76 +0400>,<she>,<DPX200>,
      <created by zg, POWCHK disabled, PULCHK disabled
       configuration hash MD5:
       00 E9 B6 7A A2 85 ED C7 34 08 36 98 17 FE 4E 26
       data hash MD5: 16K
       AC C9 A5 0C FA 4B FD B0 73 4D EE DA EE 5F 9C CE>)
$$ ##END=
$$ 
$$ hash MD5
$$ D6 96 12 F2 92 E8 90 70 1D 46 05 C1 F7 85 42 44
##$RELAX= 
##$RELAX= 
##$RELAX= 
##$RELAX= 
##$RELAX= 
##$RELAX= 
$$ Bruker specific parameters
$$ --------------------------
##$DU= <F:/spectra>
##$EXPNO= 1
##$NAME= <H-F>
##$PROCNO= 1
##$TYPE= <nmr>
##$USER= <she>
##$AMP= (0..31)
100 100 100 100 100 100 100 100 100 100 100 100 100 100 100 100 100 100 
100 100 100 100 100 100 100 100 100 100 100 100 100 100 
##$AQSEQ= 0
##$AQ_mod= 1
##$AUNM= <au_zg>
##$AUTOPOS= <>
##$BF1= 200.13
##$BF2= 200.13
##$BF3= 200.13
##$BF4= 200.13
##$BF5= 200.13
##$BF6= 200.13
##$BF7= 200.13
##$BF8= 200.13
##$BYTORDA= 1
##$CFDGTYP= 0
##$CFRGTYP= 5
##$CHEMSTR= <none>
##$CNST= (0..31)
1 1 145 1 1 1 1 1 1 1 1 1 1 1 1 1 1 1 1 1 1 1 1 1 1 1 1 1 1 1 1 1 
##$CPDPRG= <>
##$CPDPRG1= <>
##$CPDPRG2= <>
##$CPDPRG3= <>
##$CPDPRG4= <mlev>
##$CPDPRG5= <mlev>
##$CPDPRG6= <mlev>
##$CPDPRG7= <mlev>
##$CPDPRG8= <mlev>
##$CPDPRGB= <>
##$CPDPRGT= <>
##$D= (0..31)
0 1.2 0 0 0 0 0 0 0 0.06 0 0.03 0 0 0 0 0.0002 0 0 0 0 0 0 0 0 0 0 0 0 
0 0 0 
##$DATE= 1613033120
##$DBL= (0..7)
120 120 120 120 120 120 120 120 
##$DBP= (0..7)
150 150 150 150 150 150 150 150 
##$DBP07= 0
##$DBPNAM0= <>
##$DBPNAM1= <>
##$DBPNAM2= <>
##$DBPNAM3= <>
##$DBPNAM4= <>
##$DBPNAM5= <>
##$DBPNAM6= <>
##$DBPNAM7= <>
##$DBPOAL= (0..7)
0.5 0.5 0.5 0.5 0.5 0.5 0.5 0.5 
##$DBPOFFS= (0..7)
0 0 0 0 0 0 0 0 
##$DE= 6
##$DECBNUC= <off>
##$DECIM= 32
##$DECNUC= <off>
##$DECSTAT= 4
##$DIGMOD= 1
##$DIGTYP= 9
##$DL= (0..7)
0 120 120 120 120 120 120 120 
##$DP= (0..7)
150 150 150 150 150 150 150 150 
##$DP07= 0
##$DPNAME0= <>
##$DPNAME1= <>
##$DPNAME2= <>
##$DPNAME3= <>
##$DPNAME4= <>
##$DPNAME5= <>
##$DPNAME6= <>
##$DPNAME7= <>
##$DPOAL= (0..7)
0.5 0.5 0.5 0.5 0.5 0.5 0.5 0.5 
##$DPOFFS= (0..7)
0 0 0 0 0 0 0 0 
##$DQDMODE= 0
##$DR= 18
##$DS= 0
##$DSLIST= <SSSSSSSSSSSSSSS>
$$ [...]
##$SUBNAM2= <"">
##$SUBNAM3= <"">
##$SUBNAM4= <"">
##$SUBNAM5= <"">
##$SUBNAM6= <"">
##$SUBNAM7= <"">
##$SUBNAM8= <"">
##$SUBNAM9= <"">
##$SW= 16.9725356469052
##$SWIBOX= (0..15)
0 0 2 0 0 0 0 0 0 0 0 0 0 0 0 0 
##$SW_h= 3396.73913043478
##$TD= 16384
##$TD0= 1
##$TE= 0
##$TE2= 300
##$TE3= 300
##$TEG= 300
##$TL= (0..7)
0 120 120 120 120 120 120 120 
##$TP= (0..7)
150 150 150 150 150 150 150 150 
##$TP07= 0
##$TPNAME0= <>
##$TPNAME1= <>
##$TPNAME2= <>
##$TPNAME3= <>
##$TPNAME4= <>
##$TPNAME5= <>
##$TPNAME6= <>
##$TPNAME7= <>
##$TPOAL= (0..7)
0.5 0.5 0.5 0.5 0.5 0.5 0.5 0.5 
##$TPOFFS= (0..7)
0 0 0 0 0 0 0 0 
##$TUNHIN= 0
##$TUNHOUT= 0
##$TUNXOUT= 0
##$USERA1= <user>
##$USERA2= <user>
##$USERA3= <user>
##$USERA4= <user>
##$USERA5= <user>
##$V9= 5
##$VALIST= <valist>
##$VCLIST= <CCCCCCCCCCCCCCC>
##$VD= 0
##$VDLIST= <DDDDDDDDDDDDDDD>
##$VPLIST= <PPPPPPPPPPPPPPP>
##$VTLIST= <TTTTTTTTTTTTTTT>
##$WBST= 1024
##$WBSW= 4
##$XGAIN= (0..3)
0 0 0 0 
##$XL= 0
##$YL= 0
##$YMAX_a= 542131
##$YMIN_a= -454508
##$ZGOPTNS= <>
##$ZL1= 120
##$ZL2= 120
##$ZL3= 120
##$ZL4= 120
##$ABSF1= 10
##$ABSF2= 0
##$ABSG= 5
##$ABSL= 3
##$ALPHA= 0
##$AQORDER= 0
##$ASSFAC= 0
##$ASSFACI= 0
##$ASSFACX= 0
##$ASSWID= 0
##$AUNMP= <proc_1d>
##$AZFE= 0.1
##$AZFW= 0.1
##$BCFW= 1
##$BC_mod= 2
##$BYTORDP= 1
##$COROFFS= 0
##$CY= 11.3945322036743
##$DATMOD= 1
##$DC= 2
##$DFILT= <>
##$DTYPP= 0
##$F1P= 15.9154993809931
##$F2P= -4.1035820241983
##$FCOR= 0.5
##$FTSIZE= 0
##$FT_mod= 4
##$GAMMA= 1
##$GB= 0.15
##$INTBC= 1
##$INTSCL= 1
##$ISEN= 128
##$LB= 0.24
##$LEV0= 0
##$LPBIN= 0
##$MAXI= 10000
##$MC2= 0
##$MEAN= 0
##$ME_mod= 0
##$MI= 1.114404
##$NCOEF= 0
##$NC_proc= 0
##$NLEV= 6
##$NOISF1= 3.799351
##$NOISF2= 2.8
##$NSP= 1
##$NTH_PI= 0
##$NZP= 0
##$OFFSET= 15.70392
##$PC= 1
##$PHC0= -10755.85
##$PHC1= 9.600948
##$PH_mod= 1
##$PKNL= yes
##$PPARMOD= 0
##$PSCAL= 0
##$PSIGN= 0
##$REVERSE= no
##$SF= 200.130013532006
##$SI= 16384
##$SIGF1= 3
##$SIGF2= 2
##$SINO= 400
##$SIOLD= 16384
##$SREGLST= <1H.CDCl3>
##$SSB= 0
##$STSI= 0
##$STSR= 0
##$SW_p= 3612.71676300578
##$SYMM= 0
##$S_DEV= 0
##$TDeff= 0
##$TDoff= 0
##$TI= <>
##$TILT= no
##$TM1= 0
##$TM2= 0
##$TOPLEV= 0
##$USERP1= <user>
##$USERP2= <user>
##$USERP3= <user>
##$USERP4= <user>
##$USERP5= <user>
##$WDW= 1
##$XDIM= 8192
##$YMAX_p= 0
##$YMIN_p= 0
$$ End of Bruker specific parameters
$$ ---------------------------------
##NTUPLES= NMR FID
##VAR_NAME=  TIME,          FID/REAL,        FID/IMAG
##SYMBOL=    X,             R,               I
##VAR_TYPE=  INDEPENDENT,   DEPENDENT,       DEPENDENT
##VAR_FORM=  AFFN,          ASDF,            ASDF
##VAR_DIM=   8192,          8192,            8192
##UNITS=     SECONDS,       ARBITRARY UNITS, ARBITRARY UNITS
##FACTOR=    0.0002944,     1,               1
##FIRST=     0,             0,               0
##LAST=      2.4114304,     0,               0
##MIN=       0,             -454508,         0
##MAX=       2.4114304,     542131,          0
$$ Real data points
##PAGE= N=1
##DATA TABLE= (X++(R..R)), XYDATA
0@%%%%%%%%%%%%%%%%%%%R0j90K00k00K00k00K01k98L97m00M34n33O01o87P86q83
35d82R90j102J256j387J533j710J907k119K347k598K870l169L492l842M232m672
51b454N156n679O262o921P664q503R464j0585J1918j3521J5474j7923K1117k5472
65a4003L1784m1732N9816j02758L80171K28853r81493J17968P14162j23906o41265
76c72403J80740N25051j59408m61543J55430L56773n4925l67745j3718M24321
86B12573M8891n21117j756N72028o0806o20199J67175O16341k76751n71200L83859
97e0962M56630m29824l27300M09354K25918l45322j77495K78315J59136k11712
107a3262j71210J52706K32643j36054l18835J97498L62510k97479l38794L76898
$$ plain form
0 0 0 0 0 0 0 0 0 0 0 0 0 0 0 0 0 0 0 0 0 90 -100 100 -100 100 -100 101 -197 200 -200 234 -299 302 -385 401 -482
35 -482 508 -594 662 -725 808 -902 1005 -1114 1233 -1365 1505 -1664 1828 -2014 2218 -2454
51 -2454 2702 -2977 3285 -3636 4028 -4475 4989 -5596 6322 -7199 8275 -9648 11469 -14003
65 -14003 17781 -23951 35865 -66893 313278 542131 -439362 -321394 392768 268862 -372403
76 -372403 -191663 333388 173980 -287563 -132133 224640 169715 -198030 -211748 212573
86 212573 261464 -259653 -261409 310619 249813 -370386 -203211 413130 136379 -434821 -50962
97 -50962 405668 -24156 -351456 57898 283816 -61506 -239001 39314 198450 -13262
107 -13262 -184472 -31766 200877 64823 -254012 -56514 305996 8517 -330277 46621
117D6621K85323m31224k16177M72130J13936m70249o07M01645o5470l04640O7321
128a01391K32869m1525j84979j32J63881N4171j78334j04202K26739J24085l04599
139a13417q5986L65330J4649l87198O9564L62819j39554l14431J90158K47779
149B09713k14187j68887J97377R9069j38199p5384P9511R2277m4643j19590K2105
160f0838J64327k4595k18537O5503K56952j44533k40741K10756J87863k45031
170d8874j26977K53830O4116k38616p344J99418l1033j36727K8431Q4132M589
181D4945n8564m9997O4905Q5767r0987j05788J30685J09699j82266q2628K22737
192H8508K8042k34146L4517K10111p9243j68878J02079J23810j07265p7046R1063
$$ plain form
117 46621 331944 -99280 -315457 156673 270609 -199640 -200247 201398 135928 -168712 -101391
128 -101391 131478 89953 -95026 -95158 68723 122894 -55440 -159642 67097 191182 -113417
139 -113417 -199403 165927 180576 -206622 -137058 225761 86207 -228224 -38066 209713
149 209713 -4474 -173361 24016 123085 -15114 -90498 -10987 81290 36647 -82943 -60838
160 -60838 103489 78894 -139643 -74140 182812 38279 -202462 8294 196157 -48874
170 -48874 -175851 77979 142095 -96521 -103865 95553 64520 -72207 -43776 40356 44945
181 44945 -13619 -63616 1289 87056 -3931 -109719 20966 130665 -51601 -134229 88508
192 88508 116550 -117596 -83079 127032 47789 -121089 -19010 104800 -2465 -79511 11552
203A1552L6762m8912k6716M124M8245K3193q7421k0365J19618M236j48455K8775
215e5364J64292p7542j52686J22094J13852j44026o5668J39848K4471j19992M570
226d6151Q8138j6924n1828J1206J9743J6885o188n4321J8376Q1643n0530q5978
238g5929Q1579P7968j09273n7444J31707J9001j34404K1039J15391m9751q2164
249f2280N8726M8849m9455k3441K9877Q554l138p624k5256K8462M0401o0367l4179
262e0871Q7727J1404j01254J5984J02103m3701r1431O9781O6032q5713k8250P6377
274B8188J775n4426R235K9916q287q317j471p425K0980J1201m6719J184O5152
287D0986k6445o6653N3434N1936o9500l1257P5977P601p3895J7485N7901l1909
$$ plain form
203 11552 48314 -598 -27314 -23190 25055 48248 -39173 -59538 60080 64316 -84139 -55364
215 -55364 108928 31386 -121300 794 114646 -29380 -95048 44800 69271 -50721 -46151
226 -46151 41987 25063 -26765 -15559 4184 21069 14881 -39440 -21064 60579 10049 -75929
238 -75929 5650 83618 -25655 -83099 48608 67609 -66795 -45756 69635 19884 -62280
249 -62280 -3554 45295 -4160 -27601 2276 10830 7692 68 -25188 3274 43675 -16692 -50871
262 -50871 36856 48260 -52994 -37010 65093 21392 -70039 -258 65774 -19939 -48189 28188
274 28188 29963 -24463 -15228 14688 6401 -1916 -3387 -10812 10168 21369 -25350 -24166 40986
287 40986 14541 -52112 1322 53258 -16242 -47499 28478 36079 -37816 -20331 37570 5661
299E661l4927L3871R906j8911K023J909m060J3496l97l0638J8865L7113m1094
312g183k9107N7809R912o5022J2176N8927k8576m5517L8963K7885m3572o036L5588
325A6247r053j8990J4839j104o310J3022p764j5515J9861J3989l5009l009M4319
338B5523j4858m2964L0484L2981m2517j4201M3112j344l5953J3834K4875k1396
350b424r561J8898n391p867J3455p607j0060K0351m47k4670J1044K5080k2736
363a935k1439L5218N917l7304R122L1143j9774j7900K2415O626k1022L250J5069
376I386j0474k739J1906j0506n267J7841p207j6754J7520J0224k3158k914K6879
389A4737q280k4621J8527J6856k4422l996K3293p398j4624J2046N181j3006L523
$$ plain form
299 5661 -29266 4605 14511 -4400 -2377 -468 -4528 8968 8571 -22067 -3202 33911 -7183
312 -7183 -36290 21519 31431 -33591 -21415 37512 8936 -36581 2382 30267 -13305 -19341 16247
325 16247 7194 -11796 3043 1939 -4371 8651 887 -14628 5233 19222 -15787 -18796 25523
338 25523 10665 -32299 -1815 31166 -11351 -25552 17560 16216 -19737 -5903 18972 -2424
350 -2424 -11985 6913 1522 -6345 7110 -497 -10557 9794 9347 -15323 -4279 20801 -1935
363 -1935 -23374 11844 17761 -19543 -10421 20722 948 -16952 5463 12089 -8933 -5683 9386
376 9386 -1088 -3827 8079 -2427 -7694 10147 2940 -13814 3706 13930 -9228 -12142 14737
389 14737 6457 -18164 363 17219 -7203 -11199 12094 4696 -9928 2118 7299 -5707 -2184
402b184R229j0322j540J3309r071j0064J7435R82j9572P567J7242j4764j0744
415a2497J8943K703j9881O983J4193j2654n168J4070l874q733O477M171j0383
428e650L392R212r206m550J4338l680j4521J2577O524j4495j233J4687n238j0420
442h263Q740N741j1777K566R264p060m650J0885m293o337O788L466r938K981R530
457G643q668n870J0744O17j1439L998R209o977m570R583o83q530M688N286o912
472a881j100O897m147l735O631p1q639M664P825q973k495Q606j449q450P462M552
488E697p191j482N662k882k669L595N47l789K100L587m576r46P161m256m444O684
504B798Mo769M56Q833m614n165O314O87o215J951N702m002k929L942l36l371L345
$$ plain form
402 -2184 7045 -3277 -4817 8492 -579 -10643 6792 7774 -11798 -4231 13011 -1753 -12497
415 -12497 6446 9149 -10732 -3749 10444 -2210 -7378 6692 2818 -5915 562 4733 -5650
428 -5650 -2258 6954 -2252 -6802 7536 3856 -10665 1912 8436 -6059 -7292 7395 2157 -8263
442 -8263 477 6218 -5559 -2993 6271 -789 -5439 5446 1153 -5184 1604 5070 -4868 -1887 7643
457 7643 -1025 -6895 3849 4466 -6973 -2975 6234 -743 -5313 4270 3587 -4943 -255 5031 -1881
472 -1881 -2981 3916 -231 -3966 2665 2594 -6045 -1381 6444 -2529 -5024 3582 2133 -6317 1145 5697
488 5697 -1494 -2976 2686 -196 -2865 730 1277 -2512 -412 3175 -1401 -2347 4814 558 -3886 2798
504 2798 2802 -3967 -3511 5322 708 -4457 1857 2544 -3671 -1720 3982 -20 -2949 993 657 -2714 631
521F31J026k900O79L029l034k938O971q24o347K000M952l932k358M971P17n075
537b432R78M201m226M1L168j885o01J458l45j318K454n43l258p9M299j902k778
554b768M623N60m688l56M760r04m835L701J575k936n4J302K13j117o00L97J130
571CM71j324K09J970J346k741j046K731O65n196K431L793l421j497K804P42k539
588e99k04J990L55j769j73P73L7O71j012M62M55n75j752Q17J969r78k751L067
606G83J087k214r49J819O03k634J157J413l5j885k89K276p50R0j806P40J031q95
624d58j113J951M7p55q28J809mj337r5K580j753j677P03J647r99p43O11M22q49
643h41N6J017j178K041j176m68J402j149j53P11P60j091j085Q77J230o79j546
$$ plain form
521 631 1657 -1243 -564 2465 -569 -3507 3464 2640 -3707 -1707 3245 -687 -3045 1926 2643 -2432
537 -2432 -1454 2747 -1479 -1438 1730 -155 -756 702 357 -961 1493 950 -2308 -2387 1912 10 -2768
554 -2768 1855 2415 -2273 -2629 2131 1227 -3608 93 1668 -1268 -1322 -20 193 -924 -1524 -1127 3
571 3 474 -850 -641 1329 2675 -66 -1112 1619 2284 -2912 -481 3312 -109 -1606 1198 1940 -599
588 -599 -803 1187 1542 -227 -400 373 410 1081 69 531 986 411 -1341 -524 1445 467 -2284 783
606 783 1870 -344 -1293 526 1129 -1505 -348 1065 1030 -855 -1144 1132 382 472 -1334 -594 437 -458
624 -458 -1571 380 427 -328 -1156 653 649 -688 -783 1797 44 -1633 -930 717 -282 -1025 -414 8 -841
643 -841 -785 232 -946 1095 -81 -549 853 -296 -449 262 1022 -69 -1154 -277 953 274 -1272
660a272J624m53j7j291J383J178k197M78J143k78r44m10J382P11j547J49j090
677a451J730M56j924Q46J061j364j72R46m3j012J376K54L4j858K91J310N85j585
695e20R18J357k926J334M39k22o13N15j06j84O27j497L70J097j43j090N36J664
713A556j501p26J201N77j560Q2P85m6n01k42j03J140p84j69J21J242j498n89M08
732f07J212j82j663J954l53r95n35K194p20j474j19J574N19m87O0o51Q96l03q18
751d98l61J594q85j157J300N37k7m91M97p81k01R39M36o39n85J49l76O41j015
770i23J206nJ456j788k86J944j836N22o03J596j687n15R18L65m49o11J476N11
788A291N05j608q11R79j514J883j249Q61l06j39J34k78n49J162J216l74K7p77
$$ plain form
660 -1272 352 -101 -118 -1409 -26 1152 -1045 -567 576 298 -646 -1056 326 1037 -510 -361 -1451
677 -1451 279 735 -1189 -343 718 -646 -818 128 85 -927 449 703 737 -1121 -830 480 1065 -520
695 -520 398 1755 -1171 163 602 380 -233 282 176 -8 619 -878 -508 589 446 -644 -108 1556
713 1556 55 -671 530 1107 -453 -371 414 368 -133 -375 -478 662 -122 -291 -170 1072 -426 -1015 -607
732 -607 605 423 -1240 714 361 -634 -1169 1025 305 -1169 -1288 286 805 318 378 -273 623 320 -498
751 -498 -859 735 -150 -1307 -7 530 503 12 509 -272 -473 466 902 263 -322 -173 -549 92 -923
770 -923 283 278 1734 -54 -340 1604 -232 290 -313 1283 -404 -919 -1 364 -85 -696 780 1291
788 1291 1796 188 -623 356 -1158 725 -524 337 31 -108 26 -252 -801 361 1577 1203 1230 453
806D53j514J750j218J42o62K49J481j363J596O8m91J51r50R34j823J832M40J38
824A213j657J187p65m87J071M0q37RP29J002L44l508J352N12J253q9k017o04R3
843a159K121j575J426j109P10m12r18J170q07J262m71l0p46O7J224j872J786p92
861a25l45M4J221k304J497M03j560K233j062J149j986J616m24O62j957J202M20
878F84k72J69J67R77j857N59M34j798J246K85K78o38q52J58K82J096r35Q4K12
897B79R20j902l00M99J567j877N77L07J43j287J355M56m95o00J22N48m44J65l7
916dj010K333l36o90j033O64K82j021J622l64p81K97O3k52k76M53Q65j322J03
935d07J276j354O55J073j469O2R43m83J56j046Q24q00k8J959j537j92L30M60j319
$$ plain form
806 453 -1061 689 -529 -387 -1049 -800 681 -682 914 982 491 642 -308 626 -1197 635 1075 1213
824 1213 -444 743 -22 -509 562 602 -235 -226 503 1505 1849 -1659 -307 205 1458 1369 -648 -1252 -1159
843 -1159 962 -613 813 -296 414 2 -916 254 -553 709 238 208 -538 -471 753 -1119 667 -125
861 -125 -470 -426 795 -1509 -12 391 -1169 1064 2 1151 -835 781 357 1019 -938 264 684
878 684 412 581 748 1725 -132 427 861 -937 309 594 872 234 -618 -460 -178 918 -17 67 279
897 279 1199 -703 -1003 -504 1063 -814 -237 70 213 -1074 281 737 242 -358 -236 312 -132 33 -4
916 -4 -1014 1319 983 293 -740 -76 206 -815 807 443 -338 -41 22 -230 -506 -53 812 -510 -407
935 -407 869 -485 170 1243 -226 -164 779 296 452 -594 230 -570 -598 1361 -176 -368 -38 422 -897
954h97K62K17P8q6R54j728O59P48q20J023m35j50k1P30o58J123j124p59J438r47
974c93n1P11l41K96J60n30k21m40R05K78j03j12K63q48j3J034j650L86L13j188
994a544j6K511l47j690L27O68l9k86M93Q45l32o94K24n95K81O52j303J187j298
1013i56Q50l49N77q31J083o99N51P38r63P0M36l24M24M51r08Q81n31n89J294j125
1033H0l6o36L88P9k59k96L99P45j399R67R03m03q52k51J138m07j78l40O01j73
1053G0n33M16K43K027q21j431j135Q22K31m41O63p8l35o9Q97o60Q89n80M48j045
1073d22n6J299j334j762J800O65p05k69J55N18j96k7q6J89o21M68k40K96j63O86
1093A95p7r95J363j124N40O82j1k30j1K23o61p16J58N42O59qO9p98L19j278J027
$$ plain form
954 -897 -635 -418 -340 -426 528 -1200 -541 207 -613 410 -25 -175 -196 534 -124 999 -125 -884 554 -393
974 -393 -444 267 -74 222 382 -148 -369 -809 96 374 271 159 422 -426 -439 595 -1055 -669 -356 -1544
994 -1544 -1560 951 604 -1086 -759 -91 -130 -416 77 922 590 -104 120 -475 -194 458 -845 342 -956
1013 -956 -106 -455 122 -709 374 -325 226 964 1 71 507 183 607 1058 150 1031 500 -89 1205 80
1033 80 44 -592 -204 -125 -384 -680 -281 464 -935 32 935 532 -320 -571 567 160 -18 -358 243 70
1053 70 -463 -47 196 2223 1402 -29 -1164 -342 -111 -552 111 33 -302 -371 526 -134 755 175 623 -422
1073 -422 -478 821 -513 -2275 -475 190 -515 -784 -629 -111 -307 -334 -420 -231 -852 -384 -624 -328 -491 195
1093 195 118 -877 486 -638 -98 584 573 343 332 555 -106 -822 -664 -122 537 529 598 -200 119 -1159 -132
1114a32J626j458N4j762K243l08j47k47P25M08l23j41j233J029m55N56j135J116
1132D16j000j47Q97L71o85P0k79j053J471K87o36O2J308q15n68J949p70n78l15
1151a5n03K57k3Q51p46N53j71L76l79m62M66J30m12L64j200J394K26j142N80p70
1171f26O43o0N61q54N29M92m84J20K89p0r20M85R03j137K41N44l11O3J7q50l70
1192g95L21j93n0J049K76p36n58J372M6j075R30j063l86Q44k018K619k61j448
1210a126P76q99J037j65L88M3n21j88J8Rj81o55N25J422J161k610K657p17j208
1229b34n37J10N21p53J316j403Q90Q57j069j7p73r5J565q19J02O64K07p78N21
1248B75J542j448j090K0J308j225K92Q35n67L61j166J585j172K25o02J281m95
$$ plain form
1114 -132 1494 36 90 -1672 571 263 116 -131 594 1002 679 538 -695 334 -121 435 -700 416
1132 416 -584 -731 166 537 -148 -78 -357 -1410 61 348 -288 -226 1082 267 -301 1648 878 300 -15
1151 -15 -518 -261 -284 567 -179 374 203 579 200 -262 204 334 -78 286 -914 480 706 -436 144 -626
1171 -626 17 -43 518 -336 193 685 201 321 610 540 -380 105 1008 -129 112 656 345 408 425 -425 -795
1192 -795 -474 -667 -717 332 608 -128 -686 686 732 -343 587 -476 -862 -18 -2036 583 322 -1126
1210 -1126 -350 -1249 -212 -377 11 54 -467 -655 -637 -628 -809 -1464 -939 483 1644 -966 1691 974 -234
1229 -234 -771 -661 -140 -893 423 -980 -90 767 -302 -319 -1092 -1187 378 -441 -339 325 532 -246 275
1248 275 1817 369 -721 -701 607 -618 -326 509 -58 303 -863 722 -450 -225 -827 454 -41
1265d1j220R67j86K101r50o46o69J163o9p68P38k89J504q38r59j01K86r24m95
1284a396Q29l27M19J071q35J54M77n82j336J607k63m33R01R06j113l14p7l82P42
1303D8R03L59j835J468r30L8j090J485k31m87J07m33N45l79J433k10j108P38J008
1322A429j318q9M24K3l14j423J022J517r70m69J089p57j91n33N5J179j264O60
1340G0M50l44J05l08Q45r23l27P69j18j50N42l11j43j121J328j218O91M50Q18
1359A105j297L04k40p82l0J155R18j457n07N03J25J099m75o14p89J144m88p00
1377a026J179q81J667K17o44R6Q21j219M00N28j553J976o15O38j523l56L08k52
1395b39R99j125J149p99J28J190m15j758J301k98L50k61lj30l71L91Pn31n8J043
$$ plain form
1265 -41 -1261 -294 -480 1621 671 25 -644 519 450 -318 420 131 1635 797 -162 -263 23 -901 -1396
1284 -1396 -567 -894 -475 596 -239 -85 392 -190 -1526 81 -182 -615 286 1192 79 -235 -312 -694 48
1303 48 951 1310 -525 943 13 51 -1039 446 215 -272 -165 -598 -53 -432 1001 791 -317 421 1429
1322 1429 111 22 446 469 155 -1268 -246 1271 301 -168 921 164 -27 -560 -505 674 -590 70
1340 70 520 176 281 -27 818 -105 -432 337 219 69 611 300 157 -964 364 -854 -163 287 1105
1359 1105 -192 112 -128 -910 -940 215 1133 -324 -831 -328 -203 896 421 -193 -982 162 -326 -1026
1377 -1026 153 -728 939 1156 512 608 1429 210 610 1138 -415 1561 946 1584 61 -295 13 -239
1395 -239 760 -365 784 -15 113 1303 888 -870 431 133 483 222 219 89 -282 109 116 -415 -473 570
1415E70j092K55q7J424l16j502R59k13j808K165j681J841K90p89K34J043j586
1432b93R0J23L71j15n67P25j191J015k80J2j341J989j6j211J637j771J266J63
1450F06J24r21L81n68Q57j124N19j05l08j69M02J527k332N29J787l235K590j123
1468e63N86Q30j448J634j311J043j074J166j692Q02J263k372J340j545J360N80
1484E99M35r00K27Q6o23Q3K94j085J536r81n3R71j019R35j377J280j570P99k67
1503f30Q53k103L031L0p05M90M5r18R09R05j170m61R46j064r30K13P43J00k102
1522a818K001j928J865Q7j32j91N67p28K55J114j923L07K04J41o57O73m58O4K34
1541c23j28Q10p13o95O51J725j062m16q11R79N95P7q61r23O11J46P36j184M17
$$ plain form
1415 570 -522 -267 -354 1070 754 -748 211 -2 -1810 355 -1326 515 805 16 250 1293 -293
1432 -293 -203 -80 291 176 -391 334 -857 158 -122 -110 -1451 538 522 -689 948 -823 443 606
1450 606 730 -191 190 -378 479 -645 -126 -231 -539 -708 -306 1221 -1111 -582 1205 -2030 560 -563
1468 -563 23 853 -595 1039 -272 771 -303 863 -829 -27 1236 -1136 204 -1341 19 599
1484 599 1034 134 361 447 -176 -93 201 -884 652 -329 -382 589 -430 505 -872 408 -1162 -363 -630
1503 -630 223 -1880 1151 1181 476 966 1011 93 1002 1907 737 276 1222 158 -772 -559 184 284 -1818
1522 -1818 183 -1745 120 207 75 -116 451 -277 -22 1092 -831 -524 -320 -179 -836 -163 -621 -557 -323
1541 -323 -451 359 -354 -1049 -398 1327 265 -151 -962 17 612 689 -172 -1095 -484 -338 398 -786 -369
1560c69Q40p5k2n30J82N56j952L89l36K011M2o92j63o8J434q26L23m29N45n17
1580C43j146J087L94j296P5J614p52n89j17J563p33j86P47j493J190j390K187
1597A498k890J424L35J159r05m62K71r03O18m17N21K42J052r31l03k141K610j667
1615h89J308p10J399j476J39O25j680Q94O36l03J839k032p05Oj97R16j030P27
1633e33J046o48n94J940n10m89j520K155l05M03k061n77O24Q98m1l3M48J80L34
1652G17p14j14J585k337J514r64R92p08j16o17M62o45J061l7k75m3J225j441Q20
1671C65q9j662K261j084J498r05Q64L11k66K94j420L71q70j41M78n52K353j132
1689F74j024K4J92J048K89J07m13k170J792j252R93J324j597k55j01M56l48l90
$$ plain form
1560 -369 471 396 374 -156 26 582 -1370 -981 -1317 694 736 44 -119 -187 1247 421 744 315 860 343
1580 343 -803 284 678 -618 -543 1071 319 -270 -387 1176 443 257 1004 -489 701 -689 1498
1597 1498 -1392 32 367 1526 621 159 430 -473 145 -272 249 491 1543 612 309 -1832 778 -889
1615 -889 419 -291 1108 -368 -229 396 -1284 -390 246 -57 1782 -250 -955 -949 -1146 -230 -1260 -533
1633 -533 513 -135 -729 1211 701 212 -1308 847 542 945 -1116 -1693 -1069 -171 -212 -245 203 383 717
1652 717 3 -111 1474 -863 651 -313 679 -29 -145 -762 -300 -945 116 79 -196 -239 986 -455 365
1671 365 276 -1386 875 -209 1289 384 1248 1559 1293 1587 167 538 -332 -473 5 -547 1806 674
1689 674 -350 -326 -134 914 1203 1310 897 -1273 519 -733 260 1584 -13 -268 -369 87 -261 -651
1707f51j293K539o43Q89Q8j574J71L14M62n95k25J223j347N32N06o68n03O16R95
1726H36j325P23j31J16L23k6M24j035o04Q21J122j514N43K77m74K69r1p2N49o56
1746G5O55K09j308l2J103q98m29K40l7J386j598J007l01P69q64p91J343q36P35
1765D28j207M80J056j65M10j525N72j00P23j47L41m13n04m62O01Q10r07p92K237
1784A436k137O09m59O8j22Q50L96j432P86N37J65q71M95l44j25L35n33m1L69J96
1804A78j391J099rJ11o3O43k0n25j103J859o43o1k65R74M32o12m03m81l08O54
1824F6n04R81p0m33L12O08j086m27j1J283L95r82o4m28J696k329J362k014J607
1843c8j353J415L86p6N0Kj137M37M38p19O36M69j075N17q36m52J104L63O22n56
$$ plain form
1707 -651 -1944 595 -48 841 929 -645 -474 -160 302 -293 -518 705 -642 -110 396 -272 -775 -159 836
1726 836 -489 234 103 219 542 516 940 -95 -699 122 1244 -270 273 550 76 345 254 182 731 75
1746 75 730 939 -369 -401 702 -196 -625 -385 -422 964 -634 373 72 841 -23 -814 529 -307 428
1765 428 -779 -299 757 592 1002 -523 49 -51 672 525 866 453 -51 -513 88 898 -9 -801 1436
1784 1436 -701 -92 -551 -483 -605 245 641 -791 -5 532 697 -174 321 -23 -148 187 -346 -387 -18 178
1804 178 -1213 -114 -123 -12 -75 568 548 23 -1080 779 136 75 -190 784 1216 604 201 -280 -588 66
1824 66 -438 543 473 40 352 960 -126 -553 -564 719 1114 132 68 -360 1336 -993 369 -1645 -38
1843 -38 -1391 24 410 334 384 386 -751 -314 124 -595 41 510 -565 -48 -884 -1336 -232 131 753 197
1863A97o7m19j15J267n44n37n68Q36k59N59q41J471o7p47k13j321L97M72P45j798
1883a552R91J15J266j138K29K21P3n49J638q01j059J132j520J300j470J082P85
1900G43r87P52k173J604p4J089o84l6p49N34j738J519J462j413j142R9J440m85
1918b39P11o95P38j017P73n08L06k19K19K45n09k62R96q60J67R1o69J182P1p84
1938b63N94m02k79j144J354o69P2J83O7J75N6q10O04o50P68J315j86l31o10Q12
1958F56l56P39j530k63J376n58o92J707r35o16j49J357j516Q82M12l95n14J6P57
1977C78k13j625J635m90M9P01j00l45r7O11R85j197j10K68m66J31K15l94K67r
1997A94m54Q56q01L42K23p53J07R61j28r18J081k032J192J248p63j411P95L39
$$ plain form
1863 197 130 -289 -404 863 319 -218 -786 50 -209 350 -491 980 913 166 -47 -1368 -971 -499 246 -1552
1883 -1552 -561 -446 820 -318 -89 132 205 -344 1294 493 -566 566 -954 346 -1124 -42 743
1900 743 -244 508 -1665 -61 -135 954 270 234 -515 19 -1719 -200 1262 -151 -1293 -1194 246 -239
1918 -239 472 -223 515 -502 271 -237 69 -150 69 314 -195 -457 539 -321 -154 -63 -732 450 521 -263
1938 -263 331 -71 -350 -1494 -140 -809 -737 -554 -487 -312 -256 -1066 -462 -1112 -344 971 785 454 -156 656
1958 656 300 1039 -491 -754 622 64 -628 1079 144 -472 -621 736 -780 102 514 119 -395 -379 378
1977 378 165 -1460 175 -315 -266 435 335 -10 -107 504 1489 292 182 450 -16 115 330 -64 203 194
1997 194 -260 596 -205 137 360 -393 -286 675 547 -371 710 -1322 -130 1118 355 -1056 -261 78
2015G8j43N21m38k22L29J073j075q57L37K3o3J854j393p33J031j9m12j04J47K21
2035A55l6J38j30J24m51l18J162p56m03J03L11j66K2L73p2L43q12Q48k28M05j73
2056D39k47n27J19J41K80n07j025J597n6j65O91l38j391J356O1k14o24j33L07
2075b36J152r1k027K078r60r09O76K071k240M08q44N36N50k7N41j174J711k85
2093I30n82n46P49j184M88m9O28j139P44J13p50P35n32L86o73J251P17j827J612
2112A071j07n60n24N95j187Q21K42j056M86K91m67n5R76N62j397M86p6O55j108
2131c52M87P34j439Q83n95m18J37J18j69J266j008J022J85l12p23L88N34p3l06
2150C59j009o22K212j483o95J368p89J838j453O11j209K66j1r0J066j09j044J0
$$ plain form
2015 78 -65 456 18 -204 125 1198 123 -734 -397 -374 -437 1417 24 -709 322 303 -109 -213 -66 155
2035 155 119 257 127 251 -200 -518 644 -112 -515 -412 -101 -267 -245 128 56 399 -413 435 207 612 439
2056 439 192 -335 -216 -75 205 -302 -1327 270 214 49 740 402 -989 367 428 214 -410 -543 -236
2075 -236 916 825 -1202 876 -84 -993 -317 1754 -486 -78 -922 -386 164 137 678 -496 1215 930
2093 930 348 -198 551 -633 -145 -194 434 -705 39 152 -598 137 -395 -9 -682 569 1286 -541 1071
2112 1071 964 404 -120 475 -712 109 351 -705 -219 72 -395 -450 526 1088 -309 177 101 756 -352
2131 -352 135 869 -570 313 -282 -700 -563 -445 -614 652 -356 666 851 539 -184 204 738 665 359
2150 359 -650 -1272 940 -543 -1238 130 -659 1179 -274 337 -872 -606 -617 -707 359 250 -794 -784
2168g84Q63j237K317j930Q02N07j082j109J325j15j349J406r84P24q31J97J149
2185a31l58o9j006Q46J533q33Q60J10j812L00J958l288K120m35k011L523j334
2202b7R1j49J566k168J341N3K34n47q73K99j266J759j079p17O05J873k79l01m48
2221c3j77N95N64j392Q27m30N64l82l81J551k188J044j278R68N76J015j373O00
2239F70j295J069j77K88j094J373m24r4j81J262j133k4N44r29n66J76J341o22
2257A84j677J824p51J380j61Q3n20o50N77p15k93J304k044J526J71m57m18p25
2275a362Q79j18J3J145p54K96O38p55K49k73J03N93j420O31m51%L89Q5j11J148
2295I25j282J85m61J510j31j163M2o82J335J16n14M44j459P10N10m2R97n64m14
$$ plain form
2168 -784 79 -1158 1159 -771 31 538 -544 -1653 -328 -443 -1792 -386 -1370 -646 -1477 -1280 -131
2185 -131 -489 -558 -1564 -718 815 -18 842 952 -860 -560 1398 -1890 230 -205 -2216 1307 -27
2202 -27 64 -85 1481 -687 654 707 941 394 -479 -180 -1446 313 -766 -1483 -878 995 716 415 -33
2221 -33 -210 385 949 -443 384 -46 518 136 -245 1306 -882 162 -1116 -148 428 1443 70 670
2239 670 -625 444 267 555 -539 834 410 316 135 1397 264 240 784 -145 -711 -535 806 184
2257 184 -1493 331 -420 960 799 882 362 -288 289 -426 -719 585 -1459 67 238 -219 -637 -1362
2275 -1362 -483 -601 -588 557 -197 99 737 -18 231 -42 61 654 -766 -135 -586 -586 -197 -112 -223 925
2295 925 -357 -172 -633 877 746 -417 -375 -1057 278 394 -120 324 -1135 -425 85 43 1040 476 62
2314F2N00n40m24p88j354J841R86k08j119M09P77n75j72J32L066k977N89L60p54
2333a89O21q11l80p64J583r63R1J084j163J487j57m57j301K237O98k299J433k707
2351a957K958J01j714L90J791j629L06j288J244J215o23q40J092j953J95K16m8
2368e44J423n0p12L90J02J08j951N19J298j28k018J987j906K409r77j335P76j13
2386g22R36J265k857j27K329j299J545k240O20K061q66m0k028o54L63J456m32
2403f90n36K262N4l99L45o1j361m87J798j789R55O19j27r81J581m69k806J961
2421a31P04k165J706q19J047k18J231j148m03j007j47K266m91K62O98j803M82
2438F4K78J708j537J42N96p17P48j814J672j804K84L39K05K53k98R19j422N20
$$ plain form
2314 62 562 22 -402 -1190 -2544 -703 283 75 -1044 -635 142 -433 -605 -473 2593 -384 205 565 -189
2333 -189 432 -379 -759 -1523 60 -903 -812 272 -891 596 439 -18 -1319 918 1616 -683 750 -1957
2351 -1957 1001 1102 -612 -222 1569 -60 246 -1042 202 1417 794 -46 1046 -907 -712 -496 -544
2368 -544 879 829 117 507 609 717 -1234 -715 583 455 -1563 424 -1482 927 -50 -1385 -609 -722
2386 -722 214 1479 -1378 -1505 824 -475 1070 -1170 -550 1511 645 605 -1423 -2077 -1714 -258 -690
2403 -690 -1226 1036 1090 691 1036 975 -386 -873 925 -864 91 710 583 -398 1183 714 -2092 -131
2421 -131 573 -1592 114 -705 342 124 1355 207 -196 -1203 -1350 916 425 687 1385 -418 64
2438 64 342 2050 513 655 1251 534 1282 -532 1140 -664 -380 -41 164 417 119 1038 -384 136
2456A36k27k03Q41j749J845l39q44O26Nn16K51K6J42K51o91J66K149k136q36Q32
2476b71Q59j86o94l85J796j377M72J600j840p80R19O72m42O0n23k01P76j245j71
2495i61J669j439N62r3m00o0L84j59l00J692j072N15k56J168r47O63k223K085
2513H28j356j9N60n93o80J789j67K62j116J495l20k09j26m7q14L82P0l7O15R2
2533F09j977n2R62J389j474N55J236o22p22J147j303P94Q42L22j121q38P15q13
2551c51L93J65p19J919j281J10n70O45O28j249M01M70o14K49m49k23O53l98M35
2570B14j22J47N7q90O22p63J063L16j041K76j6N41L00n15q64N62M52m97Q21j160
2590d97O70m42r9k69N13R55j445R44l43m30N39N32r31Q96o58p6o8K26o8J93l07
$$ plain form
2456 136 -91 -294 547 -1202 643 304 -540 86 91 -425 -174 -148 -6 245 -446 -280 1869 -267 -1103 -271
2476 -271 588 402 -292 -677 1119 -258 214 1814 -26 -806 113 785 343 403 -120 -321 455 -790 -961
2495 -961 708 -731 -169 -262 -662 -722 -338 -497 -797 895 -177 338 82 1250 303 966 -1257 828
2513 828 -528 -547 13 -580 -1260 529 362 624 -492 1003 683 474 348 301 -513 -131 -61 -98 517 609
2533 609 -1368 -1420 -458 931 -543 12 1248 626 -96 1051 -252 542 1384 1706 585 -253 462 -351
2551 -351 42 207 -512 1407 126 236 -334 311 939 -310 91 561 -53 196 -253 -476 177 -221 214
2570 214 92 239 296 -594 28 -735 328 644 -397 -121 -137 404 704 189 -675 -113 339 -158 663 -497
2590 -497 173 -269 -368 -637 -124 831 -614 330 -13 -443 96 628 -303 593 -65 -141 -209 17 -51 142 -165
2611a65l17l37Q98L15L8j292N39K66K5PL31P28k258J200O6L33M22l40p57Q0J15
2632a03J05m0O24m07j097J271j79k02J117j295J19k80o9J184m29j10L85L13j329
2651d22J623k52m11m00K79j077M63J159m97K13r45l5N44K72o43J267q46p54O52
2670A90K1o52J333q36r6K72O07l63r42k26O68j3m2j662L603k304M53R38r36J52
2690A65j349L87N35K232k592L4Q44K76j30l1j034J97j89o28J151k03j120J949
2708D94j432P25k43K67O69n40J703q46j868L97J074p83Q15j37j33P96L41j739
2726d40Q40j36J819j774k25P3l44Q33p05J03J35O8j161O10O88j234J317P84j369
2745a18K32q37J312j009l52J042r20o1r5j21J191k20r92p65J827J21M09j634j78
$$ plain form
2611 -165 -482 -819 79 394 432 -860 -321 -55 -30 -23 308 1036 -1222 -22 44 377 799 459 -298 -218 -103
2632 -103 2 -38 586 179 -918 353 174 -28 1089 -206 -87 -367 -436 748 319 209 594 907 -422
2651 -422 1201 949 538 138 417 -660 -197 962 465 678 -267 -302 242 514 -129 1138 292 -462 190
2670 190 211 -441 892 56 -40 232 839 476 -466 -692 -24 -37 -79 -1741 1862 -442 11 949 13 165
2690 165 -1184 -797 -262 1970 -622 -588 256 532 402 371 -663 -466 -655 -1283 -132 -335 -1455 494
2708 494 -938 -213 -456 -189 480 -60 1643 797 -1071 -674 400 -383 432 295 162 958 1299 -440
2726 -440 400 264 2083 309 84 157 -187 646 -59 44 179 247 -914 -304 384 -850 467 1251 -118
2745 -118 114 -723 589 -420 -772 270 -650 -711 -806 -927 264 44 -948 -1713 114 235 644 -990 -1168
2764a168J703j457K049k297J717j24l47O50Jj111J871j189l02o25L29K99J726
2781A725j978m66J395n46r8K98o33M73P45j544J370m75P15j720J329M40j171L35
2799A94K31n52j81K83l84l95J411r83J123k43m34K36m35j62N64n89j004K298r86
2818hl28j47N42N39J102j628K28j529J073K69J01N83j764Q92j026K037j357M79
2836E8p09J090n17P01o78O12l85Q0l49p46P99Q84L4o89j86k050L275j156l03m85
2856g20m6O32N2J84j70K17N83j011Q43M01o26r13K075j802J236j284J82K38K89
2875C60J206p37m55n71J176j070O44p97j33q72J652k70o55M33K36j121J90j689
2893b473J991p79J732r57N51m18l44M67j27J56l90K93q14J563k68O37O95mr14
$$ plain form
2764 -1168 535 -922 1127 -1170 547 423 76 726 727 -384 1487 298 -4 -629 -300 -1 1725
2781 1725 -253 -719 676 130 32 330 -303 170 915 -629 741 266 981 -739 590 1030 -141 194
2799 194 425 -127 -308 -25 -409 -804 607 -376 747 504 70 306 -129 -291 273 -316 -1320 978 -8
2818 -8 -336 -483 59 598 1700 72 300 -1229 -156 113 214 797 -967 -75 -1101 936 -421 58
2836 58 -651 439 -78 623 -55 557 172 252 -97 -843 -44 840 874 185 -1 -2051 1224 68 -235 -720
2856 -720 -766 -134 -82 102 -68 149 732 -279 564 965 339 -574 1501 -301 935 -349 -167 71 360
2875 360 1566 829 374 -197 979 -91 553 -244 -377 -1249 403 133 -522 -89 147 -974 -784 -2473
2893 -2473 -482 -1261 471 -486 65 -353 -697 -230 -357 -201 -591 -298 -1112 451 183 820 1515 1511 597
2912E97n20k02j929M57K358k76j180J611p16P81O24k343q43J360j331L448j172
2929G24j377q00L73Q43k57p00K74J481j443J33J208o10M54j086J230l56p66K05
2947d70P73q53L52Q84j361J116j204M09J534q61k11J53k4o58l06P78P0K61p35
2966c53k64m08k08J207J0Q40j382N96j43J188j129K16K60k068J972m98J21M06
2984C63m80Q26n51K08p0j345Q89o63l1j44j08K36J299q24R87r66J83n21J452r59
3004b19j229K518k76J09k579J148J253p47L04j331J264J27M85p98o93J121n62
3021a05l15j280O17P92J037j008J599j842J124j231N58N47j08k20Q83k55j052
3038b59J561o74o88n73j63J452j526n5J392L92r47oL09j074J042m13Q80j762N94
$$ plain form
2912 597 77 -125 -2054 -1597 761 485 -695 916 200 981 1605 -738 -1581 -221 -1552 1896 724
2929 724 -653 -1453 -1080 -237 -494 -1194 -920 561 -882 -749 459 -151 303 -783 447 91 -675 -470
2947 -470 303 -550 -198 686 -675 441 -763 -354 1180 319 108 261 237 -421 -727 51 121 382 -353
2966 -353 -617 -1025 -1233 -26 -16 824 -558 38 -105 1083 -46 170 430 -1638 334 -164 -43 363
2984 363 -117 709 158 366 296 -1049 -160 -823 -854 -998 -1106 -870 429 -395 592 -374 -191 -712 740 -219
3004 -219 -1448 1070 794 903 -1676 -528 725 -22 282 -1049 215 342 827 29 -664 457 -105
3021 -105 -420 -1700 -1083 -291 746 -262 1337 -505 619 -612 -54 493 385 165 1048 793 -259
3038 -259 1302 628 -60 -633 -796 656 -870 -925 467 859 -88 -94 215 -859 183 -230 650 -1112 -518
3057e18K97K57P9k23K92k32j12J147r20j138J247j5N04M4k25q4q61N36j52K65
3077A88k45l48Q78p9J96r26m4J109N3l35k94l98L14J261j795m68J461j123P84
3096A89r75J141K30r80K89M92k08k96K69m9l09K55r2K16l68J193j703k14J428
3115E08m23j53m71Q7L00K83O29K52o32r97J511r85n4N50n77k69q9M88K67n01j61
3136d37P89p41k70N02m00L02J129o22Q02o97j121M03L61j096Q62M67O30j471M02
3155b06M41j187J549j106K092k413J372j08n18l37K22P42j524K62J29J3Q11n74
3173c40K31k15O84m70k69P94p66L34M03q90R79p17K41J30l78R70o72K77o73R52
3193F05m24r29J83P88m98J6N10m29K50Q70q46O30o83j380R74J108M68j053r47
$$ plain form
3057 -518 -221 36 115 -108 184 -48 -160 987 67 -1071 176 161 665 709 484 400 -461 75 -77 188
3077 188 -57 -405 473 394 590 -336 -380 729 782 447 153 -245 69 1330 -465 -933 528 -595 189
3096 189 -786 355 585 -395 -106 386 178 -118 151 102 -207 48 -44 172 -196 997 -706 -920 508
3115 508 85 -68 -539 -452 -152 131 760 1012 380 -617 894 -91 -145 405 -172 -441 -530 -42 225 -276 -437
3136 -437 352 -389 -659 -157 -557 -255 874 252 1054 357 -764 -361 0 -1096 -234 233 863 -608 -206
3155 -206 235 -952 597 -509 1583 -830 542 434 -84 -421 -199 543 -981 -719 -590 -577 234 -340
3173 -340 -109 -324 360 -110 -379 415 -351 -17 386 -504 475 -242 -1 129 -249 721 49 326 -347 605
3193 605 181 -748 -565 223 -275 -259 251 -178 72 942 96 726 43 -1337 -363 745 1213 160 -787
3212g87J18J01J826N31j604Q9N55r52J31n4N42p73K029o24j283r00J425n44m9
3231b23Q07k159J133L2J465k138O68j18O69M16j145P67n06l6o3Q18j30j27p59
3250f29O33N07j896J635r32M27j67J282q73m29O50m08l51n40J698n58N60p81K47
3269G5P57j083N97j33k18m44j00J142j068K00N42L87p90j80N84j380K8R91o19
3288g12K10R56J72Q6q02M91p52L20K23L04p20K52r97P75N05M9l61K26k22M61p74
3309c10j026K848j191K48j030O34m74m94J129k19J050j598O31K32m24Q8r26l12
3327a144j31J889j585O53k2O69Lk033K268n99j3N0Q47J21k88r59O86n56K045j537
3347C64p31k9j0N1L88M14k50j436o16J273J020l24N35l30J383j669Q8m14K00k41
$$ plain form
3212 -787 -669 -568 1258 1789 185 274 829 -123 8 -46 496 -277 1752 1128 -155 -1055 370 -174 -223
3231 -223 584 -1575 -442 -410 1055 -1083 -415 -533 136 552 -593 174 -332 -368 -431 387 257 130 -629
3250 -629 4 511 -1385 250 -682 -255 -422 860 -13 -442 208 -200 -551 -1091 607 49 609 -172 75
3269 75 832 -251 346 213 -5 -449 -549 593 -475 -275 267 654 -136 -316 268 -1112 -1084 -93 -712
3288 -712 -502 454 626 712 -90 401 -351 -31 192 496 -224 28 -969 -194 311 360 -1 225 3 464 -310
3309 -310 -1336 1512 321 569 -461 173 -301 -795 334 115 1165 -433 198 430 6 94 -832 -1144
3327 -1144 -1275 614 -971 -318 -340 329 332 -1701 567 -32 -45 5 852 973 685 -274 412 -144 1901 364
3347 364 -367 -396 -406 -355 33 447 197 -1239 -1855 -582 438 114 649 319 1702 33 121 -293 -93 -334
3367c34j42m70j418K906O04j029L52j33j254mQ62M43j74n98J372O6k83k128K221
3386H59m47j074L38R45j446M68J077r21Q58p13O6n67J171p47j97Q60r25J91o47
3405h51Q80O39L69j593J134j130J248p3j550Q85l35K36k39l78J4K96M29L16n11
3424b14J194p59R0j60M90r85R1p68o5Q17n89M26M56r56J020K0m58on21J842j167
3445b02o59mP08M29m77R81n98P9r18P51l01N71m76p5k47J021n25o54k48K01P79
3466A36q27N75K84q1Q08m43M70q13k01L48p08k23M86R50q14j033R64o05L47m37
3486h17P48M26J44l90M80M7j529N00n79J87R82k69o1O60j153P96MQq8m10N84j118
3508h48m6J004Q41q52R8n32L34q41j82P56j642J813k9k99N59M32j210m5J398P2
$$ plain form
3367 -334 -476 -946 -2364 542 1146 117 469 336 -918 -922 -60 383 209 -389 983 1049 766 -1362 859
3386 859 412 -662 -324 621 -825 -357 720 -201 657 -56 10 -557 614 -133 -330 530 -395 -204 -851
3405 -851 29 668 1037 -556 578 -552 696 623 -927 -42 -377 -141 -380 -758 -744 -448 -19 297 -214
3424 -214 980 221 311 151 641 -344 -253 -1021 -1086 -269 -858 -432 24 -932 88 108 -350 -356 -877 965 -202
3445 -202 -861 -865 -157 272 -205 776 178 257 -661 90 -211 360 -116 -191 -438 583 58 -596 -844 -643 136
3466 136 -691 -116 168 87 895 452 922 109 -92 256 -452 -675 -189 761 -53 -1086 -122 -727 -380 -817
3486 -817 -69 357 501 111 591 638 -891 -391 -970 -783 199 -70 -131 529 -624 172 176 184 96 -314 270 -848
3508 -848 -894 110 951 99 197 -335 -1 -842 -1024 -268 -1910 -97 -126 -425 134 566 -644 -689 709 781
3528G81p47L63r92l1J817j294K33L9o81O65N17j408J638j576M53o82J982n27m76
3547G4K20r62J245k529J681K84L95j29j975K914p38o69K69k53o10K16p06Q24M14
3566c5o10J96M95O36m79N94m58j543J910J48j002M90j621J941j701K355j453P41
3584F04j499J824o25N37M11j619N29n20R4N68n74L22M58n01N23M89q48Q92j099
3603c4L25J354j160j75p76R48r37N21k56m88Q08k40j32L05k26o42L25n82J411
3622C49Q22r86j446J108K37k52l3p1Q35k59r11n8Q47q83M50j47k48J482r83K77
3642A30j893K608p10K44k01l10j68p72R69j847K728j859J865l81k80o83M82L90
3660C12L14j858J365N13k441K007r68J326j439J162j518O65M21J165j641L2L31
$$ plain form
3528 781 34 397 -595 -626 1191 -103 130 169 -512 153 670 -738 900 -676 -223 -905 1077 550 74
3547 74 294 -668 577 -1952 -271 13 408 279 -1696 1218 480 -189 80 -173 -783 -567 -1273 -449 -35
3566 -35 -645 -449 46 682 203 797 339 -1204 706 854 -148 342 -1279 662 -1039 1316 -137 604
3584 604 -895 929 304 841 1252 -367 162 -358 -264 304 -270 52 510 9 532 1021 173 1065 -34
3603 -34 291 1645 485 310 -466 482 -455 66 -190 -678 130 -110 -242 63 -163 -805 -480 -1062 349
3622 349 1171 185 -1261 -153 84 -168 -201 -272 563 304 -607 -665 182 -701 -251 -398 -646 836 -147 130
3642 130 -1763 845 135 379 178 -132 -300 -1072 -103 -1950 778 -1081 784 403 123 -560 -78 312
3660 312 626 -1232 133 646 -1795 212 -756 570 -869 293 -1225 -560 -139 1026 -615 -583 -252
3677b52j088J532j508N52J839j439J014j033L4k72J094o27k22N44O65k83j510
3694i60O24L1m86J145n03j021r5J686K53p30R19L35r49Q01k320N81l55J63J509
3713F28j281m78J087j78M95L0j340M71J32n06K035j63j50J327j529J68n80Q9J120
3732A377m89j425M90O31q55m4k66l14J407j386L0J537q71m37Q4J225j181P28P7
3751C18r68O10m74R75R7p0M45j569Q25N80r19L34p8J491j823K44o11M06J94l77
3771c70j37L31M29r31J160r80M15o26J204j10q11k79J114j47K36r97k50p95K315
3790G71o50l58K16M94m85k69R9O11Q27j937J32J44J02J91k05K01N61Q50k571J155
3810a21L37O70j881J203Q64j661L80l94J087K72j126R31j549M85J194j519R24
$$ plain form
3677 -252 -1340 192 -1316 -764 1075 -364 650 -383 -349 -621 473 -154 -376 168 833 550 -960
3694 -960 -336 -305 -791 354 -149 -1170 -1265 421 674 -56 863 1198 249 1050 -1270 -689 -1044 -881 628
3713 628 -653 -1131 -44 -222 273 303 -1037 -566 -434 -940 1095 932 782 2109 580 748 168 257 1377
3732 1377 888 -537 -47 584 -271 -315 -581 -895 512 -874 -844 693 -178 -615 -531 694 -487 241 318
3751 318 -650 -40 -514 461 558 488 933 -636 189 769 -150 184 106 1597 -226 18 -593 -187 7 -370
3771 -370 -507 -176 253 -678 482 -498 -83 -709 495 385 -426 -705 409 262 498 -499 -749 -1544 771
3790 771 121 -237 -21 473 -12 -281 -182 429 1256 -681 -549 -405 -303 -112 -317 -116 445 1295 -1276 -121
3810 -121 216 886 -995 208 1072 -589 -209 -603 484 756 -370 561 -988 -503 691 -828 96
3827I6k90l21K65R17m3j959K021n50l43K33R5N19j529O76J16J685j265m34r76
3846a087j76J090M20n41K15o5n6M41K74L5p61O89q60k94J359m30l19OJ36R47j447
3867d24M15o65O45K044j787j35k73o15K07N78P01p86j1N5o83R37K98n70L68q88
3887e89P48K91j162N05L35j21r49K52M01K32M16l13rK26p42n10J103N1o28P66
3907C03Q9j75L7r6K95p59P75r80O26k98j88J317j778Q10P7l40P48n46l72N57n84
3928d82L11k85R96j008K45K81j48M60j917J568J051j205L83O53q96o10L89P29
3946E15k36l28O23p60MJ64M3j31k72m56J439j728J205k33N92k4j026N09K25MM17
3967E46p20O18L56l27J15M09j134L75O0o16N51o27J721p34k36K14j230J164K01
$$ plain form
3827 96 -194 -515 -250 667 624 -1335 686 136 -207 26 121 640 -889 -213 -97 1588 323 -111 -1087
3846 -1087 -1263 -173 247 -294 -79 -144 -200 241 515 550 -211 478 -382 -676 683 253 -66 -60 76 1023 -424
3867 -424 -9 -674 -29 2015 228 93 -180 -795 -588 -10 691 -95 -106 -51 -734 203 501 -69 299 -589
3887 -589 159 450 -712 -207 128 7 -942 -690 -289 -57 359 46 37 263 -479 -989 114 165 -463 303
3907 303 392 217 254 158 453 -306 469 -511 115 -183 -371 946 -832 -22 55 -285 463 -83 -455 102 -482
3928 -482 -171 -456 540 -468 -223 58 -90 370 -1547 21 1072 -133 250 903 7 -603 -214 515
3946 515 279 -49 574 -186 -182 -18 25 -106 -378 -834 605 -1123 82 -151 441 417 -609 -100 125 129 546
3967 546 -174 444 800 473 588 997 -137 238 298 -318 233 -394 1327 593 357 571 -659 505 706
3986G06p51L04p89P67j080J356k6j17q94R55l76n09Q20m83R90q59M50l48j309
4005a193Q70O90o88J446p86N02j388M12P43p14l54n28K261j869k9J237J61j449
4023f76J210r13L53k01o1M88L52K83j442p41N03N14J111j041O74j044Q62P36j284
4042c17K45N80j97l27l59j45J72l67J272k10j00p02J59kP3k10O28j466K400k06
4062I21j571P58J98K49r92J37O03K04m11N27n71J73l28M0p6j384J126j67P15n49
4082c98P45m86r34J972l65K8j87j05l10O11l53k59K11n13J325j522J163j7r81
4101c75R40p29J7p3j21p19J993j912K599j603R91q46N4J350j844K58p54J750j081
4120a05k38j118O11K061j348p65R51N51Q04j908R48k081J966R32p68P71p77j11
$$ plain form
3986 706 -45 259 -530 237 -843 513 487 370 -524 431 55 -454 366 -117 873 14 464 116 -1193
4005 -1193 -323 367 -321 1125 339 841 -547 -135 608 -106 -460 -988 1273 -596 -625 612 773 -676
4023 -676 534 -379 -26 -227 -288 200 552 835 -607 -1348 -845 -331 780 -261 413 -631 231 967 -317
4042 -317 -72 508 311 -16 -375 -520 -348 -715 557 347 247 -455 -296 -298 -225 -435 193 -1273 1127 921
4062 921 -650 108 306 555 -437 -300 303 507 96 623 52 225 -103 -63 -139 -1523 -397 -564 151 -398
4082 -398 347 -139 -1073 899 534 562 375 270 -40 571 218 -41 170 -343 982 -540 623 606 -375
4101 -375 565 -164 -147 -220 -341 -1060 933 -979 1620 17 1008 162 216 1566 -278 -20 -774 976 -105
4120 -105 -343 -1461 -850 1211 -137 -902 49 600 1404 -504 444 -1637 329 1261 493 1264 487 376
4138C76n18n31P81O32k52j18j40j265Q06j16J444j100l35k47O95l26K47M49J42
4157F24m36p13M51m70N8k21O87P08l98r72J395j106J172j42j669J140M7j232J412
4176C35m12P85r31K05N4m90M47N05j083n22J718p40N3L98l55l50K57N74j30l16
4196Bj077J599rn65l68p2N02L8j47l94P87n95J245j354J24O07N42J07j527m39
4216i94M58P82K63l41p24J742p69r50Q30j112J044J78R63j463n16O87m65N23k27
4235i1Q74j505J076J188k296R86J5r07M32l2J124q61j095J34J616o70l96M09J68
4254A69L84M12j625P30J50j75J71j22q74J032M9o45J314o76o35K27M65n33j434
4273a616J580O49j5o24j451K274j681M05L72o2L5R62o63l49O71Ok48j33M78o19
$$ plain form
4138 376 -142 -673 108 740 488 370 230 -1035 -229 -345 1099 -1 -336 -583 112 -214 33 482 624
4157 624 188 -525 -74 -544 -486 -707 -20 688 290 -682 713 -393 779 637 -1032 108 155 -1077 335
4176 335 -77 708 -223 -18 36 -454 -7 498 -585 -1107 611 -129 -76 322 -33 -383 -126 448 318 2
4196 2 -1075 524 515 -50 -418 -490 12 50 -97 -491 296 -299 946 -408 -284 323 865 972 -555 -994
4216 -994 -536 246 509 168 -556 1186 417 -533 297 -815 229 407 1370 -93 -609 78 -387 136 -91
4235 -91 783 -722 354 1542 -754 232 247 -660 -228 -260 864 3 -1092 -958 658 -12 -408 1 169
4254 169 553 965 -660 70 220 45 216 94 -780 252 301 -344 970 294 -341 -114 351 -182 -1616
4273 -1616 -36 613 598 -26 -1477 797 -884 -479 -107 -169 -134 828 165 -184 487 493 245 112 590 -29
4293b9J74j75m04Q60k40L80n67L36k74j00m53J427p56p71j82P20K2M74o38O21
4313D25j97j214J682q43J2L78j020J119j136N60m46P44O3R40n63r55r3l41k03
4332a088J052L14p08J512L41k086R30R89j390p65J460r20j50n94J605j773K019
4349G48j11j97N43j489K456k346N3R80Q97j499j081J470j810kK046N73n58J067
4367A740j319k15M3r80o40J097Q37j850K0J056N35j341L52P40p59J493j825L43
4385f73O82k4j071J463j168P18N22j125K115j599j93R42j083J179o57k59j095
4402a326O61k52R09m35Q09q07j94R94J48p42P46q21N95k86N09K71j051J057l20
4421D65j6m35j1P75k156J170j097J809j345N91Q55k90n74J058p9p30m72n72O90
$$ plain form
4293 -29 145 -30 -434 426 186 566 -1 335 61 -39 -492 935 179 -592 -774 -54 -32 442 -196 425
4313 425 228 -986 696 -147 -135 243 -777 342 -794 -234 -680 64 127 1067 504 -451 -544 -885 -1088
4332 -1088 -36 278 -430 1082 1423 -663 267 1256 -134 -899 561 -359 -509 -1103 502 -1271 748
4349 748 637 440 983 -506 1950 -396 -343 637 1534 35 -1046 424 -1386 -1388 658 1231 673 1740
4367 1740 421 206 249 -731 -1371 -274 563 -1287 -1267 -211 324 -1017 -665 75 -684 809 -1016 -673
4385 -673 9 -15 -1086 377 -791 -73 449 -676 1439 -160 -353 589 -494 685 28 -231 -1326
4402 -1326 -665 -917 -8 -443 366 -441 -635 359 507 -235 511 -310 285 -1 508 779 -272 785 465
4421 465 449 14 3 778 -1378 -208 -1305 504 -841 -250 605 315 -259 799 720 -10 -482 -1054 -364
4440c64J31n17J342m64p38j42J056o59K97R44j107J114m37J04q2m5l64j586K923
4459A406j407L53K38l08K39p16p4L09p87J819j360M24j32m9Q66K9q52j66M11K68
4479E11n11J909j108p07J78l27J100n20j308J424m27n74J046n62o4M29l24J477
4497A642j887q59R18q17K043k166Q31j95O99J78o00J099j686m79J009M58K61J01
4515E50o57Q13j397R34n42J06K67j918K038p82O84l10O60j443N96L33k75o06N76
4534c73R7pr94L43J070j16p7J17K38M69j155j27J871j369k33M76l31j642J521
4553b22Q5K77m85o96J444J043l6k210R97M72r97j65J128j5m46k83J367L3j470
4572a79J428j777P64l49N62j271N51L78L07j182K710j616r69R2j64R56j096O71
$$ plain form
4440 -364 -233 -750 592 128 -610 -752 304 -355 -58 886 -221 893 456 560 478 433 69 -1517 1406
4459 1406 -1 352 590 282 521 -195 -269 40 -747 1072 -288 136 4 -45 821 850 -2 -168 243 511
4479 511 0 1909 801 94 272 -55 1045 525 -783 641 214 -360 686 124 60 489 165 1642
4497 1642 -245 -1104 -186 -1003 1040 -1126 -295 -490 209 387 -213 886 -800 -1279 -270 188 449 550
4515 550 -107 706 -691 243 -299 -193 74 -1844 194 -588 96 -214 446 -997 -401 -68 -343 -949 -373
4534 -373 -276 -283 -1277 -934 136 20 -57 60 298 767 -388 -515 1356 -13 -246 230 -101 -1743 -222
4553 -222 -137 140 -345 -1041 403 1446 1410 -800 197 669 -328 -493 635 620 174 -109 1258 1291 -179
4572 -179 1249 -528 236 -113 449 -822 -271 107 414 -768 1942 326 -643 -551 -715 241 -855 -184
4590a84n68N20J265j300k77K98J176o32j095J712j00m11j39k8q63N11J887j910
4608a38J319j296k38J425r95n96J032j272L38l00J222J375p60j954Q58K01j017
4625g96J488j284k81p24N3O64R06n46l21N01O36P94j401J294j935M96N82o4L16
4644C78r4j30k48k93J367n62p64o19R40K75o33K16Q5J203j657l60J275m05M71
4663D45k4j052P35m28J31o13Q88R7j91j56Q95r77M51r51L01k8r74K134j7p34Q19
4684G51j87n92P6j76J004n30o07l97R88l36m41L48j69K25k49R83q86J014n58j73
4704H8j38M51p27q80J147n94P90N41Mm73P97p88l56K73J304q16r50M25p19J042
4724D21R5p63K79j178Q00Q22K46j187R37M39p53L38j130O62o44k17M78nk56o36
$$ plain form
4590 -184 -752 -232 1033 -267 -544 -246 930 298 -797 915 815 404 265 237 -626 -115 1772 -138
4608 -138 1181 -115 -353 1072 77 -519 513 -759 -421 -721 501 1876 1116 -838 20 221 -796
4625 -796 692 -592 -873 -1597 -1544 -880 26 -520 -841 -340 296 1090 -311 983 -952 -456 126 62 378
4644 378 284 154 -94 -387 980 418 -346 -965 -25 250 -383 -167 -82 1121 -536 -896 379 -26 445
4663 445 421 -631 104 -324 -193 -806 82 179 -12 -168 727 -250 201 -750 -449 -477 -1451 683 666 -68 751
4684 751 564 -28 48 -128 876 346 -261 -658 330 -6 -447 -99 -268 -43 -292 691 -195 819 261 88
4704 88 -50 401 -326 -1206 -59 -653 137 678 682 209 1006 218 -138 135 1439 623 -327 98 -621 421
4724 421 516 -247 32 -1146 -346 476 722 -465 472 911 158 496 -634 28 -616 -833 -355 -360 -616 -1252
4744a252N16L53L23Q4o51P66J30r11N14k85O91o75Q94K92j045P19j87j568J162
4763a30J318j365L87k21m83l54O56j97m3J015Q87k286R09j001Q06K92K73m73L60
4782C50n10l21j59J203q60N10o27O11m50L56m28Q92L44j502K26o89Q34J23R01
4801H04j076L29L91l40p0p1J03K5k14k44l14Q27l02K71k42k66K99J035j559M69
4821a45Q13j410Q89L9o6q03R45j332J256l06pq43R15k6j260K010q87k8o7O9M02
4842A58j12n84J163M08j272R00l76k18Q85p06M7o13O01K06k10o44N91j40L76j238
4862g78J572j105n45J062o93K166j597J579k65j665L88K24P77j112l03P58k18
4879B45L01j750J560Q40j9K77j690K37R37j691P08k78l27Q90q61N63n25L33l51
$$ plain form
4744 -1252 -736 -383 -60 24 -627 139 269 -642 -128 -413 278 -397 497 789 -256 463 276 -1292 -130
4763 -130 1188 -177 210 -11 -494 -848 -192 -389 -432 583 1470 -816 93 -908 -102 190 463 -10 350
4782 350 -160 -481 -640 563 -297 213 -414 197 -253 103 -325 567 911 -591 -365 -1054 -220 -97 804
4801 804 -272 57 448 108 38 -33 70 95 -119 -363 -677 150 -152 119 -123 -389 -90 945 -614 -145
4821 -145 668 -742 147 186 120 -683 262 -1070 186 -120 -127 -970 -55 -81 -1341 669 -218 -246 -313 -244 158
4842 158 46 -538 625 1033 -239 661 285 67 952 246 293 -320 281 487 277 -367 224 84 460 -778
4862 -778 794 -311 -856 206 -487 1679 82 1661 1396 -269 119 343 1120 8 -295 463 245
4879 245 546 -1204 356 1196 1177 1454 -236 1 938 -753 -45 -323 -650 240 -621 -58 -583 -250 -601
4898f01N69n48M13P45j906J343N19k176R77k94P92M45N47rJ80j052LN80n81j651
4918a705L177j162Q85o59n61R71k79j503J275j115O58L47K4M49k544K540j596
4935g98Q68k1j065J421K3j920J703J167m86j412j17N10L98O58j82j461K32L57
4953a25M89j36Q23n56k33K06l6o08K116j765M02J047j633o81K38Q04k27O97l50
4972D72n54n72O03k6J026j319L06M48O50j284N04m53J05R45m27qo94Q93p01L85
4992B99q60P85n64k61m77J479j864P21Q77j816J711J491R65k699r0M98m48l56
5010f09N24P93k037Q40J79J93J317p03j653J552j498J163r44Q81j700J293j402
5027a811J376K120j557j038Q54M31n39m23K9N77r88J538l17n85L95r54J353K02
$$ plain form
4898 -601 -32 -580 -167 578 -1328 15 534 -1642 -665 -959 -167 278 825 816 996 -56 -53 527 -54 -1705
4918 -1705 1472 310 1195 536 -25 946 667 -836 439 -676 -18 329 353 802 -1742 798 -798
4935 -798 70 49 -1016 405 428 -1492 211 1378 892 -520 -637 -127 271 929 747 -714 -482 -125
4953 -125 364 228 1051 495 262 468 432 -176 1940 175 577 1624 -9 -690 -452 352 125 822 472
4972 472 -82 -654 -51 -77 949 -370 -64 384 1034 -250 254 -199 -94 851 424 416 -278 615 -86 299
4992 299 -561 224 -340 -601 -1078 401 -1463 -742 135 -1681 30 1521 2486 -213 -303 195 -253 -609
5010 -609 -85 708 -1329 -489 -310 -117 1200 497 -1156 396 -1102 61 -883 -2 -1702 -409 -1811
5027 -1811 -435 1685 128 -910 -56 375 -164 -587 -558 19 -969 569 252 -333 62 -892 461 663
5045F63l56l98J521o02j504J108p22R2j80J579r53j056n15O60J050j547J457r22
5063f25K034j339j35N2Q4l88j343Q47J035l35R8o78J265j081r0J784p03M21j422
5082e19J175k27j43j392J589j08o69J133j309M7K30j16L35k74J120r48q3P75N67
5101A183j794N09R12p88M82N0l43k44j136J724j84l20K02K45m09k98J70J23N57
5120F41j266J577l36j016P01p54L22O66k02j224K000r66J141k023k41J629n25
5137A24j512J724J783k262M12K86N66j111r92l30Q48Q3J45N77O18j556L92J067
5155H62p55J85k50L0J01K43l4o37k24J513n23j066J96L70J086j462k61P62j82
5174d6l99J337o84K14L32k434Q50L17J518j475J21J329j801J629j114r08J359
$$ plain form
5045 663 307 -91 1430 828 -676 432 -290 -198 -378 1201 248 -808 -1323 -663 387 -1160 297 -625
5063 -625 1409 70 -65 -13 71 -317 -1660 -813 222 -113 -15 -693 572 -509 -599 1185 482 903 -519
5082 -519 656 429 286 -1106 483 375 -294 839 -470 -423 -193 -309 26 -248 872 -76 -159 616 1183
5101 1183 -611 -102 810 22 504 554 211 -33 -1169 555 371 51 253 498 89 -209 -39 84 641
5120 641 -625 952 616 -400 301 -453 -131 535 333 -891 1109 143 1284 -739 -980 649 124
5137 124 -1388 336 2119 -143 269 555 1121 10 -982 -1312 -464 -381 -236 341 959 -597 -205 862
5155 862 107 292 42 72 173 416 382 -255 -479 1034 511 -555 -359 11 1097 -365 -626 136 -46
5174 -46 -445 892 208 422 754 -1680 -830 -513 1005 -470 -349 980 -821 808 -306 -1214 145
5191A45M65q53J49Kk04P29r03Q53K80j118M38J209o49j020r31J143q91J035O48
5210E27q62lO83K60n46j374Q70N11j320P63L0J864k200o94J030l32J807j196j138
5229a320J173j4k39M51j146J499m24L29k98K47j86k86M03n20l49j83J52K147q59
5248E77o28n46J383j163m66O44m82N71J30M41l27j249P57J48j783K324l85m22
5266d76k47P22k56Q99q46P5P53r62R90j79n20m13J99J136P66k126J019j733O61
5285e38O0J008K85j625O26q29J295M91k314K181J76o44L53j512j033K470J143
5302A593p08o15n98O43R17j501l2N61q85K98p18J140o4m88j160P68K50J572j606
5321f33O95n81J679m14j587J373j773J246Q44k224J057K6Q68r04p40J627l4p67
$$ plain form
5191 145 610 -243 -94 -92 -296 433 -470 383 663 -455 -17 1192 543 -477 -1408 -265 -1156 -121 527
5210 527 -335 -338 345 605 59 -1315 -445 66 -1254 -491 -461 1403 -797 -1491 -461 -793 1014 -182 -1320
5229 -1320 -147 -161 -400 51 -1095 404 -20 309 11 258 72 -214 189 -331 -680 -863 -711 1436 577
5248 577 -51 -597 786 -377 -843 -199 -681 -110 20 461 134 -1115 -358 -210 -1993 331 -54 -476
5266 -476 -723 -1 -257 642 -204 -129 624 -338 652 473 -47 -460 -261 875 1641 -485 534 -1199 -538
5285 -538 -478 530 815 -810 -184 -1013 282 773 -1541 640 816 172 525 -987 -2020 450 1593
5302 1593 885 270 -328 315 1232 -269 -301 260 -625 -327 -1045 95 31 -457 -1617 -849 -599 973 -633
5321 -633 62 -519 1160 746 -841 532 -1241 5 849 -1375 -318 -292 576 -328 -1068 559 525 -242
5339b42J896j795l9J194j562K78q93J830j438J998j859Q62o72j033M86Q79Q77
5356G67j369L65o85J192m88M04j079L94k74J468j095J07N04j72R20j382N62N36
5374F75j074O07p07O60o78J036o76K7J47R5l46m84J306k341J523J30R6m09J54
5393b59P22P87M14k175K86Q15o10l74L23L83l19m43L63n76l07K57J023K16o0k99
5413A67p5o24P23n9K15m49J55q83J118j224J760o25n53K53K6j95j56M92o54l13
5433i01K37J033k51j1k7K00q88j26Q25n40Q1J394j851K275j104p24M81p03l58
5452i58j3M07J86m35K23L33R48p68J42J31M68j202J539l91j070J674n50o34m65
5471d35N74J16m2m81M00o8n67K52l97J834r22l80J461j030K81k076J137l55L76
$$ plain form
5339 -242 1654 -141 -180 1014 -548 -270 -1163 667 -771 1227 -632 230 -442 -1475 -989 -110 767
5356 767 -602 -237 -922 270 -218 186 -893 -499 -773 695 -400 -293 211 39 959 -423 139 675
5374 675 -399 208 -499 161 -517 519 -157 -130 17 112 -234 -718 588 -1753 -230 -100 -4 -413 -259
5393 -259 463 1250 1664 -511 -225 590 -20 -394 -71 312 -7 -450 -87 -663 -970 -713 310 526 466 167
5413 167 92 -532 191 132 347 -102 53 -830 288 -936 824 199 -354 -101 -75 -270 -426 66 -588 -901
5433 -901 -664 369 118 107 80 280 -608 -734 91 -449 -368 1026 -825 1450 346 -378 103 -600 -958
5452 -958 -971 -564 -378 -813 -590 -257 691 -77 65 196 664 -538 1001 610 -460 1214 664 30 -435
5471 -435 139 255 213 -268 132 64 -503 -251 -648 1186 264 -116 1345 315 596 -1480 -343 -698 -322
5490c22n3L51r12k20J094k72n89N64J378r30M7l09J43o50L58M49L97m57J122p33
5510D56l20j077J512r22Q6k00M21m39O02L81M3j374O81J112j057R9p6L65j043
5529g50J088j102l3J079n23q1L45j28Q82k17n94r79L90J688j28j132r51J380n2
5548A82k08J83L56m41o65O28K03M85j067J137k16j071O98O64o1k052J89J187j099
5567i68R5K83N77K98O1l95m2R60K20j532o50K142n23j021R20o00l44J57O89l36
5587iJ521k100O88n85J227J87J29k60j164m6L50o18o37o0J655M15j319J155j319
5606g90J097o10N7l82J341k442J835k95O59j274j12Q13k58J217j517J107m74K64
5624B36K98o51J229q79M72K2j185O94Q00o92q29J940k82j741J140m50J0O9o87
$$ plain form
5490 -322 -375 -24 -936 -1156 -62 -334 -923 -359 1019 89 136 -173 -30 -680 -322 127 524 67 1189 456
5510 456 136 -941 571 -351 -265 -465 -44 -483 119 500 543 -831 -150 962 -95 4 -72 293 -750
5529 -750 338 -764 -797 282 -241 -322 23 -105 777 560 -34 -1013 -623 1065 937 -195 -1146 234 182
5548 182 -26 157 513 72 -593 35 238 723 -344 793 577 -494 204 868 807 -1245 -1056 131 -968
5567 -968 -873 -590 -13 285 346 -49 -91 869 1089 -443 -1093 1049 526 -495 425 -175 -519 -362 327 -9
5587 -9 1512 -588 100 -485 742 929 1058 798 -366 -412 -62 -680 -1317 -1377 278 693 -626 529 -790
5606 -790 307 -303 -246 -628 713 -1729 106 -189 470 -804 -916 -103 -361 856 -661 446 -28 236
5624 236 534 -117 1112 233 705 727 -458 236 1036 344 -485 1455 1173 -568 572 122 132 201 -486
5643d86Q96q74K16j73p88Q49J22n94P89K16N4L09j870K468j48k05l538K603q49
5662a003K322J30k132P01N66LM92p62l13M50j011N99J45O00j496K39N49r40j80
5681a041P47m0O44R66j968J475l20k406K462m97N93Q74j118j114q06J047O34J395
5699A527k238J498j297L87k78J240p00K12J008m89j063L81pM60m51p50j042R58
5717f44j212K454K00M50j618k35O22n04L88r42O29R54R14j213P31m51NL67m08
5736D87j012R58j115J301o3p22N42k66q04Q76P11j162M19k98j8Q99q43L15k72
5755f7J07K8q16K45K18o02J294k02q46R91o75p05K261j211L75r02P02k47k76L48
5775B0J48j47k0P2k75l50O73L83j542L78J035j512N02M77L89J235J147j258n13
$$ plain form
5643 -486 410 -464 -248 -421 -1209 -360 -238 -832 -43 173 227 536 -1334 1134 986 781 -2757 -154 -1003
5662 -1003 1319 1449 -683 18 584 587 1079 317 4 454 -557 42 187 787 -709 -470 79 -861 -1041
5681 -1041 -294 -334 310 1276 -692 783 463 -1943 519 22 615 1489 371 -743 -1549 -502 132 1527
5699 1527 -711 787 -510 -123 -401 839 139 351 1359 870 -193 188 181 641 190 -560 -1602 -644
5717 -644 -1856 598 798 1248 -370 -605 17 -487 -99 -1041 -412 542 1456 243 974 523 528 895 487
5736 487 -525 433 -682 619 556 -166 376 110 -694 182 893 -269 150 -148 -166 733 -110 205 -67
5755 -67 40 68 -748 -503 -285 -887 407 205 -641 350 -325 -1030 1231 20 395 -507 195 -52 -328 20
5775 20 168 21 1 73 -202 -552 121 504 -1038 -660 375 -1137 -635 -158 231 1466 2613 1355 842
5794H42m11L94p47j313J288k51P62L14j047P86j777K94K147q28o66l77k05K71
5812e24J134l92N58o13J28k16K85j392J940n22r2j347K123j260j126J460J91j37
5830A98JJ19n81K37R49K05j574M98L70j05n10K68o10l8J852k089M98j55J004l99
5850A38M05n60L26r33N71K67p34m89Q58J161r48k48Q2K9K01K321j421j877P68
5869h3J302j816R1M54k97K167j995k97L73J486q95o71O11K39j997N21J007K20
5887D20j053R1J269q90p58M75M54k56M24O45o43k93k30N28R81n02K92j234r8L13
5907f5j41K72j027M73Q68j089L1M03L18O67j062l4R46m64n28n68J681j280N36
5926f3r6j79P12k54K83j01m9L71M98J45J9p08J03j597K77J016L07j009P57L8o38
$$ plain form
5794 842 431 825 78 -1235 53 -198 564 878 -169 617 -1160 -866 1281 453 -213 -590 -795 -524
5812 -524 610 218 776 163 291 75 360 -1032 908 386 294 -1053 1070 -190 -1316 144 335 198
5830 198 199 318 -263 -26 923 1128 -446 52 422 317 -193 75 -535 -573 1279 -810 -312 -467 537 138
5850 138 543 -17 309 -624 -53 214 -520 -1009 -151 1010 62 -186 -104 -75 126 2447 1026 -851 -83
5869 -83 1219 -597 -506 -52 -349 1818 -177 -474 -101 1385 490 -181 430 669 -1328 -807 200 420
5887 420 -633 -542 727 -163 -921 -446 8 -248 176 821 178 -115 -345 183 1164 662 954 -280 -378 -65
5907 -65 -206 66 -961 -488 380 -709 -678 -275 43 710 -352 -386 560 96 -432 -1000 681 -599 -63
5926 -63 -159 -338 374 120 403 302 253 624 1122 1267 1286 578 681 -916 -639 377 684 -325 432 470 -168
5947a68J352r76M15j93Q62j079o40J206o99N12j9p66M08k2K42n05j60J003k353
5966a580K003pO28q61p42n09M68N2L14M80p61J335j95j715K331m88j123k80l40
5985i90J440j36j297N43J034r54J533k341J882n00r19J34J94M79j927K212l7q01
6003d51N7O03J67j511J356j6r55Q52N87j699R97O39j168J204r48P09p05M4n18
6022g56P10q2J433o73j154K309j533q5m07R0L79J57j122J22J425r05O74m85k21
6041a24m87J932j775m70Q84K89o0j63Q6k7j078J755r30j087J220m56J066J35j393
6060f83m05J665j006J394q7j196l07J130p11O23M96q66j238K629q69p83l04p29
6078a247K12j281K578Q36r79p80J450j261j178P71l61J845j639J21Q56n56N5J914
$$ plain form
5947 -168 1184 208 623 430 1292 213 -427 779 80 592 573 -193 215 193 435 -70 -230 773 -1580
5966 -1580 423 416 1044 183 -559 -1068 -600 -548 -234 246 -515 820 625 -1090 1241 753 -370 -650 -990
5985 -990 450 314 -983 -440 594 -360 1173 -1168 714 214 -705 -571 -377 102 -1825 387 350 -451
6003 -451 -394 209 376 -1135 221 205 -750 102 689 -1010 -13 626 -542 662 -286 423 -282 -238 -756
6022 -756 -46 -128 1305 632 -522 1787 254 169 -238 -148 231 388 -734 -612 813 -92 582 97 -124
6041 -124 -611 1321 -454 -924 -40 249 189 26 112 85 -993 762 -168 -1255 -35 -491 575 710 -683
6060 -683 -1088 577 -429 965 878 -318 -625 505 -206 417 913 47 -1191 1438 569 -214 -518 -1247
6078 -1247 -1035 -2316 262 1098 119 -661 789 -472 -1650 -879 -1240 605 -1034 -913 -57 -613 -558 1356
6096A356j440J35Q56j896J322j164K50k77M68M60j188Q63J195j825J335O72j043
6113G9M76l86m10N42K28p01k23N64J91m92K62l46m1J10l82P39l28L02J719j798
6133A05l00K29q0N21j000N32K20jl57m55J48O83r20J164R83n17o34n7j75M37k31
6154B95k48j36J4o4k25Q45M49q68K93Q32k281O06J123p68k55J373j552J334j025
6173b58J081q70r19R6P05K81M65m16j151K92J289p66r37J089O84j122m23J048
6191A68j35L35j77m33M62m18R82o23M88j175K86j088O51J263j732J93K610k181
6209e24J504K93M20j080j58J074j720j52m56K360o79j845Q97Q7o56K223j498K312
6227B402k271R57q54p87J443j043J47j014Q05n08N43j071J656j324j41J110L56
$$ plain form
6096 1356 -84 51 907 -989 333 -831 -581 -858 -390 70 -1118 -255 940 -885 450 1122 79
6113 79 555 169 -241 301 529 -172 -395 169 360 -132 130 -216 -257 -147 -529 210 -118 184 1903 105
6133 105 -195 34 -46 475 -525 7 227 226 -131 -586 -438 245 -675 489 1472 955 321 264 89 526 295
6154 295 47 -89 -75 -139 -364 481 930 62 355 1187 -1094 -488 635 -133 -388 985 -567 767 -258
6173 -258 823 -47 -966 -870 -165 116 581 165 -986 -694 595 -171 -1108 -19 665 -457 -880 168
6191 168 33 368 191 -242 220 -198 784 161 649 -526 -240 -1328 -677 586 -1146 -953 1657 -524
6209 -524 980 1273 1693 613 455 1529 -191 -343 -799 1561 882 -963 -66 21 -635 1588 90 2402
6227 2402 131 1088 234 -553 890 -153 -6 -1020 -215 -723 -180 -1251 405 -919 -1060 50 406
6244D06j593J318L30j078M07K22l23O00j83m3k69M9J84n08k04k9m83J463N10j98
6264E78j403J945q47q73M24n3K69m5N00o5K4j133l33J21O93J125l87K83j681J083
6284B25j10K69q9q31J26q94J308L08l12n60J188m7M02j887M93N87L10j4k97j362
6304a187Q05m98L059k655R85j423L675j515j439j73K27J015j687J003M2j73j051
6321i90o45r5K127j583K434k359J043l11n20k70K37M88K67O82L57K41p10M41j973
6340a139P4J27L15J603L13j573n64J398j341J677j230o49P9K19N55q23L12J190
6358E43j093M52m31l27P23j777K229r66J268q13p9P11M42MR23l396J466o69l2
6377h22l0j1L39K07Qo91J021j348k4P56O76K90j168M72J255j947J299j988J417
$$ plain form
6244 406 -1187 131 461 -617 -210 12 -311 289 106 63 -206 -157 27 -481 -685 -714 -1197 266 776 578
6264 578 -825 1120 273 -600 -176 -229 40 -5 495 430 454 -679 -1012 -891 -198 927 540 823 -858 225
6284 225 115 384 295 -536 -410 -1304 4 312 0 -560 628 581 983 -904 -411 176 486 472 175 -1187
6304 -1187 -382 -880 2179 -476 509 -914 2761 1246 -193 -366 -139 876 -811 192 234 61 -990
6321 -990 -1635 -1730 397 -1186 1248 -1111 -68 -379 -899 -1169 -932 -444 -177 505 862 1103 393 834 -1139
6340 -1139 -1065 -938 -623 980 1293 -280 -844 554 -787 890 -340 -989 -910 -691 -136 -959 -647 543
6358 543 -550 -98 -529 -856 -133 -1910 319 -647 621 -192 -271 440 882 886 1809 -1587 -121 -790 -822
6377 -822 -852 -863 -524 -317 -309 -1000 21 -1327 -1351 -595 81 371 -797 -325 930 -1017 282 -1706 -289
6396b89O29k491J607kK3K18K28k96J434J03o05k05j713K027j051N94j079Q06j008
6415a070k23J229j75j69j3O07j708J853m47J748k417J557j711P68J189j390J424
6432A052q42o68j78J605m71K26n70o43L81j64p04P99q50K866j859k22q7o62K67
6451g24n63K99K802j736P5p81n12O51J137n83p02L20k81o2j5J27Q90o65p7M60
6471F0j02jP53j616O44L78O8o58n9J517j383p68O30k36j447L620j213k988J798
6490a003J805j190L29r00k68J540j278J852k156J360R89q37o4N2l23J643j220
6507C31o5k83n84J03O24N8r3P71j796J874j316O00p50j97O78N87j172O39P5p54
6527f70K20N81p23J563p82j7K53j129R64q84L48J296o53p08k78k05J009j482J913
$$ plain form
6396 -289 340 -2151 -544 -546 -523 -305 -77 -373 1061 1164 559 354 -1359 668 -383 211 -868 -62 -1070
6415 -1070 -1293 -64 -239 -408 -421 186 -1522 331 -116 1632 -785 772 -939 -171 1018 -372 1052
6432 1052 210 -458 -636 969 498 724 154 -489 -108 -272 -976 -177 -1027 1839 -20 -242 -329 -991 -724
6451 -724 -1287 -988 1814 78 153 -628 -1140 -489 648 65 -637 -317 -598 -660 -675 -548 342 -323 -400 60
6471 60 -42 -43 710 -906 -262 116 184 -474 -533 984 -399 -1167 -537 -773 -2220 1400 187 -2801 -1003
6490 -1003 802 -388 -59 -959 -1227 313 -965 887 -1269 91 1080 243 179 231 -92 1551 331
6507 331 266 -17 -601 -498 126 184 91 862 -934 940 -376 224 -526 -723 -45 542 -630 9 84 -670
6527 -670 -450 131 -592 971 189 172 425 -704 260 -624 -276 1020 367 -341 -619 -824 185 -1297 616
6546F16r18n36N24j83M72Kp01m76J073l6N00j3j612J467j290J129J320n26q24
6565a2J213r00q42N31O07k49K41J62N68j211r91J663j337J652p90M45k81q12J157
6584H14p16k00j109P19K73j188O49O4J20j93K89j58j56l08J947j006m59P04n79
6603d93K70m06j08P40n95R78j07l66O52o8p00K81k15M47R91j385K06M43n83K91
6623B73m26J1O58J23j298L47N93p02J045j487N87k8J48N70k211J394P45q40J879
6642A381k466Q54J429j053m89P82k10q24L29R35K15o36j180Q6J088m04M67n30
6660b26J456j678k5P9K08P02l07P0n53j20O93m90J45r3j020R97R01j456R13K84
6680D80K09j021J973k213R01n53K71K43n76J02J988k040q2n07J109J2n21M51L91
$$ plain form
6546 616 -302 -838 -314 -497 -25 -23 -724 -1200 -127 -163 337 324 -1288 179 -1111 18 1338 812 -12
6565 -12 1201 301 -541 -10 597 348 589 751 1319 108 -883 780 -557 1095 305 750 469 -343 814
6584 814 98 -102 -1211 -492 -219 -1407 -758 -694 -574 -767 -478 -636 -792 -1100 847 -159 -618 86 -493
6603 -493 -223 -629 -737 3 -592 386 279 -87 565 497 -203 78 -137 310 1301 -84 122 565 -18 273
6623 273 -153 -142 516 639 -659 -312 281 -421 624 -863 -276 -304 -156 414 -1797 -403 342 -498 1381
6642 1381 -1085 -231 1198 145 -344 438 228 -596 -267 668 883 247 -933 -847 241 -163 304 -226
6660 -226 1230 -448 -473 -394 -186 516 209 279 -274 -394 299 -191 -46 -139 -1159 -162 739 -717 196 480
6680 480 689 -332 1641 -572 329 -224 47 290 -286 -184 1804 -236 -318 -825 284 296 -225 226 617
6699F17j75o43N2m45j54J41K66R30j429k23J316K84o77j046K137j075N87j255
6717g92K43j15J139l35l48R28j560J271m19k8Q04n22l73n47M02J96p06N19l56
6736e99p31K585j018J52N08m16j738J414M03j503Q05K75Q43j207L97j88L83m88
6754a23m99J350j361N11M91k30o34J512j404r63K665j435m7Q66k8j267M45J245
6772A094p23P0M20j598R81k35p71J452K74j336J248p69j09J87M82j158J385j064
6790a70P35K6N76k171o44J417N7k85R11o00j60K61J463O3j267j382J173q27Q44
6809B0m25jJ177j540mO10m83m69J576j128j251K050O66j058O09J91j611L05L8
6828g28k10N31J959k333Q80k90j155K121j043M31N20j491k73J225o00k78RK23
$$ plain form
6699 617 442 -201 -149 -594 -748 -607 -341 589 -840 -1063 253 537 -140 -1186 951 -124 463 -792
6717 -792 -549 -664 475 140 -208 720 -840 431 12 -16 788 266 -107 -654 -252 -56 -762 -243 -599
6736 -599 -1330 1255 237 389 897 481 -1257 157 560 -943 -138 137 980 -227 170 -18 365 -123
6754 -123 -622 728 -633 -122 369 139 -495 1017 -387 -1350 1315 -120 -167 699 671 -596 -151 1094
6772 1094 371 441 861 -737 244 9 -762 690 964 -372 876 107 -2 185 667 -491 894 -170
6790 -170 565 591 1167 -1004 -1648 -231 -174 -459 452 -148 -308 -47 1416 1479 212 -1170 3 -824 20
6809 20 -405 -406 771 -769 -773 -163 -646 -1115 461 -667 -1918 132 798 -260 349 540 -1071 -766 -728
6828 -728 -938 -407 1552 -781 99 -191 -1346 775 -268 163 683 -808 -1081 144 -456 -734 -725 -502
6846e02J51J007P65j175R01j045k87O34Q1Op01m43O97k32J394q78j0p0n25n14
6866g46L40J070n3J9q95m64N64J31J89J571r91j124J92j012J470Q6L5m06N45j633
6886a112J211j241K231p61N20p40m12K37K94N24k12r4M6r15o55L57J882j247o80
6905g67m18K917j054r26L64J95p2R1o66K22L84J74k56m37J91K32O27m75j11k1
6925A94m94L1O23p69J070m68j701K069K8q34J527o94l21n20J149o35Q76k59P42
6944A614j762p99J040J031N68j187k30n44O44j12p17J758k094R79m27R00j043
6961c81M23L00j94k18M42j07m57l91J569j834Q16RL76k57k97N04n28m7L17l57
6981c12R98n0o32k35j79k76N45L52r6L3o44J121r5q72M54k10R4N42k7q94m61N31
$$ plain form
6846 -502 -351 656 1421 246 1147 102 -185 449 530 536 -165 -608 89 -143 1251 373 363 293 -232 -746
6866 -746 -406 664 611 630 -265 -729 -165 -34 155 1726 735 -389 -197 -1209 261 347 382 -24 521 -1112
6886 -1112 99 -1142 1089 328 848 108 -304 -67 227 751 539 445 491 -424 -1079 -722 1160 -87 -767
6905 -767 -1185 1732 678 -248 116 311 239 330 -336 -114 270 444 188 -249 -58 174 801 326 215 194
6925 194 -300 -269 354 -415 655 187 -1514 555 583 -251 1276 582 261 -259 890 255 1131 872 1614
6944 1614 -148 -947 93 1124 1692 505 275 -269 375 263 -454 1304 -790 189 -238 662 -381
6961 -381 42 342 148 -70 372 265 -192 -583 986 -848 -32 -23 353 96 -201 303 -225 -272 45 -312
6981 -312 686 636 4 -231 -410 -686 -141 211 115 148 -496 625 530 -342 112 -98 -4 538 511 -383 -844 -313
7003c13O06n75j23k2R30r50M55N65j67k27r8o61L75Q8Q92o10J13n5j17n47K05
7024b36L09j11m10l83J468K18j542nJ043l40P73M86q92q10P18L4N70m28o4n8o27
7045b87P33J92Q4O3j019N74K48p96J97R48k296J009L56P60q9k04p12O16L38q37
7065a22m18K42L81k86j9k91O63J006j147J10j38K88r9N69j841L43N13Q3j019J207
7085B5p83J265q46Q92M58J2j594O58P9k44n33Q42j612J738j904J18J311n07J238
7104F13m97O98O36j908J21q65J553J92k46N80p93J23K63K75j033Q04n0J14r93
7123d13K99k24j55K28J004k74j148KN59M89k85k14Q37l31r82K40M13K3k86m07
7143f25L68N8J45q74R46k02j210J805j262Q44j45j46Q24n53j39R01p8m5p02k25
$$ plain form
7003 -313 293 -282 -405 -427 503 -447 8 573 406 179 81 -580 -205 -117 775 165 278 223 106 -441 -236
7024 -236 73 -38 -448 -831 637 855 -687 -692 351 11 784 1270 378 -432 286 320 890 462 398 340 -287
7045 -287 446 638 722 785 -234 340 588 -208 -11 937 -1359 -350 6 766 677 473 -239 377 715 -122
7065 -122 -540 -298 83 -203 -222 -513 150 1156 9 119 -19 269 170 739 -1102 -759 -246 -163 -1182 25
7085 25 -758 507 -339 553 1011 1023 -571 87 166 -78 -611 231 -1381 357 -1547 -1429 -118 -625 613
7104 613 116 814 1450 -458 -337 -1202 351 543 297 877 84 207 470 745 -288 516 466 580 -413
7123 -413 -114 -338 -493 -265 739 465 -683 -681 -122 367 82 -132 705 374 -608 -368 45 68 -218 -625
7143 -625 -257 -199 -54 -928 18 -184 -1394 411 -851 -7 -152 -298 526 -27 -166 735 657 612 -90 -315
7163c15M80k46J58k41k92P81n3J30n23P2j486K285m26m56l54R15j27q31J891j276
7183H6n66rJ139j294J218K12n68n77Kk29P34Q87k233J632J28r37J874k129J071
7202D41q79O69N38j035Q3l91J496R59k247J082q08k33J171%P67r72M3k094K622
7221A212j655M11L34j06k09l92k2J528n06L54p39n64J567k94j355N16j185N91
7239e14n93J633j035m35R71j025J111p0J312k601K040m91l53R39m0j063M73j41
7257A18k01K65l98p08P04k96m67m15K948j763l30J04L42j124L100j546r85N22
7275a30J309j333P6l80P82k26o08J831j423k62M73O92j37m78l38j07J242k57r25
7294a99o3J135o83P0L1L89o39j11l64q96J579k03Q19j525K83P56l78k19j51K06
$$ plain form
7163 -315 165 -81 77 -164 -456 325 272 402 -121 -49 -1535 750 324 -132 -486 429 302 -529 1362 86
7183 86 -480 -489 650 -644 574 786 218 -359 -357 -586 148 1035 -1198 434 562 -375 1499 -630 441
7202 441 -438 231 769 -266 -183 -574 922 1881 -366 716 -92 -325 846 846 1613 641 684 -1410 1212
7221 1212 -443 -32 302 196 -13 -405 -427 1101 595 949 210 -354 1213 919 -436 80 -1105 -514
7239 -514 -1107 526 -509 -944 27 -998 113 43 1355 -1246 794 303 -50 889 849 -214 259 118
7257 118 -83 182 -216 -924 -220 -516 -983 -1398 1550 -213 -543 -439 -97 -1221 1879 333 -652 -130
7275 -130 1179 -154 -78 -458 324 98 -510 1321 -102 -364 109 801 664 186 -152 -259 983 726 -199
7294 -199 -262 873 190 260 291 680 41 -70 -434 -1330 249 46 865 -660 -377 379 1 -218 -369 -163
7314a63q89J172l86M7M56o60l21kR29j30J46o32J062j100P86p8O22j116K67K08
7334B18p4K33j317n07K044K70r86P87j712K45J221j058N84N15m74l22r47J359
7352G9R77p85p56K073r71L90m21o21L85r00O65j303J785r57L78j413J631J681
7370A917j084j087Q54o87N20P2JKj529J699r21l63L77o06J203L50j228k59P5Q1
7390f13l52J108j62N39j94p07R15k192K83P24Q24K212l958J889j955J786k141
7407a994K347k03J852o10j605J498j479N98p98M98l71Q04J85j766j31J295J608
7424A728k377J279l34N0j007Q19n66n77m0J307O56j949J747N7N84p61P40j610
7442b54L70n36P93p22j076J725J038k305P69j590p94K641m02l9J795j389p6l0
$$ plain form
7314 -163 -1052 120 -266 -219 237 -423 -744 -746 183 53 199 -433 629 -471 315 237 859 -257 10 218
7334 218 144 377 -940 -1447 597 867 -119 668 -1044 -799 422 -636 -52 463 -11 -333 -1280 79
7352 79 1056 271 -485 1588 617 1007 586 -35 350 -550 115 -1188 597 -360 18 -1395 236 1917
7370 1917 833 -254 600 -87 433 505 506 508 -1021 678 -243 -606 -229 -835 368 718 -510 -769 -694 -613
7390 -613 -965 143 -19 520 326 -381 534 -1658 -1375 -651 173 2385 -1573 316 -1639 147 -1994
7407 -1994 353 150 2002 1392 -213 1285 -194 404 -394 104 -267 537 722 -1044 -1175 120 1728
7424 1728 -649 630 296 346 -661 158 -408 -985 -1025 282 938 -1011 736 793 1377 616 1356 -254
7442 -254 116 -420 373 -349 -1425 300 1338 -967 -198 -1788 -2582 59 -343 -382 1413 24 -52 -82
7460h2J098Q5j716K076k132K015r35m27J07J696m01l09l713J337K066k714K038
7477H9J294k097J577J266k098M03j01k06m43M04J217P7j801Q99j062R43m94N69
7495D36k452J356j43L59J119j523P61J20R42l62j755K244j909j5J236p82q01J2
7513a157R74P6n8J254l91j397K845k561J244j878R14j96Q44k42q50K53Q51j731
7531a206J857q32Q20m72l69R55k62J08j270l18J0j56M41l77l09N91J73P78r13
7550g51J485r6r98K01L45L87j177N55P42j053k43R14k163J707m41M52m81j56J084
7569C13j293l99L26K002j135l37j609L221r45J88L26r12J51M17j018J033J3M81
7587H23j460J208q89Q31L1P4l4p33q60J300P49j590M88L0l58N16n92K27R5M59
$$ plain form
7460 -82 1016 1101 -615 1461 -671 1344 409 -18 89 1785 1384 1075 -2638 -1301 765 -1949 89
7477 89 1383 -714 863 2129 31 434 333 127 -316 88 1305 1382 -419 480 -582 361 -133 436
7495 436 -2016 -660 -803 -444 675 -848 -87 33 975 613 -1142 1102 -807 -822 414 -368 -1169 -1157
7513 -1157 -183 -107 -165 1089 698 -699 2146 -415 829 -1049 -135 -331 513 271 -579 -326 525 -1206
7531 -1206 651 -181 639 167 -202 753 491 599 -671 -989 -979 -1135 -694 -1071 -1380 -789 -616 162 -751
7550 -751 734 638 -360 -159 186 573 -604 -49 693 -360 -603 311 -1852 -145 -586 -134 -615 -771 313
7569 313 -980 -1379 -1053 949 -186 -523 -2132 1089 144 332 658 -254 -103 314 -704 329 342 823
7587 823 -637 571 -318 513 544 618 584 -149 -1009 291 1040 -550 -62 -32 -390 126 -466 -239 -144 315
7607C15q98j015J107Q60j313K088k419J386r17l31J393K42M99k359K258k54O10
7624A252k089L52L57k087J959L23J010r12l51L10j441K589n01j473R73M27K031
7641B729k437L24k12M76M2j089p44l05P72R92Q0l95J841l057J264p66J658j537
7659c64J048j611O34J040j799R78n6q85R49J309j175l21L78R65m49j34l11O68
7677H64o79j734J422m24K4O82J123J44k201J016n69J059K27l01p86n85J244p61
7695b35j634J701j778L573k668J006J989j643r29q28J272l53P63l13J205j52M11
7712A387j309M15K76j469J811j367K041j540j635J965j825J397M95j903P08j187
7728a740J727P98j685J039j75J086n79j062N43M85r20j018K280j389J30P05n13
$$ plain form
7607 315 -583 -1598 -491 369 -944 1144 -1275 111 -806 -1137 256 498 997 -1362 896 642 1252
7624 1252 -837 -485 -128 -2215 -256 67 1077 165 -186 124 -1317 1272 771 -702 271 698 2729
7641 2729 292 616 404 880 922 -167 -911 -1216 -444 548 628 233 2074 -983 281 -485 1173 -364
7659 -364 684 -927 -293 747 -1052 -74 -130 -1015 -66 1243 68 -253 125 1090 641 507 196 864
7677 864 185 -1549 -127 -551 -527 155 1278 1422 -779 237 -332 727 954 653 -133 -718 526 -235
7695 -235 -1869 -168 -1946 1627 -1041 -35 1954 311 -618 -1446 -174 -527 236 -77 1128 976 1387
7712 1387 78 493 769 -700 1111 -256 1785 245 -1390 575 -1250 147 642 -1261 -553 -1740
7728 -1740 -13 785 -900 139 -36 1050 471 -591 -48 437 -483 -1501 779 -610 -480 225 -288
7745b88l04K08L47J503m71j45j120P56J004j434N65p20P01q74N79L47o64J14o14
7764e10j27J344j073Q53J30J5o78m05L05L42M04j845l09J605k03j64P8J69n56
7783f25J520j906J023pO76l82m39n62M06O10r72K40J103j231J577r74J37j88m83
7802d77kJ000j092J171j585J841l31J163j450p69K04r57K234m38m00o33R52l44
7820H7J078j346l4K54k90o23J670j81j01q32J91j34J43j91p85J457j28M66n09
7839A92r95Q86jJ96p60Q82p19l43O88M04j02l80L57P31q73K9M2l63R10K65j713
7860f67o44L91M87J511j123N98K70r82P93j213j85L01m92J668R5j88j208J030
7878D42o74M87Q22r00o65R4n3J607r96j127Q65N88J192k965K450o98k2N34j688
$$ plain form
7745 -288 -592 -384 -37 1466 995 850 -270 486 1490 56 621 -99 602 -272 307 654 -10 104 -510
7764 -510 -637 707 -366 487 617 632 -46 -451 -146 196 600 -1245 -1554 51 -152 -316 -238 -69 -625
7783 -625 895 -1011 12 5 681 299 -140 -702 -296 314 -658 -418 685 -546 1031 57 194 6 -477
7802 -477 -479 521 -571 600 -985 856 525 1688 238 -531 -327 -1284 950 512 112 -521 431 87
7820 87 1165 -181 -215 39 -251 -874 796 615 514 -318 -127 -261 -118 -309 -1094 363 235 701 192
7839 192 -803 83 82 278 -482 400 -319 -662 26 430 328 -52 305 1036 163 192 234 -129 781 1046 -667
7860 -667 -1311 -920 -433 1078 -45 553 823 -159 634 -579 -764 -463 -955 713 808 620 -588 442
7878 442 -232 255 1077 177 -488 -394 -447 1160 164 -963 -98 490 1682 -1283 1167 469 447 981 -707
7897g07R69N16j492J071o77R30J5j73r22N74r50J667j346l84J016o86P02N3J92
7916C68R01q38j244P79J92l08p26O49M78k59n5j798K563k287J656j647K069N05
7934I98k028J705R8j196n46J495r57n91J318l16R83j20r80m39N71k22O2l5Q88
7953F88p61m87r34K764o05j423J271p19J19j144K861j704L1R3l04N1j75K382k259
7972b55K84m37p20Q55L72m70k05N88L50K77n4m75q76L98j496K541j589M46Q20
7991C54O80k03o47m73K24J12O30k31j80j121J360n51K54k15K54o12K84M29q49
8010e01N91J79J12k41J672k079M1J25P12o84J75O39p79L94K74j153Q77j640L02
8029i84J752L38p48M01j253L61k30N47j113Q17j41Q35q55q03Q57k59L18J72j481
$$ plain form
7897 -707 262 778 -714 357 -320 610 625 452 -470 104 -846 821 -525 -909 107 -579 123 176 368
7916 368 1269 431 -813 -34 158 -150 -876 -227 251 -8 -63 -1861 702 -1585 71 -1576 493 998
7934 998 -1030 675 773 -423 -969 526 -431 -1022 296 -20 963 843 -137 -576 -5 -227 -165 -200 688
7953 688 -73 -560 -1494 1270 665 -758 513 -206 -87 -1231 1630 -74 -43 50 -254 -203 -378 2004 -255
7972 -255 29 -408 -1128 -273 99 -371 -576 12 362 639 585 110 -766 -368 -1864 677 -912 -466 354
7991 354 1034 831 184 -289 -65 47 677 446 266 -855 505 -46 208 -7 247 -365 -81 348 -501
8010 -501 90 269 381 140 1812 -267 -226 -101 611 -73 102 741 -38 356 630 -523 354 -1286 -984
8029 -984 768 1106 358 759 -494 -133 -363 184 -929 -112 -253 582 -273 -1076 -219 -478 -160 12 -1469
8048a469Q86J573q70j243J811n66J075j364j39J41O98q79O27K73j568J894n33
8065C47N53p68o33J106r17n38N86J079j945N38p25J053O79o37j009j28J508k0
8083A29J40J45j87J048o87o16r25k22J155n73J472j070J65r25R4L05j015K523
8101I56j099J66P92k285K531j644K17M39J45o51k07j29M4j40O67J405k575K022
8119F54j870J046J636r68k248L100j235n55j067M31K568k626K793j191k33M07
8135F42j017j50K258j813J566k573R74q96J656j209J112p86m19J577k995K629
8151E56R90j463J445n74k273O17R63j23r6Q81p90p6J36L39Q67j772J105k37J21
8170F16l77Q3r00P10j250J532j498J413n9p60J43R59j476l0J370j300N70Q27J03
$$ plain form
8048 -1469 -583 990 120 -1123 688 122 1197 -167 -306 -165 533 -346 281 554 -1014 880 347
8065 347 900 132 -501 605 -312 -850 -264 815 -1130 -592 -1317 -264 415 -222 -1231 -1359 149 129
8083 129 269 414 227 1275 588 -28 -953 -1175 -20 -593 879 -191 -26 -951 -857 -552 -1567 956
8101 956 -143 23 815 -1470 1061 -583 -366 73 218 -433 -640 -769 -725 -865 -198 1207 -1368 654
8119 654 -1216 -170 1466 498 -1750 1350 115 -440 -1507 -1076 1492 -1134 1659 468 235 642
8135 642 -375 -525 1733 -80 1486 -1087 -113 -1009 647 -562 550 -236 -655 922 -2073 556
8151 556 1546 83 1528 954 -1319 -702 261 138 42 923 133 57 193 532 1399 -373 732 495 616
8170 616 239 322 -578 132 -1118 414 -1084 329 270 -490 -347 612 -864 -894 476 -824 -254 573 676
8189F76k370K192
$$ plain form
8189 676 -1694 498
8191D98
$$ Imaginary data points
##PAGE= N=2
##DATA TABLE= (X++(I..I)), XYDATA
0@%%%%%%%%%%%%%%%%%%n9J59k00K00k00K00k29L29m00M02n01O00o56P56q68R70
34E03j098J260j404J564j749J961k197K441k703L002l329L678m058M482m942N446
50B857o003O611p285Q029q863R800j0847J2051j3434J5040j6951J9259k2101K5703
64A3866l0449L7036m6833O3257r7731L42191n85673j50172R09445j85217o31744
75c62024J21943O04903j90788m76186J46246M18709j25582l39295M303M00555
85B02784L0997m67744l7773N57939l2846n94508J08249O27341k24777n99301L31237
96i8402N23215m19332l86876M26158K72795l80973j94503L08668J67135k48478
106c0593j56926J80424J96518j36921k77212J58822L50590k48384l55805L41372
$$ plain form
0 0 0 0 0 0 0 0 0 0 0 0 0 0 0 0 0 0 0 0 -59 100 -100 100 -100 100 -129 200 -200 202 -299 301 -355 401 -467 503
34 503 -595 665 -739 825 -924 1037 -1160 1281 -1422 1580 -1749 1929 -2129 2353 -2589 2857
50 2857 -3146 3465 -3820 4209 -4654 5146 -5701 6350 -7084 7956 -8995 10264 -11837 13866
64 13866 -16583 20453 -26380 36877 -60854 281337 -304336 -454508 454937 269720 -362024
75 -362024 -240081 364822 174034 -302152 -155906 262803 137221 -202074 -197771 202784
85 202784 233781 -233963 -271736 286203 253357 -341151 -232902 394439 169662 -429639 -98402
96 -98402 424813 5481 -381395 44763 317558 -63415 -257918 50750 217885 -30593
106 -30593 -187519 -7095 189423 52502 -224710 -65888 284702 36318 -319487 21885
116B1885L11116m03630k54795M55768J68838m80683n3348M43187m2488l55376
126a89526P4163K64085n6566k05879K3652J69778K5870j63889q2588J96987J22731
137A78818k67031j13530L40945N4791l80707K6986L79565j06518l42700J67445
147f1936K83504k06601k07631K11353J28955j68348q4423J08414Q1782o1965j04472
158h1368L1923J40618j9619j91851M1314K40674j01340k55522J80988K16123k30705
169b8765j57947K51285R6676k50886l5027K22721j5385j68683L2893J08526j2812
180D2596o9348k7202O1029O8440p6714r8134J09384J11557j57582r9987K05264
191F9303N9416k34661O159K25659o0990j90868R4000J46966j07828j00463J02331
$$ plain form
116 21885 333001 -70629 -325424 130344 299182 -181501 -234849 208338 165850 -189526
126 -189526 -115363 148722 92156 -113723 -90071 79707 105577 -58312 -140900 56087 178818
137 178818 -88213 -201743 139202 193993 -186714 -159728 219837 113319 -229381 -61936
147 -61936 221568 14967 -192664 18689 147644 -20704 -105127 3287 85069 23104 -81368
158 -81368 -49445 91173 71554 -120297 -78983 161691 60351 -195171 -14183 201940 -28765
169 -28765 -186712 64573 161249 -89637 -124664 98057 82672 -86011 -53118 55408 42596
180 42596 -26752 -53954 7075 75515 -1199 -99333 10051 121608 -35974 -135961 69303
191 69303 128719 -105942 -99783 125876 64886 -125982 -31982 114984 7156 -93307 9024
202I024N5710p1905l0948K7970L3052J3997o7686k4393J04860J4265j34869R120
214f1803J58835n2162j60978J01305J35386j38364q9028J45236M2733j30962q033
225e7835J06319j3412p2691J7803L6653j814q355l5734R970O9540l2851q7022
237f9429O5905Q5621r8353o7907J23157L8025j36518J765J28785l8940r8666N6853
249i702O3947n5934l3581M1032J3374j6282o809j2545J7146L6212m6086l9152
261d8380P5756K3864r5270K7J03511k9797r8300N8431P9257p8693m8291Q3280
273B5395J2076o4810Q517L8628j0219j8817M727o40J2205J0454l3838p917N8360
286C4121j4445o6897L9910O2165o3856m2305P4221J9709p6586N092O6987k3461
$$ plain form
202 9024 64734 -7171 -38119 -10149 22903 36900 -30786 -55179 49681 63946 -70923 -61803
214 -61803 97032 44870 -116108 -14803 120583 -17781 -106809 38427 81160 -49802 -57835
225 -57835 48484 35072 -37619 -19816 16837 15023 6668 -29066 -19096 50444 17593 -69429
237 -69429 -3524 82097 -16256 -84163 38994 77019 -59499 -57734 71051 32111 -66555 -9702
249 -9702 54245 -1689 -35270 5762 19136 2854 -3955 -16500 646 36858 -9228 -48380
261 -48380 27376 51240 -44030 -44003 59508 29711 -68589 -10158 69099 -9594 -57885 25395
273 25395 37471 -27339 -18822 19806 9587 -9230 -4503 -5143 7062 17516 -16322 -24239 34121
286 34121 19676 -47221 -7311 54854 -9002 -51307 22914 42623 -33963 -28871 38116 14655
298A4655m8986L4516K2264k8291l304J1442m216P525K029k3396R114L4652k7918
311H6l5582N0557K2117o5222J802O2278k0726n3298L3607L9561m3397j8572M3487
324A6698l351k8426J3350Q711r115N250j15j5187J3153J7608k9713p827L9110
337B0146m099m4568K2499L7465l7595k1655M3326M357l9043Q203L0700j8263j5279
350a3806K0383p8j2549J0180q37j2974J4922N826k3350M497K5961j5845k4586
363b2256K9058J4971l7903J121L4752j4869k4837K1644J2934k1827k077J8816
375I527q567q469J1966k353r890J4318j958j7370J3477J4217k1236p308K6048
388A2402k508k6706J3729K1402k3161r933K5100k588j9127J0941R745j1960k383
$$ plain form
298 14655 -34331 185 22449 -5842 -9146 2296 -1920 5605 7634 -15762 -6648 28004 86
311 86 -35496 15061 37178 -28044 -26242 36036 15310 -37988 -4381 35180 -8217 -26789 16698
324 16698 13347 -15079 -1729 6982 -2133 3117 3002 -12185 968 18576 -11137 -18964 20146
337 20146 16047 -28521 -6022 31443 -6152 -27807 15519 19876 -19167 -10964 19736 1473 -13806
350 -13806 6577 6499 -6050 4130 3293 -9681 5241 11067 -12283 -7786 18175 2330 -22256
363 -22256 6802 21773 -16130 -15009 19743 4874 -19963 1681 14615 -7212 -9289 9527
375 9527 960 -7509 4457 2104 -7786 6532 4574 -12796 681 14898 -6338 -13646 12402
388 12402 9894 -16812 -3083 18319 -4842 -14775 10325 7737 -11390 -449 9296 -2664 -5047
401e047J0397n831n058J2169m673j1573J3708M363j6720K267J7988j0665j3967
414a2642J6478P162j9690K070J8377j1209j0411J4274L48j1519O471N989r421
427c723k77R689n737q175J3336O63j5472R060J0635j3256m492J3706n87j3436
441h066P656Q813j1380l674J3345n669q765J0509K184j0266N289N344p425j376
455c481R616l666j0686J0989M539j3234J863R988l716q674Q317L125q898J215
469b703O882o437k200R164k352o955O899J240p975L927N883n596m644Q244O30
484D007j0062M942Q077q503j972P442k446n285L605M649p572J178L672k437j222
499a927M472k690m671N835L195q055Q18O652j779p104M290M797n986n34O740l684
$$ plain form
401 -5047 5350 -481 -5539 6630 1957 -9616 4092 8455 -8265 -5998 11990 1325 -12642
414 -12642 3836 10998 -8692 -6622 11755 546 -9865 4409 4757 -6762 -291 5698 -3723
427 -3723 -4000 5689 -48 -8223 5113 5776 -9696 -636 9999 -3257 -7749 5957 5370 -8066
441 -8066 -410 8403 -2977 -6651 6694 1025 -7740 2769 4953 -5313 -24 5320 -2105 -3481
455 -3481 6135 2469 -8217 2772 7311 -5923 -4060 5928 2212 -6462 1855 4980 -3918 -2703
469 -2703 4179 -2258 -4458 4706 2354 -4601 2298 3538 -4437 -510 5373 -223 -4867 3377 4007
484 4007 -6055 -1113 6964 -1539 -3511 3931 1485 -3800 -195 4454 -3118 -1940 1732 -705 -1927
499 -1927 2545 -145 -4816 1019 4214 -3841 -3023 3629 1850 -5254 -964 3833 -2153 -2687 4053 369
515C69l604M613n83k558P83L067l083M4M690m217l147N458N33n629J774N698m009
532A99k627K382K436l733j143N712k633j390K762j119k011K092k64k002J477K504
548B642l739l67L228r96k928K581K100l833r31O236k879l940K546L268l742n04
564a258K242o31J15n38J340j271J376n27l332K793J127k677o17M653J23l430j179
581a691M612k370k725K432J969j117k381J596L13j880R32M40m04L19j069O76J170
598H22N47l320L98K692l74k549J358J893k257j255J295K551l506N70J766q54o60
615h83J85J608j157M43j537J039J120k62q31K95J068n87j443J034J001k580k31
632a718K957q17k064J360K414j009k402R58J340j602p29N57J406j181P57q78J773
$$ plain form
515 369 -3235 1378 795 -1763 -980 2087 -996 -952 3738 -479 -3626 1832 2365 -3264 -1490 4208 199
532 199 -2428 -46 2390 -1343 -2486 3226 593 -797 1965 846 -1165 927 663 -1339 138 2642
548 2642 -1097 -1464 1764 768 -2160 421 2521 -1312 -2243 3993 1114 -2826 -280 2988 -754 -1258
564 -1258 984 353 468 -70 1270 -1 1375 848 -2484 309 1436 -1241 -1858 2795 2918 -512 -1691
581 -1691 2921 551 -2174 258 2227 1110 -1271 325 638 -1242 -310 130 -274 45 -1024 -348 822
598 822 1369 -1951 -1553 1139 765 -1784 -426 1467 -790 -2045 -750 1801 -1705 -1135 631 -223 -883
615 -883 -698 910 -247 196 -1341 -302 818 556 -275 20 1088 501 -942 92 1093 -1487 -1718
632 -1718 1239 422 -1642 -282 2132 1123 -1279 -321 1019 -583 -1312 -755 651 -530 227 -651 1122
649A122j422r99R17J812j753j524J825J125j285j277K110N52j970L8J783M37j770
666b79j89J463L35q08j918J977J9J2j261K073j253o58m79N09J040m68j362J606
684C59Q83k278r00L377n51j534k93J571p24l91J040l56j12J92L68k97J31m82j243
703a240Q92n0k48m15J964n59p79M5J093n03j146J050L29j467p50K060m39j7k39
722d19N99n0j054O80n16N92n33MR69J036q55o23l06M87n81k80J815M94k409m13
742a363K000j063k07m46J341J099j351R8O20o6j174L17J94P5j044O93q51Q68q40
761a100P42M75J68j366K74R36K06j056O72N19p79M32j37J178k239J031Q74m85
779C45K81p72L83L30j136J333o72K014k458m26L35J072n15l4O05k56n62P57j537
$$ plain form
649 1122 -300 -1299 -382 1430 -323 -1847 -22 1103 -182 -1459 651 1203 -767 -729 1054 1491 -279
666 -279 -468 995 1330 522 -1396 581 600 612 -649 1424 171 -487 -966 -457 583 115 -1247 359
684 359 1242 -1036 -1936 1441 890 -644 -937 634 -90 -481 559 203 91 283 651 354 485 3 -1240
703 -1240 -348 -398 -646 -1061 903 344 -435 -390 703 200 -946 104 433 -1034 -1784 276 -163 -180 -419
722 -419 180 130 -924 -244 -760 -168 -701 -697 272 1308 453 -170 -476 11 -570 -850 965 1459 -950 -1363
742 -1363 637 -426 -633 -1079 262 1361 10 108 728 662 -512 -195 -1 74 -970 -277 -1128 -260 -1100
761 -1100 -358 117 285 -1081 -807 129 335 -721 -49 470 -309 123 -14 1164 -1075 -44 830 345
779 345 626 -146 237 567 -569 764 92 2106 -352 -778 -443 629 114 80 685 429 -133 624 -913
798i13K429j469l49O93P6P7j137J480K02k037K44J203j225Q78p31J202J001k151
816e27K31J928j355j364j36K231j350o80l75J629n52r2J710k068r95K308J040
833A583j597K50K815k587k14o70k83n79J69P84j487Q86K350k160K11J166M42p91
851B88J27m39j28M1m05K94j66o80K110k131J728m04q89P16n86M15j48K40p63J193
871D13j255K562j759K91J5p15L62j49P86r21J751n74p54O66j204R50p15K66O26
890F42j231q2J059j70P80j800R25M38j405M57O46n52n61J496q32J39j03J329j005
909A70R9j29k37n32R93j212M19J127j7j373L55J320q24J80J65M04j763Q41n69
928e83N94L52R21j323j154R61J341k87p26Q00j038k12K10L03J8Q7M51p6j958K380
$$ plain form
798 -913 1516 47 -302 391 467 544 -593 887 1089 -948 -704 499 -726 152 -579 623 1624 -527
816 -527 -296 1632 277 -1087 -1223 1008 -342 -1022 -1397 232 -320 -412 1298 -770 -1765 543 1583
833 1583 -14 236 3051 464 250 -420 -703 -1282 -1113 -329 -1816 -930 1420 -740 -529 637 1079 288
851 288 415 -24 -152 -111 -516 -222 -388 -1068 1042 -1089 639 235 -654 62 -524 -109 -257 -17 -780 413
871 413 -842 1720 -39 252 267 -448 -86 -235 551 -370 1381 807 53 719 -485 465 -250 16 642
890 642 -589 -671 388 218 998 -802 123 561 -844 -387 259 -293 -854 642 -190 -51 -154 1175 170
909 170 269 140 -97 -629 364 -848 -429 698 681 -692 -337 983 159 339 504 908 -855 -14 -583
928 -583 11 363 1284 -39 -1193 -232 1109 822 96 896 -142 -354 -144 159 177 264 715 639 -1319 1061
948A061j141o04O5K393j440o13l53O49r89J644q27L65q65O25M80r35J294j110
966c01J93k05O31o45L29M72M7j768O40J421j567J164n08p6Q94J86n33o93o61J364
986C84n71M22J17m57m7L93J133j117M02j093J210j284J304j198J84k86J084r84
1004d04N0J496j273L77q3P87l4o89q5j424J228P34q57N33p48K97q46M78J603j340
1024b00n46J305R68k497J562p67P22p45j055K495k491J893r23n42N71m38O86k86
1042b88m93K43Q7R91l50P4o60k11J871j012q65R70l81J11r25K205j746J001Q4
1061G06k647K136L11l46j71P33m4p71L27l66m69J754n37m22j173M41P83o76P52
1080C21K32n1J28j279P59q5p23J277j14O6J85m89k14N6j013J050k53K0K43M47
$$ plain form
948 1061 -80 -684 -619 1774 334 -279 -632 17 -972 672 -155 210 -655 -30 450 -485 809 -301
966 -301 -108 -313 318 -327 2 474 521 -1247 -607 814 -753 411 -97 -173 721 907 374 -319 -980 384
986 384 -187 235 352 -105 -152 241 1374 257 659 -434 776 -508 796 -402 -218 -504 580 -404
1004 -404 -354 1142 -131 246 163 950 916 227 142 -1282 -54 680 -177 356 -392 -95 -941 -463 1140 -200
1024 -200 -746 559 1527 -970 592 -175 547 -198 -1253 1242 -1249 644 -279 -821 -250 -688 -2 -288
1042 -288 -781 -538 -451 540 190 264 -396 -607 1264 252 -613 357 -24 87 -838 1367 -379 622 706
1061 706 -1941 195 506 160 -11 722 678 -93 234 -132 -601 1153 616 194 -979 -538 245 -431 321
1080 321 553 502 630 -649 110 25 -698 579 465 531 716 227 13 69 -944 106 -147 -127 116 563
1100E63q71J160j572p51J016J18k48Q86l24n47k61K147n87j633J601j492J365
1117E70J71j977O17O06N75j15r36P46m9p02O86P32j674N92l17R65n97qJ22j7j004
1138a014J104J50l48l92l65J985k79o51l54J85q17J108P9q93K09L98l67J467j754
1157e49L32P91j48k00J213n54l22M39k28n28l77Q32m78n0K32M63q11O19q41J226
1177A061q40m70j144K048j462M54Q87O16j669K93J856j532L8J35J12j24L92Q31
1195A482j726j57J97K56r05J898p06L57l96m62R56j318p4J652n40P40r15j42L45
1214E42N17n9k541J613L97j021l70M38l15J285n97o44p24J288m9L11M17n63l45
1233d20K34L69P48j046R4R36n82k69L81lj47J216k709K036l35k83j002P33q77
$$ plain form
1100 563 -308 852 -720 -1471 -455 -337 -585 301 -23 -570 -831 1316 729 -904 697 -795 570
1117 570 741 -1236 -619 -13 562 447 -489 257 208 -494 192 924 -750 -158 -475 490 -107 -115 7 -10 -1014
1138 -1014 90 240 -108 -500 -865 1120 841 190 -164 21 -796 312 391 -502 -293 105 -262 1205 -549
1157 -549 -217 574 426 226 1439 885 563 1002 774 246 -131 701 223 173 405 868 57 676 -165 1061
1177 1061 221 -249 -1393 655 -807 -353 534 1150 -519 -226 1630 98 136 271 383 259 651 1482
1195 1482 -244 -401 -204 52 -853 1045 339 696 300 -162 794 -524 -598 1054 514 1254 339 197 542
1214 542 1059 1000 -1541 72 469 -552 -922 -484 -799 486 -111 -755 -1479 -191 -240 71 488 -75 -420
1233 -420 -186 183 931 -115 -21 915 333 64 445 442 295 1511 -1198 838 503 220 -782 -49 -926
1252i26J128k33N78q41L28l75Q57j184J65J150p70j22j259J597J011r67j909K104
1270C32j320J558k339K999l23o13q19O02J183k322M52O71M12o81Q99o79J394j668
1288b62M5J003N7p56k66J0p59J175o00K34K51J028k138p7J535o39L87R2o13j019
1308a312J189P83j080j099J698K47m09n5N35m2k41j78M82L10m76O12n63n63J114
1327I52j889L35J566k67R4O06k768J266K33J56m39j63Q89r38J509r31Q9J63j221
1346g58L15R70j331J315o30M56p31n3J04K42M60o68m17j003R33Q98p3p93J192
1365D28l20j285J041J139o5j20j413K36K89o82J520j429L3M16Q97q47L78j13Q65
1384I68r43l64J00k78N81K6J147j221J079j17j974K184l96k067J700J50l25r74
$$ plain form
1252 -926 202 -31 547 -294 34 -341 516 -668 -503 647 -123 -245 -1504 93 1104 137 -1772 332
1270 332 -988 570 -1769 1230 907 294 -525 77 1260 -1062 -610 61 473 -208 691 12 1406 -262
1288 -262 -217 786 843 87 -179 -169 -928 247 -353 -119 132 1160 -978 -1055 480 -159 228 320 -293 -1312
1308 -1312 -123 660 -420 -1519 179 426 17 -38 497 455 214 36 518 828 352 964 401 -162 952
1327 952 -937 -602 964 697 791 1397 -1371 -105 128 284 -155 -318 571 -367 1142 211 300 463 -758
1346 -758 -443 527 -804 511 -119 337 -394 -447 -343 -101 359 -309 -726 -1729 -796 102 29 -764 428
1365 428 108 -1177 -136 1003 938 818 -595 -359 -70 -752 768 -661 -628 -212 685 -162 216 103 968
1384 968 25 -339 -239 -517 64 90 1237 16 1095 978 -996 1188 792 -1275 425 575 250 -724
1402g24J031R7m59K91J82o12j74O73m56j09J801j98j808J084Q4j463K60P44L58
1421F02k677J953j00k67J093n00r13P38j24K03j00J7N23j385K781j908J47o63
1439e80N29J109j663R18l4j47j243J386m08l86m76J842K86p44r2j217M35R74k09
1458B80J054j301M67p48p57J103j04o00Q28J300p61J47R0j213L41j49o03O20J534
1477A528j404k89o76J041j557J102k16O44j058J754l48j662J985k51N8k47l0m86
1495a12R35q15L72r63O28j000J656j845J100j51j5j76j421K082q40L33QQ76j262
1514f10J443q10M79R9j364K59j146K000m37P17q20j15K162j519k15j380J002p01
1532i56J010k31r4o92p80J507J151m61O79q94oO50r76J057j579K74Q88j142k32
$$ plain form
1402 -724 307 404 -55 236 418 -194 -368 305 -151 -260 1541 1343 -465 619 703 -760 -500 244 602
1421 602 -2075 -122 -222 -489 604 104 -809 -71 -195 8 -92 -75 448 -937 1844 -64 83 -580
1439 -580 -51 1058 -605 313 279 132 -1111 275 -133 -519 -995 847 1133 389 297 -920 -485 489 280
1458 280 1334 33 500 -248 -1005 98 -6 -606 222 1522 761 908 998 -215 126 -23 -626 -6 1528
1477 1528 124 -165 -841 200 -1357 -255 -471 173 -885 869 521 -1141 844 593 651 404 374 -112
1495 -112 823 8 380 -583 45 -955 701 -1144 -44 -195 -210 -386 -1807 275 -565 -232 -224 652 -610
1514 -610 833 23 502 601 -763 -504 -1650 350 -87 630 -190 -305 1857 338 123 -1257 -255 -956
1532 -956 54 -177 -271 -963 -1743 -236 915 454 1133 239 233 883 -93 964 -615 -341 547 -595 -827
1551h27j09J429J98n52p65P65K31n44n8L20R86n17M40K24j324L85k43n06J270
1570H03j148l32K9J205m17j05j65J143j872R32J135j289K55K87p29j69N92O63
1588H18j645J514k353K690k319K020r53J832j212o0Jl41k79l91R21m52J270M3
1606A104j595J25K79l95J418p94j089J539n92j27l23M80p2J80k08k45l68j67k36
1625a086K103N79j771N2J105j19m60j164R66L92k67j361J330J031j560o91J191
1642B70r26J65M46l59P6K27J239p03p85j439Q66J132J33m77o51K43o24L44J400
1661E77P60l071K505o4k196Q59N29l85J205m56p41J63J00R7J108j475n8N21M69
1680D47K3o44N8N00m01q84J243J110j400P73N56q07K09o17R12k050J783r28M13
$$ plain form
1551 -827 -936 493 691 139 -626 139 370 -174 -232 88 1074 557 997 1221 -103 282 39 -467 803
1570 803 -345 -677 -648 557 140 35 -130 1013 -859 73 1208 -81 174 461 -268 -437 155 818
1588 818 -827 687 -1666 1024 -1295 725 -228 1604 392 332 333 -8 -287 -678 243 -209 1061 1104
1606 1104 -491 -366 -87 -482 936 142 -947 592 0 -127 -450 30 -42 138 -70 -315 -683 -850 -1086
1625 -1086 1017 1596 -175 -123 982 863 403 -761 205 597 330 -1031 299 1330 -230 -921 270
1642 270 -656 -491 -45 -404 -328 -101 1138 435 -350 -1789 -923 209 342 -135 -786 -543 -1167 -823 577
1661 577 1337 -1734 771 707 -1489 -630 -101 -486 719 263 -478 -315 -215 -118 990 -485 -543 -22 447
1680 447 470 -174 -116 384 -17 -901 342 1452 52 825 1381 574 783 166 1078 -972 811 -117 296
1699B96j109J823j25p27r85Q40l39k30J114o09K9P15q75j365J694j013J511m07
1717B38N36J42j616J803q83q56J060R9o60n9M66k60k18J87J05N66r45J08N12j453
1737a128J352q2M31j624J562l78k86J71j107J436j81k29m87K39q10L97O97l89
1755d16O27k85L08N7p41L80J281j94r13L96k3q07K28M65n16j349J367J302j211
1774d4j037J522m71L17N1j568J108m2O85q84J642j121k55J92j1p70M85J81L53
1793C33p75J31N40m53o1M61R29n96m9j07m27r10J354L11n3L2n10j080N80J585
1813A235r36L33j040N67j025O76L51K05j55r21K650k353m18Q45J70Pk68J81m79
1832c75j5Q32r55M21N59r68J48J04j039J178R28n02m28j308K388k747P16P65Q77
$$ plain form
1699 296 -813 1010 885 158 -827 13 -326 -556 558 -51 -22 693 -182 -1547 147 -866 645 238
1717 238 774 916 -700 1103 220 -636 424 523 -137 -196 270 10 -208 -21 84 650 -295 -187 325 -1128
1737 -1128 224 142 573 -1051 511 133 -153 18 -1089 347 166 -63 -550 -311 -1121 -724 -27 -416
1755 -416 211 -74 234 291 -450 -70 1211 1017 104 500 477 -330 -102 363 -153 -1502 -135 1167 -44
1774 -44 -1081 441 -30 287 338 -1230 -122 -164 521 -363 1279 158 -97 95 84 -686 -201 -20 333
1793 333 -442 -311 229 -224 -285 176 1105 509 460 353 -74 -984 370 681 628 660 150 -930 -350 1235
1813 1235 299 632 -408 159 -866 -190 161 366 211 -710 1940 -413 -831 14 184 191 -77 104 -375
1832 -375 -390 442 -513 -92 467 -501 -353 -249 -1288 -110 818 316 -112 -1420 968 -1779 -1063 -298 579
1851E79j958K408j767j94J893j865J409j304J058j020N29r83K048j551k55J888
1867I15m37n26q74O80N64m24N20m55O05p09p8p0J25m00M25r46K425j412k95J92
1887a75l2L44N68j397K72J311l49n6m21k88L28J065k5j083J771k823M80O86m32
1906b56K18M22j61M8m51n64J224j349O05l65p49J584k41j085J899r67Q72p32R1
1925D3K24j016J323n13q4N36J8r27Q9R34k36j320J626j926O24J365j161J217m55
1944C61m61Q50j452J42k67J297j536Q53o21K50q1O80N69j362R11j003J37J108
1962C75P0j74m30N04j121J98J296m78k44n41J66K65J67k00K2k35M28j174Q52j76
1982d30L39K41n34l94J182K43p91N26l27m94J98M25l01j25j49M96R1J64m85m66
$$ plain form
1851 579 -1379 1029 -738 -932 961 -904 505 -799 259 -761 -232 -1215 833 -718 -973 915
1867 915 478 -48 -922 -242 322 -102 418 -37 568 -141 -219 -289 -164 -564 -139 -1085 1340 -72 -367 -175
1887 -175 -207 137 705 -692 -420 891 542 486 65 -223 105 1170 1145 62 1833 -990 -510 176 -256
1906 -256 -38 384 223 271 -180 -744 480 -869 -264 -629 -1378 206 -35 -1120 779 -188 684 -48 43
1925 43 267 -749 574 61 -23 513 531 -396 -307 627 391 -929 697 -1229 -605 760 -401 816 361
1944 361 -100 750 -702 -560 -827 470 -1066 -213 -834 -584 -665 15 584 -778 133 -870 -733 375
1962 375 445 271 -159 345 -776 -578 718 240 -4 -545 -379 -114 53 -147 -125 -360 68 -1106 -254 -430
1982 -430 -91 150 -384 -778 404 647 -144 382 55 -439 -241 184 -117 -242 -391 105 196 360 -125 -591
2002e91Q97j269J721j339O63o06l48P54o49Q52M37j204O20k08k0p7O08J72p16
2021c03Q1M77J38o85N74O84j062L4O7M6M02m81J98O58j201J83Q24j323O52k91
2041c28J001j090r5O62O2p03P16p52O97L85k5l77L45j13l46j15M39o4n20M67l35
2062h9P91p29l30J145j489J376o97m22O03N28j265N78Q44j711K32K08Q54r60R29
2081C96k41m14P29l61m55P8K65J40Q0n78P29P1m9J61q62J30n30o59Q68J418j551
2102f35k90K691j310j150J656m36r18J43J69M15o46J89J43K22R9m06P46m59M77
2121G00K12N74j294j523J645M5l62p48R64m96L12m72K58J30J4q72O26m85j64K208
2141A272m93q20k79O57J34p09M00J139p36r02N22j823J304Q50n30J48Q89q92K6
$$ plain form
2002 -591 306 -963 758 -581 82 -524 -872 -118 -767 85 522 -682 -62 -270 -290 -367 241 413 -303
2021 -303 -222 255 393 -292 282 966 -96 -62 5 51 453 -28 170 828 -373 -190 634 -689 -37 -328
2041 -328 673 -417 -512 150 212 -491 225 -527 170 555 530 153 498 385 39 -76 363 299 -221 246 -89
2062 -89 702 -27 -357 788 -701 675 -22 -444 159 687 -578 0 844 -867 -635 -427 427 -533 396
2081 396 155 -259 470 109 -346 -268 -3 137 217 -361 368 439 390 551 -311 -181 -711 -1370 -502 916 -635
2102 -635 -925 1766 456 -694 962 526 -392 -249 -80 335 -311 -122 21 243 342 -64 682 223 700
2121 700 912 1486 192 -1331 314 359 -3 -751 213 -283 29 -443 -185 -55 -41 -913 -287 -772 -936 1272
2141 1272 779 -41 -320 337 471 -238 162 1301 565 -337 185 -1638 -334 516 -14 134 1023 131 157
2160A57m6M36q76j040K603j313Q35j475J848l90j608Q67j184J643r62J439r54
2177b0N25j59O16r02P76k516J515J18J680k745J439J75m50k524J551O96J070j202
2195c57J055N16k003L324l755J821m10k71l77J405J71j685L95j78m60O10K51l22
2213b70l98k44J90P92m8n40m25J317j020J252L65r93J498r74l09N07q43r12K557
2232A502j166j359m39K189K57p45j158K160K61r72k95l7r15J327m32p50J327j442
$$ plain form
2160 157 111 547 -329 -1369 1234 -79 756 -719 1129 739 -869 -2 -1186 457 -505 934 -20
2177 -20 505 346 962 60 836 -1680 -165 -47 1633 -1112 327 502 52 -2472 -921 -225 845 -357
2195 -357 698 1214 -789 2535 -1220 601 191 -80 -457 948 1119 -566 -171 -349 -809 -199 52 -270
2213 -270 -668 -912 -722 70 22 -518 -943 374 -646 606 971 -22 1476 502 193 700 -143 -1055 1502
2232 1502 336 -1023 -1462 727 984 239 -919 1241 1502 530 235 198 -717 610 178 -572 755 -687
$$ [...]
8191b8
##END NTUPLES=NMR FID
##END=
