##TITLE=1H_Pr-Cl
 CDCl3, 8 sc, 
 26.11.2020
##JCAMPDX= 6.0         $$ Bruker NMR JCAMP-DX V2.0
##DATA TYPE= NMR FID
##DATA CLASS= NTUPLES
##ORIGIN= UXNMR, Bruker Analytische Messtechnik GmbH
##OWNER= root
$$ XWIN-NMR		Version 3.5
$$ Thu Nov 26 11:57:30 2020 Russian Standard Time (UT+4h)  she@DPX200
##.OBSERVE FREQUENCY= 200.1315066352
##.OBSERVE NUCLEUS= ^1H
##.DELAY= (6, 6)
##.ACQUISITION MODE= SIMULTANEOUS
##.ACQUISITION SCHEME= undefined
##.AVERAGES= 8
##.DIGITISER RES= 18
##SPECTROMETER/DATA SYSTEM= spect
##.PULSE SEQUENCE= zg30
##.SOLVENT NAME= CDCl3
##.SHIFT REFERENCE= (INTERNAL, CDCl3, 0, 15.7039)
##AUDIT TRAIL= $$ (NUMBER, WHEN, WHO, WHERE, WHAT)
$$ ##TITLE= Audit trail, XWIN-NMR		Version 3.5
$$ ##JCAMPDX= 5.01
$$ ##ORIGIN= Bruker BioSpin GmbH
$$ ##OWNER= she
$$ F:/spectra/data/she/nmr/H-F/1/audita.txt
$$ ##AUDIT TRAIL=  $$ (NUMBER, WHEN, WHO, WHERE, WHAT)
(   1,<2020-11-26 11:56:00.89 +0400>,<she>,<DPX200>,
      <created by zg, POWCHK disabled, PULCHK disabled
       configuration hash MD5:
       00 E9 B6 7A A2 85 ED C7 34 08 36 98 17 FE 4E 26
       data hash MD5: 16K
       0C F2 E9 07 4C 29 89 7D 62 35 75 09 71 22 B8 4A>)
$$ ##END=
$$ 
$$ hash MD5
$$ 99 EC E6 44 D5 57 85 FE 94 EF 07 13 75 21 FC CB
##$RELAX= 
##$RELAX= 
##$RELAX= 
##$RELAX= 
##$RELAX= 
##$RELAX= 
$$ Bruker specific parameters
$$ --------------------------
##$DU= <F:/spectra>
##$EXPNO= 1
##$NAME= <H-F>
##$PROCNO= 1
##$TYPE= <nmr>
##$USER= <she>
##$AMP= (0..31)
100 100 100 100 100 100 100 100 100 100 100 100 100 100 100 100 100 100 
100 100 100 100 100 100 100 100 100 100 100 100 100 100 
##$AQSEQ= 0
##$AQ_mod= 1
##$AUNM= <au_zg>
##$AUTOPOS= <>
##$BF1= 200.13
##$BF2= 200.13
##$BF3= 200.13
##$BF4= 200.13
##$BF5= 200.13
##$BF6= 200.13
##$BF7= 200.13
##$BF8= 200.13
##$BYTORDA= 1
##$CFDGTYP= 0
##$CFRGTYP= 5
##$CHEMSTR= <none>
##$CNST= (0..31)
1 1 145 1 1 1 1 1 1 1 1 1 1 1 1 1 1 1 1 1 1 1 1 1 1 1 1 1 1 1 1 1 
##$CPDPRG= <>
##$CPDPRG1= <>
##$CPDPRG2= <>
##$CPDPRG3= <>
##$CPDPRG4= <mlev>
##$CPDPRG5= <mlev>
##$CPDPRG6= <mlev>
##$CPDPRG7= <mlev>
##$CPDPRG8= <mlev>
##$CPDPRGB= <>
##$CPDPRGT= <>
##$D= (0..31)
0 1.2 0 0 0 0 0 0 0 0.06 0 0.03 0 0 0 0 0.0002 0 0 0 0 0 0 0 0 0 0 0 0 
0 0 0 
##$DATE= 1606377360
##$DBL= (0..7)
120 120 120 120 120 120 120 120 
##$DBP= (0..7)
150 150 150 150 150 150 150 150 
##$DBP07= 0
##$DBPNAM0= <>
##$DBPNAM1= <>
##$DBPNAM2= <>
##$DBPNAM3= <>
##$DBPNAM4= <>
##$DBPNAM5= <>
##$DBPNAM6= <>
##$DBPNAM7= <>
##$DBPOAL= (0..7)
0.5 0.5 0.5 0.5 0.5 0.5 0.5 0.5 
##$DBPOFFS= (0..7)
0 0 0 0 0 0 0 0 
##$DE= 6
##$DECBNUC= <off>
##$DECIM= 32
##$DECNUC= <off>
##$DECSTAT= 4
##$DIGMOD= 1
##$DIGTYP= 9
##$DL= (0..7)
0 120 120 120 120 120 120 120 
##$DP= (0..7)
150 150 150 150 150 150 150 150 
##$DP07= 0
##$DPNAME0= <>
##$DPNAME1= <>
##$DPNAME2= <>
##$DPNAME3= <>
##$DPNAME4= <>
##$DPNAME5= <>
##$DPNAME6= <>
##$DPNAME7= <>
##$DPOAL= (0..7)
0.5 0.5 0.5 0.5 0.5 0.5 0.5 0.5 
##$DPOFFS= (0..7)
0 0 0 0 0 0 0 0 
##$DQDMODE= 0
##$DR= 18
##$DS= 0
##$DSLIST= <SSSSSSSSSSSSSSS>
$$ [...]
##$SUBNAM2= <"">
##$SUBNAM3= <"">
##$SUBNAM4= <"">
##$SUBNAM5= <"">
##$SUBNAM6= <"">
##$SUBNAM7= <"">
##$SUBNAM8= <"">
##$SUBNAM9= <"">
##$SW= 16.9725356469052
##$SWIBOX= (0..15)
0 0 2 0 0 0 0 0 0 0 0 0 0 0 0 0 
##$SW_h= 3396.73913043478
##$TD= 16384
##$TD0= 1
##$TE= 0
##$TE2= 300
##$TE3= 300
##$TEG= 300
##$TL= (0..7)
0 120 120 120 120 120 120 120 
##$TP= (0..7)
150 150 150 150 150 150 150 150 
##$TP07= 0
##$TPNAME0= <>
##$TPNAME1= <>
##$TPNAME2= <>
##$TPNAME3= <>
##$TPNAME4= <>
##$TPNAME5= <>
##$TPNAME6= <>
##$TPNAME7= <>
##$TPOAL= (0..7)
0.5 0.5 0.5 0.5 0.5 0.5 0.5 0.5 
##$TPOFFS= (0..7)
0 0 0 0 0 0 0 0 
##$TUNHIN= 0
##$TUNHOUT= 0
##$TUNXOUT= 0
##$USERA1= <user>
##$USERA2= <user>
##$USERA3= <user>
##$USERA4= <user>
##$USERA5= <user>
##$V9= 5
##$VALIST= <valist>
##$VCLIST= <CCCCCCCCCCCCCCC>
##$VD= 0
##$VDLIST= <DDDDDDDDDDDDDDD>
##$VPLIST= <PPPPPPPPPPPPPPP>
##$VTLIST= <TTTTTTTTTTTTTTT>
##$WBST= 1024
##$WBSW= 4
##$XGAIN= (0..3)
0 0 0 0 
##$XL= 0
##$YL= 0
##$YMAX_a= 405789
##$YMIN_a= -379368
##$ZGOPTNS= <>
##$ZL1= 120
##$ZL2= 120
##$ZL3= 120
##$ZL4= 120
##$ABSF1= 10
##$ABSF2= 0
##$ABSG= 5
##$ABSL= 3
##$ALPHA= 0
##$AQORDER= 0
##$ASSFAC= 0
##$ASSFACI= 0
##$ASSFACX= 0
##$ASSWID= 0
##$AUNMP= <proc_1d>
##$AZFE= 0.1
##$AZFW= 0.1
##$BCFW= 1
##$BC_mod= 2
##$BYTORDP= 1
##$COROFFS= 0
##$CY= 11.3945322036743
##$DATMOD= 1
##$DC= 2
##$DFILT= <>
##$DTYPP= 0
##$F1P= 15.9154993809931
##$F2P= -4.1035820241983
##$FCOR= 0.5
##$FTSIZE= 0
##$FT_mod= 4
##$GAMMA= 1
##$GB= 0.15
##$INTBC= 1
##$INTSCL= 1
##$ISEN= 128
##$LB= 0.24
##$LEV0= 0
##$LPBIN= 0
##$MAXI= 10000
##$MC2= 0
##$MEAN= 0
##$ME_mod= 0
##$MI= 1.114404
##$NCOEF= 0
##$NC_proc= 0
##$NLEV= 6
##$NOISF1= 3.799351
##$NOISF2= 2.8
##$NSP= 1
##$NTH_PI= 0
##$NZP= 0
##$OFFSET= 15.70392
##$PC= 1
##$PHC0= -11052.74
##$PHC1= 17.00088
##$PH_mod= 1
##$PKNL= yes
##$PPARMOD= 0
##$PSCAL= 0
##$PSIGN= 0
##$REVERSE= no
##$SF= 200.130013532006
##$SI= 16384
##$SIGF1= 3
##$SIGF2= 2
##$SINO= 400
##$SIOLD= 16384
##$SREGLST= <1H.CDCl3>
##$SSB= 0
##$STSI= 0
##$STSR= 0
##$SW_p= 3612.71676300578
##$SYMM= 0
##$S_DEV= 0
##$TDeff= 0
##$TDoff= 0
##$TI= <>
##$TILT= no
##$TM1= 0
##$TM2= 0
##$TOPLEV= 0
##$USERP1= <user>
##$USERP2= <user>
##$USERP3= <user>
##$USERP4= <user>
##$USERP5= <user>
##$WDW= 1
##$XDIM= 8192
##$YMAX_p= 0
##$YMIN_p= 0
$$ End of Bruker specific parameters
$$ ---------------------------------
##NTUPLES= NMR FID
##VAR_NAME=  TIME,          FID/REAL,        FID/IMAG
##SYMBOL=    X,             R,               I
##VAR_TYPE=  INDEPENDENT,   DEPENDENT,       DEPENDENT
##VAR_FORM=  AFFN,          ASDF,            ASDF
##VAR_DIM=   8192,          8192,            8192
##UNITS=     SECONDS,       ARBITRARY UNITS, ARBITRARY UNITS
##FACTOR=    0.0002944,     1,               1
##FIRST=     0,             0,               0
##LAST=      2.4114304,     0,               0
##MIN=       0,             -379368,         0
##MAX=       2.4114304,     405789,          0
$$ Real data points
##PAGE= N=1
##DATA TABLE= (X++(R..R)), XYDATA
0@%%%%%%%%%%%qJ6j6J6j6J7k5L2m0M8n6P2q6J00j16J35j55J78k07K38k72L12l53
34a86L99m53N10n73O42p20Q04q92R89j099J218j346J488j642J810j993K198k422
52a268K665k937L243l585L965m401M901n478O160o977P976r230J0860j3074J6272
67I092k1331L0731p6849L83942K5734o33290q8630N29107K43174m69715l03891
78c71926L46341L58613k53902l27360J24813L01036m9623k22052j1141J47651
88D2450K6059p3746N336K984n9430M2722J28509n2585k06316L4196K60634M1907
100A92720l22612j23499L49231K15663l40230l07495K92710L82298k03552m54414
110c19180J09984M86289j0976m74498r5703M38504J75749l62471k47382K80015
$$ y = [0, 0, 0, 0, 0, 0, 0, 0, 0, 0, 0, 0, -8, 8, -8, 8, -8, 9, -16, 16, -24, 24, -32, 40, -46, 54, -62, 73, -82, 96, -111, 127, -145, 167, -186, 213, -240, 270, -303, 339, -381, 423, -469, 520, -579, 639, -707, 781, -861, 949, -1044, 1154, -1268, 1397, -1540, 1703, -1882, 2083, -2318, 2583, -2895, 3265, -3712, 4264, -4966, 5894, -7180, 9092, -12239, 18492, -58357, 325585, 351319, -281971, -370601, 158506, 401680, -68035, -371926, -25585, 333028, 79126, -248234, -123421, 177615, 127992, -94060, -105201, 42450, 68509, -5237, 99, 3083, -56347, -13625, 114884, 62299, -144017, -109821, 150813, 192720, -129892, -253391, 95840, 311503, -28727, -336222, -43512, 338786, 135234, -319180, -209196, 277093, 266117, -208381, -304084, 134420, 310169, -52302, -299684, -19669]
120a9669K80501j93305k79111J06241K56766m8757j96222l875J35168K8774q1978
131a5467j5535K8045j4793K949P2658k5936j24072K0659J66049K1059k07909p2458
143a64751K24834J42814k27863k06101K04156K59126j47218l08246Q6809L27738
153A91298p160l31390o6296L14109J22722k64531j73582K09276J98179j39459
163E3166k09557Q0366K01005l9460j60036k048J20437J9624p4835k2463L6300
174B499R667j5128K6851n990n8377L935R2328J1231j20265l6715J28431Q1003
186A19470j35001j19534J20010J58038r4501j88674O1579J96035q346k04182l7343
197a32449J94110P6743j70268j08568J39089J21659r2300j33875N5324J29663
$$ y = [-19669, 260832, 67527, -211584, -105343, 151423, 102666, -93556, -97431, 37737, 66511, -15467, -31002, -2957, -17750, -14801, 57857, 31921, -92151, -71492, 94557, 115616, -92293, -164751, 60083, 202897, -24966, -231067, -26911, 232215, 84997, -223249, -136440, 191298, 184138, -147252, -213548, 100561, 223283, -41248, -214830, -5554, 192625, 53166, -156391, -76025, 124980, 85520, -74516, -76564, 43873, 63497, -11338, -33801, 2499, 12166, -2962, 23889, 17899, -40478, -36543, 55785, 67016, -53249, -89964, 38467, 119470, -15531, -135065, -15055, 142983, 48482, -140192, -78613, 117422, 109076, -95106, -132449, 61661, 138404, -31864, -140432, -1343, 120316, 28016, -105859, -50535, 79128]
207G9128k5244j10584k480R0438J1745n7928k0055L4369J6718j7578n25L034j2236
220a1198o301L8023P828n3990j6156O0550L7130o5276n3543N5116P9801m7557
232B4427r4617L3895R8622o655j04465j2884R6069L9007q8119n5585P4847O2275
244F6817n0092p1617L3955O6662j2864o1686l536N5485P502l8756j4811K8167
256E226J1445j3964j0165M343Q983q061M632L871j0399p752J6670J0762j9531
269c940j4005J3437K5343j4789k8464Q673L0885j317l5100j500K8531J3627k8876
282g495j7327K2757K2227j6157k6713J5062K0386l549k1841j441K0161M554j5758
295e134q332J6165M343o243q477N111R136m377n620J45Q453l355k599J43K545
$$ y = [79128, 53884, -56700, -59180, 31258, 43003, -14925, -34980, -611, 16107, -1471, -1996, 1038, -11198, -17499, 20524, 28352, -25638, -41794, 18756, 55886, -9390, -62933, -7817, 71984, 24427, -70190, -36295, 62327, 55672, -48793, -61677, 34392, 73399, -14720, -70305, 4542, 66817, 16725, -54892, -20937, 45725, 32861, -28825, -32361, 23124, 30626, -8130, -22941, 5226, 16671, 2707, -7458, -3115, 5868, -2193, 2439, 6310, -4089, -11841, 4829, 15591, -3940, -17945, -4508, 20835, 6046, -22418, -13745, 17140, 15823, -19277, -20777, 7754, 21381, -7495, -24822, -2065, 20162, 4005, -22708, -7646, 12740, 9191, -12650, -14091, 6070, 10624, -5134, -13466, 2699, 7042, 799, -7678, -2567, 6569, 2192, -3428, -3283, 5170, 1815, -784, -641, 1904]
310A904J574l650J218l1L649m744L04K594j130L44j878J926l04J842l974K592
326B236J356k812J007j251J720j756O84j705J866m98k450L047j448P68k353K128
342E39q09J8l89j768L155k239j27p18K485k086l90J391j412K443l833J726R90
359a024K35k674J309K396k232J590k992L306P7j032q77J91K383j545J929l621
375b581J467K436K172m156l454N715L926j587j1662M351J2723j063j4901k925
389i539J8047N720j4943j5441J8201J8123j5123k1886R007K7738o048k6431l728
402a6303K8931Q648k6915j3571K1325J9540j9604j7732R089K0468n056j8660K118
415g722J1845K543q937J376j574j372L999O795n004j8277P153K4730o59l6110
$$ y = [1904, 3478, -172, 1046, 1015, 4664, -80, 224, 2818, 1688, 2032, 154, 2080, 1776, 3618, -356, 2236, 3592, 780, 1787, 536, 2256, 500, 1184, -521, 1345, 847, -1603, 1444, -4, 764, -1589, 539, -270, -252, -641, -2409, 746, -1493, -1620, -2338, 147, -1939, -2329, -938, -2350, 93, -3740, -2014, -1024, -789, -3463, -2154, 242, -1990, -400, -3392, -86, -9, -1041, -1918, -1727, 656, -889, 1040, -2581, -1114, 1322, 3494, -662, -4116, 1599, 5525, 3938, -7724, -3373, 9350, 8287, -6614, -9539, 8508, 14228, -715, -16156, 2045, 20168, 5045, -16841, -7834, 19904, 13856, -12575, -16303, 12628, 21276, -5639, -19210, 2115, 21655, 2051, -15681, -6592, 13876, 8820, -9840, -7722, 4123, 6666, -2271, -895, -2469, -3841, 158, 6953, 1949, -16328, -9175, 15555, 14896, -21214]
429b1214m278M1236J4816m2484l0741M5401M0925l7066n6027K8668O6343j7038
441B8541o9446j478P3342J5547o6823l1752N9474M3478m8582m7377L0646N2649
453C8219j8206m7059N151L9822L745k9736l939J3487M821m184M794m244j8001
466a5330Q299L1603j901n0066n541O0906K3342o9735m3805P1740O3452o1092q9250
479g7378N0018J04657k8646j16011L022J20160K1011j12386m9297J01928O6753
490H3831q1783p9581N6641Q7272l5812q0891J1320P2069L166n5380j1621L4565
502C796J3408j8764j886J066j1557O199L0893l380n4378m629P1060K6328q6537
515b8381m9998Q9964P8065q1118j09506O7714J31314l9373j49768R748J55887
$$ y = [-21214, -25492, 15744, 30560, -11924, -42665, 2736, 43661, 6595, -49432, -20764, 45579, 28541, -40905, -42383, 30959, 46506, -20317, -52069, 7405, 50883, 2301, -45076, -14430, 38219, 20013, -27046, -21895, 17927, 21672, -8064, -12003, 1484, 6305, 2121, 6915, 2671, -15330, -7031, 24572, 22671, -27395, -32936, 27970, 51312, -18423, -62228, 9512, 72964, 11872, -77378, -27360, 77297, 48651, -67360, -64338, 55822, 76833, -35553, -84850, 17078, 83831, 2048, -77533, -20892, 66380, 30568, -50323, -39003, 33066, 36232, -19148, -30769, 3796, 17204, -1560, -3446, -2380, -13937, -7738, 23155, 19775, -34603, -39232, 31828, 58156, -28381, -78379, 11585, 89650, 8532, -100974, -33260, 98054, 58681, -91087, -81339, 74548]
526G4548K3790j49610n7543J36377Q1821j09037j04133Q2075J13288n1547j09858
537f9829K1036J00954j90p9618j6093N6701K0737l4509j1067J0300j351O05K4335
550B2011m382m8752k801O9808K3831r0038m8126R5440Q1381r2568j14442P7171
562c1467J41278m8201j65251J6036J73131K3683j71695o2065J58342R1879j29844
573d174j19389R9941J30893o4744j31064L0050J21346m146r8466j8119P5443K4530
585D2101m7890k0399K2293R469p598J4267k295l6600k695O0807J8606q1116m0775
598g1825Q8796P4291r0080j05027P7000J34815n1756j58183K0671J68104K0138
609A06944j70814n6449J58439Q9265j33017j17530J04629J30402o7845j34743
$$ y = [74548, 98338, -51272, -108815, 27562, 109383, 346, -103787, -21712, 91576, 40029, -69829, -48793, 52161, 51971, -27647, -43740, 12961, 33698, -811, -11878, -1578, -2929, -2324, 22011, 17629, -31123, -33924, 35884, 59715, -30323, -78449, 16991, 98372, 5804, -108638, -31467, 109811, 61610, -103641, -87605, 85526, 109209, -62486, -124551, 33791, 125670, -4174, -123563, -23622, 107271, 42527, -88537, -58487, 62859, 58713, -39753, -57872, 17571, 42101, -5789, -26188, -3895, 5574, -2024, 12243, 9948, -26652, -29347, 31460, 50066, -31050, -71825, 16971, 91262, 1182, -103845, -26845, 107970, 56214, -101969, -81298, 86806, 106944, -63870, -120319, 38120, 127385, -5632, -123162, -18533, 111869, 44024, -90719]
619i0719L4701J26297o194j06846j7602Q5614K5501n6673k7356L2411J7955j5051
631B038J432K154k1258m129M5238J2858o3776l1791P3595N9270p8238q4950O7433
644b0124J13062m9299j34438K2408J45283J2026j50641m3046J39488P5242j21182
655a1221j00463R6479J14063o3416j21385L4468J14858o559j00970j4828Q2794
666B3820K4626n6965k9962L7046K3384j8685j0069O298n492m999K6309Q211m0799
679a7277k1719N2343M1231n7420o0171N1072Q3226m0249r8797J9987J09955N286
691F7467j15474k8515J07215N5590r6077p4698P6781Q7744n2509r4709L0151R0284
703E3250o135q3207j0487O8446K0941m9761k7484L4494K2725j8095j6249P924
$$ y = [-90719, -56018, 70279, 64085, -42761, -60363, 25251, 50752, -5921, -33277, -866, 17089, 2038, 3470, 5624, -15634, -19763, 25475, 38333, -25443, -57234, 16361, 75631, -2607, -87557, -20124, 92938, 43639, -90799, -68391, 76892, 88918, -61723, -104769, 34719, 109961, -11221, -111684, -15205, 98858, 35442, -85943, -51475, 63383, 56824, -44146, -58974, 23820, 48446, -8519, -38481, -1435, 21949, 3264, -6805, -507, -5999, -10998, 15311, 23522, -17277, -38996, 13347, 54578, -2842, -63013, -11941, 71285, 31036, -67761, -47774, 62181, 67467, -48007, -76522, 30693, 86283, -9794, -84492, -7711, 80033, 27524, -67185, -37034, 53250, 47115, -36092, -46579, 21867, 42808, -6953, -34437, 57, 22782, 4687, -11562, -3638]
715c638N126m425R365L574j9485j2671L0254K2365l4527l5038L1434N1076k7071
728A6339o1127J3600P0773N28p4205j6177P0111L4455o4666m6474N1771N6882
740E1810l6822o2441K2698N9972m745n7692m611M7457J4365l6585j9775K6874
752E05J8205j4268j6855Q383R454k642j644P09l711m802J2034P930j4481j5134
766a6317J5137K2895j4055k7736O868L5364k456l5760o701L5382J6044l4261k1541
779b7137K6938K8465k1476l0605J2840L1150m068l1568k54K4861P654k1556j0648
792a5404J5977J1023r915j1771O864P946j624o999O42L546j073R93k89j232l108
807d424L966M211l711o208K057R591k465q358j366J0494K712j0141m237P695Q250
$$ y = [-3638, 1488, -2937, 6428, 10002, -9483, -22154, 8100, 30465, -4062, -39100, -7666, 43410, 16339, -44788, -31188, 39585, 40113, -34092, -50269, 19842, 54297, -10369, -56843, -5072, 51810, 14988, -47453, -24755, 35217, 30472, -27220, -31831, 15626, 29991, -6594, -26369, 505, 18710, 4442, -12413, -4030, 5424, 2782, 1138, 1847, -1864, -6666, 5368, 13298, -1183, -16317, -1180, 21715, 7660, -20076, -13208, 22156, 19700, -16060, -22761, 12621, 28665, -5596, -27137, -199, 28266, 6790, -23815, -10975, 20175, 16107, -15461, -15715, 9146, 16800, -4756, -15404, 573, 11596, 1681, -10090, -3226, 4720, 3096, -3903, -3261, 285, -788, 205, -84, -1316, -4424, -458, 3753, 42, -6166, -4109, 5482, 3017, -5341, -6707, 3787, 6499, -3642, -7879, -184, 8066]
822H066p766p445M092R472k325r414J548P008K650q105k109N636M008m386m881
837c951M259L164J64m381J84L261L14k528k249L229Q43p22l134J624K002k63j709
854A07j450L377l50r55k345J796J861j736j765J4L054j079r33j357J864J010j908
871g95k41k15K154j582m84l03J154J95j259N77o73J797j982L04N29J73M25j561
889a787J304j99O75j604J249N96p20R1m26J591q43l60n49J631j6q26n6Q7J564
908A402j513J21M48N12m05l27J749j331q95R6L754j809l807N12M573J493p367
925b794o70O382M347q268o420Q289P964n885j2297O154J2138j624j5555j082J6112
940F791L343j4096q764J4300R909j0545j2932P972J3536n338j2156L62J2606K02
$$ y = [8066, 300, -7145, -3053, 6419, 4094, -5320, -3772, 3236, 5886, -2219, -4328, 1308, 5316, 930, -3951, 308, 3472, 3636, -745, -561, 2700, 3014, 486, -1763, 1466, 2309, 1587, -1547, 77, 2079, 1816, 107, -1343, 2034, 1684, 729, -1616, 180, 2041, 305, -1460, -1446, 1608, 529, -404, -1761, 103, 1113, -795, -1036, -1251, 903, -679, -1163, -1466, -312, -117, -1376, -799, -1472, 325, -1657, -1353, -824, -651, -226, -1787, -483, -682, -7, -1611, -362, 234, -486, -395, -821, 770, -73, -433, -982, 649, 633, -193, -249, -162, 1402, -111, 10, 458, 970, 565, 238, 1987, 656, -239, -143, 3611, 1802, -2005, -1493, 3080, 4573, -2794, -3464, 2918, 7265, -1003, -7423, 866, 8830, 2945, -9352, -3198, 8940, 7316, -8239, -9321, 6791, 10134, -3962, -12726, 1574, 11483, 938, -11994, -4022, 9514, 4176, -7980, -7618, 4988, 5190]
954E190q593k441N832K547l908N56l3j910j51O496P92j0909j741J2714Q199j7135
970d495j1943J6439J9093j5090k5856J2899K9901n023l5583p80L6584R438l5542
983i958j8208L3663K3592k5879l0708K0449L2362j2063l2326L579L0716J582k4294
996g493p109J8732Q305j2150o159N079L602l083M375J46j0349k909J6913R364
1010A7264k4116j5710K4607K7150k5045l7093J9925M5879j0462n4695O43N7159
1022B5506J3235n8001k5951N3681L7341m4521m7576L4892N1362k0943n3629Q316
1034b6288N1108J483m2691j1407L5113J4049k3025j4489J3185J1090p223j108
1046b03J298o605l320J7492Q468k5905j7169L0041L1178l2168m2559K5628N6765
$$ y = [5190, -3403, -5844, -12, 2535, -1373, -817, -850, -2760, -2911, 3585, 4377, -6532, -8273, 4441, 12640, -4495, -16438, 1, 19094, 4004, -21852, -8953, 20948, 15925, -19658, -20438, 16146, 25584, -9958, -28166, 5497, 29089, 3210, -27498, -7049, 25313, 13250, -19076, -15497, 15219, 16801, -7493, -14602, 4130, 12435, 285, -5874, -795, 2807, -276, 4099, 4245, -6104, -9013, 7900, 17264, -6852, -22562, 2045, 29195, 4150, -32943, -13018, 32861, 22399, -32296, -31653, 25506, 38741, -19260, -45211, 8470, 45811, 1290, -46286, -11394, 39968, 19025, -34604, -26288, 24820, 26303, -16388, -27795, 7318, 21367, -1658, -16147, -2962, 8128, 905, -203, 1095, -5510, -8830, 8662, 17130, -8775, -25944, 4097, 35275, 3107, -39452, -13824, 42941]
1059D2941j6281o7516L692P2327J4628p4961l0059O8873M6889n9442o0030M6890
1071a2049O6650k9413p1238J4610O6792J487n9059j3764M8994K0251l5482k2625
1083b4846K3442J7208j2557q735L873L5m281J3839N962k3379j6165L0687K9394
1096C4477l3745m3065K9114N8150k0553p0193O098P8319J2361q1999k9864P6880
1108A5980M9675o8489o3877N3484P3744l4768q0451J8434P7187M29p0511j3934
1120d3097N9274K2778m3595k8149L0768K4126j6461j7617Q002P326m745O520N064
1133A0194j6738j3168K6482K4297l0513l8188K7570N4736k1765o6428Q116P6037
1145D0632Q412p9876k6020P5842M5945o8830o0873N4853P2203l7952p8543K0105
$$ y = [42941, 26660, -40856, -37164, 35163, 49791, -25170, -55229, 13644, 60533, 1091, -58939, -12049, 54601, 25188, -46050, -31440, 35352, 36839, -22220, -35984, 13010, 33261, -2221, -24846, -1404, 15804, 3247, -5488, -1615, -1580, -5861, 7978, 13940, -9439, -25604, 5083, 34477, 732, -42333, -13219, 44931, 24378, -45815, -39717, 38602, 50963, -31036, -60900, 15980, 65655, -2834, -66711, -13227, 60517, 25749, -54702, -36268, 40919, 41348, -29163, -43097, 16177, 38955, -4640, -32789, -2021, 22105, 5644, -11973, -3971, 3355, -1390, 5130, 10194, -6544, -19712, 6770, 31067, 554, -37634, -10064, 44672, 22907, -43521, -35405, 40632, 49044, -30832, -56852, 18990, 64935, -3895, -64768, -9915, 62288, 24336, -54207, -34102]
1157c4102P7014j212p2237j2430O1001K3044m7401k9409L4378K7007j9119k3603
1169a7069J0381J3370m515j939L152q207r254J8458J7148k2922k9891K3546M3336
1182C5594j9568n3862Q384O3931M594o7972k0364O6739L7247o1556n0055M9311
1194g577O2298l5998o7711K0174O8012l138o5102r184N5328K1058m5109k6239
1206c3188L3267K6547k0130k4589J1500J6794m013q517K096l24n089R562R787
1219A3703j3706j9629J6100K9168j4147l7633O571M6486J393m9154j4697N0612
1231A5067K6084m6847l6791L8333M6545k9251n0756J6267N2394l703n0827n643
1243b9128M3151J5661l7237j9391K6589K2337j7480k1533R981J6861l655j2165
$$ y = [-34102, 42912, 41700, -30537, -42967, 18034, 41078, -6323, -35732, -1354, 25653, 6534, -17069, -6688, 6682, 2167, 228, 3380, -4827, -14081, 4377, 21525, -1397, -31288, -7742, 35594, 16026, -37836, -29452, 34479, 39073, -28899, -49263, 17476, 54723, -6833, -56888, -7577, 54721, 18723, -48988, -28814, 39198, 36060, -29042, -38226, 17102, 38160, -6949, -33188, 79, 26626, 6496, -18093, -6593, 10201, 6188, -2329, -233, -557, -5646, 3916, 13703, -3, -19632, -3532, 25636, 11489, -26144, -19573, 26913, 28306, -20848, -35545, 15067, 41151, -5696, -42487, -4154, 42391, 13140, -37616, -21349, 31045, 27342, -23485, -29128, 14023, 29684, -7553, -26944, -355, 21982, 4502, -17031, -7050, 9811, 6156, -6009]
1255f009J593M743j472J655L818n086j0134R022J4327p156k1437M729K7237j24
1269A5706k9375q260L1853J4583k8975k2193K4807K8850j9885l1402J1038L4351
1281B1098l869l2727l737K9652J0384k5917j2996J8954J6258j3548j5993Q640
1293c801J3414l259j1612J997O454q0l527M89R15l304K352M673j828r023K382
1308c758J0671jj2658l783J4484N866j3032j0625J2354J3171r582j4904M846J7260
1322A0309k900j5948j480J4986M960j3631o163R535R241q343q636M818Q545k170
1336C123q162J157N650J544n301p59K626J324j373j154J559p14J44N25P46j598
1352f63j128L041P78j788l417L870K056j337m002J168M304m00l809j174N044O52
$$ y = [-6009, -4416, 327, -1145, 510, 4328, -758, -10892, -1870, 12457, 5301, -16136, -11407, 15830, 15706, -13669, -21929, 9924, 24507, -4468, -26661, -1854, 26996, 7111, -24291, -13253, 21098, 17229, -15498, -19235, 10417, 20801, -5116, -18112, 842, 17100, 3552, -12441, -3801, 9613, 6354, -5258, -3261, 3193, 3113, -414, 75, 990, -2314, 38, 4711, 2883, -6140, -3758, 6913, 6912, -5746, -9529, 4955, 10821, -2211, -12836, -482, 12689, 3107, -11797, -6951, 10309, 7409, -8539, -10019, 4967, 9927, -3704, -9867, -332, 8909, 566, -8070, -3252, 5293, 3123, -5039, -3882, 1768, 3312, -1989, -2748, -122, 1202, -171, -1325, 234, -480, -336, 189, 935, -663, -1791, 1250, 2028, 240, -3177, 693, 2749, 1412, -2590, -1422, 2882, 2482, -1327, -2501, 2543, 3195]
1368C195l105k465K621L597l088k620J089M148j324l769K12L215J040l757p08
1383a719K255J991k659k150K124J901q42l290J413J743L85k561l93K395J10j123
1399d20j895J913J042p25j351L70J522r80j15m57J203m71l68L81K2j88m60J151
1417A74m84j08k51Q63L47q93L03r8J079j123j52P55q8N4m30N74n53P37o78P92
1437H20l23k95L46M85J83j571P14L14M23j017o63J789j00l79j259J097m4k14J02
1456D08l37J65o30J575j075p39m92J833J061k776j374J875L742k707m535J532
1472b474O050o83p271k33O653L352q008m163P101N956n730p997M912P846j815
1487C496r203N65Q464J246o770l463O536L223l639m254L001K565j073p87j03k98
$$ y = [3195, 90, -2375, 246, 3843, 755, -1865, -776, 3372, 2048, -1721, -1509, 1706, 2746, -1011, -1719, 536, 2527, -132, -2282, -158, 1743, 901, -2389, -976, 767, 1152, -1409, -1802, 593, 703, -420, -2315, -402, 640, -85, -1436, -1066, 456, -524, -639, -1096, 107, -364, -732, -351, -329, -517, -977, 174, -310, -418, -669, 194, 541, -352, -49, -147, 932, -191, -343, 412, 324, 378, -52, 522, -31, 706, 28, 820, 497, 202, 548, 1033, 1216, -355, 359, 673, 1096, 79, -584, 1205, 1105, 726, -533, 564, 520, 306, 408, 71, 236, -394, 1181, 106, -633, -1125, 708, 1769, -1007, -2381, -506, 3236, 529, -4006, -2474, 3576, 2893, -4378, -4611, 2042, 5394, -2614, -6777, 324, 6280, 550, -7447, -2535, 5311, 3496, -5707, -5142, 3322, 4568, -2202, -5665, 871, 4094, 455, -3799, -798, 1767, 694, -93, -196, -494]
1503d94j000L355J496m413l897N333P308o108r456M070J3552k750j5202q91J6706
1518G609N525j7771q959J5940J3844j4086j7537J1055J9053n771k1188K294J9501
1531I509L014j8517o089J5102P931j0711r099P204P220l532n213J449K071j644
1545a305K878J337n170m988P569R320q527j4058O587K0315m942k3101j039K6723
1559A1599P105k7791j3228K5449K0701k3119k5662J7689L0150j1139l2486M559
1571a6173L0985M737k9889q478K4478J2084j8775j4034J2288J3734o395j1714
1583g152L853O504j439j145K058l365n832Q164R861r611j5784Q377K3577o763
1597A1303k8274lL3120P280l4895j6136L3829K5092l0454l2262K3879L8158j5935
$$ y = [-494, -1494, 1861, 3357, -1056, -4953, 380, 7688, 1580, -7876, -3806, 9746, 6996, -8206, -9097, 7609, 13134, -4637, -13596, 2344, 16188, 2102, -15435, -4380, 14673, 8902, -12286, -9992, 9509, 12523, -5994, -12083, 3019, 10950, 239, -8860, -1656, 5564, 2032, -3181, -1732, 339, -1305, 1573, 2910, -2260, -7248, 321, 9641, 1114, -12944, -6357, 13958, 9016, -14085, -15124, 11599, 18704, -9087, -22315, 3134, 23835, 716, -24946, -7257, 22893, 11754, -20732, -16173, 14812, 19549, -10340, -18818, 5660, 17744, -1031, -15065, -2777, 10957, 4562, -7152, -3299, 3205, 1766, 621, 2679, -686, -6518, 1646, 11507, 1896, -13888, -5511, 18066, 11303, -16971, -16974, 16146, 23426, -11469, -27605, 6224, 31316, 862, -31400, -7521, 30637, 14702]
1610A4702m1167O361M1112L339l9524j0161L3192J6737k6829j9809J8809J8899
1622A5661j0184j7811O036J2473k443o191R02J031m585N804Q416q315j4898Q206
1636e898K3096p091k9101R51L5163O335l7309j5541L7115K5149l4045l3582K7143
1649g615M0983j8424m4847Q211M6125K344m4451j0445L8107J8874l2076k1848
1661b5062K2919K3597j4734k1810Q216J6395k340j0983Q11M235k267J930O067
1674F974o078j2439Q377J8757o480k6184J975L2139M378l4804j4163L6476K2625
1687C1553l3013l2354K7940L9173k0592m3121R993M5568m71m3840r023L9310J7055
1700B8178l3471k1141K4201K4465j6997k2836R357J8932k963j4746J217P672k14
$$ y = [14702, -26465, -20104, 21008, 24347, -15177, -25338, 7854, 24591, -2238, -22047, -3238, 15661, 5477, -12334, -6298, 6175, 3732, -2459, -1557, -526, -5111, 693, 9109, 794, -14104, -5898, 17198, 10107, -18994, -18043, 17120, 23455, -13854, -29395, 7720, 32869, -1176, -34758, -7615, 33368, 14944, -29903, -21692, 24433, 26777, -17674, -28119, 9988, 28862, -3214, -25062, -2143, 21454, 6720, -15090, -6874, 9521, 7181, -3802, -2991, 1244, -1023, 907, 6974, 896, -11543, -3166, 15591, 9111, -17073, -15098, 17041, 21419, -13385, -27548, 8928, 31553, -1460, -33814, -5874, 33299, 12707, -30414, -20421, 25147, 24676, -19164, -28187, 11123, 28178, -5293, -26434, -2233, 22232, 5235, -17601, -8244, 10688, 7725, -7021, -5804, 1868, 1654]
1713A654k029K839k651p835O082J2631m481j9778K525K5038K826k8693j0386L0871
1727H613J7327k8081k6177K4600L2724j8307l6483R318L9706k321l7645o960L5273
1740A1587J3579k9961j8193K2781K1623j6444k0973Q981J9334l754j5714Q95R884
1753C625R82n482K11R95l338K289P016k792j2647K711J6112J505j9894o592K1686
1768F387J1216k0336j8319J9322K2297j4111k6660Q130K9433k830k8171m726K7469
1781I101R280k3518j3741J8595J6750j3727j6905P929J6589l712j3818O86R918
1794C427K004p567q53L098N19q81K077m67n547J390P581J207j0788k697J1965
1809D468O028j1966j0364J1805J2757q833j5847N958J7527j867j7436l328J8001
$$ y = [1654, -375, 2464, -187, -8022, -1940, 10691, 6210, -13568, -11043, 13995, 16821, -11872, -22258, 8613, 25940, -2141, -28318, -3718, 29006, 10699, -25784, -16466, 23240, 20919, -16726, -23686, 11587, 25166, -4795, -22988, -207, 21416, 4972, -16001, -7020, 12314, 8560, -7154, -6259, 3625, 4607, -875, -664, 331, -3007, -718, 6298, 3506, -9141, -6430, 9682, 11187, -8707, -15299, 6387, 17603, -2733, -21052, -1730, 20567, 6456, -20204, -12074, 17359, 14529, -13642, -18368, 9101, 18381, -5137, -18878, -283, 16467, 2740, -14165, -6236, 10353, 6641, -7177, -6491, 3427, 5431, -2136, -2989, 109, 628, -253, 1824, 1357, -4190, -2800, 4781, 5988, -4800, -7497, 4468, 10496, -1470, -11834, -29, 12728, 3895, -11952, -5994, 11533, 9666, -7770, -11098, 6903]
1822F903M949j4332q944J1869J1184r034j1461M886J2578l932r446o71R030J272
1836D851o847j593L667K952l225q17M12j75M3J053R64l512m99K876K361l797l940
1853e226M679N855l267p637L430O762m80q604j058Q284K043o026n376O417O087
1868E883m597n790J003P813j759n809j2M966K178n380j810M017K563l277k465
1883b476K289K609r08k126j87J825M65k155J009N49l45k22R80k013K68Q57m76
1900e7M74j305n1J619R20j746j636K123J407j422k778J864K056p53k660R1L229
1917A375M42l106L8J247K108k087k722J765K977j546k445M1K803j2k212l17P94
1934h57K455j920j704J456J365q57j117L58P84P39r61o69Q82L63P3q47O16lJ36
$$ y = [6903, 11852, -2480, -11424, 445, 11629, 2595, -8866, -3980, 8598, 4666, -4780, -5451, 3579, 4851, -1996, -3589, 78, 3030, -195, -1012, -600, -775, -732, 321, 1285, -2227, -2726, 150, 2511, -1286, -5226, -547, 5308, 2041, -5596, -2166, 4596, 4116, -4488, -5546, 2738, 4781, -1245, -6621, -204, 5883, 1286, -4504, -3501, 4312, 2553, -3256, -3268, 1698, 3876, -1504, -3314, 703, 3266, -11, -2476, -187, 2422, 1514, -612, -799, 1026, 1491, -664, 345, 894, 549, 327, 1307, -706, -438, 419, -57, 417, -888, -939, 680, 1600, -146, -1782, 341, 1748, 326, -2452, -588, 1468, 715, -1945, -1854, 1375, 1817, -1289, -1251, -4, 2104, 17, -2705, -940, 2037, 491, -1954, -1913, 890, 878, -1334, -1651, -857, 1598, -322, -2026, -570, 795, -62, -1179, -821, -37, 702, -259, -928, -46, 317, 390, -457, 159, 156, 292]
1953B92p29L40N88j98O04m98l55p28J109M89n89l47j92R01k9p04m92J566k45m75
1973C08n10O94L49o69K36l58J81j92Q4M71q15N72l96L46o88j28P49j16j67p61
1993h10P37j25k8n45O32O7m01L18p8p0p46Q59O56p01j410N72K593p35k276j022
2013b513L924Q85l778j697L320L281l501l607K230N070j682n462P53N441J020
2028C684n370j561M163K868l463l216K918K669r56l121J061J624m96n61K86k30
2044B99j333J926J683j471m056J766N231j285o444o53Q423J671q025m880Q497
2059A349P280q187q808N384J1585m435j1764J234J2201J887j2399l598R957O538
2073H224q895o898N819O940l175o946K241M851j70l494J95J071r02J334J806j688
$$ y = [292, -437, -97, 491, 293, 897, 399, 44, -684, 425, 914, 325, -22, -214, 687, 658, -46, -538, 1028, 783, 308, -202, 492, 841, 172, 408, 50, 231, 39, 123, 594, -221, 351, -45, 301, -387, -515, 234, 118, -49, -810, -73, -198, -226, -771, -139, -72, -473, -155, -233, -303, -1049, -190, 466, -235, -1645, -1073, 1520, 785, -1491, -2513, 1411, 2296, -1482, -3179, 141, 3422, -79, -3686, -1456, 3614, 1932, -3530, -2777, 2664, 3684, -1686, -3247, 916, 3784, 321, -2895, 23, 2692, 1736, -1385, -324, 1300, 804, 243, 529, 299, -1034, 892, 2575, 1104, -2952, -1186, 4045, 2760, -3684, -4337, 4086, 5757, -2268, -7148, 1349, 8629, 442, -8366, -2982, 8603, 4168, -7596, -6362, 5839, 7726, -4673, -8271, 1686, 8224, -671, -7569, -1750, 5190, 2015, -4931, -2690, 2161, 1991, -1503, -1308, -237, -1139, 195, 2001, 313]
2089C13m711K671O669j538r202m06J1910K454j2295o932J3701R836j2209j3493
2103a3232R652J7095o972j8107K137J9807J375j8640n396J6618R061j4318j0550
2116a1470R909J2093o501j1451L258R391k59p454k24L635M71j231J257j033m126
2131c735K866O008j407j0335L44J2984K863j4976p483J6289J1142j4707j6405
2144a6552J2645K0170r191k2612L666K4548J221k3575o738K1643J1139j8341j3822
2157a5799J3500J5878r600j4992M578J3801j023j1281o38O737K500m019k88P87
2171A41k589J567N362j239r719J052J2046K777j5337o604J6829J1084j5503j6685
2185a6818J4186K0308r873k3990M820K5831M31k5305o845K4428J1181k0507j5279
$$ y = [313, -4398, -1727, 4942, 3404, -5798, -6204, 5706, 8160, -4135, -11067, 2634, 12470, 261, -13232, -3580, 13515, 6543, -11564, -9427, 10380, 11755, -6885, -12281, 4337, 13398, -920, -11470, -1561, 10532, 4031, -7420, -4162, 5229, 4970, -2484, -2708, 927, 1398, 167, 1424, 391, -3735, -869, 5139, 3732, -6603, -6259, 6725, 9588, -5388, -12871, 3418, 14560, -147, -16552, -3907, 16263, 7072, -15540, -11874, 12674, 13895, -9680, -16418, 5225, 16364, -1977, -15799, -2299, 13579, 3979, -11013, -6435, 7366, 6343, -4938, -5576, 1161, 3661, -358, -646, 141, -2448, -881, 4481, 3242, -6477, -5425, 6621, 9398, -5939, -12543, 4286, 15370, -133, -16818, -2632, 17676, 7803, -16187, -11367, 14464, 14895, -10410, -17255, 7173, 18354, -2153, -17432]
2198a7432J5998J7896j1537j7528N626J6837j953j3775r68R749K797o764j823
2211b877K618J20k27K989p20p036P87R689J872j3059n020J4484R483j4381j4481
2226a5759J3128J8485r604k2394N442K4140pk4319o044K3641J0288j9938j4577
2239a7518J5879J7459j1703j7686O238J7969k692j5061q99J1780L212q576k741
2252d339M040K778k169L10K48l357L92O166J537r688l119J0557P248j1493j0813
2267a1702J0206J4685q004j7783M907J9130j58j9876m595J9706Q030j7053j2417
2280a4924J4558J4524j0431j5872N870J6124k616j3875j188J2154K707r173l794
2293e936N851M000l671j863Q43L28n22K149R51n058j423N968M411p347o559O876
$$ y = [-17432, -1434, 16462, 4925, -12603, -6977, 9860, 7907, -5868, -6836, 2913, 5710, -1054, -2877, -259, -139, -366, 2623, 1903, -5133, -4346, 5343, 7215, -5844, -10864, 3620, 13103, -1278, -15759, -2631, 15854, 6250, -16144, -10702, 13438, 13431, -10888, -16932, 6709, 16997, -2941, -17518, -1639, 15820, 4117, -13569, -7331, 10638, 7946, -7115, -8014, 3766, 6978, -1598, -4339, -299, 2479, 310, 620, 868, -2489, -2097, 4069, 5606, -4082, -7201, 3356, 10604, -889, -11702, -1496, 13189, 5185, -12598, -7691, 11439, 11281, -8595, -13190, 6516, 14546, -2507, -14924, -366, 14158, 3727, -12145, -6275, 9849, 7233, -6642, -7830, 4324, 7031, -2142, -5936, -85, 3915, 244, -1619, -776, -448, -970, 1179, 2130, -2928, -4351, 1617, 6028, -1319, -7878, -1002]
2309a002R383n611j2249L835J3610o20j4324k423J4000N823j2848q931J1582J0085
2323A0310p745j2289N400J2191k283j0874j093J0441K467q285l492N957M057l913
2337H49l565J931K749j299n77K14o48l03J273K259l195k586K427N087k714o710
2353d808K011P293j04q616q50P695L695q375m809P339O187n398p708L564Q313
2368E429j651p884m76P064J734n932l010N273L275l519l696K127L445j054k706
2383a581l45K433j68j070L24M08k35K1N73j33j354M28J383P74l491K45K629J787
2401B628l408j803K521L061k147m186K588L685l28m774k54M364J392m695k095
2416c451M784J942k701l412K460L314j223l356J12L311K26k717j187K877N68k043
$$ y = [-1002, 8381, 2770, -9479, -5644, 7966, 7346, -6978, -9401, 4599, 10422, -2426, -11357, 225, 10310, 2565, -9724, -4324, 7867, 5584, -5290, -6383, 4058, 6525, -1760, -5252, 705, 4762, 849, -2716, -785, 1964, 665, 88, 302, -346, -649, 624, 2883, -312, -2898, -471, 4616, 1902, -4808, -2797, 4496, 4392, -4224, -5074, 2621, 6316, -2059, -6868, 471, 6658, 1260, -6448, -2884, 5429, 3778, -4106, -4582, 2482, 4216, -1716, -4726, 547, 3822, 303, -3393, -1266, 2179, 1125, -1581, -1926, 507, 339, -731, -407, 1, -234, -213, 360, 227, -1127, -699, 684, 1458, -2033, -1788, 841, 2628, -780, -2583, -62, 2999, 852, -3334, -746, 2939, 2611, -2163, -2417, 1947, 3339, -1356, -3451, 1333, 3275, 574, -2838, -378, 2936, 1713, -1643, -1531, 1780, 2006, -711, -1898, 979, 1547, -496]
2432d96q08J333J230j833o55Q23J006l39r02J123j043j257J955J24p07q71R88
2449c29K0J442k365r08J772R69j372j359K090J481j976k093J525L179j157k037
2465a118n11K944n2j870j277K358J523k248j158J123K673k030j364J32J993j61
2481I57j353NQ77O40j258j26M13L88l60J77K23o33j13M99N63r59j84N77Q92p03
2501E22j257Q28Q79n7j677q8J780J27j358p30J472P84j466m00M63P19l15n08k70
2520e52Q71k89l83J88j40j9RM87n67J29k82N45l10j05k16N57M33p20k24M37M17
2541B66k46l96J44j49P99k93k70L3l9P19l10m85n92J555K39q38j320J052J944
2560A813q94k170J67K637M69k667q80K244J645j822k045J137K458j114k029M01
$$ y = [-496, -1304, 29, 1259, -574, -1229, -406, 600, 261, -641, 482, -561, -1818, 137, 261, -446, -1317, -329, -309, 1133, -1232, -2140, -368, 601, -771, -2130, -40, 1441, -535, -2628, -1103, 2076, 919, -1118, -1629, 1315, 1263, -607, -1884, 474, 1997, -251, -1409, -286, 2387, 357, -1007, -875, 1118, 957, -396, -391, 486, 1126, -132, -258, 155, 543, 183, 360, 583, -50, -163, 336, 899, -60, -244, 333, 1225, 522, -735, 93, 972, 915, -762, -850, 930, 1057, -301, -1031, 441, 1225, -241, -641, -178, 541, 226, -282, -552, 319, 30, -353, -165, -305, -324, -315, 172, -395, -266, -548, -3, -313, -418, -634, -77, 356, -364, -588, -151, 266, 20, -376, -232, -381, 418, 125, -145, -112, -151, 568, 258, -227, -819, 736, 975, 137, -1183, -131, 1813, 919, -1251, -1084, 1553, 2022, -645, -1525, 719, 2364, 542, -1503, -366, 2092, 978, -1051, -650]
2576f50J688O85j969k78N94O62n23k90N0l98M27M65J31j865M27J877N87k901j681
2595b962L385K569k654m138K588M527j653n317J23O234Q87n603k852N736L654
2610D524m794m363L207N430k512m499K95M831Q8l643n26K423J287j865o04P35
2626A4n4R8O98K07k413K40L005R81m007k035M236L951m426n807M274O779k435
2643C306q208P29Q890J444q887l709Q474N030p010p036N910P695m068p587J412
2658c615P558j61o327j076M572K368l722j420J048J377p99N19j6j966R9L050J390
2675B879m950k283N002M482n199o605M828P829k642j0019J317J0653J435j1323
2689d596l104J0138N761q497q967P861R099m839r392J758J0234o79p230k439O930
$$ y = [-650, 1038, 1723, -246, -524, 70, 732, 209, -81, -31, -429, -2, 463, 594, -1271, -844, 1033, 1620, -1281, -2962, 423, 2992, 338, -3800, -1212, 3315, 1662, -3655, -3532, 2702, 3589, -2014, -4866, 870, 4524, -270, -4633, -1426, 4004, 1492, -3007, -2712, 2119, 2207, -1436, -1962, 461, 1748, -117, -721, 14, -40, 58, 756, 963, -1450, -1210, 1795, 2776, -1231, -3266, 970, 4921, 495, -5312, -1038, 5741, 3306, -4902, -4173, 4717, 6161, -2726, -6435, 2039, 7069, 59, -6977, -1067, 6628, 2560, -5027, -3615, 3943, 3782, -2545, -3621, 951, 3319, -403, -1823, -775, 602, -197, 322, 306, -1660, -1561, 1489, 2879, -2071, -4354, 648, 5130, -69, -6674, -1846, 5983, 3341, -6678, -5361, 5292, 6727, -4596, -7700, 2438, 8199, -298, -9265, -1404, 7695, 2856, -6536, -4778, 5456, 4777, -2453, -4892, 2038]
2704B038K357m568k226K034J871j324M70n38o02M00J712P00m074j285M030L877
2720D872m861n639M212P988k806r750J704R508J746j1347l788J1019N492q719
2734c69q928P570R578m198j1117L327R663q6r313j612P066L595o185m001M433
2749e77L215k540j872J262Q57p96O03J228k818j008K816K821l855m308L444O873
2765E345k874q599K501Q689Q45j0468k724J0013N546r280p403P757Q866m903j0826
2780g515L487J0565j046r688j721Q907K904o842l913M872M332l131l697J323L068
2795A905q40j152J97K7q74J064J892k262k961K417M736k510o162J952O338J076
2811D843q743q66P015L794p174o080O507O889l942r071L477Q593q08q837q37Q073
$$ y = [2038, 4395, -173, -2399, -365, 1506, 182, 652, 114, -488, -88, 1624, 2324, -1750, -3035, 995, 4872, 11, -5628, -1416, 6572, 3766, -5984, -4280, 5228, 6974, -4373, -8161, 2858, 8350, -369, -9297, -1727, 7851, 3653, -7464, -4137, 5526, 5440, -3873, -5485, 1581, 5176, -1009, -5010, -577, 2638, 98, -1774, -512, 345, -451, 152, 1380, -1438, -2446, 370, 3191, -664, -4972, -1528, 5345, 2471, -6128, -3627, 5062, 5907, -4561, -7285, 2728, 8274, -1006, -8409, -652, 8214, 3311, -7515, -4028, 6537, 5491, -4197, -5918, 2989, 5893, -949, -4862, 10, 4342, 1211, -2486, -1163, 1905, 1065, -87, 110, 137, -737, 327, 2219, -43, -3004, -587, 4149, 1639, -4523, -2571, 3767, 4843, -3900, -4766, 2249, 6043, -1131, -7211, -704, 6185, 2243, -6828, -3351, 5242, 4434, -4403, -5240, 2833]
2827B833K480o741l950N338M398l451m688J927M133r92k709PJ938j29m95L1k75
2844c45k89L79K161j143k869O36M008K4n038m90M505K694n172l378M354M946l475
2861A508o010K343O547q40o882n36O440J959n553l071M607L831l012m841K502
2876a008M230j273l754k57L468L48k091j140J590O00m64k7l43J98o16J309p6j712
2894a018n66K198J275k695j539K063K901k341l227J414L750n25m201m70M670J301
2910B990m110k030L223L156k760m040K180M063j198l489J0L444O15k850j725K319
2926b02K299j414k351J537J347o35j033l08J158j90m9L49m47q5K10J531j400p85
2944d68K18J534m11k211M08K125O01k496r03K317J237j555k921J750K722j074
$$ y = [2833, 5313, -1428, -5378, -40, 4358, 907, -3781, -1854, 2279, 1287, -1422, -1415, 523, 394, -101, -70, -345, -634, -255, 1906, 763, -2106, -1470, 2538, 2562, -2476, -2966, 1539, 4233, -939, -4317, 37, 4983, 1508, -4502, -2159, 4388, 3548, -3334, -3870, 2570, 4529, -1024, -4095, 512, 4343, 1331, -3510, -1008, 3222, 1949, -1805, -2062, 1406, 1754, -337, -1477, 113, 713, 249, 222, -121, 77, -539, 770, 694, -1018, -1584, 614, 1889, -806, -2345, -282, 2619, 278, -2949, -1535, 2215, 1690, -2511, -2981, 1689, 2990, -1120, -3150, 73, 3229, 469, -3571, -1391, 2672, 1474, -2015, -2005, 1439, 2054, -796, -2521, -202, 2097, 683, -1668, -131, 1216, 581, -452, -760, 398, 208, 159, 508, 61, -24, 186, 1717, 317, -468, -250, 1284, 873, -1338, -930, 1195, 1796, -700, -1603, 714, 1951, 396, -2525, -775, 1947, 873]
2960H73k599o7L673R0k722j275K069J520j506k676J938J826p87j708J63K420o08
2977F24q41o77R68P95n72j467P47M52O4m52M16p76R1P11Q9l2q36P53P08j032q27
2998a094J109J024k36k441N57J847J098k722o36K140J151j231k170J509K220r86
3014A139k261K08K330k74j525o54J512M58n30j015P04R65m37r77j56N32N4K15
3032B88m26k07L08O9L70j92q09l56J627l14j025J61Q41L68j121l21L5J318n11
3051A03j697J162L79Q92k649J285J186l15n00j114J150P74j14j265N65N33n99
3068b24n25L44K13j07Q90j32q13L05J75O59m12K30l51JJ44k9o1K79r17O65L64
3089F98m35M47k55m94K88J76P7n94N31o85L41N33m35K47n25J24L84K6j351J137
$$ y = [873, -1726, -1793, 1880, 1970, -752, -2027, 42, 1562, 56, -2620, -682, 1144, 357, -1351, -1188, 1232, 624, -217, -894, 74, 869, 297, -1170, -423, 29, 93, -359, 57, -719, -628, 83, 172, 140, -696, 57, 765, -267, -1094, 15, 1039, 803, -1638, -1081, 766, 1864, -858, -1494, 646, 1797, 566, -1604, -95, 2125, 1139, -1122, -914, 1416, 1142, -383, -1037, 475, 933, 403, -612, 92, 1057, 620, -357, -513, 19, 73, 288, -138, -345, -37, 32, 402, 210, -599, -955, 672, 358, -667, -506, 335, 703, -418, -739, -704, 614, 103, -1594, -432, -53, 839, -1810, -525, 661, 346, -154, -1268, -118, 656, 542, -723, -158, 375, -224, -749, -405, -192, -299, 591, 459, -354, -49, 126, 785, 373, 603, 252, 253, 397, 368, 307, 586, -331, 334, 698, 263, 710, 455, -39, 249, 425, 502, -92, 439, -246, 95, 628, 193, 440, -85, 39, 423, 449, -902, 235]
3109B35M12o77o8L17N21o86r42L84Q17j33n43J93m54J273r72M5J66n9n49Q09l57
3130b68j222R80j094J678j104L45l3J275N15j524l35O77J217j785r38K008J126
3147A518j147j184N3K572j345q54n41J942M31k211L67R12l60l19o42J092R92j002
3165B74r92J009P09p44q7Q41l93j260J262Q66j488n27L27J252K48k018l20J673
3183F32J403l084j245K802R97j249l006K040L101n33m003P72K971K37l062j669
3199b896L859K02j848m72J285Q88j485p50N51J547o67J18j97j065l81O65J668
3216A022j039j041J501J118r18k514M4L464L67l652K21K386K495l426k328K645
3232C45K000k63l941l3M254O25n260J77L679Q36k321k398K180K281r13k741R85
$$ y = [235, 647, -30, -98, 219, 740, 54, -888, -504, 313, 180, -363, -170, -624, 649, -323, -278, -112, -171, -720, 89, -268, -1490, -510, -1604, 74, -1030, -685, -718, 557, 1072, -452, -787, -110, 1107, -678, -1616, 392, 1518, 371, -813, -760, 1812, 467, -387, -928, 1014, 1445, -766, -399, 513, 153, -166, -808, 284, 1276, 274, -718, 291, 1000, 256, 169, 1010, 617, -643, 619, 1485, -3, -530, -203, 1049, 1297, -721, -1041, 632, 2035, -1049, -2294, 508, 1505, 256, -2750, -710, 2391, 1858, -2145, -1373, 1598, 1835, -1227, -2896, 963, 1165, -683, -1155, 130, 1018, -467, -1217, -666, 881, 214, 332, 135, -930, -1311, -646, 1022, -17, -1058, 443, 1561, 643, -1871, -1827, 1637, 2004, -1648, -1427, 959, 3454, 28, -2300, 345, 2345, 2082, -1859, -1892, 2362, 2987, -2273, -2096, 1583, 2419, 98, -2300, -120, 2161, 1248, -1493, -508]
3249e08K730j527j259P06J86k36l74O64q66J17p3J103o0j754p1L119n02k974L26
3268a253K254J728l376k213K220L503j324l804M42L594P85m107p42L283K179m120
3284i51k120K866K579j665k860J189K787m93k201r27K724k32q65m31J408l66l63
3301G9N60o9n07m54J375M7j692r40J998J789k300k018J643L136j862l276J479
3318a012L763o77m081j4L715J686m244k286L218L067j796l549J003L409p94k575
3334a167p20L238r4j681j775K200J332j528k82Q16N05j736N70N85q45l7Q56Q15
3352A052j868k56P92K166j723k127J124K880m23l430l36L409J371l665j880K774
3368a40L254k452l168Q86M010o62l486L6K735J360l018j439K620J394j592j879
$$ y = [-508, 2222, 695, -564, 142, 328, 92, -282, 382, -484, -367, -440, 663, 603, -1151, -1222, 1897, 1395, -1579, -1253, 1001, 2729, -647, -2860, -640, 2863, 1539, -2265, -1823, 1771, 2556, -1551, -2293, 990, 3169, -951, -3071, -205, 2374, 709, -2151, -962, 1825, 1332, -869, -1796, 928, 696, -169, -600, 808, 442, 79, 639, 570, 63, -391, 984, 1031, -661, -1601, 397, 2186, -114, -2132, -489, 2647, 785, -2491, -1012, 2751, 2074, -2007, -2021, 1694, 3380, -864, -3150, 68, 3135, 1339, -2210, -1207, 2202, 1408, -1167, -1887, 1351, 1257, -424, -2199, 1, 1333, -195, -477, 339, 844, -892, -322, 263, -582, -619, 237, 1052, -816, -1072, -280, 1886, 163, -1964, -840, 2040, 1617, -1813, -2149, 1260, 2631, -1034, -2914, -140, 3114, 662, -2506, -1620, 2390, 1728, -1758, -1722, 1013, 2373, -645, -2084, 536, 1930, 338, -1541]
3384a541J375J552m36j205j65P46K4o35P42k39n74N98O59l36j010q6J808p4j933
3403g30n34K715J200l800j357J986L017j990k627O58L403m67l493L60K227J697
3419B265k813j883K223J596r21k558J522K252j061k205M96J470j98m00l40N45
3435a0K21k1J39L22q42k14Q70Qj307m51J851J250k337j669J884K400k427j581
3453a914Q41L318n34l465q3K664J551k947j183K385J514k075k080J739K353j320
3469G64k456Q88J955L83k045k87J254M13m46r32K23P68k47j79n3M08r20Q63J61
3488E15j150o05J153J700k065j024O75J995n8k731J93K776K74k976k37J538J682
3505A655k179j522J143K366o99k904J057J877L40k133j00J224Q32j124r93J108
$$ y = [-1541, -166, 1386, 950, -255, -420, 326, 350, -285, 457, 218, -356, 242, 901, 565, -445, -531, 1277, 1203, -730, -1264, 1451, 2651, -1149, -2506, -520, 2497, 507, -2120, -1462, 1941, 1474, -2019, -1659, 568, 2265, -548, -2431, -208, 1388, 467, -2091, -569, 1683, 622, -1583, -1087, 383, 185, -215, -555, -10, 211, 190, 329, 651, -191, -405, 465, 473, -834, -1285, 566, 1816, -521, -2190, -306, 2094, -333, -1914, -1073, 2245, 1711, -1754, -1837, 827, 2378, -569, -1752, 633, 2147, 72, -2008, -269, 2084, 764, -1692, -804, 1151, 1534, -511, -798, 456, 869, 423, -509, -286, 482, 235, 56, 3, 411, -509, 354, 515, -635, -1240, -87, 1613, -452, -1476, -801, 1194, 1136, -1595, -1402, 1374, 1648, -1328, -1565, -27, 1655, -524, -2046, -903, 1463, 764, -2140, -1083, 794, 1134, -999, -1099, 125, 957, -167, -1160, -52]
3521e2O06j19j001m0J070l29M23l87m44j79R34O49j183k17m26J634k23j165n23
3540i72J408J083j933q20J418J406j403j539O95K419j011k048M21K325j6k470
3556a037k50J593M09p98r15J221M58o41j101R34P59m91n16k12O80m90L38k70L63
3575C4k99k97P69p94p1J91J335L64j553j130J311J473j365n97k57K074j141j322
3593a275N13J287j34m73m65Q13R65k424j2J113J245p65o62K26N30K34r77l0M5
3612b46N42j11j5j94k09N61N55j082L94m63Q73j10j68j209J241J66k12n79p5R75
3632F34n28o45k15J369o49k33o10O98R26j488K62J68J120j228p74Q16O03k71o66
3651g11L64L64n61L60p9k87N54J87o64M23m01j85M42l53M16p32O79O84k87n66
$$ y = [-52, 554, 435, -566, -606, 464, 135, 558, 171, -273, -452, 482, 1131, -52, -269, -695, 939, 716, -449, -972, 436, 1519, -414, -1234, 184, 1590, 187, -1352, -657, 1762, 751, -1297, -876, 1449, 1433, -1037, -1287, 306, 715, -83, -998, 223, 681, 40, -1061, -127, 632, 141, -375, -587, 93, -397, -59, -329, 34, -265, -562, 207, -587, -658, -467, 868, 1232, -321, -1451, -140, 1333, -32, -629, -886, 1188, 47, -1275, -762, 525, 391, -82, -547, 266, 1231, -1193, -1205, -92, 1153, 388, -274, -48, 482, 716, -261, -291, -246, 296, 185, 170, -24, -233, 328, 883, -199, 195, -268, 605, 495, 327, -882, 359, 525, 313, -266, -341, 634, 106, -539, -754, 615, -34, -267, -877, -179, 747, -741, -479, -311, 809, -419, -1193, -377, 226, -45, -711, -347, 17, -544, -184, -263, -550, 4, 191, -473, -50, -451, -636, -194, -547, -131, -863, -184, 500, 213, -353]
3671c53k27J148j56r09N16P52J78j351k39J040J54o40k52L13R37q54m53O24O00
3690H28n0j120N2Q02P8m19m50L16k0J74j66K79q32J71Q11p97j93k25R01J61k8
3711B73j82j50O14n80l26r27J343L51j044N60L53M27j266k97O76P29o48o93P91
3730Dk67P51o80o2M19J11n61J14M04q8j5q30Q96n72n80P97P27m54l45N73n13k58
3752d29j150J180O59k61n86j67K045m27r90q36J276P61j025r82J017J299j199
3769A85k34l04J201n30m10j92O53J76p44m38N33L78n05J69P94o42j066P09P29
3788D62n38q74J005M08j307j051J557J099p58p35l05J588K56j653p76J060O36
3805G4jp61M34J657j596p10m12J082O09m75r6P40K26p93l5m80O00n70Q85j30p26
$$ y = [-353, -580, 568, 412, -497, 19, 771, 949, -402, -641, 399, 553, -87, -339, -26, 911, 57, -396, 228, 828, 778, -342, -290, 512, 590, 171, -279, 37, 17, 191, 25, 304, -528, -357, 454, -343, -536, -761, 140, 301, 273, 91, -59, 555, -25, -351, -1278, 65, 416, -628, -68, 285, 712, -554, -851, -175, 554, -94, -787, 4, -263, 488, -192, -254, 165, 276, -285, -171, 233, 145, 130, -700, 196, -376, -956, -159, 568, 114, -231, 342, -171, -429, -1579, -399, 260, -1, -587, -754, 1291, 864, -126, -962, 314, 1075, 50, -932, 85, 1384, 185, -49, -353, 848, 318, -92, -284, 369, 545, -199, -637, -104, 274, -231, -62, 732, 90, -976, -267, 462, -76, -950, 55, 463, -844, -1895, -338, 761, 3, -732, -1037, 551, 807, -846, -1622, -562, 74, 73, -688, -254, 1403, -193, -903, -1315, -233, 376, -99, -195, 545, 771, -22, -57, -537, 63, -507, 378, 248, -478]
3826d78k7J493o58r44o82J368J438r80k661K462J699k395j192R74J212O1j514
3843h24r57K424J584l106l44J201J219o98j246M81J506p48j285K61O76M14q11
3860b53K73m34K29j57N15o19k24P62L89J63j565K05J213J392k408j487J850K153
3878A997j535k696J676J776k78k436l1K535P57k090j952K460J269r79k125J087
3894e65J927p23r07k46R98j36j86m33L97n45J46R07l10j050K38J661n23j376L6
3913f90J651Q14j984j539J880K110j620k751J479K619m44l164J03K759N34k483
3929g26j211K452J133j458j608J064J452m17j542M6J482m35k25l47M23l48l05
3946e70J248n82j044L87J834p94j463m31K073O39k109j126J865K115j621k431
$$ y = [-478, -505, 988, 330, -614, -1296, 72, 1510, 530, -2131, 331, 2030, -365, -1557, -583, 629, 690, -824, -1781, 643, 2227, -879, -1223, -22, 1197, 499, -747, -266, 1240, 492, -793, -532, 144, 558, -253, 20, -414, -185, -342, 173, -446, -670, 92, 481, 644, -921, -716, 497, 1889, -519, -2006, -156, 1997, 462, -2234, -558, 1218, 940, -1496, -1527, 1008, 1765, -325, -2277, 183, 1452, 473, -1652, -565, 1362, 639, -268, -514, 484, 348, 162, -271, 126, -419, -273, 634, 324, -726, -488, 1173, 650, -726, -690, 961, 1775, -209, -1748, 132, 2242, 622, -2129, -650, 1969, 1525, -1639, -1536, 1223, 1757, -726, -1937, 515, 1648, 190, -1418, -354, 1098, 681, -861, -815, 667, 232, 7, -340, 83, -265, -570, 678, 96, -948, -561, 1273, 479, -984, -1415, 658, 1297, -812, -1938, -73, 2042, 421, -2010]
3962b010J056K617j35l121K48K421J130l157r12K341R37j331j192J025J220q20
3978C17q72l14J810K70j231l73K69p0L81N39o11q86K89J537O1j426m25J868n6
3997A077j416j273K336J507j675k443J644K257j203k386Q46K070J188l740m56
4012a667J622J780j752j181P06O76j7j168Q11P10J31o97p2M60n25N49J24l16J11
4031B85p07O48M8o16j17J067k62n3k156J680J470j037j234P2J569L7j502k61K575
4050A506j392l10k55J153r6q39K78o12J891p75j686J304N98q4j528O67O90N38
4068A048p48J50r61k33J409k09n85o20N93N51j01q76M17K46M4K42o75l80J651
4087I63q16p59m80K082j86j929j42J147Q20j194k41K07J532o21j940J100M13O06
$$ y = [-2010, -954, 1663, 1528, -1593, -1345, 1076, 2206, -951, -1863, 478, 1415, 84, -1108, -83, 1137, 317, -555, -869, 941, 1211, -20, -393, -124, -194, 187, 726, 115, -771, -482, 1055, 1116, -310, -735, 1133, 1077, -339, -1612, 724, 2231, 556, -1887, -243, 2014, 811, -1575, -729, 1341, 2529, -1211, -1667, -45, 1735, -17, -1198, -492, 184, 167, -1001, -190, 520, 651, -46, -118, 342, -183, 366, 490, 174, 285, -422, 226, 274, -342, -459, 608, 346, 293, -1863, -183, 1287, 250, -984, -912, 657, 694, -808, -1069, 1506, 114, -196, -451, 702, 606, -233, 45, -567, 1324, 549, -1137, 167, 765, 681, -847, -180, 510, 1048, 300, 450, -511, -744, 665, 456, -129, -749, -156, 395, 294, -582, -165, 81, 125, 367, -308, -688, 963, 147, -612, -1092, 990, 804, -1125, -1267, -120, 700, -494, -735, -528, 1004, 383, -1557, -457, -44, 562]
4105E62r58r4N75L40k92J64m7n23K6L78L32j100N7Q73l9p46k52P74L39k11p98
4126f40M31R32J45j344r5J497J52r49j133J627R33j410j087P08J602j044r90N80
4144h5O16k48l15k52O42K6o41q26N81J40N39n27Q73r24M02Lp3k95N40n44R07r7
4166D42q20P88n49J63j024L78Q43M33j435m49J144J271j711n40N13J853r19j288
4184i07kK177m85j867M09R75M80j233r50J445Q82j241m24Q76R2n51k04J257m29
4203C00m70P0M42j35m06K09N21J00j050L8Q61N35j798m64J441M97p33j109J494
4222C43P57o65j431p0K936j737j019j91J759R97j717l88j16J944j427j033L55
4239g03J481J21j509O29RJ9O31L72o08j296J703l78o8j797J560j7N37j480J12
$$ y = [562, -396, -490, 85, 425, 133, 297, 250, -273, -247, 131, 463, -637, -580, 293, 254, -492, -744, 30, 369, 158, -640, -209, 723, 868, -476, -571, 926, 1078, 129, -1004, 623, 1556, 146, -941, -233, 1369, 325, -665, -85, 531, 283, -32, -284, 358, 384, -257, -1083, -502, -362, 177, -350, 523, -401, 1, 4, -69, -364, 176, -368, 539, 442, -378, 410, -139, 24, -1000, -622, 221, 654, -781, -1230, -86, 1185, -526, -1066, -553, 1300, 381, -907, -909, 1268, 783, -1084, -675, 300, 780, -453, -1403, 42, 924, -317, -741, 135, 227, -324, -528, 729, 300, -170, -100, 342, 207, -199, 10, 531, 631, -419, -381, 480, 1015, -783, -1247, 194, 691, -42, -1151, 343, 1100, 435, -996, -1066, 1870, 133, -886, -1077, 682, 1679, -38, -426, -542, 1402, -25, -1058, -703, 778, 899, -610, 19, 28, 47, 678, 1050, 442, -854, 849, 471, 403, -1394, 166, 149, 686, -794, -682]
4258f82J522j48r00j710J860J599p51l072K235K248p85k868p71L672K48k052j550
4275a905K197J095q33j628j82K455l44j325k30J322K1j53p58J13mL83P27k63j954
4294a266Q65J304L9j891o21K641Q33k545j573K160K673k128l339J765L236n85
4310A568l678L84L629J75l201j221K411J715j526j313J334J064n75j464m89Q13
4326c74P73q29J113r67q14P51J308j015n69p9J802l00k643M34K411M68k172j823
4344b525K332K344j846k781J519M267j431l775k89M366k82k909m57K639J092j885
4360C79k055J287J461m89j445M10O94Q5n12N54n80l12M43J429r29j673N31K217
4378A495j92l040k69L426P65l013j868L071K125k115l266K034L076p25l697K14
$$ y = [-682, 840, 692, -208, -1918, -58, 1541, 790, -2282, -47, 2201, 1416, -1452, -2223, 1449, 1697, -355, -1905, 292, 1387, 554, -1074, -1256, 1199, 855, -470, -700, 622, 643, 490, -268, -155, -159, 224, 951, 688, -1266, -401, 903, 942, -949, -1570, 1071, 1904, -641, -2214, -54, 2619, 491, -2848, -1083, 2153, 1568, -2110, -1726, 1903, 2078, -1123, -2344, 67, 1782, 256, -1057, 277, 1341, 766, -698, -1187, -374, 399, -430, 683, -284, -1098, -347, 961, -54, -623, -702, 1100, 800, -1843, -1409, 1002, 1470, -702, -2525, -193, 2151, 305, -2476, -957, 3310, 1879, -1896, -2185, 2181, 1899, -1010, -1467, 1172, 2264, 379, -1676, -389, 1072, 583, -862, -452, 242, 327, -185, 369, -211, -523, -80, 1349, 420, -1253, -722, 1495, 1303, -1737, -2006, 1420, 2185, -828, -2696, 375, 2500, 385, -2881, -847, 2229, 1504, -2193, -1979]
4394a979L466N01l249r93K763R21j518j208R26J201l61j095J82N65j44j87N19
4411C10n44m54N32J130q45j740P60K543l74l001k1K765J421l329j666K920K361
4428B768k565k738J932L002r25l326N33K931L68k733r34K251Q92j311j372J270
4444D3R21o26p33M18K02m39M42L47o02q91J013J285j158j645Q91K190m82k937
4462a761J19L252L09k967r63K358J640j959k477J850K275m17l116L96K525r2j732
4479g60q01K112N64j123j058Q88N37n0k46Rj64k24M38K37o47p24J193Q41q81j566
4499a425Q09K263q10k009P1K537K62k313j294K381J423j557k144J515K287j171
4515H25k141N46J907P2j612k28R15O14q59k95K69J01J36l09J67k94l13R38J33
$$ y = [-1979, 1487, 1988, -1261, -2254, 509, 1430, -88, -1296, -370, 831, 470, -625, -443, 122, -22, -209, 310, -234, -688, -156, 974, 129, -1611, -851, 1692, 1318, -1683, -1704, 1061, 2482, -847, -2513, 407, 2768, 203, -2535, -603, 2399, 1474, -1852, -1319, 1612, 1980, -753, -1687, 564, 1456, 145, -1227, 43, 964, 338, -395, 23, 225, -214, 228, 575, -27, -918, 95, 1380, 222, -1423, -532, 1658, 1176, -1761, -1642, 1610, 1919, -1048, -2011, 347, 1987, 28, -2449, -599, 1676, 1259, -1857, -1461, 1064, 972, -760, -1561, 551, 1115, -8, -1066, -178, 359, 309, 63, 72, -92, -316, 122, 359, -288, -1012, 181, 1022, 141, -1425, -616, 1647, 837, -1172, -1101, 1436, 1698, -615, -1909, 472, 1895, 338, -1806, -291, 1996, 825, -1316, -770, 1137, 1209, -403, -631, 284, 898, 39, -256, 13, 114, 250, -59, 108, -186, -499, 439, 572]
4534E72j109m18J139Q41j104j354Q38J915p23j518j20J959J11j602r53J802J068
4551A344j660j054P62J487m23j492L01J447j85r24j7L73M83q49m3N03k86J04j8
4570a47n5k18R8M99N91r03o67Q95P15l94j599J100J109m06j505k7J742K12j552
4589e12m92J365J162j459j215J190J143r45q31J98R39j8p77M1M82j4l59q2L61
4608A77k03MJ91J7n14j9P49Oo07l22M33O64o87n73L51J062n15q40l70J369L21
4629F94j059m02R05N64q44o28O54P70m65q37J19J316m11p10R9N47n3k88k56J95
4649i0K90m01J61K39n0k36J33L49m46r2K20M83m25m23M08M72l22p87k2J163J70
4670G94j069n26J019O35o58j305J057J148o26j483N23J455m52r99j82J027K03
$$ y = [572, -537, -955, 184, 1025, -79, -1433, -595, 1320, 597, -921, -1041, 918, 1029, -573, -1526, 276, 1344, -316, -1370, -608, 879, 456, -1036, -735, 712, 527, -397, -414, -41, 442, -407, -450, 53, -233, -129, -147, -202, -420, -322, 177, 768, -135, -802, 93, 808, 414, -1185, -85, 1024, 618, -887, -914, 828, 1040, -512, -1004, 361, 1523, 64, -1151, 39, 1182, 237, -594, -396, 543, 525, -252, -211, 271, 257, -102, -184, 177, -26, -22, 169, 186, -328, -347, 402, 408, -199, -521, -88, 576, -111, -684, -333, 729, 214, -626, -996, 373, 694, -365, -767, 138, 702, -142, -770, -116, 654, 189, -648, -529, 787, 376, -334, -235, 312, 259, -29, -285, -90, 200, -201, -40, 199, 149, -87, 46, 395, -51, -143, 77, 560, 135, -288, 120, 592, 270, -517, -539, 624, 794, -275, -801, 218, 853, 195, -1110, -53, 1095, 469, -1014, -491, 964, 512, -487, -669, 358, 561]
4687E61n57n69N38Q17m88o73J23N88k27o02K53K33j43j95J80j17j0p0N28j1p05
4708e46Q6Q18J83q94q47J385Q00j197r95J352J035n80j718M38J941j69j966k77
4726a151J893N74j624q83J117J519j165j475Q29J280j8j548J11R21L11r04K1K74
4744H2J52j01J12j33l82k99R78N08j389m82J427O84j227j212J142J841q90k716
4762a905Q60K501J8k903m47K843R14k401j930K549J593j336k404J218K034j57
4778A047k125J27J362O92j438j20K77K91k88J79K50o92R9R33K16j369l88J292
4796C45J116j846j233J699K119j510k920R30L425l58l461j73L278J006l087j817
4812b487K663K349j806l032J492K698o06k767L1K486L8j664m16J228L76m47Q1
$$ y = [561, 4, -565, -27, 790, 302, -371, -248, 340, 113, -489, -236, -3, -146, -341, -161, -278, -288, -358, 170, 159, -546, -460, 358, 541, -353, -1200, 185, 985, -212, -1207, 145, 1180, 600, -1118, -680, 1261, 1092, -874, -1151, 742, 1316, -308, -1191, -74, 1445, 280, -1195, -366, 914, 896, -652, -541, 380, 691, -213, -192, 82, 234, 133, 245, 112, -270, -569, 409, 917, -472, -954, 473, 1157, -70, -1282, -140, 1701, 811, -1905, -1045, 1456, 1474, -1429, -1876, 967, 1881, -520, -2450, 99, 1692, 356, -2048, -830, 1204, 1047, -1078, -951, 411, 1103, -335, -455, -178, 113, -175, 4, 254, -438, -339, 594, 810, -559, -947, 345, 1461, -385, -1618, 81, 2200, 690, -2230, -1300, 2125, 1767, -1694, -1867, 1411, 2417, -670, -2487, 176, 2525, 719, -2313, -821, 1877, 1271, -1496, -1465, 1021, 1059, -605, -1021, 207, 583, 136, 217]
4829B17l37N5j42P09J68j320m53J413J471k308k057K435K597j699l447J315L579
4846B196j80m311r6L742J304l774k124L458K551k382l276J797L435j136l251N35
4862a512K995K24j942j302J647O08j104P17l16n19K88O20L19j665o72K506R99
4879A891k264j872K098K820k008l323J304M033n45m431j71M146J366l601k760
4894c317L631K752k356l534K210K802q19l026J99K515L27j831o40J512J97m30
4910A92l42J11k8l17R86L26j927l82K197J087k645j187J920K678k403k925J485
4927a174L963j182l819k01M044J098m167j495L348K459k797k745J882K814o72
4942A356k943L53K491M2j911m80J359R8m27j35L43m44J83J026k12j374k97J755
$$ y = [217, -120, -65, -207, 502, 670, -650, -1103, 310, 1781, -527, -2584, -149, 2448, 749, -2698, -1383, 2196, 2016, -2295, -2391, 1351, 2655, -1119, -3243, 215, 2766, 384, -2892, -1095, 2340, 1204, -2047, -1512, 1483, 1707, -235, -1537, 110, 718, -386, 331, 15, -504, -216, 404, 723, -942, -1614, 892, 1891, -373, -2245, -147, 2673, 665, -2658, -1354, 2679, 2134, -2297, -2468, 1678, 3044, -557, -3317, 314, 3066, 710, -2824, -614, 2188, 1369, -1657, -1458, 1057, 1384, -447, -1087, 425, 622, 192, -150, -39, -67, -384, 602, 928, -999, -1381, 816, 1903, -742, -1929, -9, 2669, 266, -2659, -1174, 2789, 1607, -2212, -2413, 1631, 2729, -1438, -2933, 415, 2874, 77, -2668, -786, 2028, 1356, -1587, -1234, 1257, 1299, -612, -1092, 267, 365, -62, -197, 146, -298, -115, 911, 699, -675, -972, 783]
4960G83Q17k147j415K152K219j898k458J015L562r61l486k06L691O49l351j154
4976b188K430K311k150k442J429K144m60k307Q4J872K84j315m53O64O12m84j55
4993a24M14o10k47J065p8j068o22J882O14j912j092J685J887j601j811N77K778
5010A737l60l151K9L238J4k103j241K106J400j683j416J355J263o96j254J00J250
5027E88K34j263r0O17J94j78J34k74l44N71L74L57j581j63J524K40j267j151J453
5046b5J791j307j810R80J696m89j316l02J968k61j476o73J499J153j287j042Q86
5063a5N23m19o12R3N18K00n74k56N68l3m43M60j17l22J44L78N77j368N1J016M70
5084H39r20r12J040Q34p89j316J074R61r3j128m64J194N7n95n11P71O17o35L1
$$ y = [783, 1600, -547, -1962, 190, 2409, 511, -1947, -932, 2630, 1669, -1817, -2023, 1668, 2317, -1034, -2188, 242, 2553, 403, -2039, -610, 1534, 1074, -1233, -1149, 723, 1007, -308, -761, -97, 515, 31, -124, 290, -320, -567, 498, 420, -648, -1270, 612, 1226, -686, -1778, -93, 1794, 193, -1618, -1041, 1737, 1377, -1774, -1745, 1493, 1507, -596, -1837, 269, 1669, -14, -1430, -75, 1188, 492, -762, -662, 588, 822, -441, -531, 86, 280, 102, 236, -38, -382, 189, 563, 920, -661, -824, 700, 940, -327, -1478, -25, 1766, 459, -1351, -371, 1325, 836, -480, -782, 1186, 925, -551, -1224, 275, 1428, 141, -901, -15, 508, 89, -523, -430, 88, 288, -286, -542, 26, -7, -450, 10, -107, -429, -285, 93, 670, -698, -647, 369, 839, -81, -993, 47, 881, 92, -1224, -150, 811, 718, -410, -874, 320, 377, -218, -729, 42, 659, 24, 55]
5103E5J19K56j40k93po7M26K02p7n47j11L35K31k82k17J34Q31m38p88j36J068
5124E54M04j243l20J048K94p59m14M52Q80o21q09M83J156j150m51J5O53%n41k9
5144c98L75j39P32Q4r81m33Q35K69q01Q34q26l15R40j08M5j77N06p01n82R43r5
5165GN23r99M1Q86M3l68n37N66N46j03j364N68K83M64j032k00J269j60m12j06
5185h5J88Pk2m5l16N28J31l99M5j41K20O8j81l00J66K66L87m93l70J10M65J48
5207C77p11j39O29L32o67n45O97M44k21p80o2J114k5j103j84R77L24n78p49O78
5227a92N28n6o98k90J246j25o96o28J021K20n25j58L53R9j82M0LM4N4K81r9l17
5249g7k65M91L92k84r07M21J150l54j347J91J275K42j486m47J481J077j712j085
$$ y = [55, 174, 430, 290, -3, -10, -77, 349, 551, 474, -73, -184, 151, 382, 100, -117, 17, 848, 410, -378, -514, 554, 958, -285, -605, 443, 737, -22, -436, 16, 896, 275, -534, -51, 1105, -45, -496, -481, 172, 172, -369, -398, -23, -162, 570, 654, -327, -760, 75, 344, -457, 377, -449, -764, 176, 68, 113, -64, 442, -259, -841, 102, 7, 530, -469, -428, 458, 501, 133, -404, 162, 708, 605, -759, -191, 92, 556, -476, -676, 593, 433, 21, -85, 103, 110, 88, 43, -273, 255, 386, -13, 32, -109, 111, 179, -2, -302, -136, 130, 517, 24, -346, -236, 229, 377, -334, -473, 156, 488, -179, -724, -27, 417, 196, -584, -646, 468, 443, -660, -844, 133, 457, -121, -870, -192, 336, 280, -418, -708, 538, 413, -283, -911, 110, 330, -195, -353, 0, 99, -83, -43, -40, 4, 58, 339, 240, -77, -342, 149, 541, 257, -650, -229, 921, 567, -780, -589, 686, 928, -558, -1005, 476, 1553, -159, -1244]
5267a244J128J573q33j604L77J532J2j468q87K002L11j252k08N95P21o75o02L13
5285b09K48k90N84j0o68l1M06P00q60j062P67J686p64j976N91K047l9k294l11
5304a485K129J337k343j905K171K292j609k662J307K281l07k421m21K386P77k034
5320e07j099J928Q52j173p55O57O25o40K40j36J28n76O89P28q92j281J092J660
5338A540q09k362Q35K521j89k917n98L030J486k979j770K182K612k058k894J295
5354a075L189n00l413L6K794R10k320j438K052R86r78j213M32J113l19l62O1m45
5372d90m2O53P05j140j141J225J907j309k388J036K813k05l274q56L714J523l448
5389g17k237K945L155k473l625J778L627o80l622l11L443Q57l136j122K677J201
$$ y = [-1244, -116, 1457, 624, -980, -603, 929, 941, -527, -1414, 588, 899, -353, -561, 34, 755, 80, -522, -209, 39, -251, 333, 323, -345, -376, 30, 730, -130, -1192, -425, 1261, 497, -1479, -888, 1159, 1120, -1174, -1485, 644, 1981, -362, -2267, -96, 2196, 587, -2075, -768, 1513, 1206, -1215, -1636, 750, 1527, -507, -1606, 322, 1174, 1, -754, -97, 528, -112, 128, -8, 120, -456, 233, 961, 69, -1212, -120, 1540, 731, -1631, -796, 1725, 1536, -1381, -1979, 1051, 2537, -442, -2212, -30, 2582, 524, -2370, -1075, 2114, 1614, -1799, -1763, 1031, 1941, -379, -1817, 235, 1221, 243, -970, -538, 575, 256, -106, -45, -490, -532, 121, 826, -314, -1455, -230, 1677, 368, -2020, -984, 1829, 1624, -1650, -2506, 1208, 2731, -717, -2954, -9, 3146, 673, -2952, -1174, 2453, 1773, -1849, -2160, 1283, 2140, -996, -2118, 559, 1760]
5405A760j621j368Q32J275o47q66P15k12k21O42P06j098j187J232J764j224k541
5422b059J043L159k75l774l82L594J520l704k334L483K867k499l832K005L889
5437B701q73l978o3L483P58k882j171K242J164j358j460J094J063m82p14N12k3
5454A3r1J73O50j201r05J306J561j329k225J117K710o3l212n66L400J399l755
5471a018j766L069K909l073k690J568L337j022k975P9L079K96k672p47J934J218
5487A526j534r09P57Q78m02l96MQ9l47L49N79m60j125N99J937q29j813N26J816
5506A245k26k081o52K526J392k722j370J880K504k106l041J435K258o84k232L35
5522a539L049m16k139k97J116J486j449n42M27O93m28j27Q0m2k98N35K30l47j110
$$ y = [1760, 139, -1229, -397, 878, 231, -635, 80, -132, -353, 289, 995, -103, -1290, -58, 1706, 482, -2059, -1016, 2143, 1868, -1906, -2288, 1306, 2826, -878, -3212, 271, 3138, 639, -3193, -1188, 2701, 1828, -2150, -2213, 1270, 2028, -854, -2025, 217, 1381, 23, -1437, -343, 720, 238, -476, 36, 13, -78, 95, 745, -456, -1361, -55, 1506, 177, -2048, -931, 1779, 1716, -1496, -2062, 1338, 2737, -1018, -2784, 285, 3194, 121, -2569, -1001, 2336, 1314, -1661, -1582, 1497, 1793, -879, -1626, 308, 1526, -8, -917, -160, 718, 316, -80, -76, 13, -334, 15, 594, 134, -991, -392, 1545, 716, -1097, -571, 1245, 1019, -1062, -1714, 812, 2204, -518, -1888, -8, 2496, 390, -2651, -1216, 1042, 358, -1874, -1539, 1510, 1094, -1045, -1342, -226, 1260, -189, -731, -304, 389, -39, -166, -86, -128, -426, 109, 339, -8, -1118]
5541a118J233J015q32j430Q01J247l49j859o0K594Oj932q56J683J727j492k007
5558a629J184J881m98k189L41K331o51j046M7N70l29J37o50L01Q2P2OJ04J90l68
5578a14j16N03j281j21J267M34o21r96P03J025k7j313p7J427J76j455m33J344
5596C25O54j012q05P10J010k33k028N88J589n91o42m23P18L56j27q33J007p64
5614e01PP39n60L78M61j33j91n24n03K0J031k14q37O09J056m72k68n31L16J581
5634A464j525q08J017J92o6k08O3R93r04M2o53O22m99Q25j85j042K71M52J78J1
5654B40j32K09l47J06m12p0O57M16j582l04J503n68M69l51J68j09M04n72J48n44
5674f71O18q67J087L70k83M3J42K92q85k28N31Q34p85k32K75o12J222j211j21
$$ y = [-1118, 115, 1130, 298, -1132, -331, 916, 567, -1292, -1352, 1242, 1248, -684, -1540, 143, 1870, 378, -1629, -445, 1436, 938, -1251, -910, 1421, 770, -276, -229, 341, 12, 149, -501, -200, -118, -46, -40, 64, 254, -114, -230, 273, -1008, -1129, 138, 572, -49, -1045, -342, 683, 656, -657, -734, 693, 869, -586, -1019, 325, 979, -33, -838, -128, 882, 649, -1379, -791, 798, 207, -435, -858, -140, 216, 89, -744, 263, -501, -494, 245, -315, 63, 524, 391, 200, -324, -827, -807, 224, 10, -827, -218, 838, 366, 98, -433, -117, 1464, -61, -869, 148, 340, 274, 66, 129, 1122, 218, 260, -393, 229, -270, 555, 370, -672, -401, 51, 229, 240, 108, 317, -30, 76, -336, -406, 251, 667, -915, -1219, 284, -284, 185, -166, 2, -107, 297, -275, -127, -671, -53, -920, 167, 537, 254, 297, 439, 731, -154, -382, 149, 983, 198, -34, 241, -371, 851, -360, -481]
5693d81R64j068N33k57P59K65k24n62J60L58P74j308J35M6j565J475K2k16R83
5712G93m18j12l73P04n94q41J295m34K50r15K40R54jr82J308J83n85J04m81P38
5732H33P5r01n92Q65p70J239k50r74M74M01j238M21J46Lm89J187n61k00RL30P2
5753H0L03p53Q40L0j420M42L71J062q07r25K26Q98m43m53K58M56P65j161k64Q00
5773C05L21q69r8M37O95m13n04j09L48j8K62R9n67Q9L64J64j37l32j37R05p29
5794G6k81m52P49P20j645l30J360J063j133j473J411R44l49k227R94J322O71k164
5812g44o62J594M45j005j191J363Q37r3j165J91J147r95p68N56J054p95P53l44
5830A78P3j09K06K65p82r72M15J575K31j974n5J772J007k910k51J392K328j981
$$ y = [-481, 483, -585, -52, -309, 450, 715, 491, -71, 89, 447, 1221, -87, 48, 94, -1471, 4, 26, -190, 793, 375, 263, -110, 594, 0, -841, 454, 20, 270, -645, -405, 549, 548, -434, 874, 1057, 472, 576, 95, 833, 908, 7, -585, 280, -490, 749, 499, -475, -1, 400, -838, -417, -271, -268, -757, 430, -131, -331, -322, 8, 80, 383, -370, 470, 500, -920, -478, -107, 955, 148, -777, -551, 347, -96, -549, -291, 165, 930, -231, -495, 305, 626, -243, -341, 96, 791, 378, -126, -235, 113, 95, 357, 456, -111, -22, 342, 506, 369, 37, -100, 805, 76, -205, -657, 92, 812, -833, -1163, 197, 1260, 127, -1346, 65, 1009, 660, -1567, -573, 749, 1420, -744, -1406, 188, 633, -372, -1563, -200, 637, 544, -621, -430, 717, -278, -1046, -490, 564, -231, 522, 178, 251, 142, 348, 613, -169, -1141, -726, 849, 1080, -894, -949, 823, 1830, -1080, -1331, 61, 2389, 408]
5848D08j298l67K022K77k559NK263J651l011l51r1J530l39j242O92J230q83o78
5866g41M46J052M27j406J09M52j266J211R91o90j287M91J273n97j330j68J760
5883G27J500k685j941J547K760r96l084J058K656J54k744j326L198Q08k281q73
5899a522J718J528j050k525M63J856l39r81j81J659o41l60J006l13o22J42N43
5916C81L78j846R5K213j60j771o91K482R63k495j819J407L608j975l163R40L621
5933B168J26m747N88K987L73j904k513L003K057j930k424J604J930j53k089L20
5949f04J254L78j162mL87n14L18P43p86j015N13J279L14k596k69K359J235k531
5967g01j457K050K645k036l133J480L710j583l004n32L426J330l027j428K684
$$ y = [408, -890, -1257, 765, 1042, -1517, -1512, 751, 2402, -609, -960, -1051, 479, 140, -1102, -410, 820, -63, -741, -295, 757, 1184, -222, -113, 339, -927, 284, 1275, 585, -702, -211, 1062, 465, -865, -1033, 727, 2227, -458, -2399, -852, 1908, 912, -2172, -1114, 1542, 1696, -1048, -2374, 824, 1632, -649, -1522, 196, 1724, 674, -1851, -1388, 468, 129, -852, -1033, 626, -15, -375, 631, 318, -304, -162, 381, 759, -1087, -992, 1221, 1061, -710, -1401, 1081, 2044, -451, -2270, -863, 2745, 770, -2393, -1453, 2168, 2294, -2453, -1865, 1122, 1495, -409, -2922, 81, 2138, 208, -2216, -612, 1318, 1165, -924, -604, 650, 1028, -134, -138, 249, -265, 53, 796, 10, -1005, -492, 787, 1101, -1495, -1764, 595, 1830, -701, -2158, -108, 2537, 501, -2632, -1152, 2558, 975, -2029, -2561, 865, 2195, -832, -2260, 424]
5982D24J568k105j819R25J959n00j421L15J492L6j217K62K29j01M6K60oj071L41
6001c83J153J2j846k74K126J096k541j219K329J534j343k821J326K766m18l423
6017a926J68L012Q12k818j293K197J769j850j508R07J661k38j840L14J024K54
6033F45o61r2j49L02oM59j50o78pQ62J61j609j67J725N44j630j063J686J414j190
6053C96k195J021K192n67k253j74K886P6k242p54J908R08r90j237Q34J419r06
6070C22r61J07Q87M06m91l78m6j30J35N64p09k98M10O90J42j252l53J424P90j440
6090a81o54Q03J265j122q84K75J757q94j293n8J266N95j915J69P82J299j261n92
6108f43N02O70p93k67L85Q10q96K78M62k56q74Q63j63L0p10K05L93J47j227O5
$$ y = [424, 1992, -113, -1932, -1007, 952, 452, -969, -654, 838, 874, -343, -81, 148, 47, 93, 353, 347, -724, -383, 770, 782, -1064, -1338, 788, 1884, -657, -1876, 453, 1987, 644, -2177, -851, 1915, 1497, -1926, -1758, 1254, 2066, -752, -2045, 152, 1921, 71, -1437, -530, 1131, 893, -947, -633, 391, 645, -16, -108, -257, 45, 39, 498, 348, -330, -337, 525, 686, -923, -1090, 635, 1179, -451, -1514, 172, 1586, 396, -1799, -778, 1414, 847, -1406, -1580, 1306, 1382, -860, -1614, 294, 1202, 212, -1025, -191, 1228, 322, -639, -532, 355, 761, 270, -108, -154, -284, -149, 415, -294, -592, -182, 508, 650, -602, -955, 469, 1259, -181, -835, -32, 1233, 111, -773, -498, 1259, 365, -928, -986, 280, 875, -1040, -871, -89, 1210, -51, -643, -141, 529, -264, -531, -146, 664, -232, 46, 508, 252, -622, 241, 78, 108, -602, -397, -4, 143, -1084, -1019]
6128a019J281K43K52j586N53O20k21r33Q39K57k70j096O73R43mo61o94Q35K93
6147C05j91n00M3M04K35l82L44J2l89N77p23q6N12n74J344k41p57j80R17m77o32
6168d39N4R7P55j6j92l9Pm5r63J043O3j66m01l40R14m48K0N50J1j2m57J11o38
6191e31M61q89Q71L03l09k17Q27j076n7m47R71k34J045o63p27R84m1l13O39r23
6211c26K86J008l89p70O32p21K85o79O9N70J07K05j39j52P5M14m44J09M25k0j85
6232C60n27j92P54o65L9K97N30r26o8L08J16O10o29m36J38K93M2j62j93K99j0
6253b2l7j37M00l26N03j423k5R83M4m53K71K29J37l94L19q3L75K60j589J690P
6274G29p94J34n94o3L43K11K30n5k13oL69l18l3M25l93J53m91M04O74p74n0J41
$$ y = [-1019, 262, 505, 757, -829, -276, 344, 123, -810, 29, 286, 16, -1080, -407, 536, 532, -129, -823, 12, 305, 114, -386, -343, 61, 296, -86, 258, 270, -119, 458, -265, -351, 161, -413, 931, 690, -67, -247, 670, 193, -439, -385, -288, 467, 451, 259, 220, 227, 182, -781, 262, 325, 159, -242, -582, 332, -116, -96, 454, 465, 453, -4, 107, -531, -70, -959, -88, 215, -94, -311, 516, -560, -617, -1064, -93, -327, 718, 55, -672, 312, 271, -42, 597, -326, -40, 968, 579, -191, 441, -280, 5, -674, -605, -35, 72, 277, 138, -14, 61, 475, 31, 140, 565, 545, 360, -167, -359, 395, -270, -231, 66, 596, -330, -398, -90, 26, 636, 7, -429, -291, 2, 44, -118, -311, -12, -22, -59, -196, 204, -122, 381, -1042, -1067, -84, -40, -493, -222, 7, 144, -250, 69, -14, 361, 621, -968, 722, 729, -65, 69, -525, -588, -245, -34, 196, 141, -72, -78, 291, -27, -60, 365, -28, 125, -366, 38, 712, -62, -112, 29]
6296B9K16K9J35r50J046J54m84r01P95O1O74j012q19J505l66m00N88o25M81o13
6316d57N12j39L24l33o15R41n76O1R4k99K81N41l57k32K2j42n49J742p20p95p3
6337g69R00N44l88j236Q67J034l48j522o79K469J95j367n76J217O52j025j001
6354a033Q62R59q39p18L12N95K53r40J68O44L08o35l11k25O07J59J96l69q22K90
6374e39P39J57j199O03J369k19o82j498R68J572q76j633L14K095K19j944o95J727
6392D78Q95j420j017Q27J490p83j351J34J662k57j539J32J365k84m05o6j61P46
6410D46l29N8N9n07j89P68L22j152n69J693P54j442j657J297K357j604j648M32
6428i11K257q3k112r56K523J383k348j642J665K170j609k351J222K025o7k350
$$ y = [29, 245, 274, 409, -541, 505, 659, 175, -726, 69, 130, 804, -208, -1027, 478, 112, -288, 300, -325, 156, -457, 55, -84, 240, -93, -708, 233, -343, -282, -188, -487, -206, 335, -22, -254, -232, -374, -923, 819, 99, -696, -769, 131, 675, 287, -949, -82, 952, 604, -918, -1597, 872, 1067, -300, -876, 341, 993, -32, -1033, -171, 788, -51, -769, -457, 138, 391, -549, -381, 263, 571, -64, -375, -600, 7, 166, 362, -7, -829, -539, 200, 357, -842, -239, 1130, 911, 229, -1269, -301, 1271, 395, -1238, -924, 1171, 1390, -554, -1249, 478, 1373, -47, -1064, -237, 1253, 470, -881, -747, 915, 658, -881, -749, 616, 332, -73, -139, -300, 446, 117, 175, 234, -273, -462, 306, 628, -524, -1093, 600, 1354, -88, -1745, -448, 1909, 305, -1343, -911, 1346, 1263, -849, -1805, 718, 2101, -247, -1889, -224, 1946, 337, -2014, -792, 1233, 1166, -1184]
6444a184m3J800P99j392q37P96Q42p54J44j03m04K52L08O21j246m54J576P98j708
6463a89j246J404J764j062j681K79K487O8l414o83L427J108k491j653K176J794
6479B088j761k284Q47L478j464j943J9J546L92q90j222J265Q8M8q02M11ol87P06
6498A29P23j415o36J390J633k219r07Q95K098r03k958J152K545J13l426N28J934
6515F76J046k267j830J987K520j723k036P38K489l46k306l03J975N22j622k64
6531g44Q41N02o05l11L21O5m27P00P8q68k47Q87P89p88j233Q95J666p25k050J15
6551a139K856m87k745j19K540O09j729j709J993J521j302j936Q23K198n71j989
6567a186M27J319K67r59q39J114L23n54n04N50K27k22K23M6m93k42Q59J72p48
$$ y = [-1184, -1227, 573, 1372, -20, -857, -61, 781, 27, 171, 68, -336, -84, 224, 845, -401, -855, 721, 1519, -189, -1435, -31, 1733, 671, -1010, -731, 1756, 1824, -1590, -2273, 1154, 2262, -229, -1882, 294, 2088, 327, -1957, -1110, 2368, 904, -1039, -1020, 526, 918, 28, -1194, 71, 159, 207, -595, -184, -190, -577, 129, 852, -563, -1199, 191, 1824, -395, -1302, -407, 1691, 788, -2170, -1018, 1527, 1640, -1786, -1258, 676, 1722, -545, -2375, -388, 2132, 409, -1627, -889, 1600, 1254, -1052, -1355, 620, 1142, -480, -744, 97, 599, -6, -317, 4, 69, -358, 342, 420, -448, -695, 192, 981, 193, -1040, -145, 1521, 796, -1254, -1139, 1717, 1230, -1515, -1634, 906, 1515, -214, -1923, 70, 1591, 289, -1647, -824, 1374, 803, -1186, -759, 560, 827, -132, -971, 143, 466, -88, -592, -42, 185, -37, 186, 232, -261, -503, 356, 528, -220]
6586b20q18Q55J260q70j280M26J863l79j767p3J570Q44j805j032J623R99j269
6603g3j092Q14J409l91j444k93J714L32j082l69N95J83j35j32J78k76P8K25P9
6622C20m59k44O91P9l62o58M40Q38n75q90O00J041k59j124j03R46N67j167m08
6641g27P77N64p64m49K55R92m48q82K33M80J95m75l90Q32M8m24J46k36M83m72
6661b62K3Q4J46k45L17K24l20l24M22J18k59l3J72K60k7m48j4N19k7o53k3L24
6683b6L54j68l88pP59m51l08K2L00j6j87j08J76J03j35J08o6N2N0j89o8L52l31
6706a72L14j96J19j10j39L92j63j23K47j16k49M09k01j1j89MK0l74L96L99K60
6727E17m09L14q1L37o18j5J41k86K12k82j07M62j39J0j76J39l39J29N09m91L56
$$ y = [-220, -1038, -183, 1077, 207, -1073, -647, 1216, 837, -930, -1003, 567, 1411, -394, -1426, 197, 1196, -73, -1165, -351, 1058, 667, -777, -1070, 644, 976, -106, -475, 120, 303, 168, 36, 214, -62, 16, 241, 320, -139, -383, 308, 387, 25, -633, -193, 645, 70, -820, -220, 821, 562, -562, -665, 281, 848, -319, -727, 50, 614, -150, -599, -344, 648, 200, -682, -449, 31, 226, -249, -639, 193, 241, -183, -37, -273, 210, -262, -239, -155, -9, -254, 63, 287, -33, -357, 65, 183, -76, -109, 63, 323, 296, -152, -166, 353, 326, -327, -350, -26, 328, 160, -228, -235, 524, 73, -235, -213, 87, 71, -116, -224, -48, 55, -80, 28, -38, 14, 64, -125, -193, 159, -172, 142, -54, 65, -45, -184, 208, 45, -78, 169, 53, -196, 213, 12, 1, -188, -184, -164, -538, -142, 257, 517, 108, 422, 341, 678, 60, 45, 186, -100, 112, -170, -277, 185, 46, 56, -120, 19, -320, -191, 318, -173, 183]
6748A83o3j60lM1m9n7M0J30j00J50o8L3O4q7P4o8J8k6L8r9R3m2k7P9J30k45J24
6775A03k35K72j86r9L3L4R5q2K38Pp3j1l76K61J9J14j33Q8J06m91L46n9m8N2N1
6800B6j59J03K5ok61K64J07p9J78j82J53k20P5J62p5r9M6j12k0K48j48j28j1J13
6824@P5j92J53m67K70L21l5j99l14N66J8k0n54J87N96n9n65L2M71K36o68j94L94
6847E2M32k98n24N8Q18l18o37K71L77R6l99k91M35L53l32l18J79L14k04K1j22
6868c7J15k62L78j00k59l8j14Q17n15n27J81Q00k04r51K5J292k5r09n56R49Q58
6889I18r79q85P89Q47j91j291K62J192j35r21j02N45M73o78o24P36M91l28l98
6908b79K25p1M14j18J31k18k58L28N51n66r49O16Q06L2j384J05J498K89j682p39
$$ y = [183, 120, -40, -43, -2, -51, -108, -68, 62, -38, 112, 44, 77, 141, 54, 128, 60, 78, 52, 90, -9, 84, 42, 15, 94, 224, -21, 103, -132, 140, -46, -145, -112, -78, 17, -65, 173, 180, 107, 96, -280, -19, 0, 114, -19, 69, 175, -316, 30, -29, -77, -25, 26, -133, -30, -5, -11, -272, -8, 99, 20, 198, 16, 169, -51, 24, 186, 111, 12, 58, -54, -74, 174, 26, -102, -113, 0, 75, -117, 36, -431, -161, 160, 125, -74, -388, 178, 196, 176, -378, -191, 405, 346, -219, -187, 284, 520, -148, -342, 52, 484, 186, -338, -280, 538, 220, -417, -146, 231, 327, -72, -363, 72, 425, 93, -225, -46, 268, 64, 85, -37, 78, -184, 194, 94, -165, -203, -317, 500, -15, -542, -361, 439, 235, -716, -691, 601, 576, -333, -889, 60, 918, -61, -946, -157, 690, 499, -792, -530, 662, 527, -394, -496, 49, 522, -156, -780, -44, 447, 119, -279, -54, -125, 289, 171, 302, 84, -174, 154, 705, 139, -810, -194, 612, 644, -740, -635, 863, 1152, -530, -1269]
6928a269J799P89j712j185J575J354q46j980P98J618J44k501O82J134P92j526
6944c34P5Q40j70m49n54N03l68O13j88J51j57p29J69J866j760n34J051P95k0k066
6964a266N94K063O91l424o53J784J626j881j813K014R45k91j346J84K107l73j686
6981g25N4J100Q17j450r77J009R86p99m79J25N80o5l08L98j85n21L92Q18r00o96
7001h26N28J293l05j707L34J621L56k351n61K007J342j929j706J667K167j185
7017G45k185O10J942M14k453j112K239Q73o10j534J082Q74q60n58M82N30j7l72
7035I0q42M40l76Q96M15r91k05L1J886j199j444P28J368R79k449r05J963J795
7053B180k996o08P34J976p03k419J923R27K85j938q10K756k64j901n60J826N62
$$ y = [-1269, 530, 1319, -393, -1578, -3, 1351, 505, -1475, -677, 941, 1085, -1416, -734, 400, 1192, -334, -259, 581, 411, -38, -592, -89, -457, 156, -32, 119, -38, -767, -598, 1268, -492, -1026, 25, 820, 800, -1266, -672, 1391, 2082, -1342, -1995, -211, 1415, -466, -2279, -265, 680, 389, -957, -773, 1334, 961, -725, -671, 429, 1246, -204, -1181, -172, 814, 15, -464, -339, 241, 176, -132, 266, 81, -440, -48, 770, -130, -826, -298, 995, 690, -1017, -683, 938, 1294, -1057, -1618, 389, 1731, -198, -1904, -237, 1930, 745, -1440, -830, 1112, 1526, -927, -2039, 200, 1073, 463, -1071, 11, 885, 25, -533, -51, 479, 462, 90, -752, -312, -688, 208, 623, -368, -573, -542, 1344, 145, -1299, -571, 797, 1776, -673, -1578, 385, 2180, -816, -1424, -690, 1286, 583, -1836, 87, 1014, 1299, -639, -1449, 1307, 1043, -858, -1418, 408, 970]
7070I70o41r12M51M76J40q23P2L01k13K55L16j65o96M08Q94m70j229O7J482L14
7090I97j867l14J471R30j272j687J462J773q71j889M30K063k83j941k81J827N26
7107A074j469j006J201J250p25j170M04Q36l21r4k20J40J53l35J18K23m79R1Q35
7126E06l43m74k31J165J03j225m52J245N29j064o94Q06J320p53j348K98J309J3
7144G10j236J8P35O53r29p77Q00P35m60o84M27N23k09l25j01J97Q6m9j99R0l6
7165c1k15M04j69k99j01Q24j54p62j45Q72O68q72m84M42N00l62p95L17O54r7l77
7186a82q2J41M65o88k8M75L54k89p22K91K19L25n90J73K03j0m3j31N1Q3L0n0j50
7209a55L64k77M1r5j0j65J07L08j31k68M96J4j26k70J01L51k36Ql32L95J51k61
$$ y = [970, 329, -583, -132, 344, 484, -339, -267, 34, -179, 76, 392, 227, -469, -61, 833, 363, -866, -799, 683, 997, -870, -1184, 287, 1217, -55, -1742, -280, 1493, 622, -1267, -837, 1226, 943, -998, -1279, 548, 1074, -395, -1401, -200, 1050, 325, -845, -441, 395, 74, -20, -240, -100, 53, -282, -164, 59, -420, -329, 506, 163, -311, -542, 623, 726, -499, -951, 294, 823, -241, -935, -129, 1191, 438, -910, -612, 697, 710, -526, -508, 227, 880, -49, -826, -26, 709, 249, -435, -8, 515, 306, -19, -120, 77, 163, 114, -85, 5, -31, -246, 158, -11, -310, -411, 413, 259, -503, -648, 224, 892, 20, -464, -22, 478, 116, -679, -362, 292, 195, -182, -264, -123, 342, -346, -374, 101, 455, 166, -556, -265, -46, 279, -311, -138, 65, 55, 12, -119, -68, 15, 45, -5, -155, 209, -68, -27, -122, -132, -297, -190, 118, -13, -281, 215, 229, 103, -167, -66, 285, 49, 57, -275, 120, 271, 10]
7231A0j86K45r3J58l47L83Q4q8m00M4L94j5m20k29N64J18k48m36M07J80L2m70
7253c13N40k61L9k86K35J05M4j11r1K04q6l2O3o7j70K35k65K47Rl0n4J24M8J22
7277B49j61K3j04P1j28N6K53k74j65M51k70J85m62L43J84k96j0j56K22j38Q3j7
7299f1j73N95r59K47M05j12J2n12j31N02N41q41L41M15m17j13L05O3K7l24K97
7320A07k08q0J0J40K77l02RJ18j8M7j30j80L81l08LQ0O4r4J04l07N02j37k91L23
7344A10j77K77k16J80K09k21k41J19l6J16j24jK85j82k52Q2R5q3N6j86K58J49
7366B17k98k58L66J0k5J11k03q3J49J75O7m70K11K30J8l17r0J54J91j64m31L17
7388a23N61l98j94m4J82K2j96l31O73K67n64m30K68P53j94l86k59L63J68j02j18
$$ y = [10, -176, 69, -24, 134, -213, 170, 254, 166, -234, -190, 204, 189, -231, -460, 104, 222, -26, -462, -55, 125, 157, -313, 227, -34, 5, -281, -46, 59, 103, -8, -99, 105, 19, -13, 50, -17, -187, 48, -217, 30, 39, 9, -45, 79, 127, 249, 88, 111, 7, 78, -50, 6, 259, -15, -180, 271, 1, 186, -276, 67, 251, -45, -55, -211, 11, -127, -44, -61, -234, 361, -598, -351, 54, -58, -46, -558, -689, -187, 354, -487, -146, 269, -148, -261, 44, 107, 134, -190, 107, -101, -181, -171, -31, 246, -56, -47, 71, 53, 100, -30, -210, 171, -137, -134, -54, 10, -84, 20, -287, 215, 78, -213, 110, -67, 210, -6, 174, 383, 162, -79, 40, 4, 120, -4, -5, 280, 98, -154, -72, 23, -60, -4, -190, 68, 217, -81, -339, 27, 37, 12, 123, -80, -163, -14, 161, 228, -242, -31, 199, 217, -100, -190, -36, 155, -9, -440, -123, 438, 40, -154, -198, -16, 6, -190, -521, 152, 419, -145, -575, -307, 446, 252, -134, -393, -30, 138, 36, -82]
7409h2J32M1J60n9k51k47J12M19K31o78k05P43J48o96n59R31N18m62o63M34P95
7430G62l30r39L8Q70M20j128m10J307K9n86n47J88P66p7q51N14J74j30j09j7J96
7451A40k64J1L43p3k68j72N53j74m90m7J227l20j009o96J013J629j691j110O15
7470g83J665l03j196l95J120J034j631k79J461R85j249j077J44Q94M60j953J001
7487a02M0N30j99q59R24k75j12L07Qo19L9Q67m00m29k17R61K52j022n36Q25J167
7508A150j072j346R84J593n45j863J64J869L53j756p55J377J047j025j090O53
7524b62J188l58j322L57Q48l3o89k75Q19j95j19J42J13n09j89N57J49o87j87J279
7544F27J29j019p68J326J058j277j265R54J566o98j729l2K214J16j601j082J697
$$ y = [-82, 50, 91, 251, 192, -59, -306, -194, 225, 456, -222, -427, 316, 464, -232, -791, 140, 658, 196, -467, -33, 762, 432, -507, -469, 401, 821, -307, -717, 590, 619, 33, -514, -326, 440, 363, -488, 26, 200, 70, -39, -56, 140, -124, -113, 230, 157, -111, -283, 270, 96, -394, -441, 786, 466, -543, -1239, -226, 1403, -288, -1398, -783, 882, 579, -617, -1012, 108, 1142, -489, -768, 693, 1678, 429, -648, -504, 390, 850, -1103, -102, -62, 468, 269, -590, 334, 59, -53, 254, 262, -357, -318, 549, 149, -280, -497, 464, 716, -306, -842, -17, 1150, 78, -1268, -284, 1309, 764, -1099, -935, 934, 1287, -469, -1224, 153, 1200, 175, -915, -262, 926, 568, -754, -397, 451, 418, -271, -546, 273, 78, -41, 101, 214, -295, -484, 73, 222, -465, -652, 627, 756, -263, -1031, 295, 1353, 76, -1189, -235, 1331, 633, -1096, -1128, 1086, 1202, -399, -1481, 216]
7561B16J001j286j045J083J178o73j473P99O93J18r56p1M87p6j13J00K47n90n8
7580d19P45L18j018r9R61K28j020l39J107P58j020j575J159J513o11j945K82J802
7598H27M04j892o47J595J274j778r55Q62J373p27p17m19Q64N02r49j84J125o39
7616h1l06j67O81N90o73j32J99j036O48N70k42J13n72M71L84n57j210R25J788
7635A393p60j430Q99N32N31j886n31J881P27j912n31N07J593k73j398k06J541
7652F77j08r27l60J091P7l20l02j9j98K05K27K22j24k87J86L14l40l66M11M46
7672E05l97o73M39Q18m88m74j64R98L36j181l06P14O68r60p24O86Q72m12r10M71
7692a82N97j45p22J63N67K42q31J96P1K53j90l2k52L25k40J07K38p4n39M56J72
$$ y = [216, 1217, -69, -1114, -31, 1147, 474, -999, -200, 493, 611, -345, -416, 71, -5, -118, -18, 229, -361, -419, 326, 644, -374, -473, 488, 716, -304, -643, 464, 1222, 202, -1373, -214, 1299, 688, -1257, -975, 827, 1231, -661, -1308, 287, 1561, -217, -1172, -310, 1063, 336, -381, -800, 64, 566, -383, -567, 558, -81, -387, -554, 127, 717, 44, -88, 111, -925, -277, 293, 51, 164, -408, 63, 447, -110, -1320, -395, 1393, 633, -797, 102, 634, 1165, -721, -1252, 629, 1356, -556, -1087, -580, 1013, 740, -658, -864, 677, 569, -358, -718, 373, 450, 130, -172, -191, -389, -184, 43, 265, 141, -146, 40, 354, 14, -352, 59, 505, 108, -565, -126, 692, 204, -270, -434, 564, 900, -281, -587, 127, 795, -165, -889, -203, 669, 257, -653, -182, 415, 270, -452, -289, 278, 520, -311, -115, -44, 209, 19, -13, -265, 60, -180, -73, 165, 91, -448, 8, 180]
7713A80k75j87K45J47l8k88J32M61J95j245M48L73R5j62j55k1M56m92l65J80O28
7734C12q2m51nL35J47m41l3M53L0l39m9J74K0j03M9p0L01k50J62l30M04m50J5
7757b01J99K5J46k8k96N0j73K84j1K64j08l50K26J60j33k78j27N83p7k20P6j82
7779a71L92l17p2K36P6j49j59L46O2j50m64K7P80p1m07l12L31K28k62q9OJ65J50
7802A76k17L5L74p7m13k68K49j30k2R5k8J79K31q4M02p64k62N07l55L58k06L47
7824A27k13o4M85n15M43M6m20K22J94o4l66M7J0Q8o2o9J02O0N3j90j44L73k65
7847a22On7J63K61j2k21j82R8J08j00j58k3K19j98m9M31m01M09j86n2J18j74N1
7870g1K51J33l01J72m22K29M5J52j11p3j05J25j06rR9l77K66J78r1K53l67O1P2
$$ y = [180, -95, -282, -37, 110, 72, -216, -84, 377, 572, -673, -225, 148, 243, 81, -74, -95, 361, -131, -496, -316, 312, 230, -221, -226, 109, 256, -185, -218, 235, 265, -74, -123, 51, 71, -32, 17, -53, 248, -2, 160, -170, 234, -216, -201, -2, 23, 169, 141, -155, -105, -278, 6, -5, 259, 151, -199, 27, 187, 54, -224, -351, 232, 155, -65, 11, -171, 221, -96, -168, 68, 144, -5, -164, 182, 244, 94, -370, -343, 437, 366, -41, -353, -22, 206, -56, -145, -139, 26, 176, -41, -6, 368, 291, -122, -390, -141, -271, -293, -198, -226, -47, 184, 100, 502, -262, -524, -17, -372, -14, -220, 127, -86, -150, 335, -180, 263, 309, -111, 111, 305, 241, -125, -78, -68, 20, -42, -111, -9, 51, 104, -86, -230, 143, -122, -116, -173, -10, 251, 239, 18, -164, -66, 42, -58, -216, -239, -20, -218, -267, 164, -237, 172, -14, -66, 52, -122, -71, 180, 313, 12, 184, -238, -9, 36, 188, 77, 4, -101, 24, -82, -91, 8, -369, -103, 75, -16, 237, -130, -69, 3]
7893Cq8K24l17K67J54j51j11j39J04J28ll52K10J20j0k2j43oQ3J6kJ07Jq7N5j52
7919a11j99K45K47%k90n5L19K53o66K8J26M18j57k41j41O05o52M3J5M00o0k86
7941a59J82j48K25j51k36L51m12L05J60r4k1j45K21j31j6j77N16O6n12k8L67M22
7963E85n23m88J99O49j17p14n5P57K82m91p89P61M82m29m98N00J09K66r39J63
7983b90J043m23q16K69L61k20N96q88N85p38P25l75L85p0o20O61p66J00l3J081
8003E67k08j019m92J255P28l88r44k98R60N22q38o78P97Q76o43j103P05Q69l84
8022B84r88K09P12L11p37m23J99J106q07KK94k30K42m53L96m02k59P96J10n56
8042a94m09O97O56p90j045Q11Q20P1j164k56J650p8j122r16J137J162j132j047
$$ y = [3, -85, 139, -178, 89, 243, 92, -19, -158, -54, 74, 71, -281, -71, 49, 39, 17, -126, -132, -49, -33, -35, 72, 73, -14, 41, -111, -310, -65, 182, 182, -108, -163, 156, 409, -257, -229, -103, 315, 158, -83, -224, 381, -271, -228, -213, 187, 127, -159, 23, -125, 100, -51, -287, 64, -348, -43, 117, 23, 2, -143, 78, -53, -69, -246, 270, 336, -176, -204, 163, 585, 62, -426, -227, 422, 305, -409, -464, 293, 575, 84, -705, 56, 538, 109, -389, 111, 220, 486, -453, -290, 753, 330, -486, -217, 144, -76, 520, -368, 217, -521, 204, -171, 214, 144, -476, 185, -581, -481, -514, 567, 359, -660, -1152, 103, 831, 443, -501, -799, 161, 683, -155, -833, -36, 840, 197, -906, -201, 668, 284, -704, -495, 217, 528, -209, -632, -433, 673, -134, -132, 162, -68, 174, -279, 117, -285, -544, 252, 362, -194, -603, 94, 750, -40, -1085, -274, 546, 617, -547, -803, 847, 769, -353, -1269, -132, 1030, -102, -1149]
8060a149O56R24Lj370L22J046M1q21m30Q88L89J04o64j51K65K59l19J42n74J29
8080c10M37N49p92m08O10L66m91j153R90P55R7j216j98J211M50j406j68J273N33
8099A129j076r35P75P08l57j374q7J666J25r08l22Q75P12j727N48L06K77k86j85
8118a36J44o60J811j634J145n63J75l85J037j424N0O46J97K06j115N23Q00M79
8136A296j477o81R67O70n54r58R73Q66p04j073P78O46o0j126j35O18O02p07m24
8155d83L57M42r7m25o0L07Q0k02Q0j4j70J85J67J2n02K42O27m91k92J4P18j71
8177C24p72k29N70J041r49p28M10J103m24r99M3J244j17p78
$$ y = [-1149, -493, 431, 434, -936, -614, 432, 473, -348, -778, 110, 499, 603, -61, -212, 53, 312, -7, 135, -439, -310, 127, 676, -116, -524, 86, 452, -39, -1192, -202, 553, 650, -566, -764, 447, 897, -509, -677, 596, 1129, 53, -882, -107, 601, 244, -1130, -1217, 449, 574, -334, -656, 219, 931, -796, -248, 58, 335, 49, -136, 8, -652, 1159, -475, 670, 107, 282, -103, 934, -490, -440, 206, 403, 609, -506, 17, 817, 1296, -181, -862, 105, 775, 221, -737, 236, 1102, 398, -675, 103, 749, 689, -437, -572, 46, 648, -59, -483, -126, 316, 219, -206, -266, 41, 121, -81, -1, -15, -185, 0, 167, 179, -323, -81, 546, 55, -237, -223, 495, 324, -448, -677, -107, 934, -15, -743, -333, 770, 346, -653, -610, 634, 517, -261]
8191b61
$$ Imaginary data points
##PAGE= N=2
##DATA TABLE= (X++(I..I)), XYDATA
0@%%%%%%%%%%qJ6j6J7k5L2m0N0n8P2q8J05j23J47j73K00k34K71l11L57m10M69
32B50n33O04o82P68q63R67j084J211j346J494j661J842k036K252k487K740l018
49a582L326l665M036m448M911n425O000o657P411q282R305j0531J2029j3903J6327
64H852j9607K4314l1673M4871p5687K76849J16974o81864k274N48245J96789n24609
76a18820k60548L93118L49034l11086l36905J79683L23796q7853k60370J1610
86a18341J87531K0852j07089j9114M0440l4457K7726Q7983m7052j73370N2323
97h2568K31613J004k94027q2236L40700J68213l49168k63741L22414L46117k52131
108H6190m19186J54685M78701o3681m83102m5341M61275J38180m03747k13866
$$ y = [0, 0, 0, 0, 0, 0, 0, 0, 0, 0, 0, -8, 8, -8, 9, -16, 16, -24, 26, -32, 40, -48, 57, -66, 81, -92, 108, -126, 145, -166, 191, -219, 250, -283, 321, -361, 407, -456, 511, -573, 638, -708, 786, -875, 967, -1069, 1183, -1304, 1436, -1582, 1744, -1921, 2115, -2333, 2578, -2847, 3153, -3504, 3907, -4375, 4930, -5601, 6428, -7475, 8852, -10755, 13559, -18114, 26757, -48930, 227919, 344893, -336971, -339245, 209000, 405789, -118820, -379368, 13750, 362784, 51698, -285207, -105524, 218272, 130419, -129951, -118341, 69190, 90042, -17047, -36161, 4279, -30178, -2452, 85531, 38479, -134891, -82568, 149045, 150049, -143978, -226214, 114486, 282699, -66469, -330210, -7796, 338321, 86190, -332996, -178311, 300390, 236709, -246393, -291734, 169541, 307721, -96026, -309892]
118c09892L20781K70739k38920k81239J46785K72579p5602k29203K0959J64382
128F1369K2676j09473k4295N2324M458j0174M1983j4997j01834K9871J44072j607
140I4373j88770m4699K19585J05746k27132j77175K21670K31871j76830k85986
150b27347J18060L21814m9231l30337l2743L27083R5659k91696j50619K38015
160A8658J89081j76107k04602J06322K10386o0169j82715J7676J39137J4395r9163
171b7101k1676N2526J9662k5807P790L281m3958Q657P3668L635j09411k1184J25204
184D5286N7527j32324j01855J30882J37897j06950j76594Q0569J93400l5974k00481
195a08617j6179K02641N6616j82052r5180J56522J16259j15632j27723P1119J36041
$$ y = [-309892, 10889, 281628, 42708, -238531, -91746, 180833, 105231, -123972, -103013, 61369, 84045, -25428, -49723, 2601, 7059, -3115, 38868, 23871, -77963, -48092, 95980, 94373, -94397, -139096, 80489, 186235, -40897, -218072, 3598, 235469, 58639, -227347, -109287, 212527, 163296, -167041, -199784, 127299, 222958, -68738, -219357, 18658, 207739, 31632, -172970, -66648, 143738, 83569, -99146, -81470, 57667, 72062, -27101, -48777, 3749, 23411, -2396, 5394, 8675, -35283, -26626, 47042, 50677, -58734, -79918, 45286, 102813, -29511, -131366, -484, 137413, 30463, -146131, -65562, 127838, 91864, -108617, -124796, 77845, 134461, -47591, -142771, 13751, 130010, 14378, -113345, -42226, 93815]
206I3815m0167j21107R576J02140Q883p5785j5025M3581K1446k6645p670Q461
218A503m967k954K4223P654m8707r156N7343K6784o4767m4816O1148O5825n0371
231A8742r0158M3627R5987k0739j02164l590J01592K5608r1616n0013Q3847N8092
243F9215o2375o7834M1716P0354k5244o2710J988O0323N477m6994j2222L2777
255D471J4538k2325r289O967J1126o831j948N807p751m531J1437J0711j9930j0454
269a8002J5997J9270j3425k7678J4115K8185l503l4966J032L2112P806k8326j6688
282b4071K7637J8786j8191k6346J6946K3494r553j9893l70K2577K017j6616p599
295a1182J6849O307j1760n036M038R965n643o310J396P015j023o449K693J174
$$ y = [93815, 53648, -67459, -57883, 44257, 53140, -22645, -37670, 5911, 27357, 712, -6958, 1503, -3464, -6418, 17805, 25459, -23248, -32404, 24939, 51723, -13044, -57860, 3288, 69113, 18742, -71416, -27789, 68198, 47459, -54705, -58295, 43297, 68905, -22711, -72724, 11123, 69215, 6840, -60994, -19278, 51076, 25832, -36878, -34890, 25433, 30910, -16084, -28306, 4471, 19009, -3316, -12605, -5638, 5488, -1343, -3291, 2516, -5235, -9766, 1671, 12382, -7548, -18002, -2005, 17265, 3840, -23838, -9723, 18462, 14959, -20007, -18975, 13137, 20943, -7383, -24071, 3566, 22352, 4161, -22185, -5239, 18255, 8702, -11191, -11561, 11016, 13033, -3583, -11182, 5667, 11974, 214, -4822, -784, 9181, 3538, -2772, -1376, 5639, 4616, -1833, 860, 2034]
309B034K241m623M58R32J606k259k646M927k393R1j402J528J91j53j650p02M036
326B216m267J045n80L53J3r88O37n60K295l753K858m59m40m05J65J552k417J857
344h78k437K885m17j596Q88J387Q6k577L294k208K339j695o62L126j511m99l23
361g98L548k680P18p06J138J549k674N72p37L358j901J25j102J57L607j059k374
378G41l854O726K201l405p679K310J3275m154j2942j557J7276L715j6563j0670
392a4580J6250J7383j8326j9079J1437K5229q059k6858J146K7382O704k9456r934
405b0761K3143J7381k0787j9406J4619J8944n804k0919M090J4980P28j1034o61
418e487M469k368M253K909l860j3197P412K1321m965k9262j973L9854Q501m1603
$$ y = [2034, 4275, -348, 110, 1042, 2648, 389, -2257, 2670, 277, 368, -1034, 494, 685, 532, -1118, -1820, 2216, -2051, -1006, -1586, -1233, -1220, -2208, -1571, -2131, 164, -3589, -731, -1190, -1630, -2035, -1870, -318, -2735, -878, -3315, -430, -847, -2443, -1555, -168, -82, -2659, 635, -1573, 766, -929, -1591, 1535, 24, -475, -798, 2750, 70, 788, 82, 1220, 2769, 95, 667, -70, 3288, 1387, 1512, 410, 567, 4174, 3115, 741, -3113, 3613, 5814, 2409, -5270, -2960, 10315, 6161, -6781, -8338, 8938, 12653, -3910, -14580, 1670, 19053, 727, -18352, -6915, 18314, 10255, -16603, -15457, 11925, 18629, -10827, -20761, 2382, 19763, -1024, -20430, -5811, 13133, 7329, -13590, -9500, 5480, 6208, -4826, -5487, -1018, -3386, 867, 3776, -84, -13281, -5869, 15452, 10487, -18775, -20748, 19106, 27607, -13996]
432a3996k3094M4809L6163m2170m8010L2293O3103k4068o7422P478P1977R122
444D6185p1149k3065O2561L9645n5758m5242L9662N0162k3567n1271J2202M2907
456B3272J005l6161m232K1556M495q024j492O83j2197P889K3603n768m0822j382
470b7575N6355J2916o4984l4465P2246N3069o7322p6476N5505R8507m0968j10605
482g3797J5412J19558Q324j16538l5480J07020O0152r3695p3182O8926Q5079m6790
494B4989q4599K3002P6836k563o4952p234M4043J4170k6079q724R913m752M553
507a397K0283n504m3216J419O2879J4001p8307l8588R0570O3098q5934r4974P6152
520a9518J21263n4846j41377K4861J54874N746j52585m2818J44465P0377j22825
$$ y = [-13996, -37090, 7719, 43882, 1712, -46298, -14005, 49098, 25030, -42392, -34914, 37063, 46185, -24964, -48029, 14532, 54177, -1581, -46823, -7161, 43001, 19434, -31837, -19635, 23272, 24277, -11884, -16116, 5440, 9935, 1911, 419, 1102, -11095, -3206, 20397, 14629, -26193, -27575, 28780, 41696, -23288, -57753, 14493, 67562, 240, -76236, -20731, 77776, 36808, -73797, -58385, 61173, 69497, -47041, -82521, 24499, 84651, -9044, -82226, -13300, 71779, 24989, -59610, -36608, 40228, 37665, -27287, -34521, 9522, 23692, -2387, -11111, -1198, -5950, -1397, 18886, 13382, -29834, -28415, 34464, 48465, -29842, -68430, 22140, 85238, -696, -95670, -19518, 101745, 46899, -94478, -69617, 85257, 91003, -61582, -104400, 40065, 110442, -12383]
531a2383r2782R3818J11164o8448j11984L5691J06601r579r1652q478O7196K1118
543D0282m6387j7009K1773N798l861J1809l274l7540K793N9209J2771q1430l5274
556g0340R4533O3295r4378r9257Q7171J28211o3565j54996L2867J71191L090j73154
568g5332m4168J67543P7391j45163j06894J15524J26866q2758j31955M6252J28491
579G5797j6439j10646q188Q7267K3546o2562k2892L4048J6495j4034K156J400
591E948k6015K259M8425J0032p2540k8073Q5681N7327r0265r0531Q5630J19823
603A07701o4792j47986L6798J64886r46j70934l8928J66763P2945j46680j04537
614a25710J19458J25304q6989j33673N0170J32810k0660j16887p452R6737K3185
$$ y = [-12383, -105165, -11347, 99817, 31369, -80615, -44924, 61677, 52098, -39554, -48032, 19164, 40282, -6105, -23114, -1341, 4457, 596, 12405, 9131, -28409, -25616, 33593, 46364, -35066, -70340, 24193, 87488, -6890, -106147, -18976, 109235, 45670, -109326, -76459, 94732, 97822, -75332, -119500, 48043, 125434, -19729, -126623, -11099, 115767, 33009, -98946, -52694, 75797, 59358, -51288, -59476, 27791, 51337, -11225, -34117, -69, 16426, 2392, 4548, 5948, -20067, -17808, 30617, 40649, -31891, -59964, 25717, 83044, -7221, -97752, -12122, 107701, 42909, -105077, -68279, 96607, 95661, -75273, -114201, 52562, 125507, -21173, -125710, -6252, 119052, 32063, -101610, -51440, 81370, 60710, -56177, -63629, 33108, 56293]
625E6293p1495k7476M2953K4860k3470q843O814j1032j433L2800Q253n5998k0450
638d8224O8909M5469p7278p2430P4485R8979n8904j25564L8052J40227n218j49143
650g0640k7997J46868N9355j30483q9921J10361J08244q0052j18670M8544J20297
661G5906k0832j08001n956R3361K0705o9937k8245M6263K8147k7710j6403J0710
673a992L021n008J6112N812l4296j3354M6613L1551n6253m9925N4402P1938m6349
686B2272r2467L1397J04573p151j14519j6191J12131M2350j02524o6609Q7928
697A190Q1000o4074r2739M1335R3140j7917q6756l846P6911J5657n8481k5311
709c9891M1852K6202k6594j9460J1984J1784o640K907L017j4612p235K4841J7966
$$ y = [56293, -15202, -42678, 275, 25135, 1665, -7178, -364, -11396, -12829, 19971, 28224, -27774, -48224, 20685, 66154, -11124, -83554, -9069, 89910, 31006, -94558, -56506, 83721, 78503, -70640, -98637, 48231, 107586, -22897, -112818, -2457, 105787, 25735, -92935, -44391, 75906, 55074, -52927, -58883, 34478, 55183, -14754, -42999, 3264, 31411, 3701, -12702, -1992, 1029, -3979, 12133, 17945, -16351, -29705, 16908, 48459, -7794, -57719, -3317, 68621, 22272, -70195, -38798, 65775, 58624, -55895, -72086, 40045, 82395, -20129, -86738, 1190, 82190, 18116, -74623, -33288, 59852, 41935, -44821, -48667, 28244, 43901, -14580, -39891, 1961, 28163, 1569, -17891, -5907, 5877, -763, 2144, 5161, -9451, -16686, 8155, 26121]
722B6121l3516k8316L3195M3998l0434n6301K1061O6336n993p4000p142P2110
734B7119K5982o8089m0812N8956N1647m3453o1151L0381O1675j3391n9267m80
746c0883N3059R861m1282j8637L2284J9059k0605j7453J0599J4175o179m681P37
759E4n72l096P889O510j4068j0931J4396J9420j5556k4813J0384L1520m353l6596
773a9812j539L5316J1692l5635j8354L0626K4684k3709l0601J7632L0571p647
785A3224l1784J929K8281L898k3075j0123J9770J0174j2162j1836Q212J0318m279
798B547o791K36N843j432n43J51j237j299K706M048m325m393K574Q429k790r006
814e282R98Q926L125j0941l312Q698O747p961p779O246P884k610j0132K603P893
$$ y = [26121, -7395, -35711, -2516, 41482, 11048, -45253, -24192, 42144, 36151, -37849, -44991, 27119, 53101, -14988, -55800, 3156, 54803, 11350, -49801, -19420, 42255, 28864, -30403, -30883, 22176, 32037, -9245, -27882, 4402, 23461, 2856, -14597, -3998, 10177, 3998, -683, 54, -518, -3614, 4275, 10785, -3283, -14214, 182, 19602, 4046, -20767, -10383, 21137, 16784, -19812, -21351, 13965, 25657, -9978, -28332, 2294, 26978, 3269, -27332, -9700, 20871, 13224, -18560, -16631, 11650, 15548, -7527, -17650, 2120, 12294, 132, -11704, -3492, 6826, 2547, -4244, -4008, 1835, 403, -140, 11, -1226, -2525, 181, 4229, -96, -4489, -1915, 6514, 3724, -5282, -4284, 4642, 7767, -3174, -6486, 2212, 8959, 998, -6781, -535, 7349, 4739, -5393, -2790, 5103]
829E103O54p738k625P216K548m238n027M742L113j564m733J39N526j369k227k153
845b633L387J165j869k270J201K621j662j032j371L071N31k406q19P10K482j839
861g33j354JK695n20j991K27R89K009k842l01Q01J486p58j426Q42L53J153j915
879a284Q61J5J107m15j036J266l66Q42j405J331J40j83n00p2J624j562L67n53
897A77J747m28j502M57P09N60j816Q33j39R46j109k57J311j194O45j170J934j421
915B83q24K28K029m57m089J676L043J256o412j088O750K773p297n846Q389O787
931G201o298j1031O295J2323l951j3606j82J6294J698j5065o018J4649R034j2766
945a423j0685Q958J4091p467j2369K592J2207N68j1165q48O923L152n236r07J916
$$ y = [5103, 5757, -1981, -4606, 2610, 5158, 920, -4107, 635, 3748, 2184, -2549, -2410, 3116, 1747, -480, -2633, 754, 1919, 50, -2220, -1019, 1602, -60, -1092, -2463, 608, 1139, -1267, -2086, -1376, 1106, -733, -2087, -2086, 609, 89, -1902, -1675, -686, 1323, -1519, -1820, -1019, 467, -291, -1717, -875, -522, 631, -1284, -423, -408, 699, 284, -752, 514, 148, 990, -415, 916, 1056, 873, 373, 301, 1925, 363, 730, 177, 1924, 1496, -6, 451, 1160, 1720, -96, 737, 598, 1544, 435, 178, 1489, 295, 940, -230, 1704, 283, -541, -313, 1716, 1259, -2830, -1154, 1889, 3145, -3267, -4355, 2395, 5168, -2129, -7975, 414, 7201, 903, -10128, -3833, 8490, 4539, -9067, -9249, 7045, 8743, -6322, -12340, 2309, 11343, -1423, -12108, -3150, 10941, 3474, -8895, -6303, 5904, 6472, -4693, -5541, 1382, 4534, -702, -1609, 307]
960C07r32K10L687Q23r042o02J1779M824j4852r946J7040J5162j5604k3185J4693
975e638K7770r047l2807J949L6846M516l5968j4356L5244K0974l0167k7405K3299
988d790L2088j6831l2134P243L1600p88k7922m202K0780Q744j5992o963P705N617
1002D155l726o3J226p993l82J3309O037k1353j1445K4220K1413k5011l2572K3392
1016h793M0909j4653n1329O023N6689N836n7539k0446N7069L1486m8986m3050
1028d6784L9965N0658k8617n2775J4481N3072l204m7009p012L8927J3803k9583
1040d078j4158J7585J3606j0153o203L794k892j154J1553N694k2575j1329K7573
1053G263K4016l1564l7024K9756M9620k1074o3123J0791P0142N292p4134k3060
$$ y = [307, -625, -415, 3272, 4095, -4947, -5549, 6230, 11054, -3798, -13744, 3296, 18458, 2854, -20331, -5638, 22132, 13085, -19722, -17773, 19073, 23589, -12379, -26735, 8509, 29483, -684, -28089, -4790, 27298, 10467, -21667, -14424, 17176, 16388, -11534, -15736, 5044, 13788, -2204, -9167, -1462, 4155, 429, 366, 1592, -6401, -6783, 6526, 12563, -8790, -20235, 3985, 25398, 387, -32185, -8793, 32116, 17463, -33866, -27843, 28846, 34682, -22857, -43303, 13766, 45252, -3734, -46784, -6819, 43839, 15222, -37553, -23072, 30000, 26796, -20213, -27225, 11702, 25505, -4078, -18236, -651, 12955, 2802, -3401, 393, -2499, -3653, 7900, 13594, -8981, -20310, 7263, 31279, -285, -37309, -7553, 42067, 20993, -42130, -31339, 38803, 44095, -30039, -53099]
1065e3099P3206L8046o4087n4994N4140O3845l8082o9401K0777P0755p010o2850
1077b8754r239N5223J7192m2495k1335K8374K0964j7566j2739O094N479l391N617
1090C424N865k0418q559K6574K2609l2632l6089L1441N0708k4398o4898J5100
1102c1273P3227L397q1463k0053Q0385L9282p2838n7590O1798O9378m3781p8173
1114e7704K6552P9513q655p3817q661O5847J8760n0781k6812L7211K6915k3541
1126D827k0947J0966J3270n815k40L799j1404q682K1604J9229l0002l0902K9558
1139d739M6673k5513o1188J6074P1050N43p9358j6832P8292L6362p3322n4178
1151f6136O2865O6784m6057p6752K9605P7985j0412p5359n917O7139J7839n3632
$$ y = [-53099, 20107, 58153, -5934, -60928, -6788, 57057, 18975, -50426, -29649, 41106, 34096, -28754, -37993, 17230, 34422, -8073, -29408, -1034, 19930, 2364, -10375, -4281, 1198, -2193, 3424, 9289, -11129, -19688, 6886, 29495, -3137, -39226, -7785, 42923, 18525, -46373, -31273, 41954, 45351, -36112, -56165, 24220, 63502, -9336, -66926, -5128, 64250, 20469, -57704, -31152, 48361, 39706, -34111, -42772, 23075, 41835, -8946, -35758, 1453, 28368, 4827, -16120, -5154, 8116, 2301, 2061, 5860, -5544, -14226, 7378, 26607, -3395, -34297, -4739, 41934, 16421, -44767, -28693, 42357, 42900, -36458, -53290, 25002, 61364, -11958, -66136, -3271, 63513, 17456, -59296, -29691, 48294, 37882, -37477, -43394, 23745, 41584, -12048]
1163a2048k7425M1002K8629k6276k5705J4180J9151p431p247K784k790n763J3792
1176D853J3157k1731k2711K3500L6636k2358m8471J4352N9652k247o6911j1593
1188d3872O7319K9712o5455m3430N5907N6464m2560o5833K8532O7796j0947o7837
1200c4204k700O0542J5483n0358k4363L9520K6254k5688k6412J5268K1171p427
1212G086j2628K431M403l728N254O630j2189j3833J5015K4719j6319l3085J0456
1225a5788M2614l440m8190p759N0421K0425m9588l1075M2828M1936l4071m9498
1237d1185K3654N1574r814n2588j101M7677J1228m0609j8189L2736K0785k1978
1249B190k2430J4822J8294o677j3799J947Q143r47j227J667k835o702P512J2484
$$ y = [-12048, -39473, 1529, 30158, 3882, -21823, -7643, 11508, 4077, -3170, -386, -3176, -8939, 4853, 18010, -3721, -26432, -2932, 33704, 11346, -37125, -22773, 36879, 34632, -32279, -43872, 23447, 53159, -12296, -55726, 181, 56645, 14085, -51748, -23216, 44580, 33633, -34204, -36904, 23638, 39121, -11237, -35600, 3920, 30174, 4486, -21926, -6658, 14513, 7086, -5542, -3111, 1292, -2436, 2818, 9448, -2741, -16574, -1559, 23160, 6841, -26244, -15788, 26826, 23386, -24804, -32563, 17858, 38283, -11305, -42380, 448, 42384, 8313, -41185, -17531, 34043, 24229, -28359, -29460, 18217, 29445, -11164, -29353, 3383, 24168, 2190, -20240, -5418, 12876, 6199, -7600, -5653, 2490, 1543, 316, 1983, -852, -7554, -42, 12442]
1263A2442q774j8088O249K4948k830k8156l858L0700J1308l1228j7757K6787K6353
1276B8096k3174l0087J5403L3083p373l4298N40L1340P346k8423j1602K2523J4071
1289A7445j5643j6338J1163J4143n561j2722K270R162n23m883p77K750k396J158
$$ y = [12442, 3668, -14420, -8171, 16777, 13947, -14209, -18067, 12633, 23941, -7287, -25044, 1743, 28096, 4922, -25165, -9762, 23321, 15948, -18350, -17810, 13530, 20876, -7547, -19149, 3374, 17445, 1802, -14536, -3373, 10770, 5209, -7513, -5243, 3919, 3396, -1487, -2264, 486, -1910, -752]
$$ [...]
8191e58
##END NTUPLES=NMR FID
##END=
