##TITLE=1H_Pr C2nB`
 200.13Hz, CDCl3.
 8 sc
 14.8.2026
##JCAMPDX= 6.0         $$ Bruker NMR JCAMP-DX V2.0
##DATA TYPE= NMR FID
##DATA CLASS= NTUPLES
##ORIGIN= UXNMR, Bruker Analytische Messtechnik GmbH
##OWNER= pz
$$ XWIN-NMR		Version 3.5
$$ Fri Aug 14 14:51:06 2026 Russian Standard Time (UT+4h)  she@DPX200
##.OBSERVE FREQUENCY= 200.1313
##.OBSERVE NUCLEUS= ^1H
##.DELAY= (6, 6)
##.ACQUISITION MODE= SIMULTANEOUS
##.ACQUISITION SCHEME= undefined
##.AVERAGES= 8
##.DIGITISER RES= 18
##SPECTROMETER/DATA SYSTEM= spect
##.PULSE SEQUENCE= zg30
##.SOLVENT NAME= DMSO
##.SHIFT REFERENCE= (INTERNAL, DMSO, 0, 14.3821)
##AUDIT TRAIL= $$ (NUMBER, WHEN, WHO, WHERE, WHAT)
$$ ##TITLE= Audit trail, XWIN-NMR		Version 3.5
$$ ##JCAMPDX= 5.01
$$ ##ORIGIN= Bruker BioSpin GmbH
$$ ##OWNER= she
$$ F:/spectra/data/she/nmr/H-C/1/audita.txt
$$ ##AUDIT TRAIL=  $$ (NUMBER, WHEN, WHO, WHERE, WHAT)
(   1,<2026-08-14 14:50:05.37 +0400>,<she>,<DPX200>,
      <created by zg, POWCHK disabled, PULCHK disabled
       configuration hash MD5:
       00 E9 B6 7A A2 85 ED C7 34 08 36 98 17 FE 4E 26
       data hash MD5: 16K
       B0 3E 6A F3 52 84 FD FC 44 AE 04 97 B3 28 8D 48>)
$$ ##END=
$$ 
$$ hash MD5
$$ 4F 0B 9E 85 EB 9C C0 05 7D C6 F1 43 7C C4 20 4C
##$RELAX= 
##$RELAX= 
##$RELAX= 
##$RELAX= 
##$RELAX= 
##$RELAX= 
$$ Bruker specific parameters
$$ --------------------------
##$DU= <F:/spectra>
##$EXPNO= 1
##$NAME= <H-C>
##$PROCNO= 1
##$TYPE= <nmr>
##$USER= <she>
##$AMP= (0..31)
100 100 100 100 100 100 100 100 100 100 100 100 100 100 100 100 100 100 
100 100 100 100 100 100 100 100 100 100 100 100 100 100 
##$AQSEQ= 0
##$AQ_mod= 1
##$AUNM= <au_zg>
##$AUTOPOS= <>
##$BF1= 200.13
##$BF2= 200.13
##$BF3= 200.13
##$BF4= 200.13
##$BF5= 200.13
##$BF6= 200.13
##$BF7= 200.13
##$BF8= 200.13
##$BYTORDA= 1
##$CFDGTYP= 0
##$CFRGTYP= 5
##$CHEMSTR= <none>
##$CNST= (0..31)
1 1 145 1 1 1 1 1 1 1 1 1 1 1 1 1 1 1 1 1 1 1 1 1 1 1 1 1 1 1 1 1 
##$CPDPRG= <>
##$CPDPRG1= <>
##$CPDPRG2= <>
##$CPDPRG3= <>
##$CPDPRG4= <mlev>
##$CPDPRG5= <mlev>
##$CPDPRG6= <mlev>
##$CPDPRG7= <mlev>
##$CPDPRG8= <mlev>
##$CPDPRGB= <>
##$CPDPRGT= <>
##$D= (0..31)
0 0.7 0 0 0 0 0 0 0 0 0 0.03 0 0 0 0 0 0 0 0 0 0 0 0 0 0 0 0 0 0 0 0 
##$DATE= 1786704604
##$DBL= (0..7)
120 120 120 120 120 120 120 120 
##$DBP= (0..7)
150 150 150 150 150 150 150 150 
##$DBP07= 0
##$DBPNAM0= <>
##$DBPNAM1= <>
##$DBPNAM2= <>
##$DBPNAM3= <>
##$DBPNAM4= <>
##$DBPNAM5= <>
##$DBPNAM6= <>
##$DBPNAM7= <>
##$DBPOAL= (0..7)
0.5 0.5 0.5 0.5 0.5 0.5 0.5 0.5 
##$DBPOFFS= (0..7)
0 0 0 0 0 0 0 0 
##$DE= 6
##$DECBNUC= <off>
##$DECIM= 32
##$DECNUC= <off>
##$DECSTAT= 4
##$DIGMOD= 1
##$DIGTYP= 9
##$DL= (0..7)
0 120 120 120 120 120 120 120 
##$DP= (0..7)
150 150 150 150 150 150 150 150 
##$DP07= 0
##$DPNAME0= <>
##$DPNAME1= <>
##$DPNAME2= <>
##$DPNAME3= <>
##$DPNAME4= <>
##$DPNAME5= <>
##$DPNAME6= <>
##$DPNAME7= <>
##$DPOAL= (0..7)
0.5 0.5 0.5 0.5 0.5 0.5 0.5 0.5 
##$DPOFFS= (0..7)
0 0 0 0 0 0 0 0 
##$DQDMODE= 0
##$DR= 18
##$DS= 0
##$DSLIST= <SSSSSSSSSSSSSSS>
##$DSPFIRM= 0
$$ [...]
##$SUBNAM0= <"">
##$SUBNAM1= <"">
##$SUBNAM2= <"">
##$SUBNAM3= <"">
##$SUBNAM4= <"">
##$SUBNAM5= <"">
##$SUBNAM6= <"">
##$SUBNAM7= <"">
##$SUBNAM8= <"">
##$SUBNAM9= <"">
##$SW= 18.0517328524113
##$SWIBOX= (0..15)
0 0 2 0 0 0 0 0 0 0 0 0 0 0 0 0 
##$SW_h= 3612.71676300578
##$TD= 16384
##$TD0= 1
##$TE= 0
##$TE2= 300
##$TE3= 300
##$TEG= 300
##$TL= (0..7)
0 120 120 120 120 120 120 120 
##$TP= (0..7)
150 150 150 150 150 150 150 150 
##$TP07= 0
##$TPNAME0= <>
##$TPNAME1= <>
##$TPNAME2= <>
##$TPNAME3= <>
##$TPNAME4= <>
##$TPNAME5= <>
##$TPNAME6= <>
##$TPNAME7= <>
##$TPOAL= (0..7)
0.5 0.5 0.5 0.5 0.5 0.5 0.5 0.5 
##$TPOFFS= (0..7)
0 0 0 0 0 0 0 0 
##$TUNHIN= 0
##$TUNHOUT= 0
##$TUNXOUT= 0
##$USERA1= <user>
##$USERA2= <user>
##$USERA3= <user>
##$USERA4= <user>
##$USERA5= <user>
##$V9= 5
##$VALIST= <valist>
##$VCLIST= <CCCCCCCCCCCCCCC>
##$VD= 0
##$VDLIST= <DDDDDDDDDDDDDDD>
##$VPLIST= <PPPPPPPPPPPPPPP>
##$VTLIST= <TTTTTTTTTTTTTTT>
##$WBST= 1024
##$WBSW= 4
##$XGAIN= (0..3)
0 0 0 0 
##$XL= 0
##$YL= 0
##$YMAX_a= 224188
##$YMIN_a= -207817
##$ZGOPTNS= <>
##$ZL1= 120
##$ZL2= 120
##$ZL3= 120
##$ZL4= 120
##$ABSF1= 10
##$ABSF2= 0
##$ABSG= 5
##$ABSL= 3
##$ALPHA= 0
##$AQORDER= 0
##$ASSFAC= 0
##$ASSFACI= 0
##$ASSFACX= 0
##$ASSWID= 0
##$AUNMP= <proc_1d>
##$AZFE= 0.1
##$AZFW= 0.1
##$BCFW= 1
##$BC_mod= 2
##$BYTORDP= 1
##$COROFFS= 0
##$CY= -3
##$DATMOD= 1
##$DC= 2
##$DFILT= <>
##$DTYPP= 0
##$F1P= 0
##$F2P= 0
##$FCOR= 0.5
##$FTSIZE= 0
##$FT_mod= 4
##$GAMMA= 1
##$GB= 0.15
##$INTBC= 1
##$INTSCL= 1
##$ISEN= 128
##$LB= 0.25
##$LEV0= 0
##$LPBIN= 0
##$MAXI= 10000
##$MC2= 0
##$MEAN= 0
##$ME_mod= 0
##$MI= 1.114404
##$NCOEF= 0
##$NC_proc= 0
##$NLEV= 6
##$NOISF1= 3.799351
##$NOISF2= 2.8
##$NSP= 1
##$NTH_PI= 0
##$NZP= 0
##$OFFSET= 14.38212
##$PC= 1
##$PHC0= -4221.96
##$PHC1= 16.7923
##$PH_mod= 1
##$PKNL= yes
##$PPARMOD= 0
##$PSCAL= 0
##$PSIGN= 0
##$REVERSE= no
##$SF= 200.129724274929
##$SI= 16384
##$SIGF1= 3
##$SIGF2= 2
##$SINO= 400
##$SIOLD= 16384
##$SREGLST= <1H.CDCl3>
##$SSB= 0
##$STSI= 0
##$STSR= 0
##$SW_p= 3205.1282051282
##$SYMM= 0
##$S_DEV= 0
##$TDeff= 0
##$TDoff= 0
##$TI= <>
##$TILT= no
##$TM1= 0
##$TM2= 0
##$TOPLEV= 0
##$USERP1= <user>
##$USERP2= <user>
##$USERP3= <user>
##$USERP4= <user>
##$USERP5= <user>
##$WDW= 1
##$XDIM= 8192
##$YMAX_p= 0
##$YMIN_p= 0
$$ End of Bruker specific parameters
$$ ---------------------------------
##NTUPLES= NMR FID
##VAR_NAME=  TIME,          FID/REAL,        FID/IMAG
##SYMBOL=    X,             R,               I
##VAR_TYPE=  INDEPENDENT,   DEPENDENT,       DEPENDENT
##VAR_FORM=  AFFN,          ASDF,            ASDF
##VAR_DIM=   8192,          8192,            8192
##UNITS=     SECONDS,       ARBITRARY UNITS, ARBITRARY UNITS
##FACTOR=    0.0002768,     1,               1
##FIRST=     0,             0,               0
##LAST=      2.2672688,     0,               0
##MIN=       0,             -207817,         0
##MAX=       2.2672688,     224188,          0
$$ Real data points
##PAGE= N=1
##DATA TABLE= (X++(R..R)), XYDATA
0@%%%%%%%%%%%%%%%mJ2j6J6j6J8k6L2l4M2m9N7p1Q1r0J04j20J37j56J78k01K26
37A20k56K87l20L59m00M43m92N46o06O70p39Q13q94R87j088J197j319J456j607
56h43J776j968K189k443K738l089L516m045M715n598O808q556J1143j7922K35767
71B24188p1212l22986N6708J78003j2823q3579J4075p601k44P0862L1325r0783
83a4067n8597L3412P7488N0665n8096j08373L9990J14892l0048j17070J1347R3399
95C4942J792m7780J9834p511o1159L6422R3825l2012q8392K7487P9687k2758n8823
108b4446K1913J6402l0949L7001M9251p0464p2185N9609P3677l8150o9101J5959
120c1483N8301J2099l1710l6856K243M4990J2233k3773P591P2l1014K0382M7651
$$ plain form
0 0 0 0 0 0 0 0 0 0 0 0 0 0 0 0 0 -4 8 -8 8 -8 10 -16 16 -18 24 -25 32 -39 42 -48 56 -64 73 -83 95 -106 120
37 120 -136 151 -169 190 -210 233 -259 287 -319 351 -388 425 -469 518 -570 627 -692 764 -843
56 -843 933 -1035 1154 -1289 1449 -1640 1876 -2169 2546 -3052 3756 -4800 6343 -11579 224188
71 224188 152976 -170010 -113302 64701 51878 -31701 -17626 -25227 -25471 45391 76716 -14067
83 -14067 -72664 -39252 38236 88901 30805 -77568 -37578 77314 47266 -69804 -58457 34942
95 34942 36734 -11046 8788 1277 -59882 -23460 70365 38353 -50039 -22552 57135 34377 -24446
108 -24446 -2533 13869 -17080 19921 69172 -1292 -73477 -13868 59809 21659 -47442 -31483
120 -31483 26818 38917 7207 -29649 -27406 17584 29817 6044 13635 13707 -17307 3075 50726
133E0726l9716p2647M9799R9934n0251j14911L6931R0930l2818n7867L1236L8782
145C0128k1015j7953J8384p285k4583K9065L6516k2764l0171M164J5912L169j9015
158e448j0177K4456J8173k3354l0052J1771K8049j7577j7724L8068J4985m1703
170a0533p163L2945j950k4286J4295K6658k0440k1155K4239k309l4699J8301L4311
183B8214k3693k8724J7815K0246j6531j8155J4231J7280k16m185j3196J54K3105
196A6345l006k0624J0997J1597j3543k557J0116j0334j9314J6793K5400k6890
208e020k7306L1566K1284k6683j3525J8524J3143q540o076J0685p15j1434P701
221C604O431j0500m982N084P542k571j5919j907J3287L28q013j431Q524N177j2907
$$ plain form
133 50726 11010 -61637 -11838 88096 37845 -77066 -40135 50795 17977 -39890 -8654 30128
145 30128 9113 -8840 9544 2259 -22324 6741 43257 20493 -9678 -5514 10398 13567 -5448
158 -5448 -15625 8831 27004 3650 -26402 -14631 13418 -4159 -21883 16185 31170 -10533
170 -10533 -17696 15249 13299 -10987 3308 29966 9526 -11629 12610 10301 -24398 -6097 28214
183 28214 4521 -24203 -6388 13858 -2673 -20828 -6597 10683 10467 6282 -6914 -6760 16345
196 16345 13339 -7285 3712 15309 1766 -791 9325 -1009 -20323 -3530 21870 -5020
208 -5020 -32326 -760 20524 -6159 -19684 -1160 11983 3443 -2633 8052 7337 -4097 3604
221 3604 10035 -465 -5447 -363 7179 4608 -11311 -13218 69 397 -7616 -9047 -523 4654 -8253
236h253k896J8192m38j2192P639R735o280r189J901O342p478k180J2776p915j8115
251a8351P937J3556n085j2087J164J6829L509j4617k453Q564O536K159o439k901
265a679N013k494r41K378o423k502N924J124n605q854M430J2763o661q321R273
280b575M252n658l83N520N628m426m897Q015N66p770N87J088j51m80m811M4M31
297e020m470N389N169o623k255N580O345j576q520O535J0570o963n327L972l81
312B425o43n17j495N0m562j092N618l456m450L799M153J392n116k365J0277J517
328E535o427M631K571l229q0J9L60j099l162K448n30o016J066P18o22J923l020
345d914J469N763m060j550P685J858k697j914K902M149o230l216O462k682n000
$$ plain form
236 -8253 -11149 7043 6605 -5587 2052 11787 5507 -3682 -1781 4561 -2917 -5097 7679 -236 -18351
251 -18351 -10414 3142 -1943 -14030 -12866 3963 7472 -7145 -9598 -1034 5502 7661 1222 -1679
265 -1679 3334 840 -101 2277 -4146 -6648 -724 400 -5205 -14059 -9629 3134 -3527 -11848 -2575
280 -2575 1677 -3981 -4364 1156 6784 2358 -2539 5476 6042 -1728 -1141 -53 -204 -684 -5495 -5451 -5020
297 -5020 -9490 -4101 1068 -5555 -7810 -2230 4115 2539 -5981 554 11124 4161 -1166 2806 2425
312 2425 1782 1265 -230 -180 -4742 -5834 -216 -3672 -8122 -4323 -170 1222 -3894 -6259 4018 5535
328 5535 -892 3739 6310 3081 3001 3020 3380 2281 -881 1567 1037 -4979 -3913 -3195 -3817 -1894 -4914
345 -4914 -3445 2318 -1742 -3292 4393 6251 3554 1640 4542 8691 2461 -755 5707 3025 -1975
360a975K640k085l353L06J686L081l552k493N538J163j199L285j941J815M720
375G636l586k174K548j235p44M10J160k836q199L054Q343p082m783O219o2j216
391b547L365n81l381K228R488L161j2124k070R684j319k488N60o299o78P395j463
407B931r192n013P981Q256n063l291J090k370P140P355r600m721R327O607m511
422F926p861M66L225k371M251O41j2177n92J0574j592p861j913M974O062n19l82
438A851k281n090Q471Q281q722k892P325j245m213J077j423p298r73J3972L94
453G234j8632Q75J2892n436l218P684p18k233P195L049j1011n870J3368N383j0016
468E46L780L127j4250J129J1769q528j0634J1391J2294j1416j3501Q557O803o982
$$ plain form
360 -1975 665 -1420 -4773 -4467 -2781 300 -3252 -5745 -207 956 -243 3042 1101 2916 7636
375 7636 4050 1876 4424 3189 2445 2855 4015 1179 -7020 -3966 4377 -2705 -7488 -1269 -1331 -2547
391 -2547 818 237 -3144 -916 8572 11733 -391 -2461 7223 5904 3416 3976 -2323 -3001 4394 2931
407 2931 -6261 -11274 -3293 4963 -100 -3391 -2301 -4671 2469 9824 224 -4497 4830 11437 6926
422 6926 -935 -469 2756 385 4636 5277 -6900 -7492 3082 1490 -6371 -8284 -3310 2752 2233 1851
438 1851 -430 -5520 2951 11232 2510 -382 6943 5698 1485 2562 1139 -6159 -7132 6840 7234
453 7234 -11398 -10523 2369 -3067 -6285 1399 681 -1552 5643 8692 -2319 -8189 5179 10562 546
468 546 4326 7453 -6797 -5668 6101 -2427 -13061 -1670 10624 -792 -14293 -5736 1067 -5915
482e915N981P113o986K180N896r844n629J0815O889q692l562Q718o324j5124R859
497d625Q967j3745K144J6779m838j7794J149J5131J251o997O223L380m719M986
511G292m330j5445P932J8291n825j3876L308M600j0510l033J4723l480j3062J6716
525C301J2840k1469j2314J4454J0707j951j032J113n595N27Q878j0913j4103J7005
539A448J2950j4120n517N109r342p292J6486J2807j6103r617K1121N755k1086
552g401l293J1100L828P749L246j5048j2036R953J0487j2531o759J5399N12j1290
566f084P510j207k0796O931K9174J292k3720k298J6944k745r995N971M10j923
580e36J5441n08k4306m036J4918O98o438P988K931j7589P43K1222j0746k2009
$$ plain form
482 -5915 66 7179 193 2373 8269 -1575 -7204 3611 10500 1808 -1754 6964 640 -14484 -4625
497 -4625 4342 -9403 -7259 9520 4682 -13112 -11963 3168 4419 -2578 3645 7025 2306 7292
511 7292 2962 -12483 -4551 13740 7915 -5961 -2653 1947 -8563 -11596 3127 -353 -13415 3301
525 3301 16141 -5328 -17642 -3188 7519 5568 4536 5649 54 581 9459 -1454 -15557 1448
539 1448 14398 278 -5239 -130 -9472 -16764 -278 12529 -3574 -13191 7930 13685 -7401
552 -7401 -10694 406 4234 11983 15229 181 -11855 -1902 8585 -3946 -10705 4694 5206 -6084
566 -6084 1426 219 -20577 -13646 15528 16820 -6900 -9198 7746 5001 -4994 977 1387 -536
580 -536 14905 14397 -9909 -13945 973 1671 -4767 3221 6152 -11437 -10694 10528 -218 -22227
594b2227J9613K4564j2029j5084L732J834l204O866N743j0930j607J3735p619
607C387j6897P007N827n942Q624R508j4512j4261J4954J4353j5374p087K0366
620I953M273j3920O67L94q077N130J2063m452j1027M655N869j2272n081J2847
634A022j150o644J2172K065j6107j077J5281Q48j0656P034J2200j1004r280Q503
648C207k943p103J0926L413j2129O14Q636q015j1236J1664J2227j2035l159J4876
662H943n996j3259J0942Q683q756l54R266k959j1579L080N809q688L82J1478n812
677A180q877P041N70q471M709R277l974o425Q311M968j2430j055J3314j990o918
692g70O382m36r909J145O922m357p994P570Q165j0263m435Q352j776k851Q127
$$ plain form
594 -22227 -2614 21950 9921 -5163 -1431 403 -2801 4065 9808 -1122 -2729 11006 3387
607 3387 -13510 -6503 -676 -6618 2006 11514 -2998 -17259 -2305 12048 -3326 -10413 9953
620 9953 14226 306 973 1367 -6710 -1580 10483 6031 -4996 -341 5528 -6744 -11825 1022
634 1022 -128 -6772 5400 7465 -8642 -9719 5562 6410 -4246 2788 14988 3984 -5296 3207
648 3207 264 -6839 4087 7500 -4629 -4015 4621 -3394 -14630 -2966 9261 -2774 -5933 8943
662 8943 2947 -10312 630 9313 557 203 9469 6510 -5069 -1989 3820 -4868 -4486 6992 1180
677 1180 -7697 -656 -86 -8557 -3848 5429 1455 -4970 3341 8309 -4121 -5176 8138 6148 -770
692 -770 5612 5176 -4733 -3588 3334 -1023 -9017 -1447 6718 -3545 -7980 372 -1404 -4255 3872
707C872O67o471J581O806k663p513M318O069n628p51M031p690l262Q588j169p779
723f994L021P014l276o268N328M654p159K359Q947n162m727N881M35m696P73L345
739C475k140m339K730K172o676p11M948j700n03K924j829o82L406J959k084k275
755a325M576L292o132j108M142l181j628L136j287l774j23L581n09n517K416N491
771B050l793m39M130k280n52M111k21k346L38K722j002l767K020R96m921J816
787a138K784n294n30M077j725j697J960J971r22r35L946O37l842K315L052l614
803A045M46Q56k290k99M49p74r51j541J438R15k124Q48O65r02K881N96k324J576
821E10J753K57n5j892J222Q29j965J96l96k421J414n9j888K21j20J107N22j738
$$ plain form
707 3872 4539 -1932 -351 6455 3792 -3721 597 6666 1038 287 4318 -3372 -6634 1954 785 -6994
723 -6994 -3973 3041 -235 -6503 -1175 3479 -3680 -1321 7626 2464 -2263 3618 4053 -643 130 3475
739 3475 1335 -3004 -274 1898 -4778 -5489 -541 -2241 -2744 180 -1649 -2331 1075 3034 950 -1325
755 -1325 3251 6543 411 -697 3445 264 -1364 1772 485 -3289 -3412 169 -340 -5857 -3441 2050
771 2050 -1743 -2182 1948 -332 -884 3227 3006 660 998 3720 2718 -1049 971 1967 -2954 -1138
787 -1138 1646 -3648 -4178 -101 -1826 -3523 -1563 408 -514 -1449 2497 3134 -708 1607 4659 1045
803 1045 1491 2347 57 -242 207 -567 -1518 -3059 -1621 -706 -2830 -1982 -1317 -2219 662 1258 -1066 510
821 510 2263 2520 2465 573 1795 2624 659 855 459 -1962 -548 -607 -2495 -2274 -2394 -1287 -765 -2503
839b503J833J624j637J832J158j471J328P91j594K11k83l6r52j917J106l26k388
856c224J959J52k015J846R63p89O54J80J601Q22j539J482L68j657J670j99k454
873a80O14j36p86k26j768R48O91j475Q18P21j837K192J802j020P71K80P65L92
891B566p40J10o98j401K676o39m517J042J574j905l72M82J33J72N14J859j060
908b04k032L831J473k065J450n00j878J530J105k007k394J106K819k597l703K316
924a750N15j949K955P21k345O02J815J166j486j144L111R81j325J624k488l461
940b458L117J763l477j530J747J294k348k081K630l05j088M542R74l828Q46K209
956B007q97j80J184L15j576M93K095n049l623N756J012m797J830K642l228k596
$$ plain form
839 -2503 -670 954 -683 1149 2307 836 2164 2955 1361 1572 1289 1253 301 -1616 -510 -836 -3224
856 -3224 -1265 -1113 -3128 -1282 -319 -1108 -454 -274 1327 2149 610 2092 2460 803 2473 2274 -180
873 -180 434 298 -488 -714 -2482 -1534 -843 -2318 -1500 -779 -2616 -424 1378 358 1129 1409 2174 2566
891 2566 1826 1936 1238 -163 2513 1874 -2643 -1601 -27 -1932 -2304 -1822 -1689 -1517 -1003 856 -204
908 -204 -2236 1595 3068 1003 2453 1953 75 1605 2710 703 -1691 -585 2234 -363 -4066 -1750
924 -1750 -1235 -3184 -229 492 -1853 -1251 564 1730 244 -900 2211 3192 1867 3491 1003 -2458
940 -2458 659 2422 -1055 -2585 -838 456 -1892 -3973 -1343 -1648 -2736 1806 2780 -1048 -202 2007
956 2007 1110 930 2114 2429 853 1346 3441 -1608 -5231 525 1537 -3260 -1430 1212 -2016 -4612
972d612K981L015k482m39N447j124m132K638r0k306L438K093l457j840J526r30
988b74m241J391N481l864k790O613j088p064K646N741p75j688L095J198n179m51
1004a249M438l087k083N669o89n262J135K60l562j4N572J656n148M16M572l934
1020a310k961N932J240k535K888J741m677l270K850K055l002J327L362n296k895
1035d551N115k205n559N417O702k726n143K462K213m198J370O633k492l822M814
1050D030n50o222o64L116P28j81J798k067n560K174N559n480j609Q960J138o431
1066a261O41K507l015j475O456K865p123r22N048m590m183M272J526k149K345
1081I42J324n254l371M995L399m050K309N284m246l155L834j088l601L488M805
$$ plain form
972 -4612 -1631 1384 -1098 -1537 3910 2786 -1346 1292 1202 -1104 2334 4427 970 -870 656 -274
988 -274 -4515 -3124 2357 -1507 -4297 2316 1228 -5836 -3190 2551 1776 88 3183 4381 -798 -1249
1004 -1249 3189 102 -1981 3688 2999 -2263 -1128 -868 -4430 -4444 1128 2784 -2364 -1948 2624 -1310
1020 -1310 -4271 1661 2901 366 3254 4995 318 -2952 -102 1953 -1049 278 3640 -1656 -4551
1035 -4551 564 -1641 -7200 -1783 4919 2193 -2950 -488 1725 -2473 -1103 5530 3038 -784 4030
1050 4030 3480 -2742 -3406 -290 438 257 2055 -12 -5572 -3398 2161 -3319 -4928 4032 5170 -1261
1066 -1261 -620 1887 -1128 -2603 3853 6718 -405 -1327 3721 -869 -5052 -780 746 -1403 942
1081 942 2266 -2988 -6359 -1364 2035 -2015 294 5578 1332 -1823 2011 923 -2678 810 5615
1096E615k846m606J404K72m869K632N330m288j502N907j996o687K129O010j154
1111A351j926M687P85p382N84N842m090k602N828O70m805r13O80j703q84M847
1127I69J389m719J913L215n338j105N672P7j848K630J765m610l292M159J607m901
1143b417J899M233m022l444K563n73j655K072L762q98l254K202J122l666J600
1158d76L773j602j019K333j956l021L20K740q91k160K676Q62m989J030K672k237
1174a945m92M648J118m477J178K160j382k462L791J941m066j31K574l585k104
1189c234K527J412j809l85J862r80k904K670J821k283J938K697k371r52J562q15
1205G56j219J093J979j770k604K190K89m028J107L379j915j238K074K59j882m87
$$ plain form
1096 5615 2769 -1837 -433 -161 -5030 -2398 2932 -1356 -2858 3049 1053 -5634 -3505 2505 1351
1111 1351 -575 4112 4897 -2485 -1901 3941 -149 -2751 3077 3747 -1058 -1971 -1291 -2994 -3878 969
1127 969 2358 -2361 -448 2767 -2571 -3676 1996 2073 225 2855 4620 10 -3282 877 2484 -2417
1143 -2417 -518 3715 -307 -3751 -1188 -1761 -3416 -1344 2418 1520 -1734 468 1590 -2076 -476
1158 -476 3297 1695 676 3009 1053 -1968 -1648 1092 201 -1959 717 1579 -3410 -2380 292 -1945
1174 -1945 -2437 2211 3329 -1148 30 2190 808 -1654 2137 4078 12 -119 2455 -1130 -3234
1189 -3234 -707 705 -1104 -1489 373 -607 -3511 -841 980 -1303 635 3332 961 9 1571 756
1205 756 -463 630 2609 839 -1765 425 714 -3314 -2207 1172 -743 -1981 93 352 -1530 -2017
1221b017L057P11k564K081J872l009l19J924j322j052J443J99j789r18J546o00
1237g57k097K302J089k465J230K138k076m26K461N51j432k8K109j306k406K086
1253I73N93l108P75J654j919j067J072N98n13n78J859J58j388J349P87j631R10
1270E24J062o97O6J73l12p23n03Q49o77j623J533L27k163Q19J434o49n38J280
1288A82P48p72n28K220K9k338J155J140j521l71N24o77o37m8M64n11o27J241j94
1307e21j060J832M44j586J343R55q32k95J034K64j077o64J267p60j601J463p3
1324A33j483M97O14q28j49N64M13J67m88J343j26o92J290m4p67N56j80m39j99
1343A82j37j41m63p30J052o06r83J683k08j017J199P91m71k64O97R79r61m97J433
$$ plain form
1221 -2017 1040 1751 -813 1268 3140 131 -188 1736 414 -638 805 1004 -785 -1703 -157 -757
1237 -757 -2854 -552 537 -1928 -698 1440 -636 -1062 1399 1950 518 490 2599 1293 -1113 973
1253 973 1566 -1542 -767 887 -1032 -2099 -1027 -429 -942 -1520 339 497 -891 458 1245 -386 524
1270 524 1586 889 955 1128 816 93 -410 439 -238 -1861 -328 -1 -2164 -1345 89 -560 -1098 182
1288 182 930 158 -370 1850 1879 -459 696 1836 315 -56 468 -209 -846 -894 -430 -941 -1568 -327 -521
1307 -521 -1581 251 695 -891 452 1407 575 280 1314 1578 501 -163 1104 344 -1257 206 133
1324 133 -1350 -853 -239 -1067 -1216 -652 -239 -72 -560 783 657 -35 1255 1211 444 1000 820 381 182
1343 182 45 -96 -559 -1289 -237 -843 -1826 -143 -351 -1368 -169 622 151 -113 584 1563 602 105 1538
1362A538o81j456J226j0j339L03K14o31j03R5M11l72J7J229o86n09J880k72r18
1381f4J273j23p94J36M51m19p14l25J470j366j202J375l13r22J214K50o79K20
1399e32M15Q82n87J62R04l80l45Q99j007o19P36k68o43k25J10J36q96L33R19r98
1419a004l4J933n82j307J369M49l93j12O01M23j187n8J138j689m43J468o47j067
1437a142Q65J24j293J84J187J84j042J123J522j579m36J566l38q39J150m0j030
1454A66m84L59k99j155P75J139j422L1J388j211j059J760J049j028P0J046K76
1471A401j598J19J473j233k70J540j079j284O87r0j013K73J281J90j765Q79J093
1488F04j814j12K799k30j219R91N63j373p61Q69N64j222Q00O21k506k45J700j243
$$ plain form
1362 1538 857 -599 627 617 -722 -419 -205 -836 -939 -844 -433 -805 -788 441 -245 -754 1126 854 -64
1381 -64 1209 1086 292 428 879 460 -254 -579 891 -475 -1677 -302 -615 -1537 -323 -73 -752 -532
1399 -532 -117 765 178 340 1244 864 519 1418 411 -208 528 260 -383 -608 -498 -362 -1258 -925 -6 -1004
1419 -1004 -1038 895 313 -994 375 824 431 319 920 1343 156 98 1236 -453 -896 572 -75 -1142
1437 -1142 -277 -153 -1446 -1262 -75 109 -933 190 1712 133 -303 1263 925 86 1236 1196 166
1454 166 -318 41 -258 -1413 -638 501 -921 -890 498 -713 -1772 -12 1037 9 79 1125 1401
1471 1401 -197 -78 1395 162 -108 1432 353 -931 -244 -334 -1347 -1074 207 397 -1368 -489 604
1488 604 -1210 -1322 1477 1247 28 1019 1582 209 -552 317 881 -341 459 1080 -1426 -1671 29 -1214
1506a214l51K130N03j649l4J287m53k018K449K247k581m20J624j037j523N88J004
1523E52n69l64J067p36k343J328J152j581J163J903j227j273J064N63j229L74
1539a56K288k34k295P72O29k474K4K174n74r72P39O44j871r38K128N68j168J599
1557H83J481k613l99J464j64j166J466Q06j139j294M36m75j418J780J600j986
1573g38Q7J309j351j130J568R89n38P0J875q23k992J572J715j856N3J897q34j855
1591i82J88O03j068k24K107L72j913N54O67j431L39K001k55n26Q00K7j832o50
1609a223J633K7j344J859M70k531n31J641q85r39J823J381j141j301J658m01j450
1626a254J488J625j307m94J100q32j360M44J105o22k49R42n93k130J115R57r34
$$ plain form
1506 -1214 -1565 565 1068 -581 -615 672 219 -1799 650 2897 316 -104 1520 483 -1040 -452 552
1523 552 -17 -381 686 -50 -2393 -1065 87 -1494 -331 1572 345 -928 136 699 -530 -156
1539 -156 2132 1898 -397 375 1004 -1470 -1446 728 154 -818 -79 565 -1306 -2244 -116 452 -716 883
1557 883 2364 -249 -648 816 652 -514 952 1758 619 -675 -239 -714 -2132 -352 1248 -738
1573 -738 -651 658 -693 -1823 -255 734 196 266 2141 1318 -1674 -102 1613 -243 -190 1707 873 -982
1591 -982 -794 -191 -1259 -1483 624 996 -917 -363 304 -1127 -788 1213 958 432 1232 1259 -573 -1223
1609 -1223 410 437 -907 952 1422 -1109 -1640 1 -884 -1823 0 1381 240 -1061 597 196 -1254
1626 -1254 234 1859 552 58 1158 326 -1034 -590 515 -107 -356 586 -7 -2137 -1022 -65 -999
1643i99O00J635o10q36K87O43j034J9K055l13j979Q78N46k057M8J274J31p52K27
1662b37M52j020q68J366Q78p32P14O38p86m87M29p2l81N55P46q82r35P46m80q88
1682a244J065N96j042K10O55k42j261Q03J284m26p14J264J0j381N06O96o07k20
1700d8N29J05r35p92Q43j01o75J117K91q61M68L27o41P6P09K37j91oN88r16q80
1721g56J523l93r13O08N02j125k49M10K58l26r1J024l85o90J021q0m07M10L93
1740G34l12j15M8j63k57j85L37j61l07L86l97m83M96J88l77K97N82J2k57l2M71
1761E05n1m85M49J48o79J96N4j11m71K3O15m52m75N86P1m84L51L30j65K34K74
1782D63J04j82l77M05l76j64L98l1n53L91l91k81L22R8q6j08q2M49j5k48P63K6
$$ plain form
1643 -999 -399 1236 626 -210 77 720 -314 -295 1760 1447 -532 346 892 -1165 -1117 157 288 -464 -237
1662 -237 215 -805 -1673 -307 571 -161 553 1191 405 -82 347 275 -106 449 1195 313 -622 124 -356 -1244
1682 -1244 -179 417 -625 -415 240 -2 -1263 -460 824 398 -316 948 958 -423 83 779 172 -48
1700 -48 481 586 -349 -1141 -298 -399 -1074 43 334 -527 -59 268 -373 -297 412 649 458 452 1040 124 -756
1721 -756 767 374 -539 69 571 -554 -803 -393 -135 -461 -552 472 87 -603 418 338 -69 341 734
1740 734 422 307 355 192 -65 -250 87 -74 -381 5 -392 -875 -379 -191 -568 -271 311 323 66 34 505
1761 505 454 -31 418 566 -113 83 137 26 -445 -422 193 -259 -734 -148 -77 -561 -210 120 -45 189 463
1782 463 567 385 8 413 37 -127 271 240 -313 78 -313 -594 -272 -174 -260 -368 -450 -1 -16 -264 499 525
1804E25m25J34M60m28P6j17J24k10m58L58l20n05P46J4o50M58J70k74J66k1M44
1825B67m70K44M22j95l06P56k58n96M84Np77J71kN7m38l0M38J16m63O54o5o5L03
1848B52R9k56K72M9N0l01j26K88m50j90M37l12n92M88J52j75Q2O7J69k73J31N89
1870D50k02jL40k46k54L14p8k37j27P4Q3m44j4M79n50J0M63k87j78L16J62LKJ81
1894B59J3j73K87Lm41l4M61k28m91L98j88j83j57M25j72l80M01N47n66J06N74
1915D61l28j29N98k97N7k43J75m35j5j9K13l53q8P15o71J75J00j07j94K42M83
1936C40j87j05J75J54l09q8Q11p41k91P61j84n08j73L64m48q0M43l5l73J61O87
1957C74o54Q2P59k01k95L00K42o05j75M80J7q59M62M13o83m46P82j88m0M95o1
$$ plain form
1804 525 100 234 694 266 342 225 349 139 -319 39 -281 -786 -40 -26 -676 -218 -48 -322 -156 -177 267
1825 267 -203 41 463 268 -38 718 460 -136 348 353 -424 -253 -255 -198 -636 -666 -228 -112 -575 79 14 -51 252
1848 252 351 95 367 416 466 165 39 327 -123 -313 124 -188 -780 -292 -140 -315 -233 -166 3 -270 -139 450
1870 450 248 247 587 341 87 401 323 86 -41 33 116 -328 -342 137 -413 -403 60 -227 -405 -89 73 76 78 259
1894 259 272 99 386 389 -52 -86 375 147 -344 54 -134 -317 -474 -49 -221 -601 -200 347 -219 -113 461
1915 461 133 4 602 305 362 119 294 -141 -156 -175 38 -315 -403 312 -359 -184 -84 -191 -385 -143 340
1936 340 153 48 223 377 68 -20 791 50 -241 520 336 -172 -345 19 -429 -509 -66 -101 -474 -313 374
1957 374 -280 -198 561 360 65 365 607 2 -173 307 324 -535 -73 340 -343 -789 -7 -195 -235 260 199
1978A99k97m32O48O8m97M35O09p07J5N41m86m19N74l3k68l10L73j36p71L98P36
1999B40n56J17M13Jl96J43L25l27K91N17j82p36K22J79q69K00N81j49m39L1L64
2020c0k53n76Q60L20o55Q72J58q79J27N57k18l97N13L06o92n42P65n18o64Q96
2040e0N27p39n7L58k30n19N25O29m67K82M74m34q74P01L40p88M13O79n23q58L33
2061b78J41l62p3J018p9q26P09O3r29M87M89M6j86J61Q0p61l24J131m54j97O23
2082D79o6j014j6M70j82j22N25N59q03k81O76j60o78Q76N16o27N7J76m87m77N11
2103f8K92l57j2N66n90q38O22N54n48M14O01l02m68K85J31m73J66R05m16n68R8
2124fL9n16J69N20j61m10K69Q3m44m2O34J26m43M23K66m67m89N06O6m0J57K88
$$ plain form
1978 199 -98 -530 118 186 -311 124 733 26 41 582 96 -323 251 218 -50 -360 13 -123 -894 -496 240
1999 240 -316 -199 214 215 -181 -38 287 -40 251 768 586 -150 72 251 -618 -418 163 14 -425 -394 -30
2020 -30 -283 -859 1 321 -334 538 696 -183 -56 501 283 -114 399 705 13 -529 236 -282 -946 -50
2040 -50 477 -262 -319 39 -191 -710 -185 444 -23 259 733 299 -575 126 466 -322 91 770 247 -611 -278
2061 -278 -137 -499 -572 446 367 -459 250 313 -616 -129 360 406 220 381 461 -300 -624 507 53 -144 479
2082 479 413 -601 -617 -147 -329 -451 74 633 -170 -451 225 65 -613 263 779 152 209 385 -102 -579 -68
2103 -68 224 -133 -145 421 -169 -1007 -385 169 -379 35 636 334 -134 151 282 -191 -25 880 464 -104 -6
2124 -6 33 -483 -314 206 45 -365 -96 -13 -457 -499 135 261 -182 241 507 40 -449 57 123 83 240 528
2146E28o07k02N28l69n44M05N17l55j44N43m12l72L35M57j8k80M12L5p16L57M1
2167A39l60L13J77m41j64Q5K07m71m5J074n91J5L1N21p35K90p1L78l45M40L19
2188G66r41k19K35L68j19J70k85j17o15P63J28m64L49Q72r17k56R68K14j075N66
2208C91J73o83L43o3K86r90K11k9J65l9O41J43r32m9M42J40P65j119K49K50o30
2229c35J284n17o31M53k97k3R7J00J8l11N99l99r58J245jn10J78K05l7O75r80
2250a45Q5L9J09m65J34O96m18q9q0K44l07k93m9O01k4o67J59m1R64J53o34j35
2272a63r3R4N39k70r60Q90M70n33j27j71N39n25j10J92L10K80o36K33k47j27o88
2293a103J204n72N74j45L82m29M3j19K93m75L16m6K21m02K40j59J24L96o51N12
$$ plain form
2146 528 -79 -281 247 -122 -666 -261 256 -99 -243 300 -112 -484 -149 308 290 10 422 457 -259 98 139
2167 139 -221 92 269 -172 -336 -251 -44 -515 -560 514 -77 -62 -31 490 -245 45 -26 352 7 447 766
2188 766 -175 -394 -159 209 90 260 -25 -142 -757 6 134 -330 19 891 -26 -282 686 900 -175 391
2208 391 564 -119 224 161 447 -543 -332 -361 -196 -235 406 549 -383 -432 10 150 915 -204 45 295 -335
2229 -335 949 432 -199 254 -43 -66 31 131 149 -162 437 38 -920 325 324 -186 -8 197 160 835 -145
2250 -145 -60 -21 88 -377 -243 453 35 -54 -134 110 -197 -490 -539 62 38 -629 -470 -511 453 606 -28 -163
2272 -163 -256 -162 377 107 -853 37 507 -26 -153 -324 215 -310 -420 -228 82 362 -274 -41 -288 -415 -1103
2293 -1103 101 -471 103 -42 340 -89 -46 -165 128 -347 -31 -77 144 -258 -18 -177 -53 343 -308 204
2313B04j87k57K82n4K0j87K87pM3L0m58J71m9J8KJ02K3J44k86m30L72l7K49R2
2337H7N7L8rj1K7j91K13M0j06j57k59M13m3j79rL57n89K80J8Q0k71m5J68K03P8
2362A90m5J70l15l1J55k61L8M0K0q1R4R8j13q6j3J36j41J26q9O2L1j5J9l9L4j77
2388a93N80l11k24K69k31J13M1k19j56J64k96J68K54K87j2m23M48m41m7M44L89
2409F04n04nR4k42j36K3J54m1j71O71j300O02L78p61j13M40K44J97k32l84R34
2430D52m26r1o3J13j07o5L42k28L95j19k29m69J53K50LJ59k79J62o5k52N57k38
2452d5J41J37k2k97K24p4j75JR0K03k07k7k43NJ24J14p4K6J90j26P9k41K54J16
2476A73k09J86lo1j31p9J36j50p7K81l07J49K37l48l1K64K33m78J79L64k45l2
$$ plain form
2313 204 17 -240 42 -12 8 -179 108 101 144 174 -284 -113 -162 -144 -142 -40 -17 127 -159 -589 -217 -254 -5 87
2337 87 144 182 173 162 189 -2 211 251 145 -12 -271 142 99 -80 -89 268 -321 -41 -23 57 -214 -259 -91 112 190
2362 190 145 315 0 -31 124 -137 -99 -59 -39 -120 -26 72 -41 -127 -140 -4 -145 -19 -108 -46 -15 -30 -11 -50 -16 -193
2388 -193 387 76 -148 121 -110 3 44 -175 -331 -167 -463 -295 -41 246 234 -189 259 -182 -229 215 604
2409 604 100 95 189 -53 -189 -166 -12 -53 -224 447 -853 -251 127 -634 -747 -307 -63 134 -98 -482 452
2430 452 26 -65 -128 -15 -122 -187 155 -73 322 203 -26 -495 -342 -92 -89 70 -209 -47 -112 -364 193 -45
2452 -45 96 233 211 -86 138 64 -111 -110 -20 183 -24 -51 -294 -289 -165 -51 -125 -99 91 -35 44 -197 57 173
2476 173 -36 150 147 86 -45 -124 12 -138 -215 66 -241 -92 145 -203 -234 30 263 -215 -36 328 83 51
2498E1J89p7j37m8K06n2k51M0j38r0K79J44j82m9M2R7k14J45Q4J34l3O4k80N3
2522b3J90r8k54L0J52O9k82J10j1J47j3K60l29l55N31n29P97k68L68l84J31j31
2544A08n94N77j32k6J89k78K21Rl54K71l6j33j0J43L48m99J38K5K61k45O5J29
2566A77k44O8K14j54k05L77J4l55j1K73m77J07J37J11j69Q8J08j00j21K41K4O1
2588A64j77K35l16%K16n2l07L06j5p6R4k01K89l35k24O17p3j0L8r0l15J13L81
2611B62o6l14J3K40j75j32K76k52KL66k79R3k02J2J08j76L54P1k24o7K41k77O
2634a20L75J2k17O8j33j46m2J48P0p0J19k21L30k79K36j40j5P4K07j60o5K2Nj75
2658a17MK77%k13L6K27k20p7OqL3J35j16n5M4K09j09M9q1m9K65j77l8j28q4J25
$$ plain form
2498 51 240 163 26 -22 184 132 -119 -79 -217 -307 -28 116 -66 -115 -73 24 -190 -45 39 173 140 204 -76 -23
2522 -23 167 69 -185 -155 -3 66 -216 -106 -117 30 17 277 -52 -407 124 -405 392 124 492 108 239 108
2544 108 -486 91 -41 -67 122 -156 65 74 -280 -9 -45 -178 -188 -45 303 -196 -58 -33 228 -17 48 177
2566 177 -67 1 215 61 -144 233 247 -108 -119 154 -323 -216 -79 32 -137 -49 59 -41 -162 79 103 164
2588 164 -13 222 -94 -94 122 70 -237 69 54 -22 72 -129 160 -175 -399 218 145 135 173 83 -232 -119 262
2611 262 196 -118 -105 135 -40 -172 104 -148 -146 220 -59 34 -168 -156 -48 -224 130 201 -23 -90 151 -126 -120
2634 -120 255 267 50 118 -15 -161 -203 -55 15 -55 64 -157 173 -106 130 -10 -25 49 256 96 31 53 58 -117
2658 -117 -113 164 164 -49 -13 214 -6 -83 -77 -85 -52 83 -33 -88 -44 165 56 105 24 -25 240 63 25 -103 -187 -62
2684f2O2k66J11J90q6K13j55k24K72J67k53K8J53j77o0o5K3K80j01j2P3j69j66
2707b24N1K8K50k67K12j08K3L2K9m3N5j39N1K12j16K33k61J2J47j24k17M8J34
2730A8j50K03m8J73j94j04O4J11j45L1o2J15O7p7j10M5j36L52l34J19J8J0O5j65
2754a34J4K3L7n2m7J14k01J82J0R8k5K5j2O2p5N5j14M9m9l60M22j17M5K6J15p8
2780A3j52K59N0m0j94J10r7L8j69P8K10j49J21j99J39m3j68K67l6k02K06J6J41
2803A99j95K74k79j36L80m49L07L1l9n8mJ34j47L0L5j15L3j55J74q9J1O0m5l9
2827h2O5j14L79k5k21K2l1Pp0kJ46P8k46J87j44Q9R7k91J40J13m5l4M2k33L4J91
2853E2r3p1j5R6M1m3n1J94k09J99k86K65J30j49L4j00J83J6j73J74k58LO1L7J63
$$ plain form
2684 -62 0 -266 -155 35 -51 162 7 -217 55 222 -31 -3 150 -27 -87 -152 -129 151 50 38 111 -58 -224
2707 -224 -173 -145 105 -162 50 -58 -35 -3 26 -17 38 -101 -50 162 46 279 18 30 177 53 -164 -116 18
2730 18 -132 71 23 196 2 -102 -38 73 -72 -41 -103 12 79 2 -108 -63 -199 153 -181 -62 -44 -34 31 -134
2754 -134 -120 -97 -60 -112 -159 -45 -246 -64 -54 44 19 44 32 94 19 74 -40 9 -40 -400 22 -95 -50 -24 91 13
2780 13 -139 120 170 130 -64 46 -51 -13 -182 -104 106 -43 78 -121 18 -25 -193 74 38 -164 42 58 199
2803 199 4 278 -1 -137 243 -206 101 132 93 35 31 165 18 48 83 -32 1 -154 20 -69 -58 2 -43 -82
2827 -82 -17 -131 248 223 2 24 -7 0 -70 -72 74 152 -94 93 -51 38 135 -156 -16 97 52 18 60 -173 -139 52
2853 52 -41 -112 -127 -31 10 -33 -84 110 -99 100 -186 79 209 60 94 -6 177 193 20 194 -64 -61 0 37 200
2878B00j42j99k1O7O7J7M8J80k76K6K74l38J11k71K27J69j02L0o0j70q0J73L7
2901c3K32k67m6J19j23L19j74k35L46l60J44J67j52kM1M1k1P0j57P5j88K22q4
2924f6J98l22K02j40K86M3l42J99o9N8k2MK6j69J64J1OM0j17L9j9N9j70J99k28
2949a30K47Q1n5k1p8n0J32M8q0J13j67p6J12j20N6j6K1q6j31K39K4J07j72l8P9
2974C9l7R7l4m5j55k6P8J18M5J34l92J11J11r5j0n2J80j48K24q0Lk27Q5m4L68
2999B48j64k13K36k42L34k37J81l0j04L6k70J93R5l86K36M7q0J23j19J78j21M8
3021a1P6n3J21j01P0k06J57J16q6k01J33O9j82l8Q0p7L50j40j10j15J91R0j42
3044iJ8O7j5O4j62J40K2j58J63k47K33p3o9j38L6J33M18n08L1K2J18K8q6J43j51
$$ plain form
2878 200 58 -141 -162 -95 -28 -11 37 217 -59 -33 241 -97 14 -257 -30 139 37 67 7 -163 -243 -70 -33
2901 -33 199 -68 -114 5 -118 201 27 -208 138 -222 -78 89 -63 -65 -24 17 -4 66 -91 -16 -204 18 -66
2924 -66 132 -190 12 -128 158 201 -141 58 -11 47 25 29 55 -114 50 61 67 107 -10 29 10 69 -101 98 -130
2949 -130 117 198 143 122 44 -6 126 174 94 207 40 -36 76 -44 12 -4 17 -69 -200 39 63 170 -2 -40 39
2974 39 2 99 65 20 -135 -161 -83 35 80 214 -178 -67 44 -51 -61 -113 67 -81 143 63 66 -161 -76 -120 248
2999 248 84 -129 107 -135 199 -38 143 113 9 45 -225 -32 63 -323 -87 -40 -120 3 -116 62 -59 -11
3021 -11 65 12 133 32 102 -104 53 169 83 -118 15 84 -98 -136 -56 -133 217 77 -33 -148 43 133 -9
3044 -9 9 76 61 125 -37 103 125 -33 130 -117 116 43 -26 -164 -128 5 423 -85 -54 -32 86 114 28 171 20
3069B0q1J33m5k27L90k68J44k11K16p7J10m05K69J3r9K68j80j30L73j42oJm8j2
3093Fj11j67K24J18k46J62r1j48L29o0r4P6K7%J8j57K6J15q0J79N2j42Q9j70l3
3118g8K28j20J71l81J78J07j28Q5J12n4j76k0L27k75j14L73j04k18K41N7l97J02
3140h4L5jj76K29m0k76K29R3O2j51J41j3m5j04J53j00k0M15k56r2O6N6m9k85J34
3165g9K42l47J20Q3J22k07l8J85j03P8K32k12j42j28N27m28L15j6k42R4n8rp3
3188h4n9J72p8j23j03K31m4J77JP0k13L06k2j26l56K98j06J9J33M1j75j30K01
3211C0k17K30r6K4k05M52j92k01J46P0J14Q8k5k01l7J08k63K21j41J76m8L6j79
3234a10r5J08J00Q7j34R9k50K56j84j66L80m9j8J35k98K25m1n5N7q4J05k9p0k98
$$ plain form
3069 20 -61 72 27 -200 190 -78 66 -145 71 -6 104 -301 -32 -19 -118 150 -30 -160 213 71 65 66 18 6
3093 6 -105 -272 -48 70 -176 -14 -105 -253 76 16 -78 -2 25 25 43 -114 -88 27 -53 126 178 36 125 -45 -78
3118 -78 150 30 201 -180 -2 105 -23 62 174 120 -56 -76 251 -24 -138 235 131 -87 154 211 -186 -84
3140 -84 -49 -50 -226 3 -37 -313 -84 9 71 -80 61 48 3 -101 52 -48 -68 347 91 -1 65 121 72 -213 -79
3165 -79 163 -184 -64 19 141 -66 -104 81 -22 56 288 76 -66 -194 333 -95 220 204 -38 56 -2 -11 -84
3188 -84 -143 29 -49 -172 -275 -44 -88 89 90 160 -53 253 231 105 -251 47 -59 -40 93 134 -41 -171 30
3211 30 -187 43 -53 -29 -234 218 26 -175 -29 41 155 243 218 17 -20 88 -175 46 -95 81 33 69 -110
3234 -110 -205 -97 3 90 -44 55 -195 61 -123 -289 91 42 24 159 -139 86 45 -10 47 -37 68 39 -31 -329
3258c29J93n4l3K44o8K14j79J6J5J4k28K28J32j00k05K00k8j3j03J52k05J67j3
3281A7J70k29j11J94l87L14k41M33l90J46L81k36o4O1R6k80J62j23J8J59j08l3
3303e1O7q0L4o2J35Q6j29KL4M8J0n7l9j0M20l64J29k48J0MJ88j34P1M4m0k8K6
3330F6m7q6J55j49P6%M0l4K41k52J73k23M3K15m65J99l4O2P3k38K41j9r6L3K3
3355cJ48k91K00m9m7L4L3L6N7j01J5k46K66mk12J05J51p7pn7K34l64P3K31j36
3380a1M04l73O5O5k84J20L3p9j7n8J96q2m5j19K85O2j94J01j11O9L0p3Q9lL6r7
3406IK8J0J04m7j81o5L5J97k20J47k5j07J49J60q5P7k53J02l2M8O3J52j03k32
3430f9O9J34r3j08r3J54k07o6K72M7J3j19K6P5J13q1q1r9J01n5J08j06oP2J24
$$ plain form
3258 -329 -136 -190 -223 21 -47 167 -12 4 19 33 -195 33 165 65 -140 60 32 19 -84 68 -137 30 17
3281 17 187 -42 -153 41 -346 -32 -273 160 -230 -84 297 61 -3 58 154 -126 36 -87 -69 90 -18 -51
3303 -51 16 -64 -30 -92 43 129 0 2 36 84 94 37 -2 -12 408 44 173 -75 -65 -61 127 -7 64 108 68 40 66
3330 66 19 -67 88 -61 15 15 55 21 262 10 183 -40 3 218 -247 -48 -82 -20 53 -185 56 37 -59 -26 -3
3355 -3 145 -146 54 5 -42 -8 25 61 118 17 32 -214 52 48 -164 -59 92 15 8 -49 185 -179 -106 125 -11
3380 -11 393 20 85 150 -134 -14 19 -60 -77 -135 61 -21 -66 -185 100 162 -32 69 -42 27 57 -16 73 70 106 9
3406 9 37 47 151 104 -77 -142 -107 90 -130 17 -8 -115 34 194 109 186 -67 35 3 51 114 266 163 -69
3430 -69 0 134 41 -67 -160 -6 -213 -279 -7 40 53 -66 -40 35 148 67 -14 -113 -12 -67 41 -65 -71 1 125
3455A25j53R3j04K22q9j99K37j34Q1j63O4L0R3pk8J3k28L28k19o6Q4Q9p3N5j77
3480a26J93j32j30K69p2j48m9J42J35l7k1J08L8n8q6K5N9N7j28j1K00j85j80J02
3504c5q1jL6K62L3n09L26J85k44P5K15k37k6p9J25M3k7J46m2j11k90K10j53K5
3528a54M1J38j71K84j87M5Ok42K89R8K0J13j70j8l0m09L53K11l78J36k5K0M7K
3552A9j06J47J86k79J06L5m4l4j48K33j60K22m36L59j87o1l7L8K59k02R7Kj74
3575a65Q2M4J59p1M6j74K1L15l21K18q9j9l1j07K1j3j33J64j69J66Q2j45k3K90
3599A48k2l04N84k62l37K50J54M6j10k94K81j9k41k7J31jq8J08J3j29OJ50j40
3622a03J95k14J08p5K11R5j33k77J40P1j73J71k68K28o5K8j1j51L07k41J31Q0
$$ plain form
3455 125 -28 65 -39 183 94 -105 132 -2 79 -84 -20 10 103 96 68 81 -147 181 -38 -104 -20 69 -4 51 -126
3480 -126 67 -65 -195 74 2 -146 -195 -53 82 45 24 132 170 112 26 51 110 167 39 28 228 43 -137 -35
3504 -35 -116 -117 -81 181 214 -295 31 216 -28 47 262 25 -1 -80 45 88 61 207 165 54 -236 -26 -179 -154
3528 -154 -113 25 -146 138 -49 -4 2 -240 49 147 167 280 110 92 62 -347 6 217 -161 -25 -50 -30 17 19
3552 19 -87 60 246 -33 73 108 64 30 -118 115 -45 177 -259 100 -87 -148 -185 -147 112 -90 7 9 -165
3575 -165 -83 -39 120 49 95 -79 -58 257 -64 154 65 46 15 -92 -71 -84 -217 -53 -222 -56 26 -119 -142 148
3599 148 126 -178 406 144 -193 57 211 257 147 -147 134 115 -126 -153 -22 -23 -111 -3 10 -119 -113 37 -103
3622 -103 92 -122 -14 -89 122 217 84 -193 -53 18 -155 16 -252 -24 -89 -61 -72 -223 84 -157 -26 54
3644E4j06K52m67L60J28k29K01j32j69J77j96J19l8%J44q5j11n4Q9N3R0N8r6N4
3668I6n5l9J0P2J07K9j13j4j43L9j2j02N4p2Q2p2K02j11K7L5l4J67N9j55k8P3
3694A02m02L58L5j45J27j9j15n1p7K60k13K0J84j46j20o6L68j00N7j47J10m8J1
3717a7j1J67R4j76k4p0j80J25Ln6Q6j49J77Qj28J41o9J81k62M9K23q4j20J82K20
3742C10k60n4l3K02j63OO2j65j75J84K86j56j26J38N0j00j21K23K11m13K29j38
3764cn0J84O9k86j8K23j59k5k03K09N2j95O6J77j45J32k5J64j04J82q6k92J93
3787F0j21K30R1k06J64l97J75l5o7m8J06j36M44k89R6p5K0RK4n5J88k38qJ11j12
3812f9N8m2J01r4j67J64n4J45J5k23K03k0l0J11j6Q4k20J8k4P6K29j06k98m4R5
$$ plain form
3644 54 -52 200 -267 93 221 -8 193 61 -108 69 -127 -8 -46 -46 98 13 -98 -152 -63 -10 80 138 42 96
3668 96 41 2 12 84 191 220 107 93 -50 -11 -23 -125 -71 -143 -61 -133 69 -42 -15 20 -14 153 212 57 29 102
3694 102 -300 58 93 -52 75 56 -59 -110 -187 73 -140 -120 64 -82 -202 -268 100 0 57 -90 20 -28 -17
3717 -17 -28 139 233 57 33 -37 -217 -92 -89 -145 -59 -208 -31 -23 -151 -10 -79 102 -160 -111 112 28 -92 90 310
3742 310 50 -4 -37 165 2 8 70 -95 -270 -86 200 44 -82 56 106 6 -115 108 319 -94 135 -3
3764 -3 -53 131 200 -86 -104 119 -40 -65 -268 -59 -7 -202 -136 41 -104 28 3 167 63 245 159 -133 60
3787 60 -61 169 260 54 218 -179 -4 -39 -106 -154 -48 -184 260 -29 67 -8 12 21 45 -10 178 -60 -68 43 -69
3812 -69 -11 -53 48 -46 -213 -49 -103 42 57 -166 37 17 -13 98 82 166 -54 -36 -60 16 245 139 -159 -203 -108
3837a08n4L32k59J48j53J20j23P4n3J86j44l4J45k2J32l09J26r9l1J13O2k42K54
3860F1j87K53l37j61L96j91J97J1n2J87m0L1j51O8j21j43K12J0j90J21k0K5K1
3883@R6k40P3L0L5J10l55L12n1M9m6J51L2p2k35k4K29j45q0J60J00l65K45Q4o7
3908B6J19j13L2R1m27K54J7K10k06J2Q1K49m35J75r2J3o0k3k9j1Qk9J00l8j76
3933b52L37m2j28J63p6J56o0K1k1j50J85j54O8j04K3l2R0j07j85P4O8r5J96N7
3957C2P2j84J5J91M1l2j80N6J87j78j41M6K24l02o6K60j39R5R3j42M3Nl52M15
3981E9l8J29N1k3j13p2o7j14J21r2J02j94L69k18q4J40R2j58K0l4P4P3j72K27
4005G8M0k3m6P6k14j81M64m18J63j08J98m9jj2J30j84j20M93k70O7m2j04P3J16
$$ plain form
3837 -108 -162 170 -89 59 -94 26 -97 -23 -76 110 -34 -68 77 55 187 -122 4 -95 -126 -13 49 -193 61
3860 61 -126 127 -210 -371 25 -166 31 42 -10 177 137 168 17 85 -36 -179 33 43 -147 -26 -46 -21 0
3883 0 96 -144 -71 -41 -6 104 -251 61 10 59 13 164 196 124 -111 -135 94 -51 -131 29 129 -236 9 93 26
3908 26 145 32 64 155 -272 -18 -1 209 3 15 96 345 -90 85 -7 6 -54 -77 -106 -117 -109 -138 -38 -76 -252
3933 -252 85 43 -85 78 2 158 98 119 98 -52 133 -21 47 -57 -34 -66 24 -83 -268 -194 -126 -221 -25 32
3957 32 104 -80 -65 126 167 135 -45 11 198 20 -121 -75 149 -153 -219 41 -98 -3 90 -52 -9 -4 -356 59
3981 59 21 150 201 178 65 -7 -74 -188 -67 -159 -57 -251 118 -100 -184 -44 48 -110 -90 -124 -50 23 -149 78
4005 78 118 95 49 125 -89 -270 194 -224 -61 -169 29 -20 -21 -33 97 -87 -207 286 16 83 41 -63 10 126
4029A26j61q6J72J3j15p6P5J55j40JO8k55J4J35J1j49K02J01J17p9q1n3j6J26
4053A05K47l40j3j88Q7J80k91K76q0N7k64M30l85K96k8j02J82k14K91j24j36J37
4075A23m5l90L98k15L0l7p1K71k77L13L1r0j80P1M1m4KK98M1j23Q6l15K09lj36
4100a2q0N2m9K09j96p9J57r1J28N8j43J74j46K19m42J70J64j31K9j3J45j00p9
4123e6M8K9k48J00N3j32J06J71j79j11L58p1k47J41K16j30m6J9K1l4j93L66j40
4146D1n9P7j70R8j06K32j68M1q3J11j65O2R3O0j60K04j43l5J21j58P2J86j20Q3
4170A14p4j40J56j71K41j61J9j45J45j17K28o9m6K8J76k98J87n3RJ17Mj62K43
4193B31j53j03r7K65k94o0K0J62J63j34rM8%J61q5n0N3k68J70O5j24N3r5J10p2
$$ plain form
4029 126 -35 -121 51 64 -51 -127 -52 103 -37 -36 32 -223 -209 -74 -63 -212 -10 91 208 129 48 -5 -21 105
4053 105 352 12 -1 -189 -102 78 -213 63 -17 40 -224 206 -179 117 89 -13 169 -45 246 122 -14 123
4075 123 78 -312 86 -129 -99 -136 -207 64 -213 100 131 41 -139 -68 -27 -71 -69 229 270 147 233 -82 127 124 -12
4100 -12 -92 -40 -89 120 -76 -155 2 -89 39 97 -46 128 -18 201 -241 -71 93 -38 -9 -22 123 23 -56
4123 -56 -8 21 -227 -127 -74 -206 -100 71 -108 -219 139 68 -179 -38 178 48 2 21 42 8 -185 181 41
4146 41 -18 59 -111 -13 -119 113 -55 -14 -97 14 -151 -89 4 64 -96 108 -35 -70 51 -107 -35 151 31 114
4170 114 40 -100 56 -115 126 -35 -16 -161 -16 -133 95 26 -20 8 184 -114 73 20 29 146 150 -12 231
4193 231 78 -25 -122 143 -151 -211 -191 -29 134 0 -9 39 39 200 115 65 118 -150 20 85 -39 14 -81 29 -43
4218d3J27k66O1k9K21J1j35K58k52J40oj13j07P4J52R4k41R4J3l34K43mJ13j76
4242a05O1j9j8K74j56M9k76J80q6O6P3j5j45K86l23J60n3j21O2j05N7J99J23j75
4266gJ21j09K00o7J09o0l83Q3J60O9L1k34N5L5o9J68l14L47j64k01K43J20l71
4289b38K03K0O2lj70j67K80J2j01K45o4k03K17k49R8j25K29n1j33L2R5j62L98
4312B25k01j30J35Q7k34K39l2RJ3n9j17J11k6J7J24k13L2RPj09j50K55m8R9j03
4337f0P6Q5J2j73n7J76j18N7Q2j24OR7j16J63j71k2j72M43k77P4m8k7J24q4j35
4362a89J36R4j72P6J74rK4k59RQ8K22k99qq4K70j31rJ67K4k2JJ49j77j48J51P5
4388A53p0j28J3N9L4n6j82L27j18j65M4J31o2J79j94J2j3K2L4J40j24Q2k47lJ25
$$ plain form
4218 -43 84 -182 -121 -150 71 82 -53 205 -47 93 87 -26 -133 -59 93 187 -54 40 53 -281 -38 -42 71 -105
4242 -105 -44 -63 -81 193 37 86 -190 -10 -96 -30 43 28 -117 169 -154 6 -47 -168 -106 -211 -154 45 168 -7
4266 -7 114 5 205 138 247 187 -196 -113 47 116 147 -87 -32 3 -66 102 -212 135 -29 -230 13 133 -238
4289 -238 -35 -15 47 44 -126 -293 -13 -1 -102 143 79 -124 93 -156 -58 -183 46 -5 -138 -106 -11 -173 225
4312 225 24 -106 29 116 -118 121 89 98 111 52 -65 46 20 37 161 -52 -20 -11 -4 -113 -263 -8 -56 43 -60
4337 -60 16 101 113 -60 -117 59 -59 -2 80 -44 -38 59 -57 106 -65 -87 -259 184 -93 -19 -67 -94 30 -54 -189
4362 -189 -53 41 -131 -55 119 110 134 -125 -116 -28 194 -105 -113 -197 73 -58 -67 100 124 102 103 252 75 -73 78 153
4388 153 83 -45 -32 27 61 5 -177 150 32 -133 -89 42 -20 159 -35 -23 -36 -14 20 160 36 118 -129 -132 -7
4413gO8M3n4k1p7P8j52L3K60k97K76j54j52J97k41L60l0l1mK4j00k3Q1p1j05j7
4439a16K28j60q8N9J87O4k41P4k0qM2k3r8J26O4o8k18L00p2j91J68o3L8Lj21J24
4465a0j11M9J65l34L23K2L5r7Q4j82j00j4L52j06QM2j39j91o1K80l0l5P7L3k96
4490b36J90K2l1J10o0m9P0O4r2JQ5%J5k04J29n0q2K46l1M1j36o2J12Q0j04J35
4516A63k8l28J74j5k5J35M6K2j29J59m95K23j12J94R1j33J64k04J24k21J40K0
4538c5O6r1P4p0k5K99j72r9K22j24P5m1j44k03L30j86J58k00l6J75J69k07J57
4561I2J15j99O4p8j08K57j14p4N7j3l9M9p2J63j21k02J06o6L24j59L4j43N4O0
4585a3Rm4k0O5j0k1o8J9J08Q7m8nk12J48J46k37J32K64j48k55L5m3L7K32k2P2
$$ plain form
4413 -7 61 104 50 29 -48 30 -122 -89 171 -126 150 -4 -156 41 -200 160 130 99 95 119 19 -4 77 6 -99 -116
4439 -116 112 -48 -136 -77 110 174 -67 7 -13 -21 21 -2 -100 26 90 22 -196 104 32 -159 9 -54 -16 -13 -134 -10
4465 -10 -121 -72 93 -241 82 104 139 42 126 -56 -156 -170 182 76 84 126 -13 -204 -265 15 -15 -50 27 60 -236
4490 -236 -46 -24 -55 55 -5 -54 16 80 -12 -11 74 74 89 -115 14 -36 -118 128 97 138 2 -60 52 132 28 163
4516 163 135 -193 -19 -34 -59 76 122 144 15 174 -321 -98 -210 -16 75 -58 106 -98 26 -195 -55 -35
4538 -35 31 -60 14 -56 -81 218 46 -53 169 45 120 79 -65 -268 62 -124 34 -166 -202 -27 142 -65 92
4561 92 207 8 72 -6 -114 143 29 -45 12 -1 -40 9 -63 100 -21 -223 -117 -183 141 -18 16 -127 -73 -13
4585 -13 -4 -48 -68 -3 -13 -34 -102 -83 25 112 64 59 -153 -5 141 -96 36 300 152 -103 -68 -111 -74 158 136 208
4611B08j32J4p6M1j48J68M4k85J16n9J01p1j51M14j05j15L62k56k5Mj2J46l70
4634a87R5K45j22l0j47Q9k86M65k28P0L41l48J01J46j25k06j0o0J81J80j80j64
4656a80N32l44k2J87l91K39o5J29J87j45q6k0n9P2Q6l85K76o3n0JN5J63m1J10
4680A86l37K28j75P0L5L6J6J87j96r2L2K40k69R5j17q5q7L39Jo3J49r0j43J7N
4705a8n0r4J24NO9o0J18j62J22j4l3L4rJJ07j13K15l14J87J6p2j09OK60r4j78
4731e6q1K46m15L60J34n8m04K55K44j67Q2M3J6k7j18L6j74J6J44l5j6j13oJ94
4755A00j71K10j61o7r1K95r6j30J54r0j50J85J31k1Q7k23K4M8k07L37j74O5k6
4778B9j18J13R5j63l2J54k02L27q4j21M3l0J99l00K8J2j0J13k9M3k82K05J96l04
$$ plain form
4611 208 76 90 14 55 -93 75 119 -166 -50 -109 -8 -79 -230 184 79 -36 326 70 45 49 37 183 -187
4634 -187 -92 153 31 1 -146 -57 -343 122 -106 -36 305 -43 58 204 79 -127 -137 -197 -16 164 -16 -180
4656 -180 352 8 -14 173 -218 21 -44 85 272 127 41 21 -38 34 120 -265 11 -52 -102 -101 -46 117 76 186
4680 186 -151 77 -98 -28 7 43 59 246 50 -42 -10 230 -39 56 -61 -146 -233 106 107 44 193 103 -40 -23 -18
4705 -18 -68 -162 -38 -33 36 -24 94 -68 54 40 7 41 32 33 140 27 242 -72 115 131 59 -50 -44 216 122 -56
4731 -56 -137 109 -306 54 188 130 -274 -19 225 58 140 183 199 172 54 90 -84 -68 76 41 25 -88 -94 100
4755 100 -71 139 -22 -89 -180 115 19 -111 43 -47 -197 -12 119 98 185 -38 -14 34 -173 164 -10 55 29
4778 29 -89 24 119 -44 -76 78 -124 203 119 -2 41 11 210 -90 -62 -50 -60 53 24 67 -215 -10 186 -118
4802a18K72l57J28KJ65P0j48R8l9N3L8R3k86K2J27j45O9R5q2R8k76L5K69l28J29
4827a6L9n2o3j19M08k65L33j41o8O3j45l0k5J1o1jK07j44J86l10K07ll6l7J13
4852E1k0P0r4k33L54J04k58J8K06j75q4j39K88Q3M9o26K93j13N57k93j30J37N0
4875I5J53k02k8j28K46p7o5o9K4L00k26K03k78O5j29J55J29o6k67K39r4N3N0j31
4899d8R7Q0k65L75k25J10j03Kk79M67k32n5J32n0j91J81J69p9j75n4K42r8J8k11
4923a92J88J23j08J19l01J22J38j75J47Mk06Q4J37j38l8L2K7J05m9j44J4l0O0
4946h1J55J67l00q0J8J8P4J43j62J6j7j00M9J13QJ65k99M4M3n2J64k12K10Q5p4
4971I5n6m4m0p0J97j91J08J93k25j02O7Q4k48J61L4l82M26N3M7l10K58M8j28k36
$$ plain form
4802 -118 154 -203 -75 -73 92 162 14 112 73 126 164 257 -29 -7 120 -25 44 139 57 155 -121 -86 183 -145 -16
4827 -16 23 -29 -92 -211 197 -68 265 124 56 119 -26 -56 -81 -70 -131 -132 75 -69 117 -193 14 11 -25 -62 51
4852 51 31 101 7 -226 128 232 -26 -8 198 23 -61 -200 88 171 220 -406 -113 -226 331 38 -92 45 95
4875 95 248 46 18 -110 136 59 -6 -75 -51 249 23 226 -52 13 -116 39 168 102 -165 74 -20 33 83 -48
4899 -48 49 129 -136 239 14 124 21 23 -256 211 -21 -76 56 6 -185 -4 165 86 -89 -143 99 1 19 -192
4923 -192 -4 119 11 130 -171 -49 89 -86 61 65 -141 -57 80 -58 -96 -64 -37 68 19 -125 -111 -141 -81
4946 -81 74 241 -59 -139 -121 -103 -29 114 -48 -32 -49 -149 -100 13 21 186 -113 -69 -26 -78 86 -126 84 169 95
4971 95 39 -5 -45 -115 82 -109 -1 192 -33 -135 -68 16 -232 -71 -37 -419 7 60 107 -203 55 103 -25 -261
4995b61L15m6O7M9k2N3j98Q4P7j84k0RL1j6P5K31l21K00j76jJ41l4jm5m8J14k54
5022a81L27k94J30j2L5j04P3K0K8j15L57k64Oq0J9K51n8j58k36M36l19J16q5J16
5046HR6k79J00J52r6K42l92J84J48k43O3L0j77j9L28m9j81J22l78L02l1J51p9
5069BJ74k02l2rL6j53J73l8j1J48p8l6J08j76J47p0Ln9J4j91J52j50K45N2Lk38
5095a86J13K29j33j02q8K45p9j29J27R4k49p7J07l6L05j78J46k22J75p1l7J0J24
5118H8k04J08M2q4L78m44R8l6k3j07l2K64j26J33N1j32n2o4J72j38J29j23N9r2
5142a35L1J35r6K4R2K0j82J25n2q4K55J9J06j97p0j69J90n6K67k68J04p6J80j16
5166D7O8q7o7J6k64J35J39m3j75L46k16J84M0k39R9r8K98m2j05Q6Nj47j5k33L22
$$ plain form
4995 -261 54 8 75 124 102 155 -43 41 118 -66 -86 -77 -46 -62 13 244 -77 123 -53 -54 87 53 52 7 -41 73 -181
5022 -181 146 -148 -18 -30 5 -99 -26 -6 22 -93 264 0 6 -74 -55 196 138 -20 -256 180 -139 -23 -108 8
5046 8 104 -175 -75 77 -19 223 -169 15 163 -80 -17 13 -164 -183 145 96 -85 37 -341 -39 -70 81 2
5069 2 176 -26 -58 -67 -31 -184 -11 -49 -60 88 10 -26 82 -94 53 -17 -14 -73 -59 -250 -98 -248 -3 49 52 -186
5095 -186 -73 156 23 -79 -167 78 -1 -130 -3 91 -158 -235 -128 -164 141 -37 109 -113 62 -9 -46 -36 88
5118 88 -116 -8 34 -50 328 -116 -18 -54 -77 -184 -216 48 -78 55 106 -26 -78 -142 30 -108 21 -102 -43 -135
5142 -135 -104 31 -65 -41 51 71 -111 14 -38 -122 133 152 258 61 -9 -178 12 -44 223 -45 59 -17 163 47
5166 47 115 28 -39 -23 -287 -152 -13 -56 -231 115 -101 83 123 -116 -17 -115 183 141 36 122 127 -20 -35 -268 54
5191E4J3j45J65J74l09Qj08R6R7k29J74K13l06J49Q5j78K0K7M2N9j54J34P9n6
5215A04j76m2J22R6k7p7n5j3P4r4K0R0J55l00n2K31L9j26J0p3j55J39K14m5j68
5240a09J01j84K28m0K13j69m1j72J60N5k19K97p0j63J73k7j2QM7P9j85J03j10
5263c7m5JK34l31L01l85K28J06k7O5j91M7K3J74L5j65J4j03k5J56k9J17k13J32
5287H2j5n1O0j06L8j54L18j69K18l39J58J1J02k57k9K03r5o2o9j8j9L58k76J66
5311E5o2r5N6M3O9j93L1j06M7M0J00k1Ok7J19K1L2O8l94L31j0r2J29l9l05K98
5337A01L0k88J12m2J24j29j08K99j05r3M7K12k81L3J65j63M3J45k42N7N9j5P5
5360C6m4k12J25k3N7J45r9J61j01j2N2k00J04q3J46j41q4L7P4LpK4J56j47J11
$$ plain form
5191 54 67 -78 87 261 -48 -40 -148 -52 45 -184 -10 203 -103 46 131 -47 -27 0 42 101 -53 81 160 104
5215 104 -72 -114 8 104 77 0 -55 -68 6 -88 -68 22 177 -123 -175 56 95 -31 -21 -94 -249 -110 104 59 -109
5240 -109 -8 -192 36 -4 209 40 -1 -173 -13 42 -177 120 50 -113 60 33 21 29 76 155 -30 73 -37
5263 -37 -82 -81 153 -178 123 -262 -34 72 45 110 -81 -34 -11 163 198 33 47 -56 -81 75 46 163 -50 82
5287 82 67 16 76 -30 8 -146 172 3 221 -118 40 51 153 -104 -133 70 -25 -87 -156 -174 -193 165 -111 55
5311 55 -7 -102 -46 -3 66 -127 -96 -202 -155 -115 -15 -36 -30 -57 62 83 115 183 -211 120 110 18 147 108 -197 101
5337 101 131 -157 -45 -87 37 -92 -200 99 -6 -99 -52 160 -121 -88 77 -86 -43 102 -140 -83 -24 -39 36
5360 36 -8 -220 -95 -118 -61 84 -15 146 45 33 85 -115 -11 -94 52 -89 -173 -136 -62 -59 -66 -42 114 -33 78
5385G8M3j12m3O0j15Q5k2n7K07k65K80j68j92L25j41j28K71Ok82J40Q1J5o8j49
5409a51J44l8J63k07j14K00M8mp5k0j7l4L4O6R1P9k38q7J32p9J45j80J67j09J30
5434D6O0p4r1J38K2O2j11j21P5q6P7j1J6K1k6k18K27J3k43J96R6J9j37rJ76j26
5460iJ31p6j18J79M3k20j24J01J81p1pP7j26j88K08L7J93k89J10l67J45L74k61
5483g7L5J69N6j78K92l61P0j62j41M56j36N8m6N8n8l59M19k68J80L9rn0k0kp5
5508a10R0NK1R3n2J07l33Q0J64j24N2o4nL1J06M5r0j25J20K8r0p9J06J05p0J5
5534B6k02J05j22J89N1j06M1q3K7J65m9r4j16J90o3Q8j64J09N9l0J85p8M5k42
5558f9J65n5Ol8j36j62L68j66K96k37J89j30j19M6L8M9m5R3k03J17P9k07O0rN1
$$ plain form
5385 78 121 9 -34 26 -89 -4 -26 -83 124 -141 139 -29 -221 104 -37 -165 106 112 -170 -30 51 66 -2 -151
5409 -151 -7 -45 118 -89 -203 -3 45 41 -34 -54 -71 -105 -71 -5 86 165 -73 -160 -28 -107 38 -142 25 -84 46
5434 46 106 32 -59 79 101 163 52 -69 6 -80 -3 -14 2 23 -3 -221 6 19 -224 -28 68 87 -50 -59 117 -9
5460 -9 122 46 -72 107 150 -70 -194 -93 88 17 10 87 -39 -227 -19 18 211 -78 32 -335 -190 184 -77
5483 -77 -42 127 183 5 297 -64 6 -156 -297 159 23 81 35 93 35 -324 95 -173 7 46 37 -13 -33 -35 -110
5508 -110 -20 -15 6 99 47 154 -179 -99 65 -59 -7 -71 -76 -45 61 106 16 -109 11 39 -51 -130 -24 81 11 26
5534 26 -176 -71 -193 -4 47 -59 -18 -101 -74 91 42 -52 -168 22 -41 47 -117 -8 51 21 206 128 173 -69
5558 -69 96 41 47 9 -127 -289 79 -87 209 -28 161 31 -88 -42 -4 45 0 93 -110 7 86 -121 -61 -70 -19
5583a9qP7O1j64m9J54j6k5r0L9j63L13J3j04n4R0l9j20j49J96J83r4J7l4j8k0
5609b3q3N0J03k49J83J08l9k29K98j10Q1j3q5R7L2m01N20k99J05N0m4jj13L1Q9
5634E8j12k2N0N2j94K61n5l06K07rJ14k65K55J62j32j7j50K81j06l2Q8j31K1M5
5658F3j69J76q8p6J45k14n6K64N2j67JNLK6Nj86K21O9j21J46j80R9N6k47K44j34
5684f3M2j8L76k11j62P0J76k23J89k20OJ53j86n5J00K42k03K7Pk3Q8J3P4o4p3
5709F2j16K37j48np1K87j62q6kJ13j06k30K80r0k48L86q1k44n8K08K98l96j20
5732b92O58l33K82l11L51j15m07L60k43j87K06K0p1O00k32m93n0M45o66M80j11
5753a09L15j6l86K28J36J97k74o75M05K67r7L11o4k37N94l01o28J116j007p1N58
$$ plain form
5583 -19 -27 50 111 -53 -102 52 36 11 -79 -40 -203 110 123 19 -35 55 16 -104 -253 -57 126 32 49 15 -3 -23
5609 -23 -106 -56 47 -202 -19 89 50 -179 119 9 90 77 -8 89 121 -280 240 -59 46 96 52 51 -62 -31 58
5634 58 -54 -76 -26 26 -168 93 38 -268 -61 -70 44 -221 34 196 64 47 -103 178 72 40 128 -3 18 63
5658 63 -106 70 -18 -94 51 -163 -219 45 97 -70 -69 -64 -61 -35 -30 -216 5 74 -47 99 -81 18 74 -173 71 -63
5684 -63 -21 -39 337 126 -36 34 210 -13 176 -44 -38 115 -71 -126 -26 216 13 40 47 24 112 125 199 135 62
5709 62 -54 183 35 30 -41 246 84 -2 -4 109 3 -227 53 -37 -285 101 20 -224 -282 -74 224 -172 -292
5732 -292 366 33 315 4 355 240 -167 193 -50 -237 -31 -11 -82 518 286 -207 -257 188 -478 2 -109
5753 -109 206 190 -196 32 168 365 91 -584 -179 88 -9 302 238 1 595 294 -334 782 -225 -296 262
5774B62K4j128J014M42n44k53J80m7L71l5r0p4j00K00k26l58K51l4j30k8P68n86
5796a21K28p1J53k90M18n14M81K8k50L47n97N80o89J80M6K08L87n42J94j59k27
5817b10o5N24k14m91J42O59j66OJ71m31L04K14l01m86qL59m0N85l40P1o16O13
5839B80m05k51rM69M3l0j26L2J24l35L69j94J13L37m13K4j25o3K10l77M54J21
5861B48o64M36J43j01k85K55J48Q8j6k75JJ34l1j85J78l36QJ8K72Np7j7N3Q0r1
5886a1M4j13L0L4o3J44p3L1Q8n5j13j53J00j77oL61j29K55k40j18J56K2n4OK55
5911B21k68q6O0J97Oj78NJ0J27k36K79j07P5j0m9j70K17j90q0K63j73L06l03J64
5935H0J5k6l2K8jp8n0J09J07j04O0j04J02j18K26k61OR3k40J13p5K6J49J66j25
$$ plain form
5774 262 286 -842 172 614 70 -183 -3 -50 321 286 196 122 22 222 -4 -362 -111 -145 -275 -303 465 -121
5796 -121 107 36 189 -101 317 -197 284 312 62 409 -188 392 -297 -117 -71 137 524 -18 176 17 -210
5817 -210 -275 249 35 -456 -314 345 179 185 356 -75 229 443 142 -344 -352 7 -33 552 212 283 -333 280
5839 280 -125 -376 -385 84 127 97 -29 3 127 -208 161 -33 80 417 4 28 -97 -160 50 -327 127 248
5861 248 -416 20 163 62 -223 32 180 268 252 -23 -22 112 81 -104 74 -262 -254 -236 36 41 -36 -53 0 80 -11
5886 -11 33 -80 -50 -16 -79 65 -8 23 111 56 -57 -210 -110 -287 -293 68 -61 194 -46 -164 -8 14 -40 -34 221
5911 221 -47 -133 -73 124 130 -48 -43 -33 94 -142 137 30 105 95 46 -124 93 -97 -177 86 -87 219 -84 80
5935 80 95 69 37 65 64 -14 -64 45 152 48 108 4 106 -12 214 -47 -41 52 -188 -75 -150 -124 25 191 66
5960F6O2n4j40k7M8P8J48j25O4j06j97J89k09K20P1p5n3q6q3K01O7k37L23l40
5984a95M63j95j07Mo0J38o3m0j2J00o7j3N6j48J33R9l4j42j09K04J21j38r1J60
6008F4m4J49M1l62lJ46j1k14K89k25j19J11L09j75j20K9K24j92k00L56r8L37l66
6031g4j01J96n9J4k36K01j60L37P5l74J48O0l9R2j30J37J8m08K69P9j85L36l46
6054a50N3PN0J16l7q8j99j16L66j7l2r9J76l9m5J27r7j14m7K55k65J21J18J32
6078A76m13J92J02n8K09l89J66k0k7Q7k12K9m0K69Q6l48J10RJ43J9n2j44j0K59
6102A43Rk72J59O5j13o4K2M9PL8m6j28R9MK29j30k09J4J73j07J92k83j7J23l5
6127g8n9K54j21k2j03J68l1J02L9l32j8M31K6k94N8k08J82o4J34j58k1J95j99
$$ plain form
5960 66 128 74 -66 -93 -45 33 181 56 120 14 -183 6 -203 17 88 13 -40 -126 -209 -8 59 -178 145 -195
5984 -195 268 73 -34 -30 -90 48 -15 -55 -67 33 -34 -47 9 -139 -6 93 59 -83 -192 12 133 -5 -96 64
6008 64 20 169 210 -152 -155 -9 -20 -234 55 -170 -289 -178 131 -44 -164 -135 89 -103 -303 53 -45 292 -74
6031 -74 -175 21 -38 -24 -260 -59 -219 118 193 -181 -33 27 -12 80 -50 87 105 -303 -34 45 -140 196 -150
6054 -150 -97 -90 -40 76 39 -49 -248 -364 2 -15 -47 -146 30 -9 -54 73 -24 -138 -185 70 -195 -74 44 176
6078 176 -237 -45 57 -1 208 -181 -15 -35 -62 25 -187 -158 -198 71 157 -191 -81 -72 71 90 38 -106 -116 143
6102 143 152 -120 39 104 -9 -73 -51 -2 5 43 -3 -131 -32 -28 201 71 -138 -124 49 -58 134 -149 -166 -43 -78
6127 -78 -137 117 -4 -26 -129 39 8 110 149 -183 -201 230 256 -38 20 -188 -6 -70 64 -94 -115 80 -119
6150a19J34j64N0J42m0P3k24J66QQ1k30J42j03K12j22j6J2p5M2l1J15Qj21K18
6174A58j70j0J42j48m5K8O2j89J27J80r5m1p9j1J87J30Q7l70j03R1Q3O8k13J45
6198A4j18J93j42J17j19N3j4j20K05mm1j6m5J00p3o2m5K05j31L9r6J52j09k6j37
6223b20K90q5j1K02j13J4k47N2J81j72J17rp9J47K6k37O8j10K30N3r3r5N08o75
6247b58K80M4j74J59J26o5R9k48J67J7j95rO8qj30M3j75L99j34jOo0j32L84l09
6272a06J40q0j02J46k23J61j03K2J39n5q2K57k85J78j44K65k36q0K4K27k40N6
6294a21J95R5k56J41j7k5j6j25P0j08K60j19j28K89Ql9n5%K38m64K87j22j49K08
6318D7p3J62k42K03Q7j79q7m0J28n4Q1o2J21j01j2o9Q0q2J41L2j00R1k01J67p3
$$ plain form
6150 -119 15 -149 -99 43 3 76 -148 18 26 107 -123 19 -84 128 6 -10 2 -73 -31 -62 53 61 -60 158
6174 158 -12 -22 120 -28 -73 -45 17 -172 -45 135 40 -1 -80 -91 96 226 313 -57 -160 -69 14 82 -131 14
6198 14 -104 89 -53 64 -55 -2 -16 -136 69 65 24 8 -37 63 -10 -72 -117 88 -43 -4 -100 52 -57 -83 -220
6223 -220 70 -15 -26 176 63 77 -170 -118 63 -109 8 -1 -80 67 93 -144 -76 -186 44 97 4 -91 417 -258
6247 -258 22 66 -108 51 177 112 211 -37 130 147 -48 -57 11 3 -127 -84 -259 140 6 5 11 -49 -181 203 -106
6272 -106 34 -46 -148 -2 -225 -64 -167 -145 -6 -61 -143 114 -171 7 -137 128 -108 -188 -164 63 -177 -121
6294 -121 74 169 -87 54 37 12 -4 -129 -59 -167 93 -26 -154 135 143 104 49 49 287 -177 110 -12 -161 47
6318 47 -26 136 -106 97 184 5 -82 -122 6 -48 33 -29 92 -9 -21 -90 -10 -92 49 81 -19 72 -129 38 -35
6343c5K14q9m2j15O0J81k35OPL1j9n6J16k18J75l2r4J97j24J27J38l44L8K17q0
6368B4J09l05O3n4L18j38LL3Pj75Ll2L6K18P2L2l00PM7L7lQ7j19o0J99k10m6Q4
6396f3Nr2M8K64k69J23o5M4j01K54j13M9%J18j06k16k5J56k18k8K06j18J40j83
6420a90K13j76j8J66j67Q5J21P7j22J06q3K80j12l15R2Qp7J13p3j24L08j42Pk09
6444b32K35j06J66n0l2Ml7qL02k12J52j28J14m03J60R4q6L08k71K7O6j32J30k18
6468a57RJ17J40l38K30Q8m3p9J69m8L3m8k94J71j34J26L83k24j21j7K5l0K3K1
6492Bj52N3L35J4l67J06mj21L9J14j46J92o2J96j82j08K6Q8p8Q9J97j36j22j0
6516c7K07k95L67k47o5N8J90j64r6OO1j30J81jM1j45O3P4j71Q6j06J60j74J36
$$ plain form
6343 -35 179 90 48 -67 -7 174 -61 -55 -48 -17 -36 -92 24 -194 -19 -51 -145 52 -72 55 193 -151 -113 104 24
6368 24 133 -172 -109 -163 155 17 20 53 60 -115 -112 -144 -108 110 182 214 -86 -79 -32 5 2 89 -30 -90 109 -101 -147 -63
6396 -63 -58 -150 -102 162 -107 16 -49 -5 -106 148 35 84 84 202 96 -120 -145 11 -207 -235 -29 -147 -7 -190
6420 -190 23 -153 -171 -5 -172 -87 34 111 -11 95 12 292 180 -135 -43 -35 -112 1 -72 -196 112 -30 -23 -232
6444 -232 3 -103 63 13 -19 -15 -52 -60 242 30 182 54 168 -235 -75 19 -67 241 -30 -3 63 -69 61 -157
6468 -157 -148 -31 109 -229 1 89 46 -33 136 88 121 73 -221 -50 -184 -58 325 101 -20 -37 -12 -42 -19 2
6492 2 -150 -97 238 252 -115 -9 -13 -134 -95 19 -127 65 3 199 17 -91 -65 23 -55 34 231 95 -27 -37
6516 -37 170 -125 242 -5 -70 -12 178 14 -82 -76 -15 -145 36 35 76 -69 -6 68 -103 -17 -123 37 -137 -1
6540aq9O7K8J9n3L0k55K40q4o8R9kJ07m3M0j78J65J60k71k13K8K46j42M23m4k23
6566a4J22l8j2r3LK23N0m03J46k6o1K27l8j34K98j18l19J86R9qn0M4J1o5r8K6
6592d2K0j07j5J61P6m3j23R8L7k52J97J8q2M9L3L9k1rK9j55R8Pk35K98O3j0j00
6619B9J5m0lJ09p0k7N8J53j8k98Q5M6r2qm3K17j47q0J91j5L4M9j79o8j35J69r1
6646a59K05q3n9j81L47N7kj45o2Q0q2K15q0j56nL10q5j2m9p4l9o2M5J63k30L51
6672B08k71K27J0j56k6N8R3q3Kj87J84Q1k71L8J70j01K4q4R2j22p7J58K27j68
6696B6J20k34N8O6l7N9j97J88j35J9n7K29j65j19J00K11j57r8J01Q0k74J73J62
6719A19j52l2J61j37L5M0J7j18k1OJ55j34L3Q7k66L15l2j80lJ06k5L0J5P9j18
$$ plain form
6540 -1 -90 -23 5 24 -29 1 -254 -14 -98 -166 -67 -69 38 -5 35 -143 22 182 -89 -302 -274 -28 -170 253 209 -14
6566 -14 108 70 58 -35 -32 191 241 -162 -16 -42 -103 124 86 -48 250 132 -187 -1 98 90 40 84 95 30 -68 -42
6592 -42 -22 -129 -144 17 93 50 -73 25 62 -190 7 25 -57 -8 25 64 43 34 63 -92 6 13 -222 76 139 129 29
6619 29 44 4 1 110 40 13 71 224 206 -92 -7 39 -53 -61 -104 113 -34 -114 77 62 96 145 -34 -102 -237 -68 -159
6646 -159 46 -37 -96 -277 70 127 125 -20 -82 -2 -84 131 51 -105 -110 200 115 103 54 -20 -59 -121 -76 87 -143 208
6672 208 -63 164 174 18 -8 50 143 60 62 -125 59 140 -131 -93 77 -24 0 -84 8 -114 -191 -33 194 26
6696 26 146 -88 -30 36 -1 58 -139 49 -86 -67 -124 105 -60 -179 -79 132 -25 -123 -22 58 -216 -43 119
6719 119 -33 -65 96 -41 -6 34 51 -67 -88 -82 73 -61 -28 59 -207 108 76 -104 -107 -1 -26 4 19 98 -20
6744b0M9j14m4N4Q1l1j24K14J46l06J81j23J69j80N7j84K98p6o1LJ64k35R5j4
6768aJ34p8o1J15j82j59M85l40r1L15k52n3J57q3K10m3p8J51N5j53q0J24j93Q4
6792a7n3nl6Q5j25K15r7m8Q7o8J60l20K06P8n8j58K60l7l1J37P5j88p6J17l02
6817a99O3K45j73pRM6K9J36o0k00L1P4J4j26J24Mj56K78p2N7r4J77j10j81J20
6842B9RM7l89J77J02K08j70J8M0J08j39q6J02j14K9J12j29K46k15O5n7Q9j52J12
6866D2M6n7m7K3j35J17j91L63k77J77N3L8k06L6oJ12o4ql5p6o1ML4K56j73n4K0
6893f9k50M19k53J58k66L25j62j3%L20k88K71k83K6J70m8q8J22p6j67j05K49m
6916a2p9K38q6l3m8K14j51k7p7J43n1q2P2J85k72J3J9o3q1J39j67P2J04O0j05
$$ plain form
6744 -20 29 -85 -129 -75 6 -25 -149 65 211 -95 86 -37 132 -48 9 -175 123 47 -14 -11 153 -82 13 -1
6768 -1 133 55 -6 109 -73 -232 253 -87 -178 137 -115 -168 -11 -94 116 73 -5 146 201 48 -32 92 -101 -17
6792 -17 -70 -75 -111 -26 -151 64 -33 -81 6 -62 98 -222 -16 62 4 -154 106 69 38 175 250 62 -14 103 -199
6817 -199 -136 109 -64 -71 -62 -16 13 149 89 -111 -80 -6 8 -118 6 10 -146 132 60 117 23 200 90 -91 29
6842 29 38 85 -304 -127 -25 183 13 31 71 179 40 -46 56 -58 -29 83 -46 200 -15 50 -7 82 -70 42
6866 42 88 31 -16 7 -128 -11 -202 161 -116 61 114 152 -54 -18 -24 88 24 16 -19 -95 -156 -152 -118 138 -35 -89 -69
6893 -69 -319 100 -153 5 -261 64 -98 -111 -111 209 -79 192 -91 -65 105 57 -31 91 15 -152 -257 -8 -12
6916 -12 -91 147 61 28 -20 194 43 16 -61 82 31 -51 21 206 -66 -53 -34 -97 -178 -39 -206 -134 -30 30 -75
6941g5o0J58q7J20j22L51k69n1J85n5k31M8Q9Q6j03J19m0P5j34j29J59M2j0q3
6965a7N2j90K86j04n5J30j86K14J21j56k1j67n3J12J44k67J17rrJ64j29J22j03
6988dq6M8KjL7L8j7K30j97P2k1r8O2q8mK13q6J33k4l19M31l35o6N2J54j71J5L4
7016DQ7j73L3J80j10l4J7j59J44j67K51L9R4m8j57j11J59m1LQ7j47J63q4R0j33
7041a3n4NJ00m9K7M2J04N1k01m6kqJ16r6j89L52J58m89L87j77O9j65J24k70J10
7066a14J11p2Q2m7J39l7j49l1J77q3n3O7p6P3j92J85j22M30l06Q0j43Q0J16r4
7090B1R7l1p3j47N3J57p4k0k3O7K2J96j28j35%j91J22Q7l07L34j40J70k17K58
7114I8j52J09q9NJ8J51m7j52K8J13k9j69K16j68l9J75K0%k38J07k6J20p8J07R7
$$ plain form
6941 -75 -135 23 -64 56 -66 285 16 -35 150 95 -136 -88 1 87 -16 103 63 138 4 -125 34 76 66 -17
6965 -17 35 -155 131 27 -28 102 -84 130 251 95 74 -93 -146 -34 110 -157 -40 -49 -58 106 -23 99 -4
6988 -4 -90 -42 -40 -41 -4 34 17 247 50 122 101 3 65 -23 -27 186 100 233 209 -110 321 -14 -80 -28 126 -45 -30 4
7016 4 91 -82 -49 131 21 -13 4 -155 -11 -178 73 112 206 158 1 -110 49 8 11 98 -49 114 30 120 -13
7041 -13 -67 -62 38 -11 16 58 162 213 12 -34 -36 -44 72 -24 -213 139 297 -192 195 18 87 -78 46 -224 -114
7066 -114 -3 -75 7 -40 99 62 -87 -118 59 -24 -77 -10 -86 -13 -205 -20 -142 288 -18 62 -81 -1 115 21
7090 21 118 87 14 -133 -80 77 3 -17 -40 27 49 245 117 -18 -18 -209 -87 0 -307 27 -113 57 -160 98
7114 98 -54 55 -34 -29 -11 140 93 -59 -31 82 53 -116 100 -68 -107 68 88 88 -150 -43 -69 51 -27 80 177
7139A77k65K54k17J41Kp5j21M22m63j2oO4m2m0J16J34j94J07k6r3J08j79J76j0
7163d2o3R9P0J1J32k19Nj5Q6Kp0K31k07j22J92J54k55l6J06njj95J15N8p2M8L9
7190D6J22j85Q0p7J03k21J9K55k40PM6Kj3J35j08J8N1j11J35N1p0k11J96J06n6
7215H0k80J82k0Q3m3N2j00P8j12P7k24L25j20l4J84j87K02j48o2K2J20j46K91
7238B20k28J5j43l5L9M2N5J68j7j08j92Q8R7k15K30k2K7J48j84k0j2K18ok10k3
7263f8J36j40K00q3O0k25K09j2l6Q3q7q6M1j17J00J12k86K88j04J22j14M2j41
7286a06L3j74K55O5P9q5l01K18J51j65q9j6J00J58j55K3o9K4J68j09J61k03%J
7310c6N9K5K3L2l29J07K57j48o4o4M04j87k29L00j08o8R1K7J0j00J77l16J09J23
$$ plain form
7139 177 -88 166 -51 90 92 17 -104 318 -145 -157 -163 -99 -141 -181 -65 69 -125 -18 -44 -137 -29 -208 -32 -42
7163 -42 -105 -6 64 75 207 -12 -7 -22 64 66 -4 227 20 -102 90 244 -11 -47 59 54 53 -142 -27 31 -41 7 46
7190 46 168 -17 63 -14 89 -132 -113 142 -98 -91 -45 -43 -56 79 -29 -11 40 -71 64 115 45 -166 30 136 80
7215 80 -200 -18 -38 45 2 54 -46 32 -80 -3 -227 98 -22 -56 128 -59 143 -5 -67 -45 75 -71 220
7238 220 -8 7 -136 -171 -132 -90 -35 133 116 8 -184 -96 1 -214 16 -6 21 169 -15 -35 -47 171 165 -45 -68
7263 -68 68 -72 128 45 105 -120 89 77 41 124 37 -49 -8 -125 -25 87 -199 89 -15 107 -7 35 -106
7286 -106 -73 -247 8 73 152 67 -234 -16 135 -30 -119 -135 -35 123 -32 -9 -78 -54 114 5 166 -37 -37 -36
7310 -36 23 48 71 103 -226 -119 138 -10 -74 -138 266 79 -150 150 42 -26 65 92 102 2 179 -137 -28 95
7334I5p9n2J08j70J90k18K28k72P3j24K13J38p3j4j7J0k5q9J39R1j47n8N3n3K8
7359b5J9j8Q6j35J44Q8r1J21l23L4K72j05R4l78K75n7L6J45k23R8l6j11j69L31
7383G2j2k47K14J87l40K82k29J43J51k43p7J92O9j01j22q5J65j37J51oP6j99p9
7406a75J55J02Q2r4k0R9j11j88K17o3N3j45K07j41j27J03mK66k45L5j01o6P7J76
7430I2j06K3K05l33J50O3j31q2J85J22J24l57K47j55L9r1O4L9j91Q5j07J91k4
7453E2j76Q7J2O3L5p2o0J60k23m9O0K8J74r1j67K98j00m4k9J29j86J33R2k69J29
7478a4K2l3Q1J98j04j05k46P8M9LJ08J56j40R4k83L00ml23k4L02nN3j77n3J44
7503G7k53K72R7j78J06k50J43Q1j1J46Kj75K1J18j33Q1j9j47n3p7L3K77l5k35
$$ plain form
7334 95 16 -36 72 -98 92 -126 102 -170 -97 -221 -8 130 57 43 26 36 11 -78 61 152 5 -53 0 -53 -25
7359 -25 -6 -24 62 -73 71 159 68 189 -134 -100 172 67 161 -217 58 1 37 182 -41 57 21 -90 -259 72
7383 72 60 -187 27 214 -126 156 -73 70 221 -22 -99 93 162 61 -61 -146 19 -118 33 27 103 -96 -175
7406 -175 -20 82 164 70 50 149 38 -150 67 4 57 -88 119 -22 -149 -46 -50 216 -29 6 -95 -161 -84 92
7430 92 -14 9 214 -119 31 94 -37 -119 66 188 312 -45 202 47 86 -5 59 98 -93 -8 -115 76 52
7453 52 -124 -37 -25 38 73 1 -59 101 -122 -171 -111 -83 91 0 -167 131 31 -13 -42 87 -99 34 126 -143 -14
7478 -14 8 -25 56 254 150 45 -201 -123 -74 -71 37 193 53 147 -136 164 160 -163 -187 115 110 163 -14 -67 77
7503 77 -176 96 193 15 121 -129 14 95 84 230 232 57 78 196 63 144 125 -22 -75 -152 -119 158 123 -112
7527a12J37n1K66j36j83J32j83m2N02l42p2oj56M29k36j03m7L18j72J00J99k76
7549c4Nj33J73qr5o5nK43j17k33M83k96q3J09m4P8k4P4J08j17J8o0K63j74m0j53
7575a27K15M6j72p5K01n8j82O8J95k06K00j90J76q0J04j42K0j04Q0O8n3k0q0K00
7599H4M3r9p3K07o4j79q3J15OP8L7j93K26j15Q0r1J69m8K7j58J45k92K23J42j55
7624C2K02l41J17OKN5m1Q1j52j14J86Q8k18R8rJ18j75J22J98k78m9K63j97k4j22
7649a52J52J1k38J41J23l3k1O5n4J38j48M4O7j74k42L82j66K75j73n7K14j06j82
7672a34N2M9J97k49O3j79J04L40k2o6k41J72j30O5J9j83K34J31l96L02J05l19
7694h6K96j69J6q3M8n0j7J37k30J74j02Q5J9pJ12j61OM3K8j46M7R5q1R9Pk10R7
$$ plain form
7527 -112 25 -26 240 104 -79 53 -130 -172 330 -12 -84 -90 -246 183 -53 -156 -203 115 -57 43 242 -34
7549 -34 -29 -162 11 3 -92 -157 -162 81 -36 -269 214 -82 -165 -56 -100 -22 -46 28 136 19 37 -23 240 66 26 -127
7575 -127 88 134 -38 -113 88 30 -152 -84 111 -95 105 -85 91 11 115 -27 -7 -111 -31 37 -16 -36 -116 84
7599 84 127 28 -45 162 98 -81 -164 -49 -43 35 72 -121 105 -10 70 -21 148 100 127 -31 114 -178 45 187 32
7624 32 234 -107 10 16 18 73 32 113 -39 -153 33 121 -97 1 -8 110 -65 57 255 -23 -72 191 -6 -30 -152
7649 -152 0 11 -227 -86 37 4 -17 48 -6 132 -16 28 95 -79 -321 61 -105 170 -3 -60 154 48 -134
7672 -134 -82 -33 164 -85 -22 -201 -97 243 221 155 -86 86 -44 21 40 -143 91 222 -174 128 233 -86
7694 -86 210 41 57 -26 22 -28 -45 92 -138 36 -66 19 38 31 143 -18 -12 31 59 -87 -40 55 -26 73 80 -130 -33
7721c3j76K92k14N1j64K49O2o5j93K27J39j96J49j04N7k57L21k21R0J2j82P5L9
7744d2p6K2lK63j5l17L20j24k5j9M2j0n4Lj30K29J08p9o8L07l23oj10Q5J1r6k0
7771a27P8j71L08k15M3j3J77p6r9K75j10j47j6J8K3P3pJ94k23j01O6O7l4R2jk62
7797a88J60Q7J09k42q7J56p2J81j78J82m8j33k51K20K02P0l49L29q3k3J43k8q8
7820F9j12O3l0p4J55q8l2K3N7J45l6N0l4n0j86K12Rj23j94J14R6O6r8J34k6j93
7846h3J08n1KPM4J16l04q9M21j97l3J34m3p1NM6%K8k03L75k25m7J52o7m3J15k2
7873G5r9j08M7K6j6Q4Oqr7Q7n3J2J29l1j83K49j09K8Ok5j7j71L97rk20Q9j09o0
7901h0K39l09K86q1l9j81K46j05Q9k33J48j2%K6k76L43r4J04J5q3Q5k57K66j97
$$ plain form
7721 -33 -209 83 -131 -80 -244 5 67 2 -191 36 175 -21 128 24 81 -176 145 -76 14 26 -156 -81 -42
7744 -42 -118 -96 -99 164 149 -168 152 28 3 -16 26 16 -38 -35 -165 64 172 93 25 332 9 3 -107 -22 -11 -107 -127
7771 -127 -49 -220 88 -127 -84 -97 80 4 -95 180 70 -77 -93 -75 -52 21 14 208 -15 -116 -50 17 -17 75 74 -188
7797 -188 -28 59 168 -74 -161 -5 -77 104 -74 108 60 -73 -324 -104 98 168 -181 148 65 42 185 157 69
7820 69 -43 20 -10 -84 71 -17 -49 -26 31 176 140 190 156 106 -80 132 141 18 -176 -62 34 100 2 136 110 -83
7846 -83 25 -26 -24 -17 27 143 -161 -250 171 -26 -59 75 32 -39 -34 12 12 40 -163 212 -13 -60 92 25 -18 97 75
7873 75 -24 -132 -85 -59 -75 9 15 7 -90 -3 -56 -44 85 54 -129 120 11 39 45 20 3 -168 229 220 0 89 -20 -80
7901 -80 159 -150 136 55 16 -165 81 -24 65 -168 -20 -32 -32 -6 -282 61 -33 71 86 3 88 -169 97 -100
7925a00J05j2qJ50j34k89L75M0j73Q2Qj98L79m73J98j14K05P5k24J07N0L7o3j2
7949A1n7j41J66j97J61J82M3j91K5M0m4O4m2J48j29n9p0J17pj23K22p2j48K33
7973A32J0j75R3p6j33K41j53j62J17O3L34k45J66m0q2q2J08l8m0o2J21k47J57
7996Gj65J73J56j35J2j24J65M8np5k34N5l1L03m3j05j91j2j6O6K68k05J30j31
8020h9L4K89k33m2P1NN6J79l86K32j98r3J31l3QK02r5j22K7J18p1K11l89J93K28
8045B33k49p6K54j11j65M7k46L19j69J62J47k4k87L05j19j15K04m5j46J30Q2l32
8067b01L30j12k5j06J25j28L9M9K4K46j37k7k73K03J24j77K02k05j85L60J33m06
8089a47J72l1Qj31J77l13K19j4J29J88k80M8j72J86q8P5oj05J32J53n82L93M1
$$ plain form
7925 -100 5 -7 -15 135 1 -288 87 127 -46 36 44 -154 225 -248 -50 -164 41 116 -108 -1 49 86 23 11
7949 11 -46 -187 -21 -218 -57 125 168 -23 2 42 -2 62 20 168 39 -20 -90 27 20 -103 119 47 -101 132
7973 132 142 -33 60 -16 -149 92 -61 -223 -106 -43 291 46 212 172 90 8 116 78 38 -24 97 -150 7
7996 7 -158 15 171 36 48 -76 89 137 132 57 -177 -122 -153 150 107 2 -189 -201 -217 -151 117 -88 42 -89
8020 -89 -55 234 1 -41 30 35 91 270 -116 116 -82 -175 -44 -77 -69 133 38 -84 -57 61 -10 201 -188 5 233
8045 233 -16 -92 162 51 -114 -67 -313 6 -163 -1 146 122 -165 140 21 -94 110 65 -81 49 131 -201
8067 -201 129 17 -8 -114 11 -117 -78 -29 -5 241 104 77 -196 7 131 -46 156 -49 -234 126 259 -147
8089 -147 25 -6 2 -129 48 -265 -46 -60 69 257 -23 25 -147 39 -49 26 20 -85 47 200 -382 11 52
8112E2L4k66J01J27p2j81K41l3j69J79J91l57K37k99r2M51om4l35L92j34Pq3O7
8136HM3P8o9k31K51j13j47J15m8Q2J72j68K1k37N7J51J63j49L4j16j6J09O1k13
8160a62K47j2N3k09j09M9kL8K4k4Q3P9k83K08q5K9J11k52K53r1P1j43N8J24q4
8185b9jq7J44l3jJ48
$$ plain form
8112 52 86 -180 -79 48 -24 -205 36 3 -166 13 204 -153 84 -215 -307 144 138 94 -241 151 17 24 -59 8
8136 8 51 129 60 -171 80 -33 -180 -65 -113 -31 141 -27 -6 -243 -186 -35 128 -21 13 -103 -119 -10 51 -162
8160 -162 85 73 126 -83 -192 -143 -145 -107 -83 -107 -24 55 -228 -20 -105 -76 35 -217 36 -55 16 -127 -69 55 -29
8185 -29 -30 -117 27 -6 -7 141
8191A41
$$ Imaginary data points
##PAGE= N=2
##DATA TABLE= (X++(I..I)), XYDATA
0@%%%%%%%%%%%Qj6J6j6K4l2L2m0N6o4P2q8J04j20J44j68J92k24K56k96L38l81
33b03M35m91N50o20O97p79Q70r66J071j191J320j463J619j784J966k168K391k635
51a381K901l197L528l896M312m784N322n946O681p557Q623r958J1683j4009J7331
66I653k2495L1679n2841J89461L7689m00963R4069K23922j6705j44361K2619K5170
78c103L440L5034J9546r4463l8217O6877P8189P396o5058q7263N2567J12889l1446
91E6388j18982K2983J05346k137p7725K777J4735m0921K3423Q1371l7464r2874
103f3080K9425Q6330k3742o9179K3340M2707k3951J2625L9787n8477o2113O8953
115B625P3683n0195p3523K4699O2910n212m9483k7167J5211M4252R303l5485l406
$$ plain form
0 0 0 0 0 0 0 0 0 0 0 0 0 8 -8 8 -8 16 -16 16 -24 32 -32 40 -48 56 -64 80 -88 104 -120 136 -160 178 -203
33 -203 232 -259 291 -329 368 -411 459 -507 564 -627 693 -770 849 -935 1031 -1137 1254 -1381
51 -1381 1520 -1677 1851 -2045 2267 -2517 2805 -3141 3540 -4017 4606 -5352 6331 -7678 9653
66 9653 -12842 18837 -34004 155457 193146 -207817 -113748 110174 93469 -50892 -28273 -3103
78 -3103 337 35371 54917 -39546 -77763 -10886 67303 74699 9641 -77622 -25055 87834 56388
91 56388 -62594 -39611 65735 63598 -14127 -11350 3385 -37536 -14113 67258 29794 -63080
103 -63080 -33655 52675 28933 -40246 -16906 25801 1850 14475 54262 -4215 -66328 2625
115 2625 76308 26113 -47410 -22711 40199 34987 -14496 -41663 -26452 17800 27103 -8382 -11788
128a1788J3758j8098J2809M1461k9073n7536M6459Q6244n2110j12362M2111J04879
140F6754l4988p5841L0705M5294k8568l0594J7358N818j9288K1701L3441k6959
152D833l3204J5238K4149K254j4493o064K1823J2773k7318k6601J5365K8670j3421
165D004k4461K6588J4839m3254j2181L8525M067k5960J0189K6854j5953k4250
177b0993K3769J1330k8435J2143L5302k4005l3822J9026K2019j8789k0169J5061
189g563J7636q835j1197o953J840K0543Q91k1440R175J7977j1477o088J1853l569
203B793j3574J2972K1398k2874k9212K7773K2962l1503j8482K2231J2898j2291
215d909r624J0041L995r938O391J0621q129l356Q713O035l454j2738q53J4563
$$ plain form
128 -11788 1970 -16128 -3319 38142 9069 -48467 -2008 84236 32126 -80236 -38125 66754
140 66754 31766 -44075 -13370 31924 3356 -27238 -9880 -4062 -23350 -1649 31792 4833
152 4833 -28371 -13133 11016 13270 -1223 -7287 14536 27309 -9 -26610 -11245 17425 4004
165 4004 -20457 6131 20970 -22284 -34465 4060 8127 -17833 -7644 19210 3257 -20993
177 -20993 2776 14106 -14329 -2186 33116 9111 -24711 -5685 16334 -2455 -22624 -7563
189 -7563 10073 1238 -9959 -16912 -15072 5471 6362 -15078 -5903 12074 597 -5491 6362 2793
203 2793 -10781 2191 23589 715 -28497 -724 22238 -9265 -27747 -5516 7382 -4909
215 -4909 -14533 -4492 -497 -10435 -4044 6577 -1552 -4908 3805 9840 6386 -6352 -7205 7358
229G358k80j2298k245N630J887j1445n468J6400K502j4865N830J2376n995p673
243h286N032R833k802m080R894l263j6865P803J5135q520j3127J245J2593M91
257E083j7322l348J2678M810j448n682j873P968K099j809M238k127k258O665M13
272H087o520o223L504R755o526j2842P142N611q101j391N739L840l422m644Q179
287B188M578o981J819N346m41k66k905j525K696l593J135L584q253m457N547K964
303A436k945p246M509J1072o096p082P850L355l77J519n81P10j659j610M715k600
319D970p188L240K436l302n019l043P691K737q425K415N902l322P64K780J352
334C988J331j394J705J520n162K73K692k623k27k687k689L937l547m323O489J658
$$ plain form
229 7358 7078 -5220 -7465 -1835 52 -11393 -16861 -461 2041 -12824 -6994 5382 -613 -8286
243 -8286 -3254 6579 3777 -303 9591 6328 -10537 -2734 12401 3881 -9246 -8001 4592 5083
257 5083 -12239 -15587 -2909 1901 453 -5229 -7102 866 2965 1156 5394 3267 1009 7674 8087
272 8087 1567 -4656 -1152 8603 2077 -10765 -3623 1988 -6113 -7504 -1765 2075 -1347 -5991 2188
287 2188 6766 -215 1604 6950 6509 6243 3338 1813 4509 916 2051 5635 -2618 -7075 -1528 1436
303 1436 -1509 -8755 -4246 6826 730 -6352 1498 4853 4476 5995 5414 6124 4465 2855 7570 4970
319 4970 -2218 1022 3458 156 -4863 -7906 -215 2522 -5903 -3488 2414 -908 -144 2636 3988
334 3988 5319 3925 5630 7150 1988 2261 4953 2330 2103 -584 -3273 664 -2883 -7206 -717 941
350I41m585n15L450M779l078l079Q022J141n887L168Q07l795J131R83K42l653
366G2n038L661J197m584J656m55q08M797j779k481N252J436j6K120O37j254m881
383d68J847Q191o183q742O318N40n265J185q29l228J979O329J354j0308j853J3502
399D369J522n417K617j888j29P385j531r071k452P794N915q599p563K537p34K705
415b540N360r055n222J0945O424n711o274L339P513o4Q02J795r124j637J1158
430G709j994j0579j131N231L409l643m944q49k331O111Q527p769n130R678J401
445C696m844J943K002l230P68J0148K10j8264j756J5158m047r127O269L83n594
460f285L763K053q370l535J4304P878j1052m1P370r502p11J4777n204j1471R565
$$ plain form
350 941 -3644 -4159 -709 4070 992 -2087 5935 7076 1189 4357 5164 1369 2500 3483 3725 72
366 72 -4966 -1305 -108 -4692 -3036 -3491 -4299 498 -1281 -3762 1490 2926 2910 5030 5667 4413 -468
383 -468 1379 9570 3387 -5355 963 1503 -3762 -2577 -3406 -6634 -4655 1674 3028 -7280 -9133 4369
399 4369 5891 474 3091 1203 1074 8459 6928 -2143 -4595 3199 9114 515 -7048 -4511 -5245 -2540
415 -2540 2820 -6235 -11457 -512 5912 201 -6073 -2734 4779 4715 5517 7312 -1812 -3449 7709
430 7709 5715 -4864 -5995 -764 2645 -998 -5942 -6791 -9122 -3011 5516 -2253 -7383 2295 3696
445 3696 -1148 795 2797 -433 335 10483 10693 -7571 -9327 5831 1784 -7343 -1074 -691 -6285
460 -6285 -2522 -469 -8839 -12374 1930 9808 -1244 -1285 6085 -3417 -4128 10649 5445 -6026 3539
475C539R777j3090j5209Q910J0317q356l44P532p594k529P230n679l912J2792
489C384P817q300n466Q389j219j2635Q413J2563j2705m536J3838o202j8850K765
503a2744J6411R73j0733K651N716o021J294J770r025Q403J9310o745j6602L526
517a816Q247o703m438J2373o39j5356Q869J1256k1493j3023J9545J2981p142n523
531b862J887j791N6Q383m065j0630J5630J4511j7325j0842Q415l284n823J2994
545E254Q971j7216j2896J7848P018k2092l285J8444N065l40L0j2129p458J3887
559A101J2962j0223q750J3925L196j5709J436M076j4998M844K5475l983k8076
572a4724l230K0461J229j2702O138P686l415Q480N94k0990j547K1127L257j0275
$$ plain form
475 3539 13316 226 -14983 -6073 4244 -4112 -4456 3076 -4518 -7047 183 -5496 -9408 3384
489 3384 11201 2901 -2565 5824 4605 -8030 383 12946 241 -4295 9543 3341 -15509 -12744
503 -12744 3667 4640 -6093 -3442 2274 -3747 -2453 -683 -9708 -1305 18005 11260 -5342 -1816
517 -1816 6431 -272 -4710 7663 7024 -8332 537 11793 -9700 -22723 -3178 9803 2661 -2862
531 -2862 -975 -2766 -2710 5673 1608 -9022 6608 21119 3794 -7048 1367 -1917 -7740 5254
545 5254 14225 -2991 -15887 1961 8979 -13113 -16398 2046 7111 6771 6801 -5328 -12786 1101
559 1101 14063 3840 -4910 9015 12211 -3498 -2062 2014 -12984 -8140 17335 13352 -14724
572 -14724 -17954 2507 3736 -8966 -2828 4858 1443 9923 10517 -10473 -12020 9107 12364 2089
586B089K241K705j4140l074J8870n862k2263J6022K3860j6992k0669P704R504
599ej359M301O010p820l893J2374l411j6438P683J2369o811P54N822j4106j3306
614a7836J4306J4988j4559j0987J8854N805j8199j110Q366l154M964J1537m555
627H420j1710L208Q005q956o652J3111J604j1175N471K981j5756j258J6349J841
641E483j1849L346J1608q393j0912J0964M836p116Q375N494j2687k057R234n355
655I71j0432R356J1713j3086r233J3319k232j4704J0010J2297r121l458R704j277
669C827j0065L570R922n049k982J0705m073j2237N714L711q461J835Q103m589
683f9q253N351O179j0069k402J4864P36r881N173L151p905J463Q383k424p515
$$ plain form
586 2089 4330 7035 -7105 -10179 8691 2829 -19434 -3412 20448 3456 -17213 -9509 -5
599 -5 -1364 2937 8947 1127 -2766 9608 6197 -10241 -2558 9811 3000 3754 9576 -4530 -17836
614 -17836 -3530 11458 -3101 -14088 4766 10571 -7628 -8738 -372 -3526 1438 12975 8420
627 8420 -3290 -82 7923 -1033 -7685 5426 7030 -4145 1326 4307 -11449 -12707 3642 5483
641 5483 -6366 -3020 8588 195 -10717 247 5083 -2033 6342 11836 -851 -2908 6326 971
655 971 -9461 -105 11608 -1478 -10711 2608 376 -14328 -4318 7979 -1142 -4600 5104 3827
669 3827 -6238 -2668 7254 2205 -777 9928 5855 -6382 -668 3043 -5418 -3583 4520 -69
683 -69 -8322 -2971 3208 -6861 -9263 5601 6337 -3544 1629 4780 -3125 -1662 6721 4297 -3218
698c218N100P274j0191p650Q817O15n972N355J444p686O64P092j300o212M558
713a310Q175m410l167N390l937m052Q687P00r129J353O387m007p648L598N366
728A996o540r81Q687l465o749O988L156m500J254M504o97l806K137K937n328k089
744b496N800j518l766K166k257k169K473J300k117j837L631M031n126j466O046
759B695l29k211M015k75l580K65L178j029n494M66N378m263l426L833j470k100
775d347L974K95k495J293L286L1k698J900L249l483J38L950m540k174M179j621
791I37l510J123J193j809j777K534J455m036J401M586k723l47L168j089R9J887
807C092o33o64p79M24Q61k679r80J137k179J015O60k892P43K343k40L16p69J270
$$ plain form
698 -3218 1882 9156 -1035 -8685 132 747 -5225 130 1574 -6112 -5448 1644 344 -5868 -1310
713 -1310 6865 2455 -712 4678 741 -3311 5376 6076 -3053 -1700 4687 680 -6968 -3370 1996
728 1996 -4544 -5525 3162 -303 -7052 -64 3092 -1408 -154 4350 3653 -153 1984 4921 -407 -2496
744 -2496 3304 1786 -1980 186 -2071 -4240 -1767 -467 -2584 -4421 -790 3241 -1885 -3351 2695
759 2695 2366 155 4170 3895 315 580 3758 2729 -2765 -2299 3079 -1184 -4610 -777 -2247 -4347
775 -4347 -373 -78 -2573 -1280 2006 2037 -661 1239 4488 1005 1143 5093 553 -1621 2558 937
791 937 -2573 -1450 -257 -2066 -3843 -1309 146 -3890 -2489 2097 -626 -973 2195 1106 1205 3092
807 3092 2459 1795 1016 1440 2301 -378 -1358 -221 -2400 -1385 -725 -3617 -2874 -531 -771 -455 -1224 46
825D6K527j256L35J398j907P98J295k500m50L68o56k46k010K4J843k126J64J728
843f25j426P23J991j031O52J148L64L13j058J082Q81k559M82R73l198N39J159
860D10k324l26J19M02M90j357J085J658r77J884J271j967J066J446r00Mq43l56
878G85R49k144m31O60k310O12J455j780J96P72P1R11k73K92J204p65K462Q84l905
897c55O98K911j801j274R7l87k88j057O54q59k534K623K246k535M36J102j206
914a529K065K216j564j120J689K646j740m410K286J585k873Q07N32l301j81J735
930a157J52j102j141L029J827j786P93J4k229L360K944l288j610J760R67k042
946D91k953K127P98k656K497N92m924K41L543o50k34J465R36r21P4K606k372l282
$$ plain form
825 46 2573 1317 1652 3050 1143 1941 3236 736 286 654 -2 -248 -2258 -2234 -391 -2517 -2353 -625
843 -625 -2051 -1328 663 -368 284 1432 1796 2109 1051 2133 3014 455 937 1910 -1288 -749 410
860 410 -1914 -2240 -2121 -1719 -1229 -2586 -1501 157 -820 1064 2335 368 1434 2880 1980 1984 1141 785
878 785 1734 -410 -841 -181 -2491 -1879 -424 -2204 -2008 -1236 -1165 -254 -527 -235 969 204 2666 3550 -355
897 -355 343 3254 1453 179 276 -111 -399 -1456 -802 -1661 -4195 -1572 674 -1861 -1425 -323 -1529
914 -1529 536 2752 1188 68 1757 4403 2663 -1747 539 2124 -749 58 590 -2711 -2892 -1157
930 -1157 -1005 -2107 -3248 -219 1608 -178 615 629 -1600 1760 4704 1416 -194 1566 2533 491
946 491 -2462 -335 463 -2193 304 896 -4028 -3787 -244 -894 -1128 337 1273 352 426 3032 660 -2622
964b622O039K370n959j31K748l372k994K742K498k643k396M383n43m723K502K614
980E13j859L242K718l554j997K521O87l269R72N016l023n201M565j69p066J560
996d344O982j678l495J661J699l637q89N701j12k762M776J004o295P50K553k476
1012e62k33M244J80n791j972M556k407m158N748K784m129J346K275l766j654M265
1028G26L708k413l44K790m010m019N505l91n665L982N762m865o714K231L767k806
1044b756m4O566j797m898L836J538n151O14N409Q87j671j04j605m622J552N698
1060C452m210l740P183Q97q401m74M684j231j009N667L022o852k218O499j739
1075A530m616N309K939l763j50N69m695k809N105L670m621r25M879l431m576M871
$$ plain form
964 -2622 3417 5787 -172 -303 2445 -927 -3921 -1179 1319 -1324 -3720 663 120 -4603 -2101 513
980 513 -1346 1896 4614 1060 -937 1584 2271 -998 -26 4990 1967 -3234 1331 1162 -5904 -4344
996 -4344 2638 960 -2535 -874 825 -2812 -3701 2000 1888 -874 3902 4906 -1389 -639 1914 -562
1012 -562 -795 3449 3629 -2162 -4134 422 -1985 -6143 -395 2389 -1740 -394 1881 -1885 -3539 726
1028 726 4434 2021 1677 4467 457 -3562 1943 1552 -4113 -131 5631 766 -5948 -3717 50 -2756
1044 -2756 -2800 3766 1969 -2929 907 2445 -2706 -2092 3317 4204 2533 2429 824 -3798 -2246 3452
1060 3452 -758 -4498 2685 3582 -4819 -5293 -609 -1840 -2849 2818 5840 -1012 -3230 3269 1530
1075 1530 -3086 2223 5162 1399 1249 1818 -2877 -5686 -581 3089 -1532 -2457 2422 -1009 -5585 -714
1091g14J586l183L722M430l267m951J709K697l000J304N323m141m291M402r67
1106F59p015K268O538j130l820K734J469o039K92P722j725l664N419J403n582
1121d71j350K547n20r86L292P28n619k21L354l998j899N992J249l725J765K003
1137B141l664k144M964L323m451K21M359l586m443L507J044k355J025K420j947
1152D14m028J070K546k730M91M686j373k179K416n24k757J971L566o21l158J738
1168A528J223m484q09L582j431k032L651k44m256m50L036O52k197K889K325l251
1184b68j046L889k118k545L655J575k597j006R35o03k485J262K570k707m5K685
1200A151k314j756K472O05q79J515J620j089k087K108J136l022L4L660k159k813
$$ plain form
1091 -714 872 -2311 1411 5841 2574 -2377 -668 2029 -971 333 5656 1515 -2776 1626 659
1106 659 -6356 -4088 2450 1320 -2500 234 1703 -4336 -4044 3678 1953 -1711 3708 5111 -471
1121 -471 -1821 726 206 -780 2512 3240 -2379 -2600 754 -3244 -5143 849 2098 -1627 138 2141
1137 2141 -1523 -3667 1297 4620 169 390 4749 1163 -3280 227 1271 -1084 -59 2361 414
1152 414 -3614 -2544 2 -2728 -2237 2449 1076 -1103 1313 789 -1968 3 3569 2948 -210 1528
1168 1528 2751 -1733 -2542 1040 -391 -2423 1228 984 -3272 -3722 -686 -34 -2231 658 2983 -268
1184 -268 -1314 2575 457 -2088 1567 3142 545 -461 474 -129 -2614 -1352 1218 -1489 -1534 1151
1200 1151 -1163 -2919 -447 158 -721 794 2414 1325 -762 1346 2482 -540 -506 3154 995 -1818
1216a818J792K10k276n75K741P18k916Q43K529k371o10L077m02q55J608N23j700
1233E18q19J364L70k337J008J388l011j90K214j923j323K704N47j564oJ957O3
1250I60k316J929K008k655L92K493j786j731J143N90j230q62Q76J05j670L65J291
1267i8j463K43J984r25J08J079j00j53j54O89L92j768R58J047k651k4J571j410
1285f75p81N22O80q08r18J823R12k116J026K089j289o05J665o43p32N80K47m76
1303E01q92O34l4j449O23O42j939P39J297j377j59J349O01o03j65J674k6j490
1321g4J344Q42k115J16Q23j218m15K72q1k08p11Q05L25j117R33R43q84P28O37
1340I45n99N83J81j09k06k90K86%j548J041L05k039P19M67p07m33O83N92l50o65
$$ plain form
1216 -1818 -26 184 -2092 -2667 74 792 -2124 -1281 1248 -1123 -1733 1344 942 87 1695 2218 518
1233 518 -301 1063 1433 -904 104 1492 -1519 -1709 505 -1418 -2741 -37 510 -1054 -1060 897 960
1250 960 -1356 573 2581 -74 318 2811 1025 -706 437 1027 -203 -1065 -189 -84 -1754 -1389 -98
1267 -98 -1561 -1318 666 -259 -151 928 828 675 521 1210 1602 -166 792 1839 -812 -836 735 -675
1285 -675 -1456 -934 -254 -1062 -1980 -157 755 -1361 -335 1754 465 -140 1525 882 150 730 977 501
1303 501 -391 243 209 -1240 -617 25 -1914 -1175 122 -1255 -1414 -65 536 -67 -232 1442 1416 -74
1321 -74 1270 2112 -3 113 936 -282 -697 -425 -506 -714 -1425 -620 -295 -1412 -479 464 -420 308 945
1340 945 346 929 1110 1001 795 505 791 791 -757 284 589 -1450 -731 -264 -971 -1404 -721 -129 -479 -1144
1360a144J686L01j284J151J122j574R7P92m63k79j32Pp00l08L91l81r21J107N05
1379b7j350J193P62j025L40R22L22q28K64J058q57j095J191j32j292O12J24j203
1397a021o2N78J28n03m14J253m7o53J195J50q90J163M86q90M22l1k47n01k09P17
1417F24r44r82J530n34j472O15J186q07J70N68P50n89j33J328o31q84J634k67
1435A162j215O07n8j249k4R59k47j189K09J593j599r55K361k9j008J270N49r74
1453A63k46P92J79p51N30R14j397p12J210j129j552J751O07j128k95R28J41j352
1471a347N33J926n60n45J608o67j474R64P11j066oJ027l71j924K93J189j708n23
1489a940K597P8k114P17J146j099m98J667R87j016l4J048j888o04K007p27j111
$$ plain form
1360 -1144 542 843 -441 710 1832 258 355 1147 684 405 273 280 -420 -728 -337 -718 -1639 -532 -27
1379 -27 -1377 -184 578 -447 -107 815 1137 309 573 1631 774 -321 870 738 -554 58 182 -1021
1397 -1021 -1083 -505 -377 -880 -1294 -41 -88 -741 454 604 -286 877 1363 473 895 864 617 116 -93 624
1417 624 -320 -1302 228 -306 -1778 -1163 23 -784 -614 -46 704 115 -18 1310 679 -205 1429 1162
1435 1162 -53 554 496 -753 -777 182 -65 -1254 -1045 548 -1051 -2006 355 326 -682 588 1137 163
1453 163 -83 709 888 137 667 1581 184 -528 682 -447 -1999 -248 359 -769 -1064 -136 5 -1347
1471 -1347 -814 1112 552 7 1615 948 -526 438 1149 83 77 1104 733 -1191 -898 291 -1417 -1940
1489 -1940 657 735 -1379 -662 484 -615 -1113 554 1541 525 491 1539 -349 -953 1054 327 -784
1506g84J771J29k334m46J246J76j796J629K356k121j218K011N3j717J413J549
1522A917o27q76M43n05j784P68J539j341j46J629j381j739J207Q72r67K92K209
1539A510m3k285J63J642j352k2K520o12j759P98j03j485p21J959Q21k007M79J388
1557H91k367q81K577M73j324J359J172j319j274Q37N83j418J319J589k065j092
1573i40J420j026j337J433J186j077m72J331p36k172J535K636j464n94K295p48
1589A270k125L1J636m88p07J509O9k398k38J140j164J00J763J11j013N48P7j033
1607i12k93K028Q41j487O44R62k331o91K033l77r77P11Q41j472j634J468M61j290
1625a475R90J881j374q69J281j53j137R49J472m77q73L63j48j750P92J124r95
$$ plain form
1506 -784 987 1116 -1218 -1664 -418 -242 -2038 -409 1947 -174 -1392 619 672 -1045 368 1917
1522 1917 1290 414 857 352 -1432 -664 875 -466 -612 1017 -364 -2103 -896 -24 -991 -699 1510
1539 1510 1467 -818 -655 987 -365 -387 2133 1521 -238 560 457 -1028 -1749 210 1031 -976 -497 891
1557 891 -1476 -2357 220 693 -631 728 1900 581 -693 144 727 -691 628 2217 152 -940
1573 -940 480 -546 -1883 -450 736 -341 -813 518 -218 -2390 -855 1781 317 -277 2018 1270
1589 1270 -855 -824 812 324 -383 1126 1195 -1203 -1441 -301 -1465 -1365 398 509 -504 44 121 -912
1607 -912 -1205 823 1664 177 821 1783 -548 -1239 794 417 -560 151 992 -480 -2114 -646 -185 -1475
1625 -1475 -485 1396 22 -847 434 281 -856 93 1565 1088 215 578 430 -1320 -528 596 -399
1642c99j14J308r19j390L39J057m18j45J868J16k256O60J368j369k63J916o3j106
1660A90k36M84j070q35J402P73j236j21R81j125k82P66N77k92N10P23o40r49Q39
1679D59J47j048J088N41j262o88Q34m36q04L64J342l64p76N35M14j390M08J383
1697G47j33o69R21J04p47m64M93K51q68P88n4j104J81M63p63QO88L26n70J33M54
1718A85k24k48Q66O39j166J86P68r58m24N48L06p59K6N84m44j084O07P97o83P5
1738d03O88j26j21j31L36K13k57K34K61n11J44m7n59M4J48l35R9J98j8k32l41
1759g16Q72L5n00N90L82q54L95K63j17K7l4K32l79n27K54K22p23K60K69k87M2
1780b94J53j36K35j30K95J31j41K49J91m55K88n8j20k05L09j66l01l7P2k11o79
$$ plain form
1642 -399 -513 795 -124 -1514 -1175 -118 -536 -681 1187 1303 -953 -293 1075 -294 -557 1359 1296 190
1660 190 -46 438 -632 -1467 -65 708 -528 -649 332 -793 -1075 -309 268 -24 486 1209 569 -380 459
1679 459 606 -442 646 1187 -75 -763 71 -365 -1169 -805 537 173 -603 -68 346 -1044 -636 747
1697 747 614 -55 866 970 223 -241 252 503 -365 423 369 -735 -554 -91 -854 -846 -158 168 -402 -269 185
1718 185 -39 -287 579 1218 52 238 1006 48 -376 172 478 -281 -255 329 -115 -1199 -592 205 -478 -403
1738 -403 285 159 38 -93 243 456 199 433 694 183 327 280 -279 -235 -87 -422 -323 -125 -143 -375 -716
1759 -716 156 191 -309 281 663 -191 204 467 350 377 343 575 196 -331 -77 145 -578 -318 -49 -336 -294
1780 -294 -141 -277 -42 -172 123 254 113 362 553 98 386 328 208 3 312 146 -155 -192 -120 -331 -1010
1801a010P12M40n74M7N15r4j40M01K3M5k09L17J55o46L54K13p44j1K09l05j0j02
1823d14J28L2k89j07P51r23R58K77k90L06L51o10j19L57j5l28l06M57k74o59M98
1844b19J55n17M62N6j23k03L13K07N8J3K51k17k17O06l48m14L30K12m45j41J58
1865b3m6l78q7M33k4o69O91L20n04L89L81l81L09k32J02j02j96L11k14n65M54
1886c1k00k38L40O9j27k07L44j30q6K04K55j02l02P54j2o51O79j55n75O8K99l90
1908a94j14N86j84k66l66M79l37j97N93J24k65K30L65k95r9j21N18j52l50P82
1928G37n18l66O1j58k18K20L86m44j83M59K45m18j16O45J7l38O55q2o56K79K72
1949D79n4n63l8L04m46j36N61n51k15Q96l53k60K40K71l46p9N79N05n92j02O35
$$ plain form
1801 -1010 -298 142 -432 -385 130 36 -104 297 320 365 156 473 628 -18 336 549 -195 -206 3 -302 -312 -414
1823 -414 -286 -254 -543 -650 101 -822 136 413 123 429 780 170 51 408 393 65 -241 216 -58 -717 -219
1844 -219 -64 -581 -119 -63 -186 -389 -76 131 189 202 453 236 19 625 277 -137 193 405 -40 -181 -23
1865 -23 -69 -447 -534 -101 -125 -794 -103 217 -287 102 483 102 411 179 281 179 -17 294 80 -485 -31
1886 -31 -231 -469 -129 -60 -187 -394 -50 -180 -266 -62 193 91 -211 543 531 -120 559 404 -171 -103 196 -194
1908 -194 -308 278 94 -172 -538 -59 -396 -593 0 124 -141 89 454 159 60 -61 457 305 -45 737
1928 737 219 -147 -86 -244 -462 -242 144 -300 -483 -24 221 -197 -313 332 349 11 666 584 -72 207 479
1949 479 425 -138 -176 128 -318 -454 107 -444 -659 237 -116 -376 -136 135 -211 -290 289 794 202 100 735
1970G35o67p05N84K41n36j15Q44o07p25M88J03j19K73N75l97k51O26l53j70M88
1990C12M46p04RJ60L0p13K1R05p16j51L42j73o60L74P39l36J34K39M43r54J83
2011g0N33m42QO17r1p94J36P4j42n35O13K52n54J47K18n76k40J010N1l21M45K70
2033F09n12m36N07J32q61O97Q06j031m00P03o24j49M80M70m45m53O25k27n91P26
2053B6Q07n21k22P36m23p94M41L37n15l6O25j3j235K10O73n51j87J058j42o61
2073c87L70K73n07RP72J95p12K32L44q96k41P80n8m78L13K35n01m59M52r7k99
2094f60R25O12r96j15O08l06k23L87O41n33k49K33k55q77O80N12m48k42O65n05
2114a46l95J51L06j76M4O30Po62K47L80n30J83N75l57j19p3l03j94k98P53K11
$$ plain form
1970 735 68 -637 -53 188 -348 -463 381 -226 -951 -463 -360 -479 -206 369 -28 -279 347 -6 -176 312
1990 312 758 54 63 223 253 -460 -439 466 -250 -401 -59 -232 -892 -518 221 -115 19 258 701 -253 -70
2011 -70 463 21 29 646 555 -239 -103 -29 -171 -706 -93 159 -395 -248 -30 -606 -846 164 215 -106 339 609
2033 609 97 -339 168 300 -561 136 942 -89 -489 214 -410 -559 -79 391 -54 -507 118 -109 -700 26
2053 26 833 312 90 826 403 -391 50 387 -128 -164 461 448 -787 -577 96 -455 -642 416 274 -387
2073 -387 -17 256 -251 -242 530 725 13 245 589 -307 -548 232 174 -304 9 244 -257 -716 -264 -361 -660
2094 -660 265 877 -119 -234 374 68 -155 232 873 340 91 324 69 -808 -128 384 -64 -306 359 -146
2114 -146 -541 -390 -84 -260 -216 414 421 -241 6 386 -144 39 614 257 138 65 -238 -432 -730 23 234
2135B34o40J74M47o90L0M46K4mK21K80l35l26J59J88n45N15M29p64q9K56m12K3
2157c79J88K80j34l95M01q6l03M75M74l46q3M03k25l39K68j08r1j8J62k06m59
2178e21M25Pm34J95N14J88o04J54J11J43l29R85m43k63M82k59l02j08P5K55l86
2199a15K20M13r18m71N60K27K25J56j06L28m36j1J96k36N60m4o17Q9K35l86j10
2220b41j51K40k05M81J60n34k58K30L28N23n36J13R9K16q11L10K8q2O96n33r4
2241b1J97j0p08Q78l35J29m92R28n68K35K38k31r9j61k53K45O30j024N14n10J41
2262b77J73l97j52O26j60M71l87p04N23r8K39o09O30r2O23j3o82O53kL16p37J55
2284I9j6k0k81N96o88K27O2l07O04p45O09M72o98P51j134J472j459O61M5l30O75
$$ plain form
2135 234 -406 -232 215 -475 -445 1 25 21 242 522 187 -139 20 208 -337 178 607 -157 -246 10 -402 -379
2157 -379 -191 89 -45 -440 -39 -125 -428 47 521 175 92 495 270 -69 199 91 0 -18 144 -62 -521
2178 -521 -96 -89 -523 -328 186 374 -230 -76 35 178 -151 834 391 128 610 351 49 -59 16 271 -115
2199 -115 105 518 -400 -871 -311 -84 141 297 191 519 83 72 268 32 592 548 -69 20 255 -131 -241
2220 -241 -392 -152 -357 124 284 -250 -508 -278 50 573 37 150 249 465 -346 -36 -8 -90 606 73 -21
2241 -21 176 166 -542 336 1 130 -362 566 -2 233 471 240 141 -20 -273 -28 602 -422 92 -418 -277
2262 -277 -104 -501 -653 -27 -187 284 -103 -807 -284 -382 -143 -752 -122 -214 409 396 -286 367 365 681 -56 99
2284 99 83 63 -218 378 -310 -83 -21 -328 276 -469 140 612 -86 665 -469 1003 -456 205 250 -80 595
2305E95o08M80o02q3l8P7n25L17L98L38k39K7N2j97L9j7J80k81J91J74l36k44
2327c02J46J60j17KR7j86k73P17l69P4l53N34l09M41l33K1o3L7L20l41K63p2O4
2350A58k74K77k85k%k2R6j61N5n4N3r6L87j74j07R0m5M7L34n5o0q2o8O7l7k41
2376a99L50j86l53M85k53M1m1K33q3K12j57mK50j43N6j84j74M80l82M32l67K01
2398B14j3o4m32L83N5l0j06K81p05P70l80p66J645k10K7m02k17m14J17K74M34
2419D61r25N50J50L14o56J09oj35J65k95K1q6N48j52L55k19l55k7J14K10k24n4
2441a37M8J74j65J68l11M87k82k4J40k71J74J24j06j57J64o4o6K55lj62L2M3o4
2464cok02L59k83j1K41k34j48J18L09k38k74L64P8j13j08K24M3j88J16O2j12K6
$$ plain form
2305 595 -13 467 -135 -218 -256 -179 -704 -387 11 349 110 137 189 -8 31 14 194 -87 104 278 -58 -302
2327 -302 -156 4 -113 -111 -14 -200 -473 244 -125 -51 -404 130 -179 262 -71 -50 -113 -76 244 -97 166 94 158
2350 158 -116 161 -124 -126 -126 -148 -52 -213 -158 -212 -159 -255 132 -42 -149 -59 -104 -57 277 222 162 80 12 79 42 -199
2376 -199 151 -35 -388 97 -156 -115 -156 77 -6 206 49 45 295 152 208 24 -150 330 -52 380 13 214
2398 214 201 137 -295 88 143 113 7 288 -417 353 -27 -793 852 642 669 267 50 -364 -247 27 461
2419 461 -464 86 236 550 -106 3 -3 -138 27 -268 -247 -333 215 63 418 199 -156 -183 -69 141 -83 -137
2441 -137 -89 85 -80 88 -223 264 -18 -42 98 -173 1 125 19 -138 26 -38 -104 151 148 -14 18 61 -3
2464 -3 -9 -211 148 -135 -146 95 -139 -287 -169 140 -98 -372 -8 70 -43 -151 73 116 -72 44 106 -6 20
2487B0j38J45J3LM9m06J65L74k90N3M0J27k00K17j35j39j49M15J75m45J88R1k29
2510e6Q6n1k60l8L50j94R8M7K39l55J44K6Q1J03q7K28k37j34l2Q3p6j65J67K53
2534B20o43L27N9m05K69k23O08k49J90m08m60L26N43o5L24k65j42j46K7K94q2
2555I9k67K77K12l35j79K73l50L22L14k44k71J50j2j68J11J14O9l8r6K47k80k44
2577b96K97O1n4O9m9j69p0J53Q1j67K4R0rL9j01L38l87J79J89q8j44j04J87l67
2601b98K94lqk80K70m0q4j11K04J64n2j33L50l47j68K70J76k79L46j92l19j7L14
2624E7k52L8J00J46r2NQ0j68j72L41n5J25j0n6j08j51J38K11p4k69P6J38j25K12
2648A35k0j38p3K03j85p5j3K27j18K7J18J19l76K84l9l3o1l3O3q0Lj07jj47O02
$$ plain form
2487 20 -118 27 40 43 92 -314 -149 225 -65 -12 28 155 -45 172 37 -102 -251 164 339 -106 82 173 -56
2510 -56 30 -21 -281 -319 31 -163 -65 -18 221 -134 10 36 117 220 133 361 124 -10 -42 41 -35 -200 -33 220
2534 220 -423 -96 -37 -442 -173 -396 212 -37 153 -255 -715 -389 154 89 413 148 6 -140 -113 181 99
2555 99 -168 109 321 -14 -193 80 -270 52 366 122 -149 1 -11 -179 -68 46 115 77 -19 228 -52 -296
2577 -296 1 62 8 77 28 -141 -211 -58 23 -144 -120 -30 -39 0 -101 237 -150 29 218 130 -14 -118 69 -298
2601 -298 -4 -7 -15 -295 -25 -65 -149 -260 -56 108 56 -77 273 -74 -242 28 204 -75 271 79 -240 -257 57
2624 57 -195 -157 -57 89 -3 2 82 -86 -258 83 28 153 143 87 -21 -172 -34 177 103 -166 -90 48 -77 135
2648 135 115 -23 -96 107 -78 -153 -166 61 -57 -30 88 207 -169 115 76 43 -18 -51 12 -68 -65 -172 -173 -320 282
2673B82n29J30Q0O8j01J30P0j35N2K43j82n6m1j21J52p3M1M1Q6j26jj60N1O7K20
2698A88j78k7J41j29j25Q6J52p8K2Mj90O5j5N9p7K81l93K81j88P8j59o1L27l8
2722B6J9k8p2j81K05j85M95k57j35K08k30J58r7K71l90L6P5oL9P4j3R7j2l1L6
2747A02P3j79j8Q3o2L0j30N7Q1j96J68M5j97P1N6k2L1j03J3L7O1M5P2k41j1K71
2773A37J98l79RN3k2j1J38O8l43M3j23M46k75J54j70R0J8r1J56l6ON6p1j79J87
2798E9j18R8M0j38n1J90N9k20J34J69k77M6j38M3j03K83j01J36j50R3j51J10Q8
2821A01O5k41oP9n2Q1Nj78O0J6L7NJ49k07k5J84N4k64J39M3j9m6J15k16J88o9
2847bm1n8mM7J75M5j36m5m0R0l7k67L12J13o4L7o3k67J59M6l4K0L3l37K75J83
$$ plain form
2673 282 -247 -117 -37 31 -70 60 130 -5 47 290 108 52 11 -110 42 -31 10 51 137 11 10 -150 -99 -32 188
2698 188 10 -17 124 -5 -130 -44 108 30 52 56 -134 -69 -84 -25 -102 179 -214 67 -121 -43 -202 -263 64 26
2722 26 45 17 -55 -236 -31 -216 279 22 -113 95 -135 23 -74 197 -193 -157 -82 -88 -49 25 12 109 97 66 102
2747 102 175 -4 -22 61 -1 29 -101 -44 37 -159 9 54 -143 -72 -16 -38 -7 -110 -97 -60 1 46 118 -123 -134 137
2773 137 335 -44 -35 18 -4 -15 123 191 -152 -109 -232 214 -61 93 -77 13 31 -60 96 60 66 122 51 -128 59
2798 59 -59 39 79 -59 -110 80 139 -81 53 222 -55 -9 -147 -104 -207 76 -25 111 -39 54 -97 13 101
2821 101 166 -75 -81 -2 -54 27 32 -146 -86 -70 -33 -28 121 -86 -111 73 127 -137 2 45 26 -20 95 -121 67 -2
2847 -2 -43 -101 -105 -58 117 162 26 -19 -59 31 -6 -273 39 152 88 125 62 -205 -46 0 -34 -14 19 -318 -43 140
2873A40j55J13k71J1K11k49J78M1j0l9j08K25j97M9k13J25J97J88l34R7N2j32
2895h1J22P7r7L6r2N5n9J04ok44L22j00l9L6j8k2rK4O4k72K68o6p6J45P6j45N7
2922F0J48k47l2R3j21J00P9p1J9o1J6l1j36J64J52j49J07J15r3o5q1Q0k09k4M
2947a83J64K6J4l1N6m0j90J36Q1m1o9K0Q4%J10j61j22J79J6j17J75p9KJ4j57k8
2973a41K46j40J79k52L01k28J74j78K3J65j43j19J62j16Qn8K08p3j31K20j66M1
2995a8r7J74Q7q8l03Q9L28M4l07K90k40O3o3p6Q6k08M43k51K2J24l14K56J20k37
3019g6n6Q7k7K89j32n4m5J43j46J64j68k6p4o6J47k5m6pK24j78j1K0O3K9r7J2
3045e6J35R8p9R4j92n3Pj17J70M4J4k1j25M1J42o7m7J4j43j4R2J87n7j93K03j88
$$ plain form
2873 140 -15 98 -173 -162 49 -200 -22 19 9 -30 -138 87 -110 -61 -274 -149 48 236 -98 -1 51 -81
2895 -81 41 118 21 57 -35 20 -39 65 59 -185 137 37 -2 34 16 -6 -15 9 73 -199 69 3 -73 72 148 3 60
2922 60 208 -39 -71 22 -99 1 80 9 28 -33 -17 -48 -184 -20 132 -17 90 205 112 47 -34 46 -163 -187 -183
2947 -183 -19 7 21 -10 46 6 -184 -48 33 -8 -77 -57 27 27 137 -24 -146 33 49 -68 107 28 30 44 -113 -141
2973 -141 105 -35 144 -108 193 -35 139 -39 -16 149 6 -113 49 -67 -59 -117 91 18 -113 107 -59 -18
2995 -18 -115 59 146 58 -245 -156 172 216 -91 199 -41 22 -41 -117 -31 -239 204 -47 -25 99 -215 41 161 -76
3019 -76 -132 -45 -72 217 85 31 -14 129 -17 147 -21 -47 -121 -187 -40 -65 -111 -118 106 -72 -83 -63 0 29 -68 -56
3045 -56 79 177 98 192 0 -53 -46 -163 7 51 65 44 -81 -40 102 35 -12 2 -141 -155 -63 124 67 -126 77 -111
3071a11K85l29L21l09J60J18k00Q1j09K62k95J51J58l3k18K8J41j72L9J68jm0
3093I5o2R5k81K45j15o2N0k5J66p6j32O9l5j47J10K24j73ol0N2K49j07J13j53
3117F4n3J03j55j9o2J16J63j75J98j67j84p5L81m3p9J29k99J98P7k30J26r4J33
3140E3J36k41J50k30R3n4R0pm6J76k9k0l30L22r3j21K60k42K6J02k26K93Q7j74
3164b5J02n8q2J58O5j88jJ38k19N0J6R3k15O4O4J28n2K58j30k32J15j00o1K93
3188A81N6j88j03L3K70l07m5J46J63k27N6k9J24q1N6R7Ok68L2k35L60J05j53J94
3212B43k00k8M8l6k72M7K56j37R8K32k24J44j01j38J78j04J31j99k3j4M3OJ3J03
3236F6P8j9k29K8L07m79L73j68J21J28r2J4j81J60j15J73j60j04K74q0k44K74
$$ plain form
3071 -111 174 -155 166 -143 17 135 -65 16 -93 169 -126 25 183 150 -68 -40 101 -71 -32 136 135 95
3093 95 33 128 -153 92 -23 -85 -35 -60 106 30 -102 -33 -68 -215 -105 119 -54 -60 -90 -38 211 104 217 64
3117 64 11 114 -41 -60 -122 -6 157 -18 180 13 -171 -246 135 92 13 142 -157 41 118 -112 14 -80 53
3140 53 189 -52 98 -132 -39 -93 -3 -10 -56 120 91 71 -259 63 -30 -151 109 -133 -107 -5 -231 62 149 -25
3164 -25 77 19 -63 95 160 -28 -29 109 -110 -60 -44 49 -166 -102 -38 90 38 296 166 -66 49 -51 -112 181
3188 181 237 49 -54 -21 249 -58 -103 43 206 -21 35 6 130 49 105 202 208 -60 -28 -263 97 202 49 243
3212 243 43 15 63 27 -245 -198 58 -79 19 251 27 171 70 -68 110 6 137 -62 -85 -99 -56 -50 -37 66
3236 66 144 125 -104 -76 231 -248 125 -43 78 206 114 128 -53 107 -8 165 5 -99 175 95 -149 125
3258A25J58k55j66P5j84J26l7J12j0k6K29j38r8J85m4J71k59l1k2J96J65j90p3
3281Ik07K42o3J4J65k07M4l4j83J51Np0L05k03J15j48M4R6k27J87k32J26J77k88
3305a82J37Q7K8j80J55p4Rl4Lj49L68l08R2MLO5M6m0k6k9R2oj85L30j35n9m4j12
3333a44J52M4M9r3j13J00N5Pm6P9j91J26o7j2n6P2N1j20K33r8j06R0O8n6n4O5
3359C5Q8K4l05J06Q4j22j23M20k74J46J1q8P8l01k18N24l6j40K19j28k92L17k47
3382b22K7M00l22J91J44j38K7q0kp6Q2k83K83j18J81k14Q3j01J28O3j66J68j01
3405d6O2N8J7j13mK26j76p9J34l7j9OJ12k15J46k36J21J00M3J23k63L0q1J63j18
3430d6j1j29K8J76m4k2o4QlK5nj56J37O5N9j02J25J58l05J14o2j09K24J44l51
$$ plain form
3258 125 283 28 -138 -63 -247 -121 -158 -46 -56 -82 147 9 -89 96 52 223 -36 -67 -89 107 272 82 9
3281 9 -198 44 -19 -5 160 -47 -3 -37 -220 -69 -64 -134 171 -32 83 -65 -21 75 -152 35 -197 -71 106 -182
3305 -182 -45 42 70 -110 45 -29 -20 -54 -51 -200 168 -140 -48 -44 -41 24 70 30 4 -25 67 61 -124 206 71 12 -32 -144
3333 -144 8 52 101 8 -105 -5 50 57 11 90 -101 25 -42 -54 -110 -38 13 -107 126 28 -78 12 80 24 -30 35
3359 35 123 147 -158 -52 32 -90 -213 207 -67 79 90 2 80 -221 -439 85 49 -91 128 0 -292 25 -222
3382 -222 -195 205 -117 74 218 80 107 27 25 -51 31 -252 31 -87 94 -120 -37 -138 -10 53 -113 55 -46
3405 -46 16 74 91 -22 -26 200 24 -55 79 42 23 29 141 -74 72 -164 -43 57 100 223 -40 -10 -91 72 -46
3430 -46 -57 -186 -158 18 -26 -48 -112 -104 -107 -82 -87 -243 -106 -41 18 -84 41 199 -106 8 -54 -163 61 205 -146
3455a46M8K74l9j54n5J47K3j65Q8j31m2K09L7j72J60J05k76K47j21M0k9j13o8
3478a33L55k14J17L4r3k48J10L6Q0k16q8J95k09L27j15J2J8K06r1p8l0N3N8j67
3502h1Q8J08l30M00j49k1o2mK49j57J5jJ7k93M19j7k92J2K4J28j38J10J13j70
3526c2q9J52j48j9J56j37Q8j78J79P2j25KK9R1k12L07J08j0j33k48K32l6k69K22
$$ plain form
3455 -146 -98 176 137 -17 -72 75 98 -67 21 -110 -152 57 94 -78 82 187 -89 158 37 77 48 -65 -133
3478 -133 222 8 125 159 66 -182 -72 -36 44 -172 -260 -65 -274 53 -62 -50 -32 174 83 5 -25 28 86 -81
3502 -81 7 115 -215 185 36 15 -47 -51 198 41 56 55 72 -221 198 181 -111 -99 -75 53 -85 25 138 -32
3526 -32 -121 31 -117 -136 20 -117 -29 -207 -28 44 -81 -79 -50 41 -171 136 244 234 101 -147 85 49 -220 2
$$ [...]
8191e
##END NTUPLES=NMR FID
##END=
