##TITLE=1H_Pr-BuCl
 CDCl3, 8 sc, 
 28.06.2021
##JCAMPDX= 6.0         $$ Bruker NMR JCAMP-DX V2.0
##DATA TYPE= NMR FID
##DATA CLASS= NTUPLES
##ORIGIN= UXNMR, Bruker Analytische Messtechnik GmbH
##OWNER= root
$$ XWIN-NMR		Version 3.5
$$ Mon Jun 28 12:54:46 2021 Russian Standard Time (UT+4h)  she@DPX200
##.OBSERVE FREQUENCY= 200.131506
##.OBSERVE NUCLEUS= ^1H
##.DELAY= (6, 6)
##.ACQUISITION MODE= SIMULTANEOUS
##.ACQUISITION SCHEME= undefined
##.AVERAGES= 8
##.DIGITISER RES= 18
##SPECTROMETER/DATA SYSTEM= spect
##.PULSE SEQUENCE= zg30
##.SOLVENT NAME= CDCl3
##.SHIFT REFERENCE= (INTERNAL, CDCl3, 0, 15.7039)
##AUDIT TRAIL= $$ (NUMBER, WHEN, WHO, WHERE, WHAT)
$$ ##TITLE= Audit trail, XWIN-NMR		Version 3.5
$$ ##JCAMPDX= 5.01
$$ ##ORIGIN= Bruker BioSpin GmbH
$$ ##OWNER= she
$$ F:/spectra/data/she/nmr/H-F/1/audita.txt
$$ ##AUDIT TRAIL=  $$ (NUMBER, WHEN, WHO, WHERE, WHAT)
(   1,<2021-06-28 12:53:29.03 +0400>,<she>,<DPX200>,
      <created by zg, POWCHK disabled, PULCHK disabled
       configuration hash MD5:
       00 E9 B6 7A A2 85 ED C7 34 08 36 98 17 FE 4E 26
       data hash MD5: 16K
       D7 EE BB 3F E2 9E 39 9D 55 75 CC 8D 29 02 50 C4>)
$$ ##END=
$$ 
$$ hash MD5
$$ FE 00 9D 56 34 CD BE 95 60 88 A9 60 FE 72 E2 C8
##$RELAX= 
##$RELAX= 
##$RELAX= 
##$RELAX= 
##$RELAX= 
##$RELAX= 
$$ Bruker specific parameters
$$ --------------------------
##$DU= <F:/spectra>
##$EXPNO= 1
##$NAME= <H-F>
##$PROCNO= 1
##$TYPE= <nmr>
##$USER= <she>
##$AMP= (0..31)
100 100 100 100 100 100 100 100 100 100 100 100 100 100 100 100 100 100 
100 100 100 100 100 100 100 100 100 100 100 100 100 100 
##$AQSEQ= 0
##$AQ_mod= 1
##$AUNM= <au_zg>
##$AUTOPOS= <>
##$BF1= 200.13
##$BF2= 200.13
##$BF3= 200.13
##$BF4= 200.13
##$BF5= 200.13
##$BF6= 200.13
##$BF7= 200.13
##$BF8= 200.13
##$BYTORDA= 1
##$CFDGTYP= 0
##$CFRGTYP= 5
##$CHEMSTR= <none>
##$CNST= (0..31)
1 1 145 1 1 1 1 1 1 1 1 1 1 1 1 1 1 1 1 1 1 1 1 1 1 1 1 1 1 1 1 1 
##$CPDPRG= <>
##$CPDPRG1= <>
##$CPDPRG2= <>
##$CPDPRG3= <>
##$CPDPRG4= <mlev>
##$CPDPRG5= <mlev>
##$CPDPRG6= <mlev>
##$CPDPRG7= <mlev>
##$CPDPRG8= <mlev>
##$CPDPRGB= <>
##$CPDPRGT= <>
##$D= (0..31)
0 1.2 0 0 0 0 0 0 0 0.06 0 0.03 0 0 0 0 0.0002 0 0 0 0 0 0 0 0 0 0 0 0 
0 0 0 
##$DATE= 1624870408
##$DBL= (0..7)
120 120 120 120 120 120 120 120 
##$DBP= (0..7)
150 150 150 150 150 150 150 150 
##$DBP07= 0
##$DBPNAM0= <>
##$DBPNAM1= <>
##$DBPNAM2= <>
##$DBPNAM3= <>
##$DBPNAM4= <>
##$DBPNAM5= <>
##$DBPNAM6= <>
##$DBPNAM7= <>
##$DBPOAL= (0..7)
0.5 0.5 0.5 0.5 0.5 0.5 0.5 0.5 
##$DBPOFFS= (0..7)
0 0 0 0 0 0 0 0 
##$DE= 6
##$DECBNUC= <off>
##$DECIM= 32
##$DECNUC= <off>
##$DECSTAT= 4
##$DIGMOD= 1
##$DIGTYP= 9
##$DL= (0..7)
0 120 120 120 120 120 120 120 
##$DP= (0..7)
150 150 150 150 150 150 150 150 
##$DP07= 0
##$DPNAME0= <>
##$DPNAME1= <>
##$DPNAME2= <>
##$DPNAME3= <>
##$DPNAME4= <>
##$DPNAME5= <>
##$DPNAME6= <>
##$DPNAME7= <>
##$DPOAL= (0..7)
0.5 0.5 0.5 0.5 0.5 0.5 0.5 0.5 
##$DPOFFS= (0..7)
0 0 0 0 0 0 0 0 
##$DQDMODE= 0
##$DR= 18
##$DS= 0
##$DSLIST= <SSSSSSSSSSSSSSS>
$$ [...]
##$SUBNAM2= <"">
##$SUBNAM3= <"">
##$SUBNAM4= <"">
##$SUBNAM5= <"">
##$SUBNAM6= <"">
##$SUBNAM7= <"">
##$SUBNAM8= <"">
##$SUBNAM9= <"">
##$SW= 20.0188882624521
##$SWIBOX= (0..15)
0 0 2 0 0 0 0 0 0 0 0 0 0 0 0 0 
##$SW_h= 4006.41025641026
##$TD= 16384
##$TD0= 1
##$TE= 0
##$TE2= 300
##$TE3= 300
##$TEG= 300
##$TL= (0..7)
0 120 120 120 120 120 120 120 
##$TP= (0..7)
150 150 150 150 150 150 150 150 
##$TP07= 0
##$TPNAME0= <>
##$TPNAME1= <>
##$TPNAME2= <>
##$TPNAME3= <>
##$TPNAME4= <>
##$TPNAME5= <>
##$TPNAME6= <>
##$TPNAME7= <>
##$TPOAL= (0..7)
0.5 0.5 0.5 0.5 0.5 0.5 0.5 0.5 
##$TPOFFS= (0..7)
0 0 0 0 0 0 0 0 
##$TUNHIN= 0
##$TUNHOUT= 0
##$TUNXOUT= 0
##$USERA1= <user>
##$USERA2= <user>
##$USERA3= <user>
##$USERA4= <user>
##$USERA5= <user>
##$V9= 5
##$VALIST= <valist>
##$VCLIST= <CCCCCCCCCCCCCCC>
##$VD= 0
##$VDLIST= <DDDDDDDDDDDDDDD>
##$VPLIST= <PPPPPPPPPPPPPPP>
##$VTLIST= <TTTTTTTTTTTTTTT>
##$WBST= 1024
##$WBSW= 4
##$XGAIN= (0..3)
0 0 0 0 
##$XL= 0
##$YL= 0
##$YMAX_a= 410447
##$YMIN_a= -563146
##$ZGOPTNS= <>
##$ZL1= 120
##$ZL2= 120
##$ZL3= 120
##$ZL4= 120
##$ABSF1= 10
##$ABSF2= 0
##$ABSG= 5
##$ABSL= 3
##$ALPHA= 0
##$AQORDER= 0
##$ASSFAC= 0
##$ASSFACI= 0
##$ASSFACX= 0
##$ASSWID= 0
##$AUNMP= <proc_1d>
##$AZFE= 0.1
##$AZFW= 0.1
##$BCFW= 1
##$BC_mod= 2
##$BYTORDP= 1
##$COROFFS= 0
##$CY= 11.3945322036743
##$DATMOD= 1
##$DC= 2
##$DFILT= <>
##$DTYPP= 0
##$F1P= 15.9154993809931
##$F2P= -4.1035820241983
##$FCOR= 0.5
##$FTSIZE= 0
##$FT_mod= 4
##$GAMMA= 1
##$GB= 0.15
##$INTBC= 1
##$INTSCL= 1
##$ISEN= 128
##$LB= 0.24
##$LEV0= 0
##$LPBIN= 0
##$MAXI= 10000
##$MC2= 0
##$MEAN= 0
##$ME_mod= 0
##$MI= 1.114404
##$NCOEF= 0
##$NC_proc= 0
##$NLEV= 6
##$NOISF1= 3.799351
##$NOISF2= 2.8
##$NSP= 1
##$NTH_PI= 0
##$NZP= 0
##$OFFSET= 15.70392
##$PC= 1
##$PHC0= -11566.44
##$PHC1= 16.00101
##$PH_mod= 1
##$PKNL= yes
##$PPARMOD= 0
##$PSCAL= 0
##$PSIGN= 0
##$REVERSE= no
##$SF= 200.130013532006
##$SI= 16384
##$SIGF1= 3
##$SIGF2= 2
##$SINO= 400
##$SIOLD= 16384
##$SREGLST= <1H.CDCl3>
##$SSB= 0
##$STSI= 0
##$STSR= 0
##$SW_p= 3612.71676300578
##$SYMM= 0
##$S_DEV= 0
##$TDeff= 0
##$TDoff= 0
##$TI= <>
##$TILT= no
##$TM1= 0
##$TM2= 0
##$TOPLEV= 0
##$USERP1= <user>
##$USERP2= <user>
##$USERP3= <user>
##$USERP4= <user>
##$USERP5= <user>
##$WDW= 1
##$XDIM= 8192
##$YMAX_p= 0
##$YMIN_p= 0
$$ End of Bruker specific parameters
$$ ---------------------------------
##NTUPLES= NMR FID
##VAR_NAME=  TIME,          FID/REAL,        FID/IMAG
##SYMBOL=    X,             R,               I
##VAR_TYPE=  INDEPENDENT,   DEPENDENT,       DEPENDENT
##VAR_FORM=  AFFN,          ASDF,            ASDF
##VAR_DIM=   8192,          8192,            8192
##UNITS=     SECONDS,       ARBITRARY UNITS, ARBITRARY UNITS
##FACTOR=    0.0002496,     1,               1
##FIRST=     0,             0,               0
##LAST=      2.0444736,     0,               0
##MIN=       0,             -563146,         0
##MAX=       2.0444736,     410447,          0
$$ Real data points
##PAGE= N=1
##DATA TABLE= (X++(R..R)), XYDATA
0 0 0 0 0 0 0 0 0 0 0 0 -8 8 -8 16 -16 24 -32 38 -41 56 -64 78 -89 106 -128 145 -169 201 -230 264 -303 344
32 344 -391 441 -499 561 -632 709 -793 883 -984 1095 -1214 1346 -1487 1642 -1815 2001
48 2001 -2203 2428 -2675 2947 -3249 3586 -3961 4383 -4863 5413 -6052 6803 -7705 8803
62 8803 -10183 11973 -14395 17886 -23369 33278 -56881 237066 -7306 -407089 162944 280258
74 280258 -163017 -345923 68554 141360 -123187 -92897 124158 -92332 -311565 -31038
84 -31038 321931 88183 -243822 -55140 263873 131472 -144031 -145900 66660 178422 115384
95 115384 -51425 -176734 -87029 115069 73048 -110043 -95670 47546 36451 -59550 -22897
106 -22897 14468 -87900 -28032 198467 111024 -231886 -190228 232493 265514 -186850 -273194
117 -273194 139254 245654 -88334 -194052 48556 96181 -91420 -36471 133854 -15211
127 -15211 -193729 9785 229004 12087 -255781 -48036 254349 104802 -181824 -129007
137 -129007 94224 119289 -11138 -51904 -22595 -12758 31773 56441 -10557 -64064 -15954 62859
149 62859 50569 -27924 -53529 -18575 52981 93550 -9838 -128846 -39521 146450 113514
160 113514 -116406 -146187 76109 139298 -29042 -95052 9785 47309 -25846 -8588 60962
171 60962 -20409 -96495 29287 128133 -14285 -156570 -17837 165343 52595 -139105 -81001
182 -81001 81469 82727 -31137 -58832 -4796 6127 7178 29316 -458 -50460 -30970 41055
194 41055 52221 -30112 -68840 -3236 59083 39147 -44484 -75032 9601 80227 27857 -70260
206 -70260 -64307 41668 64932 -18079 -48498 -5742 18298 3057 934 12472 -23295 -41087
218 -41087 31559 63330 -24324 -83190 531 95883 26906 -84940 -41850 58243 50794 -22028
230 -22028 -36384 9226 16113 -1486 15767 11976 -24597 -19409 29855 41816 -19941 -50859 13107
243 13107 56182 11181 -43132 -29517 31468 41997 -6502 -30489 -12058 18636 24246 -1147
255 -1147 -12446 -8294 -910 14856 12784 -5863 -18856 -8246 25247 20617 -24926 -29633 12708
268 12708 35269 879 -38908 -12588 26490 14081 -11798 -16338 -2070 5842 476 5860 -812
281 -812 -19775 -6475 17326 11914 -16242 -24711 9303 23363 -7208 -22121 -7079 12391 9199
294 9199 -11200 -10580 -988 -265 4736 1382 -7421 -7903 -1993 10854 5050 -13175 -7297 6077 9297
309 9297 1144 -11230 -2425 9387 4754 -32 -5096 -2160 7083 4167 1197 -1372 -3781 5123 6274
324 6274 1057 -532 -3557 4476 8655 -1297 -2344 656 5000 6026 -2608 -67 4436 671 3141
339 3141 2499 -438 1007 -542 4537 3673 -5676 135 4876 1247 -1470 -3103 3501 2980 -4909 931
355 931 2767 -2428 -1234 -859 1989 -611 -5066 2420 1675 -4979 -1154 431 618 -2755 -5168 2773
371 2773 38 -5780 -856 -745 -1038 -1607 -4244 250 -1156 -4015 64 -2118 -1686 -1192 -3831 1103
387 1103 402 -3939 -858 -789 1896 -376 -6333 1911 5161 -2403 -3818 41 5757 -6 -7528 4184
403 4184 7533 -4291 -4559 3531 8332 -1637 -8820 6650 8702 -5558 -3853 6714 8473 -4287
417 -4287 -8306 9881 10225 -6704 -5222 6754 9725 -3003 -9467 6747 10920 -2753 -5981 1204
431 1204 7921 1688 -6521 3711 7491 -4200 -6528 3084 11614 -79 -15415 872 16456 512
445 512 -15769 -5082 17680 7332 -19952 -8690 15470 7256 -12257 -8825 9779 2809 -16354
458 -16354 -303 17014 -3406 -22721 -4359 23369 5763 -28571 -9964 23353 9630 -21860
470 -21860 -16952 16120 16237 -14983 -13701 7749 5407 -7981 -3014 12854 753 -22496 -2834
483 -2834 25057 7651 -23937 -16923 21238 22348 -17457 -23037 10201 23635 -348 -21632 -4149
496 -4149 16916 6090 -4996 -1267 1848 -3097 -4999 12668 17430 -13593 -24238 9754 34138
509 34138 2997 -37596 -8832 41284 16942 -34578 -22268 30184 28805 -21116 -21307 17154 9684
522 9684 -14589 4116 25207 -8012 -39878 7640 52657 241 -53153 -10258 49054 19028
534 19028 -42778 -22159 32593 19958 -18775 -17043 4355 6372 -484 7683 2091 -22112 -13890
547 -13890 18313 22109 -5558 -29834 -14405 20840 25439 -7864 -37769 -10575 40619 19972
559 19972 -41344 -31933 31785 36661 -25463 -35633 17291 17557 -18709 711 28067 -13959 -49757
572 -49757 14480 69626 -8750 -79143 -3043 76199 14718 -67741 -20810 56243 20108 -37767
584 -37767 -11799 20387 -71 -8430 20001 12577 -35086 -22190 40222 36619 -24882 -41942 4509
597 4509 40240 16941 -23423 -28634 5058 40217 14815 -40044 -26784 34780 37962 -20239 -34819
610 -34819 12687 19959 -10262 6755 23234 -24306 -45186 29634 71840 -21939 -87042 10709
622 10709 88062 1588 -80238 -10973 68064 12432 -52082 -6146 29983 -8873 -16119 27851
634 27851 14120 -50527 -28735 58262 43886 -50414 -57157 24424 54594 -2696 -43246 -15288
646 -15288 19588 22321 -43 -27343 -18315 19414 27039 -8289 -30533 -5238 17357 7094 5224
659 5224 1030 -29263 -23747 37728 50854 -32820 -74068 19670 81924 -5436 -76460 -5627 65330
672 65330 10540 -48771 -2786 31770 -12422 -15836 35279 15005 -54679 -25749 69438 44786
684 44786 -65177 -55129 48462 59856 -24014 -49400 8951 33116 2774 -8779 -5261 -9163
696 -9163 2291 23311 11943 -25222 -25249 18652 33078 3088 -24153 -24531 5895 36293 19810
709 19810 -31756 -42170 20281 54292 -7155 -53607 -4814 44246 11144 -33035 -10515 17616
721 17616 -2522 -4608 20458 -1168 -42702 -9946 56011 26777 -60521 -44363 46371 48760
733 48760 -28271 -46426 10417 31788 -4371 -15139 896 -3962 -5888 14094 14935 -20345 -30732
746 -30732 14964 39459 -2873 -39250 -16887 26328 29478 -8047 -30402 -12171 20024 26815
758 26815 -6628 -30039 -5170 23650 14991 -11852 -16230 1763 9246 9455 7318 -12960 -22150
771 -22150 8309 35407 8087 -38814 -21999 35450 31643 -19907 -30623 7266 26319 2889
783 2889 -12550 -3455 -858 1859 14032 7965 -16653 -19864 14482 32386 -4394 -33337 -8517
796 -8517 26493 20239 -13099 -22321 184 15599 11012 -5160 -15820 -4509 11900 11998 -4154
809 -4154 -17369 -5483 13924 12197 -4721 -18533 -9171 14862 17088 -5815 -22607 -9383 19033
822 19033 16169 -11909 -19358 -908 14251 6728 -9216 -9228 -1897 4892 8718 -1186 -13214 -7877
836 -7877 10073 15657 -5557 -21111 -2530 17559 10066 -10796 -14811 2741 11893 4627 -4171
849 -4171 -9214 -3382 8343 9178 -1888 -12466 -3997 13172 9500 -6678 -11097 -25 12165 6823
863 6823 -6134 -7875 -263 9514 8094 -5178 -9070 313 9441 7180 -5544 -8088 1678 7475
877 7475 5832 -3440 -8371 141 8147 6003 -3521 -9247 1126 8850 2942 -4617 -5890 827 6073
892 6073 2437 -2431 -5362 -1990 6704 4553 -4788 -7098 -256 7366 1926 -6921 -4331 1611 3595
907 3595 1234 -4430 -3744 -740 2752 3272 -3752 -6254 315 4229 1742 -4151 -5053 1125 2992 540
923 540 -2331 -4026 775 3333 -232 -2622 -2979 868 2996 -741 -1468 -1323 -936 2838 1842 -1851 -2763
940 -2763 -198 4667 1470 -4162 -311 2729 1573 -138 -921 1391 669 -147 2849 361 -2291 707
956 707 3068 1907 -2227 -1931 3904 1948 -1995 -336 1423 1390 -521 -90 2353 -468 -1415 1762 1263
973 1263 -73 -1138 -17 2578 14 -1760 475 690 1095 -816 -1962 1434 1222 -1822 -1492 403
989 403 2091 -1361 -3583 1620 1801 -3042 -2487 1695 2315 -3573 -4815 3795 2741 -4714 -3776 2246
1005 2246 3297 -4373 -4955 4437 2857 -5202 -3746 3030 3769 -3926 -4842 4069 3091 -4737 -3548 3041
1021 3041 4486 -3131 -5887 3108 4647 -2499 -3995 1443 5365 -1416 -6495 2405 6647 -1202 -5864
1036 -5864 687 7435 -1 -7748 2241 8988 -432 -8248 -612 9673 2090 -8751 34 8359
1050 8359 478 -6900 382 9785 969 -9574 533 9752 754 -8491 -1147 10531 2512 -11028
1064 -11028 -2607 10561 5139 -7833 -6503 7041 5825 -6667 -3787 6701 3269 -7796 -5038
1077 -5038 9047 5506 -10253 -5930 9378 5923 -10276 -9492 9945 10257 -10090 -11582 5458 9719
1091 9719 -3428 -8977 2862 5349 -6174 -4754 6382 5024 -7350 -8153 6351 8468 -7140
1104 -7140 -9991 4527 11043 -2353 -14473 -1458 13997 4666 -10998 -7492 7704 6672 -6591
1117 -6591 -2913 8228 -133 -10087 445 14009 1753 -17087 -1709 19663 3746 -19756 -6119
1130 -6119 20655 10844 -18218 -11023 14624 9824 -8470 -4829 8246 1152 -9843 3614 14446
1143 14446 -2839 -14986 1257 16374 2991 -15692 -4724 14190 8520 -8790 -11242 3069
1155 3069 12623 2754 -8161 -6354 2982 6631 -394 -2713 1696 -2728 -5583 4319 10078 -3849
1169 -3849 -16514 1550 21200 -55 -25097 -4625 24748 9586 -23986 -13745 18065 10655
1181 10655 -12400 -4842 8207 -3118 -12313 8041 17245 -11355 -22482 8933 23696 -5460
1193 -5460 -24934 798 23171 2614 -18748 -7000 9912 8596 -1895 -5292 -3892 -2381 5175
1206 5175 8364 -1372 -8463 -4928 4456 10067 2485 -9847 -9359 7708 17330 -3651 -22204 -188
1220 -188 24708 7802 -22005 -12188 17536 12626 -9585 -5135 5948 -3097 -5957 11793 13808
1233 13808 -15930 -19951 16699 25389 -12033 -27155 6561 27487 -452 -22504 -3424 14022
1245 14022 5885 -3741 -2430 -2766 -5389 4549 13766 -1313 -16637 -5326 13574 11757 -7565 -14962
1259 -14962 -438 13018 8518 -9397 -16390 2987 18964 3526 -17559 -11629 11148 12771 -4584
1272 -4584 -7839 -1689 -3001 1132 10550 4253 -17269 -14258 17667 20284 -15829 -24424 8836 25118
1286 25118 -2888 -23083 -2110 15327 4435 -5495 -2371 -3164 -5099 5560 15245 -3314 -20917
1299 -20917 -3090 20550 10829 -14593 -15375 7467 15328 1013 -10563 -7195 5345 11653 2610
1312 2610 -9892 -8664 5418 13266 1871 -9679 -6633 1933 9679 7358 -5020 -12654 -2440
1325 -2440 16296 11813 -14073 -16643 8985 19107 -1359 -17709 -4096 12675 6453 -3611 -4471
1338 -4471 -4021 -1401 6981 9687 -5221 -17084 -64 19207 6411 -16277 -12606 10475 14561
1351 14561 -4303 -12410 -3016 5873 6841 91 -7378 -7486 1465 11300 4430 -11701 -10414 4703
1365 4703 12427 2430 -11500 -8311 4681 10067 2570 -10364 -8698 6032 11084 -172 -11880
1378 -11880 -5960 8460 8415 -2434 -8132 -4859 4118 8797 2959 -7426 -10027 3518 14325 2442
1392 2442 -12529 -7619 8266 11697 -2872 -9906 -1348 6128 6055 300 -6170 -4715 3381 9682 3041
1407 3041 -10197 -6980 7423 10547 -424 -9973 -4266 7118 7631 -435 -6987 -4975 5033 8142
1421 8142 162 -7638 -4941 5806 8197 -1742 -7526 -3430 4801 7191 -973 -7326 -4381 4233 8010
1436 8010 -920 -8725 -3269 5511 6340 -2010 -7727 -1991 4260 4735 -743 -6800 -3698 3946 5911
1451 5911 -500 -7864 -4136 5335 5212 -2125 -6475 -2665 4680 4147 -1645 -4870 -2740 3495 4803
1466 4803 -1624 -5471 -2070 4156 4620 -2043 -5148 -1368 3717 4516 -1413 -5635 -1409 3876 4441 -1390
1482 -1390 -5249 -652 3908 2875 -704 -4062 -1068 3529 3403 -431 -3770 -1496 4291 3281 -1405
1497 -1405 -3394 -558 4109 2600 -1639 -2454 -694 3280 3305 -1312 -3326 -574 3490 3063 -1814 -2932
1513 -2932 539 2271 1696 -986 -2198 -210 1362 1699 -86 -3299 -966 2522 1685 -1305 -3336 104
1529 104 2878 48 -1825 -2001 -319 1688 607 -1011 -1525 -1127 1399 828 -1359 -1434 -681 689 1088
1546 1088 -995 -1751 -1027 1274 1712 -1715 -2340 635 2008 17 -2104 -692 1593 -175 -1185 461
1562 461 317 -658 -525 1253 1580 -1932 -1554 2552 1994 -1396 -2078 912 2696 -804 -1851 1344 1420
1579 1420 142 -1599 414 2311 -309 -1218 1007 1517 -99 -1574 781 3023 -625 -2573 372
1594 372 2496 840 -2410 -540 3289 446 -2481 -340 2506 1221 -2804 -1453 3005 1031 -2666
1609 -2666 -606 2190 1197 -2933 -1827 3188 1351 -2815 -1709 2138 1667 -2775 -2067 3084 1544 -3158
1625 -3158 -2574 1978 3007 -2481 -3319 1900 2079 -2273 -2593 1674 3277 -2230 -4334 1774 3206 -1591
1641 -1591 -3709 1271 3852 -1971 -4554 1907 4030 -1509 -4680 283 4545 -729 -4488 1313 4299
1656 4299 -1163 -4521 200 5192 260 -4819 -72 3757 216 -3341 -309 4500 863 -4544 -862
1671 -862 4365 1924 -3183 -1777 4491 1958 -4638 -1142 5151 3112 -4136 -3897 4249 4282 -3517 -3101
1687 -3101 3470 3201 -3502 -3502 4601 4008 -4122 -3318 3584 3374 -3940 -3769 4868 4068 -5017 -5093 3295 5518
1705 5518 -2164 -5638 1154 4216 -1364 -3318 876 3034 -1495 -4075 930 3493 -1507 -3878 820
1720 820 3877 -1077 -6340 321 6947 993 -7240 -3460 6004 4036 -5389 -3397 4114 1780 -4646
1735 -4646 -1501 5239 1149 -6335 -738 6561 -158 -6703 -351 8184 1987 -9033 -3310 7604
1749 7604 4441 -4843 -4002 2836 2655 -2280 -356 2792 -392 -2316 416 3440 831 -3537 -488
1764 -488 4252 1890 -3695 -4125 3464 6960 -455 -6752 -1964 5819 4521 -3974 -3607 2846 1770 -2018
1780 -2018 -13 2869 -580 -4749 1898 6526 -2585 -7857 1824 9568 173 -10688 -2342 9416
1794 9416 3562 -6269 -3782 2911 1829 -2164 481 2265 -3573 -3093 3756 4082 -3931 -6136 2554
1809 2554 6854 -1682 -7374 -1905 5338 4283 -3105 -5761 -1041 3615 3538 -1559 -4395 -743 2198
1824 2198 1633 427 -1451 -2159 -314 3268 3041 -4336 -6100 3707 8534 -1277 -9715 -2248 9401
1839 9401 4492 -6238 -4694 2526 3057 158 465 441 -3386 -1762 6233 4061 -6021 -5950 5355 8428
1855 8428 -3157 -8998 648 7979 3297 -4237 -4491 741 3570 3319 94 -4469 -3046 3511 5129
1870 5129 285 -4945 -2985 3722 4527 -577 -5301 -2952 4715 5836 -2236 -7463 -1416 7575 4455
1885 4455 -5042 -5555 881 3851 2213 -1095 -2603 -2828 664 5932 1432 -7379 -4906 6055 7268
1900 7268 -4240 -9504 951 8009 2024 -5158 -4179 1130 3218 2310 -16 -4680 -3978 3881 6044
1915 6044 -1297 -7413 -2072 6771 4354 -4336 -5453 67 5368 3317 -3218 -5373 -467 5496 4729
1930 4729 -3484 -6137 129 5448 3605 -2389 -4770 -598 3526 4464 -830 -5954 -1675 6154 5169
1945 5169 -3681 -7082 1333 7499 1866 -4722 -3800 1175 4507 2550 -1189 -4592 -2425 5069 5750
1960 5750 -2639 -6933 -336 7075 3605 -4917 -4924 1585 4596 1868 -3215 -4091 229 4004 3549 -3020
1976 -3020 -6264 -222 5869 3261 -4214 -5899 732 5234 2006 -3347 -5013 -11 5043 2582 -3344
1991 -3344 -5400 104 5212 2283 -3705 -4551 342 4424 2399 -3286 -4390 -444 4403 3402 -3747
2006 -3747 -5103 665 5204 2085 -4178 -4197 1754 4125 1914 -3188 -3478 982 3976 2656 -2681 -4914
2022 -4914 453 5320 2571 -3197 -4133 1301 5009 1482 -3089 -3264 1127 4355 1627 -2833 -3001 1216
2038 1216 4417 1802 -3188 -3080 1078 4278 1731 -3182 -3267 1275 4047 1717 -3108 -3348 1782 3713
2054 3713 1155 -2708 -3004 1175 3439 920 -2622 -3072 959 3492 464 -2692 -2636 922 3262 647
2070 647 -2818 -2411 524 3450 819 -3334 -2452 762 3308 448 -3107 -2144 1117 2278 524 -2414
2086 -2414 -1943 769 2173 953 -2246 -2067 1013 2432 217 -2208 -1985 1703 2354 306 -1920 -1971
2102 -1971 1128 2515 257 -2016 -1511 1193 2541 -415 -1915 -887 1157 1848 317 -1298 -1082 366
2118 366 1914 985 -1872 -1493 1461 2539 162 -2396 -529 1926 1313 -439 -1024 -128 965 951 508
2135 508 -760 -1047 577 1724 680 -1354 -1508 1089 1943 -276 -1437 -677 859 1158 -468 -1036 -82
2152 -82 667 718 -622 -965 261 -289 -129 309 -190 -1076 -595 1285 891 -1243 -1333 920 1204 -680 -1925
2171 -1925 196 1557 -702 -1505 22 730 -8 -861 16 425 -1233 -680 1201 717 -989 -1286 570
2188 570 1438 -644 -1134 270 1157 83 -1443 -35 1212 -30 -1105 -58 679 406 -861 243
2204 243 1301 -28 -1124 -30 1236 581 -952 -550 1720 297 -890 -113 1341 960 -663 -961
2220 -961 1502 1197 -748 -674 422 982 -672 -1059 1296 1100 -1061 -1050 581 1598 -567 -1506 1206
2237 1206 1133 -1141 -1487 857 2050 -811 -1977 802 1563 -718 -1694 370 1608 -947 -2212 508
2253 508 1547 -346 -1577 265 1311 -737 -1601 822 1702 -540 -1865 -467 1670 212 -1714 -170
2269 -170 973 -164 -1658 -645 1641 584 -1773 -785 877 767 -895 -961 1513 935 -1874 -1159 1245
2286 1245 1657 -1062 -1756 1214 1502 -1149 -891 1505 1310 -1458 -1873 1753 2251 -1138 -1209 1010 1638
2303 1638 -1163 -1301 1522 1649 -931 -1373 572 1557 -363 -1020 1115 1179 -1336 -1184 891 1906 -47
2320 -47 -2243 265 1576 329 -955 -246 1301 410 -1368 -248 1400 258 -765 -400 798 27
2336 27 -1560 345 1862 82 -2235 -1267 2025 1633 -1845 -1579 973 1075 -759 -1259 853 923 -1371
2353 -1371 -856 890 212 -871 -348 1720 425 -2555 -837 2385 1726 -1700 -2329 786 2172 -653
2369 -653 -1400 169 623 71 -575 146 339 -759 307 961 -327 -1310 -660 1874 1611 -1404 -2259 296
2387 296 2295 1511 -1636 -1854 1017 1399 51 -622 -210 1128 27 -208 394 -517 -555 1083 1783 -325
2405 -325 -3201 -432 3571 1798 -2829 -2359 1304 2706 -305 -2065 202 153 98 577 284 -865 -962
2422 -962 1401 2112 -1992 -2831 618 2648 686 -2758 -2291 1047 1996 520 -1406 -2263 467 1908
2438 1908 665 -1424 -1580 790 1672 134 -1385 -1499 -43 1924 862 -1647 -3114 270 3875 1246
2454 1246 -3334 -2509 1559 2903 -374 -2171 -401 645 724 1011 -698 -1903 -556 2718 2171 -2686
2470 -2686 -3128 1850 3828 389 -3319 -1907 2165 2210 169 -1359 -1681 357 2587 1166 -2061 -2649
2486 -2649 1261 3272 387 -2413 -1616 1388 2512 447 -2265 -2086 897 3212 1014 -3099 -2591 1829
2502 1829 3189 -6 -2900 -1252 1392 1951 762 -1622 -2413 665 3240 1175 -3153 -3031 2223 3595
2518 3595 -405 -3470 -1468 2119 2330 -206 -2156 -2154 230 2804 850 -2866 -2436 1686 3706 -223
2534 -223 -3553 -1580 2024 2404 -575 -2901 -1513 1361 2362 346 -3150 -2423 1979 3128 -126 -3175
2550 -3175 -1782 2164 2622 -109 -2823 -1719 1753 2907 -168 -2760 -1966 2423 3439 -521 -3070
2565 -3070 -1386 2003 2932 -558 -2560 -1377 1390 2833 233 -2962 -1848 2310 3359 -116 -3480
2580 -3480 -1341 2590 2795 -669 -2914 -884 2236 2291 -25 -2774 -1702 2251 2785 -163 -2699 -1586
2596 -1586 2313 2679 -882 -2858 -1408 2189 2479 -868 -2431 -1043 1878 2580 -589 -2802 -1399 1902
2612 1902 2288 -795 -3240 -808 2056 2206 -1052 -3053 -813 1963 2209 -578 -3045 -1088 2199 1921
2628 1921 -633 -2849 -1091 2082 2020 -1028 -2477 -649 1964 1895 -732 -2249 -906 2239 2220 -933
2644 -933 -2727 -501 2446 2069 -1025 -2382 -188 1777 1903 -548 -2135 -333 1759 1842 -501 -2598
2660 -2598 -423 2333 1542 -898 -2144 43 2136 921 -228 -1611 -730 1379 2010 -565 -2037 -537
2676 -537 2199 1586 -1312 -1886 -136 1863 1146 -1379 -1741 265 1125 1527 -566 -1862 -576 1491 1320
2693 1320 -939 -2001 -53 1447 892 -814 -1851 -138 1373 887 -1214 -1638 76 1433 677 -997
2709 -997 -1283 20 1131 753 -475 -1063 -961 1374 1246 -939 -1382 -108 1794 1080 -1554 -1234 489
2726 489 1107 286 -1230 -889 232 674 794 -253 -1175 -45 797 872 -319 -1483 242 1450 836 -756
2744 -756 -1056 512 1162 423 -564 -370 271 1132 210 -182 -229 -31 651 766 -65 -338 -222 1022 637 -791
2764 -791 -687 433 930 565 -1079 -643 1030 649 -104 -291 -340 38 328 229 338 -768 -235 487 453 -138
2784 -138 -1039 69 1394 -153 -1270 -484 726 604 -678 -663 604 -205 -261 150 225 -374 -982 109
2802 109 767 -265 -689 -157 469 -135 -951 -36 937 -20 -666 -188 98 150 -294 46 477 34 -259 44
2822 44 336 443 -503 -484 86 271 -49 32 -43 529 -439 -847 494 661 50 -474 -176 842 9 -785 518
2843 518 774 -481 -450 302 876 -131 -466 510 452 -555 -329 653 1162 -322 -698 331 610 -51 -344
2862 -344 163 826 -596 -982 166 557 213 -343 4 353 -28 -321 385 290 69 -670 -296 650 140 -539
2882 -539 -16 -97 -9 -424 -399 612 344 -778 -205 -21 290 -17 -308 245 -322 -468 -265 229 563 -470
2902 -470 -881 96 298 -344 -338 157 127 -384 -704 316 532 -188 -502 -173 594 -254 -318 307 554 -22 -560
2923 -560 165 707 254 -492 297 413 -492 -121 563 710 -586 -597 572 396 -170 -136 98 150 -343 -36
2943 -36 525 221 66 83 -230 -189 -162 342 757 -70 -398 94 -392 606 768 -338 -766 7 633 -166 -711
2964 -711 -109 872 -505 -779 54 365 -88 -132 370 110 -1210 -198 1351 395 -1288 -868 844 851 -901
2983 -901 -536 578 -99 -514 -198 58 -261 -401 658 120 -1119 -564 692 713 -427 -1254 -228 593
3001 593 481 487 -351 -611 371 712 343 -1035 -287 1218 207 -855 -451 87 286 298 43 -59 -1107
3020 -1107 458 1811 482 -1747 -714 1793 1366 -990 -923 1050 472 -210 110 176 -220 -138 1339 722
3038 722 -1934 -1068 1434 1471 -830 -1895 -14 1392 426 -233 -626 -698 515 901 7 -1187 -937 1136
3056 1136 1255 -1048 -1276 76 1023 614 -743 -892 -1011 917 1803 -334 -2062 -719 1555 1312 -1084
3073 -1084 -1610 210 980 361 -263 -1029 -669 428 1196 -8 -2184 -820 1829 1717 -1358 -1928 71
3090 71 1971 266 -1047 -1301 -255 1192 1079 -409 -1712 -646 1502 1840 -947 -1802 202 1697
3106 1697 1331 -1010 -1692 151 1311 1113 -812 -2048 -166 1818 1339 -1041 -1819 281 1836 736
3122 736 -709 -1300 -85 1755 1303 -875 -2009 -607 2318 1650 -1534 -2219 173 2085 917 -1470
3138 -1470 -1519 220 1632 1195 -1150 -2013 -335 1778 1333 -1113 -2415 187 2182 951 -1584 -2034
3154 -2034 368 1762 845 -1105 -1916 123 2176 1024 -1120 -2182 -73 2200 1034 -1334 -2172 76
3170 76 1914 1106 -1693 -1713 -30 2155 1014 -1704 -1763 275 2031 960 -1698 -1773 637 1911 777
3187 777 -1511 -1776 253 1936 1212 -1261 -2068 621 2121 972 -1533 -1759 690 2367 568 -1513
3203 -1513 -1358 310 2149 597 -1196 -1604 176 2439 1021 -1599 -1579 223 2000 682 -1668 -1422
3219 -1422 450 1667 804 -1613 -1501 441 1851 885 -1860 -1714 850 2113 370 -1571 -1597 584
3235 584 1572 411 -1488 -1788 473 2141 458 -1780 -1731 917 2011 107 -1744 -1199 658 1497 422
3252 422 -1487 -1405 313 1762 538 -2035 -1320 1074 1755 49 -1941 -1148 682 1118 94 -1490 -1493
3269 -1493 549 1360 491 -1477 -1672 706 1816 168 -1572 -1158 917 1558 43 -1392 -1203 518
3285 518 1808 226 -1408 -674 969 1685 -29 -1434 -399 716 1264 583 -1388 -828 936 1579 573
3302 573 -1572 -745 1171 1386 127 -1369 -746 957 1143 -256 -1001 -670 623 1115 21 -1026 -804
3319 -804 681 1297 6 -1245 -658 612 1405 -289 -1266 -375 317 967 -124 -1408 -263 611 718
3336 718 -11 -1150 -874 762 1040 -120 -1124 -719 801 699 -11 -776 -323 467 789 -351 -699 -435
3354 -435 729 539 -364 -677 -219 776 866 -562 -750 -322 145 1067 137 -768 -582 243 764 -173 -784 196
3374 196 703 179 -26 -468 228 627 469 96 -590 -350 876 703 -7 -699 -355 636 473 -169 -159 118
3394 118 489 234 -40 -73 108 411 453 -391 -333 66 93 476 -323 -557 91 21 184 105 -407 -127 121 391
3416 391 -245 -547 -36 159 -107 -480 -209 367 466 -364 -198 -233 -118 116 97 141 -466 -483 32 293 -323 -101
3438 -101 -422 83 -11 -424 -131 174 -122 -158 -259 -108 158 209 -53 15 -98 133 -130 27 126 -353 -163 -56
3460 -56 -139 284 -49 -11 384 -259 -84 304 435 231 -203 134 383 -228 102 244 70 200 -508 -37 619
3481 619 245 -181 12 -117 192 -194 -65 738 35 -573 -114 704 20 -375 -201 609 -405 -708 123 567
3501 567 162 -305 -113 332 -461 -12 178 257 -57 -665 292 235 -119 -248 37 -315 60 201 117 137 140 146 -93
3524 -93 -364 218 217 -251 -163 -100 200 -298 -89 540 193 -646 -125 441 298 -444 -361 808 -335 -731 253
3545 253 812 125 -625 -261 592 -165 -457 666 260 -747 -405 382 676 -130 -165 934 82 -577 310
3564 310 565 299 -58 -102 349 -39 101 536 -333 -491 195 708 -181 -363 465 464 -676 -317 653 310 -260
3585 -260 -420 608 -164 -973 407 1113 11 -1280 -133 1172 -280 -966 167 734 -434 -855 219
3602 219 469 -205 -352 632 -45 -749 54 759 146 -698 -588 500 137 -64 23 -292 -215 210 217 -162 -516
3623 -516 215 927 -342 -794 -2 455 -6 -114 31 -232 -553 644 904 -512 -1119 160 981 260 -1047
3642 -1047 -309 1417 149 -400 -78 18 98 44 404 51 -915 -56 1200 306 -704 -829 779 1124 -394
3661 -394 -593 42 500 573 21 -330 -509 135 802 404 -840 -487 556 809 126 -1059 -597 307 609
3680 609 498 -939 -971 190 1008 263 -1335 -995 1129 807 -511 -620 -687 630 508 217 -457 -1261 291
3699 291 1207 186 -1306 -954 449 1300 -667 -1524 -91 414 913 -332 -931 -575 333 918 145 -1225
3717 -1225 -918 549 1194 104 -1571 -424 1194 862 -96 -1109 -479 867 979 164 -1052 -800 1048
3734 1048 1122 27 -1364 -281 906 1405 -177 -880 -275 689 1466 -118 -1502 -602 1077 1210 -248
3751 -248 -1579 -52 1286 1106 -269 -1564 -513 1068 1212 230 -1414 -659 1081 1341 -328 -1456
3767 -1456 -598 1605 887 -435 -1007 -522 1004 1045 -305 -1623 -730 1077 1329 -491 -1640 -438 952
3784 952 1248 -830 -1206 -542 805 1253 -481 -1554 -642 986 1201 -329 -1833 -116 1288 900 -424
3801 -424 -1290 -526 1211 1283 -49 -1521 -485 1374 1218 -341 -1691 -293 1156 906 -900 -1203 -272
3818 -272 1064 896 -321 -1176 -505 1371 1427 -823 -1547 93 1461 1076 -609 -1400 183 1066 1089 -456
3836 -456 -1431 -305 1225 827 -894 -1595 -256 1577 626 -617 -953 -272 1397 907 -160 -1020 -490
3853 -490 1233 1310 -883 -1588 -148 1460 779 -1173 -1015 321 1074 464 -569 -1148 -110 865 884 -701
3871 -701 -1629 -239 1125 534 -813 -1602 201 1225 291 -913 -1316 -127 1060 472 -767 -1346 -101
3888 -101 1018 562 -589 -1037 -4 1162 850 -538 -948 -212 1247 861 -981 -1027 382 1159 473 -1330
3906 -1330 -861 599 696 74 -341 -627 79 624 853 -286 -1166 -179 1271 482 -947 -1265 478 1451
3924 1451 19 -900 -560 540 870 100 -508 -389 469 557 634 -303 -679 -137 850 589 -730 -660 282 879
3944 879 316 -1113 -711 840 666 64 -1003 -497 484 327 132 -39 -450 -244 586 257 -405 -766 -115
3963 -115 1074 264 -963 -535 567 816 -80 -1179 -246 526 84 -224 -351 -76 -196 -90 468 -101 -623
3982 -623 -303 682 713 -639 -725 430 684 107 -676 -108 851 434 -369 -341 -40 126 -160 149 -117 -581
4002 -581 -359 634 440 -179 -399 -81 695 7 -605 52 561 608 -118 -717 281 353 -9 -92 -111 69 -193
4023 -193 -66 624 66 -541 -188 371 408 -49 -791 230 617 -258 -134 25 687 297 -606 42 347 -221
4043 -221 -130 16 -58 -375 -808 84 616 -140 -591 23 366 -147 -772 465 652 -347 -404 -186 511 82 -544
4064 -544 156 146 -389 -101 170 609 114 -370 -102 -151 117 173 -134 -120 -135 115 76 343 154 -79 -553 -317
4086 -317 299 -2 -391 60 717 -178 -585 -23 919 291 -597 -281 459 285 -351 308 635 -407 -731 499
4106 499 662 68 -767 292 496 -421 -231 551 447 -198 -343 18 118 22 227 390 -44 -296 162 129
4126 129 369 -329 -106 102 -332 20 32 -180 116 70 44 -687 -136 611 288 -697 -436 31 135 -176 -1
4147 -1 500 -33 -874 206 389 -280 -846 67 117 -724 -565 342 491 -72 -538 65 -72 -472 -180 313 -84
4168 -84 -210 204 82 154 -238 157 282 -357 -80 305 69 337 84 -156 51 -221 357 238 -525 -84 243
4189 243 508 166 -327 360 293 -365 -22 355 130 -119 -295 83 -169 -79 275 362 -309 -121 245 299 -122
4210 -122 -217 378 153 172 79 -33 -142 79 150 9 -264 -470 114 247 142 -267 -129 241 -303 -78 71
4231 71 -271 47 357 -90 -138 -378 297 441 -609 -471 137 399 307 -387 -215 102 -139 165 -15 -399 -322
4252 -322 176 541 -131 -699 88 764 180 -563 -183 127 175 -94 -58 -35 -252 576 555 -52 -394 -72 439
4273 439 198 -677 -343 -58 520 276 -348 -346 -58 430 467 -360 -708 151 854 601 -782 -462 523 479 212
4294 212 -273 -361 131 664 248 -9 -877 -65 1013 278 -858 -606 190 769 -41 -473 -511 -238 554 558 -358
4315 -358 -820 -64 786 542 -1226 -784 517 667 206 -751 -581 240 -50 329 -204 -836 -241 863 494
4334 494 -745 -1158 395 849 57 -710 -551 258 540 -6 -698 -702 342 1192 363 -749 -314 222 755
4353 755 342 -596 -719 326 821 427 -909 -678 383 1229 452 -1023 -771 869 791 47 -996 -704
4371 -704 488 666 377 -548 -1087 146 1091 369 -1123 -664 643 1377 -292 -991 -394 576 896 -48
4389 -48 -958 -433 304 653 289 -1158 -582 578 750 278 -960 -505 430 864 210 -1030 -916 661 1096
4408 1096 -73 -1258 -632 1064 876 -195 -697 -498 550 755 224 -900 -1044 214 1037 219 -1370
4425 -1370 -647 816 1332 -273 -1282 -147 803 538 -240 -923 -332 561 749 4 -874 -586 877 700
4443 700 6 -944 -449 954 1133 176 -845 -757 1079 1408 -333 -1303 -414 1353 720 -466 -736 49
4461 49 480 560 -53 -722 -414 463 1303 176 -1350 -533 1208 1364 -494 -1606 397 1228 480 -399 -567
4480 -567 -51 486 509 234 -793 -690 640 978 6 -983 -540 1019 802 -385 -1190 -546 1066 838 -720
4499 -720 -1118 -226 808 459 -688 -552 154 305 557 164 -579 -406 384 1006 294 -1305 -690 850 983
4518 983 -1147 -1295 198 1274 62 -607 -227 171 361 -141 215 -461 -626 351 1237 -163 -882 -552
4536 -552 1009 646 -805 -978 230 939 431 -699 -811 423 246 336 -229 -507 -13 110 315 305 -261
4555 -261 -345 452 809 96 -1178 -192 1324 630 -711 -929 685 989 -160 -325 228 348 67 107 349
4574 349 -175 -660 -65 1064 -126 -827 -97 515 643 -959 -554 414 706 46 -380 -411 118 122 129 -257 -378
4595 -378 -26 -1 96 261 -276 -598 441 368 -128 -937 -89 931 87 -726 -699 629 576 -304 -179 143 -111
4616 -111 -491 200 381 -59 -469 204 690 -186 -648 332 451 130 -694 -335 470 553 13 -354 -121 48
4636 48 134 -34 225 117 -250 -283 149 408 108 -513 229 493 -292 -401 3 623 204 -829 196 438
4656 438 -182 -300 95 281 -352 -746 429 505 134 -407 188 265 -31 -569 143 416 -394 -239 105 144 144
4677 144 -176 19 -261 -54 86 -50 144 -42 -140 -207 -271 20 188 -408 -45 95 -207 -350 -38 174 37
4698 37 -804 10 312 -146 -454 203 492 -235 -475 441 541 -452 -476 21 312 278 -273 187 212 -287 -60
4719 -60 495 118 71 -24 211 93 -231 -40 189 155 -288 -353 -22 87 -78 226 -27 -273 112 158 355 -60
4741 -60 -142 236 -233 1 358 32 -54 124 -26 46 -463 309 582 -361 -456 -39 161 185 -212 -81 26 163
4763 163 -166 158 -294 73 38 177 276 -380 84 207 225 -311 -308 -162 243 -91 -182 -180 -359 43 33 96 -46
4786 -46 -268 120 -149 -36 -205 119 -6 372 -138 -221 127 -37 102 83 -322 -127 -153 325 197 -350 48
4807 48 189 -10 84 239 264 -51 -149 25 203 -85 222 318 -96 -230 79 354 81 -176 277 72 36 32 -19
4830 -19 399 124 -171 158 -237 -81 91 51 -109 -500 126 -47 -100 -30 84 -95 18 200 -73 -96 -2 104
4852 104 420 -123 -403 179 574 -64 -599 79 306 -225 -236 192 -230 -46 47 -105 -96 -529 -149 344 -141
4873 -141 -179 -165 356 71 -392 82 -246 -132 233 94 -67 -177 330 490 351 -544 265 217 187 -170 -213 -72
4895 -72 259 180 111 -156 -58 418 438 -42 -416 -167 336 183 99 -195 -19 310 386 11 -322 -229 681 454 -425
4918 -425 -279 84 191 227 -134 -205 27 -83 218 227 -472 -541 249 691 -210 -636 54 474 221 -543 -500 117
4940 117 407 13 -269 -241 -20 349 330 -122 -431 -196 268 249 -510 -618 -173 314 594 -584 -726 90 640
4961 640 504 -483 -481 196 508 205 -237 -220 106 116 70 -142 -885 -61 637 626 -391 -949 291 851 195
4982 195 -623 -372 394 601 158 -286 -107 15 455 276 -117 -520 -102 690 413 -349 -439 237 553 355
5002 355 -328 -723 369 916 439 -784 -462 403 440 -56 -147 -258 -210 487 277 -25 -832 -359 621 534 -407
5023 -407 -753 52 918 -117 -1040 -382 708 369 -128 -282 -52 -142 -17 243 -232 -624 -59 983 333
5042 333 -525 -659 373 956 244 -682 -630 612 463 -247 -440 -420 726 457 -127 -381 -176 80 482 151
5062 151 -73 -744 -64 1057 549 -1033 -919 321 1200 -168 -1385 -117 608 169 -385 -109 351 -18
5080 -18 37 683 -327 -764 -153 984 499 -868 -906 1017 1094 -124 -705 -402 595 713 -143 -373 -293 288
5100 288 679 -158 -204 -281 263 724 -161 -60 -263 -188 1003 585 -960 -1028 686 878 -312 -1101 175 1076
5120 1076 -61 -514 -71 61 -35 -46 348 -64 -1005 38 1157 189 -1362 -766 723 751 -790 -809 246
5139 246 611 229 -357 29 56 -346 207 -308 -644 -43 169 262 45 -756 -337 -69 548 14 -907 -486 577
5160 577 714 -517 -839 212 606 -101 -269 3 360 -292 105 437 -94 -604 129 1115 107 -1139 -265
5179 -265 1096 447 -682 -89 466 364 -6 -21 140 -97 -161 250 -7 -224 -141 227 393 -150 -641 -16
5199 -16 387 445 0 -750 -232 326 1 -326 -526 93 393 -397 -229 305 -93 -197 95 373 -42 -261 371
5220 371 947 -386 -606 -110 681 141 -453 -301 98 -314 -161 7 29 -112 -157 6 224 -62 -260 261
5240 261 13 -81 -93 -165 205 120 -214 -416 -342 471 313 -334 -64 55 58 -94 -102 328 -180 -235 222 -142 -263
5263 -263 -450 59 364 -122 -442 187 213 -16 7 36 545 97 -165 268 109 -278 146 38 122 55 -17 -57
5285 -57 18 -230 -225 -187 -116 143 46 -100 -238 -83 -30 -163 -94 -29 -80 -30 69 144 -55 -145 10 235 -192 -386 21
5310 21 423 59 -365 141 -18 -84 147 -59 -101 -131 -84 91 -147 -166 -50 -179 -26 114 -29 -195 -167 10
5332 10 -28 -250 -256 80 82 111 218 -234 354 160 112 -115 14 -110 262 -131 119 12 12 -50 -96 -93 -469 -321 281
5357 281 229 -170 -47 139 -16 -106 -78 32 -65 -45 200 -142 29 -309 174 70 -297 -48 54 11 170 -179
5379 -179 -118 174 25 2 87 -235 108 22 19 -264 -213 384 217 -229 -21 -94 -201 92 -151 -2 -316 -279 167
5402 167 184 -298 -311 77 87 -246 -121 247 63 4 -2 -34 48 -149 165 250 104 59 147 2 -321 -139 -77 121
5426 121 67 -362 50 43 -170 -43 241 -114 46 -5 92 -39 201 159 -27 97 -249 -39 136 366 -12 299
5448 299 134 16 -106 200 -48 -71 103 184 -285 -221 282 34 5 72 -32 49 35 -112 -99 -83 107 363 -40
5471 -40 -91 -196 197 82 17 259 -224 138 43 15 269 -235 -5 328 -34 -298 -93 -47 325 -220 -365 -62
5493 -62 104 -147 -23 -176 -166 -117 -36 304 -151 -97 -70 217 62 -273 -152 109 29 -115 -268 -320 391 -95 -361
5516 -361 -248 -109 19 183 53 -37 -173 133 212 302 -124 -321 147 322 314 -470 -70 363 376 -93 -409 69
5538 69 115 56 -89 -84 -44 40 51 216 -49 -329 333 225 294 -274 -23 397 258 -163 -327 -53 54 375 -274
5561 -274 -66 122 -174 -5 181 -126 -287 -14 419 -7 -302 -232 209 265 -179 -679 -265 605 11 -230 -299
5582 -299 205 299 -132 132 -195 -382 177 416 199 -323 -359 242 583 -222 -362 -255 600 291 -475 10 -36
5603 -36 143 101 -154 -93 145 231 252 195 -253 136 431 363 191 -685 -322 498 608 -75 -747 -2 675 -25
5625 -25 -446 -136 430 278 -119 -32 233 -143 -198 484 74 -448 -589 464 660 -468 -488 264 612 -13 -544
5646 -544 -212 307 274 214 -169 -111 111 232 310 -219 -322 208 298 -99 50 -515 -455 378 437 -453 -668 -94
5668 -94 789 -89 -692 -244 712 325 -169 -7 -17 -381 -357 462 -54 -778 -115 601 616 -609 -760 397 583
5689 583 -353 -585 246 391 -179 -12 -17 -340 115 362 261 -282 -530 -284 580 -138 -191 -386 267 483 331
5710 331 -164 -491 -31 521 29 -487 174 501 130 -73 -241 109 -99 -240 525 407 -835 -766 830 498
5730 498 -647 -621 602 669 -528 -313 170 102 100 -209 80 -168 -241 200 203 -302 -606 19 628 128 -499 -300
5752 -300 -171 156 104 -163 -128 315 285 64 -689 -173 483 15 -24 -399 -167 146 226 184 43 -622 -124 558
5774 558 163 -315 -130 402 556 -299 -413 169 46 -159 -210 102 98 -14 335 350 -449 -203 42 570 266
5795 266 -319 -20 260 218 -73 -288 -137 140 -37 -64 -265 -180 318 -29 17 -227 -109 -105 65 104 -68 -476
5817 -476 184 524 186 -56 -140 47 35 -352 65 144 140 164 69 34 -52 59 202 -38 -256 -93 -114 2 294
5840 294 -528 -120 346 206 -104 -95 -19 -83 203 133 -53 -309 160 -276 -125 -82 -58 -190 196 -2 -197 -340
5862 -340 264 278 -35 -331 -132 202 -13 -90 -179 95 -118 126 296 -38 -136 300 128 98 -333 -20 416 318
5884 318 -92 -104 -60 250 -151 45 110 -163 322 -81 -121 34 111 156 125 -144 80 -224 197 122 -29 35 84
5907 84 -151 -97 -88 -343 181 -3 -145 525 -89 -14 -40 114 2 -119 -258 142 -100 -45 -33 -52 30 -431 487
5930 487 58 -195 10 237 92 -184 -284 -232 -41 -103 -214 -125 -207 407 -71 -145 -219 -105 -188 -210 -24 96 -335
5953 -335 -199 230 146 -80 2 -74 -127 -190 -4 45 67 130 -37 -57 115 157 -26 302 -44 -385 40 100 86 -164
5977 -164 -112 -76 18 60 239 15 7 -35 87 50 -58 228 145 -167 -144 -187 -215 -292 -205 128 291 84 -263 11 -21
6002 -21 -25 -11 229 157 -91 -2 108 -77 101 -274 80 57 -266 295 -267 -244 122 59 62 -152 -64 98 89 89 -119
6027 -119 -13 -88 60 8 -161 -371 114 120 162 -19 -259 263 250 -149 -108 397 -92 -58 -15 127 0 -124 177
6050 177 213 -320 -50 -185 -237 49 -237 -95 145 -156 -87 62 -83 225 216 2 -104 -24 199 237 -130 135
6072 135 116 236 124 49 -76 -1 43 108 -206 -140 154 -79 42 -14 -139 164 94 -52 350 109 219 -335 -60
6095 -60 -17 13 -143 174 42 -80 -33 106 346 -179 -202 75 262 67 90 -54 198 -210 -158 -16 -166 -99 58
6118 58 275 126 -180 -139 100 125 -386 -333 -94 239 -288 -497 -211 17 126 150 -115 18 425 -183 166 -60
6140 -60 -174 -50 -42 -15 -21 -172 198 361 351 -151 26 269 410 -132 -227 184 339 36 -64 -95 296 -91 -87 -99
6164 -99 -59 -152 -140 63 95 -215 -332 235 250 -109 -412 75 97 -6 -68 -159 -78 62 69 -69 -276 -257 -167 259 329
6189 329 26 -595 6 403 -151 -209 21 372 263 -201 -123 78 128 104 -52 -29 -49 -158 108 -288 -52 -223
6211 -223 -40 -73 -3 -278 -288 396 325 -342 -147 -171 334 209 -220 -175 42 -128 56 95 -43 -85 -203 120 320
6234 320 -256 -480 232 631 -213 -140 -26 381 36 -29 -250 18 94 -80 193 53 -47 50 487 222 -365
6255 -365 -93 173 249 -17 -258 3 160 224 -45 -401 -135 186 99 -154 -420 -78 287 95 -138 209 -175
6276 -175 -320 296 -51 -271 -364 119 457 -318 -506 415 376 292 -248 -96 -101 96 -42 479 -144 -423 -73 347
6298 347 -27 -438 -3 347 249 -315 -56 78 272 -176 -251 -89 -168 137 121 -191 92 79 302 -30 29 -235
6320 -235 -312 242 293 -73 -276 66 233 505 -76 -456 280 362 87 -231 -109 73 307 34 108 -278 -419
6341 -419 299 166 -125 -160 -278 514 117 -205 -250 -15 88 -54 -14 -14 -319 151 136 -289 -327 30 96 -3 102
6364 102 -315 43 63 164 -87 -313 88 254 50 -91 -198 173 301 -27 -130 -326 104 144 79 -95 -121
6385 -121 -162 -91 13 -348 -144 58 53 193 49 -223 132 87 83 -141 -44 160 -24 296 -170 -259 -11 293 -16
6408 -16 -37 -350 15 31 1 250 55 284 160 -72 91 -76 39 161 -92 -68 207 37 291 592 -20 -240
6430 -240 18 219 -98 -336 -173 -47 144 -122 -168 -87 -56 5 18 -160 -389 97 -43 155 102 62 149 148 31
6453 31 -11 14 -86 119 44 -178 -26 284 -44 168 -145 -14 -230 127 321 133 -17 -286 179 -171 -324
6474 -324 88 355 -300 336 -52 -130 120 -252 47 -94 -258 -100 22 88 -385 -129 65 147 5 -27 33 105
6496 105 -25 158 8 89 -22 -166 -154 -52 178 3 -3 106 48 106 -160 265 -101 -87 -74 88 212 308 -19
6519 -19 -51 10 -21 -84 207 -143 -50 -45 -138 26 14 -76 32 94 39 38 221 51 194 130 -47 -113 -112 -246 104 -53
6545 -53 -148 227 -74 163 -36 -82 -149 172 122 147 87 -60 271 21 -47 11 88 -64 15 69 -164 -47 -149 16
6569 16 135 -297 36 -93 144 -150 -128 -175 -63 65 53 -24 -105 325 196 -89 -171 -201 -98 26 115 -365 -50
6592 -50 22 165 99 73 42 60 -24 -89 102 -120 169 50 -71 -61 -17 -93 -159 -36 -80 164 -54 -61 -328 -145 -48
6617 -48 -27 232 -134 154 99 -17 179 -105 -74 29 -72 -36 -154 -128 -154 -134 -228 -131 98 -297 -295 -44 7 178
6641 178 -193 99 259 57 10 93 168 40 -78 89 -106 -227 109 -256 -61 193 -234 168 139 131 90 -19
6663 -19 11 82 -56 13 52 120 7 -53 -126 182 -4 -185 91 113 -159 -42 -47 119 -1 -24 -188 159 -55 -85
6687 -85 189 -13 -93 98 -153 -121 16 -167 -71 363 -83 114 -106 52 137 36 53 -68 -36 134 -14 126
6709 126 208 -197 -294 -113 -20 -145 -358 -17 -45 -310 -117 167 -43 67 -140 -169 -37 -250 -182 -214 -85 25
6731 25 -272 -33 -75 -256 -56 -157 167 -167 48 -67 297 -101 216 -22 235 314 -64 -210 29 277 80
6752 80 87 55 260 69 -134 143 -9 -274 93 165 135 -19 -282 -135 107 53 -285 -55 71 161 78 -55 -88
6775 -88 150 6 -85 94 -79 90 157 287 -138 -63 123 -103 -60 -48 -84 185 47 -147 -180 66 205 -79 -96
6798 -96 231 -366 12 -55 15 -15 -67 237 133 118 -257 11 226 -51 -420 -109 -163 -64 -25 -193 -271 12 -47 -196
6822 -196 -172 15 103 -104 181 -124 51 -26 101 197 -29 -122 314 199 -116 -316 -515 68 45 -138 -57 192
6844 192 -126 7 270 28 171 -233 166 35 -169 -14 224 92 3 -130 -306 346 14 64 -224 -177 -28
6865 -28 -9 -55 53 138 49 161 149 -188 -134 140 220 16 -150 -332 -38 204 112 -274 -71 160 321 -141 142
6888 142 147 -2 -24 268 87 -115 -45 88 86 -186 -323 185 261 -35 -12 -22 15 -49 -17 159 -194 -8 93 162
6912 162 -99 -14 -44 453 33 -58 -350 -272 -51 -38 -17 -211 -50 -55 -33 -336 34 -132 130 178 -139 -268 208
6935 208 151 345 -277 -22 151 360 -10 -206 -157 414 160 214 -143 -306 -59 -1 67 -275 -192 380 177 132
6957 132 39 -388 57 370 -110 -315 82 153 271 79 -42 -27 -14 -57 114 -78 -54 -28 44 121 36 -98 136
6980 136 -194 16 -97 164 185 214 -60 -188 -245 -136 73 -178 -24 -259 -34 -177 -39 254 -166 -55 -1
7001 -1 72 17 -61 -143 112 105 -297 -211 -73 44 -309 -114 64 -67 -71 195 -68 -88 -105 17 -81 -64 61 257 -159
7026 -159 56 27 -214 -28 182 98 51 135 25 70 -1 -153 -213 -118 286 -165 -123 -230 -89 10 -81 -175 -11 31
7050 31 175 93 -169 -39 -166 62 146 -170 -239 22 -188 259 156 132 196 4 8 -80 95 70 55 -70 -47 93
7074 93 99 -128 7 -63 -42 -109 47 157 85 -287 208 104 -61 -33 209 293 -1 -209 -42 -155 73 171 -122
7097 -122 63 -170 169 135 63 147 -25 103 263 22 88 154 -140 264 74 -277 60 -119 -55 -49 -93 156 -10
7120 -10 86 -3 -1 -32 -287 342 -90 -215 -61 10 -236 296 -284 94 102 45 -194 85 151 -8 -69 -65 -90 -123 -4
7145 -4 -156 -101 108 -18 227 10 209 -3 -148 -102 -30 172 143 48 258 138 -117 -219 70 87 70 207 113
7168 113 135 -242 212 1 50 -269 -177 -134 -154 93 -215 259 16 305 -49 30 169 -200 128 -204 103 -21
7190 -21 108 -104 30 48 -21 -298 -10 -63 141 262 -186 -12 25 -211 -208 -119 156 323 -62 -113 191 -99 -81
7213 -81 -246 -80 -52 184 310 103 -60 -106 114 167 -175 -56 -130 40 -102 9 -89 27 100 -173 -270 -102 136
7236 136 -33 344 -203 68 -14 40 -108 203 -114 -79 148 52 137 -27 -242 98 61 -159 120 264 -31 -111
7258 -111 -187 117 -151 -77 -45 23 -100 -82 8 284 21 -173 138 -25 -194 61 -57 -51 136 -104 311 182 -201
7281 -201 -200 -103 48 -187 -194 220 -71 -295 49 -182 -137 149 -118 -25 -29 174 -32 -187 29 25 -88 109 -145 22
7305 22 -43 -255 181 -16 -69 -130 28 198 -88 -270 217 31 -258 -17 70 1 -117 -100 115 167 73 32 -3 181
7329 181 183 76 48 -269 -69 68 94 -137 80 -153 -319 199 43 -57 45 225 1 -41 107 67 -181 166
7351 166 -115 -41 -74 -211 107 204 47 -118 -256 310 -138 -157 -80 -13 -60 -116 -84 215 -124 -128 -76 -154 -37 -113 -108
7376 -108 -3 61 -244 142 -190 113 -214 -162 252 -108 -242 -202 14 -32 32 135 9 46 -94 -185 129 -68
7398 -68 140 -90 32 -22 -35 -55 -93 125 -66 72 -48 18 85 -81 142 117 70 -117 -16 17 -247 350 35
7421 35 129 -101 98 1 8 35 14 -22 104 83 -232 -56 113 149 -168 14 441 -73 39 -288 -45 9 191 251
7445 251 231 -126 -268 52 80 274 6 -66 136 228 76 -318 -356 -23 82 -31 -205 295 -235 171 -44 12
7467 12 -16 25 244 200 -166 -58 233 73 121 -100 -90 -1 -84 230 176 17 -261 79 112 -83 -159 278 287 51
7491 51 -184 -111 -49 78 -139 -107 -91 206 396 -35 82 144 92 70 157 -184 301 108 23 209 -125 26 268
7514 268 130 -9 5 39 43 69 -112 59 -130 -5 -105 114 -72 -125 80 55 31 -216 -229 58 227 36 76
7537 76 108 -72 245 -219 26 89 397 52 171 -168 -188 -131 -100 -102 -264 67 -78 39 -190 -77 24 208 -178
7560 -178 -141 -204 136 -20 143 123 137 224 8 69 -33 141 -85 -54 220 -83 8 15 382 73 -3 -32 195 294
7584 294 82 2 92 -37 2 174 -9 95 -232 1 161 13 -53 27 35 98 5 -8 -72 16 63 133 1 -103 -90
7609 -90 114 -285 -149 23 31 119 -100 -139 99 265 -2 -244 -95 26 143 43 184 -200 144 44 68 80
7631 80 47 -198 -133 -126 -18 -226 37 107 370 -25 -231 103 214 -2 34 -107 48 4 -35 -63 140 141 -11 417
7655 417 60 8 236 -101 73 -2 83 -270 -82 110 -51 26 161 116 -114 -142 -211 54 17 127 381 22 -134
7678 -134 199 113 278 157 -101 -4 51 -130 -159 188 130 73 61 74 -98 -158 2 -67 -91 -39 95 5 -52 -122 -12
7703 -12 131 -93 279 -340 2 129 -15 240 12 -179 -167 183 -55 -132 1 -20 -44 187 108 -229 -155 -18
7725 -18 15 -172 -13 201 9 -87 178 -11 139 142 -81 74 -62 186 -79 89 -189 -164 -73 -40 212 -6 -190
7748 -190 -100 -31 0 -18 117 -162 -293 -101 100 -197 -11 -76 -3 53 -118 -16 -82 -6 -68 51 -12 83 180 7
7772 7 -100 13 190 277 -87 -320 -37 -15 100 116 -17 -193 -39 -51 -146 83 95 -17 -51 -136 -74 -55 -91 148
7796 148 -215 208 12 -70 -53 -47 -180 -144 425 -183 44 -40 -4 78 -40 -246 92 46 -30 100 -34 -147 -177 113
7820 113 6 -189 -71 -27 -43 -48 -202 245 -261 -98 -96 -230 94 103 -174 -1 -136 18 -36 104 328 -103 -74
7843 -74 -101 9 -39 116 -66 -102 -24 -170 -202 -103 160 -163 -112 -140 -77 132 -240 141 72 311 85 106 -69 -26
7867 -26 -62 177 56 -122 -217 -171 142 58 -140 138 16 10 64 124 339 -318 -253 106 -11 -274 -199 20 111 -182
7891 -182 174 -152 -164 -108 128 79 28 -143 153 76 -183 -142 -25 270 32 -17 100 125 -187 -184 -48 -29 123 452
7915 452 149 38 -179 175 7 -156 -167 -212 -150 -88 -20 54 -86 5 80 92 -313 -172 77 -14 -136 62 171
7938 171 -255 -170 150 145 53 -70 129 -181 74 29 -52 -13 122 -113 -110 94 189 -133 86 30 225 -30 -195 -218
7962 -218 93 115 -24 90 -3 68 -101 133 -222 -280 172 -249 -42 161 -277 -274 -312 105 187 -113 210 -116 -37
7985 -37 15 5 -12 -1 -122 -73 -53 70 279 85 -51 -68 191 34 -21 -85 158 95 -116 -40 -70 -10 -281 -26 267
8010 267 -280 -121 64 -86 -108 135 -76 167 115 -115 -151 -73 4 3 -85 -141 -172 -78 168 42 -442 157 103 -110
8034 -110 28 -142 34 -243 60 135 16 -25 -191 221 48 -73 -12 196 -27 -41 -122 -234 -13 -46 -270 15
8056 15 145 53 192 -89 -17 -139 -17 242 -102 -118 -29 -186 12 -37 -173 91 82 -75 40 -109 73 -45 -59
8079 -59 -78 -47 -362 -238 -72 72 -3 -241 195 -179 -11 56 -113 238 -321 -119 87 -236 -26 243 119 -162
8101 -162 25 156 129 -219 -49 157 185 52 25 44 172 -253 -153 -51 -328 126 187 211 -250 102 288 232
8123 232 -119 -66 -37 -90 180 103 -102 -147 122 93 75 -266 -148 53 37 0 61 -86 -102 13 102 1 243 -36
8147 -36 135 146 -76 15 130 -68 332 -220 -83 75 -15 208 131 -82 -4 224 -101 -117 -37 -253 -56 192 -166
8170 -166 62 -42 319 -23 -166 -102 56 -260 150 -109 232 -15 -276 -15 -16 -80 -176 -267 28 8 -37
8191c7
$$ Imaginary data points
##PAGE= N=2
##DATA TABLE= (X++(I..I)), XYDATA
0 0 0 0 0 0 0 0 0 0 0 0 8 -8 8 -8 16 -16 24 -24 32 -40 48 -56 64 -77 88 -104 120 -139 160 -182 210 -236
32 -236 268 -305 343 -385 434 -485 540 -602 671 -744 824 -913 1010 -1116 1231 -1355 1492
49 1492 -1646 1813 -1996 2203 -2433 2689 -2980 3313 -3697 4148 -4681 5327 -6129 7152 -8508
64 -8508 10398 -13225 17892 -26963 51055 -249663 -563146 198388 410447 -131337 -424155
75 -424155 -47746 80655 -155568 -81824 233901 93731 -168124 7088 258933 8639
85 8639 -274869 -2910 354879 155396 -203713 -197688 32882 113398 14763 -98992 -121931
96 -121931 -13000 127682 34119 -166346 -115254 88415 105628 -10797 -12506 31714 -48793
107 -48793 -33055 146947 85930 -191372 -125377 243737 219416 -236340 -295308 159134 273484
118 273484 -97714 -214032 59599 133553 -78524 -70311 117047 20583 -148140 28583 215535
129 215535 -4169 -248230 -26470 270208 88791 -213594 -115746 137514 126473 -52118
139 -52118 -89172 -5851 24250 36073 40745 -25075 -65793 -2841 67869 39036 -43822 -50932
151 -50932 7911 53964 53981 -36714 -115634 -12007 142016 76053 -138598 -140533 92797 144820
163 144820 -53820 -121506 13045 68328 -16814 -30100 39186 -9822 -80790 26495 111090
174 111090 -26594 -145967 -3255 162316 33301 -158697 -70654 109796 82737 -57121
184 -57121 -77250 7893 31556 7278 13234 -7582 -44323 -14878 47088 42629 -37024 -62327
196 -62327 15711 66028 21135 -52933 -59055 29108 81836 9347 -76777 -47948 57915 69399
208 69399 -28664 -57430 6097 34864 9158 -5992 4942 -10363 -24276 31803 55515 -27477
220 -27477 -70860 16247 94263 16633 -90595 -33074 76222 50405 -37057 -43719 15286 29022
232 29022 -2842 1965 6869 -21530 -14361 28562 30373 -25086 -47756 17167 54443 -2899 -51011
245 -51011 -22105 37068 37330 -20524 -39375 -4952 23384 19114 -11412 -21381 -5465 3912 10882
258 10882 5518 -13841 -17745 -3003 20248 13167 -28518 -27263 17784 30764 -7538 -40143 -9036
271 -9036 32883 12453 -20642 -17263 2152 10960 1177 -1054 -1520 -14945 -3255 19145 8056
284 8056 -17235 -19102 12292 25421 -8890 -22927 227 17432 9620 -11464 -10325 6510 6237
297 6237 4326 2570 -5853 -3049 4878 11396 6166 -10814 -4159 12509 9986 -300 -8835 -527
311 -527 13006 5195 -3066 -3303 -458 8489 4773 -2289 -1170 -2116 4510 6434 -2312 -2597 -1467 2936
327 2936 7272 -3091 -5516 1400 3299 2942 -4119 -4062 3565 -460 -1531 377 -3383 -1252 -1055 92
343 92 1224 -6648 -3116 4462 -1611 -4363 -3648 682 2071 -6115 -2632 2991 -3650 -2937 -689 -266
359 -266 -677 -5519 360 2393 -5209 -2411 1850 -629 -2449 -4163 1756 2410 -5396 -697 2117 -776
375 -776 -76 -1989 1046 2315 -2231 1373 1798 -681 1985 -326 2133 3407 -1944 977 2805 2406
391 2406 2023 -2823 2427 7366 -1521 -2694 2898 5710 1996 -5308 3203 9143 -3663 -4296 4935
406 4935 7273 -899 -7597 4988 9832 -5514 -5447 6954 6434 -4754 -8517 7229 10261 -9018
420 -9018 -7355 6680 6759 -4616 -10220 4538 10301 -5750 -9298 1246 5845 149 -8593 8
434 8 6527 -5548 -7786 2814 7589 -2724 -15196 -532 15094 -1947 -17073 -3686 15262
447 15262 5621 -20803 -9748 17328 6486 -14398 -9187 9317 5151 -14128 -1952 16680 -3339
460 -3339 -20565 -686 22839 5681 -26324 -8240 26764 9440 -22344 -13096 19672 18171 -15324
473 -15324 -14900 12341 10312 -6096 -2893 10354 2753 -16854 16 25953 5897 -23777 -11340
486 -11340 23655 21720 -18355 -21762 15709 24292 -4134 -21904 -1662 21371 6986 -10085 -3404
499 -3404 3012 321 -1829 8704 11872 -13799 -20822 12912 29424 -3110 -36260 -6180 40129
512 40129 12521 -38681 -19755 32046 25965 -26254 -27296 18485 15023 -15656 -2874 17675 -7838
525 -7838 -33414 7786 46257 -5216 -55201 -6180 49930 14339 -46758 -22571 37253 20158
537 20158 -27217 -19966 9796 11440 -2174 -723 -294 -16988 -8345 21397 17568 -13541 -27703
550 -27703 -5002 26795 20477 -15019 -32090 -1935 40045 15974 -41694 -25754 37208 35406
562 35406 -27984 -37166 21412 28422 -15731 -7476 22347 -7439 -37327 16433 61636 -11420 -75121
575 -75121 4519 80071 10508 -71521 -17877 63571 22435 -46855 -15731 29257 7280 -12017
587 -12017 10343 9854 -27977 -16191 40607 30315 -34117 -40031 15067 42874 7401 -32645 -23093
600 -23093 14283 34847 5373 -41457 -21579 37956 32776 -28225 -39033 14815 28772 -10584
612 -10584 -7578 14253 -18122 -34168 27894 58331 -27780 -82361 15580 88142 -5400 -85985
624 -85985 -8209 73498 11722 -61670 -11148 40125 -1342 -22583 17316 12292 -40335 -20923
636 -20923 56025 36196 -57426 -51984 37935 57218 -12855 -50620 -7450 32020 19934 -9044
648 -9044 -25527 -9707 25054 23946 -14257 -29604 1653 26344 8432 -6121 -4011 -17540 -10136
661 -10136 36317 38204 -35679 -63091 27490 80987 -11619 -79962 63 72270 10182 -56379
673 -56379 -7261 41323 -2882 -21835 24234 14103 -44817 -18582 63998 35790 -68721 -50727
685 -50727 58538 59132 -35846 -56051 15495 42045 -2200 -21248 -5055 -1242 4576 16663 3253
698 3253 -26034 -19699 23054 30285 -9434 -30908 -15505 15402 31834 6031 -36717 -32861 25378
711 25378 49088 -14291 -56180 -87 48818 7832 -39935 -12963 24854 4390 -11457 10383
723 10383 -586 -32586 -2975 49958 17537 -60282 -37287 54547 47612 -37513 -48960 18020
735 18020 40015 -6233 -23595 2414 5048 -2334 10217 9983 -17675 -22237 19184 36616 -9557
748 -9557 -40280 -5944 34755 25093 -17134 -30968 -1580 26733 21446 -12370 -29378 1304 28635
761 28635 11442 -17324 -16126 7262 14410 4975 -665 -11893 -14179 12602 29737 -209 -37927
774 -37927 -14913 38598 28025 -28039 -31881 13223 29303 -1293 -20126 -3864 5438 2742 8084
787 8084 2111 -16873 -14245 15674 26495 -10459 -34878 -2553 30109 14351 -20880 -23659 5873
800 5873 19121 4926 -11388 -15018 -438 14213 7455 -9267 -15734 -1530 16005 8495 -10693
813 -10693 -16214 -2834 17042 13303 -11672 -21040 -2060 21730 13340 -16163 -18564 5640 17308
826 17308 4592 -12212 -8535 4126 7632 6011 -2770 -11274 -2637 12564 12715 -7772 -19061 2683
840 2683 21042 7266 -13691 -12711 7229 15064 2009 -7573 -6805 827 10547 7146 -4925 -10226
854 -10226 -802 13589 7705 -9741 -10037 3718 12475 4227 -9492 -7493 3423 9352 4665 -7761
868 -7761 -9302 2922 9229 3833 -7843 -8439 3646 7652 1791 -5880 -8011 1380 8148 2486 -6157
883 -6157 -8611 2074 9100 409 -7533 -5206 2130 6328 3 -5305 -4502 -619 5482 2749 -6973
898 -6973 -6307 1777 6907 860 -8129 -3570 3899 3457 -21 -4426 -3092 2032 3160 2149 -3475 -5303
914 -5303 2248 5298 910 -3834 -3717 3379 4842 -388 -2441 -1813 2128 4832 -332 -2493 -605 2169
930 2169 3695 -268 -1963 239 608 3263 2066 -2209 -1547 1745 4148 1459 -3872 -479 3848 1189
946 1189 -568 -933 1213 1406 -718 1684 477 -2503 723 2735 643 -2566 -2073 3200 2051 -3236
962 -3236 -1023 1099 184 -968 -1211 1041 -275 -2554 1015 737 -1845 -1690 -447 1778 -714 -3311
978 -3311 -180 1218 -355 -1151 -2681 737 1111 -2469 -1477 570 1201 -1255 -3457 1467 2690 -3120
994 -3120 -2304 1844 2019 -2720 -4005 3620 3970 -4480 -3337 3506 3388 -2861 -4335 4809 4319 -4938
1010 -4938 -3201 4164 4067 -2637 -3813 4453 4318 -4216 -2591 4300 4440 -2600 -4942 3332 6055 -2139
1026 -2139 -3573 2281 5302 -911 -5660 2390 7208 -1516 -5631 1080 6598 90 -7496 1564 8348
1041 8348 -1352 -8229 230 9171 1811 -9318 -1250 8659 28 -7506 -136 7970 379 -10116
1055 -10116 -261 9515 -336 -8873 -1275 8670 1490 -11121 -2708 10454 3335 -9442 -6675 6726
1069 6726 5645 -7549 -5197 6103 2677 -7528 -4758 7754 5139 -10087 -6334 9712 5477
1082 5477 -10254 -7795 10019 9973 -10776 -11442 7902 10759 -4321 -9893 2959 7272 -4500 -4742
1096 -4742 6504 4828 -6487 -6297 6920 8660 -6695 -8725 6108 10451 -3062 -12462 739
1109 739 15221 3500 -12153 -5554 9448 8052 -6221 -4686 7812 1937 -8393 893 12277
1122 12277 1164 -15260 -1503 19017 2896 -19280 -4290 20485 8773 -19689 -11160 17088
1134 17088 10924 -11513 -7497 7788 2950 -8861 1253 12173 -3626 -15239 2171 15183
1146 15183 991 -16273 -4258 15099 6264 -12180 -10360 5349 11999 -496 -11418 -5329 5391
1159 5391 6718 -1813 -5468 7 -424 -3799 3568 7485 -4957 -13924 2262 18724 -1468 -23729
1173 -23729 -1951 25055 6637 -25118 -12327 21100 12754 -15276 -8114 9368 893 -9617
1185 -9617 5841 15024 -9815 -20121 10716 23001 -7166 -24257 3336 24774 1372 -21114
1197 -21114 -4649 15034 8890 -5207 -7207 -1186 2143 5684 6127 -3351 -8877 -1144 7440 8482
1211 8482 -890 -9961 -5272 9356 13672 -5805 -19947 2648 24308 4001 -23394 -10418 20293
1224 20293 13266 -13701 -9191 7552 1207 -5149 7494 9422 -14361 -17108 16667 23181 -15124
1237 -15124 -26826 9006 27295 -3587 -26157 -2188 18231 4567 -9010 -5216 -354 -1567
1249 -1567 3949 9611 -3892 -16563 -2251 15284 8537 -11229 -14397 3160 13992 4055 -11628
1262 -11628 -12962 6079 18043 -61 -19008 -8142 14418 13089 -8147 -10869 1145 2600 2012
1275 2012 7199 1228 -13958 -8917 17946 17836 -16945 -22364 12536 25149 -5486 -24568 564
1288 564 20076 3966 -10036 -3602 928 -836 5587 10514 -4494 -18714 647 21932 7771
1301 7771 -17591 -13378 11649 16338 -3534 -13044 -3945 8297 10605 -1263 -11425 -5404 8186
1314 8186 11826 -1609 -12158 -4490 5943 8606 2615 -8008 -10635 1501 14706 7268 -15704
1327 -15704 -14640 11534 17880 -5314 -19153 -2075 15622 5285 -8857 -6325 -913 1851 5791
1340 5791 4833 -6991 -14296 2329 18636 2925 -18551 -10099 13235 13926 -7654 -14325 504
1353 504 8977 5213 -3070 -8258 -3972 4700 10293 1205 -12499 -7793 8925 11905 -1358 -12501
1367 -12501 -5617 8666 10024 -691 -10848 -5980 8488 10732 -3184 -11225 -2977 10724 7832
1380 7832 -5597 -8370 -1006 6889 7629 -797 -8535 -6430 6322 13029 -325 -13763 -4747 11103
1394 11103 10156 -5557 -11040 821 8070 4351 -2629 -6758 -2366 4930 7321 -108 -9844 -5028
1408 -5028 9131 8915 -4152 -10965 -2322 8770 5809 -4231 -7554 -2601 5998 6676 -2697 -8334
1422 -8334 -3123 6837 6710 -4408 -8492 -1264 5955 5402 -3143 -7555 -1973 5514 6076 -2870 -9052
1437 -9052 -1453 7036 4847 -3860 -7704 -159 6124 3261 -2754 -6134 -1726 5571 4831 -2439 -7060
1452 -7060 -1798 7039 5048 -3839 -6035 -625 6078 3886 -2910 -4654 -419 4703 4608 -2711 -5042
1467 -5042 15 5073 4336 -2922 -5302 1001 5083 3479 -2017 -4921 453 5246 3139 -2322 -4855
1482 -4855 620 4974 2195 -2403 -3544 162 4207 2450 -2045 -3517 -530 4371 2376 -2856 -3450
1497 -3450 609 3946 1617 -3247 -2693 29 2901 2180 -2624 -3448 -115 3160 1883 -3083 -3657 1208
1513 1208 2315 417 -2064 -2775 456 1474 692 -918 -3129 -412 3022 804 -2200 -2994 455 2946
1529 2946 -218 -2483 -1255 663 1904 253 -1517 -1011 -183 1626 940 -1550 -1245 468 1294 1146
1545 1146 -920 -1768 439 1751 1424 -1304 -1846 1563 2194 57 -1769 -331 2134 463 -1162 996
1561 996 1067 226 51 987 1185 -1406 -1408 2836 1857 -1709 -1526 1314 3050 -587 -2271 1157 2074 -529
1579 -529 -1255 299 1818 -170 -1625 1006 1255 -581 -1343 165 2034 -600 -2985 515 2296 8
1595 8 -2356 -946 2523 133 -2910 -264 2224 239 -2805 -1666 2689 985 -2925 -849 2041 653
1611 653 -2733 -1966 2887 1147 -3395 -1484 2358 1717 -2397 -2220 2942 1876 -3383 -2044 2507 2602
1627 2602 -2018 -3216 1786 2959 -2050 -2431 2077 2974 -1527 -3913 2255 4079 -1784 -3210 1407
1642 1407 3579 -1135 -4082 2360 4873 -1608 -4194 1058 4743 31 -4297 1268 4548 -1200 -3981
1657 -3981 998 5253 641 -5032 187 4709 398 -3393 -276 4032 891 -4575 -395 4487 1319
1672 1319 -3371 -1710 3668 1869 -4294 -1503 4588 2117 -4765 -3768 4198 4320 -4240 -4069 2974 2706
1688 2706 -3801 -3931 3678 3777 -4686 -3903 3727 3350 -4013 -3837 3935 3851 -5269 -4984 4293 5174 -2936
1705 -2936 -6090 1568 4813 -1324 -3589 1186 2909 -1266 -3670 1198 3730 -1717 -3713 1141 3585
1720 3585 -1071 -5107 603 6797 312 -7227 -2314 6377 3845 -5466 -3590 5101 2617 -4139 -1308
1735 -1308 4713 1552 -5500 -839 6515 556 -6455 185 8147 1453 -8782 -2467 8944 4172
1749 4172 -5763 -4193 3809 3967 -2033 -1272 2378 -92 -2264 691 3070 462 -3428 -246 4162
1764 4162 1052 -4147 -3010 3493 5851 -2052 -7272 -957 6114 3427 -4669 -4294 3118 2696 -2411
1779 -2411 -1085 2311 -499 -3852 873 5205 -2311 -7235 2155 8554 -1274 -10474 -1284 10287 2943
1794 2943 -8398 -4101 4262 2788 -2483 -819 1738 -2355 -2859 3737 3411 -4280 -4914 3586 6631
1809 6631 -2828 -7213 222 6456 3520 -4069 -5339 1239 5080 2356 -2465 -4191 601 3684 1449
1824 1449 -709 -1378 -1097 746 2665 1841 -3405 -4525 4446 7597 -2699 -9020 -407 10260 3691
1839 3691 -7915 -4765 4159 4102 -480 -1413 4 -2129 -1180 5216 3007 -6336 -4895 5805 7170
1854 7170 -4156 -8818 1846 8472 1253 -6019 -4460 2314 4237 1281 -2099 -4030 -1788 4031
1868 4031 4120 -1825 -5591 -1974 4416 3563 -2391 -5151 -1288 5064 4199 -4294 -7121 485 7475 3180
1884 3180 -6397 -5636 2909 4906 608 -2952 -2639 -911 1588 4464 208 -6801 -3085 6643 6080 -5178
1900 -5178 -8392 2613 9188 365 -6587 -3586 3150 4160 682 -1330 -3628 -2265 4677 5559 -2452
1915 -2452 -6746 37 7438 3447 -5443 -5022 2603 5718 1836 -4338 -4299 1693 5592 3100 -4631 -5790
1931 -5790 1973 6437 2362 -3858 -4482 1175 4768 2706 -2137 -5453 -354 6316 3390 -5143 -6092
1946 -6092 2467 7826 352 -6251 -3080 2687 4187 606 -3356 -3700 -747 4915 4103 -4298 -6843
1961 -6843 1055 7084 2114 -6498 -4720 3310 4834 -37 -4370 -3436 1412 4263 1779 -3859 -5319
1976 -5319 1521 5962 1575 -5014 -4968 2306 5629 517 -4321 -3805 1659 5629 1455 -4515 -4352 1775
1992 1775 5784 931 -4970 -3216 2380 4895 1038 -3815 -3336 1593 4895 2173 -4235 -4175 2738 5503
2008 5503 1255 -4883 -3173 3582 4624 194 -3551 -2951 2498 4545 1059 -3360 -3663 1908 5477
2023 5477 792 -4545 -3016 2369 4939 153 -4071 -2134 2280 4159 261 -4184 -2276 1813 3481
2038 3481 633 -4045 -2706 2241 3532 354 -3989 -3161 2526 3776 129 -3909 -2777 2315 3274
2053 3274 -26 -3498 -2342 1980 3333 -397 -3058 -2506 1718 3144 -537 -3248 -1655 1688 2949
2068 2949 -747 -3188 -1962 1847 3099 15 -3374 -1730 2150 3196 -69 -3365 -1273 2369 2631
2083 2631 -171 -2531 -1127 2237 2334 484 -2087 -1275 2112 2635 -431 -2343 -1144 2067 2535 -652
2099 -652 -1883 -931 1901 2695 -463 -1894 -750 1758 2304 -582 -2143 42 1733 1444 -78 -1506
2115 -1506 -614 811 1661 437 -2038 -1201 1664 2099 -486 -2649 -382 2296 653 -1296 -1124 -9
2131 -9 1251 485 -676 -1121 -1038 554 1481 -479 -1670 -1138 984 1767 -931 -1856 -294 1040 877 -906
2149 -906 -1628 251 816 -90 -648 -821 443 415 -224 447 -674 -933 268 777 536 -1446 -993 1572
2167 1572 1296 -936 -1514 410 1782 -572 -1466 452 1071 59 -470 61 728 -732 -514 1511 631
2184 631 -663 -938 768 1738 -645 -1363 827 1127 -156 -737 -86 1393 471 -848 -92 936 235
2201 235 -447 84 1378 -95 -1277 200 1257 398 -1119 -637 1375 469 -1097 -318 1071 634 -1144
2218 -1144 -1179 1179 950 -1040 -716 751 775 -820 -1090 1036 1074 -1275 -1053 759 1624 -523 -1412 648
2236 648 888 -1287 -1279 731 1548 -918 -2499 520 1768 -639 -1573 431 1254 -666 -2314 805 1809
2253 1809 -377 -1474 68 1630 -180 -1599 718 1814 -678 -1659 -74 1834 686 -1513 -108
2268 -108 1599 -170 -982 -158 1493 836 -1753 -548 1405 1009 -773 -916 1526 963 -1749 -962 1945
2285 1945 1191 -1239 -1681 1538 1970 -1007 -864 1473 909 -1418 -1727 1692 1998 -1499 -1668 928 1484
2302 1484 -721 -1416 1155 1669 -1548 -1859 864 1422 -511 -1364 689 1045 -1623 -1271 1210 1541 -878
2319 -878 -2244 -40 1897 -122 -1721 -109 1081 5 -1626 -362 1433 52 -1434 -617 641
2334 641 112 -1150 21 1300 -320 -2240 -471 1943 1315 -2189 -1912 1295 1316 -858 -1270 646 1274
2351 1274 -1009 -1043 966 395 -476 -227 1409 469 -2043 -777 2446 1711 -1891 -2089 1360 2547 -624
2368 -624 -1480 318 1025 37 -381 309 505 -221 73 952 -173 -1317 39 1830 1606 -1507 -2007 989
2386 989 2323 956 -2002 -1678 1380 1565 -318 -1166 -282 1088 157 -718 542 -275 -551 776 1074
2403 1074 -781 -2522 -97 3681 1157 -3482 -2150 2228 2690 -1118 -2350 -12 449 -225 220 -368
2419 -368 -1089 -586 1164 1656 -2043 -2540 968 2813 -70 -3040 -1811 1860 2375 -310 -1996 -1775 1054
2436 1054 2074 -80 -1704 -1099 1007 2017 -475 -1560 -570 697 1327 722 -1751 -1978 1170 3371
2452 3371 313 -3730 -1828 2817 2717 -733 -2593 -175 1604 870 388 -778 -1585 357 2403 1399
2468 1399 -2496 -2452 2675 3652 -890 -3579 -1034 2772 2166 -678 -1494 -1253 1360 2432 330 -2762
2484 -2762 -1840 1322 3151 -265 -3215 -842 1989 2275 -449 -2753 -1326 1654 2573 -233 -3526 -2047
2500 -2047 2500 2778 -982 -3272 -986 2280 1397 -643 -1893 -1846 1108 2556 138 -3098 -2148 2880
2516 2880 3225 -1765 -3871 -377 2874 1973 -1322 -2562 -947 1256 2721 10 -3102 -1842 2336
2531 2336 3272 -569 -4108 -431 2898 1954 -1228 -2847 -239 2085 2190 -501 -2955 -1191 2445 2908
2547 2908 -918 -3316 -854 2935 2228 -1259 -2746 -831 2227 2481 -1029 -3079 -939 2593 2905 -1362
2563 -1362 -3122 -121 2739 2138 -1147 -2847 -422 2073 2414 -799 -2953 -724 2518 2595 -1365 -3580
2579 -3580 -757 3264 1917 -1622 -2855 -309 2525 1944 -1268 -2881 -993 2488 2368 -1409 -2948
2594 -2948 -804 2791 2325 -1877 -2826 -493 2697 1774 -1710 -2553 -158 2023 1697 -1349 -2956 -179
2610 -179 2407 1991 -1514 -3306 -191 2886 1629 -1469 -2829 -358 2909 1445 -1134 -2412 -399
2625 -399 2523 1648 -1278 -2411 -309 2852 1540 -1721 -2035 191 2528 1662 -1434 -2241 95 2367
2641 2367 1794 -1520 -2475 405 2318 1688 -1477 -2224 450 2360 1165 -837 -2152 305 2285 1294
2657 1294 -1148 -2444 67 2612 1150 -1729 -2017 590 2312 691 -1143 -1634 -324 1544 1169 -1174
2673 -1174 -1978 -85 2291 1300 -2176 -1943 700 2058 476 -1781 -1746 461 1425 494 -1299 -1621 255
2690 255 1686 784 -1165 -2067 463 1956 264 -1438 -1740 100 1708 300 -1482 -1510 501 1807
2706 1807 122 -1529 -850 358 1386 521 -1114 -863 -209 1227 973 -1097 -1217 403 1596 845 -1585
2723 -1585 -1154 1164 1587 123 -1034 -703 741 1075 318 -348 -812 199 1312 488 -706 -1071 39
2740 39 1629 368 -924 -697 1065 1413 -348 -1000 -7 516 825 207 -651 -77 -211 470 671 -442
2758 -442 -514 19 697 496 -1183 -945 912 892 -194 -1120 -721 984 845 -441 -448 -273 344 145 -79 3
2778 3 -495 -522 549 245 99 -1079 -120 855 -127 -1184 -272 1139 510 -1065 -647 623 169 -394 64
2797 64 437 -470 -829 24 853 -331 -719 263 454 -45 -762 97 1136 -49 -812 55 481 734 -413
2816 -413 -26 386 -91 -340 321 521 309 -127 -394 536 329 -212 -78 69 461 -126 -845 344 609 -30
2836 -30 -574 -2 377 -53 -647 355 697 -213 -702 47 934 -155 -544 350 263 -346 -488 183 842 -354
2856 -354 -1073 406 554 -118 -339 -45 387 -214 -691 413 568 -93 -696 -247 317 142 -428 31 365
2875 365 -508 -611 -173 568 217 -680 -347 200 -110 -453 -226 478 -2 -625 -243 131 459 -115 -410 153
2895 153 148 -424 13 524 231 -219 -368 264 621 -247 161 188 216 -31 -359 296 982 62 -343 -2 571
2916 571 306 -240 552 555 -435 -393 368 845 122 -846 -9 346 -569 -33 777 475 -567 -694 283 902 -289
2937 -289 15 218 -250 -217 -181 267 166 -164 -113 88 -122 -183 479 20 -292 -73 -340 114 215 451 -558
2958 -558 -779 -24 670 80 -665 66 520 -400 -754 298 344 -19 -631 172 270 -935 -71 1284 406 -1469
2978 -1469 -895 991 1364 -773 -668 758 226 -298 62 400 68 -449 549 375 -883 -241 1277 1000
2996 1000 -551 -1115 346 1070 303 -230 -285 -272 502 811 -42 -746 -221 1287 571 -1017 -431 580 593
3015 593 132 -293 -250 -607 539 1716 -185 -1928 -428 1727 1270 -1318 -1217 834 606 -271 -257 -69
3033 -69 -520 314 753 65 -1401 -626 1548 972 -1284 -1873 320 1578 253 -1234 -752 -391 646 692
3051 692 -598 -1077 -662 1238 991 -1225 -1268 418 1007 203 -746 -1231 6 829 1227 -756 -2161 81
3069 81 1759 1099 -1504 -1568 667 1409 54 -451 -725 -111 779 907 -99 -1494 -280 2181 1384 -1675
3087 -1675 -1686 807 2261 563 -1784 -821 466 1225 745 -586 -1429 -38 1664 1305 -1030 -1602 746
3104 746 2118 583 -1123 -1734 530 1598 701 -1144 -1854 315 2111 552 -1718 -1754 706 2070
3120 2070 510 -1383 -1137 252 1684 938 -1005 -1682 142 2012 910 -2298 -1742 578 2023 442
3136 442 -1855 -1093 767 1321 669 -1017 -1659 222 1765 1018 -1390 -1977 565 2192 160 -2018 -1731
3153 -1731 560 2046 294 -1580 -1370 671 2291 406 -1681 -1506 488 2151 88 -2016 -1474 774
3169 774 2201 356 -1798 -1473 647 1994 604 -1895 -1325 1103 2083 308 -1806 -1311 1404 1978
3185 1978 195 -1603 -1109 1126 1992 464 -1598 -1557 663 2142 214 -1886 -1468 1260 2072 -121
3201 -121 -1870 -995 1145 1899 84 -1441 -1417 637 2147 401 -1982 -1416 1260 2084 192 -2070 -1186
3218 -1186 1073 1692 145 -1576 -1480 1057 1733 16 -1720 -1447 1272 1776 -320 -1527 -796 1105 1610
3235 1610 -248 -1483 -1349 873 2148 -305 -2078 -1247 1146 1952 -509 -2017 -726 1214 1669 -233
3251 -233 -1919 -798 776 1744 346 -1897 -1136 1554 1846 -51 -1706 -755 1711 1186 -187 -1406
3267 -1406 -592 991 1376 1 -1248 -839 1369 1875 -598 -1537 -563 1135 1677 -361 -1470 -441 891
3284 891 1691 -447 -1436 -181 1069 1256 -424 -1492 -19 1020 1132 -178 -1382 -711 1025 1060 -195
3301 -195 -1539 -1061 1184 1102 -623 -1396 -542 1222 712 -875 -1122 -340 859 679 -519 -1378 -799 682
3319 682 979 -570 -1402 -334 760 868 -602 -1329 -211 728 618 -507 -1341 -72 968 592 -379
3336 -379 -1230 -203 906 795 -147 -1239 -129 1048 894 -443 -790 -239 1114 687 -654 -709 -66 772
3354 772 604 -334 -759 -32 769 911 -243 -552 43 560 1026 -160 -985 -204 561 682 -356 -727 283
3373 283 814 195 -357 -272 146 547 69 -202 -331 -137 844 403 -66 -636 9 659 282 -517 -117 83
3393 83 279 169 -147 -450 -136 93 131 -420 -548 21 495 188 -658 -496 -50 271 201 139 -533 -236 89
3414 89 87 75 -612 86 483 -149 -446 -111 257 285 -201 -96 -320 -105 208 536 -66 -439 -355 161 256 -257
3436 -257 -57 226 50 114 30 367 298 -3 -69 10 372 318 252 -184 126 -27 33 211 184 302 -95 -73 244
3459 244 299 137 182 243 74 22 -129 355 193 49 66 -66 378 -113 -95 146 189 78 -396 -303 605 -102 -271
3482 -271 -67 -81 86 58 236 209 -210 -618 198 308 51 -432 -313 518 -77 -495 284 184 -81 -425 -260
3503 -260 359 -201 -406 409 -93 -415 -422 65 433 -67 -175 122 -66 236 227 119 135 -106 -225 -274 -316 426
3525 426 359 -103 -89 248 303 97 -278 396 159 -857 -279 1010 338 -264 -331 705 217 -815 502 534
3545 534 -339 -529 -111 623 4 -849 610 541 -622 -238 541 445 -409 -587 412 82 -427 266 450 43
3565 43 -225 -36 444 112 -81 473 -265 -618 63 276 -253 -670 -24 561 -606 -587 751 287 -552 -324
3585 -324 199 162 -1048 288 960 -592 -1366 -149 722 178 -975 -83 582 -254 -532 -65 138 -295 -377
3604 -377 537 -72 -774 283 614 317 -756 -656 770 850 -64 -390 -73 -192 135 460 -194 -388 231
3623 231 745 -397 -837 131 753 263 9 -294 34 -65 537 910 -506 -793 558 1209 20 -1055 -179
3642 -179 1233 248 -551 -125 440 120 -183 193 -3 -663 123 1128 198 -1083 -415 630 1057 -500
3660 -500 -774 -101 347 635 -165 -560 -284 116 525 -161 -1292 48 554 633 -219 -932 -445 747 636
3679 636 -81 -978 -709 589 605 -41 -1110 -516 735 414 -535 -583 -153 551 431 -215 -450 -723 310
3698 310 1174 -158 -1548 -462 949 1333 -690 -1269 219 933 656 -123 -867 -159 548 698 41 -1451
3716 -1451 -275 976 952 -614 -1570 -380 1444 727 -515 -699 -108 1069 1053 -380 -913 -618 1180
3733 1180 1334 -746 -1260 -176 1245 1071 -695 -1297 -5 787 1011 -284 -1290 -222 1393 1059 -677
3750 -677 -1543 -4 1432 444 -488 -1237 -87 1297 627 -336 -1310 -534 1246 915 -900 -1359 -65 1489
3768 1489 652 -925 -1017 -104 825 853 -884 -1288 -192 1123 1174 -942 -1830 29 1509 936 -1032 -1458
3786 -1458 284 1056 1053 -482 -1561 -75 1283 879 -785 -1730 19 1686 576 -1165 -1303 131 1475
3803 1475 763 -534 -1297 16 1646 1153 -1192 -1309 285 1659 715 -1071 -1046 211 1107 475 -741
3820 -741 -1170 249 1226 963 -1114 -1527 196 1278 705 -959 -1051 256 1406 497 -561 -1204 326
3837 326 1554 675 -1127 -1449 262 1852 362 -1233 -797 361 1205 681 -944 -1058 -93 1114 795
3854 795 -1242 -1609 326 1686 359 -1305 -1160 856 754 78 -799 -916 133 920 556 -571 -1385
3871 -1385 19 1361 566 -1365 -1376 718 1550 357 -1024 -555 451 1437 209 -964 -623 323 1170
3888 1170 272 -900 -568 269 1088 670 -887 -901 478 1141 816 -1022 -968 913 1303 146 -1264 -559
3906 -559 686 1049 -105 -755 -613 91 742 222 -435 -1013 56 1175 476 -1279 -1003 704 1409 -377
3924 -377 -1404 -123 725 830 -126 -911 -228 467 372 357 -683 -780 126 728 701 -860 -875 393 834 124
3944 124 -1047 -638 835 912 -417 -596 -260 313 416 -326 -239 -188 -345 628 83 -290 -837 28 1051 322
3964 322 -999 -295 711 709 -219 -1075 173 553 446 -211 -540 314 247 156 392 137 -315 27 509 448 -398
3985 -398 -759 595 756 -213 -612 16 923 782 -605 139 229 535 101 24 12 -168 -397 436 708 -215
4005 -215 -191 120 859 271 -632 -159 749 282 -504 -457 376 834 -219 -451 147 111 -119 -28 218 45 -750
4026 -750 -76 287 223 -338 -159 22 250 -373 -475 252 181 -212 -581 -141 445 46 -132 20 -122 -85 -616
4047 -616 79 551 -225 -430 -184 484 14 -783 -56 656 -139 -574 80 568 261 -651 20 396 -9 -160
4067 -160 -38 240 -129 -395 51 300 29 324 101 -130 -2 -54 -156 182 128 190 -544 -51 722 163 -287
4088 -287 199 490 122 -487 66 633 -98 -546 230 217 8 -326 160 636 -337 -624 381 631 -150 -671
4108 -671 455 519 -389 -332 395 434 -152 -538 -148 333 12 -5 97 -311 -135 296 -10 118 -313 -287 193
4129 193 -263 277 139 -320 163 -215 -115 -519 -166 384 72 -794 -196 178 287 -476 60 499 40 -612
4149 -612 420 577 -147 -589 53 662 -114 -369 582 511 -128 -115 -106 516 -165 -148 333 109 191 258 182 35
4171 35 -173 -135 346 25 -82 530 -25 8 155 10 253 56 124 51 -532 69 303 87 -202 -201 118 545
4193 545 -447 120 498 81 -224 50 207 -241 -250 290 556 -365 -269 191 549 168 -551 174 251 -489 -286
4214 -286 -51 151 -125 -441 71 -207 -421 154 167 -164 -320 -281 83 -50 -535 -49 -483 117 284 -112 -231
4235 -231 -144 124 689 -448 -647 673 377 -127 -341 -56 488 195 -152 281 -161 -53 424 342 -4 -406
4255 -406 75 1026 -121 -494 -221 294 530 -92 -43 194 -83 474 408 -98 -283 127 803 356 -898 -215
4275 -215 173 457 313 -312 -225 167 228 206 -183 -847 430 679 65 -436 -691 256 675 -458 -356 -352 16
4296 16 553 224 -74 -802 314 885 95 -1029 -253 394 330 -113 -816 -166 149 104 323 -502 -794 266
4316 266 745 -63 -799 -811 708 438 -96 -860 -413 420 420 181 -123 -1038 111 874 -37 -773 -655 529
4336 529 1052 -134 -740 -204 620 693 162 -643 -271 349 1076 134 -796 -472 724 755 -214 -1038 -88 690
4356 690 638 238 -1124 -443 734 1182 161 -807 -483 1303 1116 -477 -686 -227 660 655 -13 -400 -649
4375 -649 383 951 101 -1198 -561 966 1133 -440 -1309 -284 980 1046 -222 -1223 -120 544 782
4392 782 76 -1278 -588 725 884 -212 -796 -413 738 647 -448 -1252 -633 776 1188 -873 -1246 1
4410 1 973 685 -801 -765 -254 932 594 -218 -693 -643 218 1047 41 -1345 -531 948 1185 -468 -1456
4429 -1456 96 1399 795 -398 -740 50 638 703 -384 -676 -208 1134 833 -495 -790 -564 959 1062
4447 1062 -266 -1057 -355 1021 1277 -646 -1183 -316 1470 686 -766 -698 233 805 577 -102 -751 -144
4465 -144 520 732 8 -1559 -394 1275 818 -988 -1492 406 1282 111 -961 -622 359 620 227 -448
4483 -448 -521 -227 524 822 -421 -1183 -340 1184 872 -1114 -1492 64 1200 866 -897 -1105 512 944
4501 944 258 -819 -877 543 532 -37 -268 -732 -279 547 844 -127 -1560 -342 1349 863 -1118 -1187 666
4520 666 1440 -70 -1221 -306 509 552 -146 -216 -212 -126 211 1103 -218 -787 -46 1109 877 -844 -631 351
4540 351 998 218 -761 -478 823 587 54 -420 -328 238 255 37 108 -508 -384 321 694 88 -866 -160 1180
4561 1180 383 -1236 -795 607 1179 -493 -998 238 318 -94 -10 170 -25 -415 118 770 -226 -1128 138
4580 138 889 408 -1196 -728 901 903 -68 -740 -446 216 296 -185 -215 -172 -206 305 23 120 -309 -194 514 420
4602 420 -403 -612 16 955 116 -978 -173 999 333 -757 -604 508 226 -164 183 538 8 -265 295
4621 295 712 -117 -526 392 333 75 -761 66 495 119 -356 -241 -91 537 223 -205 -169 281 -195 -133 -214
4642 -214 205 -95 -570 -59 628 107 -517 122 593 -265 -620 -81 554 35 -393 -61 117 -205 -773 615
4662 615 669 -260 -451 262 641 -18 -702 166 336 -384 -291 -27 33 4 -66 -53 59 -67 274 -249 114 -84
4684 -84 -172 -199 132 254 351 -323 -169 267 -225 -33 -102 450 51 -428 50 574 79 -314 307 494 -7 -608
4706 -608 337 752 -497 -341 144 249 94 -216 16 408 -184 -98 518 23 -257 -21 402 217 -541 48
4726 48 235 130 69 -406 125 183 66 -250 -127 -177 71 -137 -70 47 22 -129 -183 -12 206 357 -55 38 -10
4749 -10 -122 -31 131 224 -206 -470 20 293 74 -203 -314 69 -51 -189 46 -127 39 21 -58 218 69 -14
4771 -14 151 83 -420 -381 258 257 -42 -270 26 -384 206 231 1 45 48 165 297 -34 -69 476 80 59 -43 266
4795 266 154 14 50 251 -303 -110 42 132 84 -281 124 317 -19 -3 273 109 -15 -85 144 203 -275 153
4817 153 220 -123 -168 86 281 52 -267 -107 298 53 -52 -206 40 170 -157 47 -356 -56 360 -66 -88
4838 -88 -82 80 205 -64 -239 109 49 68 -137 -10 52 -89 -130 362 -418 -516 234 108 -109 -324 55 335 -31
4861 -31 -185 20 -5 -145 150 112 120 -398 39 322 -42 -285 -71 526 39 -255 -83 238 315 368 -45 -405
4883 -405 -195 343 405 2 -368 -163 462 227 -131 -202 40 432 159 263 -85 -119 345 143 -211 -70 -50
4904 -50 332 95 -352 248 -249 292 168 6 -490 -403 541 260 -310 -541 81 266 16 -385 -197 237 -43
4925 -43 41 -37 -294 -233 238 477 -138 -711 129 697 -22 -404 -264 267 646 -18 -313 -253 125 122 7 -490
4947 -490 -392 -94 475 309 -320 -298 125 307 292 -365 -770 297 695 193 -624 -534 490 332 -195 -365 -117
4968 -117 271 419 139 -310 -409 -121 766 574 -292 -425 309 1104 -27 -844 -336 747 907 -327 -395 -80
4988 -80 129 589 155 -355 -223 218 378 394 -439 -542 458 654 218 -640 -785 518 555 -96 -799 -380
5008 -380 669 579 -361 -773 -258 -37 622 -8 -275 -615 -235 832 334 -903 -828 344 1368 -197 -1032
5027 -1032 -148 419 306 -304 -683 72 276 125 287 -322 -797 211 728 578 -685 -642 600 836 -351
5046 -351 -800 -444 459 512 -309 -473 -197 637 562 -233 -754 46 242 421 278 -486 -334 -23 865 516 -960
5067 -960 -828 566 1024 -268 -1042 -106 1385 272 -538 -436 302 161 -18 421 -232 -715 26 923 404
5086 404 -795 -690 871 955 -466 -860 171 618 121 -327 -393 -142 177 238 -169 -505 -252 241 394 -284
5106 -284 -368 -216 -35 574 588 -1104 -629 681 860 -308 -1218 342 767 -38 -935 123 392 -28 -294
5125 -294 319 72 -812 224 1039 397 -1067 -334 1158 907 -869 -742 322 675 207 -292 -62 62
5143 62 126 126 -43 -287 -245 429 461 79 -476 -295 192 891 85 -973 -385 750 687 -441 -755 153 605
5164 605 -286 -456 310 246 194 -350 449 33 -665 68 1062 -335 -793 -268 997 548 -700 -377 451 145
5184 145 -161 -277 -81 21 -184 214 266 -248 -124 112 122 -48 -480 -95 329 336 -375 -444 -60 646 155 -613
5206 -613 -390 193 295 -123 -309 95 14 4 126 289 -214 -227 169 861 -273 -804 110 754 394 -379 -105
5227 -105 291 180 -9 148 -108 -54 -413 102 -68 -292 -120 286 -31 -146 -94 51 190 36 -262 -268 -207 676
5249 676 293 -327 -114 250 156 -46 -316 536 286 -202 148 418 -99 -31 -8 263 -146 -439 104 440 -197
5270 -197 -325 216 133 -31 -128 407 -75 -292 -81 -33 315 -18 -50 216 -71 -129 -174 -103 -40 -125 -94 -179 -265 -137
5294 -137 -19 -207 23 97 55 9 4 -46 56 -239 36 349 71 -536 -186 124 -208 63 28 354 42 141 -188
5317 -188 93 -23 67 244 -81 -324 7 441 296 -68 -295 73 309 199 -27 -150 126 13 -271 -91
5337 -91 -10 78 208 113 123 -119 -74 98 64 -41 -26 50 -135 12 -56 -15 -113 -49 411 359 -317 -131 109 -30 -10
5362 -10 -436 173 276 -274 130 -104 -92 -72 36 16 -200 -196 325 -98 39 -198 134 59 -146 -10 176 -219
5384 -219 52 160 -111 -121 -85 -127 77 -100 -143 290 -47 -19 84 -1 -199 -149 263 196 -361 41 192 41 -164
5407 -164 52 226 230 -46 14 225 -21 -9 201 24 -311 -245 125 447 -229 -192 241 268 2 -277 220 172 76
5430 76 97 22 -136 -100 -220 210 113 -79 331 -36 -202 28 126 318 461 87 25 -120 163 174 142 -95 -162
5453 -162 176 199 -373 -16 134 -293 66 -190 -221 17 -361 298 190 -244 -96 -22 -106 153 -132 -96 3 -348
5475 -348 -15 71 -328 94 189 -7 -202 -80 37 -99 -137 -359 316 117 -95 -301 -81 82 -8 222 -109
5496 -109 -29 282 -50 134 -45 -92 28 293 197 32 -85 347 465 170 -8 -85 81 183 -284 -169 -279
5517 -279 304 437 36 -109 126 -5 281 346 -63 -70 43 425 -191 -322 -167 379 -45 -12 -170 -158 208 -86
5539 -86 122 -196 -125 204 4 95 -194 -434 119 215 -80 -450 -324 412 159 -396 -121 -28 253 20 -604 -38
5561 -38 314 117 1 -184 -242 -89 134 231 100 -498 -29 282 281 -299 -471 -30 521 -190 -365 26 -6 310
5583 310 89 -163 -146 161 -49 285 188 -23 -527 418 622 -127 -297 -100 687 63 -635 -203 316 365 -149
5604 -149 -237 -320 78 -31 299 -23 -548 -34 216 349 -44 -430 -319 337 27 -454 -692 189 872 44 -578
5625 -578 -418 493 153 -75 -181 81 -229 -239 275 -12 -432 -420 559 250 -394 -673 455 603 47 -751
5645 -751 -100 489 106 -152 -229 96 6 228 212 -30 -419 -62 283 247 -153 -452 -95 300 26 -502 -688
5666 -688 365 860 -263 -612 -120 761 290 -381 7 219 9 -1 749 -6 -534 -221 680 587 -716 -817
5686 -817 615 828 -400 -564 126 334 224 21 229 -143 -117 505 215 -362 -258 -58 498 239 -261 -139
5706 -139 116 555 162 -377 -501 338 645 -155 -619 78 366 472 -221 3 29 36 -185 389 11 -750 -37
5727 -37 588 213 -662 -807 783 724 -617 -685 528 401 -283 -272 48 -179 -222 240 393 -409 -551 282 541
5748 541 -34 -607 -392 142 315 -92 -591 -265 88 198 -83 -446 306 398 -182 -265 20 28 -7 395 352 12
5770 12 -390 86 502 -50 -544 57 466 117 -211 -369 464 435 -162 -327 -171 10 33 145 182 -256 -219 650
5792 650 488 -273 -463 -24 375 -119 -104 -96 -81 332 142 -305 -190 -68 449 -358 63 -89 116 296 124
5813 124 205 -196 -115 145 443 58 -172 48 201 -26 -283 -261 284 226 31 -172 45 -196 74 3 20 -76
5835 -76 -252 103 67 -167 -121 193 -3 -123 53 -201 -182 182 75 -212 -79 -269 224 80 9 -76 202 -25
5857 -25 86 72 -68 24 -99 367 45 -47 224 111 116 130 -234 99 271 424 123 190 9 100 222 -9 -56
5880 -56 -86 113 153 133 67 64 -163 -6 -146 -45 -174 240 20 13 -189 -75 -35 252 81 54 -222 -67 214 -76
5904 -76 -237 -271 -277 9 229 -72 63 145 -197 -2 -207 -184 -281 -26 16 -334 -27 213 -67 187 219 -121 -13
5927 -13 120 -118 52 -292 83 187 -137 2 -153 0 49 -188 202 77 -97 -8 322 57 -15 24 -227 324
5949 324 106 120 -38 -57 155 175 -280 -55 186 66 -109 -155 166 14 -70 -252 -216 135 -112 -23 -119 32 -152
5972 -152 -9 244 39 -202 95 103 -201 -60 102 -176 7 198 -123 89 28 26 287 -46 -252 -206 117 -98
5994 -98 -119 -201 -55 -45 276 127 -41 -73 161 87 -19 -263 35 150 -131 -29 -95 -337 144 -152 76 310
6016 310 -42 184 488 9 126 -210 3 237 -224 162 12 -129 -132 -84 -129 199 -196 136 -102 -200 183 133
6038 133 159 -124 15 210 53 -21 99 -172 145 65 -15 228 69 -33 185 -17 -139 151 -2 82 61 -79
6060 -79 -81 138 239 175 -231 -454 -89 59 64 -132 -113 -130 273 45 -10 28 -17 -35 -61 -83 84 29 202 52 -122
6085 -122 48 -7 -78 -148 83 -146 17 -101 -154 -225 76 -44 388 0 -265 64 -176 52 148 -502 49 139
6107 139 -149 -89 125 106 28 -357 125 38 -228 -119 -146 62 54 -48 118 230 -256 -89 21 321 -286 -156
6129 -156 75 124 142 12 30 227 155 235 -54 -22 -74 -263 54 234 -297 -245 149 75 36 -23 -127 246 305 -6
6153 -6 -273 -47 140 -216 -150 -22 -68 -20 -149 378 -154 -252 -175 63 265 -394 -98 68 346 60 -192 -161 167
6176 167 277 -134 -145 103 132 -97 -49 187 66 -7 291 135 73 -433 320 369 -75 -203 -167 182 208 -270 -257
6199 -257 306 9 -119 151 17 -112 10 15 121 -443 -339 -18 445 143 -328 186 340 352 -92 -134 -193 407
6221 407 53 -251 106 173 197 45 6 196 -117 -388 74 195 -449 -275 127 527 -220 -343 2 300 88
6242 88 -360 15 163 64 -418 169 120 -73 -23 254 -60 -333 -471 638 31 -118 -366 -171 289 -109 110
6263 110 -249 -279 306 81 -168 -184 128 -101 70 -253 -240 -147 -122 183 -67 -138 -65 -10 301 -31 -597 143 371
6286 371 -233 -309 -219 236 -214 -100 49 -137 -12 38 146 -9 -366 51 345 117 -248 -198 96 518 -19
6307 -19 -264 43 -56 113 309 -145 -258 524 279 56 -218 -226 29 280 -253 145 -586 182 245 48 109 -220
6329 -220 409 540 -375 -236 -17 107 73 -74 -38 -256 -68 308 92 -139 -508 -50 252 -63 -531 -160 221
6350 221 395 -156 -225 28 118 161 -7 -107 -363 195 234 189 -61 -244 127 491 3 -64 -64 -3 121 -13 -96
6373 -96 -398 167 338 -246 -165 -36 80 338 -45 35 38 -295 189 185 118 -366 -78 187 91 69 -173 -48 -77 214
6397 214 -139 -194 -53 109 34 -281 -208 159 42 166 -88 -224 378 135 -38 -91 -162 57 -120 57 -135 -26
6419 -26 -110 57 32 -193 53 319 -129 338 -431 25 88 44 403 -45 -64 -253 73 157 67 -171 223 -151 50
6442 50 -90 -135 160 12 200 -48 41 -241 179 65 82 -147 44 91 -44 -206 -116 96 43 -157 -169 -106 -116
6465 -116 315 120 -19 -31 -34 -55 49 -175 -313 234 85 235 -251 -14 -177 128 234 -89 -41 1 437 -69
6487 -69 -27 -231 188 73 -62 -119 -154 27 258 -224 -97 202 -41 30 -13 36 219 72 -359 -139 141 327
6509 327 -113 -175 162 -41 -330 92 79 114 110 80 108 216 99 317 -131 146 -68 -36 190 68 -198 116 73
6532 73 -59 -279 -83 191 -215 -274 -39 -275 222 64 -50 31 100 165 248 -199 27 -124 -198 231 169 99 -121
6555 -121 202 195 -31 -298 -83 96 199 -272 6 193 111 51 238 56 139 3 16 89 68 -49 -86 118 -335
6578 -335 147 302 -18 -88 -48 -63 9 146 55 12 77 -72 -23 85 122 214 27 -173 230 53 -9 33 -111 -237
6602 -237 -70 -251 -57 49 -114 62 -81 -213 -159 -71 -124 115 -92 -8 13 -177 -158 108 41 45 92 32 2 109
6626 109 -195 -157 -363 -32 200 4 225 -32 -122 -336 135 95 -118 235 -263 16 185 -59 -125 -1 -240
6647 -240 209 2 -101 118 148 42 -59 -25 261 49 25 -113 -127 284 5 -44 107 33 264 28 127 -16
6669 -16 -252 53 -7 135 -165 248 92 253 250 -303 -42 148 40 146 -115 -19 -106 -55 9 2 6 71 299 72
6693 72 36 -134 44 69 68 -189 119 178 -208 -77 54 123 -208 -95 -205 251 88 94 -252 44 -122 -4 127
6716 127 207 52 -399 301 212 -234 63 -15 100 24 -262 -233 -73 172 -53 -5 -6 24 -325 -4 162 -83 -65
6739 -65 83 -101 -16 -129 -10 70 62 168 -109 77 276 -30 -176 146 -11 132 -63 180 -58 26 -225 -129
6761 -129 49 0 -281 -49 142 -87 -220 251 303 28 -83 -118 -181 1 266 -76 142 80 -121 -139 299 -147
6783 -147 -54 158 180 44 -43 66 215 -90 -118 -6 84 233 -51 -177 25 25 152 -96 -66 -241 -63 83 366
6806 366 -251 -35 -26 -125 120 -72 25 178 103 -11 -198 -202 -45 20 0 -67 -28 46 229 7 -8 247 -240 245
6830 245 175 103 -265 -2 253 -322 -494 192 -35 183 -179 -28 207 32 -33 138 56 -87 -110 163 121 -267
6852 -267 -100 -146 81 -66 -141 107 49 187 -19 72 37 -28 -69 324 -44 -11 84 285 57 44 139 -26 131 30
6876 30 139 -133 252 136 -44 -17 -185 249 -32 17 -74 -178 -110 106 287 -57 -346 -1 -172 -190 86 -150
6898 -150 137 241 14 -123 47 140 46 101 -76 -118 -47 18 -27 -276 -58 71 237 214 -75 21 30 86 -101 11
6922 11 -13 129 272 -279 -146 60 160 177 -153 -218 -175 11 199 233 -63 -151 252 266 -140 8 97 82 224
6945 224 -127 152 -61 107 205 -154 -178 -38 -62 240 -19 89 -225 110 139 -9 -37 1 141 -61 -109 -424
6967 -424 306 -63 336 57 -400 -11 181 -202 -153 -57 -22 66 243 -137 -77 -66 62 -94 106 147 -171 -23
6989 -23 107 379 -72 25 273 158 -412 -219 -99 252 -61 -160 211 -146 -37 -78 12 -139 -22 21 -94 190
7011 190 106 136 -61 -211 -214 -129 -30 258 76 175 -36 135 95 278 -148 -359 122 -42 34 -157 102 99 -165 36
7035 36 118 -300 -294 -139 -7 -99 -240 -101 182 -85 128 23 -136 -107 100 78 -337 206 149 62 36 -59 -95 6
7059 6 -69 34 -93 49 -195 125 120 -27 175 -115 56 -114 -356 151 84 -84 -212 -222 7 -4 -1 25 -25 11
7083 11 135 -235 -52 -112 -159 139 -139 -251 -441 82 201 -11 -207 -176 41 -114 242 -399 -209 -30 89
7104 89 8 -263 153 -32 -159 336 -254 32 36 76 175 -26 27 311 -31 36 171 -44 -117 -44 276 7 -64 -43
7128 -43 113 60 -110 -241 6 37 -121 -235 -6 -110 -46 324 -125 -4 -214 -170 68 10 -85 143 31 -184
7150 -184 -9 46 157 -160 124 220 -197 -46 86 16 46 73 215 164 100 -80 118 -45 -42 209 -131 -212 51
7173 51 278 163 -95 -14 -148 5 0 19 183 10 -137 12 159 -33 252 -238 8 38 150 159 -357 135 -105
7196 -105 -106 -62 69 -52 -62 -70 39 274 -8 259 -149 -150 119 255 -118 133 -77 82 214 224 167 -9 31 -210
7220 -210 117 90 2 -7 -163 12 86 -57 -153 -66 -81 144 16 124 -185 -233 171 15 -14 178 99 -189 -169 -45
7244 -45 260 71 -64 57 53 58 43 39 -289 -64 179 -129 -32 -111 30 82 -289 56 -159 -25 -18 80 76 -301 -161
7269 -161 105 156 -294 -191 -200 239 -222 -74 250 166 -13 -84 -63 -201 -22 231 161 254 101 19 135 -157 268
7292 268 -199 349 98 161 232 -98 -95 -144 -94 62 83 126 194 -177 171 27 -98 129 115 -43 -50 88 135 126 -140
7317 -140 -41 -59 105 34 -3 -115 -17 -126 -110 -289 14 -101 83 48 -173 -75 92 -24 -116 -29 -99 -13 -214 98
7341 98 83 -13 163 131 -83 -81 -43 -79 -102 -113 112 80 -133 215 156 -48 -82 -126 126 -309 -135 82 292 184 -75
7366 -75 -401 88 -146 -372 59 81 -46 13 -75 128 -125 -69 86 55 -160 -315 101 84 119 160 7 7 121 -113
7390 -113 -206 290 239 144 93 81 107 273 -145 126 72 -327 -15 324 92 -22 21 192 101 -172 34 107 154 61
7414 61 34 98 195 -180 -106 127 -109 -169 -254 -268 4 -128 -113 235 140 -124 35 -156 137 40 22 17 71 70 -422 -111
7440 -111 -6 -25 -91 284 -22 49 -43 65 40 -32 -101 -33 34 265 134 -113 -49 -215 26 23 -182 95 171 -69
7464 -69 -66 -86 -318 -62 -54 -100 148 68 127 117 26 -103 60 58 317 -31 -84 32 -52 23 -291 2 -117 -182 152 -43
7490 -43 38 59 97 -54 31 -96 55 -90 -86 64 -568 -118 119 -94 -81 77 -68 121 266 -83 -153 -78 33
7513 33 -17 -8 -357 -35 24 164 -159 -44 -134 2 185 -62 -63 -193 -202 152 -150 -151 11 -1 353 -69 -186 139
7537 139 60 -86 -163 -158 -17 121 13 138 -110 -148 139 -54 -186 98 184 196 -235 -121 -122 -190 32 10 202 -171
7561 -171 -316 135 195 21 96 -371 -3 169 -1 7 13 271 158 -43 -144 146 280 147 49 -315 175 129 76
7584 76 134 95 -189 51 160 278 32 -131 180 -59 -77 119 254 -41 -124 -167 19 -189 86 81 239 62 -234
7607 -234 -192 -145 -99 61 -20 27 210 16 -166 -200 45 89 35 -42 88 66 57 51 -7 260 108 -97 -139 99 7 12
7633 12 85 -154 -384 -102 132 169 -387 -208 170 173 -131 -8 48 78 -39 139 -27 -248 191 -76 64 -135
7655 -135 -41 -30 313 72 -144 -61 32 362 -33 52 206 -40 -11 -118 112 73 53 43 -133 229 182 -18 -6 -79
7679 -79 37 10 -225 -272 21 -78 -63 188 96 219 9 -96 14 -59 154 -116 -217 75 163 172 154 -233 -182 132
7703 132 75 -166 -320 56 397 -85 30 -191 -170 166 36 -73 -19 -59 -57 -220 145 112 -47 89 52 -15 149
7726 149 -158 -84 -262 -61 -39 -156 238 -170 -111 -340 -119 251 -199 -131 18 142 -23 -109 -203 10 -119 56
7748 56 -31 -56 -130 188 -79 209 -66 -55 -193 -133 -67 -242 -41 -169 157 100 1 72 -82 56 -17 -28 123 -92
7772 -92 43 -98 196 -20 -62 -2 -250 166 -62 -25 72 -60 -47 -4 -79 33 -215 109 -354 -57 153 -167 -116
7795 -116 -280 -155 67 294 -166 9 29 -183 -275 -147 -50 197 135 23 220 197 184 138 141 -151 150 72 -78
7818 -78 216 75 260 -103 165 -88 -77 -97 70 35 39 -13 119 32 81 -126 43 114 11 100 89 188 33 24 -306
7843 -306 134 30 -219 42 -204 -145 -110 6 -196 19 158 23 47 -66 107 209 54 68 -44 -102 21 201
7865 201 187 -51 -51 34 -141 -101 -3 158 52 -150 -3 -38 64 -173 -2 -157 -14 -2 38 264 -67 -78 250
7888 250 51 230 -22 244 -60 156 98 119 -48 -37 -48 -137 -203 -97 81 97 143 322 -32 26 112 -342 -77
7911 -77 -66 28 -88 -65 -250 22 17 230 -52 -49 120 -92 -56 21 -84 -357 75 -53 91 44 213 117 73 -112
7935 -112 -315 -75 109 -75 108 -97 -121 -136 141 215 -174 8 66 -34 134 238 83 108 39 200 -243 42
7957 42 -84 -94 -43 -158 76 175 -13 -110 -177 140 -216 -104 143 -101 -448 110 155 -115 -46 9 348 108 -149
7980 -149 -201 -109 219 -357 107 83 -24 -33 -190 22 -10 37 -39 -129 -263 -144 -142 112 -44 -18 -52 111 -67 41
8004 41 -70 -68 -14 400 -231 -302 177 295 -158 -76 76 -93 116 -131 -11 -54 -139 114 157 -132 -56 58 128 118
8028 118 -113 -30 255 205 -26 10 121 80 8 46 115 -278 -162 93 -174 105 -320 -123 305 -243 -7 142
8050 142 136 -4 -130 215 -116 -353 187 98 -136 -110 182 -19 45 95 -139 -45 340 202 -48 -283 -63 246
8072 246 -24 65 -180 78 -141 -68 89 66 -63 257 147 13 -56 74 -44 23 -184 -102 127 230 -51 -1
8094 -1 -61 61 14 43 44 35 -223 224 292 -361 -42 141 352 33 -44 120 7 -141 202 66 71 99 276 92 -66
8119 -66 -132 292 25 196 -22 -103 -68 44 -62 150 -235 156 390 -64 -14 -3 -126 101 -161 -85 69 -171
8141 -171 -28 369 -45 -163 199 70 19 -84 -345 16 198 22 214 75 124 173 108 -156 -134 24 177 -87
8163 -87 -125 9 -2 189 83 -64 -125 -186 3 -185 -96 -308 -37 127 172 -239 27 -13 -8 178 -307 37 -89
8186 -89 321 91 -9 -32 204
8191B04
##END NTUPLES=NMR FID
##END=
