##TITLE=1H_Pr-Am6Am-D
 D2O,8 sc, 
 3.02.2021
##JCAMPDX= 6.0         $$ Bruker NMR JCAMP-DX V2.0
##DATA TYPE= NMR FID
##DATA CLASS= NTUPLES
##ORIGIN= UXNMR, Bruker Analytische Messtechnik GmbH
##OWNER= root
$$ XWIN-NMR		Version 3.5
$$ Wed Feb  3 13:16:08 2021 Russian Standard Time (UT+4h)  she@DPX200
##.OBSERVE FREQUENCY= 200.1315066352
##.OBSERVE NUCLEUS= ^1H
##.DELAY= (6, 6)
##.ACQUISITION MODE= SIMULTANEOUS
##.ACQUISITION SCHEME= undefined
##.AVERAGES= 8
##.DIGITISER RES= 18
##SPECTROMETER/DATA SYSTEM= spect
##.PULSE SEQUENCE= zg30
##.SOLVENT NAME= D2O
##.SHIFT REFERENCE= (INTERNAL, D2O, 0, 15.7039)
##AUDIT TRAIL= $$ (NUMBER, WHEN, WHO, WHERE, WHAT)
$$ ##TITLE= Audit trail, XWIN-NMR		Version 3.5
$$ ##JCAMPDX= 5.01
$$ ##ORIGIN= Bruker BioSpin GmbH
$$ ##OWNER= she
$$ F:/spectra/data/she/nmr/H-F/1/audita.txt
$$ ##AUDIT TRAIL=  $$ (NUMBER, WHEN, WHO, WHERE, WHAT)
(   1,<2021-02-03 13:14:43.59 +0400>,<she>,<DPX200>,
      <created by zg, POWCHK disabled, PULCHK disabled
       configuration hash MD5:
       00 E9 B6 7A A2 85 ED C7 34 08 36 98 17 FE 4E 26
       data hash MD5: 16K
       6B 59 94 71 BA 00 0D F7 CD 4E A4 13 D2 E8 0F FC>)
$$ ##END=
$$ 
$$ hash MD5
$$ 67 7B E9 9C 43 AB C1 95 EE 43 91 D0 1A C8 BA 13
##$RELAX= 
##$RELAX= 
##$RELAX= 
##$RELAX= 
##$RELAX= 
##$RELAX= 
$$ Bruker specific parameters
$$ --------------------------
##$DU= <F:/spectra>
##$EXPNO= 1
##$NAME= <H-F>
##$PROCNO= 1
##$TYPE= <nmr>
##$USER= <she>
##$AMP= (0..31)
100 100 100 100 100 100 100 100 100 100 100 100 100 100 100 100 100 100 
100 100 100 100 100 100 100 100 100 100 100 100 100 100 
##$AQSEQ= 0
##$AQ_mod= 1
##$AUNM= <au_zg>
##$AUTOPOS= <>
##$BF1= 200.13
##$BF2= 200.13
##$BF3= 200.13
##$BF4= 200.13
##$BF5= 200.13
##$BF6= 200.13
##$BF7= 200.13
##$BF8= 200.13
##$BYTORDA= 1
##$CFDGTYP= 0
##$CFRGTYP= 5
##$CHEMSTR= <none>
##$CNST= (0..31)
1 1 145 1 1 1 1 1 1 1 1 1 1 1 1 1 1 1 1 1 1 1 1 1 1 1 1 1 1 1 1 1 
##$CPDPRG= <>
##$CPDPRG1= <>
##$CPDPRG2= <>
##$CPDPRG3= <>
##$CPDPRG4= <mlev>
##$CPDPRG5= <mlev>
##$CPDPRG6= <mlev>
##$CPDPRG7= <mlev>
##$CPDPRG8= <mlev>
##$CPDPRGB= <>
##$CPDPRGT= <>
##$D= (0..31)
0 1.2 0 0 0 0 0 0 0 0.06 0 0.03 0 0 0 0 0.0002 0 0 0 0 0 0 0 0 0 0 0 0 
0 0 0 
##$DATE= 1612343682
##$DBL= (0..7)
120 120 120 120 120 120 120 120 
##$DBP= (0..7)
150 150 150 150 150 150 150 150 
##$DBP07= 0
##$DBPNAM0= <>
##$DBPNAM1= <>
##$DBPNAM2= <>
##$DBPNAM3= <>
##$DBPNAM4= <>
##$DBPNAM5= <>
##$DBPNAM6= <>
##$DBPNAM7= <>
##$DBPOAL= (0..7)
0.5 0.5 0.5 0.5 0.5 0.5 0.5 0.5 
##$DBPOFFS= (0..7)
0 0 0 0 0 0 0 0 
##$DE= 6
##$DECBNUC= <off>
##$DECIM= 32
##$DECNUC= <off>
##$DECSTAT= 4
##$DIGMOD= 1
##$DIGTYP= 9
##$DL= (0..7)
0 120 120 120 120 120 120 120 
##$DP= (0..7)
150 150 150 150 150 150 150 150 
##$DP07= 0
##$DPNAME0= <>
##$DPNAME1= <>
##$DPNAME2= <>
##$DPNAME3= <>
##$DPNAME4= <>
##$DPNAME5= <>
##$DPNAME6= <>
##$DPNAME7= <>
##$DPOAL= (0..7)
0.5 0.5 0.5 0.5 0.5 0.5 0.5 0.5 
##$DPOFFS= (0..7)
0 0 0 0 0 0 0 0 
##$DQDMODE= 0
##$DR= 18
##$DS= 0
##$DSLIST= <SSSSSSSSSSSSSSS>
$$ [...]
##$SUBNAM2= <"">
##$SUBNAM3= <"">
##$SUBNAM4= <"">
##$SUBNAM5= <"">
##$SUBNAM6= <"">
##$SUBNAM7= <"">
##$SUBNAM8= <"">
##$SUBNAM9= <"">
##$SW= 16.9725356469052
##$SWIBOX= (0..15)
0 0 2 0 0 0 0 0 0 0 0 0 0 0 0 0 
##$SW_h= 3396.73913043478
##$TD= 16384
##$TD0= 1
##$TE= 0
##$TE2= 300
##$TE3= 300
##$TEG= 300
##$TL= (0..7)
0 120 120 120 120 120 120 120 
##$TP= (0..7)
150 150 150 150 150 150 150 150 
##$TP07= 0
##$TPNAME0= <>
##$TPNAME1= <>
##$TPNAME2= <>
##$TPNAME3= <>
##$TPNAME4= <>
##$TPNAME5= <>
##$TPNAME6= <>
##$TPNAME7= <>
##$TPOAL= (0..7)
0.5 0.5 0.5 0.5 0.5 0.5 0.5 0.5 
##$TPOFFS= (0..7)
0 0 0 0 0 0 0 0 
##$TUNHIN= 0
##$TUNHOUT= 0
##$TUNXOUT= 0
##$USERA1= <user>
##$USERA2= <user>
##$USERA3= <user>
##$USERA4= <user>
##$USERA5= <user>
##$V9= 5
##$VALIST= <valist>
##$VCLIST= <CCCCCCCCCCCCCCC>
##$VD= 0
##$VDLIST= <DDDDDDDDDDDDDDD>
##$VPLIST= <PPPPPPPPPPPPPPP>
##$VTLIST= <TTTTTTTTTTTTTTT>
##$WBST= 1024
##$WBSW= 4
##$XGAIN= (0..3)
0 0 0 0 
##$XL= 0
##$YL= 0
##$YMAX_a= 925459
##$YMIN_a= -1022105
##$ZGOPTNS= <>
##$ZL1= 120
##$ZL2= 120
##$ZL3= 120
##$ZL4= 120
##$ABSF1= 10
##$ABSF2= 0
##$ABSG= 5
##$ABSL= 3
##$ALPHA= 0
##$AQORDER= 0
##$ASSFAC= 0
##$ASSFACI= 0
##$ASSFACX= 0
##$ASSWID= 0
##$AUNMP= <proc_1d>
##$AZFE= 0.1
##$AZFW= 0.1
##$BCFW= 1
##$BC_mod= 2
##$BYTORDP= 1
##$COROFFS= 0
##$CY= 11.3945322036743
##$DATMOD= 1
##$DC= 2
##$DFILT= <>
##$DTYPP= 0
##$F1P= 15.9154993809931
##$F2P= -4.1035820241983
##$FCOR= 0.5
##$FTSIZE= 0
##$FT_mod= 4
##$GAMMA= 1
##$GB= 0.15
##$INTBC= 1
##$INTSCL= 1
##$ISEN= 128
##$LB= 0.24
##$LEV0= 0
##$LPBIN= 0
##$MAXI= 10000
##$MC2= 0
##$MEAN= 0
##$ME_mod= 0
##$MI= 1.114404
##$NCOEF= 0
##$NC_proc= 0
##$NLEV= 6
##$NOISF1= 3.799351
##$NOISF2= 2.8
##$NSP= 1
##$NTH_PI= 0
##$NZP= 0
##$OFFSET= 15.70392
##$PC= 1
##$PHC0= -10566.29
##$PHC1= 19.20095
##$PH_mod= 1
##$PKNL= yes
##$PPARMOD= 0
##$PSCAL= 0
##$PSIGN= 0
##$REVERSE= no
##$SF= 200.130013532006
##$SI= 16384
##$SIGF1= 3
##$SIGF2= 2
##$SINO= 400
##$SIOLD= 16384
##$SREGLST= <1H.CDCl3>
##$SSB= 0
##$STSI= 0
##$STSR= 0
##$SW_p= 3612.71676300578
##$SYMM= 0
##$S_DEV= 0
##$TDeff= 0
##$TDoff= 0
##$TI= <>
##$TILT= no
##$TM1= 0
##$TM2= 0
##$TOPLEV= 0
##$USERP1= <user>
##$USERP2= <user>
##$USERP3= <user>
##$USERP4= <user>
##$USERP5= <user>
##$WDW= 1
##$XDIM= 8192
##$YMAX_p= 0
##$YMIN_p= 0
$$ End of Bruker specific parameters
$$ ---------------------------------
##NTUPLES= NMR FID
##VAR_NAME=  TIME,          FID/REAL,        FID/IMAG
##SYMBOL=    X,             R,               I
##VAR_TYPE=  INDEPENDENT,   DEPENDENT,       DEPENDENT
##VAR_FORM=  AFFN,          ASDF,            ASDF
##VAR_DIM=   8192,          8192,            8192
##UNITS=     SECONDS,       ARBITRARY UNITS, ARBITRARY UNITS
##FACTOR=    0.0002944,     1,               1
##FIRST=     0,             0,               0
##LAST=      2.4114304,     0,               0
##MIN=       0,             -1022105,        0
##MAX=       2.4114304,     925459,          0
$$ Real data points
##PAGE= N=1
##DATA TABLE= (X++(R..R)), XYDATA
$$ plain form
0 0 0 0 0 0 0 0 0 0 0 -8 0 -8 8 -8 9 -16 16 -24 32 -32 40 -48 53 -64 77 -85 101 -118 133 -155 179 -197 227
33 227 -258 286 -323 363 -403 452 -505 560 -622 690 -759 842 -931 1022 -1129 1245 -1367
50 -1367 1509 -1664 1831 -2026 2242 -2483 2763 -3089 3466 -3922 4473 -5160 6048 -7234 8906
65 8906 -11453 15760 -24438 48861 -267083 -1022105 -584906 317412 925459 630553 -293827
76 -293827 -935081 -618884 285872 924149 613243 -302970 -882514 -587678 257151 866478
86 866478 604378 -262050 -849395 -583667 244731 826955 579241 -235913 -802428 -571764
96 -571764 217132 789280 563474 -213802 -757894 -557846 191102 754060 543819 -193308
106 -193308 -710973 -543465 163254 715808 528038 -168583 -672011 -530052 142360 676320
$$ packed form
0@%%%%%%%%%qQqJ6j6J7k5L2m0N6o4P2q8J01j17J41j62J86k19K51k88L34l76M24
33B27m85N44o09O86p66Q55r57J065j182J312j449J601j773J953k151K374k612
50a367K876l173L495l857M268m725N246n852O555p388Q395r633J1208j3282J6140
65H906k0359K7213m0198P3299l15944p55022M37199R02318O08047k94906r24380
76b93827o41254L16197R04756O38277l10906r16213n79544K94836Q44829O09327
86H66478k62100q66428n87345K65728Q28398N82224k47714q15154n66515K30664
96e71764P88896N72148k25806p77276n44092K00048P48948N62958k10241p37127
106a93308n17665J67508P06719N52554j87770o96621n03428J41959O72412N33960
$$ plain form
116 676320 512974 -142558 -638672 -515502 123340 635302 503954 -116596 -616556 -502349
126 -502349 114660 599723 485351 -94997 -581221 -491897 91405 575197 478256 -87763
136 -87763 -555020 -468621 75186 536651 466979 -63391 -529593 -462242 65120 512024 449014
147 449014 -49020 -499488 -449725 49966 484428 437998 -33322 -476337 -439643 39155
157 39155 462499 424306 -25276 -448772 -423547 20787 437793 419832 -16956 -430875 -406227
168 -406227 12498 408743 405688 1090 -406358 -403535 2147 396174 390434 3984 -378712
179 -378712 -388841 -15282 374541 387579 13243 -366027 -376788 -19625 352226 375649 25399
190 25399 -347403 -369341 -27445 335716 365002 32576 -328509 -359855 -36323 319686 355976
$$ packed form
116F76320j63346o55532m96114J23170O38842N11962j31348o20550m99960J14207
126e02349O17009M85063j14372n80348m86224Q9324N83302M83792r6941n66019
136h7763m67257Q6399N43807M61465o9672n30370m66202O7351N27362M46904o3010
147D49014m98034m50468M9763M99691M34462m6430m71320m43015L6694M78798
157C9155M23344l8193m49582m23496K5225M44334M17006j7961m36788m13919K4648
168d06227M18725L96245l055m04598m07448K823M05682L94027n740l86450l82696
179c78712j0129L73559L89823J3038l74336l79270j0761L57163L71851K3423l50250
190B5399l72802k1938L41896L63161K9286l32426l61085l1346L23532L56009L6290
$$ plain form
201 355976 39022 -310873 -350119 -45329 303026 348576 47244 -296215 -343302 -51174
211 -51174 289704 339536 52881 -281178 -334990 -57796 275431 332816 59233 -270060 -327388
222 -327388 -59747 262124 321432 64670 -254328 -320629 -66752 251645 314956 66022
232 66022 -242104 -308974 -72203 235714 308564 73683 -231485 -303959 -75131 225182 299278
243 299278 77792 -218766 -297613 -79733 215323 292399 80085 -208586 -289110 -82392
253 -82392 203969 284956 83592 -198513 -281503 -84891 193101 277255 86977 -187652 -274269
264 -274269 -88724 182502 270835 90783 -177522 -267408 -92093 172220 264383 94713
274 94713 -167886 -262250 -95173 164365 258225 96314 -158945 -255108 -98109 154988 252706
$$ packed form
201C55976l16954l49895l9246L04790L48355M5550l01332l43459m7087K92128
211e1174L40878M9832k86655l34059n3812K77194L33227N7385k73583l29293n7328
222c27388K67641L21871N9308k56762l18998o6301K53877L18397O3311k48934
232F6022l08126o6870K36771L07917P2850k34881l05168p2474K28828L00313P4096
243B99278k21486k96558p8847K17880K95056P7076k12314k88671q0524K06718
253h2392K86361Q0987k01364k82105q2990J96612K77992Q4154j90278k74629q6617
264b74269J85545K71226Q8333j80052k68305q9886J75315K64313R2163j69670
274I4713k62599r4364J67077K59538R3860j61911k55259r6163J56999K53097R7718
$$ plain form
285 252706 98862 -151282 -248387 -99400 145565 245534 101928 -142197 -242713 -102135
295 -102135 137353 239298 103999 -133358 -236659 -104957 129457 233911 105536 -125820
305 -125820 -230498 -106896 121780 228531 107128 -119213 -224581 -107420 114504 221888
315 221888 108335 -111751 -218722 -108272 107863 215322 108744 -104214 -212095 -109339
325 -109339 100901 209514 109382 -97641 -206030 -110077 94198 203811 110158 -91691
335 -91691 -200335 -110086 88002 197517 110670 -84992 -194830 -110732 82308 191775 110529
346 110529 -78956 -188618 -110937 76020 185895 110853 -73081 -182953 -110870 70329
356 70329 180371 110897 -67622 -177665 -110759 64973 174846 111076 -62351 -172917 -110814
$$ packed form
285B52706j53844k50144r7105J48987K44965R9969j43606k44125j00516J40578
295a02135K39488J01945j35299k37357j03301J31702K34414J04454j28375k31356
305a25820j04678J23602K28676J06751j21403k26341j05368J17161K21924J07384
315B21888j13553k20086j06971J10450K16135J07459j06578k12958j07881J02756
325a09339K10240J08613j00132k07023j08389R5953K04275J09613r3653k01849
335i1691j08644R0249J98088J09515q6847j95662j09838Q4098J93040J09467q1246
346A10529j89485j09662P7681J86957J09875p5042j83934j09872P2083J81199
356G0329J10042o9474j78519j10043O6906J75732J09873o3770j73427j10566O2103
$$ plain form
367 -110814 60580 169899 110079 -57904 -167005 -110067 55210 164612 110068 -53355
377 -53355 -162338 -109102 51189 158919 108894 -48187 -156756 -109272 46309 154731 108627
388 108627 -44735 -151976 -107790 42222 149334 107917 -40377 -147413 -107355 38737
398 38737 145171 106630 -37252 -142702 -105539 35393 139800 105165 -33212 -137520 -104711
409 -104711 31547 135471 104100 -30254 -132737 -102781 27587 129939 103634 -25796
419 -25796 -129149 -102575 25472 126119 101147 -22910 -123531 -101477 21122 122056 101126
430 101126 -20493 -120495 -99480 19179 117027 98942 -16524 -115485 -99062 15785 113372
441 113372 97744 -13921 -111028 -97569 12492 108848 96812 -10466 -106967 -97026 9330
$$ packed form
367a10814J71394J09319n9820j67983j09101N6938J65277J09402n4544j63423
377e3355j08983N3236J60291J07730n0025j57081j08569M7484J55581J08422m6104
388A08627j53362j07241M4186J50012J07112m1417j48294j07036M0058J46092
398C8737J06434l8541j43882j05450L7163J40932J04407l4635j38377j04308L2809
409a04711J36258J03924l1371j34354j02483K9956J30368J02352k6305j29430
419b5796j03353K6574J28047J00647k4972j24057j00621K2054J22599J00934k0930
430A01126j21619j00002K1015J18659R7848j8085j15466r8961J6423J14847R7587
441A13372j5628j11665r7107J3459J10061R6356j2036j07278r6501R941J06356
$$ plain form
452 9330 105593 95907 -8323 -102893 -95423 6193 101476 95339 -5478 -99682 -94291 4326
464 4326 97830 93567 -3204 -95618 -92746 1505 94050 92681 -843 -92207 -91336 -636 90212
477 90212 91216 1694 -88523 -90177 -3051 86708 90232 3884 -85599 -88935 -4746 82982 88614
490 88614 6481 -82160 -88429 -6495 80545 86662 7698 -78051 -86554 -9296 76741 86088 10176
503 10176 -75430 -85653 -10407 73691 83778 12230 -71115 -84591 -13575 70865 83532 13632
515 13632 -68619 -82895 -14882 67424 81854 15877 -65330 -82244 -16862 65148 81028 16708
527 16708 -62641 -79925 -18582 61319 79972 19127 -59964 -79187 -20032 58733 78662 20438
539 20438 -57261 -77561 -21470 55322 77499 22679 -54711 -77043 -22686 53369 76026 23304
$$ packed form
452I330R6263r686j04230r4570P470J01616R5283o137j00817r4204N391R8617
464D326R3504m263r6771r2414K872R4251R2545j369r3524r1364Q71R0700R0848
477I0212J004q9522r0217j654Q7126Q9759L524q6348q9483l336Q4189Q7728N632
490H8614q2133q8641o269Q1934Q7040O117p8964q5749q503P7258Q6037R347p5912
503A0176q5606j0223P5246Q4098J0087p1548q3345j3476P1016Q4440J2667o9900
515A3632q2251j4276O8013Q2306J4430o5977q1207j6914O5382Q2010J5880o4320
527A6708p9349j7284O1343P9901J8653o0845p9091j9223N9155P8765J9929n8224
539B0438p7699k0300N6091P6792K2177n4820p7390k2332N4357P6055K2657n2722
$$ plain form
551 23304 -51883 -75000 -24270 49994 75196 25189 -49996 -74246 -24487 48006 72741 26051
563 26051 -46731 -72862 -26222 45714 71889 26802 -44753 -71348 -26965 43396 70290 27556
575 27556 -42154 -69903 -28272 41449 69410 28048 -40479 -68157 -28447 38830 67477 29217
587 29217 -37797 -67107 -29627 37148 66401 29362 -35787 -65118 -30470 34650 65227 30330
599 30330 -33937 -63900 -30866 32709 63741 31085 -32094 -62858 -31152 31037 62176 31417
611 31417 -30081 -61433 -31875 29180 61011 31845 -28370 -59908 -32121 27247 59290 32518
623 32518 -26389 -58963 -32697 25859 58097 32648 -24823 -57467 -32999 24030 56904 33136
635 33136 -23321 -56448 -33165 22663 55505 33270 -21710 -55007 -33383 21154 54156 33445
$$ packed form
551B3304p5187k3117N0730P4264K5202n0007p5185k4250M9759P2493K4735m6690
563B6051p2782k6131M6640P1936K6175m5087p1555k6595M4383P0361K6894m2734
575B7556o9710k7749M1631O9721K7961m1362o8527k7678L9710O7277K8647l8260
587B9217o7014k9310L7480O6775K9253l7039o5149k9331L4648O5120L0577l4897
599C0330o4267k9963L3034O3575L1032l2656o3179l0764L1706O2189L1139l0759
611C1417o1498l1352K9558O1055L1831k9166o0215l1538K7787N9368L2043k6772
623C2518n8907l2574K6266N8556L2238k5449n7471l2644K4468N7029L2874k3768
635C3136n6457l3127K3283N5828L2842k2235n4980l3297K1624N4537L3002k0711
$$ plain form
647 33445 -20139 -53603 -33693 19490 53016 33636 -18819 -52136 -33699 17759 51478 34297
659 34297 -17055 -51244 -34162 16595 50353 34153 -15685 -49697 -34260 14873 49183 34559
671 34559 -14444 -48712 -34274 13869 47803 34321 -13001 -47212 -34490 12238 46708 34669
683 34669 -11922 -46226 -34239 11067 45059 34670 -10211 -44930 -34806 9873 44325 34638
695 34638 -9272 -43707 -34681 8594 43218 34710 -8266 -42591 -34506 7593 41963 34722 -7046
708 -7046 -41599 -34476 6671 40747 34383 -5714 -40129 -34597 5338 39859 34419 -5013 -38972
721 -38972 -34194 4213 38287 34515 -3620 -38056 -34406 3357 37349 34216 -2749 -36707 -34244
734 -34244 2205 36239 34171 -1791 -35611 -33955 1306 35038 33886 -713 -34444 -33756 305
$$ packed form
647C3445n3584l3464J9910N3183L3526j9380n2455l3317J8437N1458L3719j7181
659C4297n1352l4189J7082N0757L3758j6200m9838l4012J5437M9133L4310j4624
671C4559m9003l4268J4438M8143L3934j3482m7322l4211J2722M6728L4470j2039
683C4669m6591l4304J1987M5306L3992j0389m4881l4719J0124M4679L4452r687
695C4638m3910l4435R026M3275L4624q508m2976l4325Q085M2099L4370p241m1768
708g046l4553P123M1147L4076o364m0097l4415N532L9935L4521n440l9432l3959
721c8972M778L8407L4074l772l8135l4436L650L7763L3992l133l6965l3958K463
734c4244L6449L4034k068l5962l3820J656L5261L3732j152l4599l3731O88L4061
$$ plain form
747 305 33843 33757 217 -33327 -33693 -559 32788 33438 1039 -32186 -33376 -1471 31643 33268
761 33268 1893 -31255 -33185 -2141 30649 32883 2604 -30059 -32803 -3033 29507 32700 3492
774 3492 -29142 -32600 -3721 28511 32279 4167 -27883 -32309 -4632 27560 32174 4824 -27087
787 -27087 -31913 -5100 26463 31682 5625 -25988 -31718 -5789 25577 31346 6098 -24904 -31176
800 -31176 -6640 24423 31135 6876 -24029 -30872 -7152 23489 30766 7474 -23108 -30694 -7648
813 -7648 22668 30303 8052 -21984 -30380 -8432 21851 30118 8380 -21361 -29699 -8768 20648
826 20648 29637 9157 -20400 -29525 -9262 20000 29146 9543 -19351 -29017 -9942 19085 28993
839 28993 9987 -18623 -28665 -10269 18223 28563 10520 -17839 -28333 -10675 17404 28153
$$ packed form
747C05L3538q6l3540l3544l66L3134L3347O50l2399l3225j190L1905L3114J625
761C3268l1375l3148j930L1044L2790K234l0279l2663k744K9770L2540L193k9208
774C492l2634l458K8879L2232L768k8112l2050m426K7677L2192M614k7350l1911
787b7087m826K6813L1563N219k6057l1613n730K5929L1366N769k5248l1002o272
800c1176K4536L1063O712k4259l0905o843K3720L0641P277k3292l0582p586K3046
813g648L0316P635k2251l0036q396K1948L0283Q267k1738k9741q338K0931K9416
826B0648Q989k0480k9557r125K0263K9262R146j9603k8894r666J9075K9027R908
839B8993j9006k8610j0042J8396K8492J0340j8043k8359j0494J7658K8079J0749
$$ plain form
851 28153 10909 -17025 -27998 -10999 16753 27661 11083 -16200 -27376 -11524 15812 27387
863 27387 11679 -15495 -27125 -11739 15076 26842 11974 -14564 -26678 -12359 14286 26592
875 26592 12303 -13982 -26247 -12416 13580 26033 12620 -13211 -25868 -12750 12950 25737
887 25737 12732 -12708 -25243 -12864 12121 25148 13097 -11892 -24915 -13217 11609 24668
899 24668 13147 -11185 -24329 -13390 10721 24255 13535 -10645 -24029 -13546 10233 23757
911 23757 13708 -9945 -23507 -13693 9597 23219 13814 -9213 -23137 -13925 9004 22836 13908
924 13908 -8756 -22497 -13966 8277 22327 14143 -8126 -22142 -14041 7875 21797 14035 -7368
937 -7368 -21587 -14368 7186 21467 14221 -7015 -21108 -14229 6592 20839 14349 -6360 -20655
$$ packed form
851B8153j7244k7934j0973J6999K7752J0908j6578k7283j1176J5852K7336J1575
863B7387j5708k7174j1630J5386K6815J1766j4868k6538j2114J4319K6645J2306
875B6592j4289k6285j2265J3831K5996J2453j3413k5831j2657J3118K5700J2787
887B5737j3005k5440j2535J2379K4985J3027j2051k4989j3023J1698K4826J3059
899B4668j1521k4332j3144J0939K4111J3534j0720k4180j3384J0483K3779J3524
911B3757j0049k3653j3562R814K3290J3622r405k3027j3924R212K2929J3832q928
924A3908k2664j3741Q531K2243J4050q184k2269j4016Q101K1916J3922p762k1403
937g368j4219P219K1554J4281p246k1236j4093O879K0821J4247o490k0709j4295
$$ plain form
950 -20655 -14323 6090 20396 14359 -5916 -20167 -14321 5664 19968 14369 -5414 -19612 -14340
963 -14340 4977 19374 14552 -4878 -19286 -14276 4658 18849 14360 -4352 -18691 -14422 4067
976 4067 18451 14496 -3845 -18283 -14306 3714 17831 14403 -3146 -17666 -14518 3079 17573
989 17573 14415 -3010 -17156 -14311 2608 16931 14448 -2367 -16862 -14488 2323 16547 14179
1002 14179 -2009 -16237 -14367 1789 16032 14330 -1592 -15848 -14249 1332 15623 14245 -1252
1015 -1252 -15439 -14159 982 15041 14131 -657 -14985 -14303 696 14865 14130 -608 -14456
1028 -14456 -13989 153 14255 14235 -25 -14205 -14052 106 13760 13803 313 -13536 -13972 -480
1042 -480 13446 13900 595 -13242 -13768 -712 12947 13797 955 -12805 -13830 -1071 12618 13727
$$ packed form
950b0655O332K0413J4306o037k0275j4251N846J9985J4304n599j9783j4198N272
963a4340J9317J4397m822j9430j4408N010J8934J4191m489j8712j4339M269J8489
976D067J4384l955j8341j4438L977J8020J4117l428j7549j4520L148J7597J4494
989A7573l158j7425j4146K845J6919J4323k483j6815j4495K374J6811J4224k368
1002A4179j6188j4228J870J6156J4243j702j5922j4256J599J5581J4291j378j5497
1015a252j4187J280J5141J4059r10j4788j4328O82J4999J4169p35j4738j3848
1028a4456M67J4142J4102k0j4260j4180J53J4158J3654M3j3490j3849m36J3492
1042d80J3926M54j3305j3837n26J3056J3659Q50j2842j3760j025J2759J3689J109
$$ plain form
1056 13727 1299 -12415 -13711 -1314 12286 13579 1493 -11999 -13557 -1602 11862 13519 1772
1069 1772 -11668 -13435 -1817 11344 13269 2104 -11157 -13377 -2260 11136 13315 2293 -10922
1082 -10922 -13175 -2419 10643 13101 2612 -10483 -13145 -2809 10369 13071 2761 -10107 -12875
1095 -12875 -2829 9883 12862 3163 -9734 -12900 -3048 9709 12711 3188 -9360 -12556 -3381
1108 -3381 9195 12572 3555 -9110 -12505 -3437 8942 12435 3522 -8799 -12386 -3618 8552 12184
1122 12184 3749 -8368 -12357 -3921 8304 12157 3830 -8132 -11886 -4044 7707 12032 4061 -7846
1136 -7846 -11944 -4145 7726 11690 4117 -7270 -11631 -4424 7115 11677 4360 -7067 -11415 -4382
1150 -4382 7057 11533 4361 -6784 -11322 -4626 6687 11172 4628 -6496 -11164 -4711 6358 11061
$$ packed form
1056A3727j2428j3714j296J2397J3600J293j2086j3492j558J1955J3464J657j1747
1069A772j3440j767J1618J3161J925j1165j3261k220J1117J3396K179j1022j3215
1082a0922k253J0756J3062K458j0489j3095k662J0336J3178K702j0310j2868k768
1095a2875J0046J2712K979r699j2897l166R852J2757L002r523j2548l196R175
1108c381J2576L377r017j2665l395R068J2379L493q913j2321l587Q768J2170L632
1122A2184q435j2117l989Q436J2225L853q327j1962l754P842J1751M325p971j1907
1136g846m098P799J1871L964p573j1387m361P207J1539M562p317j1427m348P033
1150d382J1439M476p172j1145m538O696J1313M485o544j1124m668O453J1069M703
$$ plain form
1164 11061 4766 -6190 -10998 -4933 6048 10961 4930 -6013 -10880 -4917 5751 10693 4962 -5628
1178 -5628 -10560 -5153 5502 10630 5126 -5464 -10452 -5060 5219 10295 5184 -5074 -10250 -5280
1192 -5280 4952 10242 5207 -4872 -10020 -5284 4658 9924 5359 -4532 -9972 -5388 4498 9851
1206 9851 5305 -4359 -9657 -5425 4226 9656 5449 -4047 -9549 -5504 3957 9423 5507 -3864 -9306
1221 -9306 -5503 3621 9147 5618 -3574 -9147 -5638 3545 9055 5537 -3380 -8817 -5541 3203 8896
1236 8896 5686 -3170 -8773 -5548 3117 8609 5546 -2913 -8457 -5653 2861 8478 5623 -2797 -8319
1251 -8319 -5569 2683 8213 5648 -2558 -8128 -5625 2476 8049 5666 -2382 -7988 -5627 2350 7821
1266 7821 5563 -2176 -7741 -5633 2085 7750 5661 -2149 -7634 -5479 1949 7406 5601 -1800 -7440
$$ packed form
1164A1061o295j0956m808O065J0981M913o031j0943m867N963J0668M942n731j0590
1178e628m932N407J0655N128n504j0590m988N392J0279N076n111j0258n176M970
1192e280J0232N290n035j0079n148M736R942N266m565r891n440M584R886N353
1206I851m546r664n298M232R651N430m207r496n502M045R461N466l916r371n442
1221i306L803R124N526l529r192n573L509R183N510l518q917n437L276Q744N693
1236H896l210q856n603L225Q665N492l063q459n544K804Q514N617k855q420n522
1251h319K750Q252N530k565q206n570K503Q101N573k383q048n606K361P977N471
1266G821k258p739n565K108P718N665k089p810n485K155P428N457j805p401n640
$$ plain form
1281 -7440 -5603 1777 7316 5594 -1654 -7203 -5578 1613 7038 5538 -1459 -7040 -5570 1418 6947
1296 6947 5552 -1386 -6910 -5465 1280 6741 5572 -1200 -6720 -5476 1155 6620 5466 -1043 -6536
1311 -6536 -5499 985 6373 5481 -881 -6362 -5475 868 6235 5404 -800 -6171 -5398 697 6013 5468
1327 5468 -583 -6039 -5500 582 6002 5346 -499 -5758 -5387 381 5706 5428 -269 -5720 -5327 366
1343 366 5564 5324 -153 -5504 -5382 158 5443 5289 -119 -5359 -5263 4 5238 5229 42 -5209 -5247 -62
1361 -62 5087 5158 131 -5062 -5200 -166 4967 5111 247 -4864 -5193 -342 4868 5195 296 -4792 -5032
1378 -5032 -294 4656 5032 453 -4597 -5116 -489 4619 5065 467 -4528 -4915 -456 4453 5009 605
1394 605 -4372 -4940 -621 4324 4857 649 -4242 -4875 -670 4186 4893 756 -4149 -4834 -768 4092
$$ packed form
1281g440J837P380N539j722p248n549J625P191N425j500o997n581J470O988N529
1296F947j395o938n524J445O745N461j169o772n520J244O631N465j154o509n493
1311f536J037O484N388q92o362n481Q87O343N367q31o204n371P73O095N316n45
1327E468o051n456N39O082N420o56n845n259L71N768N325k78n697n451L93N693
1343C66N198k40n477n351J22N540N285j54n408n240R6N267N234rn187n251l8N185
1361f2N149P1n027n193j38N034N133J44m864n111l29M851N210L27m899n088k40
1378e032M738M950L76m579n050n19M627N108M46m598m995l87M459M909N56m404
1394F05m977n68M319M945N33m208m891o33M205M856P07m137m905o85M066M860
$$ plain form
1410 4092 4791 801 -3976 -4765 -787 3932 4733 854 -3851 -4808 -886 3844 4677 810 -3754 -4614
1426 -4614 -946 3713 4684 1044 -3632 -4603 -1002 3701 4532 964 -3486 -4526 -1047 3475 4518 1111
1442 1111 -3466 -4463 -1043 3371 4419 1155 -3337 -4434 -1158 3314 4397 1081 -3222 -4330 -1207
1457 -1207 3204 4262 1197 -3112 -4326 -1208 3100 4288 1243 -2999 -4218 -1231 3004 4170 1269
1472 1269 -2876 -4117 -1365 2886 4223 1258 -2884 -4132 -1270 2757 4041 1393 -2690 -4035 -1306
1487 -1306 2778 3998 1258 -2672 -3941 -1368 2566 3947 1367 -2558 -3897 -1369 2568 3891 1411
1502 1411 -2529 -3804 -1393 2343 3864 1473 -2403 -3750 -1499 2344 3808 1434 -2285 -3682 -1498
1517 -1498 2221 3725 1577 -2189 -3673 -1512 2193 3676 1525 -2137 -3542 -1509 2003 3584 1608
$$ packed form
1410D092O99l990m777p89L978M719Q01l879m705r57L922M730Q33l867m564q60
1426d614L668M659R71l640m676r71L601M703Q31l568m450j040L479M522J043l407
1442A111m577r97L420M414J048l264m492j097L276M472J083l316m303j108L123
1457a207M411J058l065m309j214L118M308J188l045m242j219K987M235J166k901
1472A269m145j241K752M251J337k965m142j248K862M027J284k648m083j345K729
1487a306M084J220k740l930j269K573L934J381k580l925j339K528L937J323k480
1502A411l940j275K411L736J521k391l876j347K251L843J464k374l719j397K184
1517a498L719J504k148l766j484K161L705J483k151l662j405K033L512J581j976
$$ plain form
1532 1608 -2030 -3656 -1530 2018 3563 1517 -1929 -3432 -1642 1855 3494 1662 -1909 -3448 -1565
1547 -1565 1847 3382 1635 -1753 -3411 -1650 1744 3392 1576 -1703 -3320 -1683 1683 3307 1651
1562 1651 -1655 -3281 -1651 1593 3249 1694 -1569 -3247 -1650 1567 3212 1614 -1522 -3115 -1690
1577 -1690 1410 3202 1755 -1472 -3067 -1628 1376 3016 1698 -1330 -3062 -1733 1372 3022 1628
1592 1628 -1336 -3001 -1658 1242 2931 1765 -1249 -2996 -1703 1222 2925 1724 -1244 -2908 -1701
1607 -1701 1111 2817 1727 -1093 -2873 -1694 1105 2798 1714 -1037 -2773 -1762 1020 2703 1808
1622 1808 -960 -2728 -1757 987 2680 1742 -941 -2657 -1695 885 2578 1822 -845 -2665 -1770 917
1638 917 2611 1718 -814 -2488 -1795 756 2549 1797 -788 -2549 -1697 761 2451 1749 -639 -2490
$$ packed form
1532A608l638j626K126L548J545k046l446j503J790L497J639j832l571j539J883
1547a565L412J535j747l388j658J761L394J648j816l279j617J637L366J624j656
1562A651l306j626J630L244J656j555l263j678J597L217J645j598l136j593J425
1577a690L100J792j447l227j595J439L004J640j318l028j732J329L105J650j394
1592A628k964j665J343K900J689j166l014j747J293K925J703j201k968j664J207
1607a701K812J706j090k820j780J179K799J693j084k751j736J011K782J683q95
1622A808k768j768R71K744J693r38k683j716R62K580J693p56k667j820Q95K687
1638I17J694q93k532j674O93K551J793p52k585j761Q52K458J690p02k388j851
$$ plain form
1654 -2490 -1841 667 2476 1759 -700 -2456 -1760 639 2411 1772 -581 -2341 -1775 588 2318 1796
1670 1796 -575 -2346 -1724 594 2307 1713 -497 -2255 -1854 490 2297 1803 -508 -2178 -1743 487
1686 487 2190 1778 -396 -2200 -1831 435 2201 1781 -386 -2187 -1758 378 2074 1740 -291 -2129
1702 -2129 -1785 352 2105 1782 -338 -2057 -1764 302 2037 1773 -261 -2034 -1800 236 2057 1727
1718 1727 -307 -1909 -1784 178 1951 1734 -204 -1955 -1771 174 1951 1707 -162 -1845 -1757 50
1734 50 1834 1753 -115 -1832 -1731 100 1889 1725 -52 -1805 -1734 45 1793 1747 5 -1779 -1688 56
1752 56 1734 1711 -13 -1761 -1728 9 1727 1737 -3 -1692 -1704 -94 1652 1698 90 -1637 -1708 -96
1770 -96 1625 1695 122 -1604 -1700 -53 1621 1691 115 -1555 -1685 -158 1577 1672 122 -1528 -1598 -120
$$ packed form
1654b490O49K508J809p17k459j756O96K399J772o39k353j760N66K363J730n22
1670A796k371j771O22K318J713n94k210j758M01K344J807m94k311j670M35K230
1686D87J703m12k174j804L69K266J766m20k167j801M29K136J696l34k031j838
1702b129L44K137J753l23k120j719K93K066J735k64k034j773K34K036J821l30
1718A727k034j602J25J962J773k17j938j751J84J945J777k44j869j683Q8J807
1734E0J784q1j868j717J01J831J789j64j777j753P1J779J748m6j742j784R1J744
1752E6J678k3j724j748L3J737J718J0j740j689j2J610J746M6j608j727p1J612
1770i6J721P0j573j726r6J647J674P0j576j670j30J527J735R5j550j650p0J478
$$ plain form
1788 -120 1489 1648 174 -1506 -1685 -256 1441 1667 133 -1371 -1667 -237 1447 1622 246 -1418
1804 -1418 -1620 -204 1358 1555 292 -1323 -1585 -259 1358 1612 250 -1294 -1578 -299 1268 1587
1820 1587 307 -1285 -1552 -282 1253 1580 400 -1262 -1588 -347 1218 1605 344 -1217 -1513 -362
1836 -362 1165 1560 441 -1167 -1580 -387 1101 1486 366 -1176 -1525 -444 1095 1512 455 -1105
1852 -1105 -1470 -434 1049 1481 435 -1011 -1486 -436 1014 1545 488 -984 -1434 -436 954 1468 466
1869 466 -1017 -1456 -473 914 1451 469 -1024 -1411 -430 943 1428 488 -864 -1431 -498 911 1441 530
1887 530 -892 -1373 -498 892 1347 583 -816 -1417 -574 831 1398 515 -785 -1369 -545 789 1336 625
1905 625 -795 -1379 -595 773 1349 612 -736 -1312 -581 730 1327 593 -689 -1298 -612 723 1370 606
$$ packed form
1788a20J609J59j474j680j79J429J697K26j534j504k96J430J684J75j376j664
1804a418k02J416J562J97j263j615k62J326J617K54j362j544k84J279J567L19
1820A587j280j592k67J270J535L27j180j662l26J241J565L87j261j561k96J151
1836c62J527L95j119j608m13J193J488L85j120j542l49J081J539M17j057j560
1852a105l65J036J483M32j046j446m75J050J450N31j057j472m50R98J390N14j002
1869D66j483m39R83J387N37r82j493l87R81J373M85r40j352n67R33J409N30r11
1887E30j422m81Q75J390M55p64j399o01Q43J405N67q83j300n84Q24J334N47p11
1905F25j420n84P84J368N76p37j348n76P31J311N97p34j282o09O86J335O47p64
$$ plain form
1923 606 -667 -1283 -599 673 1235 664 -675 -1296 -639 668 1219 568 -578 -1214 -639 616 1271 680
1941 680 -636 -1253 -636 618 1226 644 -584 -1240 -713 552 1261 614 -554 -1170 -605 563 1200 593
1959 593 -525 -1160 -662 516 1200 701 -479 -1128 -670 449 1119 687 -465 -1176 -669 493 1156 670
1977 670 -482 -1169 -703 468 1071 646 -402 -1110 -721 424 1112 704 -403 -1050 -647 404 974 639
1995 639 -314 -1089 -765 389 1097 664 -345 -1015 -683 285 958 710 -313 -978 -751 280 994 697 -245
2014 -245 -988 -756 314 997 693 -247 -956 -712 309 924 677 -274 -974 -712 230 934 731 -240 -949
2033 -949 -754 274 984 685 -191 -896 -692 177 899 742 -164 -925 -710 194 846 695 -186 -850 -705 136
2053 136 894 725 -130 -865 -684 112 840 671 -80 -824 -746 127 859 686 -116 -826 -725 95 812 686
$$ packed form
1923F06j273o16O84J272N62n71j339o21O57J307N51o51j146o36N75J255O55n91
1941F80j316o17O17J254O08n82j228o56N27J265P09o47j168o16N65J168O37o07
1959E93j118o35M98J178O84m99j180o49M58J119O70m32j152p11N07J162O63m86
1977F70j152o87M66J171O03m25j048p08L89J145O88m08j107o47M03J051N70l35
1995F39r53p75L24J154P08m33j009o70L32R68O73k48j023o65K27J031P14k97r42
2014b45p43K32J070O83l04r40p09K44J021O15k47r51p00K62R42P04k03r71p09
2033i49J95J028P10k99q76p05K04Q69P22j57r06p61K15R04O52j51q81o64J45Q41
2053A36P58j69q55p35J81P96P28j69p51p44P8Q73P32j73q02p10J01Q20P17j26
$$ plain form
2073 686 -82 -787 -740 3 803 749 -41 -806 -716 99 764 675 -49 -747 -757 46 742 746 -19 -751 -690 10 718
2096 718 743 -38 -695 -694 18 714 699 -6 -697 -702 15 689 733 -8 -691 -689 2 741 687 0 -655 -671 -49 663
2120 663 628 77 -644 -723 -6 688 666 37 -637 -662 -90 586 647 20 -627 -665 -5 612 690 38 -557 -626 -32
2143 -32 560 666 60 -569 -688 -51 612 642 123 -535 -660 -185 576 669 104 -577 -647 -74 513 643 167
2164 167 -558 -686 -156 586 693 121 -520 -693 -112 516 614 161 -566 -671 -132 482 625 191 -504 -614
2184 -614 -178 444 681 193 -476 -667 -196 429 664 117 -461 -622 -150 478 570 202 -496 -654 -155 448
2204 448 607 207 -421 -604 -195 419 648 249 -462 -654 -162 400 626 143 -386 -617 -214 359 576 249
2224 249 -394 -657 -167 379 637 195 -383 -622 -242 331 558 237 -329 -597 -237 424 612 248 -186 -649
$$ packed form
2073F86p68p05M7P43Q00n4p90p65R0Q15O65q9p24o98j0Q03O96Mp65p32O1P00P08
2096G18K5p81o57JP12O96j5p05o91nP17O74M4p41o83KO91P39n4o87o55j6O22P12
2120F63l5n51p21p9P17O94k2o29o74k5N72O76O1o27o47l8O60O17P8o52n95o9N94
2143c2N92J06o06o29j19O37O63L0n19o58j25M75P61R3n65o81p0N73N87J30m76
2164A67p25j28N30P42J07n72o41j73N81O28R8m53p27j05N39O14J43m34o95j10
2184f14M36O22K37m88o69j91M71O25K35n47n78j61M72O28R2l68o98j58M99O03
2204D48J59m00o28j83M09O14K29l99p11j92M92N62K26m83n29k31M03N73K17l27
2224B49o43k63M90N46K58m42n78k39L80N73K27l21n66k68L60O61J88l64m34m63
$$ plain form
2244 -649 -243 383 620 238 -345 -574 -286 298 496 294 -269 -620 -206 363 605 194 -236 -618 -225 317
2264 317 569 251 -233 -514 -258 271 591 308 -297 -525 -254 248 499 298 -252 -579 -333 289 602 353
2284 353 -282 -547 -200 147 496 256 -339 -585 -472 157 613 327 -226 -441 -319 324 508 263 -229 -642
2304 -642 -250 374 486 223 -207 -631 -219 206 593 362 -250 -569 -261 152 485 276 -180 -444 -294 110
2324 110 427 249 -110 -478 -363 396 528 315 -139 -511 -242 122 457 330 -231 -538 -274 260 495 268
2344 268 -114 -438 -288 214 520 342 -111 -428 -319 191 436 307 -148 -415 -345 88 444 266 -183 -442
2364 -442 -260 80 440 310 -160 -458 -318 115 359 301 -118 -455 -303 71 397 324 -104 -397 -356 80 435
2385 435 323 -103 -408 -278 95 389 326 -93 -391 -304 116 366 295 -88 -430 -289 74 379 327 -75 -447
$$ packed form
2244f49M06O26K37l82n83k29K88N84J98k02n63l51M14N69K42m11m30l82L93N42
2264C17K52l18m84k81K56N29L20k83o05k28K71N02K51k01n50l27K46O22L13k49
2284C53o35k65L47L47L49k40n95k46J13O29M56k86n53k15J22O43J84k45m92m13
2304f42L92O24J12k63m30m24M12M25L87k31o12l19L08M13L33k09m56k64J50M04
2324A10L17j78l59l68J15P59J32k13m54l72K69L64L35j27n61l07K64N34K35k27
2344B68l82l24J50N02L06j78m53l17J09N10K45j29m55k67P0M33L56j78m49k59
2364d42J82L40L60j30m70k98J40M33K44n8m19l37J52L74L26p3m28k93M1M36L55
2385D35j12m26l05J30L73K94o3m19k98Q7M20K50p1l83l42J41L63L05n2m02l72
$$ plain form
2406 -447 -367 114 411 314 -27 -370 -331 38 322 347 -77 -437 -303 84 397 285 -37 -325 -335 55 361 327
2428 327 -67 -392 -303 68 368 245 -60 -368 -286 25 360 330 -43 -331 -343 17 350 380 -79 -318 -325 35
2450 35 294 309 -117 -340 -312 24 290 288 27 -351 -287 -4 372 297 53 -328 -325 -14 303 291 37 -341 -348 20
2474 20 346 333 28 -317 -276 -10 287 327 32 -330 -326 -82 303 335 -7 -342 -335 -59 257 297 32 -275 -338 16
2498 16 333 316 20 -264 -294 -42 269 293 14 -259 -353 -13 307 308 82 -258 -354 -45 240 352 69 -293 -289
2521 -289 -46 220 276 16 -301 -301 -74 288 268 65 -258 -268 -30 258 333 66 -238 -328 -56 193 288 42 -270
2544 -270 -299 -85 246 290 113 -281 -299 -37 296 330 79 -202 -308 -48 251 321 52 -218 -314 -128 211 325
2566 325 55 -121 -298 -40 260 363 123 -206 -243 -72 312 308 56 -271 -238 -82 254 295 77 -254 -311 -100
$$ packed form
2406d47Q0M81K97r7l41l43L9L69K84K5m24l60J34L87L13j12l22k88j0L90L06l4
2428C27l94l25Q9L71L00j23l05l08Q2L11L35l0l73k88j2L60L33L0m59k39pL60
2450C5K59J5m26k23K8L36K66kk61l78O4K83L76p5k44l81LL11L17j2k54l78pL68
2474B0L26j3l05l45M1K66K97M0k95l62MK44L85L2l42l35PK76L16M0k65l07o3L54
2498A6L17j7k96k84l0K52L11K4k79k73r4L40L20Jk26l40r6L09K85J12k83l62M
2521b89K43K66N6k60l17%K27L62k0k03l23j0K38K88P5k67l04r0K72K49R5k46l12
2544b70k9K14L31M4j77l94j8K62L33L4k51k81j06K60K99P0k69k70r6J86L39J14
2566C25k70j76j77K58L00J03k40l29l7J71L84mk52l27L3J56L36M1k18l31n7K11
$$ plain form
2588 -100 194 239 53 -200 -271 -68 273 292 65 -236 -303 -126 217 207 53 -170 -286 -82 119 285 92 -169
2610 -169 -379 -173 272 247 82 -195 -225 -52 250 246 169 -207 -260 -13 262 362 137 -208 -277 -57 213 369
2632 369 132 -253 -217 -80 132 220 185 -189 -192 -194 148 335 43 -161 -330 -144 44 388 114 -236 -275 -90 94
2655 94 207 77 -126 -336 -105 203 107 92 -78 -182 -122 29 268 91 -159 -292 -100 182 301 98 -110
2676 -110 -257 -117 134 280 197 -151 -241 -139 72 191 142 -144 -283 -129 158 237 140 -146 -237 -47 83 227
2698 227 113 -93 -257 -106 105 226 130 -133 -188 -131 71 229 138 -111 -211 -136 106 224 163 -82 -195 -143
2720 -143 49 205 129 -67 -230 -127 106 244 96 -101 -243 -194 82 207 145 -63 -221 -185 112 208 84 -103
2742 -103 -217 -157 108 231 133 -58 -228 -153 100 198 150 -87 -188 -134 28 235 89 -63 -227 -161 65 193
$$ packed form
2588a00K94M5j86k53p1K03L41J9k27l01o7J77L43j0j54k23j16K04K01J66j93k61
2610a69k10K06M45k5j65k77l0J73L02mp7l76n3K47K75J00k25l45o9K20K70J56
2632C69k37l85L6J37K12Q8l5l74lkL42J87k92k04j69J86J88L44k74l50l9J85J84
2655I4J13j30k03k10K31L08r6j5j70j04O0J51K39j77k50j33J92K82J19k03k08
2676a10j47J40K51J46q3l48r0J02K11J19m9k86j39J54K87P9r7k86r1J90J30J44
2698B27j14k06j64J51K11J21r6k63n5N7K02J58r1k49j00P5K42J18o1k45j13N2
2720a43J92J56p6j96j63J03K33J38j48j97j42M9K76J25o2k08j58L6K97R6j24j87
2742a03j14O0K65J23r8j91j70P5K53R8m8k37j01N4J62K07j46j52j64O6K26J28
$$ plain form
2764 193 133 -53 -177 -144 80 151 129 -86 -242 -131 49 193 198 18 -240 -125 58 212 191 -55 -199 -150 86
2787 86 146 101 -76 -158 -170 56 208 137 -18 -205 -165 37 162 162 -60 -145 -174 24 213 153 -54 -160 -126 21
2811 21 164 136 -12 -175 -163 13 172 132 -30 -157 -65 25 247 151 -18 -119 -169 36 122 142 -15 -163 -181 58
2835 58 174 170 -41 -154 -125 50 170 108 -56 -178 -179 -46 155 131 -20 -163 -120 72 206 120 38 -175 -147 -1
2859 -1 185 143 -56 -143 -155 -18 111 147 -8 -87 -117 29 225 142 40 -154 -161 21 128 140 22 -124 -76 34
2883 34 147 202 -64 -167 -113 15 153 199 18 -136 -163 -11 126 130 32 -83 -121 -37 123 112 29 -140 -131 -20 90
2908 90 138 -6 -125 -108 -12 119 92 28 -181 -39 -56 181 182 -93 -71 -264 -30 -9 180 13 -14 -130 1 166
2932 166 82 31 -47 -123 27 64 164 -38 -157 -127 -158 51 74 114 -44 -162 -46 30 184 18 -174 -138 -94 68
$$ packed form
2764A93o0j86j24L3K24P1k2k15j56J11J80J44Nj80k58J15J83J54k1k46j44M9K36
2787H6O0m5j77q2j2K26J52p1j55j87M0K02J25%k22q5k9J98J89o0k07j06L4J47
2811B1J43k8j48j63J2J76J59m0j62j27R2R0K22r6j69j01n0K05Q6K0j57j48j8K39
2835E8J16mk11j13K9J75J20o2j64j22jJ33K01k4j51j43M3J92J34q6q2k13K8J46
2859aJ86m2j99q7j2J37J29L6j55p9l0J46J96q3j02j94pJ82J07J2j18j46M8J10
2883C4J13N5k66j03N4J28J38M6j81j54k7J52J37Mr8j15l8Q4J60j1q3j69RJ11J10
2908I0M8j44j19J7R6J31k7o4k09J42j7K37Jk75K2j93K34K1J89j67k7j16J31J65
2932A66q4n1p8p6J50L7J00k02j19L0l1K09K3M0j58j18J16P6J54j66j92L6M4J62
$$ plain form
2956 68 239 97 -109 -87 50 191 202 32 -109 -67 48 19 50 31 -105 -86 -42 194 152 54 25 -41 38 140 138
2981 138 91 -67 -230 -46 186 110 0 -140 -114 -31 -1 167 19 -194 -121 -87 85 104 75 -168 -16 38 115 206
3005 206 4 -51 -173 -56 62 131 -118 -113 -21 -28 100 194 12 -129 -111 -53 150 90 0 -233 -59 25 113 235 61
3030 61 -76 -46 -96 146 46 -35 -8 -137 56 163 88 69 -173 55 -30 22 63 -31 34 -272 52 56 83 47 26 -383
3056 -383 -158 -77 14 -33 -26 -19 -199 27 111 31 -114 -226 -85 223 57 171 112 10 237 138 124 26 -33 -44 -89
3081 -89 -133 228 -85 -189 -279 74 145 -221 -45 -198 -104 19 71 48 130 -427 87 -167 249 44 195 62 -106
3104 -106 356 156 -59 371 30 -58 118 126 22 -183 -215 -39 -286 53 216 163 -14 18 -86 -460 178 69
3126 69 -7 -146 -75 149 120 256 -33 -38 -11 -110 178 25 26 -60 1 98 2 -2 -21 -94 -85 98 104 82 -22 -79 -54 2 83
$$ packed form
2956F8J71j42k06K2J37J41J1j70j41M2J15k9L1j9j36J9M4K36m2r8k9o6P9J02k
2981A38m7j58j63J84K32p6j10j40K6Q3L0J68j48k13P3L4J72J9k9k43J52N4P7R1
3005B06k02n5j22J17J18O9k49NR2pJ28R4j82j41J8N8K03o0r0k33J74Q4Q8J22j74
3030F1j37L0n0K42j00q1K7j29J93J07p5j9k42K28q5N2M1r4O5l06L24MK7l6k1m09
3056c83K25Q1R1m7PPj80K26Q4q0j45j12J41L08j66J14n9j02K27r9j4r8n9j1m5
3081h9m4L61l13j04r0L53P1l66J76j53R4J23N2k3Q2n57N14k54M16k05J51j33j68
3104a06M62k00k15M30l41q8J76Qj04k05l2J76k47L39J63n3j77L2j04l74O38j09
3126F9p6j39P1K24k9J36k89nK7r9K88j53Jq6O1R7r6mj9p3RJ83Ok2j04n7K5N6Q1
$$ plain form
3155 83 44 -57 -110 -47 22 57 24 36 -93 -72 -46 36 46 -50 -83 -59 9 49 30 -33 -110 -73 20 75 52 -21 -125 -38 -6
3184 -6 71 31 5 -79 -26 23 115 66 -51 -98 -30 -4 59 48 -4 -75 -105 23 59 78 -61 -88 -93 -17 89 62 -24 -59 -53 56
3214 56 77 42 16 -91 -71 6 55 94 -41 -44 0 -23 56 47 -41 -62 -38 -9 63 100 -37 -107 -64 -27 61 81 -64 -100 -106 -27
3244 -27 81 77 -6 -71 -32 21 8 105 -7 -95 -107 -24 45 47 -12 -32 -12 17 40 29 -7 -82 -93 26 77 101 -62 -45 16
3273 16 -27 82 100 22 -94 -83 -10 119 38 17 -45 -15 23 37 85 44 -19 -109 17 38 64 18 -13 -44 -29 14 37 31 -44
3302 -44 -71 35 43 57 -23 -55 -42 -18 18 61 52 -27 -87 49 60 60 2 -1 -29 -15 60 57 -19 -54 -73 -6 42 43 -17 -59 -43 22
3334 22 2 98 25 -80 -75 2 -1 27 12 18 -42 -11 3 34 76 -48 -35 -7 46 14 21 -86 -97 -26 40 85 -17 -58 -26 -16
3364 -16 52 14 7 -31 -23 -9 41 109 10 -115 -76 -33 10 32 31 -42 -96 -12 -13 11 8 -64 -40 -6 47 64 15 -23 -37 -29 18 70 -30
$$ packed form
3155H3l9j01n3O3O9L5l3J2j29K1K6Q2J0r6l3K4O8M0j9o3p7L7R3N5k3p3j04Q7L2
3184fP7m0k6q4N3M9R2m9j17m7O8K6O3j1n2p1l0J28L6J9j39k7nP6J06k7q6l5OJ09
3214E6K1l5k6j07K0P7M9L9j35lM4k3P9rq8k1K4K9P2L7j37p0M3L7Q8K0j45l6oP9
3244b7J08mq3o5L9N3j3R7j12q8j2Q3O9Kn9k0K0K9K3j1l6p5j1J19N1K4j63J7O1
3273A6m3J09J8p8j16J1P3J29q1k1o2L0L8J4M8m1o3r0J26K1K6m6l1l1J5M3K3op5
3302d4k7J06QJ4q0l2J3K4L6M3rp9o0J36J1%n8lk8J4P5lp6l5j9O7M8Jo0m2J6O5
3334B2k0R6p3j05NP7lK8j5Oo0L1J4L1M2j24J3K8N3l2Pj07j1P1O6M5j02m1L2J0
3364a6O8l8pl8QJ4N0O8r9j25L9M3M3K2jp3n4Q4jK4lp2K4L4N3J7m9l8j4QM7N2j00
$$ plain form
3397 -30 -41 -25 -54 -12 28 27 -39 -65 -23 7 24 -54 -12 -64 -16 30 54 36 -54 -46 2 56 11 54 -22 -81 -33 27 17 37 -72
3428 -72 -66 25 28 62 21 -11 -25 -38 20 35 28 32 -17 -25 15 46 40 -18 -24 -10 1 -27 21 -7 -91 18 20 20 26 25 -36 -22 -12 45 9
3463 9 -41 -49 -32 9 26 29 25 -36 -3 -1 82 8 15 -26 -39 -2 45 75 -47 -75 -49 -18 24 51 -15 -40 -26 45 2 39 -8 -22 -10
3496 -10 21 34 48 2 -69 -19 -53 49 74 19 -39 -5 -73 44 24 -64 -7 -50 -3 36 8 -23 -73 -5 47 25 68 40 -16
3525 -16 -57 43 24 26 -28 -29 -33 67 27 41 -40 -57 -24 -3 84 42 22 -60 -54 11 68 34 41 -67 -84 -27 31 0 20 -36 -2
3556 -2 9 9 23 40 -89 -23 2 54 111 14 -5 -46 -50 10 54 -22 -13 -82 5 38 48 -4 -24 -55 -14 41 22 -7 -66 -31 42 48
3588 48 26 3 -45 -15 -16 10 21 -3 -135 -61 0 4 35 -13 -70 -45 -4 11 -1 56 -44 -63 -44 62 31 -61 -95 -9 31 45
3618 45 41 12 6 -35 -1 39 10 -38 -18 -51 22 -44 43 21 -43 16 -27 64 45 -40 7 -9 7 36 1 -23 -41 -22 0 -7 41 -43
$$ packed form
3397c0j1J6k9M2M0jo6k6M2L0J7p8M2n2M8M6K4j8r0QM8N4m5M3p6n9M8O0j0K0j09
3428g2OR1LL4m1l2j4j3N8J5pMm9qM0L1on8oJ4J1k8M8k8q4J09K%Ojo1J4J0N7l6
3463In0qJ7M1J7Lmo1L3KQ3p4Pm1j3L7M7L0j22k8K6L1M2K7o6k5J4P1m3L7m7j4J2
3496a0L1J3J4m6p1N0l4J02K5n5n8L4o8J17k0q8N7m3M7L9k8l1n0O8N2k2M3k8n6
3525a6m1J00j9Kn4jmJ00m0J4q1j7L3K1Q7m2k0q2OO5N7l4Pj08j7N7N8l1K0n6L4
3556bJ1%J4J7j29O6K5N2N7r7j9m1mO0M4p6Ro9Q7L3J0n2k0l1M1N5j9k9n9L5P3O
3588D8k2k3m8L0jK6J1k4j32P4O1ML1m8n7K5M1J5j2N7j00j9J9J06l1r2l4Q6M0J4
3618D5mk9om1L4M0k9m8K0l3P3o6Q7k2o4N9m3R1j9q5M7j6J6K9l5k4j8J9K2pM8q4
$$ plain form
3650 -43 -63 -50 -11 -11 82 -3 -15 -46 -15 35 13 3 -37 -65 3 25 25 11 -26 -7 17 24 -15 -13 -12 -91 25 17 78 22 -53 -40 -51
3683 -51 21 14 48 -38 -34 8 -10 41 -10 -21 3 -18 49 36 41 9 -28 6 15 24 -35 -6 -17 19 10 -34 51 14 -47 -14 -12 33 45 -16
3717 -16 -58 -46 -24 40 2 -31 -12 -42 47 -30 33 -25 -20 -51 44 32 -8 -29 -44 -48 -5 76 4 -16 -63 26 73 43 -8 -11 -24 -58
3749 -58 -22 41 8 -1 -15 -74 3 30 70 -10 -38 -61 22 29 61 15 1 -3 -3 35 -2 -20 -54 -2 35 67 64 -13 26 -16 -10 14 3
3782 3 -61 -13 -61 51 62 49 23 -18 21 18 69 -27 26 -55 -18 -41 17 34 -36 -24 4 -4 41 31 -38 -16 -12 -25 45 -10 -18 -46
3814 -46 18 21 34 57 -14 0 -30 -3 31 98 16 -3 -38 -22 -4 -12 -29 10 2 -25 31 24 -7 -80 -28 62 1 5 21 -72 -32 29 17
3847 17 32 -37 -48 -14 -8 25 27 -21 -39 -44 47 52 42 19 -63 -20 22 22 32 -35 -68 -19 18 37 -1 -34 13 -23 -2 12 21 30 -24 -21
3881 -21 10 20 46 -60 -10 25 -2 -18 22 -11 -61 -58 9 28 -14 -7 11 -63 4 18 4 25 -53 -61 -37 -31 75 18 -35 -48 11
$$ packed form
3650d3k0J3L9%R3q5j2l1L1N0k2j0m0k8O8K2%j4l7J9K4Pl9KJp9J16qO1n6p5J3j1
3683e1P2pL4q6MM2j8N1n1j1K4k1O7j3Nl2l7L4RRn9K9j1L6rm4Q5l7o1L3KM5J2o1
3717a6m2J2K2O4l8l3J9l0Q9p7O3n8Nl1R5j2m0k1j5mM3Q1p2k0m7Q9M7l0n1lj3l4
3749e8L6O3l3rj4n9P7K7M0q0k8k3Q3PL2m6j4m%L8l7j8l4N2L7L2lp7L9m2OK4j1
3782Co4M8m8J12J1j3k6m1L9lN1r6N3q1L7k3N8J7p0J2K8qM5j0o9K2Mj3P0n5qk8
3814d6O4LJ3K3p1J4l0K7L4O7q2j9l5J6J8qj7L9qk7N6pl1p3N2R0o1MJ6r3M0O1j2
3847A7J5o9j1L4OL3Km8j8nR1Nj0k3q2M3M2%J0o7l3M9L7J9l8l3M7l6K1J4RRn4L
3881b1L1J0K6j06N0L5k7j6M0l3n0LO7J9m2PJ8p4O7J4j4K1p8qK4OJ06n7n3j3N9
$$ plain form
3912 11 33 0 -35 -26 -41 -3 9 -29 5 10 -11 -59 34 23 15 -47 6 5 41 35 -28 -27 -33 -11 35 2 16 -84 -33 1 34 47 55 -2
3946 -2 -34 16 53 20 29 15 -14 6 -27 17 17 -51 -74 -2 -20 19 -11 -12 -16 44 25 54 38 -25 -67 26 12 63 31 -26 -5 40 42
3979 42 21 -40 -14 -13 -23 58 24 25 -23 -20 -22 34 20 -7 -42 -39 8 55 38 19 0 -25 1 -13 42 0 -35 -79 -7 18 14 3 -22
4012 -22 1 -25 11 12 -21 -16 -35 17 51 -17 4 -7 -32 -14 48 33 -43 -17 -24 29 73 89 -25 -14 -32 -35 8 -16 21 -24 78
4043 78 -40 83 34 47 -17 0 28 -25 -7 -52 -4 -12 -32 1 -24 -25 17 -14 -22 11 32 57 14 -7 -8 28 11 84 -60 -38 -41
4074 -41 64 -9 -6 15 -29 -26 -12 0 33 10 -59 -51 32 10 -2 -36 -18 -31 32 16 -22 -27 -24 -13 -4 23 -11 -5 -7 -43 21 15 -53 -6
4108 -6 -20 11 9 14 6 -21 -22 -24 -39 8 2 16 30 -21 18 2 7 -39 -23 -52 1 -2 -27 -7 -9 3 3 41 24 -34 17 0 1 80 37 -57
4144 -57 -14 15 40 19 57 -4 -44 33 8 35 9 26 -4 -60 45 18 42 -8 -17 -44 -35 58 34 -7 -16 -75 -25 14 44 83 -35
$$ packed form
3912A1K2l3l5Rj5L8J2l8L4Nk1m8R3j1qo2N3jL6oo3JoK2M6l3J4j00N1L4L3J3Qn7
3946bl2N0L7l3Rj4k9K0l3M4%o8k3P2j8L9l0jmO0j9K9j6o3m2R3j4N1l2n7K1M5K
3979D2k1o1K6Jj0Q1l4Jm8LkN6j4k7l5LM7M7j7j9j9k5K6j4N5m2l5m4P2K5mj1k5
4012b2K3k6L6Jl3Nj9N2L4o8K1j1k5J8O2j5p6K6pN3M4J6j14J1j8lM3k4L7m5J02
4043G8j18J23m9J3o4J7K8n3J8m5M8qk0L3k5jM2l1qL3K1K5m3k1jL6j7P3j44K2l
4074d1J05p3LK1m4LJ4J2L3k3o9QQ3k2j2l4J8j3O3j6l8nLJ1RK7l4Okl6O4oo8M7
4108fj4L1kNqk7jkj5M7oJ4J4n1L9j6Nm6J6k9N3lk5K0kJ2%L8j7n8N1j7JP9m3r4
4144e7M3K9K5k1L8o1m0P7k5K7k6J7l0n6J05k7K4n0rk7RR3k4m1rn9N0L9L0L9j18
$$ plain form
4175 -35 -2 9 -8 29 -39 13 28 57 -29 53 57 -24 -12 -11 -53 -29 -18 28 -36 28 10 2 -35 -9 7 30 -5 17 64 -20 -9 6
4207 6 39 48 -35 -40 -46 -38 29 -8 -14 50 -18 -3 10 28 23 -35 -13 -15 19 21 -18 4 67 7 41 9 7 -39 31 37 -56 7 -30 1 -59 -2
4243 -2 35 48 -39 113 45 -12 104 65 -21 153 5 -136 -57 77 -16 -17 -9 -24 6 -5 -8 -61 -3 -2 -25 23 -7 12 4 -17
4273 -17 50 30 9 19 -44 -23 33 -18 4 3 -32 -6 42 1 -23 -47 -65 5 46 18 -37 -30 74 -1 21 19 18 -104 3 47 52
4304 52 31 -1 -2 -67 -70 18 5 -3 44 -43 -14 -34 -7 10 34 -18 5 -3 21 -15 9 1 -29 15 -1 -11 19 -3 -49 14 37 3 -35
4337 -35 7 31 13 14 -35 -30 -13 -34 -5 91 10 -5 0 -37 45 17 30 -13 -4 -23 -22 4 -12 -14 -24 1 -24 4 -41 -31 36 -7 24
4370 24 -15 -4 -39 -18 -67 -8 1 30 -12 -69 -28 28 2 -47 -30 32 30 -51 38 -10 17 17 -8 -22 -6 -13 -11 -55 -33 -10 6 -6 2
4403 2 -48 14 16 43 2 -34 -9 2 13 71 38 6 -25 -7 -2 -8 30 -9 -59 -33 -4 44 4 10 -14 25 -28 21 -18 -22 -27 33 18 31
$$ packed form
4175c5L3J1j7L7o8N2J5K9q6Q2Mq1J2Jm2K4J1M6o4O4j8ql7K6J6K3l5K2M7q4J1J5
4207FL3Rq3noQO7l7oO4o8J5J3J8nn8K2kL4Kl9K2O3o0L4l2km6P0Or3O3l7L1o0N7
4243bL7J3q7J52o8n7J16l9q6J74j48j41P9J34r3jQj5L0j1ln3N8Jk3M8l0J9qk1
4273a7O7k0k1J0o3K1N6n1K2jl5K6M8m1k4k4j8P0M1k8n5PJ04p5K2kjj22J07M4N
4304E2k1l2jo5lQ8j3qM7q7K9k0K7J7K4n2K3qK4l6K4ql0M4j6j0L0k2m6O3K3l4l8
4337c5M2K4j8Jm9NJ7k1K9R6q1j5Nl7Q2k8J3m3Rj9JK6j6kj0K5k5K8m5J0O7m3L1
4370B4l9J1l5K1m9N9RK9m2n7M1N6k6m9J7O2kq1Q9m8K7%k5j4J6pKm4K2K3J6j2Q
4403Bn0O2KK7m1l6K5J1J1N8l3l2l1J8NoL8l9n0K6K9M8m0Ok4L9n3M9l9mnO0j5J3
$$ plain form
4437 31 26 -36 16 -6 18 -30 21 37 -18 -46 -2 45 -17 -5 -6 14 3 15 -8 -13 23 40 9 12 -1 -28 21 -9 14 -24 -52 -19
4469 -19 -1 30 -13 25 -9 -41 18 14 13 29 21 21 -8 -64 -20 39 19 -13 -30 -38 32 17 11 23 -24 -34 10 27 7 35 -34 22 3
4502 3 7 -3 -17 -61 26 25 -33 23 53 -53 3 10 -7 -13 -19 -34 -38 21 15 12 21 2 22 -4 -12 -8 -40 47 -4 -89 63 -6 -26 -63 -22
4537 -22 31 -53 2 -11 -4 -56 16 6 50 -19 -20 -30 28 26 -71 -51 4 36 -1 75 72 2 -31 12 -4 8 -20 27 -36 34 -23 38
4569 38 1 -12 45 -44 28 46 -51 -12 -39 11 -8 24 -45 -34 13 -65 14 47 -11 -5 -19 -23 4 -14 13 -2 -3 -9 -11 7 34 -25 -8
4602 -8 -25 -6 -34 -31 -60 -18 8 0 12 -18 12 37 -20 -33 -8 -2 -15 -8 -63 45 9 16 15 24 4 -30 16 -48 25 18 13 -4 16 0 29
4637 29 -8 -23 5 -45 35 5 -14 -56 1 -33 -15 -8 63 -5 -34 -22 -12 10 -28 -17 14 -22 44 38 -50 -50 26 10 -31 -23 32 35 -16
4670 -16 43 1 -17 1 -21 -40 -32 34 35 42 -24 -9 -37 -21 -27 -45 40 -35 53 34 13 1 -1 -38 12 23 2 17 11 28 -26 -2 4 -16
$$ packed form
4437C1no2N2k2K4m8N1J6n5k8M4M7o2J2jK0j1J2k3nL6J7l1Lj3k7M9l0K3l8k8L3
4469a9J8L1m3L8l4l2N9mjJ6q%k9n6M4N9k0l2j7qP0j5oJ2m7j0M4J7k0K8o9N6j9
4502CMj0j4m4Q7jn8N6L0j06N6Pj7ooj5mN9olRj9K0k6qMl2Q7n1q5J52o9k0l7M1
4537b2N3q4N5j3Pn2P2j0M4o9jj0N8kr7K0N5L2l7P6lp0l3M3j6J2k8M7o3P0n7O1
4569C8l7j3N7q9P2J8r7L9k7N0j9L2o9J1M7p8P9L3n8Oj4mK7j8K7j5jokJ8K7n9J7
4602hj7J9k8Lk9M2K6qJ2l0L0K5n7j3K5Oj3Pn5J08l6PjRk0l4M6o4P3pnj7K0j6K9
4637B9l7j5K8n0Q0l0j9m2N7l4J8PP1o8k9J2J0K2l8J1L1l6O6oq8%P6j6m1QN5Ln1
4670a6N9m2j8J8k2j9QO6JPo6J5k8J6oj8Q5p5Q8j9k1j2kl7N0J1k1J5oJ7n4K4Ok0
$$ plain form
4704 -16 16 5 59 32 -30 18 9 -24 41 -41 -39 8 -8 30 11 5 -16 -21 7 -15 -37 -2 -14 34 42 -32 55 14 12 13 4 -15 18 -8
4738 -8 13 6 -31 -10 -2 54 9 33 -24 28 15 68 3 45 -32 37 44 -12 -36 47 3 18 21 -1 75 -31 24 53 -7 4 10 -23 -3
4771 -3 -33 24 -3 25 6 -22 -7 29 32 2 -10 -42 17 34 18 7 -4 -12 -17 32 20 -8 -36 -29 -5 0 -5 18 -2 -8 -39 -11 30 -26
4805 -26 11 -8 -7 17 39 -17 2 4 -4 21 -15 -2 -11 -3 -30 1 -40 -20 -12 -42 -1 52 -45 25 9 19 24 -2 22 -30 -34 -5 -14 40 51
4840 51 24 2 -20 -17 29 4 19 8 -37 -20 -6 -48 3 30 7 -30 -64 25 -16 10 45 52 27 41 61 -6 -32 -29 25 -22 9 18
4872 18 -55 13 34 54 -54 -24 -32 -13 31 33 -57 3 -35 10 -7 -23 44 11 -5 -44 5 -27 -9 2 7 32 7 8 22 3 -41 -61
4904 -61 10 35 28 18 -15 26 38 36 3 -32 -16 30 -24 11 -10 -2 15 59 17 -14 -17 -4 -20 -26 -22 -14 9 15 -9 -36 -6 21 -28 4
4938 4 7 -48 -9 -45 -31 15 16 -33 -3 0 24 -18 3 10 40 37 40 52 -21 -4 41 -7 -21 13 7 5 36 42 6 -5 17 -2 11 -40 -34 6
$$ packed form
4704a6L2j1N4k7o2M8rl3O5q2KM7j6L8j9ok1nK8k2k2L5j2M8Qp4Q7m1kJrj9L3k6
4738hK1pl7K1QN6m5K4n7N2j3N3o5M2p7O9Pn6k4Q3m4J5Lk2P6j06N5K9o0J1Ol3K0
4771cl0N7k7K8j9k8J5L6Ll0j2l2N9J7j6j1j1qnM9j2k8k8PK4NnK3k0ol1K8M1n6
4805b6L7j9JK4K2n6J9KqK5l6J3rQk7L1m1K0Ql0M1N3r7P0j6J0Nk6K4n2mK9rN4J1
4840E1k7k2k2LM6k5J5j1m5J7J4m2N1K7k3l7l4Q9m1K6L5Pk5J4K0o7k6LN4m7L1R
4872A8p3O8K1K0j08L0qJ9M4Kr0O0l8M5j7j6O7l3j6l9M9l2J8J1NK5k5JJ4j9m4k0
4904f1P1K5pj0l3M1J2kl3l5J6M6n4L5k1QJ7M4m2l1lJ3j6oMQK3Ok4k7L0K7m9L2
4938DLn5L9l6J4M6Jm9L0LK4m2K1PL0lLJ2p3J7M5m8j4L4okL1Ol6j1K2j9J3n1OM0
$$ plain form
4974 6 -26 -9 14 -5 -23 54 -6 -27 32 -41 8 -2 -14 -34 11 -1 44 2 -42 31 -4 -3 30 -19 -15 6 -14 29 18 -55 20 -17
5006 -17 -34 31 -16 -25 -22 -9 -4 -29 49 -10 4 -41 5 -15 42 20 26 -5 -24 33 3 -43 1 22 5 42 19 51 -48 -18 -31 -25 -6
5039 -6 -27 14 68 27 29 -31 -3 -39 -31 -17 -5 21 -10 -37 -34 -6 2 -2 -25 13 7 68 5 -31 -5 5 -13 -7 5 11 -17 -1 -21 9 -17
5074 -17 -15 0 14 2 30 13 -27 47 13 3 -26 -26 10 -42 6 15 -34 7 21 -32 20 -25 -23 22 -11 -38 -34 26 0 9 13 -1 -40 40
5108 40 -31 44 -8 -47 42 7 -39 -23 50 -31 -9 -29 -18 -1 -29 -18 -15 -3 25 -24 12 27 10 -1 23 23 -61 -16 10 -13 4
5139 4 -15 51 6 -20 22 45 -10 -4 -7 29 19 -74 -1 -9 -22 -26 -42 -29 24 -23 4 -3 -53 -37 44 18 -32 -19 17 -1 -12 39 17
5172 17 -2 -50 32 22 -38 -6 15 -20 -16 46 -28 18 -31 -22 16 -9 13 17 -33 15 -20 20 24 38 10 15 -42 17 48 -18 32 -54 -8
5205 -8 10 -3 31 57 -40 -9 -18 -9 -2 -20 -25 -71 -33 -9 27 11 -3 31 -16 52 38 15 21 -8 70 -35 63 -22 24 15 -4 -35 20
$$ packed form
4974Fl2J7K3j9j8P7o0k1N9p3M9j0j2k0M5j2M5m2m4P3l5JL3m9MK1k0M3j1p3P5l7
5006a7j7O5m7rLJ3Nk5P8n9J4m5M6k0N7k2Ol1j9N7l0m6M4K1j7L7k3L2r9L0j3OJ9
5039fk1M1N4m1Ko0K8l6QJ4J2K6l1k7LK8Qmk3L8oO1o3l6K6J0j8OJ2Ok8J6k0L0k6
5074a7KJ5J4j2K8j7m0P4l4j0k9%L6n2M8Rm9M1J4n3N2m5KM5l3k7MO0k6RMj4l9Q0
5108D0p1P5n2l9Q9l5m6J6P3q1K2k0J1J7k8J1LJ2K8m9L6J5j7j1K4%q4M5K6k3J7
5139Dj9O6m5k6M2K3n5OlL6j0r3P3qj3mj6J3N3m7K7pn0J6Q1k6n0J3L6j8j1N1k2
5172A7j9m8Q2j0o0L2K1l5MO2p4M6m9RL8k5K2Mn0M8l5M0MJ4k8Nn7N9L1o6N0q6M6
5205hJ8j3L4K6r7L1rRPj8nm6L8K4L6j6j4L4m7O8j4k3Ok9P8j05R8q5M6rj9l1N5
$$ plain form
5238 20 -11 44 -3 -8 -15 5 41 13 -18 30 22 -14 57 -12 27 34 -7 17 -32 -4 12 -38 24 -21 23 -25 30 -7 -20 36 -13 40
5270 40 28 -6 -4 3 -34 2 -51 5 20 -9 15 -28 -11 -66 29 -23 12 -8 -26 84 19 1 -19 60 15 -6 -22 -23 0 12 1
5301 1 17 20 -9 22 -33 53 -7 -35 13 -26 40 21 9 -21 34 21 26 -25 6 2 -9 16 -9 13 -47 22 -41 -1 -14 34 -39 -5
5333 -5 -34 11 -15 -8 6 -38 32 -38 -43 18 3 -20 16 -32 1 21 32 13 -34 27 -15 -6 -31 18 43 25 9 27 17 -31 65 -8
5365 -8 -1 -2 -7 15 -20 11 -2 26 -15 4 37 4 5 15 -17 26 30 10 16 21 19 54 15 -15 -2 -3 -4 -16 1 14 6 31 -4 -9 -26 9 28
5402 28 17 -29 12 -24 -36 43 26 -51 6 -10 28 17 -43 17 40 -40 -6 -18 28 19 -10 26 12 -61 -26 -7 -29 -14 54 -26 9
5433 9 16 10 -43 25 -11 -42 54 -14 22 16 -7 -32 -30 -41 -34 -20 45 4 52 8 -13 28 -53 26 -40 0 12 -22 -8 -44 -10 -16 14 -8
5467 -8 10 -17 -5 50 15 1 -14 -54 -12 -5 -19 33 21 -31 -42 -11 3 23 -21 -65 -50 -99 7 14 -25 -26 -40 45 24 -17 -35 35
$$ packed form
5238B0l1N5m7npK0L6k8l1M8ql6P1o9L9Pm1K4m9K8J6n0O2m5M4m8N5l7j3N6m9N3
5270D0j2l4KPl7L6n3N6J5k9K4m3J7n5R5n2L5k0j8J10o5j8k0P9m5k1j6jK3J2j1
5301AJ6Lk9L1n5Q6o0k8M8l9O6j9j2l0N5j3Nn1L1mj1K5k5K2o0O9o3M0j3M8p3L4
5333ek9M5k6PJ4m4P0p0nO1j5k3L6m8L3K0J1j9m7O1m2Rk5M9K5j8j6J8j0m8R6p3
5365hPjnK2l5L1j3K8m1J9L3l3JJ0l2M3Mk0ONkL5l9l0J3jjj2J7J3qK5l5nj7L5J9
5402B8j1m6M1l6j2P9j7p7N7j6L8j1o0O0K3q0L4j2M6rk9L6j4p3L5J9k2J5O8q0L5
5433IPon3O8l6l1R6o8L6ok3k5Kj1PJ4O5m1M8m4k1M1q1P9o6M0J2l4J4l6L4oL0k2
5467hJ8k7J2N5l5j4j5m0M2Pj4N2j2n2j1L1J4K0m4m4J5m9J06Pl9jj4Q5k1m1j8P0
$$ plain form
5499 35 13 -44 10 -7 -20 -45 30 28 -19 14 -6 46 -25 -5 58 7 -5 -39 -17 -50 -9 14 28 29 -13 -48 -13 20 -37 -14 19
5530 19 -24 -29 -4 -42 -7 -19 27 -11 -65 38 23 -7 -9 -34 11 26 -31 12 56 -21 -7 -21 -57 -53 -21 14 -17 -28 -1 -6 23 39
5562 39 -24 -35 9 -27 -37 32 24 20 23 0 -6 -21 -41 -12 -17 -23 23 -18 -17 -22 -32 -15 -23 42 15 -10 -9 41 66 -75 -12 17 23 20 29 5
5598 5 -9 -4 19 -6 0 -19 1 -24 -14 5 -25 8 29 -42 15 28 -59 -12 46 21 -27 -43 -29 -36 -11 6 -11 20 20 74 -26 3
5630 3 4 27 16 -28 -35 27 36 -32 24 -33 11 -25 31 -31 -1 11 20 -15 -22 -6 -13 -23 -33 12 5 -38 -3 -26 -30 -1 11 19 -16 -18 -2 -5
5666 -5 -20 -34 -30 -12 -14 15 18 -19 -7 8 -14 -34 -29 -26 -26 2 3 38 -4 -39 19 22 -18 -15 16 -20 -2 -73 0 -7 57 20 -18 10 -5 -3
5702 -3 -38 21 -38 -17 -14 -14 2 -42 -20 5 12 0 46 -6 -9 10 -17 44 10 -27 20 -47 2 -31 6 -40 52 -17 -9 10 37 -21 -14 -51
5736 -51 -24 -1 -5 6 -11 2 -5 -10 -30 41 13 35 -3 6 24 -17 20 -17 -20 -37 -37 41 18 -13 -42 -5 20 -64 7 21 24 28 22 4 14
$$ packed form
5499C5k2n7N4j7j3k5P5km7L3k0N2p1K0O3n1j2l4K2l3M1K3J4Jm2l5L5L3n7K3L3
5530A9m3nK5l8L5j2M6l8n4J03j5l0kk5M5J5n7M3M4p7J4j4l6ML2L5l1j1K7nK9J6
5562C9o3j1M4l6j0O9qmLk3oj5k0K9noM6m1Jnj0J7qO5k7k5JN0K5j41O3K9OlRk4
5598Ej4NK3k5Oj9K0k5J0J9l0L3K1p1N7J3q7M7N8k5m8j6J4pK5J7j7L1%N4j00K9
5630CJK3j1m4pO2Ro8N6n7M4l6N6o2L0J2Rl5pJ6pj0j0M5pm3L5k3mK9J2Ql5kJ6l
5666ej5j4MJ8kK9Ll7J2J5k2k0NL%K8JL5m2l5N8Lm0LL1l6J8p1P3pO4l7l8K8j5K
5702cl5N9n9K1L%J6m4K2K5Pj2M6n2lJ9k7O1l4l7M7o7M9l3L7m6R2o9QJ9K7n8Pl7
5736e1K7K3mJ1j7J3pnk0P1k8K2l8RJ8m1L7l7lj7%P8k3l1k9L7K5q4P1J4LMoj8J0
$$ plain form
5771 14 -38 -38 20 -3 35 -45 -56 -28 -2 17 5 -25 -15 9 58 -13 -78 26 1 21 26 6 37 10 2 -49 -2 -19 -62 6 56
5802 56 4 -20 -52 49 -46 -4 41 16 -10 19 35 -21 -21 -54 -11 18 23 0 42 11 7 3 2 13 -19 -20 -22 0 13 21 37 -48 -7 -35
5836 -35 26 9 -38 -9 -75 19 -21 41 6 52 -13 -4 17 7 19 33 -26 22 40 18 -7 50 2 36 -1 7 32 -45 -21 -64 5
5867 5 -53 -42 21 19 -18 -2 37 36 31 43 15 9 -8 -22 -33 12 -11 -25 -78 1 -12 -6 -31 54 2 21 3 -50 -14 -38 -19 -25 9 -35
5901 -35 -38 -33 -32 -26 10 18 -18 -34 -41 -63 -2 7 -8 1 -18 3 13 -37 -33 -19 -15 28 9 37 -2 -15 -47 8 22 -7 -14 5 -22 -19 -26 -35 -1
5938 -1 -5 43 15 21 13 -29 17 -15 38 27 2 -45 -14 21 3 -3 39 -5 -47 -9 -31 27 -37 7 33 -41 -9 9 -32 11 29 -6 67
5971 67 -18 -53 27 -52 -5 -45 -18 33 -40 -28 11 -3 -24 -4 19 18 -31 -11 10 -22 20 1 19 -10 -31 -9 -2 -6 2 -20 -43 45
6003 45 -7 -16 -14 -1 -29 12 -28 18 49 24 24 -14 40 41 -29 -25 -3 -22 26 21 -11 2 37 22 -14 6 41 -108 -14 35 11 -13 26
$$ packed form
5771A4n2%N8k3L8q0j1K8K6J9j2l0J0K4M9p1o5J04k5K0Nk0L1k7qn1M7j7m3O8N0
5802E6n2k4l2J01r5M2M5k5k6K9J6n6%l3M3K9Nk3M2l1mmjJ1l2jkK2J3QJ6q5M1k8
5836c5O1j7m7K9o6R4m0O2l5M6o5RK1j0J2J4n9M8J8k2k5N7m8L4l7QK5p7K4m3O9
5867En8J1O3kl7J6L9jnJ2k8oj7j4j1M5k3j4n3P9j3Ok5Q5n2J9j8n3L6k4J9oL4m4
5901c5lNJOL6Ql6j6pk2O1Rj5Rj9K1J0n0MJ4MM3j9K8l9j3l2N5J4k9pJ9k7LprL4
5938amM8k8Oqm2M6l2N3j1k5m7L1L5j8oM2m4m2L8k2N8o4M4K6p4L2J8m1M3J8l5P3
5971F7q5l5Q0p9M7m0K7N1p3J2L9j4k1K0K3jm9K0K1l2M2j9J8k9k1K2PmQk2k3Q8
6003D5n2rKJ3k8M1m0M6L1k5%l8N4Jp0MK2j9M8nl2J3L5j5l6K0L5j49R4M9k4k4L9
$$ plain form
6036 26 -1 -3 -43 29 -18 0 -48 43 50 -8 4 -46 3 -44 -2 -25 -41 -45 -5 19 -10 -39 14 -4 20 -9 45 31 4 42 6 -29
6068 -29 -4 18 -13 -6 19 -15 -9 -40 16 -21 -3 -17 -40 27 7 47 -47 -33 -7 -29 -4 -14 -30 1 19 8 17 -3 -37 0 15 -9
6100 -9 -2 -22 12 27 0 79 26 24 -5 24 16 11 -24 -3 -61 12 7 17 -51 29 -6 53 -54 -60 -10 -33 11 -8 4 0 -5 -24 17 -32
6134 -32 13 -1 73 21 -18 -6 10 -58 19 9 23 10 37 -25 -38 -8 59 -4 30 -69 -21 -3 -41 -2 -16 27 -52 12 1 8 -44
6165 -44 -8 0 -12 36 -57 16 21 -64 -27 -4 -15 2 3 65 -8 -16 34 -2 1 0 11 30 -11 27 3 -22 -33 5 -47 22 15 12 -20 1
6199 1 27 -32 7 6 -13 38 -20 -5 11 29 45 -20 -25 39 13 -13 15 -33 35 67 -31 21 -19 -56 -20 6 -27 -45 -38 -42 -6 -20 -45
6232 -45 -28 39 -27 -8 -41 -42 11 -2 46 -42 -13 -4 -20 26 32 -3 36 20 -24 -9 22 18 1 10 24 -25 -44 -42 -18 -49 63 9 -24
6265 -24 29 -17 30 5 3 13 10 6 -36 -48 10 39 8 -24 -4 -34 11 -6 -1 -16 -18 4 27 11 -4 -43 1 -4 -23 -46 2 19 44
$$ packed form
6036B6k7km0P2m7J8m8R1Pn8J2n0M9m7M2k3j6mM0K4k9k9N3j8K4k9N4j4k7L8l6l5
6068b9K5K2l1PK5l4Ol1N6l7J8j4k3O7k0M0r4J4K6k2K5j0j6L1J8j1Rk0l4L7J5k4
6100iPk0L4J5k7P9n3kk9K9qnl5K1n8P3nJ0o8Q0l5N9j07oN0k3M4j9J2mnj9M1m9
6134c2M5j4P4n2l9J2J6o8P7j0J4j3K7o2j3L0O7o3L4r9M8J8l8L9j4M3p9O4j1Pn2
6165d4L6Qj2M8r3P3Nq5L7K3j1J7JO2p3qN0l6LjJ1J9m1L8k4k5j1L8n2O9pll2K1
6199AK6n9L9jj9N1n8J5J6J8J6o5nO4k6k6K8m8O8L2r8N2m0l7L6K6l3j8PmL6j4k5
6232d5J7O7o6J9l3jN3j3M8q8K9Rj6M6Ol5L9j6m4J5L1mj7RJ4m9j9KK4l1J12n4l3
6265b4N3m6M7k5kJ0lmm2j2N8K9l1l2K0l0M5j7Nj5kK2K3j6j5l9M4nj9k3M8J7K5
$$ plain form
6298 44 11 -21 -49 -2 45 -10 8 -27 -43 15 -42 10 9 -12 0 -7 -13 -30 -17 -8 5 -7 -1 -6 -33 35 9 -32 -45 55 18 -3 -25
6331 -25 -31 -17 -6 -3 -42 7 -5 -56 0 33 4 -16 -36 35 32 -12 -14 54 -14 2 19 23 11 44 36 5 -28 29 -16 2 -20 30 4
6364 4 38 -14 11 -16 -11 -9 -51 8 -16 0 -34 -38 51 0 18 59 -24 28 16 32 -6 -2 -34 -28 -2 -1 25 -22 43 -16 -41 -26 -1 -2
6398 -2 -5 23 10 1 3 -11 17 -73 -35 -40 -3 -21 -5 52 -12 39 -39 -61 -20 -27 -11 -16 -55 15 24 17 38 39 2 -56 8 -36 2 10 -28 -24
6434 -24 4 -9 -17 -16 -18 7 29 -10 37 2 -23 8 4 -9 69 -43 8 10 -9 -41 -14 28 -30 -14 -32 48 16 15 22 -6 -7 -15 -50 -1
6468 -1 -67 -69 -3 35 10 -2 2 -16 18 -14 -12 20 -31 -14 2 -46 13 -32 -18 26 -39 -28 11 26 35 -12 4 -3 -5 -7 -15 -11 40 19 22 -29
6504 -29 -21 -32 -11 -9 -25 -11 3 -7 -47 -21 32 -7 9 -22 -12 14 -7 19 -53 2 -13 -25 -10 -3 -34 -14 60 -19 0 -51 16 -18
6536 -18 -8 -2 12 -12 -32 -36 -47 26 10 11 -45 30 15 42 12 -46 -15 -35 32 -29 -2 30 28 -16 -1 26 -12 9 6 0 37 17 -6
$$ packed form
6298D4l3l2k8M7M7n5J8l5j6N8n7N2jk1J2poj7J3RJ3j2Onk7O8k6m1j3J00l7k1k2
6331b5oJ4J1Ll9M9j2n1N6L3k9k0k0P1lm4kO8o8J6J7Mj2L3ql1l3N7m5J8k2N0k6
6364DL4n2K5k7NKm2N9k4J6l4mQ9n1J8M1q3N2j2J6l8Ml2OK6JK6m7O5n9k5J5K5j
6398blK8j3rKj4K8r0L8nL7j8J6N7o4N1p8k2M1pJ6nl9P0RpK1Jl7n8O4m4L8Ql8M
6434b4K8j3qJkK5K2l9M7l5k5L1mj3P8j12N1Kj9l2K7M2n8J6j8Q0l2jPk8jql5M9
6468ao6kO6L8k5j2Mj8L4l2KL2n1J7J6m8N9m5J4M4o5J1L9J5Rm7J6pkkqMN1k1Ln1
6504b9Qj1K1Kj6J4J4j0m0K6N3l9J6l1J0K6k1K6p2N5j5j2J5Pl1K0P4p9J9n1O7l4
6536a8J0OJ4k4k0mj1P3j6Jn6P5j5K7l0n8L1k0O7o1K7L2km4J5K7l8K1loL7k0k3
$$ plain form
6569 -6 8 -14 -10 14 24 -26 -18 4 -51 -20 -74 -12 0 -52 -29 45 -39 3 4 5 27 -12 -13 -43 51 28 -4 -52 -14 -25 -5 3 -31 -18
6603 -18 -46 13 0 -16 -31 20 25 -7 56 -34 5 -3 -66 -21 -7 -40 28 -22 -7 8 34 1 28 -24 -22 -19 -33 17 32 -12 -4 -19 18
6636 18 11 -10 40 -36 -2 -2 -16 26 44 -57 59 -6 16 -7 8 0 -14 16 -70 -12 5 14 27 -10 -31 -37 29 -30 -36 13 -23 -12
6668 -12 -5 -20 -29 7 -15 5 -42 12 -4 -27 8 -57 -47 30 29 -14 -6 7 24 -61 -35 15 -22 -7 2 -8 -33 -30 -15 -16 -41 15 -18 28
6702 28 38 -13 -12 -8 -2 15 18 -56 -45 -5 -9 -5 -27 6 6 -40 41 -30 -4 -61 -44 2 -7 -6 -11 -4 -1 12 9 -2 -65 -35 -10 -15 13 5 -7 8
6740 8 20 -32 9 46 41 66 46 31 -26 31 -36 31 15 -30 38 -17 1 -21 -31 64 -21 37 13 43 -4 25 8 -4 21 -20 -1
6771 -1 14 -10 -19 -9 25 -27 13 -4 -72 -10 23 -20 12 -29 -7 58 11 -45 1 -50 -36 9 6 -17 25 -34 -18 14 -46 -4 -11 -26
6803 -26 -12 -64 -49 22 6 -5 28 7 -20 -1 -2 -19 -11 -6 -16 -21 13 -6 -67 25 9 -1 -34 -38 4 -39 19 28 3 8 -31 -29 44 -3
$$ packed form
6569fJ4k2MK4J0n0QK2n5L1n4O2J2n2K3P4q4M2JJK2l9jl0R4k3l2m8L8j1K0Ql4J3
6603a8k8N9j3j6j5N1Nl2O3r0L9qo3M5J4l3O8n0J5J5K6l3K7n2KLj4N0J5m4Qj5L7
6636A8pk1N0p6L4%j4M2J8j01J16o5K2k3J5qj4L0q6N8J7RJ3l7k1oO6n9oM9l6J1
6668a2Pj5rL6k2K0m7N4j6k3L5o5J0P7jm3QJ3J7q5K6N0l7J5Rj0k5LJ5jk5N6l3M6
6702B8J0n1JMOJ7Lp4J1M0mMk2L3%m6Q1p1K6n7J7M6rJnPLJ3lj1o3L0K5nK8qj2J5
6740HJ2n2M1L7nK5k0j5n7N7o7O7j6m5O8n5J8k2j0R5q5N8k4L0m7K9j7j2K5m1J9
6771aJ5k4rJ0L4n2M0j7o8O2L3m3L2m1K2O5m7n6M6n1J4M5lk3M2n9J6L2o0M2pj5
6803b6J4n2J5P1j6j1L3k1k7J9jj7QNj0nL4j9o1R2j6j0l3mM2m3N8Rk5Nl9KP3m7
$$ plain form
6837 -3 19 -44 45 12 -31 7 16 -13 -17 -19 -9 -13 -6 47 46 16 27 -12 -31 -26 -19 12 21 -54 -24 -10 -21 -23 27 -19 11 43 3 29 -30 10
6873 10 -5 48 37 -12 -41 -3 4 -9 29 16 -2 -3 -8 27 -21 -49 2 -23 -58 2 -33 -7 -16 15 -69 -58 23 -14 2 33 -10 52
6905 52 -30 -15 -20 54 -24 -19 24 14 33 -21 23 -15 -22 38 -6 23 28 41 32 13 -12 -15 14 -11 17 24 -31 24 16 -37 -46 -5 49 -30 -33
6940 -33 -71 20 -1 25 -68 22 24 11 -33 -1 -1 -74 -33 -22 -13 -65 5 30 21 -10 26 -14 -8 -8 55 35 -41 2 4 34 11 -47 -26 37
6974 37 -55 19 -3 6 30 -20 34 -10 17 -28 -23 -6 7 -41 -4 -26 14 7 6 -17 -15 -13 -15 -42 -30 -24 -18 52 28 -15 -3 -15 -7 18 18 -26
7010 -26 -26 -68 42 0 -10 26 -29 40 -4 -43 -37 -1 1 11 44 -7 24 33 -7 -19 8 6 -7 -15 -51 30 28 36 -33 -17 -21 -24 7 5 14 5
7046 5 -36 -16 10 -39 32 25 18 36 -10 -31 -3 31 11 -33 -11 -8 -32 6 -63 -26 19 -57 24 17 -76 -3 16 -21 -58 -9 2 -40 5
7079 5 -11 20 -34 35 21 38 79 -46 15 -13 13 20 -6 6 -17 8 -3 -18 -14 -28 17 23 -2 26 1 20 33 9 36 -13 -7 19
$$ packed form
6837cK2o3Q9l3m3L8Rk9mkJ0mPN3jl0J1l9j9NPL1Rp5L0J4j1kN0m6L0L2m0K6n9M0
6873A0j5N3j1m9k9L8Pj3L8j3j8jnL5m8k8N1k5l5O0l5K6rL1q4J1Q1l7J6L1m3O2
6905E2q2J5nP4p8NM3j0J9n4M4l8pO0m4K9NJ3rj9k5lK9k5K8Pn5N5qn3rM1N4p9l
6940c3l8R1k1K6r3R0Kj3m4L2%p3M1J1Rn2P0K5rl1L6m0O%O3k0p6M3KL0k3n8K1O3
6974C7r2P4k2RK4n0N4m4K7m5NJ7J3m8L7k2M0pjk3KKkk7J2OOP0k4m3J2j2QK5%m4
7010b6%m2J10m2j0L6n5O9m4l9OL6KJ0L3n1L1Rm0j2K7kj3ql6Q1kQo9J6mlL1kRr
7046Em1K0K6m9P1ppJ8m6k1K8L4k0m4K2Lk4L8o9L7M5p6Q1pr3P3J9l7l7M9J1m2M5
7079Ej6L1n4O9j4J7M1j25O1k8K6Pk6J2k3K5j1j5Mj4M5Ok5K8k5J9J3k4K7m9OK6
$$ plain form
7111 19 0 22 -2 7 32 31 20 -16 -54 -17 -34 -39 -10 -32 -21 -58 13 14 -24 -36 -1 -24 -17 -2 8 13 -46 -14 -5 -10 -32 46 -29 -15
7145 -15 10 0 24 15 1 33 42 22 6 -21 7 59 -7 -54 17 -27 -19 1 -30 27 45 30 19 13 -15 -17 -12 -53 -3 -26 -42 -3 11
7178 11 -30 1 -7 -70 5 19 2 -53 4 -37 -8 -32 -62 -46 3 12 -7 21 48 -52 -15 -24 54 19 -15 -16 4 0 -53 -19 10 28
7210 28 -17 -32 -35 -20 -16 15 -36 -16 6 63 9 -34 39 -54 -57 13 -5 -37 40 -36 -39 -5 -4 -24 49 23 -4 12 8 -14 -18 -21 10 22
7244 22 1 -4 -14 25 -14 -12 2 -16 0 -50 19 -20 21 -41 1 -25 20 20 -36 -15 30 8 70 15 -27 27 -61 -50 6 28 11 8
7276 8 28 40 -2 11 4 30 3 4 -9 20 2 -3 29 -43 -4 13 -3 -38 5 -11 -10 9 -64 -24 15 39 43 -50 17 -16 -18 -26 16 5
7310 5 -21 55 -7 14 -16 -56 10 -77 13 15 -53 35 -45 10 -16 16 13 -66 41 21 28 -30 44 -42 -10 -48 -64 36 35 6 -17 10
7342 10 -13 13 -8 8 7 -36 -30 28 15 20 3 21 8 -4 44 -8 -42 -39 -10 22 5 -22 25 24 -6 28 8 16 -6 -65 28 64 -17
$$ packed form
7111A9j9K2k4RK5jj1l6l8L7j7nK9k2J1l7P1Jl8j2L5k3PJ5J0Nn9L2Rnk2P8p5J4
7145a5K5j0K4rj4L2Rk0j6k7K8N2o6m7P1m4QK0l1N7J8j5j1ok8kNm1N0k3j6L9J4
7178A1m1L1qo3P5J4j7n5N7m1K9k4l0J6M9Rj9K8K7j00L7rP8l5l4jK0mn3L4K9J8
7210B8m5j5lJ5ML1n1K0K2N7n4m3P3r3lP0j8l2P7p6lL4Jk0P3k6k7J6mk2mlL1J2
7244B2k1nj0L9l9KJ4j8J6n0O9l9M1o2M2k6M5%n6K1M5k2O2n5m2N4q8J1N6K2j7l
7276HK0J2m2J3pK6k7Jj3K9j8nL2p2L9J7j6l5M3j6JJ9p3M0L9K4Mr3O7l3kqM2j1
7310Ek6P6o2K1l0m0O6q7R0Ko8Q8q0N5k6L2lp9J07k0Pn8P4q6L2l8j6J00jk9k3K7
7342A0k3K6k1J6jm3ON8j3Nj7J8j3j2M8n2l4LK9L2j7k7M7jl0L4k0Qk2n9R3L6q1
$$ plain form
7375 -17 27 0 -5 -25 -47 4 3 -14 27 38 61 -13 -38 -8 13 18 -20 -11 19 18 10 5 -48 36 -23 -34 -15 -13 -7 -35 -13 -39 21 -17 28
7410 28 35 -27 21 4 -2 23 16 -27 -14 20 -22 11 2 -63 12 -21 -34 -43 31 3 1 -12 -19 20 2 25 20 37 38 16 -20 -4 62 37 -24
7445 -24 -4 -1 39 -4 14 17 -28 13 -15 -7 -28 -5 66 33 -51 15 24 4 22 -86 0 8 23 1 -4 35 -12 -35 -39 -14 -28 -6 4
7478 4 17 29 -47 1 -53 -63 -48 -20 -12 -4 12 -20 21 18 -15 9 5 -3 -21 -13 -24 -67 2 -42 -6 -24 2 60 -48 -11 14 -17 -36
7511 -36 0 78 0 -10 -41 20 11 -36 -15 10 -31 -9 12 15 -22 28 21 7 -22 -34 18 1 -17 21 8 -8 -21 -46 12 -18 -25 30
7543 30 15 43 -20 -17 -31 -38 -48 18 -10 -5 -26 -57 25 13 -7 30 -39 -27 17 -1 -12 18 -43 -59 42 -24 53 -59 30 20 -11
7574 -11 -17 0 -35 8 -1 -15 7 61 2 2 9 -8 -27 27 -32 -9 -8 11 3 9 0 -22 -15 -20 -7 -45 -19 -6 -20 -79 52 21 22 -12 -42
7609 -42 -14 -36 -52 18 -39 14 -2 -50 0 48 -41 22 14 11 55 -3 58 -21 -34 13 -43 -19 6 -64 9 -12 -39 9 22 -1 7 -22
$$ packed form
7375a7M4k7nk0k2N1jj7M1J1K3p4k5L0K1Nl8RL0jqnn3Q4n9j1J9KOk8K2k6O0l8M5
7410B8Po2M8j7oK5pm3J3L4m2L3ro5P5l3j3rP4k8kj3pL9j8K3nJ7Jk2l6J6O6k5o1
7445b4K0LM0m3J8Lm5M1k8Qk1K3P1l3q4O6Rk0J8j08Q6QJ5k2nL9m7k3mK5j4K2J0
7478DJ3J2p6M8n4j0J5K8QQJ6l2M1ll3K4mqj8Qj1m3O9m4L6j8K6N8j08L7K5l1j9
7511c6L6P8p8j0l1O1rm7K1K5m1K2K1Ll7N0pj4k9j2N2j7j8L8j3j6j3k5N8l0pN5
7543C0j5K8o3Lj4pj0O6k8Nk1l1Q2j2k0L7o9J2M4j8j1L0o1j6J01o6P7j12Q9j0l1
7574a1oJ7l5M3rj4K2N4n9%Pj7j9N4n9K3JJ9qOrk2PnJ3l8K6J3j4n9J31l1Jl4l0
7609d2K8k2j6P0n7N3j6m8N0M8q9O3qlM4n8O1p9j3M7n6K4K5p0P3k1k7M8J3k3Qk9
$$ plain form
7641 -22 -15 -27 7 -44 -20 22 -21 -13 -10 5 -44 37 14 18 -37 0 14 -20 -59 -10 -59 -27 12 33 -45 12 -10 -23 24 -23 -21 13 -43
7674 -43 -17 -12 -35 17 13 27 27 52 35 3 2 42 -26 2 -15 -87 -17 -14 -32 -19 38 4 -33 -43 18 13 -49 -55 4 21 -36 -6 -8 28
7708 28 -37 2 42 -36 -11 -32 18 -8 9 24 -46 26 -67 9 27 -41 1 -10 14 21 -8 4 10 -6 25 -23 -19 -29 -25 4 26 2
7740 2 9 -33 8 -3 -61 -48 7 35 -50 26 14 11 -44 -3 -5 8 -26 34 -37 49 17 -24 31 16 -7 -16 -25 18 -45 3 20 -10 51
7773 51 -3 -12 10 9 -30 -8 14 -16 -17 42 -28 4 -6 -35 75 -31 33 -35 -4 -33 30 4 20 -57 -51 -9 -3 47 25 13 24 -28
7805 -28 30 42 -69 12 -37 -22 -12 37 -33 -33 -37 19 -1 -22 -31 -6 -15 5 0 -41 -14 55 6 -4 -18 -16 -25 -53 30 2 -35 -75 -46
7838 -46 -33 -47 -8 -9 15 -10 42 26 -14 30 -2 -16 26 43 -19 -58 -7 26 -7 -1 -47 40 -14 6 -31 -11 -39 2 -36 -41 2 -50
7870 -50 -37 12 30 -7 -8 -36 22 16 -50 32 -12 70 10 -47 -18 2 16 -40 29 -38 -108 -18 26 12 6 -35 43 -22 -1 37 29 46
$$ packed form
7641b2Pj2L4n1K4M2m3QLJ5m9Q1k3Mn5L7J4l4l9M9m9L2L9K1p8N7k2j3M7m7KL4n6
7674d3K6Nk3N2mJ4%K5j7l2jM0o8K8j7p2P0Lj8J3N7l4l7j0O1no2oN9J7n7L0kL6
7708B8o5L9M0p8K5k1N0k6J7J5p0P2r3P6J8o8M2j1K4Pk9J2Oj6L1m8Mj0MK9K2k4
7740BPm2M1j1n8J3N5K8q5P6j2ln5M1kJ3l4O0p1Q6l2m1N5j5k3rrM3o3M8J7l0O1
7773E1n4rK2jl9K2K2l0jN9p0L2j0k9J10j06O4o8L1k9O3k6J6p7OM2ON0k2j2J1n2
7805b8N8J2j11Q1m9J5J0M9p0%mN6k0k1rK5rK0nm1K7O9m9j0j4Krk8Q3k8l7m0K9
7838d6J3j4L9jK4k5N2j6m0M4l2j4M2J7o2l9N1L3l3Om6Q7n4K0l7K0k8M1l8nM3n2
7870e0J3M9J8l7jk8N8oo6Q2m4Q2o0n7K9K0J4n6O9o7p0R0M4j4om1P8o5K1L8qJ7
$$ plain form
7902 46 -12 -70 -8 -5 -21 -31 4 0 -19 -1 -29 32 19 -17 -33 29 -19 -15 -45 -3 7 3 -20 11 -7 -22 15 28 -18 -25 17 -3 12
7935 12 -16 -43 -31 -42 -7 -12 20 12 -45 14 -23 -31 20 10 45 -3 -36 24 -7 0 4 -41 20 -45 -16 16 -13 25 -65 -5 14 -1 -19
7968 -19 6 -27 31 76 19 4 17 -29 19 4 -23 0 -21 18 -15 9 -11 0 -53 -18 -4 -11 -39 -42 6 -26 20 -6 5 -20 -50
7999 -50 48 18 -25 7 -10 7 55 -42 -28 25 -5 -18 -12 -37 29 -8 -39 14 -18 69 -35 -36 15 -62 -5 -4 -53 20 18 6 17 4
8031 4 4 -24 -10 -7 -27 -11 -47 -14 -4 -18 11 -45 5 -28 2 44 -4 2 -27 1 -5 -11 30 0 20 -50 11 -40 -23 9 15 18 -25 -18 21
8066 21 -25 -16 15 31 0 -35 27 4 -39 -10 3 30 34 7 -2 -38 -74 29 20 -16 4 -11 9 -11 27 -12 -30 -20 -3 -35 -19 -46
8098 -46 -28 -31 -30 -16 -27 -38 18 3 4 31 -66 -24 -33 -12 0 -3 38 -22 29 1 -18 77 -39 12 -24 16 -9 -39 -4 -28 3 -4 6
8131 6 -8 -33 -35 -25 -21 13 -22 -55 -2 -54 4 3 26 -7 -45 -43 -9 12 -22 35 53 12 -69 -63 -32 -43 -2 -9 -17 -24 44 68 8 -17 -48
$$ packed form
7902D6n8n8O2Lj6j0L5mj9J8k8O1j3l6j6O2m8Ml0M2J0mk3L1j8j5L7J3m6pM2k0J5
7935A2k8k7J2j1L5nL2qn7N9l7qN1j0L5m8l3O0l1PMm5O1o5K9L2k9L8r0O0J9j5j8
7968a9K5l3N8M5n7j5J3m6M8j5k7K3k1L9l3K4k0J1n3L5J4pk8lM8l2M6k6J1k5l0
7999e0R8l0m3L2j7J7M8r7J4N3l0j3Ok5O6l7l1N3l2Q7j04jN1p7N7Jm9P3kj2J1j3
8031D%k8J4Lk0J6l6L3J0j4K9n6N0l3L0M2m8Ok9K8ooM1l0K0p0O1n1J7L2OLm3PL9
8066B1m6RL1J6l1l5O2k3m3K9J3K7Mk7rl6l6J03rl6K0j5K0k0L8l9j8J0J7l2J6k7
8098d6J8lJJ4j1j1N6j5JK7r7M2rK1J2lM1o0N1k8j9R5j16N1l6M0k5l0L5k4L1pJ0
8131Fj4k5kJ0ML4l5l3N3n2N8jK3l3l8KL4K1l4N7J8m1q1OL1j1M1pqpO8K4o0k5l1
$$ plain form
8166 -48 3 -10 8 -1 -49 -4 -4 12 17 -17 25 17 34 34 -51 -14 -63 25 51 15 34 -13 -41 31 12
$$ packed form
8166d8N1j3J8rm8M5%J6Nl4M2qJ7%q5L7m9Q8K6l6J9m7k8P2j9
8191A2
$$ Imaginary data points
##PAGE= N=2
##DATA TABLE= (X++(I..I)), XYDATA
$$ plain form
0 0 0 0 0 0 0 0 0 -8 0 -8 8 -8 16 -24 24 -33 42 -49 65 -80 89 -113 134 -153 185 -215 246 -288 332 -376 435
31 435 -497 561 -638 721 -808 912 -1021 1139 -1275 1418 -1572 1749 -1936 2138 -2366 2609
47 2609 -2875 3172 -3495 3847 -4242 4677 -5158 5701 -6311 7002 -7801 8726 -9814 11124
61 11124 -12728 14745 -17379 20968 -26178 34484 -49813 87657 -387232 -248080 816213
72 816213 842847 212505 -726818 -891561 -202446 715435 880936 203259 -714875 -859632
82 -859632 -176508 662757 837740 208144 -656014 -837046 -192884 633407 814529 200406
92 200406 -614668 -797893 -199212 589087 786309 205333 -579424 -764327 -202847 547291
102 547291 758857 209165 -546045 -726254 -205903 503897 729213 214671 -509678 -694646
$$ packed form
0@%%%%%%%qQqJ6j6K4m0M8n7P5r1J14j45J69k02K47k87L38m00M61n34O20p08Q11
31D35r32J058j199J359j529J720j933K160k414K693k990L321l685M074m504M975
47B609n484O047o667P342q089Q919r835J0859j2012J3313j4803J6527j8540K0938
61A1124k3852K7473l2124L8347m7146O0662q4297J37470m74889J39152J064293
72H16213K6634o30342r39323j64743O89115R17881J65501o77677r18134j44757
82h59632O83124Q39265J74983o29596q64158j81032O44162Q26291J81122o14123
92B00406q15074j83225N98681P88299J97222n80976p84757j84903N61480P50138
102E47291K11566n49692p55210j80209N20351P09800K25316n14542p24349j84968
$$ plain form
112 -694646 -212742 468883 698905 217185 -471477 -666329 -219110 439162 666787 221857
122 221857 -432817 -647899 -226230 420512 637992 216959 -400070 -618011 -231607 387509
132 387509 616747 225771 -380759 -598140 -223449 362494 582450 228504 -345851 -576512
142 -576512 -232692 341641 563871 224424 -322696 -548886 -233993 316106 540853 226211
152 226211 -297924 -528918 -236823 296343 521639 225035 -279986 -505704 -232220 270583
162 270583 498182 232201 -260894 -492029 -227378 254712 472117 229491 -234901 -469768
172 -469768 -234902 234465 462243 226826 -225094 -445615 -228798 209481 441664 233915
182 233915 -207430 -435597 -227272 198872 422060 229963 -187896 -418188 -229581 183693
$$ packed form
112f94646M81904O81625K30022m81720o88662j94852M47219O58272K27625m44930
122B21857o54674k15082M21669O46742K17480m21033o17029k17941L86404O19116
132C87509K29238l90976o06530k17381L74691N85943K19956l53946n74355k30661
142e76512L43820N74333K22230l39447n47120k26190L14893N50099K24747l14642
152B26211n24135k30994K92095N33166K25296k96604n05021k25718K73484N02803
162B70583K27599k65981m93095k31135K64651M82090K17405k42626m64392k34867
172d69768K34866M69367K27778k35417m51920k20521K16817M38279K32183k07749
182B33915m41345k28167K08325M26144K23188j92097m17859k30292J88607M13274
$$ plain form
192 183693 407715 228345 -174179 -401359 -228223 167739 392860 228110 -161138 -385968
202 -385968 -226366 152547 377752 228678 -147137 -372983 -226905 140545 365970 226930
212 226930 -136005 -359042 -225325 128274 353042 226574 -124095 -348304 -224517 120422
222 120422 340926 221502 -113289 -333000 -223402 107706 330601 221642 -106032 -322097
232 -322097 -217923 97595 315260 220975 -92978 -312083 -218974 89528 305959 217460
242 217460 -84431 -299490 -217619 79685 296444 215858 -77261 -289601 -214311 72127
252 72127 284983 213018 -68873 -279412 -211904 64840 274317 210078 -60707 -268852 -209669
263 -209669 56377 264024 208551 -52400 -259290 -207845 48664 254162 206637 -44380
$$ packed form
192A83693K24022j79370m02524k27180J73136L95962K25121j64750l89248k24830
202c85968J59602L78913K25205j49074l75815k25846J46078L67450K25425j39040
212B26930l62935k23037J33717L53599K24768j26468l50669k24209J23787L44939
222A20422K20504j19424l34791k19711J09598L31108K22895j08959l27674k16065
232c22097J04174L15518K17665r4285l13953k19105R3109L08502K16431q8499
242B17460l01891k15059Q1871K97304K16759q0586k93119k12340P5290K86438
252G2127K12856p1965k81891k10539O7508K76744K09477o4239k70785k08145N9183
263b09669K66046K07647n5473k60951k06890N1445K56509K05498m7525k51017
$$ plain form
273 -44380 -249977 -206923 41330 246470 204861 -38624 -241144 -203787 34592 237072 203308
284 203308 -31667 -233398 -201385 29279 227830 200124 -24609 -224034 -199809 22534
294 22534 219723 198061 -18656 -215393 -197389 15946 211547 196436 -13182 -207804 -194734
305 -194734 10478 203530 194343 -7847 -200822 -192273 6110 195896 190828 -3053 -192688
316 -192688 -189462 1348 188546 187512 1114 -184604 -185955 -3543 180684 184700 5491
327 5491 -177427 -182817 -7769 173361 181778 9755 -170686 -179932 -11244 166579 178195
338 178195 13567 -163192 -176954 -15413 160084 175263 16849 -156334 -173292 -18954
348 -18954 152803 171942 20679 -149492 -170153 -22361 146267 168672 23979 -143105 -167148
$$ packed form
273d4380k05597M3054K48253K05140m1609k43485k02520L7357K38379K02480l3764
284B03308k34975k01731L2013K30664J98551k7706k24733j99425K4225K22343
294B2534J97189k1662k16717j96737J8004K13335J95601j5111k09618j94622J3070
305a94734K05212J93052r187k02190j92975Q549J98383J89786n068j93881j89635
316a92688L226J90810J87198j034j86398j85718j351J82412J84227M016j79209
327E491j82918n390J75048J81130Q417j72023j80441r246J68688J77823J1616
338A78195j64628j76759j3762J61541J75497J5179j58414j73183j6958J54338
348a8954J71757J9139j51263j70171k0661J47792J68628K2405j44693j67084k4043
$$ plain form
359 -167148 -25431 140078 165439 27110 -136934 -164383 -28387 134706 162570 29151
369 29151 -131432 -160437 -30637 128374 159064 32138 -125768 -157639 -32691 123181 155270
380 155270 33836 -119562 -153840 -35683 117117 152799 36415 -115047 -150879 -36968
390 -36968 112050 148866 38308 -109493 -147806 -39133 107346 146019 39654 -105217 -144325
401 -144325 -40024 102603 142014 40779 -99824 -140543 -41738 97487 138943 42357 -95521
412 -95521 -137087 -42423 92501 134776 44274 -89828 -134634 -44740 89138 132372 44222
423 44222 -85916 -130116 -45728 83543 129357 46539 -82128 -128138 -46056 80495 125448
434 125448 46535 -77054 -124074 -48032 75665 122978 47712 -73357 -120927 -48682 71213
$$ packed form
359a67148J41717J65509K5361j38329j64044k7449J35996J63093K7864j33419
369B9151j60583k9005J29800J59011L0690j26926j57906l1871J24948J55872L2089
380A55270j21434j53398l4278J18157J52800L5682j16384j51462l5832J13911
390c6968J49018L6816j10558j47801l8313J08673J46479L8673j06365j44871l9108
401a44325J04301J42627L9411j01235j40603m0719R8805J39225M1456r6586j37878
412i5521m1566R4664J34924M2275r0502j34102m4806Q9894J33878M3234q8150
423D4222j30138m4200Q4388J29271M5814q2818j28667m6010Q2082J26551M4953
434A25448p8913j23589m7020P6042J23697M7313p5266j21069m7570P2245J19895
$$ plain form
445 71213 119448 49061 -68821 -117928 -50358 66957 117182 50390 -65583 -115126 -50675
456 -50675 62867 113935 51703 -61669 -112797 -51666 59842 111115 51903 -58189 -109477
467 -109477 -52060 55841 108045 53027 -54623 -106948 -52527 52802 105074 53430 -50930
478 -50930 -103981 -53371 49242 102367 54153 -47588 -101677 -53889 46529 99577 54229
489 54229 -44116 -98803 -55009 43501 97709 54250 -41883 -95324 -54719 39641 94455 55290
501 55290 -38359 -93396 -55652 37324 92141 54794 -35390 -89747 -56184 33148 89880 56308
513 56308 -32865 -88008 -56059 30883 86996 56156 -29645 -85218 -56980 27846 85164 56748
525 56748 -27759 -83083 -56163 25370 81752 57075 -24209 -80961 -57018 22953 79766 57244
$$ packed form
445G1213M8235p0387j17882m9107O7570J17315N0225o6792j15973m9543O4451
456e0675J13542N1068o2232j13372n1128O1131J11508N1273n9212j10092n1288
467a09477N7417J07901N2204n5018j07650n2325N4421J05329N2272n1644j04360
478e0930n3051N0610J02613N3125m8214j01741n4089M7788J00418N3048m5348
489E4229r8345n4687M3794R8510N4208m3459r6133n3441M0605R4360N4814l9165
501E5290r3649n5037L7744R2976N4817l7347r0184n4357L3563Q9332N6732l3572
513E6308q9173n5143L1949Q6942N6113l0840q5801n5573K8238Q4826N7318k8416
525E6748q4507n5324K6920Q1533N6382k4677q1284n6752K3943P9971N6813k2522
$$ plain form
537 57244 -21959 -78624 -56962 20527 76990 57348 -18770 -76407 -57812 18346 75356 57275
549 57275 -17136 -74054 -57023 15884 72344 57589 -14256 -72322 -57533 14537 70726 56417
561 56417 -12549 -69107 -57305 11724 68558 56859 -10755 -67451 -56880 10133 66343 56403
573 56403 -9076 -65110 -56488 7860 64340 56549 -7533 -63465 -55797 6761 61830 55642 -5455
586 -5455 -60939 -55759 4592 60198 55607 -4344 -59049 -54777 2863 57728 55477 -2391 -57319
599 -57319 -54581 1646 55857 54783 -762 -55384 -54412 433 54240 54139 338 -53288 -53726 -1145
613 -1145 52358 53838 1630 -51653 -53127 -2260 50378 52918 3202 -49555 -53018 -3778 48959
626 48959 52618 4067 -47893 -52140 -4838 47048 52062 5384 -46375 -51789 -5843 45634 51293
$$ packed form
537E7244p9203n6665K1662P7489N6463j9642p6118n7637J8595P6158N7010j8081
549E7275p4411n6918J7031P2907N6460j4755p1845n8066J4789P2070N6189j4309
561E6417o8966n6558J1802O9029N6834j1699o7614n6696J0571O7013N6210r940
573E6403o5479n6034Q622O4348N6480p791o4082n5932P668O2558N5069o188o1097
586e455n5484N180O0351N5606m591n9951n4705M272N7640N4865k251n7868n4928
599e7319K738N6227N4211j074n5545n4622R72N4845N3807j01n3801n3626m38N2581
613a145N3503J480n2208n3283j474N0867N2638K540m9716n2757l463M9240N2737
626D8959L659m8551n1960m247M7302N1886N014m6678n1759n414M5946N1477N659
$$ plain form
639 51293 6275 -44600 -51093 -6848 44030 50655 7244 -42938 -50463 -7956 42180 50180 8264
652 8264 -41492 -49706 -8767 40369 49293 9606 -39635 -49540 -9995 39164 48931 10237 -38211
665 -38211 -48550 -10794 37349 48304 11433 -36743 -48201 -11563 36073 47599 11940 -35148
677 -35148 -47182 -12522 34388 46986 13009 -33845 -46783 -13073 33019 45963 13696 -32014
689 -32014 -46056 -14301 31559 45754 14431 -30975 -45356 -14774 30193 45081 15130 -29692
701 -29692 -44759 -15294 28936 44298 15795 -28336 -44163 -15900 27809 43507 16160 -26823
713 -26823 -43132 -16738 26249 43092 16862 -25871 -42512 -17004 24887 42028 17577 -24244
725 -24244 -41970 -17872 23883 41514 17858 -23154 -41048 -18257 22437 40772 18526 -21912
$$ packed form
639E1293m5018n0875o493M4245N0878O625m3411n0182p525M2507N0136Q000m1916
652H264m9756q214M0939M9136Q924l9687m9241r905L9545M9159R767l8694m8448
665c8211j0339L7756M8143J0955l6871m8176j1458L6638M7636J1526l5659m7088
677c5148j2034L4660M6910J2598l3977m6854j2938L3710M6092J2944l2267m5710
689c2014j4042L1755M5860J4195l1323m5406j4381L0582M4967J4888k9951m4822
701b9692j5067K9465M4230J5362k8503m4131j5827K8263M3709J5698k7347m2983
713b6823j6309K6394M2987J6843k6230m2733j6641K5508M1891J7141k4451m1821
725b4244j7726K4098M1755J7631k3656m1012j7894K2791M0694J8335k2246m0438
$$ plain form
737 -21912 -40390 -18735 21326 39967 18915 -20610 -39527 -19243 20037 39177 19433 -19338
749 -19338 -38783 -19660 18848 38549 19748 -18299 -37928 -19940 17746 37662 20173 -17115
761 -17115 -37281 -20348 16762 36946 20284 -16144 -36376 -20558 15611 36073 20737 -15017
773 -15017 -35764 -20930 14617 35365 20859 -14008 -34871 -21192 13427 34631 21324 -13118
785 -13118 -34280 -21292 12653 33787 21311 -11999 -33345 -21551 11634 33128 21561 -11238
797 -11238 -32532 -21678 10550 32244 21815 -10130 -31830 -21837 9680 31440 21939 -9254
809 -9254 -31179 -22090 8930 30788 21995 -8362 -30234 -22250 7783 30181 22370 -7721 -29768
822 -29768 -22057 7207 29115 22225 -6621 -28909 -22435 6313 28553 22280 -5976 -28050 -22321
$$ packed form
737b1912j8478K1655M0061J8641k1052l9525j8917K0284L9280J9140j9744l8771
749a9338j9445J9123L8508J9701j8801l8047j9629J7988L7686J9916j7489l7288
761a7115k0166J6933L7110K0184j6662l6428k0232J5818L6169K0462j5336l5754
773a5017k0747J4834L5547K0748j4506l4867k0863J3679L4619K1204j3307l4442
785a3118k1162J2988L3945K1134j2476l3310k1346J1794L3185K1494j1567l2799
797a1238k1294J0854L2228K1694j0429l1945k1700R993L1517K1760r501l1193
809i254k1925R089L1020K1858q793l0357k1872P984L0033K2398p811l0091k2047
822b9768P711K9264K1908o890k8846k2288O474K8748K2240o273k8256k2074N729
$$ plain form
835 -22321 5379 27800 22540 -5192 -27557 -22393 4830 27098 22447 -4440 -26796 -22462 4078
848 4078 26439 22475 -3762 -26170 -22528 3448 25917 22424 -3238 -25413 -22305 2676 24971
861 24971 22484 -2334 -24765 -22451 2086 24456 22362 -1754 -23982 -22378 1270 23624 22548
874 22548 -1082 -23491 -22336 839 22985 22321 -519 -22696 -22271 253 22415 22287 -31
887 -31 -22208 -22036 -180 21605 22014 659 -21347 -22070 -811 21071 21955 1001 -20756 -21777
901 -21777 -1345 20295 21812 1643 -20147 -21800 -1782 19783 21578 2037 -19419 -21563 -2244
914 -2244 19173 21390 2464 -18773 -21389 -2744 18531 21322 2870 -18286 -21058 -3009 17798
927 17798 20969 3372 -17539 -21030 -3517 17311 20741 3674 -16885 -20631 -4034 16572 20666
$$ packed form
835b2321K7700K2421n260k7732k2365N164K7223K2268m651k6887k2356M334K6540
848D078K2361l964k6237k2408L642K5976K2469l493k5662k2175L108K4981K2295
861B4971k487k4818k2431K314K4537K2370k094k4116k2228J604K3648K2354j076
874B2548k3630k2409J155K3175K2146o64k2840k2177M25K2524K2162j28k2318
887c1k2177J72K1856K1785M09k1355k2006p23K1259K1882Q84k0954k1757j021
901b1777K0432K1640J517k0169k1790j653K0018K1565J795j9541k1456k144J9319
914b244K1417K217j8926k1237k616J8645K1275K791j8452k1156k772J8049K0807
927A7798L171j7597k0911l491J7513K0828L430j7067k0559l746J6597K0606M094
$$ plain form
940 20666 4141 -16478 -20470 -4146 16015 20319 4466 -15799 -20251 -4577 15427 20092 4827
953 4827 -15180 -19970 -4897 14905 19830 5056 -14593 -19669 -5158 14216 19483 5509 -13979
966 -13979 -19498 -5522 13794 19184 5637 -13424 -19150 -5883 13063 19035 6073 -12879 -18966
979 -18966 -6057 12674 18610 6225 -12152 -18548 -6578 12001 18529 6633 -11819 -18308 -6581
992 -6581 11458 18176 6865 -11109 -18064 -6983 11069 18000 6945 -10668 -17598 -7129 10392
1005 10392 17620 7248 -10189 -17441 -7343 9854 17319 7517 -9739 -17178 -7490 9449 16942
1018 16942 7589 -9099 -16858 -7872 9016 16876 7787 -8817 -16566 -7810 8426 16365 8090 -8231
1032 -8231 -16485 -8085 8165 16180 8019 -7798 -15842 -8323 7563 15817 8333 -7390 -15697 -8351
$$ packed form
940B0666j6525k0619l992J6324K0161M304j5853k0265m452J5674K0004M665j5265
953D827k0007m790J5073J9802M925j4774j9649n076J4511J9374N267j3974j9488
966a3979n519J3976J9316N390j3547j9061n726J3267J8946N972j2962j8952o087
979a8966J2909J8731N936j2385j8377o396J1970J8579O528j1896j8452o489J1727
992f581J8039O718j1311j7974o955J1081J8052O931j1055j7613o930J0469J7521
1005A0392P228j0372j7437p252J0098J7197P465r802j7256p439R688J6939P493
1018A6942r353j6688p759Q986J6888P860r089j6604p749Q756J6236P939q275j6321
1032h231q254Q400J6250Q015q161j5817q044P519J5886Q254p484j5723q307P346
$$ plain form
1046 -8351 7228 15437 8409 -6891 -15414 -8598 6815 15236 8577 -6605 -15119 -8684 6393 15031
1060 15031 8577 -6216 -14811 -8759 5997 14697 8823 -5708 -14586 -8788 5637 14455 8805 -5353
1074 -5353 -14136 -8921 5119 14126 9012 -5066 -14026 -8939 4921 13686 9023 -4678 -13694 -9123
1088 -9123 4446 13557 9166 -4441 -13488 -9088 4138 13039 9180 -3982 -13023 -9279 3830 12988
1102 12988 9160 -3717 -12788 -9175 3424 12678 9209 -3331 -12511 -9170 3148 12293 9249 -3054
1116 -3054 -12331 -9208 2958 12112 9085 -2841 -12039 -9140 2624 12003 9223 -2602 -11661 -9078
1130 -9078 2290 11550 9256 -2070 -11418 -9289 2245 11329 9166 -2095 -11063 -9190 1682 11124
1144 11124 9382 -1727 -10911 -9163 1533 10709 9271 -1454 -10592 -9212 1339 10367 9255 -1202
$$ packed form
1046h351J5579Q209p028j5300q523O816J5413Q421o659j5182q514O435J5077Q638
1060A5031o454j4793q595O052J4756Q700n874j4531q878N798J4425Q818n650j4158
1074e353q783N215J4040R007n114j4078q960N087J3860Q765m663j3701r016M571
1088i123J3569R111m391j3607r047M400J3226Q901l859j3162r041L744J3109R158
1102A2988l828j2877r071L613J2599R254l469j2540r180L341J2318R145l044j2303
1116c054r277L123J2166R154l027j1926r198K899J1764R379k780j1825r059K583
1130i078J1368R260k294j1326r348K129J1534R084k163j1261q968J873J0872R442
1144A1124j742j1109r184J748J0696R176j438j0725r138J380J0551R028j112j0457
$$ plain form
1158 -1202 -10290 -9224 1052 10180 9121 -965 -10022 -9176 710 9783 9236 -682 -9793 -9164 611
1173 611 9609 9060 -456 -9460 -9074 273 9321 9082 -205 -9276 -9040 153 9088 8952 -5 -8898
1189 -8898 -8958 -85 8717 8995 157 -8731 -8898 -254 8531 8773 467 -8387 -8836 -481 8319 8777 534
1206 534 -8190 -8727 -685 8005 8707 723 -7965 -8693 -792 7733 8610 833 -7639 -8515 -981 7507
1222 7507 8435 1098 -7357 -8517 -1191 7273 8517 1143 -7202 -8295 -1295 6929 8284 1519 -6983
1237 -6983 -8364 -1366 6883 8214 1409 -6644 -8077 -1567 6529 8157 1603 -6518 -8048 -1636 6332
1252 6332 8020 1711 -6209 -7922 -1790 6098 7950 1854 -6067 -7900 -1858 5938 7769 1849 -5817
1267 -5817 -7671 -1976 5664 7728 2081 -5687 -7662 -2011 5516 7435 2104 -5339 -7515 -2162 5291
$$ packed form
1158a202r088J066J0276R128j059j0086r057Q46R886R073n47r918r111O29R775
1173F11Q998n49r516r004L86R347R048k39r287r071K36R193Q935j36q957q893
1189h898o0Q873Q802K78q838q888j67Q644Q785K42q306q854m49Q355Q800M58q243
1206E34q724n37Q042Q690P02p984q688p28P901Q525Q77p777q472q76P534Q488
1222G507R28p337q455j160P326Q464J244p374q345j093P000Q224J355o765q502
1237f983j381O998Q249J331o805q053j433O510Q096J628o554q121j530O412P968
1252F332J688o309p920j713O132P888J852o096p921j833O042P796J831n920p666
1267e817j854N695P640K064n647p768j975N651P527J919n331p443k176N353P453
$$ plain form
1282 5291 7445 2284 -5195 -7428 -2246 5115 7369 2286 -4875 -7341 -2462 4856 7255 2351 -4844
1297 -4844 -7209 -2414 4707 7099 2468 -4582 -7022 -2569 4564 6988 2499 -4417 -6926 -2516 4357
1312 4357 6891 2610 -4175 -6815 -2677 4200 6799 2671 -4057 -6700 -2666 3963 6599 2797 -3815
1327 -3815 -6708 -2841 3775 6572 2781 -3712 -6385 -2830 3550 6434 2912 -3505 -6438 -2927 3498
1342 3498 6333 2855 -3374 -6250 -3046 3305 6268 2978 -3211 -6124 -2990 3112 6075 3051 -2951
1357 -2951 -6008 -3081 2995 5998 3101 -2878 -5985 -3113 2822 5925 3034 -2724 -5791 -3141 2621
1372 2621 5789 3200 -2685 -5752 -3093 2640 5630 3051 -2420 -5559 -3230 2391 5596 3165 -2379
1387 -2379 -5465 -3181 2312 5392 3177 -2182 -5390 -3167 2214 5365 3151 -2162 -5259 -3203 2060
$$ packed form
1282E291K154n161p479k233N182P361K254n083p161k466M879P318K399m904p195
1297d844k365M795P121K392m631p050k440M453P133K424m489o916k509M410O873
1312D357K534m281o785k640M138O877K599m128o728k643M034O629K636l802o612
1327c815k893L867O616K797l791o493k673L555O380K884l522o417k933L511O425
1342C498K835l478o229k876L204O351K963l290o189k913L134O102K963l024o002
1357b951l057K927O076L003k897n979l107K872N935L103k891n758l067K650N762
1372B621L168k589n885l067K659N733K990k579n471l139K329N621L205k431n544
1387b379l086K284N493L080k215n359l208K223N381L151k214n313l097K056N263
$$ plain form
1402 2060 5169 3249 -2001 -5202 -3241 1902 5150 3216 -1953 -5042 -3213 1834 4997 3244 -1783
1417 -1783 -4959 -3251 1717 4927 3248 -1726 -4870 -3200 1624 4760 3225 -1551 -4781 -3273 1531
1432 1531 4741 3156 -1544 -4661 -3172 1380 4619 3244 -1360 -4635 -3190 1391 4509 3209 -1261
1447 -1261 -4444 -3259 1238 4451 3192 -1261 -4448 -3177 1213 4318 3162 -1159 -4257 -3217 1107
1462 1107 4224 3159 -1006 -4207 -3149 1039 4159 3134 -990 -4012 -3129 884 4042 3157 -911
1477 -911 -4066 -3124 909 3964 3120 -882 -3883 -3166 770 3945 3137 -769 -3864 -3008 736 3756
1493 3756 3091 -668 -3803 -3108 624 3763 3057 -688 -3669 -3031 534 3606 3086 -519 -3562 -3108
1509 -3108 523 3603 3040 -530 -3503 -2990 489 3479 3016 -433 -3408 -3004 431 3393 2986 -371
$$ packed form
1402B060L109j920n250l201J961N143L248j934n169l089J829N047L163j753n027
1417a783l176J708M968L210j679m974l144J670M824L136j535m776l230J508M804
1432A531L210j585m700l117J489M552L239j375m604l275J445M581L118j300m470
1447a261l183J185M497L213j259m453l187J271M390L105j156m321l098J040M324
1462A107L117j065m165l201J058M188L120j025m124l022Q83M013L158q85m068
1477i11l155R42M033L055q44m002l001P17L936L175q08l906l095Q56L744L020
1493C756o65l759l135O95L732L139p06l745k981O38L565L072n20l605l043M54
1509c108L631L080n63l570k973N13L479K990m63l449k975M04L435K962m07l357
$$ plain form
1525 -371 -3372 -2932 340 3206 2967 -205 -3237 -3057 244 3223 2902 -284 -3142 -2911 106 3028
1541 3028 2997 -131 -3158 -2982 159 3028 2875 -89 -3005 -2878 70 2961 2907 -60 -2966 -2886 50
1558 50 2894 2827 -20 -2850 -2901 28 2832 2769 1 -2792 -2908 -49 2778 2731 45 -2688 -2760 -148
1576 -148 2633 2845 120 -2685 -2785 -65 2611 2712 236 -2524 -2789 -229 2581 2728 226 -2547
1592 -2547 -2719 -166 2415 2659 314 -2403 -2711 -235 2453 2725 318 -2360 -2642 -306 2322 2589
1608 2589 346 -2290 -2686 -400 2234 2592 345 -2255 -2636 -409 2179 2589 445 -2137 -2666 -413
1624 -413 2149 2536 384 -2139 -2545 -424 2068 2520 527 -2016 -2599 -569 2082 2577 499 -1947
1640 -1947 -2427 -532 1933 2514 583 -1897 -2483 -610 1891 2486 602 -1846 -2375 -678 1793 2462
$$ packed form
1525c71l001M40L272K866k39l172l032J80L301K979l21l186k858K31L017K922
1541C028l1l128l027J76L141K869j53k964k916J27K948K891n4k967k906Q0K936
1558E0K844o7k847k830n1K929K804o3k768k793j16K859K827m7k686k733p2K612
1576a48K781K12k725k805j00K720K676J01k476k760k65K560K810J47k502k773
1592b547j72K553K581K44k345k717l08K476K688K72k407k678k82K336K628K67
1608B589k243k636l96K286K634L58k247k600l81K227K588M10k144k582n29K253
1624d13K562L87k152k523m06K121K492M52j993k543n83K030K651M95k078k446
1640a947m80J895K465N81j931k480n86J873K501N95j884k448n29J697K471O69
$$ plain form
1656 2462 623 -1884 -2416 -615 1787 2382 641 -1742 -2419 -687 1703 2373 694 -1688 -2367 -671
1672 -671 1692 2345 702 -1626 -2242 -783 1579 2356 778 -1587 -2351 -758 1544 2282 711 -1521
1688 -1521 -2278 -840 1521 2306 771 -1541 -2310 -738 1452 2236 764 -1421 -2257 -873 1472 2209
1704 2209 850 -1339 -2258 -822 1363 2196 818 -1280 -2203 -941 1367 2208 926 -1277 -2099 -847
1720 -847 1252 2160 965 -1170 -2157 -876 1233 2099 918 -1271 -2055 -932 1134 2078 927 -1174
1736 -1174 -2098 -936 1115 2062 934 -1125 -1974 -963 1033 2053 1024 -1097 -2011 -965 1054 1985
1752 1985 967 -1038 -1937 -1001 1006 1995 1021 -1023 -1950 -925 943 1916 1024 -937 -1940 -1040 892
1769 892 1964 981 -929 -1948 -1007 906 1855 988 -870 -1848 -1041 759 1856 1048 -853 -1838 -961
$$ packed form
1656B462j839k507n32J801K402N95j741k383o77J732K390O70j679k382o79J696
1672f71K363O53j643k328o16J459K362P77j578k365p64J593K302P38j571k232
1688a521p57J438K361P85j535k312p69J572K190P84j472k185q36J384K345P37
1704B209j359k189r19J436K185Q33j378k098r23J262K308Q41j282k203q22J252
1720h47K099R08j195k135r87J281K109Q66j181k189p84J123K066R44j151k101
1736a174r24J162K051R47j128k059q49J011J996J020j029k121r14J046K019R31
1752A985j018k005q99R36K007R89r74k044r27J025J868R73q92j961j003R00J932
1769H92J072r83j910j019R41J913R49q67j858r78Q07J800J097q08j901r85Q77
$$ plain form
1786 -961 804 1822 1036 -768 -1836 -1063 799 1839 1070 -796 -1816 -1027 738 1743 1089 -689
1802 -689 -1763 -1112 683 1730 1072 -724 -1759 -1104 607 1640 1010 -618 -1729 -1086 620 1699
1818 1699 1076 -585 -1673 -1044 477 1565 1080 -508 -1672 -1118 507 1588 1150 -495 -1581 -1095
1834 -1095 471 1531 1141 -460 -1586 -1130 480 1563 1056 -461 -1533 -1091 379 1473 1093 -388
1850 -388 -1531 -1112 402 1440 1066 -347 -1430 -1077 307 1439 1102 -368 -1445 -1095 301 1376
1866 1376 1107 -251 -1379 -1094 239 1355 1131 -266 -1386 -1090 320 1409 1084 -186 -1335 -1096
1882 -1096 214 1323 1096 -220 -1362 -1118 241 1259 1068 -189 -1259 -1157 122 1314 1126 -161
1898 -161 -1205 -1141 93 1255 1152 -156 -1218 -1113 124 1179 1095 -135 -1199 -1135 72 1143 1092 -68
$$ packed form
1786i61J765J018p86j804j068P73J862J040p69j866j020P89J765J005o54j778
1802f89j074O51J795J047o58j796j035O55J711J033o30j628j111O43J706J079
1818A699o23j661j088O29J521J088m85j588j164N54J625J081m38j645j086M86
1834a095J566J060l90j601j126M56J610J083n07j517j072M42J470J094l80j481
1850c88j143M19J514J038l74j413j083L53J384J132l37j470j077L50J396J075
1866A376k69j358j128K85J333J116k24j397j120K96J410J089l25j270j149K39
1882a096J310J109k27j316j142K44J359J018j91j257j070J02J279J192j88j287
1898a61j044O4J234J162j03j308j062J05J237J055q4j230j064O4J207J071n1j160
$$ plain form
1916 -68 -1182 -1053 79 1158 1110 -101 -1160 -1047 36 1152 1077 31 -1060 -1137 -10 1152 1081 -16
1934 -16 -1110 -1141 -55 1089 1120 19 -1053 -1090 -5 1102 1013 20 -1044 -1028 -51 1003 1068 67 -1025
1953 -1025 -1095 -32 1003 1041 70 -888 -1036 -104 987 1072 63 -965 -1057 -137 923 1037 125 -896 -1057
1972 -1057 -103 854 1056 119 -907 -1037 -198 916 1020 86 -897 -1042 -230 888 1030 187 -844 -999
1990 -999 -144 864 986 168 -855 -1033 -189 834 1035 122 -806 -950 -191 745 955 242 -786 -1022 -267
2009 -267 761 992 229 -774 -978 -295 721 1007 200 -702 -995 -288 696 981 243 -705 -982 -264 673
2028 673 968 274 -679 -930 -242 697 949 257 -659 -926 -296 682 907 308 -605 -975 -249 634 963 308
2048 308 -641 -890 -343 582 931 349 -588 -883 -311 611 903 331 -608 -891 -321 520 925 363 -508 -889
$$ packed form
1916f8j114J29J132J079m8j211j059J13J083J116p5j046j091p7J127J162p1j097
1934a6j094l1J086J144L1j101j072l7J085J107q9r93j064J6R77J054O5j001j092
1953a025p0J063J035L8r71r58j48R32J091Q5j009j028r2R20J060J14r12j021j61
1972a057R54R57K02r37j026j30Q39J114J04r34r83j45Q12J118J42q43j031j55
1990i99Q55J008J22q18j023j78Q44J023K01r13r28j44P59R36K10p13j028k36P55
2009b67J028K31p63j003k04O83J016K86q07r02k93P07R84K85p38r48k77P18R37
2028F73K95o94r53k51O88R39K52o92r16k67O30R78K25n99r13l70P26Q83L29o55
2048C08r49k49N47R25L49n82r37k95N72R22K92n72r39k83N70Q41M05n62q71l81
$$ plain form
2068 -889 -316 495 873 368 -510 -882 -341 465 870 381 -491 -858 -368 515 888 362 -488 -829 -385 456
2088 456 910 434 -498 -875 -338 376 780 372 -441 -831 -421 427 850 382 -445 -841 -426 447 814 390
2108 390 -414 -830 -446 400 791 426 -412 -765 -425 350 794 422 -317 -774 -430 347 794 392 -407 -768
2128 -768 -426 354 736 457 -308 -740 -446 286 700 436 -304 -762 -459 263 739 441 -303 -720 -462 305
2148 305 713 435 -277 -736 -492 267 722 450 -286 -757 -460 295 714 441 -223 -654 -448 224 706 447
2168 447 -221 -703 -444 265 651 465 -233 -677 -470 194 667 480 -209 -653 -457 229 687 420 -171 -611
2188 -611 -514 168 649 507 -210 -640 -462 154 630 521 -156 -609 -453 189 651 480 -174 -571 -473 154 635
2209 635 480 -55 -613 -509 75 621 474 -124 -574 -462 63 557 491 -115 -631 -543 95 593 430 -94 -590
$$ packed form
2068h89N73Q11L78n05q78l72N41Q06M05m89q72l67M90Q83L73n26q50l41M44Q41
2088D56M54m76r32l77N37P14M04m08q13l90M10Q48M23m68q27l96M15Q73L67m24
2108C90q04m16L84Q46L91l65q38l53L40P75M44l72p39m57L44P77M47m02p99l61
2128g68L42P80L82k79p65m32K94P32M14k64p40m58L03P22M76k98p44m17K58P67
2148C05M08k78p12m59K44P59M55k72p36m71K97P55M19k73o64m31K06O72M82k59
2168D47o68m82K59P09L86j86o98m44K07O64M73j87o89m44J96O86M58k67n91m40
2188f11R7O82M81j42p17m30J78O16M76j09o77m53J56O42M62j71o54l97R8O27M81
2209F35j55n35n58J04N84N46j47n98m50J12N25M94o6o06n16Q8O38M98j63n24m96
$$ plain form
2230 -590 -421 118 552 496 -82 -525 -462 77 555 435 -74 -488 -417 97 483 556 62 -554 -473 6 506 483
2252 483 -37 -530 -431 -88 486 434 -113 -495 -605 -9 438 516 -59 -453 -489 -24 446 508 -20 -563 -511 122
2274 122 520 437 -9 -426 -461 -75 432 465 -115 -428 -437 26 533 439 0 -449 -440 27 514 535 -70 -423 -553
2297 -553 67 495 439 6 -407 -505 -157 482 485 34 -464 -521 -111 469 608 -60 -449 -523 -40 338 469 -15
2319 -15 -435 -306 1 373 302 -30 -357 -421 4 369 586 29 -514 -360 -82 404 392 112 -308 -487 -146
2340 -146 329 470 61 -352 -378 2 309 419 85 -415 -426 -77 340 449 135 -331 -470 -139 310 492 118
2361 118 -360 -379 -20 298 431 103 -337 -467 -125 310 400 94 -382 -477 -119 308 400 124 -298 -427 -151
2382 -151 280 457 163 -258 -404 -134 258 420 124 -264 -416 -136 300 449 143 -326 -411 -124 308 395 118
$$ packed form
2230e90J69N39M34n6n78m43O3N39M78j20n09m14P1N14L86P3m94o16Q1M79N00k3
2252D83n20m93R9L43N74n2n47l82j10N96M47P8n75l94l6M65M70O2n28n43N2O33
2274A22L98q3m46m17l5L86N07L3n80l13rM63N07r4m39m49RM67M87K1o05l53j30
2297e53O20M28n6m33m13r8L48O39Lm51m98n7M10N80J39o68l89p4M83L78J31m84
2319a5m20J29L07L72p1l32l27o4M25L65K17n57n43J54K78M86j2k80m20j79L41
2340a46M75J41m09m13k6L80L07J10l34n00j1L49M17J09l14m66j39L31M49J82l74
2361A18m78j9L59L18J33l28m40j30L42M35R0l06m76r5L58M27R2k76m22j29K76
2382a51M31J77k94m21j46K70L92J62k96l88j52K80M36J49l06m69q5K87M32Q7k77
$$ plain form
2403 118 -273 -451 -143 266 432 145 -261 -439 -203 252 382 156 -231 -396 -142 226 415 145 -253 -355
2423 -355 -171 219 388 232 -186 -416 -197 264 376 97 -264 -418 -147 232 351 189 -229 -405 -164 272
2443 272 364 132 -266 -379 -189 186 378 174 -187 -432 -174 270 381 97 -173 -375 -204 164 419 139
2463 139 -211 -395 -138 189 351 164 -137 -365 -175 138 394 194 -206 -298 -176 237 378 188 -152 -304
2483 -304 -189 210 362 228 -127 -341 -211 179 353 195 -192 -326 -226 125 346 196 -180 -361 -195 188
2503 188 286 180 -141 -364 -217 139 413 161 -168 -289 -200 157 376 191 -113 -365 -232 139 296 207 -139
2524 -139 -320 -159 99 315 214 -152 -365 -234 155 391 203 -138 -328 -197 61 363 230 -151 -376 -135
2544 -135 119 357 227 -78 -278 -200 69 310 286 -110 -372 -141 156 273 226 -85 -270 -275 38 351 247 -138
$$ packed form
2403A18l91j78L08M09J66k87m06j78K36M55J30k26l87j65K54L68J89k70l98j02
2423c55J84L90J69j56m18k30K19M61J12k79l61j54K71L79J19j62m18j76K41M36
2443B72R2k32l98j13J90L75J92k04l61k45K58M44J11k84k70k02J71L68K55k80
2463A39l50j84K57L27J62j87l01k28J90L13K56k00m00r2J22M13J41j90l40j52
2483c04J15L99J52j34l55k14J30L90J74j58l87j34J00L51K21j50l76j81J66L83
2503A88R8j06l21k23J47L56K74k52l29j21Q9L57K19j85l04k52J33L71J57q9l46
2524a39j81J61K58K16j01l66k13J31L89K36j88l41j90J31K58L02j33l81k25K41
2544a35K54K38j30l05k00P8K69K41k4l96k62K31K97J17m7l11j85nL13L13j04l85
$$ plain form
2566 -138 -265 -153 77 263 240 -13 -328 -233 42 236 192 -83 -212 -259 43 305 210 -136 -285 -184 53 250
2588 250 270 -85 -296 -295 49 223 298 -56 -233 -186 95 300 266 -83 -217 -143 70 257 118 -71 -286 -173
2610 -173 15 295 206 -123 -303 -269 126 473 222 -34 -291 -137 47 449 175 -44 -222 -302 -42 331 248
2631 248 -121 -154 -178 86 312 284 60 -242 -144 239 430 188 -10 -419 -234 -22 261 165 -13 -341 -183 37
2653 37 208 240 -77 -259 -237 94 61 158 -105 -260 -241 10 241 262 -52 -210 -231 23 247 217 -31 -270 -222
2676 -222 -17 146 230 -50 -230 -188 0 252 197 43 -174 -217 20 195 267 7 -242 -204 21 160 163 61 -205
2699 -205 -220 -11 224 190 -10 -234 -234 -60 213 219 60 -202 -229 38 199 223 0 -178 -169 15 257 229 54 -179
2723 -179 -144 -11 151 234 31 -205 -190 35 133 175 12 -187 -183 -17 162 156 11 -175 -209 -80 160 178 53 -232
$$ packed form
2566a38j27J12K30J86k3k53l15R5K75J94m4k75j29m7L02K62r5l46j49J01K37J97
2588B50K0l55k11JL44J74P5l54j77M7K81K05l4l49j34P4K13J87j39j89k15J13
2610a73J88K80q9l29j80L4L95L47k51k56k57J54J84M02k74k19j78q0K60L73q3
2631B48l69l3k4K64K26k8k24l02R8L83J91k42j98m09J85K12K83r6j78l28J58K20
2653C7J71L2l17j82K2L31l3R7k63j55J9K51K31K1l14j58k1K54K24l0k48k39M8
2676b22K05J63Q4k80j80M2J88K52n5j54k17m3K37J75P2k60k49L8K25J39Lj02k66
2699b05j5K09K35l4k00k24%J74K73Oj59k62k7K67J61K4k23j78RJ84K42k8j75k33
2723a79L5J33J62Q3k03k36J5K25R8M2j63j99MJ66J79oj45j86l4J29K40J8j25k85
$$ plain form
2747 -232 -246 -32 184 195 2 -163 -202 -29 193 221 65 -116 -151 6 171 200 51 -142 -212 -62 150 233 38
2770 38 -180 -147 -69 132 181 23 -138 -211 -37 172 156 35 -158 -201 -49 120 163 -9 -145 -162 -53 148 222
2793 222 35 -151 -132 -33 122 206 151 -85 -141 -79 133 206 47 -112 -134 -31 181 184 70 -112 -218 -59 128
2816 128 140 49 -148 -125 8 108 163 49 -124 -201 -76 147 171 64 -89 -203 -62 129 222 89 -89 -188 -58
2839 -58 69 204 66 -95 -96 -73 123 188 66 -90 -201 -64 65 209 52 -114 -168 -104 108 157 103 -102 -221
2862 -221 -89 115 140 41 -86 -202 -110 121 175 80 -94 -175 -88 101 245 80 -76 -137 -55 89 208 79 -89
2885 -89 -143 -122 39 160 51 -72 -181 -86 83 161 113 -140 -151 -58 91 120 29 -61 -112 -90 20 156 46 -137
2909 -137 -204 -72 33 166 88 -126 -162 -81 83 150 53 -123 -196 -70 -70 164 107 -48 -116 -91 46 152 66 20 -109
$$ packed form
2747b32j4K14K16J1j93j65l9J73K22K8j56j81l5J57J65K9j49j93p0J50K12Q3j95
2770C8k18L3P8K01M9j58j61p3J74K09j6j21j93m3J52J69M3j72j36j7J09K01P4
2793B22j87j86J9R9J55Q4n5k36n6O2K12P3j59j59k2J03K12Lj14j82j06J59J87
2816A28J2r1j97K3J33J00N5j14j73p7J25K23K4j07j53j14J41J91R3j33j78r9J30
2839e8J27J35j38j61jK3J96O5j22j56j11J37J29J44j57j66n4O4K12M9n4k05j19
2862b21J32K04K5r9j27j16R2K31N4r5j74q1Q7J89J44j65j56o1Q2J44J19j29j68
2885h9n4K1J61J21j09j23j09R5J69P8m8k53j1R3J49K9r1r0n1K2J10J36j10j83
2909a37o7J32J05J33p8k14l6Q1J64O7r7j76p3J26%K34n7j55o8K5J37J06q6m6j29
$$ plain form
2934 -109 -129 84 47 94 -61 -225 -125 -30 149 44 -28 -160 -92 -2 125 165 -121 -87 -58 106 126 208 -65 -104
2958 -104 -13 6 160 143 -103 -153 -122 71 123 150 -68 -99 13 112 66 173 -67 -168 -74 148 180 172 -22 -143 -41
2983 -41 -45 103 160 40 -110 -24 10 154 88 30 -86 -100 25 125 60 66 -88 1 -41 28 23 -138 -143 -40 57 155 -18
3010 -18 41 -140 -146 85 97 176 -76 -126 -145 22 93 75 -41 -10 -179 -9 123 -22 24 -169 -15 15 172 156 -3
3035 -3 -125 -186 -3 233 94 -163 -81 -156 36 89 30 -189 -124 -126 35 51 34 -3 -38 -73 107 140 -103 -103 -138 -57 -34
3062 -34 70 90 82 -217 -8 -85 -100 206 -43 -192 -43 -150 52 11 216 -159 101 83 -57 134 48 227 54
3085 54 49 43 211 -113 -242 17 140 57 12 43 -431 -638 15 167 223 202 -249 -117 196 28 -45 97 12 -224
3109 -224 -94 309 6 177 121 -114 136 -121 46 -22 -283 -121 -77 262 259 8 -19 -72 -152 185 109 -134 -121
$$ packed form
2934a09k0K13l7M7j55j64J00R5J79j05p2j32O8R0J27M0k86L4K9J64K0Q2k73l9
2958a04R1J9J54j7k46n0L1J93N2K7k18l1J12R9m6J07k40j01R4K22L2qj94j21J02
2983d1mJ48N7j20j50Q6L4J44o6n8j16j4J25J00o5Oj54Q9m2O9nj61nJ03R7R8j73
3010a8N9j81oK31J2P9k52n0j9J67P1j8j16L1j69J70J32j45M6j93J54L0J57j6j59
3035cj22o1J83K36j39k57Q2p5J92N3n9k19O5kJ61J6j7l7l5l5J80L3k43%l5Q1K3
3062c4J04K0qk99K09p7j5L06k49j49J49j07K02m1K05l75K60j8j40J91q6J79j73
3085E4noJ68l24j29K59J23q3m5L1m74k07O53J52N6k1m51J32L13j68p3J42q5k36
3109b24J30M03l03J71n6k35K50k57J67o8k61J62M4L39lk51k7n3q0L37p6k43J3
$$ plain form
3132 -121 -118 -71 -20 -6 51 -35 -223 -78 71 101 -33 -68 -110 -28 44 84 -21 -37 -100 14 19 35 28 -38 -72 -34 80 42
3160 42 -14 -90 -63 -10 35 51 20 -62 -105 -26 37 47 -12 -21 -59 -13 36 39 -33 -102 -99 -4 1 60 53 -58 -59 -35 43 76 51 -74
3192 -74 -57 -48 42 56 46 -52 -41 -7 43 67 -4 -69 -52 2 15 94 4 29 -59 -33 37 39 32 -80 -69 -55 -24 62 0 -53 -84
3223 -84 -32 59 56 16 1 -55 44 45 65 24 -4 -61 -51 13 96 87 33 -9 -69 38 118 27 -64 -40 -50 -16 62 13 -42 -40 -92 -8
3255 -8 93 61 -33 -113 -24 48 8 10 -62 -134 -85 47 54 21 -27 -90 -55 30 78 61 17 -63 -31 30 106 0 12 -73 34 38
$$ packed form
3132a21LM7N1J4N7q6j88J45J49L0j34l5m2Q2P2M0j05j6o3J14NJ6po6l4L8J14l8
3160D2n6p6K7N3M5J6l1q2m3P9O3J0n9rl8M6M9Lp2o9LR5NN9pj11jK4P8L3k5j25
3192g4J7RR0J4j0r8J1L4N0K4p1o5J7N4J3P9r0K5q8K6P0Kpj12J1J4L1Q6o2n3l1
3223h4N2R1lm0j5n6R9JK0m1k8n7J0O4Q3rn4m2o0J07Q0r1r1K4j0L4P8m9n5Kn2Q4
3255hJ01l2r4q0Q9P2m0Kp2p2M9J32Pl3m8o3L5Q5M8j7m4q0L2O1P6j06J2q5J07M
$$ [...]
8191c7
##END NTUPLES=NMR FID
##END=
