##TITLE=1H_Pr-Am-st
 CDCl3, 8 sc, 
 26.11.2020
##JCAMPDX= 6.0         $$ Bruker NMR JCAMP-DX V2.0
##DATA TYPE= NMR FID
##DATA CLASS= NTUPLES
##ORIGIN= UXNMR, Bruker Analytische Messtechnik GmbH
##OWNER= root
$$ XWIN-NMR		Version 3.5
$$ Thu Nov 26 12:02:13 2020 Russian Standard Time (UT+4h)  she@DPX200
##.OBSERVE FREQUENCY= 200.1315066352
##.OBSERVE NUCLEUS= ^1H
##.DELAY= (6, 6)
##.ACQUISITION MODE= SIMULTANEOUS
##.ACQUISITION SCHEME= undefined
##.AVERAGES= 8
##.DIGITISER RES= 18
##SPECTROMETER/DATA SYSTEM= spect
##.PULSE SEQUENCE= zg30
##.SOLVENT NAME= CDCl3
##.SHIFT REFERENCE= (INTERNAL, CDCl3, 0, 15.7039)
##AUDIT TRAIL= $$ (NUMBER, WHEN, WHO, WHERE, WHAT)
$$ ##TITLE= Audit trail, XWIN-NMR		Version 3.5
$$ ##JCAMPDX= 5.01
$$ ##ORIGIN= Bruker BioSpin GmbH
$$ ##OWNER= she
$$ F:/spectra/data/she/nmr/H-F/1/audita.txt
$$ ##AUDIT TRAIL=  $$ (NUMBER, WHEN, WHO, WHERE, WHAT)
(   1,<2020-11-26 12:00:55.48 +0400>,<she>,<DPX200>,
      <created by zg, POWCHK disabled, PULCHK disabled
       configuration hash MD5:
       00 E9 B6 7A A2 85 ED C7 34 08 36 98 17 FE 4E 26
       data hash MD5: 16K
       69 15 AF DC AF BE 4F 07 2C A9 26 89 44 D5 FF 2C>)
$$ ##END=
$$ 
$$ hash MD5
$$ B3 BE DD 88 22 1E CC 15 78 B8 5C 60 8C DF AF B0
##$RELAX= 
##$RELAX= 
##$RELAX= 
##$RELAX= 
##$RELAX= 
##$RELAX= 
$$ Bruker specific parameters
$$ --------------------------
##$DU= <F:/spectra>
##$EXPNO= 1
##$NAME= <H-F>
##$PROCNO= 1
##$TYPE= <nmr>
##$USER= <she>
##$AMP= (0..31)
100 100 100 100 100 100 100 100 100 100 100 100 100 100 100 100 100 100 
100 100 100 100 100 100 100 100 100 100 100 100 100 100 
##$AQSEQ= 0
##$AQ_mod= 1
##$AUNM= <au_zg>
##$AUTOPOS= <>
##$BF1= 200.13
##$BF2= 200.13
##$BF3= 200.13
##$BF4= 200.13
##$BF5= 200.13
##$BF6= 200.13
##$BF7= 200.13
##$BF8= 200.13
##$BYTORDA= 1
##$CFDGTYP= 0
##$CFRGTYP= 5
##$CHEMSTR= <none>
##$CNST= (0..31)
1 1 145 1 1 1 1 1 1 1 1 1 1 1 1 1 1 1 1 1 1 1 1 1 1 1 1 1 1 1 1 1 
##$CPDPRG= <>
##$CPDPRG1= <>
##$CPDPRG2= <>
##$CPDPRG3= <>
##$CPDPRG4= <mlev>
##$CPDPRG5= <mlev>
##$CPDPRG6= <mlev>
##$CPDPRG7= <mlev>
##$CPDPRG8= <mlev>
##$CPDPRGB= <>
##$CPDPRGT= <>
##$D= (0..31)
0 1.2 0 0 0 0 0 0 0 0.06 0 0.03 0 0 0 0 0.0002 0 0 0 0 0 0 0 0 0 0 0 0 
0 0 0 
##$DATE= 1606377654
##$DBL= (0..7)
120 120 120 120 120 120 120 120 
##$DBP= (0..7)
150 150 150 150 150 150 150 150 
##$DBP07= 0
##$DBPNAM0= <>
##$DBPNAM1= <>
##$DBPNAM2= <>
##$DBPNAM3= <>
##$DBPNAM4= <>
##$DBPNAM5= <>
##$DBPNAM6= <>
##$DBPNAM7= <>
##$DBPOAL= (0..7)
0.5 0.5 0.5 0.5 0.5 0.5 0.5 0.5 
##$DBPOFFS= (0..7)
0 0 0 0 0 0 0 0 
##$DE= 6
##$DECBNUC= <off>
##$DECIM= 32
##$DECNUC= <off>
##$DECSTAT= 4
##$DIGMOD= 1
##$DIGTYP= 9
##$DL= (0..7)
0 120 120 120 120 120 120 120 
##$DP= (0..7)
150 150 150 150 150 150 150 150 
##$DP07= 0
##$DPNAME0= <>
##$DPNAME1= <>
##$DPNAME2= <>
##$DPNAME3= <>
##$DPNAME4= <>
##$DPNAME5= <>
##$DPNAME6= <>
##$DPNAME7= <>
##$DPOAL= (0..7)
0.5 0.5 0.5 0.5 0.5 0.5 0.5 0.5 
##$DPOFFS= (0..7)
0 0 0 0 0 0 0 0 
##$DQDMODE= 0
##$DR= 18
##$DS= 0
##$DSLIST= <SSSSSSSSSSSSSSS>
$$ [...]
##$SUBNAM2= <"">
##$SUBNAM3= <"">
##$SUBNAM4= <"">
##$SUBNAM5= <"">
##$SUBNAM6= <"">
##$SUBNAM7= <"">
##$SUBNAM8= <"">
##$SUBNAM9= <"">
##$SW= 16.9725356469052
##$SWIBOX= (0..15)
0 0 2 0 0 0 0 0 0 0 0 0 0 0 0 0 
##$SW_h= 3396.73913043478
##$TD= 16384
##$TD0= 1
##$TE= 0
##$TE2= 300
##$TE3= 300
##$TEG= 300
##$TL= (0..7)
0 120 120 120 120 120 120 120 
##$TP= (0..7)
150 150 150 150 150 150 150 150 
##$TP07= 0
##$TPNAME0= <>
##$TPNAME1= <>
##$TPNAME2= <>
##$TPNAME3= <>
##$TPNAME4= <>
##$TPNAME5= <>
##$TPNAME6= <>
##$TPNAME7= <>
##$TPOAL= (0..7)
0.5 0.5 0.5 0.5 0.5 0.5 0.5 0.5 
##$TPOFFS= (0..7)
0 0 0 0 0 0 0 0 
##$TUNHIN= 0
##$TUNHOUT= 0
##$TUNXOUT= 0
##$USERA1= <user>
##$USERA2= <user>
##$USERA3= <user>
##$USERA4= <user>
##$USERA5= <user>
##$V9= 5
##$VALIST= <valist>
##$VCLIST= <CCCCCCCCCCCCCCC>
##$VD= 0
##$VDLIST= <DDDDDDDDDDDDDDD>
##$VPLIST= <PPPPPPPPPPPPPPP>
##$VTLIST= <TTTTTTTTTTTTTTT>
##$WBST= 1024
##$WBSW= 4
##$XGAIN= (0..3)
0 0 0 0 
##$XL= 0
##$YL= 0
##$YMAX_a= 148578
##$YMIN_a= -163386
##$ZGOPTNS= <>
##$ZL1= 120
##$ZL2= 120
##$ZL3= 120
##$ZL4= 120
##$ABSF1= 10
##$ABSF2= 0
##$ABSG= 5
##$ABSL= 3
##$ALPHA= 0
##$AQORDER= 0
##$ASSFAC= 0
##$ASSFACI= 0
##$ASSFACX= 0
##$ASSWID= 0
##$AUNMP= <proc_1d>
##$AZFE= 0.1
##$AZFW= 0.1
##$BCFW= 1
##$BC_mod= 2
##$BYTORDP= 1
##$COROFFS= 0
##$CY= 11.3945322036743
##$DATMOD= 1
##$DC= 2
##$DFILT= <>
##$DTYPP= 0
##$F1P= 15.9154993809931
##$F2P= -4.1035820241983
##$FCOR= 0.5
##$FTSIZE= 0
##$FT_mod= 4
##$GAMMA= 1
##$GB= 0.15
##$INTBC= 1
##$INTSCL= 1
##$ISEN= 128
##$LB= 0.24
##$LEV0= 0
##$LPBIN= 0
##$MAXI= 10000
##$MC2= 0
##$MEAN= 0
##$ME_mod= 0
##$MI= 1.114404
##$NCOEF= 0
##$NC_proc= 0
##$NLEV= 6
##$NOISF1= 3.799351
##$NOISF2= 2.8
##$NSP= 1
##$NTH_PI= 0
##$NZP= 0
##$OFFSET= 15.70392
##$PC= 1
##$PHC0= -11054.54
##$PHC1= 18.60088
##$PH_mod= 1
##$PKNL= yes
##$PPARMOD= 0
##$PSCAL= 0
##$PSIGN= 0
##$REVERSE= no
##$SF= 200.130013532006
##$SI= 16384
##$SIGF1= 3
##$SIGF2= 2
##$SINO= 400
##$SIOLD= 16384
##$SREGLST= <1H.CDCl3>
##$SSB= 0
##$STSI= 0
##$STSR= 0
##$SW_p= 3612.71676300578
##$SYMM= 0
##$S_DEV= 0
##$TDeff= 0
##$TDoff= 0
##$TI= <>
##$TILT= no
##$TM1= 0
##$TM2= 0
##$TOPLEV= 0
##$USERP1= <user>
##$USERP2= <user>
##$USERP3= <user>
##$USERP4= <user>
##$USERP5= <user>
##$WDW= 1
##$XDIM= 8192
##$YMAX_p= 0
##$YMIN_p= 0
$$ End of Bruker specific parameters
$$ ---------------------------------
##NTUPLES= NMR FID
##VAR_NAME=  TIME,          FID/REAL,        FID/IMAG
##SYMBOL=    X,             R,               I
##VAR_TYPE=  INDEPENDENT,   DEPENDENT,       DEPENDENT
##VAR_FORM=  AFFN,          ASDF,            ASDF
##VAR_DIM=   8192,          8192,            8192
##UNITS=     SECONDS,       ARBITRARY UNITS, ARBITRARY UNITS
##FACTOR=    0.0002944,     1,               1
##FIRST=     0,             0,               0
##LAST=      2.4114304,     0,               0
##MIN=       0,             -163386,         0
##MAX=       2.4114304,     148578,          0
$$ Real data points
##PAGE= N=1
##DATA TABLE= (X++(R..R)), XYDATA
0@%%%%%%%%%%%%%%%qJ6j6J6j6K4l2L3m1N0n8P2q4R2j05J25j45J65j88K12k40K72
37A44l08L45l85M32m80N32n91O56p24Q00q86R76j074J184j305J437j583J746j926
56a010K130k360K621k926L280l698M207m836N638o698Q167j0363J4056l3540J73910
71A48578j28645j63081J84997j2386r0206N9530L4756m0269k0890j1663R4134
82E4855O589j20704J1180J37763o3174q6011J09262j3785r6668Q3111M4193q5418
94a8807l896K0570J1165L2121o5337p291N1494k5155k698K5780k9036n418J5440
107a068L528L3540m4880l4008P1076Q480n5937J5602L1285m6952J2553M4973m0705
120b513k5872L3059p431L556J8658n9352K6513L9145n8008L2163K5778p7271L5855
$$ y = [0, 0, 0, 0, 0, 0, 0, 0, 0, 0, 0, 0, 0, 0, 0, 0, -8, 8, -8, 8, -8, 16, -16, 17, -24, 26, -32, 40, -44, 48, -57, 68, -77, 88, -100, 112, -128, 144, -164, 181, -204, 228, -252, 280, -311, 345, -379, 421, -465, 511, -563, 621, -684, 753, -830, 916, -1010, 1120, -1240, 1381, -1545, 1735, -1963, 2244, -2592, 3046, -3652, 4515, -5848, 8208, -25332, 148578, 19933, -143148, 41849, 29463, -60743, -1213, 33543, -6726, -27616, -39279, 54855, 61444, -59260, -48080, 89683, 26509, -59502, 49760, 35975, -60693, 22418, 66611, -18807, -22703, -2133, 9032, 41153, -24184, -31475, 20019, -5136, -7834, 17946, -11090, -16508, -1068, 2460, 36000, -8880, -42888, 28188, 36668, -19269, -3667, 27618, -19334, -6781, 38192, -2513, -28385, 4674, -2757, 799, 19457, -39895, -13382, 25763, -32245, -82, 25696, -51575, -15720]
133a5720O3210p6494J2957M5136n8446J6517N6021m5745l2873N1525l739k0384
145h035J9697j1598j5763J8046K825j673R650m7497J8624O0006n5386j6498N0923
158B3321l1608j4887N7612k4175l5250K2907J4458O300j5828j0591J0041P630
170I930n582J0071n409k8313J7420K9334j9463k5559K1727o893l723K8313k2222
183c69k1475J9130J1209k575j471k0195R509J6906j1005J0781j1667j8575K2823
196C026J7213k0961p988M053j894J5550j516j7033m678J2607K123K621J453k4530
210a9954P317K2919n771r414k014p505J8639J0277k6013J2555k07j7116K8050
223A1763J1669l9971o10L4056j1404o849N073p708m203J3552N471r210o589r675
$$ y = [-15720, 47490, -29004, -16047, 29089, -29357, -12840, 43181, -2564, -35437, 16088, 12349, -8035, 11662, 64, -15699, 2347, 5172, 3499, 13149, -34348, -15724, 44282, -11104, -27602, 23321, -8287, -23174, 34438, 10263, -24987, -2080, 12378, 18678, 2850, -7741, 2300, 9930, 4348, 14419, 9010, -19303, -1883, 27451, 7988, -17571, 4156, -2737, -6460, 21853, -369, -21844, -2714, 8495, 5920, 4449, -15746, -6237, 10669, -336, 10445, -1222, -19797, 3026, 20239, -722, -8710, -4657, -6551, 8999, 7483, -9550, -14228, -1621, 502, 3123, 4576, -19954, -12637, 10282, 4511, -4903, -6917, -14422, 4217, 14494, -11519, 1036, 829, -16287, 11763, 23432, -16539, -17149, 16907, 5503, -1346, 3727, -3981, -8184, 5368, 10839, 1629, -4960, -14635]
237a4635K2775J2171k7257m094K0553j0105k098K3834k3480j3224K2742O652r261
250D573m639l736P84J4980m755p239m253k57P776O414n325j5969O353P310M186
265F203k761j0892k315R666P531p150k152p144L997J0725L69p422j1777Q710J1268
280F856j769j0944K172l020J962J5683r314j3641K863J1999o7m0p476q119J3108
295B53N397k653m848l697l134J7064L857j9860L804M274M45P648m56j8808N674
310e040J5124o449J006m563q337P285J5342r915j0903N839j287P240N220j0244
324C18r609J1154M663j960K260j3627N94J3700K621j1765j243n8Q38J1585m626
339D845j0662k792J0328K306j226l111j0771O414J1066j237j1318J144J74L390
$$ y = [-14635, 8140, 20311, -6946, -11040, 9513, -592, -2690, 21144, -2336, -15560, 7182, 13834, 4573, -66, -3802, -3018, 11962, 7207, -32, -4285, -4542, 3234, 9648, 4323, -11646, -5293, 2017, 6203, 3442, -7450, -9765, -99, 7432, 282, -1870, -9014, -5017, 5708, 6077, -1345, -13122, -4412, 6856, 5087, -5857, -3685, -6705, -4743, 10940, 1626, -12015, -9152, 2847, 2780, 2740, -4736, -12855, 253, 5650, 2997, -1851, -5548, -8682, 8382, 12239, -7621, -3817, 457, 902, 8550, 8094, -10714, -5040, 10084, 3635, 4641, 78, -8259, -974, 14368, 4453, -6450, -611, -1898, 5342, 10562, 318, -9291, 1863, 6526, 4566, 6826, -6801, -6207, 7493, 10114, -1651, -2894, -2952, -2114, 9471, 4845, -5817, -8609, 1719, 4025, 2799, -312, -11083, -4669, 6397, 5160, -6158, -5014, -4840, -1450]
353a450Q759p032q220RJ0519J833l413o253l687Q874N544l621p848K488k574P962
369A890Q625j5269n693R620N417l063K099r552j966J3139K364o258n852K512P58
384a229R138M85j3393j98Q418K456P6k380j3199J0115J0510q996k07j442n948
399e794O551J3269j1166j2213N959R636j95m922j347o597P993N244l893j316q038
414f829m72J7091O70k1799M773J0132k781J98J014n286p810J1217R074q701j0674
429a0183K991Q112N955o892j1368J1958j062m571J2242m491j6147P564J6785p088
443C805j0553O48P850j397J171J856r298L266K722L347M043j1542p147J8060K348
458I179j3675O136j706k808O491L809n738p754O594M461n70j495m200n729J3629
$$ y = [-1450, 7309, 277, -7943, -7934, 2585, 4418, 1005, -5248, -8935, -61, 5483, 1862, -5986, -3498, -6072, 1890, 10515, -4754, -10447, -827, 4590, 1527, 3626, -5926, -7892, 5247, 7611, 1353, -4499, -1987, -1229, 7909, 8394, -4999, -5197, 3221, 5677, 5753, 3373, -9826, 289, 10799, 1803, 1596, 154, -5794, 757, 14026, 2860, -9353, -3394, 6242, 6047, 1125, -222, -6819, 1174, 6418, 2525, 1209, -6829, -7301, 9790, 10460, -11339, -6566, 3566, 785, 983, 1997, -3289, -11099, 118, 9192, 491, -10183, -7192, 920, 6875, -17, -11385, 573, -489, -5060, 7182, 2691, -13456, -5892, 10893, 3805, -6748, -6100, 1750, 353, 1524, 3380, -5918, -2652, 70, 3417, 7460, -4082, -11229, 6831, 9179, -4496, 1640, -66, -2874, 3617, 7426, 1688, -6066, 528, 4989, 4419, 2924, -1276, -7005, 6624]
473F624J768j1674M969l364J64P367j590n199j517j454P295N671j1345l793L856
488b222Q874m047p701P963o072m570J4847J855j8778J346J1137L821n820q997
502h364P565q52p78P044l190r102n04R994Q071j0963j4450J6301N423r249M319
517A265k714m557K449R546J286j3000o203J5928N031r039k356l724Q492K039l563
532H80L920q755m897J5961N453j6295l357O643P894l682l855K433q626P022J0081
547A0820q098p581L239J767P710k172j2216N420J298K812L880q334m564M191P638
562E810j627p157m36M109m228Q582J813j8464P327J0505n110l427J091j972R26
577b258L500J577l478p599P003L593P0m129p092J0448J271q121P159J156j3604
$$ y = [6624, 8392, -3282, 1687, -1677, -1513, 5854, 4264, -935, -2452, -3906, 3389, 9060, -2285, -6078, -2222, 6652, 2605, -5096, 2867, -3205, -7775, 7072, 8927, -9851, -8505, 2632, 6453, 633, -8364, -799, -1651, -2429, 4615, 1425, -7677, -8181, 1813, 9884, -1079, -15529, 772, 6195, -3054, 1265, -1449, -6006, -3557, 5989, 7275, -5725, -11928, 4000, 9031, -8, -2364, -6088, 2404, 4443, 880, 4800, -3955, -8852, 7109, 12562, -3733, -7090, -447, 7447, 3765, -90, 2343, -6283, 739, 10820, 2722, -4859, -1620, 147, 7857, 5685, -6531, -1111, 187, 2999, 6879, -1455, -6019, -1828, 5810, 4183, -2974, -3410, 699, -3529, 5053, 6866, -11598, -4271, 6234, 1124, -2303, -1212, -3184, -2258, 1242, 2819, -659, -8258, -1255, 2338, 2408, -1721, -8813, 1635, 2906, -5215, 1944, 3100, -10504]
592a0504R568R769j0871k266J994L283J89M28j917k931K921J775J47J991m878
607a302p329J5221J809j4165O172J507l868N000K579o980j411J902N604J494p875
622a642j697K553O789k991m887L691l826l8J0249l592j3035P243M956j397Kn197
638b819n32K311N717j942o261n85L091K366K946n006p959Q594K434j647N20o652
654e424K2Q382L14n999O15k227K414N943j321q423j152J0579k086k269J009n108
670d731P62R125k017o281J239j765O410L262p826k067L969J693N87J456o539j640
686d363O882L559n510k676K116j459O428J2p162k99L984P66J734j333p565L672
702a214N511j066k463k425J20J374M470k432m470m22M020J146M09l536m395N680
$$ y = [-10504, -936, 8833, -2038, -4304, -2310, 973, 1162, 1590, -327, -3258, -337, 1438, 1585, 3576, -1302, -8631, 6590, 8399, -5766, 406, 1913, -1955, 3045, 5624, -1356, -2767, -865, 4739, 6233, -1642, -3339, -786, 6003, 3012, -1875, 1816, -2010, -2048, 8201, 4609, -8426, -1183, 3773, 2376, 2378, -2819, -3351, -1040, 4677, 2735, -3526, -4111, -1020, 1346, 4292, -714, -8673, -79, 2355, 708, 1228, -5424, -5402, 2980, 3294, -2705, -2090, -4317, -1903, 4040, 2719, -5704, -6856, 3723, 1637, -632, 377, -4731, -3969, 5156, 3139, -3142, -1903, -3668, 2742, 6004, -1822, -3889, 80, 1773, 2360, 3816, -2723, -4363, 2519, 6078, 568, -2108, 8, -1451, 4977, 4989, -2173, -2472, 1512, 2278, 4012, 2679, -4886, -1214, 4297, 3231, 768, -1657, -1537, -163, 4307, 1875, -2595, -3017, 1003, 2149, 2558, -978, -5373, 307]
718C07K701k261j852j216j298M051M715p062l306L221L140l54J27k980l947P012
734I98J214k035k575j367J117N782n96o799J620J595J479K171j179o507J847P543
750D308k454j546j375k210K451O424l764n643L493j67L117J628l831n029N329
765G31L422k578k27l446J55M656K817n921j892K099L49M611j561o051k70O137
781C031l80j333n06m724K656N464p22o132L05J604J505K974l991l559J506M208
797A906n52q58k644l287O482K408l767l138J361M8L514J730o122j409L203L262
813B137j390p48l875L54O533r44l292j400J235L72M608j441o206J742K653K497
829B835j068k203l429L948M180k701j775j197P04J939M134m444m278L273K157
$$ y = [307, 3008, 747, -1105, -2321, -3619, 432, 5147, -1915, -5221, -2000, 1140, 786, 913, -2067, -6014, 998, 2212, 177, -2398, -3765, -2648, 3134, 2538, -4261, -2641, -1046, 433, 2604, 1425, -5082, -3235, 4308, 1854, 308, -1067, -3277, -826, 5598, 1834, -3809, -316, -483, 2634, 4262, 431, -4598, 731, 4153, 1575, 1348, -2098, -1943, 2713, 5530, -391, -2283, -184, 165, 4776, 3215, -2836, -3106, 3031, 2651, 1318, 812, -3912, -1256, 4208, 3486, -2646, -2341, -737, 768, 3742, -249, -3808, -2302, 1906, 1354, 496, -2148, -5435, 1047, 3455, -312, -3450, -2089, -2041, 1473, 3203, -2919, -4328, -1125, 2137, 747, -1, -3876, -3522, 3011, 2067, -1225, -2625, -1390, -1018, 3590, 2149, -4057, -2315, 338, 2835, 1767, -436, -3865, 83, 4263, 1562, -213, -1410, -706, 1233, 5367, 923, -3355, -82, 2075]
844B075R88j095l100j793N613P77k635l70k406R60M338J545p130j076M346J293
860B330j34j731k957k24N787j110j646j342l436M387M964m779m927M239P1Q65
876C57K012l623l043K108N013k408j691k114m6N918K68n811k34L305k336M882
892B557K13p562J552M954O05k117r66k974L688L243j990k837k56J954M5M330l655
909G84n419N019L045k564M57j539k796N764J162l393o38m55N76K119J950m769
925f97k370L897K423k793k70n13k860O634k60l204M12j643O57M491j668p007L441
942a330L535j536n33Q60l034k627Q373k290m470J694m97j0O020n334n611P939
958A149j645q99M635m948m111N660M698m397k900J319J67J442L881n661k844O207
$$ y = [2075, 3063, 1968, -1132, -2925, 2688, 3465, 830, 460, -1946, -986, 3352, 4897, -2233, -3309, 1037, 2330, 2196, 465, -2492, -2716, 3071, 1961, 315, -1027, -4463, -76, 4888, 109, -4818, -579, -508, 357, 2369, -1254, -4297, -2189, 2824, 416, -1275, -3389, -3435, 2483, 2751, -3060, -3294, 11, -2325, 2557, 2770, -4792, -3240, 1714, 2319, 202, -764, -3738, -50, 3193, 1203, -1634, -1890, 64, 109, 4439, 784, -4635, 384, 3429, 865, 1322, -217, -3013, 2751, 3913, 520, -118, -573, 3, 2122, 4072, -697, -3067, 830, 3253, 460, 190, -323, -3183, 3451, 3191, -13, 399, -1244, -587, 3904, 2236, -4771, -1330, 2205, 669, 136, 996, -2038, -4665, 3708, 1418, -3052, -1358, -1855, -1865, 4155, -1179, -6790, 1149, -496, -1395, 3240, -1708, -5819, -159, 4539, 142, -2758, -1439, -1272, 170, 4051, -1610, -4454, 1753]
974A753l144K919J825p979J400P830k416l345R58k391L218K493n91m543j464O270
990B793r27L06j152m207K123P876n402l683K466k164M796J303m092l143K762K898
1006B553L15k857j065j276K485N605o395k758N159l681L089K827p893Q36M612
1021A556j048M87m82n130L301L453q29m204P81J535j441L789p53n088J435M680
1037B042l371J769j234m099O125J19k622J381j025j278M405k90l347l21J084K353
1053A691j788J058j658j877M686l09k290K91j168l2M711j952k678J916k712L280
1069A169O46j846j036K78J824J471j861p67k06m54M064j406l153J298o94K360
1085A687N79k811k145K684J249P90j943k410Q92J502K827l674k172J939N51J507
$$ y = [1753, -1391, 1528, 3353, -4626, -3226, 4604, 2188, -1157, -199, -2590, 628, 3121, 2530, -2013, -3477, 2793, 1866, 2172, 1020, -3187, -1064, 6812, 1410, -2273, 193, -1971, 2825, 4128, 36, -3107, -345, 2553, 2868, 11, -1054, -2330, 155, 5760, -635, -3393, 1766, -1915, 1174, 4001, -3892, -3056, 1556, 508, 995, 513, -4617, -1316, 2137, 1308, -2896, -2115, -580, -2021, 1768, 1015, -4073, -2638, 2042, -1329, 440, -794, -4893, 1232, 1351, -1271, 110, -915, -2193, 2212, 1922, -1425, -1746, -662, 1691, -97, 961, -697, -2574, 2112, 1803, -487, -196, -1364, -1396, 3315, 1363, -1315, 601, -2111, 1169, 1815, -31, -1067, -789, 1035, 2506, 645, -122, -328, -782, 3282, 1876, -1277, 21, -673, 1687, 2266, -545, -2690, -6, 1243, 2033, 90, -2320, -1428, 74, 2901, -773, -2945, -1006, -455, 1052]
1101A052P95n083k84N069j752Q84j115l702L124L447j804k985Q34m66K644J727
1117B385k545l564K329L825k686J154k252k085N085J525m014k33J60o52N022j162
1133B292m825R99K057J865o96r48l013J463L809n04k811m01O72K44L795l264l091
1150b357K278J223P30m83j740j978L341J540j323k250m20J328Q47K229l508j906
1166b449K290J315m52j02k195j314M393J37j873j431N2O48J963M41l762J94J882
1183b63J037k97k23l134M86M571j926j166L2j021J550L259k795l142K432L72J343
1200A115J61j767k069K867J654j752K71j855J58L120Q90l754m44J812l07K556
1216B656j325l079N69L157q8j249m49k153K598K146j159k765N44N27R13K017l158
$$ y = [1052, 1847, -3236, -3520, 1549, -203, 681, -434, -4136, -1012, 2435, 631, -2354, -1520, -1986, 658, 2385, -160, -3724, -1395, 2430, -256, 898, -1354, -3439, 1646, 3171, -843, -1076, -916, -1568, 3454, 2292, -2533, -1534, 523, 2388, 1692, 744, -2269, -806, 3003, 2499, -312, -713, -41, 203, 3998, 734, -2357, -79, 1144, 1874, 1391, -349, -2327, 1014, 2554, 1231, -1019, -1439, -111, 736, 2965, -543, -2449, -159, 1156, 704, 602, -1593, -2907, 1486, 1623, -250, -1681, -1629, -981, 982, 1423, -2339, -2145, -263, 774, 477, 254, -2880, -2394, 2177, 251, -915, -883, -1904, -354, 2905, 110, -3032, -600, -228, 1115, 1276, -491, -2560, 307, 1961, 209, 480, -1375, -1217, 1903, 2793, -961, -1405, 407, 100, 2656, 1331, -1748, -1179, 1978, 1890, 641, 192, -1961, 637, 2783, 1624, -1141, -597, -70, 843, 2860, -298]
1233b98j752J447K440m51j038j155j103L021J085j844k560J234Q02J152Q79l698
1249a839k47J920J436j059o25j598j34L735l15k352j339J498O9K159n70l866J310
1266a817K479M55j210k10k318J709L825k614j715L02O03R54K128k829k238L096
1282F00L68K00m84j369j502L851J055k840l07k02N61J980M37l818L24K553l15
1299A092P86j392j846O10L296j093j900L13r69J943J438j283l143J529J589j52
1315H18M51j914j359J625K701k100q79n71l88K520P44k341j717J946M98N31k35
1332C30k023n09K155J897k751j13n36J54L152j070k710M77J768o1J212j165k736
1349b529J737K317k88k080K76n73J221K094j713k158J022J866m19J324l012q34
$$ y = [-298, -2050, -603, 1837, 1386, 348, -807, -1910, 1111, 2196, 352, -2208, -974, -172, 980, 1859, -1839, -2086, -166, 1270, 211, -414, -2012, -2146, 1589, 1274, -1078, -2417, -919, -850, 1309, 739, -3127, -1817, 662, 1117, -93, -303, -2621, -912, 2913, 299, -1416, -1114, -511, 443, 2571, -258, -2496, 600, 968, 1168, 684, -685, -2187, 1664, 2719, -121, -428, -630, -69, 1911, 2348, -1470, -1146, 1407, 1092, 1878, 486, -1360, -750, 2546, 1453, -447, -134, -1103, 840, 2278, 995, -2148, -619, 970, 818, 1269, -645, -2004, -379, 2322, 222, -657, -1228, -1616, 904, 1648, -693, -2410, -464, 34, 565, 330, -1693, -2202, -47, 1850, -901, -1014, -1550, -1396, 1756, 686, -2024, -1547, 221, 160, 1372, 207, -2529, -792, 1525, 1237, -843, -567, -1140, 81, 2175, 462, -1696, -674, 1192, 773, 2097, -915, -1749]
1365a749K779P53j094o21o44J96K556p34j267j526J550J140p00R88k962L22K679
1382A666l92j392J23p46jL309k224j172K8J28J567J65j390j297J114J694j026
1399A54q82L93j047J31L308k673o22K55l85K333N2k163o12J911q64J799j148k172
1417b232J480N51K310l050m33M51Q49J185jl121J216J722o63J590k841r08K572
1434F77P74k89j127j754J423K234p60m03k193P08K965j184J67k237l52L059K73
1451A981j809l60q28J037K480j729j249o48J323J935j545p45j036J42K713J81
1467A843l526J023k18N07L516l819j646K050O35P82m73k518K8K306K5qk140O15
1485a018Q2J576J244l717K6K283j037Q64M60l917J857L082k474R08o30j054J836
$$ y = [-1749, 1030, 1783, 689, 68, -576, -380, 2176, 1442, 175, -1351, 199, 1339, 639, 1627, -1335, -1013, 1666, 1274, -118, 5, -741, -742, 2567, 343, -829, -801, -673, 894, 1059, -331, -1628, -514, 1180, 154, -728, -335, -1382, -1251, 2057, -616, -1238, -983, -1368, 965, 1017, -1146, -1758, 153, -711, 1088, -60, -2232, -752, -201, 2109, -941, -1374, -923, -74, 1111, 1110, -2011, -795, 927, 264, 1854, -987, -1895, 677, 1451, 1162, 35, -1719, -296, 1938, 1178, 775, -1418, -710, 2255, 1071, 1238, -999, -1351, 1708, 1981, 172, -188, -1016, 21, 2501, 772, -477, -1125, 198, 2133, 588, -157, -1193, -1051, 1662, 1843, -1683, -660, -878, -371, 3145, -674, -2320, -270, 365, 1147, 674, -1844, -1816, 490, 515, 507, -1633, -1018, -936, 640, 1884, -1833, -1807, 476, -561, 303, 763, -3154, -1297, 1785, -689, 219, -411, -1465, 371]
1502C71J318j285j100M94M72O34l15j83k157J889J298j186k74k32j174L460m94
1519A536j268M10O5m12J257p43o71j053Q48J275q52n02J53p94J568J227l186N65
1537e77R22r48K492j301j822J61J864k16Qj150n03K66J871K45l736J818J27m18
1555h97K893k447k432K698Q57j207J319k480p13L419o3j238j371N30M73J722L15
1572A378l019k90K532M41q80O49k787J099L223j869q46k9n85J493K057k286j369
1589a088R22R40R25j336m19j296J691J929j758j071K52K01J212J147k855j47J139
1606C88L08N55j018r88J31J599N90j518j103O16P07L47Q31l322N69J629n8J01
1624C64l12j822J052K233j071j018l07j66Q70J508j355k033J755M56k79P28j362
$$ y = [371, 1689, 404, -696, -202, 270, 904, 589, 406, -1751, 138, 1436, 250, -24, -256, -1430, 2030, 1536, 268, 678, 743, 331, 1588, 845, 174, -879, -31, 1244, 392, -110, 43, -751, 817, 2044, -1142, -577, 345, -603, 1889, 588, -1234, -1073, 791, 575, 583, -567, -1070, -804, 1067, 1312, -2424, -606, -479, -897, 1996, -451, -2883, -185, 672, -535, 784, -1696, -2409, 1010, 947, -291, -1662, -1132, -659, 1063, 1378, -1641, -1931, 601, 1042, 162, 811, -1976, -877, 2346, 477, -369, -398, -983, 510, 2567, 281, -1088, -166, 774, 1699, 363, -56, -1352, 339, 2268, 510, -561, -309, -108, 1104, 2251, -604, -751, 388, 696, 1251, 233, -755, -624, 975, 1565, 47, -1056, -440, 267, 614, 1445, -1877, -1308, 321, 263, 364, 52, -1770, -718, 1515, 444, -574, -881, -1047, -177, 1331, -24, -2057, -302, 154, -125, 603, -759]
1641g59j660K500J317k210P12p43l67K248Q9k229Q7J138k32J275o32k016N70K089
1659A177o1j373P08j572J092J614j013j685J076M63JJ648k325q07J145J412n62
1676I38o89m74n33J678P47j474r97R10M32j12R31k253k99J315P78r69k48l11o14
1695a244K678n50j706j79P61L96n7Q86k437L44J801J08j488K48j032R35J943j581
1713a74j134J78P59L93J090j615j647K172N11j95m10m89r12K290L94j809k4K06
1731d16L38J024j13j901Q3J877Q9n47m04q35L45K014l85j513L83n81J207P81r51
1750D95j694J120R58k47L39j387l73J169J201j253o87J30k71J500j2j514r51J778
1768C01L60k10j70j550K19J650K72j272K36p99L55J761r40j501n5J028M54K23
$$ y = [-759, -2419, 81, 1398, -812, -100, -843, -1210, 1038, 1127, -1102, -1015, 123, -109, 1166, 534, -1482, -912, 1177, 1116, -257, 451, -1121, -29, 1585, 572, -1113, -37, 426, 427, 2075, -250, -1057, 88, 1500, 938, 249, -225, -758, 920, 1667, 193, -804, 106, 538, 426, 1357, -896, -1195, 120, 898, -71, -319, -630, -1244, 1434, 884, -822, -1001, -240, 156, 99, 985, -1452, -1108, 693, 801, -687, -439, -1471, -536, 1407, -174, -1308, -1130, -371, 22, 1112, -503, -2150, 22, 533, 338, -72, -561, -1473, 817, 1211, -598, -622, -416, -78, 946, 833, -1068, -985, 892, 981, 434, 30, -805, -460, 1554, 1169, -344, 39, -542, 665, 1446, 495, -1199, -79, 879, 632, 971, -416, -789, 380, 1581, 328, -359, -229, -500, 1000, 988, -526, -1477, 301, 661, 451, 281, -1269, -1050, 600, 872, -400, -164, -963, -608, 1153, 213, -1288, -1343, -315, 139, 362]
1786C62q20j312J224J247n18j045J51o12J411J287j958o20J005M53m6O40j896
1803a047j88J699O46j182m77K84m16J893j36j675l1Q21k6N73J66k129Q30J562
1821A167n49k82o34j44N88J577j351r20K95P26K9J32n17j747K042P36r81L37j029
1840e25n81J815L06j817O8J26L75J067m81j460l10K011j00r31M12j259L58K112
1858A186q90k046J992o02k2J062j199j217J555Q75j076O12j255O5M83J363l71
1875E15j678J107n93R08J124j760j101J959K15m45O79j831M38J434N4p19r50O06
1893c8J7J139K1j920K22J619k97o85J033k567J211J493o19o14K03q58J008J133
1911A501j764r54Q12J050M46p55n38j158K141P08j839o75N12m09K454p83k345
$$ y = [362, -458, -1770, -546, 701, 183, -862, -711, -1323, 88, 1375, -583, -1203, -198, 255, 209, 849, -1047, -1235, 464, 1110, -72, -549, -265, -681, 1212, 1076, -599, -630, 191, 165, 738, 904, -1225, -395, 1167, 618, 336, -298, -442, 146, 1723, 372, -548, -253, 473, 502, 634, 117, -1630, 412, 1148, 167, 504, -525, -1106, 709, 1015, -802, -734, -608, -233, 834, 353, -1107, -1417, 594, 494, -437, -25, -1284, -926, 1186, 296, -1750, 242, -360, -382, 680, -519, -1736, -181, 694, -382, 230, -1025, -960, -477, 886, 515, -1163, -56, -649, 259, 1383, -377, -1478, 481, 696, 251, 930, -901, -463, 971, 1025, 306, -644, -38, -21, 1118, 1139, -781, -559, 1060, 763, 78, 1111, -1456, -245, 1248, 629, 15, 218, -640, 368, 1501, -263, -1217, -405, 645, 1091, 336, -202, -1360, 781, 1489, -350, -1025, -513, -922, 1532, 749, -1596]
1928a596Q30K66L42k04l19n75M57J641j70j488r3P15m63J525m12k636J856Q13
1946D89p20O99q84j272K331p6o05j73p88J175J57L78k16j792J656M75n25km34
1965a27q24K144L8j465P43q98O56P06o40n37J20J15P42j33n05J00j076J981j99
1984I41j447R76j106M89J210n38j662J490r46P12R36j727J11K80Q79l20o50k49
2002f21l79Q54J038j226j293J858j019J037Q75k487N04P30K35L84j49j079Q11
2019G3K79J87n17j307J024R99M79q32j713Q89J107p18J11J81j155J271Q56j462
2037b48R3n65R44Q94j63j397k94R23J028p36l31j62j050K161M4j775M91J19K21
2056A97J045q07j491P54P06L26R0j246Lj41J576m84j183K24J36N78M40r56j366
$$ y = [-1596, -766, -500, -158, -362, -681, -1256, -799, 842, 672, -816, -909, -194, -657, 868, 456, -2180, -324, 489, -231, 468, -416, -1688, 643, 567, -38, -211, -999, 176, 333, 711, 495, -1297, 359, 834, 309, 307, -127, -951, 1193, 1231, -234, 509, -389, 267, 973, 333, -204, -84, 31, 773, 640, 135, 235, -841, 1140, 941, -506, 470, -636, -147, 1063, 525, -1137, 353, -593, 119, 1055, -672, -561, -281, 598, 278, -372, -621, -1000, -146, 892, -334, -1627, 231, -788, 249, 1124, -1363, -859, -129, 106, 490, 341, -738, 73, 352, 539, 22, -1285, -261, 738, 1217, 385, -1328, -439, 668, -50, 61, 242, -913, 358, 1214, -248, -155, -720, 224, 1118, 955, -442, -736, 187, 1215, 479, 148, -14, -1064, 1097, 1141, -634, -143, -24, 197, 1242, 435, -1056, -302, 404, 730, 820, -426, -423, -564, 1012, 528, -655, -431, -295, 283, 723, -233, -1599]
2075a599K111l33j57K80j067k82J245N54j062k59R0K74M67J58j223n42J601k85
2093b9K10Q5j282K53J528m36r36P15r84R04O94n75q23M17Q10l19L24p50m40M74
2113a60J120m77p74M64q78J318O06j300n0J43L37K98J77j440J98Q37K25k73n56
2132a85J44j73J070p2j242K39M86J19M56o48j074Q87M17J67o60k28n07N60J039
2151G95j001m44K88M83L3J62p45p11J232J3J0m58m57j71J310M7j103N14L8K94
2171A29K35m2j482M98J225k56j72m75n09M78J414p65q01P19m57P71K28p04q90
2190h56J029N01l52K55r32k3P01Q01j153m3l9k12J112m4j153k01J069J3r8K19
2210E94j010j52J203Nj068J93J31q7J010o14p36j40R92k67R6k48q63Q25N33n73
$$ y = [-1599, 512, 179, 22, 302, -765, -1047, 198, 752, -310, -569, -479, -205, 262, 420, -803, -1345, 256, -29, 181, 266, -1016, -763, 765, 329, -607, 108, -876, 28, 722, 147, -676, -259, 551, 232, 556, -194, -634, -160, 960, 483, -291, 173, -705, 613, 1219, -81, -131, 12, 349, 647, 824, -616, -418, 419, 644, 371, -185, -41, -214, 856, 784, -458, -219, 267, 386, 842, 194, -880, 7, 424, 591, -69, -297, -804, -244, 795, -206, -650, -362, 121, 154, 316, -429, -1140, 92, 105, 115, -343, -800, -971, 339, 386, -717, -203, -165, 129, 364, 322, -1160, -662, 563, 307, 135, -340, -849, -371, 1043, 278, -523, 196, -261, 510, 738, 34, -856, 173, 674, 322, 577, -355, -378, 323, 1124, -29, -72, -111, -323, 789, 745, -408, -609, 460, 473, 375, 594, -416, -568, 635, 640, -428, -235, -104, -191, 819, 205, -531, -671, 321, 54, 150, -98, -961, -136, 397, -176]
2230a76l94K04k33O47M87j046k22L83N52k81K66q75l91J491m7o46k53M31j75J013
2250G35k94j019K49N19qj24M27j097K58J250m72o71K34k38M81R58j175m09L57
2269c9K23M12j36j79r27R61M14m33k26l01J88M17O43q58q01M96L58K43j58n99
2289c02l59J480l73m27M6k77M65N26k43j696P98J2K91J59K79j174M24J028j129
2308d72j07N76p34M75P28j087Q1M60k79P55K26j307Q4K18Q60k14k34l44l62P31
2328E4O01r48l64O98j71Q16m17r99J344l52K74N49j616J21M58M91j24m76o57R77
2348B59j01K79l67L22M92J37m80p05K0n51J549L73j321j7l25R89k5o1j217M50
2368c00L66M31n89L17o31m06J487n57n02K52m28K13J152j176m90L30K09O50o73
$$ y = [-176, -570, -366, -599, 48, 535, -511, -733, -350, 202, -79, 187, -688, -1079, 412, 365, -281, -534, -103, -278, 735, 441, -578, -329, 190, 182, 58, 485, -612, -354, 896, 424, -247, -13, -251, 230, 1188, 13, -396, -39, 184, 596, 460, 281, -646, 315, 729, 296, 70, -231, -43, 374, 1017, 159, -642, -146, 212, 455, 297, -302, -661, 819, 446, 19, 65, -212, 253, 779, 536, -1160, -362, -350, -59, 100, 379, -795, -371, 657, -472, -579, -3, -737, -262, 466, -621, -540, -80, -359, 396, 622, -685, -601, -383, 477, 263, 29, -315, -677, 54, 655, -293, -657, 41, -130, 686, 269, -730, 614, 262, 536, 1085, -531, -410, 48, 539, 415, -61, -718, 259, 158, 437, 70, 392, 884, 1021, 541, -164, -144, -695, 854, 1227, -94, -111, -436, 553, 528, 467, -750, -300, 66, 497, -92, 225, -406, -812, 675, 118, -384, -132, -560, -347, 805, -371, -861, -531, -322, 328, -345]
2387c45j57j19M01P60n37n29R2L24K25N59p98j241J628l34J99l0o53K72P24Jj95
2408B47n34K69k9M74R2o73j91R40l18N4k54o59L52J183j086k8L87o24P57K42l41
2429B60k24l52O03m0K02n09k29L29P47j048N51l07m96J308j43r30Q9j38R9O99
2449D71k90p14J54Q92k96K15j247N50p52J008P22j899R84k5P37K21o12j584J544
2468G9K98l6L65j138j82N62Q77j345j69l47J546m91R36j064r30J887q96N27k91
2487A88o84M19J304n23j117O3j16R46L83J27q68n16Q78j05k62q9rk20J383j268
2507h6L9J38K56O81l11k38o24N93N8L98o54l65k60O54N53r73o88J324p15Q15k33
2528C62j398K50J147k22l2k47n69N71N43n1p69p9N04r4K93j93n95M46n5J0P16
$$ y = [-345, -502, -621, -220, 540, 3, -526, -434, -110, 115, 674, -124, -1365, 263, -71, 128, 98, -555, -283, 441, 442, 247, -287, -18, -47, 427, 519, -154, -345, 595, 277, 331, 77, -582, -230, 953, -133, -161, 226, -398, 359, 601, 260, 36, -316, 287, 247, 449, -60, -289, 40, 787, -261, 290, -17, -513, 795, 652, -278, -189, -327, -228, 471, 181, -533, -379, 513, 217, 432, -815, -265, -1017, -9, 713, -1186, -202, -227, 510, 731, 119, -1465, 79, 377, 341, 706, -432, -614, -52, 825, -520, -689, -1036, 510, 19, 955, -109, -1039, 848, -48, 479, 188, -496, -77, 1227, 704, -413, -350, -466, 480, 863, 990, 122, -394, 484, 379, 117, 28, 19, -201, 1182, -86, -47, 91, 347, 1028, 717, 479, -145, 448, 506, 904, 250, -115, -375, 279, 832, -141, -829, 495, -220, 595, 362, -1036, -786, 361, 139, 107, -140, -709, -138, 405, 354, -415, -494, 10, -84, 209, 16, -579, -133, -188, -178, 538]
2549E38j71j937J604J076o62r56P15l99N15k22l16R9M6L71p3R8l32l25Q40J09
2569F18o60j07J57l78J067l59l24j39K32L06j2q8q70O63K3L00m39J39j34k3R11
2590H83q18o72N03L28nLj41o18N53L42l94j50q5r1N19L40j040L18P6J09N0N5o61
2613e96K38O30l64J08P3m38L6P21k99o28L49j01M85K6j46n86K82O57l51j00k81
2634b85j69O07L39m14m66M22l98P56j42j78k65J21N58m61K72m92L56K44K95p10
2654a0j28K40J83M35k31p55k70J060k39j24k08l89K08P03j63r14K83L46J91P60
2674I78j321j92M19N23o48k13j01J0L20P16o12k97M98k40j26O84l72n30K37Q67
2694F00p59N59r38R09m64M53j048K60M5R34J58j331n21O87K79Q6l91N07l8j22
$$ y = [538, 367, -1570, 34, 1110, 448, -508, 207, -192, 323, 101, -215, -116, -70, 301, 228, 326, -6, -331, 509, 618, -42, -149, 8, -370, 697, 338, 14, -125, 107, 413, 401, 313, -557, 106, 129, 429, -10, 129, -5, -28, 883, 65, -607, -104, 224, 219, 222, 81, -537, 16, 358, -36, -186, -271, -362, 157, 497, -543, -225, -149, -40, 10, 65, -596, -358, 272, -92, 16, 89, -349, -313, 408, 109, -519, -170, -271, 214, 240, 94, -492, -210, 447, 96, -4, -285, -454, 153, 492, 78, -388, 34, -364, 392, 250, 72, -193, -72, 486, 25, 297, -195, 161, 405, 700, -10, -138, 102, 285, 720, 489, -266, -536, 524, 285, 161, -47, -436, -228, 475, 312, -602, -319, 27, 218, 978, -343, -535, -116, 407, -241, -454, -555, -545, -225, 491, -121, -418, 80, -160, -286, 398, 26, -504, -267, 600, -159, 400, -538, 371, -93, 360, -688, -428, -383, 551, 709, -622, -1143, -456, -177, -91, -482, 25, -13, -135]
2714a35P17o07M16j169J241N08P4j183P25p42K76j80J13n70P16J18m8J63m26p1
2734f4l5L68j36n57K89L17k74M91l38n43N63M83l35k26k70o2L59K26j85o37L68
2755a98J54O4j17j94k79O56Q6l50o4l22nJ152l89m44m5L09k41M79q6p06K05O03
2777B68J09o34L58m79J55Q30n58l47J21M07j69N91o27k91K88L00j64j35Ll07M63
2798A82L63m72k36L54k0N4K30q02K15N69k59M22m34m26j15P77l93J2o74N17j44
2819b80N63K7r12N12j56M17j94k3o09M14Q69q00j97K22l55N68K62n07l67K08M51
2840A13N1o47Kk6K14R00j249K77L10k12N01Q2j136N22N58m21L86k88n15N11M04
2861C37R3p11j92L11M47j5J6o35O27J59m70O92q51J12O38p6l12j71j3J51L03p7
$$ y = [-135, 582, -25, 391, -778, 463, 971, 1045, -138, 587, -155, 121, -59, 54, -516, 200, 318, 270, 433, 7, -64, -99, 269, 133, -424, -135, 182, -92, 399, 61, -482, 81, 564, 229, 3, -267, -329, 30, 256, 71, -566, -198, -44, 20, -97, -291, -570, 86, 172, -178, -242, -564, -569, 583, 194, -250, -295, 14, -227, 252, 166, -540, -335, 268, 377, -257, 101, -378, -223, 607, 49, -298, -177, 230, 61, 652, 25, -266, 22, 322, 158, 23, 26, -281, 182, 545, 73, -163, 191, 171, 225, 455, -347, -132, 437, 178, 600, 166, -260, -375, 402, 9, 21, -653, -136, -280, 283, 310, -602, -90, -246, 171, -23, -46, -655, -241, 628, -172, -369, -147, -502, 66, 328, -179, -546, -338, 113, 164, -483, -481, -507, -293, 607, -642, -365, -55, -267, 234, 316, -820, -298, 260, -161, 225, -63, -578, -67, 337, 430, -281, -473, -162, 285, 270, 286, -349, 278, 437, -33, 659, -192, -80, 558, 482, 170, -1, -14, 137, 440, 363]
2883C63k24l26L35L38n88M85m73k54P73l09l93N10l78J01O79p73l15L28L9J12
2903C0J15j96l11K13K12O6n47L54k68Q9R19r65O3O8R6J82J60n29o2J85J95O6m18
2926b83M5N5K09K03m16k09J77K28J74L32j123M37N41m59K54k67k63N33M18l94
2946A92j92m43J11M27O1J09p93L65O08m24J49k17j83L66O73q14q8j99K2Q23m67
2967H6k51k53O89J16j98l31Q5k81N36L22r68K57jL00L22p72o59Q29M82l86K15
2988A39l16j03L66k86L99m22J26j18M30J32o44k34L69J04jK44q10J63P75k72j51
3009a10k71K28J04M42l69k24j49M84J22k28J81m99P4O18n1j98J39k70o5N60l96
3030A22l36K34M61l0k26k50j35L71J90n23J07L94n93L80L5o79K53N23m58L35j81
$$ y = [363, 139, -187, 148, 486, -102, 383, -90, -344, 429, 120, -273, 237, -141, -40, 639, -134, -449, -121, -82, 30, 145, -51, -362, -149, 63, 129, -418, -64, -332, -243, 676, -289, -226, -158, -62, 120, 280, -249, -311, -126, 69, 135, -283, -238, -183, 26, 229, -187, -396, -219, 9, 183, 515, -608, -171, 370, -89, 165, -102, -365, 168, 586, 192, 0, -443, -332, 95, 156, 265, -528, -163, 445, 21, 170, -47, -230, 136, 809, -5, -93, -292, -270, 553, 86, -165, -418, 271, 387, 189, -142, -57, -338, 198, 520, -448, -191, -192, 108, 430, -342, -1001, -172, 310, -76, 139, -177, -280, 86, -200, 199, -223, -97, -215, 215, 347, -297, -531, -162, -58, -59, 185, -625, -462, 313, 41, -110, -381, -153, -49, 393, 24, -200, -349, 135, 257, 29, 210, -289, -215, 403, 352, 154, 293, 23, -42, 518, 122, -214, 20, 481, 451, 225, -25, -160, 211, 401, -122, -15, 379, -214, 166, 201, -478, -225, 298, -160, 175, -6]
3051fM2k96M16j3J26m03N9k69J67J77n88N85l39M22j30j09l68M74L17k16Q1n74
3073d45j11N36K89o46P7L81l23L65j02p7l21M19K3j61J97m30J47M08m1k75r8L84
3095A96k8L26j79n35LO84l41L0l2l95N58j93q8k11M5K25j59O97o29n9J96J68p8
3118B01k06k57k58P25L41n98j27K87k57J1L89p29L04J30O8l7l2k12j74Q25m16
3139b2k95j33M40K5j78K76o04K53L24k8O4j12m75M62M40m82j47J61k48M76J39
3160C36m57l41M87O9O4j06k46O7M07J63l35k74qr9O76n6k78j78K93k39N69k29
3182B85k90K0P35l41l96L7p32M69J165k11j155M58J30r9K26l75k43L99K16k33
3202F5k24l1q3N97k58k11k19J68K72j76K2k32%J15K86j96R2l47J91N00o59M8J83
$$ y = [-6, 36, -260, 156, 143, 269, -134, -75, -344, -177, 0, -588, -3, -342, 80, -50, -159, -527, -53, 264, 48, 129, -445, -556, -20, 269, -377, -300, 81, -242, 123, 21, -56, -377, 42, 65, -96, 101, -329, -182, 226, 185, -90, -188, 196, 168, 494, 315, -220, -217, 467, 126, 156, 124, -271, 287, 94, 6, -205, -160, 65, -94, 603, -26, -85, 111, 279, 201, -5, -262, -520, 205, 546, -52, -179, 108, -149, -138, 251, -478, -174, -44, 24, -13, -45, -257, -431, 394, -22, -317, -450, -10, 15, -163, 113, -491, -238, 86, 58, 122, 10, -465, -3, 437, -45, -192, -31, -279, 197, 336, -121, -462, 25, 94, 158, 52, -194, -127, 280, 443, 108, -166, -174, -273, 403, 347, 69, -109, 184, -55, 514, 285, -5, 15, 750, 409, 13, 50, -682, -213, 952, 741, -414, 44, 174, 75, 301, -74, -317, 82, 298, 65, -159, -190, -273, 324, 66, -145, -364, -196, 76, -100, -78, -310, -310, -195, 91, -105, -13, -360, -169, 331, -328, -280, -97]
3225i7O3L63P9n67k91L80J65L0j88K18l15J47L77p99J58N84q6R9K18j440N90P62
3247D50k85K0p82O82p01M16R32j187P42r0n9K85o6n65N47J43m45K50k16m91L45
3268g5N02l18M8j03l1K16K0k00l19L98q0m5k39K04m00Q12J4n68k91J1M34J46o23
3291d87N12m50K64j31L68k8l00L27K19j65l42J48P1l29K30j54k31N97o0K04j62
3312A01j12k2K98r2j26j36k72N78J13J71o61jO04k48p56Q67n86K36O25n40ml50
3334c13M33Q5rq1m81N46J4j13j48M30q74P21L79r54M01N64o57J85K29l54k35M33
3356B01m70k53L54j58J88N30l25j83R5n8m84Q76m74q64J680j186J71Q38l98k95
3376b15l91J515p28M9n13l84L81M98q8m93K71J13J32J94k24o07N63j70K55M7k92
$$ y = [-97, -34, 329, 408, -159, -450, -70, 95, 125, -63, 155, -160, -13, 364, -435, -277, 307, 221, 320, 538, -902, -312, 450, 165, 185, -597, 85, -616, -200, 732, -455, 287, 197, 138, 423, 357, -208, 339, 482, 37, 287, 71, -420, -75, 427, 109, 157, 54, 23, 239, 259, 59, -260, 138, 58, 13, -226, -22, -422, 390, 404, -164, -455, -444, -10, 136, -487, 25, -425, -161, -292, 76, 48, -252, 75, 294, 129, -213, -65, 6, -323, -93, -247, -478, 119, 59, 263, 101, -11, -33, 265, 173, 47, -89, -361, 217, 330, 501, -160, -161, 443, 195, -561, 306, -280, -44, 581, 41, 37, -313, 120, 205, 196, 115, -366, 180, 194, 81, -67, 363, -511, 210, 589, -365, 36, 600, -57, 128, 357, 3, -232, 201, -269, -522, -168, -326, -138, 392, 67, -116, -21, -79, -563, 313, -161, -1025, 655, -531, -360, 478, 80, -215, -606, 909, 181, 230, -283, -667, -286, 212, 124, -369, -98, 15, 147, 341, 117, -490, 73, -97, 158, 205, -87]
3397h7L37j7K4l74r8L37P3M9N0k98k39M97J19k20n2j06k2N21oo89J58M2K48K74
3421E21n02j29m38P57K14j27k33l85O49L00l03j142R77j35L21J26p76J14J34J08
3441E1N9j20k60J5L71K10l82k08L63k54J60K04n29K00J82J8K4l0k98L3K35mj7
3464B3j62J61K5L4k01k34K49K49j59L60m18j39O30l00j17L58n05K52L81k68k71
3485e2j7Q0L48j70l55L41l81N51j64j76r3p5Q9M94l21n37M65L9M1j5k83O3J28
3508@Q4L9l8k58P8j26J43j64k18M15M6n0J91k44K9M26l15k50L51o09K33L72j44
3531ik33J51K73j92K57k58Mm66N98j00J79r9l58M47K71l19q3j52K91JMj70j6P6
3555I7K87j41k50O8l43L75L8j16o1K67k76K25J51l94M3L83j33j60J41o36K46J22
$$ y = [-87, 250, 233, 257, -117, -215, 122, 195, 244, 294, -4, -243, 254, 373, 153, 101, -5, -27, 494, 488, -201, -43, -1, 247, 521, 19, -110, -548, 209, 423, 296, 63, -322, 327, 627, 324, -818, 159, 24, 345, 471, -305, -191, -57, 51, 110, -10, -270, -255, 116, 326, -56, -264, 99, -155, 5, 209, -320, -120, 62, 80, 104, 74, -224, -191, 44, 40, 23, -139, 22, 47, 81, -120, -354, -105, 144, -15, 345, -73, -212, 418, 118, 1, 359, -146, 106, 487, 219, -52, -69, 11, 359, 189, -166, 175, -206, 345, 181, 5, -88, -163, -74, 420, 99, -438, 27, 66, 107, 92, -191, -128, 0, 84, 123, 85, -173, -95, -221, -78, -242, -460, -45, 1, -49, 142, -102, -73, 353, 38, -212, 139, -470, -237, 135, -9, -242, -91, 182, -10, 247, -11, -7, -473, 125, 25, 204, 105, -253, 194, 465, 146, 63, -89, 202, 203, 207, 37, 21, 97, 384, 243, -7, 61, -282, 93, 131, 15, -46, 221, -55, 170, 321, -73, -30, 353, 220, 60, 201, -435, -189, -67]
3577f7L28m07j83K94j56M75l29l55K97J37r3p3o7Q4QL20l91J32l64K59J64K4k37
3600b00J17o2K51k95J47J2j62L08P1k06j065J065n66J000L6l44l11L70l09K09
3620F6k13m1l5M15o3p1r9M3P7K98j33l18L19J13j86P5k96N6K40jJ99n79J04M4
3644A4K68k06o3l55L88p4O2J62l84J95M4K09l09j63j05J82O1Pp8j3L49l48O8j72
3668b61k93M81J00j7j38K6l33L63L36k31k22K3J55J49K0m00J53J21J86m45L68
3689A41j64j02L21l1k50J39L8P4J50j98j49J46J50j52R2n2O1l16L61l54N3M9j64
3712a57L31o3K74m88M21j58l48L09k81j08L47J49l61R2m9P5j52K35j22j76O32
3733D02m12K97m96r3J26k7J18k22J81k9K47J77m95p8J24M09k36k8q8l03J34K74
$$ y = [-67, 261, -146, -329, -35, -191, 284, -45, -400, -103, 34, -59, -132, -199, -115, -107, 213, -178, -46, -410, -151, 13, 37, -200, -83, -145, 106, -189, -42, -30, -192, 116, 187, -19, -1084, -19, -585, 415, 451, 107, -204, 166, -143, 66, -147, -188, -223, 192, 129, 58, -41, 2, 79, 377, 244, -74, 245, 358, 172, 247, -49, 7, 247, 246, 445, -134, -30, 14, 282, 76, 13, -342, 46, -28, 34, 196, -188, 7, 51, 260, -49, -212, -317, -135, -74, -67, -145, -158, 191, -157, -89, -261, -554, -73, 27, 10, -128, -102, -435, -72, 264, 33, -189, -166, -11, 138, 158, -242, -89, 32, 218, -227, 141, -23, -125, 196, 165, -85, 54, 92, 166, 316, 118, -31, 115, 265, 113, 205, 153, 214, -102, 259, -95, -42, 7, -157, 174, 111, 385, -103, 318, 160, -188, 121, -160, -268, 79, 228, -133, -41, -90, -15, -167, 68, -54, -230, 402, -10, 287, -209, -302, -176, -203, -85, -307, -126, -155, 92, 269, -226, -304, -180, 229, -7, -35, -123, -426, -292, -18]
3755a8J35l97K94k61N56k16j31o0K7J95Q6k1l75k6K52J87r1Kj65M2L72k62k62
3778a37J66J10n8K62l26l03M90j47n6o0P8k10K98p0k6M5p0J17J37j24k21r5M65
3801B65j80j35j28K32j95J01J73r3k95J61J58m24L59j06n05O49k14J03P4j20N
3822a15L34l64n08O00l6O5J42k42k0j95L88k4j3k6j84q7N48l97p4M58l72K31N5
3845A64k48M2L02l04K73%j38k20P5M02k95l32K93J83M5j74R5l22P72o38Ok5k21
3868b65P83j001M03K43L0L59q11J69K90r14O11R6L56j52p44R66m46J20J94n73
3888b86k39O97K09m0n54K45o00P01k47j75L02j66L86k10k09M6J40j12J94j67n52
3909f37Q16k41J13k2l69L97l7K33k14j26N7K57k42K90m44J09K17k5k9K14l46j86
$$ y = [-18, 117, -280, 14, -247, 309, 93, -38, -98, -71, 124, 210, 189, -186, -212, 40, 227, 136, 138, -27, 15, 387, 125, -137, 29, 139, 81, 343, 17, -286, 204, 57, 1, -59, 19, -191, 107, 37, 11, 56, -14, 103, 240, 116, -105, -200, 265, 85, -50, -178, 54, -141, -40, 133, 40, -255, -94, 64, -360, -1, -107, -612, 37, -177, -74, 0, -120, -115, 219, -145, -653, -53, -89, -24, 118, -124, -144, -339, 49, 25, 12, -14, -198, -285, 263, -134, -208, 250, -122, 109, 164, -84, -42, 260, -44, 229, 229, 91, -129, -54, 348, 53, -279, 14, 197, 242, 68, 163, -159, 613, -25, -19, -44, -265, 518, -483, -80, 163, 193, 552, -259, -90, 200, -714, -103, -7, 349, 197, -547, 419, -27, 93, 287, -286, -525, 172, 381, 341, -213, 32, -568, 133, -114, -289, 13, -153, 233, 23, -186, -140, 0, -112, 82, -85, -637, 179, -62, 51, 29, -340, 57, 20, 253, 39, -87, -30, 227, -15, 275, -169, -60, 157, 132, 103, 317, -29, -215]
3931b15K89O1j42K0k58K20J1l9J55lJJ97l28q6P3k00O67l09k55J53oK24qn20j25
3956d23L77J31j90J02j42q8P1J47j08n0q2l30O43m9l93J96N0j42J85J5k99M83
3978A04l38K21q7n7r9L1L12N0j81k08K85j65N5L28m65M38l74K91j2j43j16L76
4000B46J69k71j54k90M85k2J06l70m1K69L72k06l25J06O1O62l27o82j2j64J86
4021b02L12k23k80N32N9J75j16k2m24NJ34K4rm12J96O70m83pm09O42l81O55k03
4044B33l95j20M03P4k06j67l8K95K2Q2l46j7N31l45J98j09l04m6O89K21r60N52
4066B47k60l1M81j098J396k2j548J023j21K51k24O0J77k77j92J87l30K29J33L6
4086A17k91K30Q8k32K66k78j16K61J64l77O5m2P2O7P1j44k05L80j90K43P2l26
$$ y = [-215, 74, 135, -7, 13, -245, -25, -14, -53, 102, 99, 100, 297, -31, -117, -44, -244, 423, 114, -141, 12, 6, 230, 222, -298, -423, -46, 85, -105, -3, -145, -233, -162, -15, -123, -173, -255, -585, 58, 9, -384, -188, -138, -280, -95, -80, -379, 104, -234, -13, -100, -157, -256, -225, 87, 137, -44, -252, 33, -132, -77, 251, -214, 224, -150, 141, 129, -14, -130, 246, 415, 144, -10, -300, 185, 163, 269, -101, -142, 127, 499, 293, -32, 74, 135, 797, 470, -212, -224, -388, -202, 110, -113, -393, 139, 198, 373, 257, 235, -189, -184, -50, -26, -35, -447, -251, 419, -64, -71, -480, 162, -219, 436, 233, -162, -282, 121, 195, -11, -178, -216, 79, 101, 183, -163, -180, 351, 6, 204, 95, -209, -255, 434, 655, -305, 247, -13, -44, 437, -661, 735, 713, -835, 188, 67, 318, 94, 154, 331, 54, -138, 49, -281, -52, 81, 117, -174, 56, 144, -88, 178, -100, -216, 45, 209, -168, -103, -145, -73, -6, 65, -79, -284, 96, -94, 149, 221, -105]
4108a05J4J39n7J80k44pJ34L49p02K41m7L33m45M10l80j40O18m81J72j09N9J05
4130C7K65k76j99J88j19L85k99K40j80q5k3k0J41o3J92l24J85k43L79l1n06O84
4152C28j97J6n85K61K61O0k11m5N22m90L97k28k84K01K39L01m38m19K06N93o30
4173a42J55n65Q42o23K12L13m56N44m05K38k96J57j04j01K70P4l26K01m73M73
4193a2J01q3l9j30M14l16j2m2j27J15K46k77K98m95J31O06m14K14l19o5r6M20
4215A18j46o51O92k53O1K25n1J86k80J48N51k66m79K40j98N15m28k90L68K68k78
4236E2n0N43m21pL99j25n21J50L01l37N43l63l77J38L81O7m44K93K4j76m95O45
4258B20l80K88l77M59j17j4p49N26K72L66k79m2m9l70MJ3K32lK58j0n25J04lK40
$$ y = [-105, -91, 48, -9, 171, -73, -80, 54, 403, -299, -58, -105, 228, -217, 193, -187, -327, 291, -190, -18, -127, -68, 37, 302, 26, -173, 15, -104, 281, -18, 222, 42, -43, -66, -86, 55, -8, 184, -140, 45, -198, 181, 150, -356, 328, 131, 147, -438, -177, 84, 144, -67, -112, 410, -80, 317, 89, -195, 6, 245, 546, 108, -311, -105, 488, -142, 13, -552, 290, -333, -121, 192, -264, 280, -125, 113, -183, -26, -130, -231, 39, 113, -213, -12, -485, -12, 89, 6, -33, -163, 251, -65, -77, -119, -246, -131, 115, -162, 136, -359, -228, 378, -36, 178, -141, -206, -302, 118, -28, -679, 13, -240, -179, 46, -5, 181, -99, 49, 600, 334, -145, 95, -103, 412, -16, -306, 62, 330, 52, 2, 545, 124, 117, 516, 391, -130, 20, 321, -16, 527, 164, -213, -75, 306, 373, -71, 222, 246, 70, -425, 220, -160, 128, -249, 210, 93, 79, -670, -144, 128, 494, 215, 173, 124, -246, -242, -229, 3, 0, 258, 248, -277, -173, -176, 64]
4282F4k71l76Q66k54j46M52l03n06O58l89J24J70n09J49j2M11L10m27N6pK28k92
4304dK62K14J52o73j141Q95L04l8L33k43R6J1k46o4K06L8l6j76J64Q5k52J34k9
4327hl8K17j70J47l16J11ROR7l44j5K3M29k28l3j8J44n8J39q8j54J70M2r8j5j08
4353a57n7J12L56j48r9j56J34m7L04m92J29K72j25J49k99L27l28K34k18L48l71
4374a32J51K35j33j26j04Q4L30m44K04p4L7P6J83k16J27j29k10M06k72J19l42
4395b30K75l1q4M8K5j01K01R4k27n6J6R5q1l9J0J07R7J08m57k7j93O16m6N86r63
4420b57k24J96J95k83L02J55j37N78o76J08j57M61j66L02j08p72J41J024q07P13
4440E88k71l21r33J249n92N36m94J009K43q39O25j64n9j387M91N76p45l02J236
$$ y = [64, -207, -583, 283, 29, -117, 335, 32, -474, 184, -205, -81, 89, -420, -271, -283, 128, 438, 11, 67, 60, 288, -4, 258, 472, 624, -49, -1190, -295, 9, -29, 304, 61, 157, 168, -78, -142, 64, 102, 66, -110, 54, 139, -113, 21, -8, -46, 171, 1, 148, -168, -57, -48, -42, 55, -289, -304, -281, 148, -80, -113, -131, 13, -45, 94, 6, -148, 22, 64, -34, -49, -157, -214, -102, 254, 106, 7, -149, -15, -62, 242, -250, -121, 151, 26, 175, -124, 203, -125, 109, -109, 239, -132, 19, 254, 121, -5, -109, -25, 305, -139, 65, -9, 28, 104, 287, 71, 198, 69, -141, 265, -7, 112, -230, 45, 14, -70, -22, 3, -98, 103, 197, -30, -86, -70, 25, -56, -95, -85, 22, 119, 227, -230, -257, -450, 166, 120, 706, -257, -481, -285, -90, -373, -71, 84, -53, 525, -151, -43, -200, 261, 95, 397, 289, -483, -342, 682, -125, 588, 317, -4, -937, 312, -280, 256, -238, 771, 1014, 175, 800, 636, 577, -810, -319, 257, -488, -790, 446]
4459D46m7q95L43j11J257k74k09O21p80M32m74J67j282Q17j85l8L55J14p10J59
4479b94P36q71M9M15q0J113n93q84M30k30L51k58O19J30r62Q3R46q89M97k67j93
4500a52o52k5Q50m2p62O64J25m81M55j32L55j36r0M42j356J221k33l63M10l53
4520b55M04p7J86l52n25M35k7Q21q35M87j10l40M23N06r26J62K37j22L59n69J01
4541a7J30O1j07j40K22O2l38K82n13L98j87J73j8J75j52j16j71K88k11j36K44
4562g1j42L38l69L13l27R1M12l58pM7M50j42j11p1K47l30K4o5k47J79j67K37j44
4585b13M22m46J13o1N67l32J30Mn49M57K91l40j06Q1m40M32K59l9k5m54O16m46
4607g9K26q27J79O60K02k28l5o35O56J06j11j18l80P30k86J68j97P20j740J473
$$ y = [446, 399, -496, -153, -264, 993, 719, 510, 1131, 351, 783, 309, 476, -806, 11, -174, -212, 143, 257, -453, -294, 442, -429, -380, 35, -45, 1068, 475, -409, 21, -209, 142, -116, 503, 633, -329, -246, 700, -189, 308, 41, -152, -804, -829, 21, -21, -783, -119, 6, -475, -20, -152, 203, 67, -23, 419, -937, 284, 51, -312, 98, -255, 149, 72, 258, -94, -619, -184, -211, 610, -225, 262, 152, -188, 235, 741, -185, -23, 214, 92, 451, -118, -17, 113, 174, 67, -73, 149, 211, -127, 155, -358, 40, -147, 26, 8, 183, 31, -85, -256, 32, -179, -315, -71, -213, 125, -244, 69, -258, -167, 245, -113, -120, -73, 377, 235, 124, 53, 300, -30, -6, -71, -318, -139, -306, -69, -213, 209, -237, -124, -185, 382, 50, 180, 184, -365, 92, 383, 43, -63, 18, -422, 10, 269, 230, 205, -249, 367, -79, 147, -680, -501, 159, 361, 133, 98, -537, 119, 225, 114, -4, -384, 346, 60, 228, 31, 751, -989, 484]
4627D84k80K13k33k90M93m25JK04j86O4Q5L9l08q6L54l3l63K19n3J93L4l08j27
4650c09K75K32l93K70j76l2K7J18n0l9K88j17j13N10n92j33L42j18J65j24n7K13
4672A87l02K81n4k50K11n25N03j28K22j25N2j6k4R7k24L14J03j96J62l46j36L78
4694A84Q9l29N5J06q1p0J20j75j75K92j40K91m73P63p10O22N14j159M38j00j91
4715a29n5L82l54k74O8l94L03K24O87r55J017r07m55R12J67k0R8r48O08j60j08
4736b93L79M20o10k76N60J94l9k9m29oj47J47n56Q58N64p21J36k15L71m58J010
4757H60j611O00n04J255p09J93l77L86n9p73Q3Q20L94j016K97N35j02p49L04k38
4777d11K69M17l83L94q65J160p35l80M23j07k71O38m26L70R8q49J062p00M84J48
$$ y = [484, 204, 417, 184, -106, 387, -38, -37, 167, -19, 45, 130, 169, -139, -225, 129, 96, -267, -48, -101, 92, 126, -182, -309, -34, 198, -195, 75, -101, -133, -106, 12, -38, -77, 211, 94, -19, 491, -101, -234, 108, -10, 155, 31, -26, 187, -115, 166, 112, -138, 73, -452, 51, -77, 145, 20, 72, 56, 32, 129, -95, 219, 322, 126, 288, -58, -194, 184, 273, -56, -1, 105, 24, -46, 74, -101, -276, 16, -124, 167, -306, 457, -253, 369, 883, -276, 162, 62, -129, -184, 198, -156, -430, -362, -756, -453, -229, 458, -497, 520, -387, -842, 70, 237, 217, 315, -633, -25, -185, -293, 86, 506, -104, -380, 180, 374, 335, 306, -123, -129, -276, -129, -685, 173, 737, 16, 152, -63, 308, -150, 860, -751, -151, -655, 600, -109, 84, -293, 93, 34, -739, -656, 164, 558, -458, -161, 374, 272, -477, -173, -411, -142, 275, -108, 286, -579, 581, -154, -534, -111, -218, -489, 149, -277, 93, 191, -658, 404, -296, 188, 336]
4797C36p93M81J2j75J19j16J6R1l5j52O24l85K51j73k89J69j19J85k7j07M2J79
4819A34j96N6J17j73L4j7M2R2j19K15k13L72j37l01m4K72k68J27J06j14M13k40
4841A58L09n84R9O1J7P1j73N4k61L66J4P5m40M4K51J84n03K31K10n04M56J84m97
4864a78J26P9qK58l54o6r5J96J7J01j81Q0j50J87J09l57j3K41M2J03k11MP9k7
4888a8J07k2j71J38j70J71j90L5J32J38k21L65k12O4k81L15j42j17M5k3Q9M4K1
4911I7j13N4L33m25OKj95M12P0l38K35K2K0K4l02K9P1j23K73J00k55j3j42L4L03
4936A79l77J69j91L45j10j99KK66k91P3R4j55k9Q7r3O24l7n99N41k09k91K78J56
4959B33k66j40q1M95j73J71n23K28J66l12K41J40K7K89j78m82j17M86k93n7M57
$$ y = [336, -457, 24, 36, -139, -20, -136, -120, -29, -64, -216, 408, 23, 274, 101, -188, -19, -138, 47, 20, -87, -45, 134, -62, -6, 111, -62, -28, -45, -3, 89, -30, 185, -28, 344, 207, -94, -138, 134, -134, -7, 99, -15, 398, 158, 467, -117, -18, 43, 60, 131, -42, 12, -249, 117, 131, 206, -234, -190, 61, 245, -258, -27, 183, -321, 135, 319, -178, -52, 27, 19, 277, -77, -143, -238, -42, -25, 76, -105, -25, -175, 12, 121, -236, -249, -8, 34, 137, -74, -70, 9, -18, 89, 67, -104, 34, -136, 35, -155, -120, 12, 150, -71, 294, 82, 146, -135, 180, 38, -79, -34, -57, 32, 76, 97, -16, 38, 371, -54, -48, -46, -241, 171, 241, -97, 138, 160, 180, 204, -98, -69, 2, -121, 152, 252, -3, -16, -158, -124, 179, -198, -29, -220, 125, 15, -184, -182, 84, -207, -134, -40, -195, -224, -137, -230, 394, 357, -242, 299, 90, -201, 77, 233, -33, -173, -254, 241, 68, 239, -284, -56, 110, -202, 39, 179, 206, 495, 317, -165, -282, 204, -89, -146, 311]
4980C11n27J02Q17j427L63N94p52J044o97K09J31M0K69k85m05M96l7J21n31n8
5000b22l53O11l19J018l60j10Mm96N48L7n1P8k80j02K62l21o09R58j75k52L49
5021B15p64K44J12k32O97J013j122n1m17J40M47j24J95m13M24r01J08K85K50k03
5041i7J45J37J81j33j46j56k38K23J96p6n8N8j8K40n5j04l38K49J75J5n15O70
5063C55j70j59p2j82K79J27l31K63J65k33j99L76j54L87m14j60k9l5l2K49j06
5084g5K52j7J66n75L27q10J70M69J53N3k74r7J56K91p87R38m7j50O23j347J73
5105d08P74J02p64N58j30K71j21n59L28r04M22K26N53m49n4j7o8J85J27p3k40
5126b41J28o2p7L40L21m09J82K91o51L1K58K41N5l62K59j84n93K80P59k85o62
$$ y = [311, -216, -114, 703, -724, -361, 233, -519, 525, -172, 37, 168, 208, 477, 192, -213, 283, 246, 367, -164, -222, -575, 36, -283, 735, 375, 265, 269, -227, 321, 358, 307, 385, 105, 3, 265, -56, -665, 293, 118, -134, 215, -549, -305, -193, -425, 272, 1285, 163, 112, -305, -165, 282, 158, 353, -60, 364, -537, -429, -144, 106, -97, 48, 185, 366, 233, 87, -69, -307, -84, 112, 36, -22, 36, 18, 258, 203, 99, -239, 10, 185, 200, -315, 355, 185, 26, -46, -228, 51, 178, -153, 110, 275, 42, -157, 219, 65, 452, 38, -122, -151, -186, -218, 31, -75, 177, 160, 326, -249, 78, -732, -562, -93, 60, 113, -161, -258, -102, 189, -598, 340, 293, 143, 766, -581, -408, 366, 468, -296, 262, 132, 403, 282, -277, 51, -853, -431, -205, 348, -101, -155, -172, -240, -55, 72, -1, -241, -113, -175, -252, 88, 409, 0, 182, 473, -178, -147, 111, 352, 407, 45, 304, 120, -473, -193, 566, 281, -381]
5147c81N10j56L1K85o92L23J90l89P63l98m66N54m0J07n09J92O2K17k52lq2J80
5169D6q2j07K62j43L0J08m57K56n4N2K6m4N9J48J8Ork23K89q4%L24m71L6Q3J86
5195B55l12K29m44l0L66j02q9J80l40N49J32n25J34J34m53J5K64J15K66l35j43
5216a34j08K23J5L27j02j72k64J15L3o4P54m69L57l78n39P60l79k03Q3k75J46
5237b74L74k53O76o99J97l37J64k56Q34q53L67M13j353J124k27K09m32L86K75
5256C35l99K63K65j42l26P7m01N20r1k31K87j85j02L35k06K02j4K14n10K26j47
5277c0K29j40P8N5q2j8j41J6J64j24l2n1N39j60q2j24j62J03J3k03o5K42q5P8
5301A8j80n1k9P9J72L32j29j25k47K01o3k5j62M26m9R3r0j58J58k29Q7k63K08
$$ y = [-381, 129, -27, 4, 289, -403, -80, 110, -279, 484, 86, -380, 174, 134, 241, -268, -76, -14, 203, -49, -52, -134, 46, -36, -143, 119, -24, 6, 114, -343, -87, -141, -89, -63, -107, -48, 100, 118, 124, 115, -108, 181, 97, 97, 421, -50, -14, 69, 255, -57, 172, -272, -302, 64, -38, -127, 53, -287, 262, 394, -131, 3, 137, -316, -301, -37, 78, 344, 9, -134, -242, -19, -4, 323, 221, 49, -215, -100, -67, -131, 623, 154, 511, 133, -406, 354, -25, -228, -145, -420, -274, 100, -153, 523, -176, 21, -316, -152, -408, 426, -427, -60, 353, -1000, 124, -103, 106, -326, 60, 335, -64, 199, 464, 322, -4, 73, -328, 192, 101, -130, 157, -28, -130, 205, -1, 201, 187, 401, -109, 117, -30, 199, 59, 137, 192, 110, 92, -49, -33, 131, 7, -25, -76, 463, 303, 221, 97, -65, 38, 51, -152, -217, 25, -60, 18, -162, -213, -242, -163, 9, 341, 212, 87, -160, 41, -22, -47, -209, 217, 168, 261, 171, 13, 171, -58, 29, -234, -26]
5324b6R7k22J81n3lJ24l09J31J67j47r3J99Q6j5l20J52k6k3O1j13J25j14K62j26
5348eJ95k82j33K40J08m21L63k90L37K9J24l83J01J00j79J25k1N6L7n8j35J92
5370A00l58L95l5M1j46J07n6l65L80j45L00N0n82M56r2j95j6J89L49p62N7N24
5392A96Nm05R65m22j257J563j019k75N74j80O9n14R46J52p22j0L98L75o76K48
5412A1O2o73R93l56j47j43J12k5r63J208l9M16j24o77L04L21j93J018j448L74
5432C1K45n45N0J99L08k83N35q31J53K95r0j31R2J77k57j44J49J93j97j6J82j72
5454e7m29Q47Lj35L87o21J14j52q1n41J141j95m52O08J64r85K20jK47o75o5O58
5476@J60l57N52l90J1J00j34J17j48K80m33N39k89P7j92KJ4K11j09K31l72J02
$$ y = [-26, 71, -151, 30, -23, -26, 98, -211, -80, 87, -60, -153, 46, 132, 117, -203, -51, -77, -100, -39, -152, -27, -141, 121, -5, 190, -92, -225, 15, 123, -298, 65, -225, 112, 141, 265, -118, -17, 83, -96, 29, 8, 64, 101, 43, -92, 100, -258, 137, 102, 143, -3, 104, 48, -317, 63, -82, 218, 268, -314, 142, 50, -145, -161, 28, 377, -385, -328, 196, 201, -204, 761, 339, -918, 645, -374, -649, -75, -255, -186, -700, 246, 398, -324, -334, 64, 439, -237, 11, 73, -600, 393, 37, -110, -253, -141, -166, -1129, 79, 40, 456, 332, -345, -41, 280, 87, 1105, -343, 31, 276, -269, -219, -20, 288, 5, 540, -291, -138, 157, 67, -64, 28, 205, -52, -196, -47, 146, -51, -67, 115, -57, -486, 361, 364, 229, 616, -5, 109, -43, -124, -665, 476, 281, -171, 437, 601, -384, -164, -165, 82, -593, -658, 0, 160, -197, 355, -35, -24, 76, -58, 59, -89, 191, -242, 297, 8, 85, -107, -105, -91, 120, 11, 242, -130, -28]
5498b8J91l64J68j0K0%k00L50Q4j14j29J35o1j06K3K00j92R4P5r4j69J46J54j25
5522D8m43M24j36L84j18k28J00M9j01n2p8J53K81P6j76l64L31l29k7M34q1l53
5544b06K9L32Q2j88j60q1k7m4O4o2K33r5P4R9j08J50l2l8l81L60n7L7NkL01k56
5570B9j59J6J90o8rjK0q6K18j27J6J01J74l68P1n8J62o7K82l09K4P5j39K46l28
5595i5o8L51j81O6j07lM4m7q9N0p5n8K79k38K81J9q5j14j05L17P6J7m14j3L44
5620A52j15j70j05K14K4J09K25k08J00kp7m5J5O0l29K65k16M48k34J83l7p05P85
5643C37o62K65m04P62k78l56K36J44m35M36O47r58O28j3o81N06j65J68J03Q8o02
5664b34M59k89k71Q95o02K94n80M80l8P6k47n4J80k8K3j02m8P5K18l03K48r2k1
$$ y = [-28, 163, -201, -33, -43, -23, -23, -223, 127, 211, 97, -32, 103, 42, -64, -41, 159, -33, 61, 136, 42, -127, 19, 173, 48, -395, 29, -107, 277, 159, -69, 31, 80, -21, -73, -151, 2, 283, 359, 183, -181, 150, -179, -206, 228, 147, -206, -177, 155, 237, 49, -111, -192, -219, -263, -199, -261, -28, -123, -49, 50, -58, 92, 60, 22, -359, 1, -56, -19, -14, -16, 285, 29, -130, -114, 76, 8, -1, -2, 18, -68, 150, 23, 39, 140, 314, -54, 17, -41, 121, 54, 336, 27, 51, 126, -13, 233, -95, -163, 188, 7, 73, -34, -37, 7, -40, -129, -79, -154, -212, 67, -171, 110, 129, 44, -70, -175, 142, 218, 235, -179, -192, 152, 37, -133, -238, -24, 0, 109, 334, 126, 226, 224, 147, 102, 117, 177, -152, 113, -103, 345, 111, 294, 257, -448, 337, -325, -60, -464, 298, 20, -336, -100, 44, -391, 45, 692, -266, 362, 349, -332, 174, 9, 177, 280, 368, -234, 225, -64, -335, 560, -42, 252, -328, 152, 114, 190, -57, -111, 69, 41, 64, -38, -86, -11, 207, -96, 152, 60, 39]
5687C9P8p6kl31L75j49K12l7n81M71J43j63J72l78J37M9l0j32N04n00J86j00L8
5710g5R2j27J13O9j41J68j88N1K44n9j74QJ38k41J90j11j9K37K21m82J11ON2O
5734H9K6j16k56J40m1K28j00J42j22Q3j3r3j48J18j40J88l2p1j11J31J68p8J30
5757A22o3k32K59k40J79J86l36o7L99k26q2J56j76Q1L5K1j93Q8J4k9j06J53m6
5780a03n2J92K3k76J96k37M23J02j49j31q2q8K26j16O3K2K85l59o9K73j54J10
5802I9j79J05j50J05J81L9j68l4J04RJ12j83k3J6L6N4k27O3k02K98oj69L22l15
5826a13j44O58n49J46j60J18K3M8J63j42l11L31J4j11J17l98L74q6J53l43K88
5847G6k05M3J42k10J5Q6p6K69l23J52lk16L35l8j3j31j54L89J35l75J63J3k81
$$ y = [39, 117, 41, 39, -292, 83, -66, 146, 109, -472, -1, 142, -21, 151, -227, -90, -41, -71, -203, 301, -199, -13, -113, -75, 17, -110, 3, 72, -69, 99, -89, -38, 206, 147, -27, -19, 119, -122, 68, -43, -62, 175, 396, -86, 25, 31, 83, 89, 115, -1, -257, -117, -158, 70, -30, 112, -10, 73, 60, -33, -181, -63, -203, -15, -47, -118, -229, -98, 70, -8, 122, 59, -173, 86, -154, 25, 211, -125, -192, 207, -19, -101, 55, -121, -40, -5, 16, -177, -89, -75, -104, -210, -57, -103, -155, 37, 60, -216, -20, -257, 166, 268, 119, -12, -94, -182, 44, -72, -9, 13, 298, -61, -130, 143, -11, 99, -80, 25, -125, -20, 161, 200, 32, -2, 102, 111, 223, 40, 17, 33, 69, 123, -104, -41, -243, 55, 49, -120, 202, -113, -257, 401, -148, -2, -162, -44, -21, 27, 190, 48, -263, 68, 82, -29, 88, -310, 64, -22, 131, -212, 76, -129, -86, 56, -154, -139, -53, -129, 140, -183, -31, -34, -250, 85, 47, 34, -97, -251, 138, 273, -102, 61, 74, -207]
5870b07M43l67j97N08j55P3l51M48k05J07l4p7K08j67k7r5J88k10J28J5mj06n3
5893a37O2M7K36l26L39m11L6J69j54Q2k07N36m23K52j99o3R3J47j32k5N9R5j12
5916c6L5J49j6o6lq7j3O0l38J65J64l0l40K52n8L48Np2L2k73K5J08j91K24n6J54
5942A42K6k33K13R9j16J71m7k26O7n0J99j94m3R2j3K1K7o7k6l3l9Jl7K24j64k77
5968b83M21m13L41k83m5L79k41K56O6J61o50K74K17m87N04r0j88J57m1k47K01
5989IL27l28j69K67l71N28k69Km3k00K99j27J60j47k22J95J54P9j00k32L07j58
6011c9j07j04K14J05j45L42j43k00O5m1J96k79K59k23O7o5qOj4K12k25L51j53
6034G1j24Q8l2M6n1K08j85R6J2m8k12jL44k43l72N70K47m94P30l58K04m50K59
$$ y = [-207, 236, -131, -328, 180, 25, 98, -253, 195, -10, 97, 63, -14, 194, 27, 0, -95, 93, -117, 11, 26, 22, -84, -137, -75, -28, 208, -118, 221, -190, -154, 15, -139, -57, -264, 272, -151, 101, -98, -161, -68, 79, -53, -78, -19, 76, -36, -1, 148, 132, 66, 63, -24, -37, 23, -315, -150, 14, -16, -356, -104, -162, 186, 191, 119, 151, -122, -97, 11, -180, 44, -12, 142, 168, -65, 148, 247, 131, 302, 255, 29, 96, 46, 245, 51, 8, 100, 87, 108, 135, 68, 42, 9, -30, -29, -66, 158, -6, -283, 138, -275, 66, -217, -262, 117, -124, 132, 198, 359, -291, -17, 200, -287, 217, 127, -61, 96, 55, -192, 9, 336, 8, -161, 106, -265, 263, -6, -4, -47, -247, 52, -75, 85, -62, -284, -89, 65, 144, 44, -188, 119, -39, -146, -250, -36, 69, -76, 266, 123, -77, -12, -53, 143, -136, 123, -100, -33, -98, -106, -100, -114, 98, -127, 224, 71, -53, 35, 3, 49, -2, 206, 21, 117, 129, 81, -131, -132, 212, -31, -403, 167, 414, -80, 650, 292, 496, 46, 305]
6057C05l16P13p26K82k72l28L36n8j27L80m55K46P55q93M26j54m0l39N90l35m40
6078d50Q90l01j22m5J9k53P29m96k83K41J59J9r8J35k69K2L55k36k15K64J17k84
6100a02J20j0Q6k16J70Q8k76J40m6K13J42k33K58j79j34j08J20n1j8M3j45J7K28
6123A07p8J39l8j73O7j59J25j14L32k78K7J75j83K14j19N0J6j19R9J24k04k74
6145b64J78q4L8L20k99K14j68l10K73j8j51M31m2o3j90OkQJ75j33O5J45K3k78
6169a26L10J9j83J85k31Q5J38j75J73j23k90K44k75r0M38m72O88j45n19k25Q76
6190C02j96j98M07o18K98j86R9O3J22j03j35j40M24pj00L58m33k30L09J99j98
6211C7n6J53j16j43J44j24J36k55K21r6J59O3l24M92j44P4k31j50J73N8k27P7
$$ y = [305, -11, 702, -24, 258, -14, -342, -6, -64, -191, 189, -266, -20, 735, -158, 268, 114, 74, -265, 325, -10, -450, 440, 139, 17, -28, -9, -262, 467, -29, -312, -71, 88, 107, 9, 144, -125, -103, 252, 16, -199, 65, 182, -102, 18, 8, 94, -122, 48, 136, -140, 0, -46, 167, 309, 76, 334, 155, 21, -87, 33, -18, -36, 7, -138, -121, 107, 29, 168, 130, -43, 24, -135, -10, -124, 208, -70, -43, 132, -51, 163, 44, 94, 110, -9, 90, 214, 10, -264, -86, -170, -132, 188, -111, 103, -65, -375, -102, -120, -271, 160, 118, 55, -135, -129, -131, -123, 52, -81, -16, 129, 152, -126, 184, 203, 20, 205, -26, 59, 197, 22, 195, 72, -218, 26, -249, -339, 99, -373, 315, 170, -349, -574, 302, 106, -92, 315, -303, -5, -191, -92, -29, 93, -10, -145, -285, 139, 132, 32, 390, -43, -273, 36, 235, 37, -19, 134, 18, -125, 19, -105, 31, -224, -3, -99, 60, 123, -201, 291, 147, 221, -10, -160, 13, 71, -156, -79]
6233g9k4J65l79mL63L53q38L44j22J54K75K4j35j65j59L20n8J25n9k44k47K18
6255a72M55k85J12j64J41j46J37Q1m4j93P8j62OJ36o0M0j29J3L25l37O8L05j91
6278A4j46m7M2J32J55j21j45J01J69N7pj8m36M30j61q1J03o8p0q4J60L6O4l96
6302c17K37q7K89j59q4K69J22k75j78M2J22L52l51K6p7k63J75J73N7q6L4l2l20
6325c31M47j22J75N3k11L03n58r2O10m22M60k53j06R1m1K54k25j69J33L03o04
6346c05L40k90L73R7j10p7j3k55J71J39j44K54l23mJ60m3k09O00j99k43j27J42
6368f6J35k39M2J64N1j92J12l0JJ02K3j01p6Q2j88J29M3j04M0K75m29K93l4J32
6392A65k12K16Oj58M1j35J10L4M7J42n8k57R9j07L9l8K01j28J86l14J85j61K08
$$ y = [-79, -103, 62, -317, -321, 42, 395, -443, -99, -221, -67, 208, 232, 97, -68, -227, 93, 35, 160, 101, -143, -390, -172, 283, -2, 110, -54, 87, -59, 78, 159, 115, -78, 0, -162, -156, -20, -80, -40, -169, -156, 169, -168, -100, 205, 14, -132, -179, -137, -5, 150, 29, -116, -15, 154, 211, 204, 186, -250, 180, 19, -62, 41, -27, -97, -181, -21, 15, 79, -317, -80, -167, 122, -37, -121, 148, 270, -5, -183, -141, -19, 333, -18, 8, -69, -332, -157, 16, 73, -13, 21, -11, -331, 116, -6, 169, 222, 11, 314, -244, -336, 274, -148, 312, 59, -47, 44, 3, 257, 32, -137, -4, 299, -305, 35, -255, 118, 215, 105, 28, 15, -240, -69, 70, -74, 180, -143, -147, 13, -30, -239, 361, 162, -81, -208, -66, 69, -170, -128, 36, 87, -105, 7, -23, -22, 80, 103, 2, -74, 8, -180, -51, -8, -112, -72, 203, -226, 67, 33, 165, -47, 169, 175, 17, 58, -77, 33, 67, 114, 256, 198, -59, 40, -67, -28, -66, 135, 7, 193, -121, 64, -97, 111]
6415A11j12n6J96k16m6q1n2L64M2o5j88J11q0K35m03J50J57K2J10k7j38j97J95
6438C2j64J12J06p1K9l56K61K31j33k25q3N25k58j0K1J62j88K8p6j48K66j01l07
6461c47N38j00j10J60l50K71k91K36l51J43K14l3r7K76k82j9J93J6o7l4J20pk30
6484a51p8O1M13l51K8rO2J2J25k89K67J81l11l51N39q74Q49J2l18M2N17M8p46
6507c22n54L32M57K7r8l69O61o35M25P1m7j02J67j20j12R6J07Jj5kJ88J16k64
6530Hl9J73j13j11j96J77J95k56K02j86K22j98K13q7q7o4O4L51j05m9q0M1n5K7
6554D7n6k3J03j51j90N29k43J10l78O6q6M30K2j34j09J80m0j97L80l57K79k65
6576h3q5K32Jn2K7j03J5K40j76j09J13K8n0N4N2kl84L13q1J79k89J76N3QJ19l60
$$ y = [111, -1, -57, 139, -77, -123, -204, -256, 108, 150, 85, -103, 8, -72, 163, -240, -90, 67, 89, 199, 172, 34, -163, 32, -132, -20, 86, 15, 44, -312, -51, 180, 47, -178, -261, 264, 6, -4, 17, 179, -9, 19, -57, -205, 61, -40, -347, 191, 91, -19, 141, -209, 62, -229, 7, -344, -201, 13, -20, -117, 159, -123, -142, 51, 67, 0, -34, 86, 79, -151, -229, -168, 245, -106, -78, -87, -25, -13, 112, -177, 90, 271, -40, -391, 148, -726, 123, 135, -183, -141, 376, 424, -322, -876, -544, -87, -60, -158, -527, 134, -501, -76, -5, -52, -154, 13, -107, -219, -123, -16, -15, -30, -32, 156, 272, 8, -31, 142, 29, -82, -278, -101, 94, -162, 40, -146, 76, -122, 91, 4, -83, -147, -83, 268, 163, 114, 34, 75, 20, 47, -9, -32, 71, -80, -270, 259, 16, 126, -252, -186, -272, 158, 180, 46, -63, 117, 77, -120, 260, -97, 182, -83, -168, 64, 65, 13, 40, -63, -48, 192, 16, -93, 20, 48, -2, 52, 104, 102, -282, 31, -50, 129, -160, 16, 69, 77, 196, -164]
6602a64j6rL64l64L22J47n10N1P7N1O6P3m2l05O51l65N3j52O4P0L8k76k7r1K61
6627c3l0j63J65k8K89p0M4j27K0o9J23k18K27J67j14m12P41r04Q36o28k4L50p86
6650f44R83m01L40k48L16n60L12p1j42J38J8K5p0K00k83J70k9k68K99Nj21j72
6672b03K37p2J41m75P0J55K98j83Q4j95j86L73o3L5j21kj24M11p2M5l38J44K70
6695B29l35N0Q0J17l75J47J13n7J89L4k75j28K62k0O8o4q8p2J85J0q7J8m5k5J41
6720G2l78M69j12Rj51j44j26j32k05Q41k69m65L67M78k45K06o13n53M72Q25m58
6741a12Q47j160J01M7K7M60M94j295L38l77Q86q84K37O37o86M54k51QJ7k63Q14
6762C39J25Q81q79m48rp27L60O01q19Q90J65l53n9j236J525j25J89j285mM89k56
$$ y = [-164, -180, -189, 175, -189, 133, 280, -230, -179, -102, -51, 15, 88, 46, -259, 392, 27, 80, -72, -8, 62, 100, -176, -203, -294, -33, -63, -226, -61, -89, 200, 130, 174, 47, 67, -2, 121, -97, 130, 297, 183, -229, 512, -392, 444, -184, -208, 142, -644, 339, -62, 278, 30, 346, -214, 98, 27, -115, 23, 41, 66, -4, 196, -87, 83, 54, -214, 85, 90, -31, -203, 34, -38, 103, -372, -302, -147, 151, -32, 52, -143, -329, 44, -19, 16, -105, -107, -231, 180, 108, 153, -185, -41, 229, -106, -56, 24, 141, -234, -87, 26, -31, 158, 192, -83, -211, 51, 31, 99, 35, -53, -125, 60, 70, -17, 1, -44, -69, 72, -306, 163, 51, 60, -91, -235, -361, -493, -698, 143, -126, -591, -224, 254, 9, 215, -398, -951, -479, 346, -112, 735, -425, -324, -277, -250, 210, 704, -591, -253, -630, 256, -628, -391, 246, -440, 14, -237, -229, -212, -475, 339, 464, 1345, 466, 18, 9, -718, -358, 243, -576, 314, 479, 126, 67, -1169, 356, 231, 420, -865, -869, -380, -636]
6783f36N25l65Q88L4q83L80j4J046j092k2P0J83J96n41L46m58NK8J82j5r3l1J2
6806b55j38O72j064N55K02k79P9j29L12j0k39J37M33k3L09n97p7L40j68j07L74
6827C27j92k17K02q37N36Q2L45k82Q88l27j144R10L67k02j089J226J27q51r2N31
6847C08j77k1L7n89n7Q26l85M35o2P5q87L96K51L00j172L1P54k92m96O82j12L50
6869A95r5P5l25n6N44r32J94M70K89j419Q48n77M68O00k76j77P9k17K16l2k46
6890c74P98n62M17l45l4Q8L61l09k84L77j49L7p11J57P89j64k81M1R94j153Q40
6911E33m9j001R12k11k68j5J86k39n83P61J06L30n71k16K64J72l58k3L20J67m09
6932a92L54k50L45n4p08N01K16r05J92O90k22n1J82J09k38J76K76j24n94J91j07
$$ y = [-636, -111, -476, 412, 446, -437, -57, -71, 975, -117, -139, -69, 114, 310, -231, 115, -343, -338, -310, -128, -143, -236, -267, -255, -393, 279, -785, -230, -28, -307, -228, -357, -45, -55, -294, -157, 276, 253, 562, -35, -112, 228, 60, -47, 327, 135, -82, 120, -717, -181, -99, 246, -36, 852, 525, -619, 291, 658, 456, -633, 593, 720, -131, -223, 308, 131, 110, 147, -442, -499, 327, -58, 377, 315, 390, -497, -101, 150, 450, -722, -691, 63, -229, -725, -43, -155, 195, 100, 175, -150, -206, 338, -594, -400, 70, 359, -1060, -212, -789, -321, 279, 3, -174, -95, -312, -96, -128, -374, 424, -138, 279, -66, -100, -12, 349, 40, -244, 133, -16, 21, -690, -533, 256, 92, -189, -148, 846, -307, 533, 484, -517, 395, 184, -84, -99, 87, -152, -735, 26, 132, 462, -109, -325, -61, 111, -247, -270, 50, 217, -192, 162, -88, 257, 203, -505, -4, 212, -693, -501, 189, -33, -84, 98, 207, -31, 145, 421, 297, -297, -106, -213]
6953b13k62K99J21l05KK90K60j26m3n4J35l65K89m5J64j35j94q6M05n61j63O30
6975D3k62n00N35k97K48P04l02j52J22j37r5N94m76j7j13J17j39J52N6j76J01
6996FM0J2L9K7m0j65L9Q3j50J09M0p9n6O1J63j37ml4J11j5r7j30N21m05R3m3q0
7023i1pK69j21q4J3j47J29K28l57K30p1J39j08l68K62K02p4j05j17J42m2O4J72
7046A58J21k62J59j61Jm46J31O7k02K57K11k4Q5o1n20Q23l45o71M25J66j94K35
7068d7N32q99J66L08k15P8j58m79P15m94M64M41K97k06p71O1r8O82m15K12l90
7089b16K82K96n81j19M01j85o49R89o80L66k2j69j47P39k10k92K82J17j03K45
7109C44q93M8Q22l73p98P00j39J4N45l81j15N57p85k7M02n8L55q58M99R0J31L87
$$ y = [-213, -475, -176, -55, -360, -358, -68, 192, 66, 23, -31, 104, -261, 28, -17, 147, 12, -182, -268, 137, -424, -587, 43, -219, -719, -184, -481, -233, 471, 169, 17, 139, 2, -93, 501, 25, 8, -105, 12, -127, 25, 81, -95, 6, 46, 58, 97, 124, 84, -81, -42, 41, -109, 0, 40, -39, -95, -34, 129, -8, -12, -46, 65, 50, -47, -177, 344, -61, 32, -11, -91, -98, 171, 50, -34, -21, -168, -39, 189, -168, 62, -9, 130, 22, -346, -84, 118, 44, -61, -178, -36, -78, -14, 158, 279, 17, 176, 15, 16, -430, -299, -232, -434, -177, 34, 10, 95, 34, -486, 337, -8, -679, -254, -88, -282, -47, 485, -414, -248, 60, -155, -77, -235, -714, 1, -493, -29, 412, 709, 503, -268, -207, -305, 377, -38, 174, -216, 66, 362, -219, -338, 63, -122, -771, 218, -462, -96, -118, -287, -434, 305, 95, -197, 85, 202, 99, 344, -549, -501, 321, -52, -850, -150, -289, -275, 270, -111, -226, 331, -454, -481, -79, -137, 218, -640, -141, -51, 80, 467]
7131D67n83q8L74j77o28M20M20o8k39O81m09k32J67n04K54K01Q7Q2J64k34k24
7152f9r0L52j32k96K75r23R92n5k62j111J434o28K41N45n7m91o7N81o84q20J253
7173a2j47J110j397N62K00m94J032q70L75r02N57p37Q03n37p2K96K7K00l64k14
7193e84J086M39r90q25J567m58k8R4o75K57k23M31n98O79O79j103R86q62l33J44
7213c17j96R98m29J24n6j37n94L03j88P02m6n15Q75o86m05L30l72N50Q2L30r73
7234f20L20M00l01k28R86j076j09R90j102R57j112K52K72m66J151k52l18O31n00
7253a25M10l48L4m42L2J22K39k16r4K45M19n99M13l2K83o14O94m58N27n38M6l99
7275d01L42K66k4j68L01rr08N62N39m57K20o9m96N97m0m39p1O48n65J00K40j95
$$ y = [467, -116, -204, 170, -7, -635, -215, 205, 137, -102, 579, 170, -62, 105, -399, -145, 56, 143, 225, 389, 155, -69, -159, 193, 61, -235, 40, -883, 109, 54, -208, -1319, 115, -513, -272, 273, 216, -275, -342, 239, -445, -1265, -12, -159, 951, -446, 116, 316, -178, 854, -16, 359, -543, 14, -723, 80, -457, -529, -233, -206, -6, -370, -584, 502, 941, -49, -874, 693, 235, 207, 301, -374, -117, -340, 91, -507, 172, 851, -252, 734, -128, -461, -317, -513, 485, 56, 180, 124, -13, -607, -304, -492, 210, 164, -351, 524, -162, -567, -237, -609, -59, 23, 353, -620, -300, 100, -201, -429, 557, -519, -628, 362, -740, 217, -895, -643, -371, -837, 314, 62, -256, 375, -125, 285, -63, -29, -471, -439, -317, -78, -294, -388, -143, 276, -323, 90, 58, 341, -273, 421, -37, 490, -48, -2, -401, -59, 207, 183, 15, 316, 307, -601, -39, 500, 43, 263, 194, -302, 295, 255, -184, -255, 393, -172, -72, 168, -27]
7297b7m0j05O49n49J072j004j43J017p71o0m25K62k88J165p67r6M58k89l74K44
7317g1M09N25n02j85r3p17Q64k09l08m99M87K8O39r74R81j126O71L3r9M75l92
7338f3M46L6k70J61n84p08J104N05j053J34J075n82k27n27N48R6l72M69L14n81
7358g9JJ26l2K75o25L8K12j55L82k8J54m69j46j42J147o15J71p43N57o7M63J74
7380E99m07K66p94k09K40N26n10M54L02o57LJ27n2q7M07Q7o69K24J8R4n5R2j22
7403a23K14j58L10o3j63r3l29N76j81J86k54J52q4K46l06j63j27N30L46m41n9
7424A6k01K49o6j71LK33j49n3Q7K30L1k41j2j10R9K26n24P41j22q34Q6O20n50
7447d12L59M84j166Q31j74m70j23P97p62O09p20j56Q76M7K38N04n56n13O71r83
$$ y = [-27, -67, -172, 477, -72, 1000, -4, -147, 870, 99, 39, -386, -124, -412, 753, -14, -110, 348, 59, -315, -71, 338, 863, 361, 176, 83, -634, 230, 21, -287, -786, -299, -271, 368, -606, 375, -751, -80, -47, -146, 329, -63, 383, 419, 149, 310, -274, -982, 122, 627, -426, -292, 783, 201, -26, -553, -5, 91, -281, 188, 502, -79, -78, 48, 16, 291, -334, -296, -84, -239, 143, 115, 269, -200, -346, -488, 659, 44, 215, -528, 29, -38, 425, 599, 192, 458, -336, -545, -305, 221, -289, 165, 467, -190, -187, -60, -112, -199, 208, 295, -374, -150, -132, -38, -93, -1, -123, 91, -67, 243, 180, 17, -76, -405, 171, -10, 176, -78, 74, -10, 236, -70, -233, -360, 170, 516, 75, 16, -185, 64, -2, -173, -170, 63, -86, -139, -52, 178, 209, -32, -44, -154, -55, 171, -353, 388, 266, -568, -482, 138, -412, -53, 431, -735, 96, -78, -548, -671, 126, -636, -27, -747, -903, -27, 20, 258, 762, 206, -307, 364, -619]
7467f19O33l20J76Q6J26J8pJ93J14j001L4M33J56K1K70k15n10K28O6n36J026l60
7489A2J41J30k77M08l88J21q52P94l59P23j68j93N2m87O36P6l96K74k95M7L03
7510C02L09m91l94M13J03r8l49N06l71j11l25O19j14l10J81J78J68o89R36k25
7530B38M50q41P35m81J98m18q7o10J114j131N69M95q05J05k46J309j307L77k87
7549f23R15J95m43N7J27j72L63o81j86J23K5l75N42M09n11J65K6L13j96r8j24
7570a49M02l13p0J42p8o1P7k8J16r4P1J7K0k31J19n6j73K14K6N4J04j89K10m25
7594b95K54o0J95R4k26j57L48o7J22l09K75k61q4J72l0k4K12Pj93R7k82L81k49
7617h0J85J72k49J75j92O8k64rqO6LJ61K8j05p4j27L57k72Q7QJ03k0J82j32o5
$$ y = [-619, 14, -306, -130, -44, 82, 100, 93, 286, 400, -601, -567, -134, 22, 43, 313, 98, -412, -184, -118, -654, 372, 12, 153, 283, 6, 414, 26, 147, -705, 89, -270, 453, 285, 92, 144, -343, 293, 369, -27, 247, -48, -1, 302, 611, 120, -274, 139, 242, 144, -205, 301, -70, -181, -506, 113, -1, -311, -130, 48, 216, -473, 463, 238, 688, -153, 582, 101, 299, -119, -206, -816, 298, -833, -264, 231, -574, -469, -715, 594, -713, -336, -623, 292, 487, 44, 101, 228, 56, 419, -262, -448, -325, -300, -675, -133, 276, -235, -70, -44, 269, 73, -25, -149, 253, -60, -130, 12, -66, -127, -50, -78, 38, -56, 15, 32, 52, -179, -60, -116, -289, -75, -49, 5, 109, -80, 130, -295, -41, -101, 94, 188, -38, -195, 153, 86, 208, -101, 174, -87, -171, 1, -29, -53, 159, 166, -27, 70, -212, 169, -80, 105, 277, 28, 203, 11, 79, -185, -194, -202, -136, -133, 28, 56, -49, -123, -250, 107, -165, -78, -70, 33, 13, 195, 63, -2]
7642bj76J96Q7k11L85l67R4j31j82J13K48J24k82K06J22k88Q1J3NR9j54J01k42
7665a61P7k3l56L71r8J18J99j09q7o3OM10m85L16j02j48K68j26q6QO4R8j26mo1
7690a00K05j11j1K9k45K88m7J49k71K20k03j59L85l11R3J19J63p7j96K26k90q5
7712b29K73j04p3K49K5j10k53O8K41l80K79k27K81n0j4k84M48l2oj13p3J07Jn
7736A9j19J15J03j68O0j43PJ80M3j06J29M2q5J63j21j82J36l26K79K6l20K68J67
7759A67k54L0q2J15R1J61k08R8j08K14j15k10K27j27K0q4j33L57k26L72m83K7
7781a51O1J65r3J06N0l64L71l55J46N8J11l06K68k19M5M3J86j48J04l13L09k64
7803a90K10l5j44L45j30o0J9m9L3o2jJ68k75K94j9k09KM02k64r8J37O1N3k48k07
$$ y = [-2, -178, 18, 105, -106, 279, -88, 6, -125, -307, -194, 54, 178, -104, 102, 224, -64, 17, 30, 35, 134, -20, 81, -161, -84, -107, -463, -92, -190, -72, 127, 18, -69, -132, -126, 284, -201, 115, 13, -135, 133, 7, -79, -71, -7, 91, -35, -39, -100, 105, -6, -17, 12, -233, 55, 8, 157, -114, 106, -97, -256, 129, -182, -89, 30, 193, 116, -80, 146, -144, -229, 44, -60, -133, 116, 141, 31, -222, -154, 87, -293, -14, -241, 40, -10, -24, -308, 140, 108, 102, -11, -84, 23, 24, 19, -100, 15, 118, -50, 10, -133, -126, 54, 97, -9, 120, 162, 77, 240, 119, -63, 73, -253, 26, 52, -268, 0, 167, -87, -57, -139, -24, 67, 228, 20, 118, 10, 224, 109, -101, 126, -1, 19, -65, -198, 159, -67, 305, -178, -151, -90, 75, -18, 88, 138, -226, 145, -210, -64, -6, 105, -201, 67, -152, -107, -64, 122, -26, 78, -235, 74, -190, 20, -15, -159, 186, 56, -4, 15, -34, -1, -63, -64, 104, -171, 123, 104, -105, -103, 299, 35, -63, 74, 135, 188, -60, -267]
7828b67K52M43l66j39P7j85J75r5j69K99J18l21J93J12k25O1K28l76J63K2k5K0
7850ej05J9L21j71M7r4q7O0n3K39l61P7J81j28K1j36K18K0j01qj91%M3J50K21
7875A77j14j11J71k27J72j68J17n9J22l0L0k11Q4Pj24J53k51L09k35l1K35K80
7897B96m13K36m16L2O84m25j13r3L45M8Q6m45M9K68q9j01J94j12k60K08Q7k10
7919a44M45j50J69k1l84L14p0m92K77L89m53M05n60K98j33K98n07l62J422j346
7939f05N12j80N83L38j060R26k05m25O59l93r40R37l28N4J7l11O30m19k8l27p7
7960f42Q18l95M27l71L87p2k3L8n34K27K31n0k21K29q7q9RK0K06j35J00n1j06
7983h4n1r8J72J53j06K34k14P4l7rQ2m7m16M8K87J1Nr9K04r3j42J64J72l75J86
$$ y = [-267, -15, 428, 62, -77, 0, -185, -10, -105, -274, 25, 143, -178, 15, 127, -98, -37, 191, -185, -22, 0, -25, -5, -110, -91, 230, 59, 106, 12, -75, -15, -68, 171, -190, -113, 68, -60, -39, -175, 43, 63, -38, -46, -237, -237, -194, -44, 177, 63, -48, 123, -104, 68, -100, 17, -42, 80, 50, 80, -131, -47, -40, -164, -11, -262, 47, -188, -219, 16, 296, -117, 119, -297, -265, 419, -6, -119, -212, 133, 181, 267, -178, -129, 139, 50, -51, 143, 31, -229, -21, 66, -144, 301, 151, 320, 299, -85, 229, 159, -333, -56, 333, -120, 285, -275, 23, -110, 188, -319, -681, 741, -605, -93, -273, 310, 648, -412, 514, 309, -116, 543, 150, -790, 147, -181, -127, -110, -421, 209, -210, -238, -565, -642, 176, -219, 208, -163, 224, 152, 129, 167, -367, -140, 91, 41, -180, 49, -38, -127, -118, -98, 108, -27, 73, 22, -84, -135, -233, -61, 92, -14, 220, 6, 80, 43, 34, 116, 69, -347, -299, -12, -1, 4, -95, 109, 16, -126, 38, 210, -165, 21]
8008B1j18J05l5q0J23j28k9M4r8J86j34K01r9J88j65J11j7k77J69J56Q2k55k9
8031g8J91o1J00k49j77L03J37m7j01p8j72L65j25p9L6j12K45o2o4J48r1J46m07
8054b32M24m30K52J2K5j40J90j16Q2j17J6KK41j62q5k4J57o9m9K64j39J2K33l80
8078c3N2k80N48k38K31k28j3Q9j46N5m2j70K57o30N68J42q98R53n13M29o71J329
8100G91q39R6R16j308Q2L68l48J91m44l6P90m06N17o21RL10k80K17k94L11l26
8121c04L52j99K37p6J49j66m8R0P8j87J51p0k40J6L11q6k43p7L07p2J00l91J03
8144b65q7K57p91J211j068N15M73l90R9m9K40k29qM5J17k82K61L3n2k1j6n9p4
8167a40M19l23j55Q3l4J99r3mo0M36M07j078N28m95N59n04K07l17M69mO2j55J49
$$ y = [21, -97, 8, -27, -107, 16, -112, -141, -97, -195, -9, -143, 58, -41, 147, -18, 93, 76, -201, -32, 124, 206, -49, -78, 113, 52, 152, -97, -274, 29, 166, 119, 18, -60, -232, 133, 8, -71, -35, -147, 98, 36, -28, 120, 29, 175, -232, 192, -238, 14, 26, 51, -89, 101, -15, 67, -50, -34, -32, 209, 47, -38, -62, 95, 26, -23, 241, 102, 114, 347, -33, 19, -261, 287, 49, 280, 52, 39, 128, -18, 37, -5, -175, 82, -548, 20, 162, -736, 217, -296, 133, -538, 791, -48, 48, 964, -344, -262, 106, -242, -51, -495, -531, 259, -147, 370, -251, -242, 68, -212, 5, -289, 22, -304, 48, -151, 86, 10, 159, -7, -55, 35, 113, -74, 77, 7, -233, -217, 94, 8, -235, -312, -5, -77, 23, -368, -265, -352, -95, -886, 325, -743, -228, 245, -145, -46, -95, 145, -84, -92, -47, 70, -212, 49, 82, 30, 9, -7, -66, -140, 279, -44, -199, -116, -150, 49, -44, -48, -108, 328, 735, -343, 185, -310, 249, -255, -48, -365, 104, 100, 162, 7, 156]
8190A56o9
$$ y = [156, 87]
8191H7
$$ Imaginary data points
##PAGE= N=2
##DATA TABLE= (X++(I..I)), XYDATA
0@%%%%%%%%%%%%qJ6j6J6j8K6l2M0m8N6p0P9r0J06j23J46j70J94k23K54k89L28
34A74l68M12m65N24n87O55p29Q09q97R93j099J215j341J479j629J795j976K176
52A141k399K646k924L236l590L995m463N014n673O479p485Q784j0535J3033j6899
67i640K3711l9106J33290j1658k59983J99997M5532j31150L5086O4635o8389j0586
79b8261K993O1042J0276j08129j376J36875l3911j17555R1500M1214j11357N9691
91C002P1004r0532k2662O0831l992J4843m2738k7968O5426j4335k9747K7432j9222
104h658j8594K8166k123R102j9815m1099O4954K1740o3898M683M6685l2067q312
117a9236N2286k9803l6119M0150J0938k0637J9695l6142j835O0343n0544n074
$$ y = [0, 0, 0, 0, 0, 0, 0, 0, 0, 0, 0, 0, 0, -8, 8, -8, 8, -10, 16, -16, 24, -24, 32, -38, 41, -49, 57, -66, 80, -90, 104, -119, 135, -154, 174, -194, 218, -247, 277, -310, 345, -384, 425, -472, 521, -578, 637, -704, 775, -854, 941, -1035, 1141, -1258, 1388, -1536, 1700, -1890, 2105, -2358, 2656, -3017, 3462, -4023, 4761, -5774, 7259, -9640, 14071, -25035, 108255, 96597, -163386, 36611, 82143, -49007, -13921, 50714, -17675, -28261, -25268, 35774, 46050, -62079, -63455, 73420, 39509, -78046, 13454, 54668, -56689, 3002, 74006, -16526, -39188, 21643, 17651, 32494, -10244, -38212, 27214, 12879, -16868, 10564, -8658, -27252, 914, -1209, 7893, -11922, -53021, 11933, 33673, -30225, -25542, 21143, -10924, -19236, 33050, 3247, -32872, 7278, 18216, -2421, 17274, -18868, -20703, 39640, -10904, -15978]
129a5978M6475o0947K746P9698o3408k8403P0215m3747j0956O1511l3575m5444
141d1813N3816J5652l8184J6760K326j7554J7011J1631j5005O403k2759k074O1602
154D7812m2211m2301N6828r305l6873M9483p077n1435L0339K0567o389j4470j0461
167a5493J4318J0380o735o15K612k1811J3828K9618j8922k9448K0337J1788j6838
180f981K0936j2657k7925K3577J6103j2465n819j0121K509K4899j4787k629K154
193c206j7539K1486J8911k2961j3894J5552K629O935M45j8196N73J3818N265p862
207A956J874j5652K669K6076p702j6660J070J709Q487J3228k5857Q32J6533j7720
221i157J6594J4760l4753p122M1213p072k0701R853k680k908R925N812j4522m427
$$ y = [-15978, 30497, -30450, -27704, 51994, -11414, -39817, 30398, -13349, -24305, 37206, 3631, -41813, 12003, 27655, -10529, 6231, 8557, -8997, 8014, 19645, 4640, 11043, -11716, -13790, 47812, 5601, -36700, 20128, 10823, -26050, 23433, 16356, -35079, -4740, 15827, 9438, -5032, -15493, -1175, 9205, 2470, 1855, 4467, -17344, -3516, 26102, 7180, -22268, -1931, 9857, -6981, 13955, 1298, -26627, -3050, 13053, 588, -5231, -15352, -12843, 12056, -2731, -5360, -3206, -20745, 741, 19652, -3309, -17203, -1651, 978, 7913, 8358, -9838, -9265, 4553, 9818, 1956, 3830, -11822, -9153, 16923, 9221, -7439, -6369, -4660, 3827, 17055, -8802, -7970, 8563, -9157, 7437, 22197, -12556, -19678, 21535, 14463, -6238, 3615, 935, -1973, 7952, 13764, -758, -5185]
235e185j244J3536J3434k8303q382K3846j825j3722J9016j2338k0455K6913P675
248A2966j5110o420L490J663J1623l420j2284J631J997P965K099o022j3088O511
262f399J2352k287m030r867J235R771O162r413n083M10K654J1374l678p159p280
277a1238Q806J2626n367j1208J194O193j236J1728p223j5190O709J3280n21q133
291D20k274n653J1766O633q583n464m21J906R237N585k1053J089J2788j988K006
306E994n11j3187J572K0006p997o928Q41n620O501J1925q285j5922R783L882P03
321B757L329r921p449J0593Q997r345J87p035o26J5214L35j3085k793P652p82
336a972P683l425j1514J261J0289L966p856j477o199N998J1007l772j1527M06
$$ y = [-5185, -6429, 7107, 20541, -7762, -16144, 7702, 5877, -7845, 11171, -1167, -21622, 5291, 12966, -2144, -8564, -5074, -3411, 8212, 4792, -7492, -5861, -3864, 4101, 6200, 178, -12910, -6399, 5953, 3666, -364, -10231, -8996, 775, 6937, -2476, -7559, -7149, -4495, 6879, 3201, -3958, -11238, -2432, 10194, 4827, -6381, -5187, 1006, -230, 11498, 4275, -10915, -4206, 9074, 8553, 420, -1854, -7507, 4259, 10892, 2309, -3155, -3576, -1670, 7567, 13152, -7901, -6812, 5976, 3988, 5994, 5483, -7704, -6132, 13874, 5877, -1051, -210, -5830, 671, 12596, 4311, -11611, -1828, 2054, 2757, 6086, -3835, -11284, -691, 8306, -1039, -852, -7887, -8513, 6701, 7036, -6049, -8842, -1190, -1972, 5711, 2286, -9228, -7967, 2322, 6288, -1568, -3045, -9244, -3246, 7761, 3989, -7538, -7132]
350g132P019l31O651o787p965L860R529K467q238l734p90R653M274o416p332L512
366a760L561J708P424j3624o871J3029O335p246j762l055l513J3830O82r343m654
381e259M525L739K774J149j3605Q73J1106K088n501k333p210N651J4558j2086
395D69m908K897k534M171R686r001j4203R652R980j850q582L7j247M188P728p823
411a340k654k679Q38J2932J856k1454K431J7321m872l843P25k438m305Q566Q925
426A0009j0855r759N994J0534J29n458j0771R718P011r944Q379r52j4066O178
440c853J7678p819j3877L802R271L79n039L429p250J258P299j045J108p739n876
455h274J4638O293j8412L272N838n276N591J907n628o896O950O281m007k984j643
$$ y = [-7132, -113, -444, 6207, -580, -8545, -4685, 4844, 7311, -927, -4661, -5451, 4202, 8476, 2060, -5272, -1760, 1801, 3509, 10933, -2691, -9562, 3467, 9802, 2556, 794, -2261, -5774, 8056, 8738, -605, -5259, -734, 3005, 5779, 6928, -6677, -5804, 5302, 7390, 1889, -444, -7654, -2003, 12555, 469, -4439, -1542, -4076, 95, 9781, 780, -13423, -3771, 6209, 4359, -4223, -4186, -5433, -1245, 6483, -1340, -3994, -6673, -5835, 7097, 8953, -12501, -10070, 7251, 2379, -1464, -739, -3177, -7482, 1084, 10009, -846, -10605, -4611, 5923, 6052, 594, -10177, -459, 6552, -3392, 4987, 4035, -10031, -3853, 13825, 6006, -7871, -4069, 5202, 5581, 542, 3971, -3279, -2021, 5278, 4233, 5341, -2398, -8274, 6364, 12657, -5755, -2483, 3355, -1921, 3670, 5577, -51, -6947, 3, 6284, 2277, -707, -2350]
470b350k938Q497N613j5221K787M094l439O863k066o686J12K628L624M570j0852
485d764m194P926N456k131j0423O867Q56o628J1095L496j7790L12J5934j43n972
500a03q667P111N123m851N032k566p620J516J0546L606r951j2406J4103J1843
514A2716j4721J402J664m529L769O854m80j1788l489J4460O914j4213k362J153
528b650N670M989q184J435k771m680J2599N755j7326m101J1675M804l551q094
542d430M089k877K017J0898r285q804N597M852J751m35j2097M255P490k249K409
557C181o979l733O006O471k363q132j51O621j717Q44N129j5411L169J5804p306
572A433o418K941P66L0L725r27k560n131N589O634m839k502m925P980N269j0259
$$ y = [-2350, -5288, 3209, 8822, -6399, -3612, 482, -2957, 3906, 1840, -4846, -4734, -2106, 1518, 6088, -4764, -8958, -1032, 4424, 2293, -8130, -1263, -407, -7035, 4060, 7556, -10234, -9922, 6012, 5869, -103, -8770, -1659, 3464, -1387, 3645, 1079, -6541, -5025, 5521, 9127, -824, -13230, 873, 12716, -2005, -603, 1061, -3468, 301, 7155, 6675, -5113, -8602, 5858, 12772, -1441, -3803, -2650, 3020, 8009, -175, 1260, -1511, -6191, 6408, 12163, -5163, -9264, 2411, 7215, 3664, -4430, -341, -3218, -1201, 9697, 412, -8392, -2795, 2057, 3808, 3373, -8724, -4469, 3021, 772, 3181, -3798, -7531, -1525, 4946, 2583, -5549, -5700, 921, -796, 48, 5177, -10234, -7065, 8739, 1433, -4985, -2044, -1278, -1248, 2477, 1550, -1010, -6141, -552, 6082, 1243, -1259, -6184, 1796, 7065, -3194]
588c194K893N311j1206M460J3887j2719m901O333K436L13k567n74k539L403K267
603C603j543k78k042n083R611O340j7209L706P737n805K549K948o669k111M891
618F45K859N85p662j410N071M279j900p709M050O73k044O988j609j2477O008R500
634E847n589j339k854l71M320L179k062o527P93M761K451q69l275o166P587N735
650E621o293k89k965J11P978L99p880L75K302P48N255k951o777o25J0437j64p156
667a874K146k316Q41P298j154r090K553K367K233L741q714k172N809K468k153
682A983J52l927k316P669K328n970m220M726J72K270J474q671L26N581J118k102
698E93n20n298K565P071l111l447j794J996K249K139k175n182J351M670P58k123
$$ y = [-3194, -301, 5010, -6196, -1736, 12151, -568, -5469, 864, 3300, 3613, 1046, 472, -2067, 1336, 3603, 2060, 1782, -260, -5343, 4268, 10608, -6601, -2895, 4842, -963, 1586, 4534, -2135, -4246, 645, 3504, 4089, -3573, -4983, 88, 4367, 2467, -5242, -1192, -519, -2563, 4425, 2816, -9661, -3653, 5847, 258, -1081, -3935, -4306, 14, 3193, 1131, -5396, -4603, 158, 2609, 1740, -1535, -7701, -114, 5621, -672, -961, -3926, -3815, 4163, 4562, -3318, -2943, -641, 107, 5362, 2411, -4366, -4991, 5446, 5282, -1874, 272, -2044, -1203, 6095, 4941, -4149, -1596, 771, 3004, 6745, -1969, -4141, 1668, 4136, 1983, 2135, -1792, -4108, 3561, 5889, -81, -4301, 425, 597, 2867, 4341, -4330, -4004, 1577, 2695, 593, 73, -5225, -2660, 4411, 1300, -2147, -3941, -1945, 304, 2443, 268, -4914, -3563, 1107, 1865, -258]
714b58j580l978N605L906m665j852m5O77K584M093o479l921N434K978j187k234
730i22l57l026O015L224n167j941K28J935L681L03p766J551M449m6Q90j943l933
747b825Q74Q217k675m780R28o98K194L850k683p072M702K336k24J058m254k905
763c957M674M840m785j898q44M40M500Q66n213l181M904K28J828j009o325J045
779c887O290N70m945N14k313K067N150j641n698m07M891J41J142l352l346L175
795a649L923p64l065n99k261O007K463n048k833K266K359O68J602n628j231M823
811A033K471k221k302q10Q7O093p10n003m98K212J285J522m41o300K218M347K10
828C193j628k718r09K507M749l629l059N1K011J207J818k977n295M615L206j045
$$ y = [-258, -1838, -5816, -211, 3695, -970, -2822, -2867, -2190, 394, 4487, -1992, -5913, -479, 2499, 1312, -922, -1279, -4305, 1710, 4934, -233, -2174, -1946, -11, 3670, 3973, -3793, -2242, 2207, 2161, 3051, 1108, -2825, -1951, 6266, 3591, -1189, -261, -959, 1235, 5085, 2402, -4670, 32, 2368, 2144, 3202, -1052, -3957, 717, 5557, 772, -1126, -1970, -1530, 2970, 3836, -1377, -4558, 346, 574, 2402, 1393, -4932, -3887, 2403, 2973, -1972, -1458, -3771, -1704, 3446, 1805, -3893, -4300, 591, 732, 1874, -1478, -4824, -1649, 2274, 1510, -1555, -2154, -4415, 1592, 4055, -993, -3826, -1560, 799, 1467, 3069, -2559, -3790, 1033, 3504, 1283, -1019, -1829, -1742, 4351, 3641, -1362, -1860, 352, 1637, 3159, 2718, -3582, -1364, 2983, 3193, 1565, -1153, -2062, 445, 5194, 1565, -1494, -1443, 568, 1775, 3593, 616, -4679, -64, 3142, 2097]
844B097j951k515p31M973J751n239n3n74J208L594k08n411k064O290P44j598k012
861a699j238M63M710k78m458O47j756L491M684n419n066M861L186k357J556k994
877a667j929K716M625k364l975M60P72M880m89n643n31M809n14K41K105p236J433
894b307O426q37l296o46o73K267L594l096k887K8L161k98J227j006o117M989M000
911D529l731j137L13k261M243K631o173l98J447J273L95J89k659k521M594K438
927C172l361j939K808m327N550J154o582K425J33L05K397M37p461K045O329k330
943G55j956M63q24k181O332J052p806K461J757j216M124j658p731P884P75l405
959a174L119j917m462M938N393n996l574L524J158O06J660l778m300Q209j193
$$ y = [2097, 146, -2369, -3100, 1873, 3624, -1615, -1668, -2242, -1034, 2560, 2352, -3059, -5123, 1167, 1911, 313, -1699, -2937, -2474, 2236, 1958, -2500, -1853, -3609, -118, 4566, -853, -5919, -1058, 2128, -229, 1327, -1667, -3596, -880, 3745, 1381, -2594, -2134, -1362, 3518, 3029, -2614, -3145, 1664, 1150, 1391, 3496, -3740, -2307, 4119, 3282, -14, -660, -1333, 934, 4528, 1432, -1455, -1427, 1734, 1436, 2663, 1657, -4460, 529, 4529, 798, -339, -26, -2287, 1956, 4587, -1586, -1984, -537, 736, 1131, 1320, -1339, -3860, 734, 3172, -189, -2128, 680, -3647, 1903, 3057, -3525, -1100, -967, -662, 1735, 2172, -5289, -3244, 3085, 755, -1201, -738, -1562, -3743, 2589, 3641, -4165, -1704, 53, -1163, 2961, 1303, -6428, 1456, 2231, -1174, 1945, 28, -4434, 504, 5897, -99, -3673, -149, 1009, 1615, 3275, -503, -4803, 3406, 2213]
974B213j728K278n684n96R239j758o792K459L12Q54L213k304l103k030O356M99
990C428l229p61k406K299O101m035n977N199j884J943K849n428k382M160K302
1005B179j503l150j6P30J743L772l922o023P210j437M49K462o182j121P718j464
1021A445k471R56m003K778L762j644k905K34L444j658K020j95n399J237O964l804
1037G61k287K308l870M248K528m182M0M05r58L609R16n281O35J748J618j171j323
1054b56R23l124M407J688m100k55L96l06L405j158m850K995o20J212J733l726
1070a636k33J173K037N94k404k027J751N53K075j290l988K974K51P08Q89l638
1086b211r73L298J253j097r70k252K266J261J096k361l344L755J086k63L41l458
$$ y = [2213, 485, 2763, -2921, -3517, 5722, 3964, -2828, -369, -57, 797, 4010, 1706, -1397, -3427, 2929, 3428, 199, -562, -2968, -669, 5432, 1397, -4580, 619, -1265, 678, 3527, -1901, -4283, -123, 2179, 676, -2474, -2490, -1760, -17, 3755, -167, -6190, 1020, -417, 32, 2494, -3688, -4809, 2909, 1445, -1026, -70, -4073, -1295, 2467, 823, -2082, -1848, 1596, -62, 1958, 1763, -3636, -2399, 4565, 761, -1526, 782, -3088, 1160, 3688, -494, -454, -49, -1007, 2602, 3518, -1763, -1128, 620, 2238, 1067, -256, 667, -2457, 1950, 3638, -462, -717, -321, -627, 2778, 1620, -3230, -235, -855, 357, 2090, -1636, -1869, -696, 1341, 1935, -469, -2496, -745, -192, 1883, 593, -3395, -421, -170, 538, 1427, -2211, -3184, 114, 1367, 270, -700, -2952, -686, 575, 1671, -690, -4034, -279, 807, 544, 885, -2573]
1102b573p74N903p69k876J109l232K845L843k620l178J121J673J199P65k868k187
1118b619K185M118k512j271M6k161M422J992n031r59K622n42K182M05n584J948
1134g59K104J026j201j747p95P09L700j288l225l23K439p4J542j592l867L028
1150c23J656j57j133j661p43K397K145k438j826k53K711p3R32k202k877L556J655
1167A366j277q57r09q15L705Q44l636k97P48J444P42K1l254L4L324J49j013p62
1185d43j010J11M542j738l020J251l76J589J965k120l430K818J781o84L19k309
1201g54m97K374K244l255m03j18r8K664Ok825j409L568m33O61p79l159J328K700
1219A815Q2k444k16j135J958K438j717k723J38K430l03R53k506j561K226J987
$$ y = [-2573, -3347, 2556, 1787, -1089, 20, -3212, -367, 3476, 856, -2322, -1201, 472, 1671, 2436, -432, -2619, -434, 3684, 1172, -99, -53, -2214, 2208, 4200, -831, -1790, 832, 290, 2472, 2877, -2707, -759, 1345, 2371, 1170, -577, -1372, -663, 3037, 1749, -1476, -1799, 640, 566, 2108, 516, -3351, -323, 1333, 1176, 43, -1618, -2361, 36, 2181, -257, -2083, -2336, 375, 302, 1234, -968, -3845, -289, 1366, 89, -768, -1677, -2492, 1213, 2057, -1579, -1876, -1128, 316, 1058, 1079, -2175, -2141, 1183, 1332, 319, -443, -1453, -1342, 3200, 1462, -1558, -307, -683, 906, 2871, 751, -2679, 139, 1920, 1236, 1555, -754, -1251, 1123, 3367, 112, -291, -409, -507, 2157, 2163, -662, -2071, 1497, 1064, 1725, 946, -2213, -885, 1815, 1897, -547, -763, -1898, 60, 2498, 781, -1942, -1804, 626, 323, 1276, -1230, -2791, -565, 1422]
1235A422l59k820N95r44K747J233k901j515J376J877l62M81l063k85L137J228
1251A847j564j469j3m45L585l87l242l28K389M95J36K7l441J390L363n50j929
1268a36m96j45Q56L359k707k290J460R35M56J004k310k415L510J173j427j67j268
1285f08o22K705J554m003j01J108K99J136j52l030n08L923o28n77j100j263Q93
1302i74K832r97k795J060L3J101J079j541k422J171K851j199o93j020p82J876
1318d20K339k044j959J114q2K085J93k496j314K581J160j133J26j692J33K186
1334G77J338k986n45J370q5K137n75l155P64K592m85k57m76k307K109K209p66
1351A659k515p9P63R32J461j959j650J061K352j214J04j043k015L350R11j940
$$ y = [1422, 1063, -1757, -1162, -2106, 641, 1874, -1027, -2542, -1166, 711, 349, 830, -2233, -2518, 619, 1847, 283, -1186, -1199, -1644, 1941, 1554, -1688, -2016, 373, 868, 1004, 1031, -2410, -1020, 2343, 1793, -136, -632, -777, 79, 3438, 731, -1559, -99, 836, 1292, 2296, -14, -2429, 1081, 2254, 827, 660, -608, -1230, 1475, 3029, -974, -1075, 33, 332, 1468, 1316, -1714, -2222, 1701, 1073, 496, -604, -1867, -974, 1858, 861, -1934, -874, -841, 260, 1339, -202, -2624, -1453, 1398, 199, -494, -1514, -2296, -420, 1919, -125, -2084, -970, -1052, 1033, 1226, -1270, -2584, -3, 1157, 24, 150, -1542, -1409, 777, 2115, -871, -1416, -46, -131, 2006, 1431, -1724, -960, 1632, 1147, 890, 414, -1893, 216, 2425, 1659, -856, -935, -172, 760, 2221, 262, -1388, -327, 2025, 811, 915, -128, -2143, 1207, 2118, 178]
1367A78j059L66J8K195o06k475l24J325J822j474k88q63o88L185k21k427Q9O52
1385e95l92K821j751k350J529L91J393m39j832o87J347J492k47j553l82M90O8
1402f97K344k358o96K072o81N34O89l036Q73K061J2j113K69j861J561J731M3j711
1420C6j565K040O40M75q03j966K93L007j134o1r47j849L061R31j680r34m45R35
1438C4K354j384j665l54J45L175j380j475m55n02L027M15k779o06M57R06K151
1455B064k287k162J368Q44J625j547j258j8R49J688k0l131L13J772o57K458k677
1472f76k487L276O53j49j62k444N5L356n01j218j021L07J827L24N12l013j58K690
1490A171L03j935J542k461P09M141l760k38P83j016J749R51j949j003J324L68
$$ y = [178, -881, -515, -497, 1698, 1092, -1383, -1707, -382, 1440, -34, -322, -1185, -1873, 1312, 1091, -1336, -1247, -595, -987, 1834, 83, -2267, -738, -347, 1046, 607, -1225, -1912, -565, 927, 680, -873, -1255, -765, -697, 1647, -711, -1407, 665, -16, 518, 1207, -1829, -956, 1105, 1117, 4, 273, -1588, -27, 1704, 1747, 36, -1529, 511, 1151, 1626, 823, -1143, -850, 2157, 1023, 962, 15, -1834, 1227, 2158, 478, -456, -901, 34, 2388, 1004, -661, -1015, -870, 2305, 925, -550, -1005, -1507, 1520, 1935, -844, -1450, -993, -87, 2064, -223, -2385, -1017, -173, 1452, -95, -1353, -1371, -422, 1266, 1246, -1885, -1572, 200, -457, 2001, -676, -3163, 113, 766, 617, 455, -1989, -1934, 1422, 921, -297, -1318, -1011, 816, 1140, 1652, -1361, -1519, 1171, 1474, -461, 1081, -1380, -671, 3470, -290, -528, 255, -761, 988, 1939, -10, -1013, 311, 679]
1506F79N27r61K36j585R54K808k662o85J180j210J816R83l371j29K094p41J465
1523A398k001j044P33P65J854j930p66L96j80P95J752l114m10K233j215J311l53
1540B24k165J017J359Q9j322J29o88J320Q14Q2k891N09K585j559J578q82k683
1557b484K504J919k312M12l54j480L490j81j872q02R73R82L83P9k084m71K345
1574A047R85k062K16o38k32L568k089j931Q00J64J023R96k078j305J788O60N29
1591A441j524r16K82J004J747k107j166Q01L70O44M63k214p64K382J71j43j324
1608h53p50Q63J346M24j591j103J007J063k99N28k344O7K938j056n53j91r42O65
1626g81K327j256j583P84q6J084L43o90k040J699J538r94K1n79q01K045J220k582
$$ y = [679, 1206, 245, 481, -1104, -150, 2658, -4, -689, 491, -719, 1097, 2080, -1291, -1420, 674, -67, 1398, -603, -1647, -914, -149, 1705, -225, -991, -595, -775, 20, 1772, -1342, -1752, 481, -734, 577, 224, -1941, -924, 435, 524, -798, -669, -1357, -37, 777, 859, -2032, -1523, 1062, -497, 1081, 199, -2484, 20, 1939, -373, 39, -315, -1795, 1695, 1514, -358, -1160, -187, 795, 1178, 1257, -827, -1298, 1047, 2032, -30, 186, -452, -684, 2884, 795, -1136, -336, -172, 851, 1847, -231, -1536, 252, 912, 1441, -83, -999, -717, 287, 2034, -73, -1239, -438, -68, 576, 1039, -1175, -1939, 443, 614, 471, -853, -1603, -740, 606, 1030, -561, -1664, -657, 406, 107, 635, -1709, -1642, 1296, 240, -313, -504, -1446, -781, 1546, 290, -1293, -509, -595, 489, 832, 142, -1898, -199, 1339, 345, 366, -213, -1014, 1031, 2251, -331]
1644c31m46J150r69K191k87k119k06K007k84K41j94j929P90J969n7k095N00L7
1662c2j33K169j269k086Q81J257k66N11j303j231J840P88p12j412M30j97J022
1679B57R64j767j105J063J037p22P90j392o31J683N14j375m49M14j11J461j71
1696D60j803j40J581N07o37K2j517L31K480k08j436J32l41j32K376j137j611N57
1714e16R29L18l7n81j812K303P14j191k71j52M4J202Q51k269j98R08M41K55j75
1733G63j458l58K472n32q26r1o79P37J410l08k210M11O01Q30M82j454j648J402
1751d56J485q89k93l99p60J368R93j334j300J032J52Q95J92j608o88J184J218
1768G92j263L27q03j83J769Pj725q1J022k97J393q66j662N08J369M61q09L7j281
$$ y = [-331, -777, 373, -596, 1595, 1308, -811, -1017, 990, 706, 947, 753, -1176, -386, 1583, 1526, -569, -69, -32, -165, 2004, 735, -1351, -470, 787, 521, 1032, -271, -1502, 338, 1126, 414, -998, -568, -765, 257, 1221, -546, -1651, -588, 449, -273, 517, -875, -1506, 177, 691, -684, -1133, -719, -830, 631, 460, -1343, -1483, 98, 605, -32, -10, -1527, -1196, 1284, 1076, -360, -228, -569, -701, 1675, 538, -1073, -516, 413, 731, 694, 113, -1699, 604, 1318, 127, -144, -296, -252, 950, 1801, -468, -666, 242, 683, 938, 763, -695, -1053, 1419, 887, 61, -30, -709, 28, 1438, 1130, -1080, -669, -68, 762, 1244, -210, -1858, -456, 1029, 140, -153, -552, -1312, 56, 1049, -285, -1585, -553, -401, 494, 686, -922, -1610, -426, 792, -471, -144, -947, -1130, 639, 646, -1079, -1160, -138, -435, 958, 92, -1570, -1062, 307, 768, -41, -4, -1285]
1787a285J373J391o81j503N92J70J53J533j935j023J589P62m73j1o85n88J480
1804H59L55j044o97N72L7Q41K08k057O5J716j34l67K92j597K98K245j195o37k44
1823d84oK54J343p81k001J206P63K24n30k5j534J326J636j853ql91p3J211N01
1842G78j568m74J110M2N18o08j081K08J369O72j532P2L0Q7J031j89k395J182P66
1861A8l32J375j293j108R20J832q28q42J38m91J019Q80m97k044J343N23k79J176
1879A510j792o57J707O68j364L35q26l05K422r37r53m20P19J26Q67n06j351k0
1897g77J803K9j692P11j264M76K224j038j606N68L30O39L14j664q27J679N32j00
1915C37j005O52j164J426J105k238q36J395K0P66N87l091J157K137o47J39j378
$$ y = [-1285, 88, 1479, 798, -705, -113, 57, 210, 1743, -192, -1215, 374, 1136, 663, 652, -33, -621, 859, 1214, 170, -527, 45, 82, 923, 1131, -926, -861, 855, 721, 354, 646, -951, -653, 1592, 397, -240, -484, -490, -236, 1107, 326, -1675, -469, 294, 518, -12, -37, -1571, -245, 1391, -462, -470, -861, -934, 277, 778, -790, -1264, -154, -112, 406, -202, -1283, -1075, 294, 966, -566, -494, -464, -377, 654, 465, -1930, -748, 18, -314, 1061, -232, -1340, -420, 1412, 584, -258, -120, -611, 408, 1288, 791, -1253, 90, 613, 334, 1510, -282, -939, 768, 1436, 72, 407, -419, -724, 1698, 761, -192, -612, 107, 233, 1100, 594, -757, -777, 1026, 1055, -637, 74, -1190, -714, 1510, 472, -1134, -566, -236, 403, 717, -947, -1774, -95, 437, 337, -668, -16, -1180, 246, 1351, -887, -1723, -328, -308, 458, 1045, -2046, -889, 1248, 601, 740, -638]
1932f38q05R19J924n86j413o08J574J82r2K58k162J205J806j357K35l45j209J733
1950F21Q75j421k82j45O94N17n66j55p68Q95J006r38p01N87j054J612J029k563
1968g57N62K92l38J212p54r09K51O78K33l78o53K82k64O77O88k241J096J5k92
1987f00J508o37j749J395J31m27J113j905N26O00L15K62j242k7J86M89Q52r73
2005a83j229J464L99m21J076k151K39J538J5r25J98j151Q41J596j115j39j008
2022i56J580L55n69K9j156J261J304r09n39k58j204J821R40k054R1j27N68Q36
2040A013n67r35m94J409M80j96j413M94k85R64P02k055K05N04L63N16r26j434
2058a655R18J646o95l62p11K21K56J053l19j988R84P61q3O01o71j439J524O33
$$ y = [-638, -1443, -524, 1400, 814, -599, -1207, 367, 549, 457, 715, -1447, -242, 1564, 207, 442, 97, -1112, 621, 1496, 75, -207, -352, 342, 859, 293, 138, -630, 265, 1271, 333, -368, 219, -835, 777, 1806, -757, -195, 97, -241, 971, 217, -692, -441, 237, 470, 92, -561, -279, -543, 134, 822, -1419, -323, -308, -600, 908, 271, -1478, -83, 48, -379, 734, -1171, -645, -45, 270, 532, -710, -737, -551, -62, 790, -183, -1412, 52, 451, 30, 1106, -1045, -806, 732, 747, -178, 20, -1131, -290, 1306, 191, 52, -956, 624, 979, 410, 439, -717, 544, 1848, 939, 400, 142, -1062, 759, 1699, -355, -264, -391, 177, 1013, 446, -489, -983, 426, 906, 710, -703, -209, -494, 470, 1172, -883, -678, -174, 189, 705, -221, -1655, -737, 909, 214, -148, -859, -638, -382, 671, 352, -1636, -652, 109, 26, 627, -44, -1483, 41, 674]
2076F74r32J08l40J8R92L77j393k27O90k4P00j92p41p99J752Jq84N08r16L03J423
2097A098l93r60P0R2L08R81j148o08L10Q53n8P4o63k53N19P38n45q62O43k81L74
2118B89O34j605J43O55K46K03l34q27J9R81j59k53r35O97j56Q00j89j187K22Q37
2138H1L04n34J0q47L65J063l45n54k94K62J46J156r21q05M89O59N4l49p2j055
2158a187J486Q02j350J60j86R9R36J66j524Q30L00j52L59n31o69J3J461l75m99
2177A39k3m40L15J119k82j741R79J30L64J64q73m41N88Q37o59m0l20l07Q59L59
2197G27q10o78R69l58N65M0r04n14R88M20n59k50m57L80J205m89r52q4N91n4O63
2218D39m05r75L47R28Q4o81K3n55O88P99q37n21K87L70K07J53n88o21Q61N96n27
$$ y = [674, -258, -150, -490, -472, 520, 897, -496, -723, -33, -57, 643, 451, -290, -1089, 663, 664, -220, 288, -628, -325, 1098, 705, -255, -185, -93, 215, 1196, 48, -560, -250, 603, 545, 619, -44, -297, 222, 960, 415, -447, 196, -85, 289, 923, -682, -539, 116, 362, 565, 231, -596, -577, 404, 245, -8, -943, -246, -402, 398, 209, -978, -756, 81, 385, -149, -139, -986, -621, 442, 97, -457, -751, -489, -343, 813, -108, -913, -424, 235, 289, -60, -132, -1187, 299, 1101, -249, -89, -275, -176, 760, 926, -598, 232, 532, 380, 739, 208, -461, -448, 1013, 638, 139, 116, -324, -9, 1110, 828, -913, 66, 196, 560, 724, -149, -590, -2, 835, 176, 136, -184, -491, 368, 727, -83, -761, 208, -150, 415, 455, -449, -963, 25, 445, -114, -364, -821, -441, 764, 275, -677, -761, -170, -224, 439, 34, -941, -594, 334, 418, -263, -240, -795, -107, 692, -145, -666, -379, -9, 198, 351, -237, -858, 3, 599, 72]
2239G2l05Q8p24J567L02j194l49N15M7L18L88j310J61J195n1o12j66l76M46J122
2259A134o15n26k55M42J42M10n38j204R20N73l81j63r3m87P68O98r39k19Q6QL48
2280A09J91p03m36R09J77j30k75j97o62J373o8j045J75L38QQ48n99q59K87N88
2300B9J13kn25O4k5Q92n99l27p1n5K76P90o92p27J043j30N73L0j196N55l38J001
2322F79n34k01l0L07Q04k78j213n68J943m28K60k19j338R64R30m28n20J90n40
2341b20N15N65n24k14n33R91k3kj146o74J065J256k03j511K17l75Q07O19r33K13
2361a10l48O06l3J88p90j88O39K80n41m64N92k78J072l03j375O43r0N66M12n46
2381f8p84P68L09n2L2p45J97L63M77o64l74N85M25k47L02n59p15J453j31n35M49
$$ y = [72, -233, -145, -869, 698, 1000, -194, -543, -28, 19, 337, 725, -585, -424, 771, 720, 108, -58, -434, 12, 1134, 519, -7, -262, 180, 322, 732, 194, -1010, -90, 483, 102, -61, -154, -641, 127, 825, -114, -333, -247, -239, 109, 300, -403, -839, 70, 247, 117, -158, -355, -1017, 356, 288, -757, -582, -244, -236, 612, 13, -846, -559, 29, 142, 140, -385, -321, -346, 546, -53, -380, -451, -506, -230, 560, -132, -859, 184, 54, 627, 657, -539, 16, -322, 679, 145, -56, -86, 221, 1025, 747, -466, -1034, 909, 481, 741, 522, -816, 148, 1078, 650, 130, 320, -220, 295, 860, 336, 122, -411, 580, 557, 555, -591, -1265, -200, 1056, 853, -658, -441, -816, -9, 610, -323, -110, -458, 148, 115, 303, -487, -675, -36, 244, -297, -761, -169, -447, 625, 322, -1053, -410, -500, 66, 478, -68, -852, -84, 225, 173, 205, -540, -343, 20, 497, -167, -541, 44, 469, 222, 524, -35, -750, 703, 572, 37, 486]
2402D86m47j77R50j08p59k95m1J267j66l12o98k37J208k51l12k01o17P87Q51p58
2422A70o73P93r77P96M72q90O1J51L16k52j01j67j4K83O42r48j92P57n24N19L72
2443E94j001K78M51q15J32R18j137K34Q23j58p29l13P88o30J132j25k011J121
2461d48R17J3m45R19k279K014j92n57K58J22M08K54k45k20j045N14R86o69K52
2480E57q72n86J436k58r2J71o85j36J009J08r89k20L34O78k38l11J90m49Q54q
2500D93q90L58p1k16J108n18j160R01J26o15P04m73k2M34P82q76m49K01K10R8
2520A25M27j207l85R99K40J67K25j111n15J407n32N77n55l56O66M62n26m07m1
2539c40P06k51K61p05P4q9R17j073P81L24o88O18J02M4o75j16L55N96m48m93Q2
$$ y = [486, 39, -138, 812, 704, -55, -350, -391, 876, 710, 398, -300, -537, 671, 420, 108, -93, -710, 77, 928, 170, -503, 290, -687, 109, 581, -309, -248, -97, 219, -33, -134, -301, -315, -32, 610, -338, -530, 227, -297, 222, 594, -407, -129, 322, -493, -361, 557, -580, -346, 477, 319, -410, -723, 65, -565, 567, 442, -1569, -448, 469, 482, 37, 956, -1323, 691, 499, -58, 200, 322, 730, 984, 739, 519, -526, -12, 974, 305, 557, -315, -901, 535, 277, 185, 356, -329, -465, 544, 652, -337, -557, -223, 455, 217, -94, 96, -353, 501, 493, -397, -39, -110, -326, 782, 264, -896, 5, 131, -484, 220, -253, -275, 159, 941, 65, -384, -183, 27, 125, 552, -655, -1040, -41, 199, 366, 591, -520, -1035, 372, -160, 417, -138, -494, 172, 634, 108, -299, -340, 366, 115, 376, -329, -255, -344, 573, -500, 281, 605, -83, 535, 637, 681, 6, -110, 245, 841, 393, -100, -18]
2560a8J18L96n95J59k66j31P55J97o14n09Q48m23O21j40j123O62K82q7kk29m30
2581e29J81Q95j50j007K68M16l11N73n47o00O79K69j58m6j0p93R62J4j48k72K1
2602b93K1J22O28r24N8O01j20oJ64o84j21J213J6q68J05k9K72K99j58p00L11K65
2624A72k7L07k77n25J71J095p74j36M7j94N07J33n11l36M34J55o1J36l49j48M76
2645B95J78m37k4j51J1M89j4l62n40N31j93M33J06o91j98J002j04p69J78l08M65
2666a03K94q89J83K92O7l91M08R9q24N83N37n69p0M61p73R43K10j146K13N11j36
2687a00O11J16n46l5N47o0n94Q9L37j212J299n1q09O86J013j192n46J42q92J432
2707B35J64r20M42K49k98j8K004k438M11j09J182j465M83L06o96M29P26J64j049
$$ y = [-18, 100, 496, -99, 60, -206, -337, 418, 615, 1, -508, 340, -83, 538, 398, -725, -63, 219, 132, 130, -99, -529, -348, 547, 397, -610, -342, 74, -237, 336, -211, -811, -132, 137, -21, -67, -77, -870, 92, 106, -42, -314, -293, -272, -150, 478, -446, -388, 213, 93, 87, 251, -433, -554, 659, 675, -193, -88, -117, 155, 454, 296, -404, -93, 172, 145, 452, 175, -350, -179, 916, 142, 6, 53, -141, 366, 499, -12, -348, 86, 241, 180, 316, -33, -181, 295, 473, 36, 12, -139, -128, 361, 347, -15, -555, -24, -217, 216, 322, -369, -567, 435, 331, -438, -260, -568, -103, 191, -698, -515, -223, -156, -547, -139, -40, -864, -281, 256, -313, -383, 78, -695, 248, 458, -688, -475, 36, -100, 511, 627, 81, 46, 593, 533, -61, 28, 365, -847, 452, 401, -408, 278, 1291, 99, -447, -305, -1197, 235, 399, -521, -79, 170, -128, -146, 1858, -580, -169, -278, 904, -561, -78, 228, -468, -39, 687, 851, -198]
2726a98N02o96J111o22n49K27K38L76Q7m95n72l2J038k34l0j76m06L98M51n87
2746a69j8j62K15J94P7k57n17O32M0kJ20m36k49N48N82o59Q0k61j95O69k60l25
2768c53J05M52m8n8P3n18M88O8K46l94k67R9j37Q04l17n46J62M57j71K09j50m46
2790b42K43K19K31m37j28L2L38K57m02m19J91L88k46L56m99p34R76M4j07l60J16
$$ y = [-198, 304, -392, 719, 97, -452, -225, 13, 389, 476, -19, -591, -623, 415, 181, 151, -25, -431, -33, 418, -169, -187, -349, -134, 60, 137, -120, -637, -5, 35, 33, 153, -283, -532, 16, 598, -61, 19, -242, -437, 232, -28, -353, -248, 204, 156, 98, 171, -347, 141, 209, 455, 61, -206, -107, -244, 560, 243, -303, -141, 316, 145, 354, 204, -242, 1, 220, 451, 14, -114, -82, 256, 513, 111, -308, -117, 271, 25, 381, -118, -852, 124, 168, 61, -299, -183]
$$ [...]
8191A15
##END NTUPLES=NMR FID
##END=
