##TITLE=1H_Pr-A_Cl
 CDCl3, 8 sc, 
 28.06.2021
##JCAMPDX= 6.0         $$ Bruker NMR JCAMP-DX V2.0
##DATA TYPE= NMR FID
##DATA CLASS= NTUPLES
##ORIGIN= UXNMR, Bruker Analytische Messtechnik GmbH
##OWNER= root
$$ XWIN-NMR		Version 3.5
$$ Mon Jun 28 12:48:37 2021 Russian Standard Time (UT+4h)  she@DPX200
##.OBSERVE FREQUENCY= 200.131506
##.OBSERVE NUCLEUS= ^1H
##.DELAY= (6, 6)
##.ACQUISITION MODE= SIMULTANEOUS
##.ACQUISITION SCHEME= undefined
##.AVERAGES= 8
##.DIGITISER RES= 18
##SPECTROMETER/DATA SYSTEM= spect
##.PULSE SEQUENCE= zg30
##.SOLVENT NAME= CDCl3
##.SHIFT REFERENCE= (INTERNAL, CDCl3, 0, 15.7039)
##AUDIT TRAIL= $$ (NUMBER, WHEN, WHO, WHERE, WHAT)
$$ ##TITLE= Audit trail, XWIN-NMR		Version 3.5
$$ ##JCAMPDX= 5.01
$$ ##ORIGIN= Bruker BioSpin GmbH
$$ ##OWNER= she
$$ F:/spectra/data/she/nmr/H-F/1/audita.txt
$$ ##AUDIT TRAIL=  $$ (NUMBER, WHEN, WHO, WHERE, WHAT)
(   1,<2021-06-28 12:47:32.15 +0400>,<she>,<DPX200>,
      <created by zg, POWCHK disabled, PULCHK disabled
       configuration hash MD5:
       00 E9 B6 7A A2 85 ED C7 34 08 36 98 17 FE 4E 26
       data hash MD5: 16K
       60 5D 97 2C F6 B6 C6 AD B4 9B A2 A0 B4 A7 D6 21>)
$$ ##END=
$$ 
$$ hash MD5
$$ 14 34 0B 09 1E 30 B1 0C 28 03 91 6A 57 62 63 8F
##$RELAX= 
##$RELAX= 
##$RELAX= 
##$RELAX= 
##$RELAX= 
##$RELAX= 
$$ Bruker specific parameters
$$ --------------------------
##$DU= <F:/spectra>
##$EXPNO= 1
##$NAME= <H-F>
##$PROCNO= 1
##$TYPE= <nmr>
##$USER= <she>
##$AMP= (0..31)
100 100 100 100 100 100 100 100 100 100 100 100 100 100 100 100 100 100 
100 100 100 100 100 100 100 100 100 100 100 100 100 100 
##$AQSEQ= 0
##$AQ_mod= 1
##$AUNM= <au_zg>
##$AUTOPOS= <>
##$BF1= 200.13
##$BF2= 200.13
##$BF3= 200.13
##$BF4= 200.13
##$BF5= 200.13
##$BF6= 200.13
##$BF7= 200.13
##$BF8= 200.13
##$BYTORDA= 1
##$CFDGTYP= 0
##$CFRGTYP= 5
##$CHEMSTR= <none>
##$CNST= (0..31)
1 1 145 1 1 1 1 1 1 1 1 1 1 1 1 1 1 1 1 1 1 1 1 1 1 1 1 1 1 1 1 1 
##$CPDPRG= <>
##$CPDPRG1= <>
##$CPDPRG2= <>
##$CPDPRG3= <>
##$CPDPRG4= <mlev>
##$CPDPRG5= <mlev>
##$CPDPRG6= <mlev>
##$CPDPRG7= <mlev>
##$CPDPRG8= <mlev>
##$CPDPRGB= <>
##$CPDPRGT= <>
##$D= (0..31)
0 1.2 0 0 0 0 0 0 0 0.06 0 0.03 0 0 0 0 0.0002 0 0 0 0 0 0 0 0 0 0 0 0 
0 0 0 
##$DATE= 1624870051
##$DBL= (0..7)
120 120 120 120 120 120 120 120 
##$DBP= (0..7)
150 150 150 150 150 150 150 150 
##$DBP07= 0
##$DBPNAM0= <>
##$DBPNAM1= <>
##$DBPNAM2= <>
##$DBPNAM3= <>
##$DBPNAM4= <>
##$DBPNAM5= <>
##$DBPNAM6= <>
##$DBPNAM7= <>
##$DBPOAL= (0..7)
0.5 0.5 0.5 0.5 0.5 0.5 0.5 0.5 
##$DBPOFFS= (0..7)
0 0 0 0 0 0 0 0 
##$DE= 6
##$DECBNUC= <off>
##$DECIM= 32
##$DECNUC= <off>
##$DECSTAT= 4
##$DIGMOD= 1
##$DIGTYP= 9
##$DL= (0..7)
0 120 120 120 120 120 120 120 
##$DP= (0..7)
150 150 150 150 150 150 150 150 
##$DP07= 0
##$DPNAME0= <>
##$DPNAME1= <>
##$DPNAME2= <>
##$DPNAME3= <>
##$DPNAME4= <>
##$DPNAME5= <>
##$DPNAME6= <>
##$DPNAME7= <>
##$DPOAL= (0..7)
0.5 0.5 0.5 0.5 0.5 0.5 0.5 0.5 
##$DPOFFS= (0..7)
0 0 0 0 0 0 0 0 
##$DQDMODE= 0
##$DR= 18
##$DS= 0
##$DSLIST= <SSSSSSSSSSSSSSS>
$$ [...]
##$SUBNAM2= <"">
##$SUBNAM3= <"">
##$SUBNAM4= <"">
##$SUBNAM5= <"">
##$SUBNAM6= <"">
##$SUBNAM7= <"">
##$SUBNAM8= <"">
##$SUBNAM9= <"">
##$SW= 20.0188882624521
##$SWIBOX= (0..15)
0 0 2 0 0 0 0 0 0 0 0 0 0 0 0 0 
##$SW_h= 4006.41025641026
##$TD= 16384
##$TD0= 1
##$TE= 0
##$TE2= 300
##$TE3= 300
##$TEG= 300
##$TL= (0..7)
0 120 120 120 120 120 120 120 
##$TP= (0..7)
150 150 150 150 150 150 150 150 
##$TP07= 0
##$TPNAME0= <>
##$TPNAME1= <>
##$TPNAME2= <>
##$TPNAME3= <>
##$TPNAME4= <>
##$TPNAME5= <>
##$TPNAME6= <>
##$TPNAME7= <>
##$TPOAL= (0..7)
0.5 0.5 0.5 0.5 0.5 0.5 0.5 0.5 
##$TPOFFS= (0..7)
0 0 0 0 0 0 0 0 
##$TUNHIN= 0
##$TUNHOUT= 0
##$TUNXOUT= 0
##$USERA1= <user>
##$USERA2= <user>
##$USERA3= <user>
##$USERA4= <user>
##$USERA5= <user>
##$V9= 5
##$VALIST= <valist>
##$VCLIST= <CCCCCCCCCCCCCCC>
##$VD= 0
##$VDLIST= <DDDDDDDDDDDDDDD>
##$VPLIST= <PPPPPPPPPPPPPPP>
##$VTLIST= <TTTTTTTTTTTTTTT>
##$WBST= 1024
##$WBSW= 4
##$XGAIN= (0..3)
0 0 0 0 
##$XL= 0
##$YL= 0
##$YMAX_a= 454965
##$YMIN_a= -434013
##$ZGOPTNS= <>
##$ZL1= 120
##$ZL2= 120
##$ZL3= 120
##$ZL4= 120
##$ABSF1= 10
##$ABSF2= 0
##$ABSG= 5
##$ABSL= 3
##$ALPHA= 0
##$AQORDER= 0
##$ASSFAC= 0
##$ASSFACI= 0
##$ASSFACX= 0
##$ASSWID= 0
##$AUNMP= <proc_1d>
##$AZFE= 0.1
##$AZFW= 0.1
##$BCFW= 1
##$BC_mod= 2
##$BYTORDP= 1
##$COROFFS= 0
##$CY= 11.3945322036743
##$DATMOD= 1
##$DC= 2
##$DFILT= <>
##$DTYPP= 0
##$F1P= 15.9154993809931
##$F2P= -4.1035820241983
##$FCOR= 0.5
##$FTSIZE= 0
##$FT_mod= 4
##$GAMMA= 1
##$GB= 0.15
##$INTBC= 1
##$INTSCL= 1
##$ISEN= 128
##$LB= 0.24
##$LEV0= 0
##$LPBIN= 0
##$MAXI= 10000
##$MC2= 0
##$MEAN= 0
##$ME_mod= 0
##$MI= 1.114404
##$NCOEF= 0
##$NC_proc= 0
##$NLEV= 6
##$NOISF1= 3.799351
##$NOISF2= 2.8
##$NSP= 1
##$NTH_PI= 0
##$NZP= 0
##$OFFSET= 15.70392
##$PC= 1
##$PHC0= -11563.96
##$PHC1= 11.60101
##$PH_mod= 1
##$PKNL= yes
##$PPARMOD= 0
##$PSCAL= 0
##$PSIGN= 0
##$REVERSE= no
##$SF= 200.130013532006
##$SI= 16384
##$SIGF1= 3
##$SIGF2= 2
##$SINO= 400
##$SIOLD= 16384
##$SREGLST= <1H.CDCl3>
##$SSB= 0
##$STSI= 0
##$STSR= 0
##$SW_p= 3612.71676300578
##$SYMM= 0
##$S_DEV= 0
##$TDeff= 0
##$TDoff= 0
##$TI= <>
##$TILT= no
##$TM1= 0
##$TM2= 0
##$TOPLEV= 0
##$USERP1= <user>
##$USERP2= <user>
##$USERP3= <user>
##$USERP4= <user>
##$USERP5= <user>
##$WDW= 1
##$XDIM= 8192
##$YMAX_p= 0
##$YMIN_p= 0
$$ End of Bruker specific parameters
$$ ---------------------------------
##NTUPLES= NMR FID
##VAR_NAME=  TIME,          FID/REAL,        FID/IMAG
##SYMBOL=    X,             R,               I
##VAR_TYPE=  INDEPENDENT,   DEPENDENT,       DEPENDENT
##VAR_FORM=  AFFN,          ASDF,            ASDF
##VAR_DIM=   8192,          8192,            8192
##UNITS=     SECONDS,       ARBITRARY UNITS, ARBITRARY UNITS
##FACTOR=    0.0002496,     1,               1
##FIRST=     0,             0,               0
##LAST=      2.0444736,     0,               0
##MIN=       0,             -434013,         0
##MAX=       2.0444736,     454965,          0
$$ Real data points
##PAGE= N=1
##DATA TABLE= (X++(R..R)), XYDATA
$$ [...]
1825A169j524k93J49P64N16j593K82J430k56j264j67J706P7k356J212J674j772
1842b46j81R12L00r25kO76l85m02P33j61M4J71r25P08O09j112j65J089Q3j257
1862d36m40K277p31j608J135N84p78j69j01J013n54o46N22J35j44Q5k74M00J68
1881D38r42M07L38m29k23P0N83n87n08J161j39p88M69j61M88p40o8J066o32n71
1901g68O23J83l61O9j12N03k61j69L28l81N04K46q36O67P0m93J06J22n1j78J33
1922e6P60j180l4J231q44J38J91k40P15n40J73l0k85L81m53j42R60o90m24P39
1942C70n5m34L48J02J15m07nM26n79M10L32j167O47K83n23Ln7L87k61j12O48n84
1964a13q6O83o07J5L13m20J76M9k73lK84P1l85k86N64L40r04N91j43J6N9p6J48
$$ y = [1169, -355, -648, -499, 265, 781, -812, -530, 900, 644, -620, -787, 919, 996, -1360, -148, 1526, -246, -427, 485, 785, -140, -142, 534, 149, -253, 480, 319, 363, 534, -391, 317, 926, -186, -351, 738, 821, -436, -876, 1401, 670, -938, 197, 781, 3, -166, -267, 746, 192, -454, 68, 203, 59, 144, -130, 270, 438, -504, -97, 241, -188, -411, -341, 242, -345, -853, 308, 169, -619, -150, -311, 177, -563, -631, 435, -197, -768, -145, 38, -323, -254, -366, 137, -124, -293, 35, -346, 158, 404, -432, 235, 305, -188, -82, 40, -11, -189, -56, 704, -476, -510, 721, -123, 15, 206, -34, 681, 141, 314, 284, -1, 380, -73, -215, 745, 55, -369, 370, 315, -119, 229, 331, 446, 39, 34, 460, -119, 291, 623, -544, 103, 386, -137, -134, -191, 196, -65, -177, 471, -113, -199, 484, -123, -108, 205, -215, -39, 10, -263, -266, 18, 89, -296, -582, -18, 322, -582, 9, -134, -118, -59, -135, 13]
1987A3l48P0L15l05K09K02p86N77M6k73N9J57r6J1r7K39k77K09L76n76oN79l34
2010c6k05N03k03k28j27K06R0J68J59l59l30Q45m42MK52l85L44j92M2J14j63L43
2032D00k8n58N99j79l51M40j92J60L30m09N5R8j80q6l31L16L34p97L84J71o58
2053d82M32J83j32p4K41j38j71p8M52j09k62M35o18n5P07p56O9L70l8l82L0Q61
2075D85m95p55Q68J00n67L00K3M4j41j31L42k69P3L01q66Q85L9j003N57J47j10
2096a73j27J6L07M0j80K05k13J72J92m50K73L17m50L97j21O9q2P7J27l09m32O97
2118C52j33k91M65O9l58j42j53P28l29o42O72k9P18r87l23Q41J0p37K78M67l45
2139A31k22l5O94m77l45J81j00J09O3j86K43K7o07O48J9m12k4L40R6o30p9N45
$$ y = [13, -335, -265, 50, -255, -46, 156, -630, -53, -7, -280, -221, -64, -160, -149, -246, -7, -284, -75, 301, -275, -281, 298, -36, -241, 262, 59, -169, -296, -90, 0, 168, 327, -32, -362, 483, 41, 45, 297, -88, 256, 64, 106, 220, 57, 400, 372, -186, 413, 234, -117, 323, 131, 291, 621, 212, 267, 365, 185, 99, -232, 84, 418, -379, 5, 176, -482, -50, 133, 1, -73, 168, 30, -141, -219, 233, 124, -138, 297, -321, -376, 331, -425, -356, 14, -24, -406, -376, 485, -10, -765, 103, 203, -364, -64, -41, 3, -138, -269, 73, -196, -123, 178, -688, 197, 236, -767, -210, -63, -173, -300, -284, 23, 63, -117, 88, -125, 47, 239, -211, 62, 379, -71, 326, 205, 274, 192, 269, 396, 87, -345, 352, 219, -72, 393, 462, 104, -38, -191, 537, 208, -434, 238, 209, 927, -60, -383, 458, 468, -269, 9, 476, 131, -91, -126, 568, 91, -254, -73, -173, -64, -1, -187, 56, 83, -524, 124, 143, -269, -293, 47, 143, -487, -566, -21]
2161b1L40j103K54Q41J34j203J58Q41r1o47J31L83J97n94m17J271l16n68J53M7
2181b10N41o62m6P20l36l06N36l70J83l57P2P28q42k2J003l28m92R0P13R2j163
2202d56J10R50k50l96k68K66Q67j032n4O09K76l14o71N26R03j444J02R53n29k18
2222g0Q4L84n06r7N21k72o18P92L53n32k2k84O90K56q54l44O87L40o40j225J343
2243a4R52j463m02J044K52p68k64Q77J20o83LL99l8p3j65n6L68m05r8M21j19P5
2265c7n7K8k00k52P29J56p54K51K79J35m50n85J311J26j304L3J021J57n51p51
2285g15J122K20q62j20K03N49j8m80O9M10m92R6j12M25j11j18J02q7k73P17j16
2306D09o57K28L93kn61j97Q19J78o34k00J48R36m01j381Q83Q69o82n46J16R34
$$ y = [-21, 319, -784, -530, 311, 445, -758, -600, 241, 150, -497, -366, 17, 214, -380, -797, 474, 158, -410, -257, -210, 331, -331, -377, 343, 7, -299, 237, -133, 50, -307, -235, 493, -349, -371, 632, 304, -188, -98, 615, 707, -456, -346, 604, 354, -42, -310, -44, 823, -209, -263, 346, 622, 308, -363, 163, 1066, -378, -276, 677, 148, -70, 14, 398, -108, -205, 316, 44, -574, 218, 571, 39, 17, -267, 423, 679, -175, -519, 168, 508, -132, -1357, -14, 938, -525, -927, 117, 369, -399, -663, 214, 334, -349, -346, 53, 15, -58, -223, -279, 89, -316, -414, 7, -112, -37, -94, -66, -266, -518, 211, 367, -387, -136, 143, 278, -172, -757, 554, 680, -624, -591, 430, 587, 36, -715, 407, 627, -235, -355, -152, 397, 379, -101, -32, 378, -114, -18, -130, 295, 184, 66, 168, 81, -192, 525, 409, -248, -20, 373, 371, -190, -387, 432, 610, -24, -224, -76, 860, 459, -922, -39, 830, 148, -398, -282, 652]
2326F52p32p47Q97J54n25K28K42l34J05k9j43m5O7L82n50L84p2j92O26n91m56
2347f79O95K75m48l67M88O29o66q61Q22M15o35j07L12M94m42l18L45J42R8k06
2367a4m30O60q4p8L1o6K00J07n47K05j08J14L78m85J05L27k04J1l97M62K52k35
2389B04l26P4Q0M26n21l62J226m55l70JL48K3n04k61Q56o9m35m8K3L84m73M4n
2412a40J32P1q6m12M18J99j97J57o48L02L74l92kJ80J00J66p38L57N19n55j46
2433c41K07P0L49n59K31L41m46r1J49P7K21l72j08L70j48L30n22qJ87k62K67K62
2455B04n21O12j41l71J44K5N6P5l23M30Q6j69l35q5L75J47j61m1K79j82Q4r3K77
2478C72k45N6j45J6n6L48p0n91M38l3j44K08l57L17l80J97J48j68J97J21k66J74
$$ y = [652, -80, -827, 70, 224, -301, -73, 169, -165, -60, -89, -232, -277, -210, 172, -378, 6, -66, -258, 368, -223, -679, 16, 291, -157, -524, -36, 593, -73, -934, -112, 303, -332, -439, -127, 367, -75, -393, -48, 94, 192, -14, -444, 216, 132, 54, 85, 19, 219, 326, -221, -16, -124, -10, 368, -117, -12, 315, 111, 122, -275, 187, 439, 204, -122, -48, 32, 458, -63, -425, 801, 346, -24, -23, 325, 348, -156, -417, 439, 370, -65, -113, -90, 294, -179, -135, -140, -8, 63, -23, -435, -17, 182, -15, 142, -506, -204, 170, -222, -224, -44, 56, 222, -516, -159, 360, -195, -341, -134, -64, 285, -274, -43, 298, -148, -239, -90, -13, 208, -164, -272, 98, -50, 280, -242, -250, -63, -325, -58, 204, -317, 295, 154, -217, -73, -48, 8, 83, -240, 190, 276, 107, -228, -313, 62, 209, 48, 7, 286, 104, 188, 95, 372, 127, 183, 38, 54, -2, 346, 276, -315, 123, 90, -54, 154, -203, 114, -266, -69, 79, -89, 108, 229, -37, 137]
2500A37j2j31m0p9K09k2k27K49r1k11oJ68R6ll45K59l0j25K46m76L27k14k8K20
2524a29P1P2L6m72N27k95j18K23R4l18K89k24L9J21r2K82k66q2M83k76LK67l48
2547a13J54j24P6k72J47K00j38J02J58K6n24L44K4n3l80M69K00l74K02N2k90J07
2569gL33m16QK14j49P0l3K90k66j71O4j16L30k7j5j97K24k1J66k59J56K30n81
2592a73J61j4j77J26k6RL31l30J46j4k20K22J2k97J43on7q6K7K89r5L2j4l17K51
2617g7jJ9J19j98l2L50l9j11j37k59K70Q5n5J45j76JK6m8o5K80j56J08k88L74
2641A35Kl0R2l09O5J14j26N3j92J04K93l11%M17m66J78L53n22MJ67l7K64j07K4
2665A65J79m80K21J71l68L18k93L78l27Ko6J97L0k1m04M17Ok76K38j40K11m56
$$ y = [137, 125, -6, -46, -125, 84, 62, -165, 84, -7, -218, -224, -56, 40, 37, -308, -49, -79, -204, 42, -434, -107, -321, -349, -129, -58, 14, 50, -422, 105, -190, -308, -85, 9, -309, -20, -244, -205, -84, -176, 106, -160, -242, 241, -35, -32, 235, -113, 41, -83, -7, -279, -132, 68, -70, 32, 190, 216, -308, 36, 60, 7, -373, 96, 296, -78, 124, 176, -114, -7, 326, -90, -82, 132, -17, 53, 20, 310, 44, -127, -63, -179, 151, 124, 109, -88, 136, 115, 281, 22, 178, 408, -173, -12, -26, -203, -77, -103, -94, 237, -93, 53, 39, -181, 41, 53, -244, -101, -107, -164, -250, -223, 66, -29, 3, -11, -328, -77, -78, -59, 60, -138, -170, 180, 141, 30, -107, -366, -96, -11, -66, 79, -97, -96, -70, -118, -183, 97, -59, 49, -239, 135, 137, 107, 199, -110, -45, 69, -57, -4, -196, -92, 201, -110, -110, 307, -159, 19, 372, -150, -146, 21, -16, 248, 141, 165, 344, -136, 85, 256, -112, 206, -87, 291, -36, -34, -100, 97, 127, 106, -298, 119, 125, -151, 87, -53, 158, -298]
2687b98J79L33J20r43N40K72k06Pj02k01J82l4j24J14l1J78k96J57K99k03J23
2708F6J3k60L73j72j10J62k98L29L4n08M17J67j05k21l24M35l6j64J97J41Q8l10
2730h6p5K5K92k34K0J90J12j26m65N23k61J72J0J38m41K49K66n43J67J61q7J7
2752B4j52L28k98K08j98M6N80k66l57j77M20J13k70n06P85J37q81K29L97n2K85
2773C95q11J79J53J02k4k15K89p3m5j99J9K07J16k38j78O11k59Q2l25R2J56j80
2795a46k03N3J25M54m31l02O94Q2k62m65M98M12n94k70L90j41Q9q4k22L30J78
2816A85k36l10L58K05l64l35N34M3j34K15l68L63m7K1j51j00K87K16o61P4N60
2837C55j83m30J27R4N83l78j91K75j85J04j83l5M8J78q2k17J03L46k15l27K5J38
$$ y = [-298, -119, 214, 334, -609, -69, 203, -3, 4, -98, -299, -117, -151, -275, -161, -192, -14, -310, -153, 146, -57, 66, 79, -181, 192, 20, -90, 72, -226, 103, 137, -371, 46, 213, 108, -113, -437, -2, -38, -202, -5, 136, 224, -86, -161, -136, 156, -78, -58, 132, 244, 118, -347, 176, -85, 87, 97, 235, -206, 43, 309, -234, -67, 94, 7, 24, -128, 200, -98, 110, -88, -42, 538, 272, -85, -262, 158, 271, 1, -505, 280, 417, -464, -235, 162, 110, 395, -416, -237, -84, 18, -6, -221, 68, -5, -50, -249, -230, -23, 93, -145, -323, 288, 29, 111, -214, -122, 34, -146, -349, -296, -171, 283, -148, -450, 244, 326, 64, -401, 97, 509, -85, -355, 35, -106, -17, -101, -323, 7, 185, -51, -361, -3, 202, -162, -497, 37, 80, -54, 161, -207, 156, 109, 130, -21, -121, 166, 382, -279, -205, 355, 172, -258, -131, -37, 546, 168, -23, 252, 67, 171, -12, -47, 1, 179, 97, -120, -17, 329, 114, -213, -188, -50]
2859e0J28j0j23k8O0n3J87j56J56k78j33J81J20L43m53k43L05nj97j55K46O7M30
2882C39o80J46L60m2m32M5J71N36o22J6K79j58P8k10k66N43J20n15J69j15M09
2903A71J42o41K24J72J08j95l33L40M52l09n59M97p1K56j56j70L09j73j02j62
2923b00L26K25n58L70N1M6k94n7o9M18J9k54j84O3M05k17r9R1r7J70j08r6R4K95
2947C40m12p6j07L10n5k29J41K64k60n8l5J98K86k91j63O9J40Jk2k99J44pK09
2970H8j78K13P9l03J06j65L38J0l34L03M4L3k82p3M7J87j16K2J17N2k40j00N0
2993a02J53k27J68j01j91N14l32o1R2L6q9R7p0J93l3k1k24K14M1K5J1m21N65j08
3017A29l97M57j82M06j77k00r0M5N2j37K26K71o10K37O8r9L7r5j24K36p7O0J43
$$ y = [-50, 78, 68, -55, -83, -23, -76, 111, -45, 111, -167, -300, -119, 1, 344, -109, -352, -47, -52, -249, -404, -158, -91, 339, -341, -195, 165, 123, -309, -264, -93, 443, -179, -163, 116, -42, 36, -174, -440, 103, 223, -292, -123, -238, 171, 313, -328, -104, 68, 176, -19, -352, -12, 440, 131, -428, 69, -2, 254, 98, -72, 237, 64, -38, -200, 126, 351, -207, 163, 214, 260, -34, -91, -160, 258, 277, 23, -161, -98, 307, 90, -9, 82, -15, 155, 47, -49, 45, 340, -72, -148, -255, 55, 0, -229, -88, 176, -84, -142, -177, 21, 307, 16, -147, -78, 62, 63, 41, -258, -114, -121, 88, -90, 123, 202, -101, 5, -160, 178, 188, -146, 157, 201, 234, -48, -121, -74, 113, -3, 19, 136, 188, -52, -152, -102, 51, -176, -8, -109, -300, 214, -118, -179, -87, -51, -140, -43, -113, 80, 47, 26, -198, 16, 57, 82, 93, -328, 237, 129, -268, 189, 7, 413, 236, 36, -54, -9, 43, -94, 132, 403, -207, 30, 98, -1, 36, -59, -183, 53, -24, 36, 179]
3040A79m21L58J25m03J74j93J12P6j09K09l5k6qp7J67K2k96O7p2k18L64J89j17
3063F7Rj95M00m42K53m3j10J61K2l57K55L3j96O0n5K19j61j74J79l1J56J97l51
3086a04K9nL11n8j80OK91l41Q4%j5K86nj43j9l9Q5k56O0J71jl99M59m90K88J57
3112A72k59m8L7QK99j28k00L36o03L19OK8j67K0L50m1Po1r7n6L21l48m5K49l32
3137b33Q7J02J8J4k6J28R2l75K73m00K60R8R6m30L86k91P0p2j74L34J00k34j90
3160c67L48q7L32m37R2K03N6j96j36K02k9K4oj63K17J04l28J34J37n2n7O5k46
3183a90N45k68Mr1M3K01j61q6O9L6O1k51K87j56K08l13M20l74J72j82j8k7K49
3206A78j41M4N0J5M9k36J62J44n09l3M01J66m42K88p8j01M3l1q3N1J08j40K84
$$ y = [179, -242, 116, 241, -162, 12, -181, -69, 7, -102, 107, 72, 46, 38, -39, 128, 150, -146, -79, -151, -369, -5, 184, 67, 76, -119, 281, -161, 92, 49, -61, 100, 122, -235, 20, 53, -143, -83, -138, 81, -80, -254, -75, -106, 50, 247, -104, -75, -80, 231, 173, -7, -1, 290, -51, 33, 33, 18, 304, 299, 156, 137, 98, 183, -73, -13, 158, 157, -242, 217, -273, 15, 172, -87, -135, -98, -90, 209, 81, -119, 217, -386, -67, -61, -33, -200, -180, 170, 129, 136, 75, -22, -78, 243, -105, -150, 99, -233, -146, -44, -26, -12, -38, 90, 182, -193, 80, -320, -60, 38, 134, -296, 90, -201, -131, -203, -377, -43, 57, -177, -367, -19, -106, 226, -211, -119, 84, 140, -56, -192, 10, -19, 5, -1, -164, 53, 157, -171, -37, 100, 48, -9, 56, -190, 355, 87, 91, 0, 43, 244, 83, -3, 66, 102, 163, -88, 199, 43, 251, -62, 358, -16, 156, -26, -44, -71, 178, 37, 81, 131, 146, 195, -41, 121, 265, -244, -277, 124, 290, -152, 136, 58, -43, 0, -31, -114, -63, 45, -95, 189]
3229A89n08K85K31m08J7J38n0K67k48k10K49J74k82L72j20j44p4O1K64k95j29
3250b21K04QK5j90K90m3J20k47R7l45L60K39k82j50M7J07OK4n9J5j25L51k55j20
3274a44L15r1k01J38K34r3j74j43R8K25l32J12N1J56k4l55M66j21j47j37R8L2
3296c7K56j51p5l6L94j98o5L8R6j40L3Lo8o9k00K06J01j26L1q1k6M07k64j09L8
3321d2P3J76n05M64j57j69L60l10J58J69k58j57j1K23J76j26Q6m6k69K8K3j40
3343b54L86j05J13k76J69J77j38n40L17L64l93q7M56QJ13n40L87j0n3k37J33M5
3365C5p2j19J22L1J7J66j73J43L0j63K5j2q9J85o0j16O8q2L37k32j46Q3J52m7
3389H3k52J28J67Q4j46J9J2O9q0r1K6L19k46j58j49J71R4ol07J51l3Q4k70L31
$$ y = [189, -319, -34, 197, -211, -194, -56, -106, 161, -87, -297, -48, 126, -156, 216, 96, -48, -122, -61, 203, -92, -221, -17, -9, 16, -174, 116, 73, 193, -54, 43, -302, 58, 297, 15, -135, -88, 19, 25, 49, -10, 5, -120, 231, -24, -144, 171, 80, -121, 17, 251, 158, -16, -159, -61, 164, -168, -56, -5, 151, 127, -228, 238, 117, -30, -167, -69, -37, 219, 68, -7, -43, 351, 153, 88, 126, 222, 82, 115, 118, 50, -19, -219, -13, 88, -38, -7, -88, -114, 293, 29, -80, -42, 31, 207, -298, 166, 9, -160, 200, -110, 48, 217, -41, -198, -209, 14, 190, 64, 150, 104, -165, -137, -114, -254, 132, 27, 140, -136, 33, 210, 72, -468, -151, 213, -180, -267, 189, 197, 310, -230, 157, 147, 94, -143, -10, 35, -37, -156, -34, -3, 14, 180, 7, 150, 180, 17, 42, 30, -59, 126, 66, -50, 18, -64, 273, 41, -105, -22, 130, 83, -169, -41, 126, 210, 64, 83, 95, 164, 84, -7, 19, 338, 92, -66, -215, -44, 50, 44, -263, -112, -145, -61, -331, 0]
3413@M0j65K43l06J74K1J92l50K24J22j27r4k42L63N3j93j80j4L59j49O7J18k97
3436a41J63l87K80M2Q6j73p9J27J7J27k32PJ7K27M1n6K7K05m47K28nl3l3k64J08
3461a48K45nl69K65J73O3l72R5J4J32O0k10k4O0L85l60k6K23j06J65l70K09j23
3484b4k44O20n97M17j61m17K96mJ0J72k21L91j65j97J12j7j46K39m9j16J25P0
3506I4j12j41J9N6Np7K82q3O1m34J79K9O6L19m61M6L21j29p4J44j15M8k9j51m1
3531a78J43k81P6P5M3J36k27K56j82M39j60L9k35J11j18J25k68K04Q4j02j72L05
3553A13J48r7j28J22P5k11J74k61p1K87j48n1R2k1N8k39K26J26j4m25K68m1J86
3576A68r2j50O4P5Jk3Q1k12K92j92Q9j17J01J88k41R9l7q8L66l01p8l6p4J9j1
$$ y = [0, 40, -125, 118, -188, -14, 7, 199, -151, 73, 195, 68, -26, -268, 95, 148, -45, -225, -239, 120, -29, 38, 156, -141, 22, -365, -85, -43, 43, -130, -209, -82, -65, 62, -170, -163, -146, 81, 122, 66, 93, 298, -149, 79, 74, 41, 8, -256, -148, 97, 92, -277, -12, 161, 224, -148, -53, -39, 93, 153, -57, -81, -21, 364, 4, -22, 201, 95, 260, -110, 99, -24, -268, 352, -245, 172, 11, -406, -110, -114, -104, 68, -153, 238, 73, -124, -12, -29, -175, 64, 15, -101, 24, 94, -18, -159, -140, -84, -79, -156, 126, 43, 104, -330, -151, -122, -56, 263, -198, -152, 169, 40, -34, 110, -5, 43, 14, -137, -178, -35, -316, -240, -165, -122, 14, -213, 43, -139, 300, 140, 179, -56, 55, -63, 62, -206, -2, 82, -20, -192, 113, 261, 164, 36, 158, 233, 22, 196, -65, -136, 151, 3, -48, 44, 23, 81, -158, 68, 194, 180, -245, 23, -18, 168, 76, -74, -10, 65, 66, 43, 124, -88, 204, 12, 101, -16, 85, 273, 32, 131, 94, 6, 372, 71, -7, -43, -117, -98, -109]
3601a09J5j54L4J68p1K60n3l57K51j9q1J24J41l36Q6L50k69K26o0m5p1k18K57
3624F9j89J7J19p1n6N7k99O05r3j55N4j96j02M27q3j23p7K46k97J09j12L31j71
3647A0J06o7PJ83k93J2P4P1q8j53mK42p7J25j45J53j83K0k12K21k00K36k76J12
3671a26j2J34k1l9P5j00K80l38J65J36j84K68m12P8J96k70J17K06j85j18M3J48
3693D1q4k97L42J16l7k14J66Mj10j2L9J8j70K11n3r5K64k46K18Q5k59J76l95M3
3717b49M65q7k55K06r6K2k29k9K98K9k05K92l30K7L19j52Ok3j10J03j22K31J48
3740B59j75r8k8J47k44j06L53r7P6j62J53J48k87N4l7j3J57j05l2q1k8J81q2Q
3764c9k68J24R5N8K81l00J58K9l68J79J01J6j87J21l51M66j13J13m71K84O7J30
$$ y = [-109, -94, -248, -214, -46, -117, 143, 90, -267, -16, -35, -116, 8, 149, -187, -101, 249, -20, 206, 146, 101, 30, -188, 69, -120, -103, 16, -55, -111, -54, -353, 252, 159, 4, 58, -138, -240, 187, 104, -19, -96, 150, -147, -38, -150, 181, 10, 116, 49, 56, 239, -54, -42, 32, 103, 15, -138, -142, 100, 23, 148, 3, 156, -27, -7, -219, 2, -198, 38, -238, -126, -138, -4, -25, -64, 11, -89, 191, -147, 18, 154, -30, 238, -174, -96, 100, -170, -53, 153, -32, -150, -107, 41, -43, -340, 2, 118, 81, -133, 33, 37, -73, -85, -46, -28, -198, 13, -40, -135, 129, -117, 101, 186, -73, 103, -292, -249, 216, 129, -126, 80, -16, 6, -223, -252, 46, 75, -130, 162, -168, -141, 178, 26, 32, 9, -101, 2, -120, 111, 259, 84, -14, -42, 105, -139, -245, 108, 11, 87, -75, 78, 226, -61, -7, -44, -57, 100, -5, -37, -118, -146, 35, -47, -39, -307, -183, -88, -30, 251, -49, 109, 138, -230, -51, 50, 66, -121, 0, -351, 115, 2, 115, -356, -72, -5, 125]
3786A25k77K92k34r0J10o8k42M64K07m38o3J42J38j0j88N5K54j37N1k08K99l91
3808b09K75J8n4qk58J97J12l70K71j89K66n3J44l24n7R9J07j56L39k71J67J48
3830A94k28rP1Q0j28rM40k59k83L87m62M02r4j98m3K03kl17K00O8k61J94K6Q2
3854E4l47N05j46k44M9j38J33J38j57J04L18m93j04K79J56m1R2l04J95L5j87r2
3876a95M0L64l95J43K49l55K19k6k8j77J74n7O0j09J95L5k78J98r2J56n0r1L6
3899A6P3L7j35l1m5J32J08p0K11k56m9k25N13l27j91J48O3L93l82k36k8P41p50
3922b90N92k01J8j5M1j31NN5j21l91J78L00J12k09m6J30P6J16l82J00J16o1j71
3945a79J21k2K26m97M11p6J29q9j70k41O79k7k12j86O8M71n29K61k19n7K99Qk09
$$ y = [125, -152, 140, -94, -184, -74, -142, -384, 80, 287, -151, -214, -72, 66, 56, -132, -77, 177, 40, 91, -117, 182, -209, 66, 84, 30, 22, -236, -39, 73, -297, -26, -215, 51, -2, 142, -182, -239, -140, -33, -189, 150, -121, 46, 194, -34, -43, 28, 108, -20, -29, 411, 152, -131, 256, -206, 196, 102, -96, -139, 64, 62, -255, -55, 13, -248, -54, -28, 54, -293, 212, 66, -178, -129, -267, -134, 4, -153, -49, 269, -224, -328, -49, 107, 66, 158, -146, 49, 84, -103, -195, -155, 209, -186, -43, 206, -149, 70, 44, 16, -161, 13, -44, 16, -93, 102, 137, -141, 57, -35, 121, 71, -20, 16, 89, 126, -9, -40, -85, 47, 155, 85, 296, 40, -9, -234, 279, -48, -239, -91, -28, 365, -17, -253, -281, 460, -290, 302, 101, 119, 104, 145, 14, 19, 74, -47, -438, -260, 40, 152, -57, -103, 27, 103, 219, -163, -63, 53, -8, -179, -58, -80, 146, -351, 60, -16, 113, 24, -146, -387, 292, 265, 53, -133, -65, 406, -123, 138, -81, -138, 161, 169, -40]
3968d0k9j56K34K5R5j73J37l38L64j56J17m2j34O7J7j51J41j21J8L5j01k7M21
3991B03j63Lq0J78Rk80J63L9k27L49j59K41k1l29L29n7k6J56n28K52J6l5P4j60
4015e3pL74k98k33Q2J94J34l24K60Q2k3k3k73J47k03K46m45M22j41L27J03l41
4037GJ51k25r0J91P9j98J11K31k51j01mM7l0N4K20l47J96k21J2N0j42p4M39J4
4061A19j43j13j18L20j47j12L4K20J80q9k91m5K32k54J02l7Q5J21l61K08O1j53
4083a81K04q5J51n3r6J09l04K51Q7M3k41J6J80K10k74j6J18K1k79L79k4m5j24
4106D7N9n2PK8j51J25j2j94KJ59mr4L93l58k05L05P3l45K83j28J50l42J28K30
4130A04K0j15n0k06P1R4m3J56M5r4K59l52J05%nj6k96N5N29l67J62k58o3K45J73
$$ y = [-40, -69, -225, 9, 34, 129, -44, 93, -245, 119, -37, 80, 38, -96, -29, -12, -163, -22, -143, -125, -90, -191, -218, 203, 40, 43, -37, 141, 150, -130, 33, 72, -155, 194, 35, 276, 255, -74, 255, 198, 172, 328, -200, 52, 68, 33, 107, -53, -60, 314, 16, -217, -135, 59, 193, -131, 129, 211, 188, 165, -108, 39, -164, 82, -363, 59, -82, 245, 348, 7, 158, -67, -157, 34, 113, -85, 26, 257, 6, -95, -99, -52, -82, -28, 192, -155, 41, -180, -168, -118, -260, -334, 105, 119, -24, -137, -255, 65, -82, -194, -160, 60, 240, 151, -140, -185, 47, -207, -105, -142, -57, 64, -297, -89, -28, -181, 23, -62, 89, 36, -60, 49, -255, -4, 83, 126, -115, -99, 81, 291, 17, 1, 119, 140, -139, 240, 216, 171, 47, 106, 54, 61, 89, -62, 63, 51, -143, -141, 18, 14, -80, 313, -45, -250, 55, 128, -217, 66, -62, 88, -254, -126, 104, 124, 9, -41, -247, -176, -82, -125, 31, 76, -18, 241, -111, -6, -6, -11, -27, -323, -268, 261, -106, 56, -202, -265, -20, 153]
4155A53k29J86k19j06K21J2J4m84N48n2j37L44k22j12K5J24J0j61N0K26k45J29
4177G5k6N7j10J60j94L5l9K99k5m25J48J08J38p0k77J61j70J32J60j60J1J71l6
4200A23l36L73m5J89j71j30J63l81J63R6r8K8k14J68P7m9N9R9j37j88K98j24o1
4223i8k65K90lP3q5k3J47O4R5M2r9l96M69l98j5K34lR0p0r7k5L03n54L85q6j6
4249d1j26J34j48K63n2J0J42j28J26m45K84O3O1k02m1K1L99o36M46k07q5j10M92
4272B20l78J16K1j1J43j17J47l01K55Nj75L0M7n3m14L50J86k17K68Q4l34J47j12
4295i3R4lk01J18L10j53J28q6k15L21j82L6jk25j3O7l9o1K45M2j19j13k44N56
4319A69m85K22K07l93L30n6M0JK36l31p7K03o3r4Q9J60k57L7J12M9j41n1j7K28
$$ y = [153, -76, 110, -109, -215, 6, 18, 32, -452, 96, 44, -93, 251, 29, -83, -58, 66, 76, -85, -35, 191, -54, 75, 49, 106, -4, 156, -38, -3, -42, 257, 232, -193, -45, 63, 201, 131, -146, 15, -155, -23, 137, -23, -12, 159, 123, -213, 160, 115, 304, 133, 3, 166, -215, -52, 44, -54, -26, -240, -72, 5, -44, 15, 114, -23, -211, 87, -37, -98, -363, -73, -76, -3, -88, -111, 36, 100, 195, 237, 138, -258, 211, -187, -202, 32, 29, 119, 49, -48, -73, 230, -324, 61, -25, -41, -167, -33, -181, 82, 30, 40, 182, 54, 180, -265, 19, 82, 143, -59, -100, -79, 320, -316, 130, -77, -162, -272, 220, -158, -42, -21, -32, 111, -6, 141, -160, 95, 100, -75, -45, 2, -51, -465, -115, 71, -146, 122, 206, -128, 19, -93, 1, -2, -203, -85, 225, 72, 200, 114, -101, 220, 38, 74, 73, -152, -165, -98, -137, -198, 47, 89, -30, -143, -387, 169, -316, -94, 113, -280, 50, -6, 34, 35, 271, -60, -137, 66, 3, -91, -2, 158, -99, -62, 50, 99, -42, -93, -110, 118]
4343A18P9j22J77k40j06m59M88K63k85J59j73K04J75R5j93J46j68j54J2O6j0j91
4365a19K53m1j17K47j73m8j81K43R0R9j65j74k1m13N06J16j10j45K84q1M5r8j12
4388a15lK36j05k11M44P4r2j63j29J50l0j22K26k1l07K62j98O3J02p4j5L2k8j24
4412a48K79k75K88m63J01K16J33j59P9l22M14p0n4K11j63Nj18k5J68j98J1L19
4434B29m39O9K27n0j02L57j76k76J45J30J06j51KJ27r9k5k6Q9J4J25l07J59o7
4457F1J59n9k85l5J64l9J30j23J74k8n0m5j06J93p4p9l0m3J31Q3k34J03J58k8
4481I8m6o2l1K63k16R6j30k3p5KK97j04j71K4J25k24L37Ll36J50km9P3%K36j20
4507A15k01J26J2k4j8j40K40jm2l58J70K31o5l48M01r1J97m34R7J74J49L7m6k78
$$ y = [118, 197, 75, 252, 12, -94, -553, -65, 198, -87, 72, -101, 103, 278, 373, 180, 326, 158, 4, 16, 82, 72, -119, 134, 93, -24, 223, 50, 2, -179, 64, 154, 253, 88, -86, -107, -520, -14, 102, -8, -153, 131, 50, 95, -3, -115, -118, 118, 13, -198, 246, 320, 228, 65, -64, 86, 56, -66, 160, 139, -168, 94, -104, -41, 61, -13, -28, 4, -24, -148, 131, -144, 144, -319, -218, -2, 131, -28, 51, -271, 143, 73, 19, 230, 67, 72, -46, -71, 97, -101, -90, 229, -210, -141, 86, 36, -66, 291, 115, -161, -16, 114, 220, 69, 71, 198, 99, 74, 48, 137, 151, 276, -31, 128, 61, 220, 161, -124, -159, 5, -34, 96, -27, 147, 119, 69, 24, -82, 111, 37, -42, -72, -115, 16, 99, -135, -32, 126, 98, 52, -10, -41, 222, 6, 102, -28, -51, -126, -124, 173, 69, -102, -78, 47, -177, 160, 163, -173, -23, -25, -74, -1, -1, 235, 115, -86, 40, 52, 28, 10, -130, 110, 109, 67, -291, -121, 110, 45, -303, 98, 7, 204, -230, -133, 41, 190, 227, 181, -97]
4531i7o9L01m93K68J15LKj14N5Q6J69l70L0J42K7R9N4l14J28J40l26K21K56n79
4555b66L51M4j94K41k19j98M09j06J09j34kOq2j86K86p9N6r7m1J66M5j20r3j3
4579a17j47K77j78K98q8l80L65k15j9O13p99M75J00j59K6j30l7J00p7OP1r7L43
4602B31k94r8L47n30J48RK17j83J1O9J26r6J51R0k83K49j36k1K41p6j84q7k12
4625c11Q0J51Kp7J73O8J64k88L6K54k19L5o8k82M53j12J95j82j11L3J49K0k18
4648e5J77nj45J23n9k22K62r6k0N7m9L6Kj70L6K72mr6j0m7K5J2m8L42m65J61p8
4675f4L31p7Nk17J69M4m61K47n5Q0Lj05Kj56K34r1J59k24R1j8M8q5J71M4k43J39
4701b9K06q9l36K65j02R3%K07j19j19J41n8l6L4o4K02j50j5p6o8K90k98L90n0
$$ y = [-97, -166, 135, -358, -90, 25, 28, 30, -84, -29, 57, 226, -144, -114, 28, 55, 154, 208, -106, 22, 162, -164, 57, 313, -266, 85, 129, -65, 176, -43, -241, 168, 62, 171, 37, 35, 41, -41, -227, 59, -20, 36, -61, -102, 64, 109, -11, -104, -117, -264, 13, -165, 133, 45, -335, 30, -185, -204, 409, -390, 85, 185, 26, 52, -78, -115, -15, -92, -86, -15, -112, 231, -63, -161, 186, -344, -196, -187, 30, -153, -142, -73, 53, -43, 108, 198, -85, 164, 28, 7, 248, 172, -12, -99, -311, -231, -80, -78, -155, 18, 86, 250, -38, -2, 252, 33, 68, 0, -282, 171, 59, 254, 72, -39, -6, 143, 163, -55, 122, 117, -28, 95, 36, -186, 76, -20, -40, 17, -32, 4, 6, -164, -128, 144, 140, 44, 34, -13, 12, 24, -24, 318, -147, 14, -64, 267, 190, 195, -22, 147, 191, -270, -23, -78, 2, 5, -100, -98, -254, -20, -111, 48, -176, -85, -103, -55, -140, 31, 75, -168, -29, 177, 88, -248, 17, -85, 8, 8, 215, 96, -23, 118, 60, 24, 58, -6, 196, 46, 31, -45, -113, 177, -121, 269, 219]
4725B19p4l48J81j51L47k21Q7P0j85J30q6P3q1J85k71K79j77p6Q8k1o4J67k02
4748a31J80R5j20j10K30l29J53K28lj24k6P1l45L52k01j13L53J24l90K21k57K56
4770A14p2k55L40n8q8l7o2J88k6k11K35O3J71n01N2J80lJ26r0n7j90J8Q8O8J39
4795A32j17n5l10M06k29N4j4m1J53K30m54J70m1J15m5j73J24K80j81N3J78l05
4817g0j41K76p8K4J13o6j88j5j47L07k38J42J02K7k12L0M69m05O3O6L4j6l51M48
4841A74j86l0Q5j34nK68k13j03K75l30K15M2l80L64j8r8K71k94K91l31J55k87
4863b69J51J0LQ6j6RL9jJ36j69P4p3M3j74M5J48o7n2m0J64k4o2mJ04J12n8k33
4890a18N1L12j85q1Q6j79j76K99P9k31L18j70J55nO4l30L12l41J61K27k41k36
$$ y = [219, 145, -203, -22, -173, 174, -47, 40, 110, -75, 55, -31, 42, -39, 146, -125, 154, -23, -99, -11, -32, -96, 71, -131, 49, 144, 24, -86, 144, -185, -32, 196, 193, 69, 43, 114, -231, 121, -80, -193, 160, 284, -106, 115, -142, 114, 42, -213, 127, 69, -19, -56, -118, 70, 44, -167, 68, 131, 302, -199, -147, 33, 30, 156, 66, 9, -181, -163, -75, -7, 132, 15, -40, -350, 56, -173, -119, -133, -174, -21, 209, -245, -75, -116, -1, -46, -219, -95, 185, 4, 57, 235, -70, -211, 65, -13, 11, 124, 58, -130, -145, -292, 15, -223, -81, 21, 48, -164, -134, 335, -70, -7, 59, 93, 77, -274, 174, -12, -42, 43, -91, -96, 172, -41, -144, 131, -199, 16, 58, -322, 42, 24, -74, 197, -97, 194, -137, 18, -269, -118, -108, -105, -19, -35, -26, 13, 12, 148, -21, 53, -20, 23, -151, -106, 42, -25, -77, -117, 47, 23, -39, -43, 61, 173, 115, -118, -67, 245, 60, -21, 65, -114, -290, 9, 88, -143, 175, 5, 160, 155, 219, -111, 201, -140, 21, 248, 7, -229]
4912b29K88O2m1j35J02J61j45k13KJ84J81l64K72j84J41k2J1n2l22O5L40j8k54
4935a70K12k98K87k26J05K32l11J60L63l04mJ67m85J90k1j36K60M2j08K3m69M54
4957c7J5r8L19jl79K37j14j37J63K3l65J50K82R1k81L02j01K03O4k44k08m3L74
4980B15j02j53K07k18n5J26m8m7J46j8j95l2J7L56k59M11k42k60L28j51N4j86
5002a06K82j14j06L9K51k22J70j95R8o6m3P9n0K0k57J53k4J75M4O2j77J25k28
5025i0K12j91K12k89M13j63j56j63K75n6j96j4L1J96j53RJ38K73l01K29m10J24
5047g0K33k66k30L43j69K7J77n9J77m88N90m01J99l58J59P4K23j25j3j10J13k26
5069b00K28K1j15J19n5P0k53P1J21K27m95L45r6P6j89L14k79K45J9j42j09K00
$$ y = [-229, 59, 121, 80, -55, 47, 208, 63, -150, -148, 36, 217, -147, 125, -59, 82, 60, 71, 19, -303, -238, 102, 84, -170, 42, -256, 31, -195, -90, 142, -169, -9, 354, 50, 46, 213, -272, -82, -103, -239, 21, 63, -45, -22, -491, -37, -22, -120, 199, 198, -181, 56, -58, -195, -32, -9, -374, -224, 58, 149, -132, 170, 69, 272, 336, 92, -116, -159, 215, 113, -40, 167, -51, -106, 20, -28, -75, 71, 53, -142, -174, -157, 199, -60, 351, 109, -151, 177, 26, 80, -106, 176, 62, -44, -5, 246, 24, 194, -1, 97, 31, -12, 67, 17, 37, -220, -67, -91, 84, 128, 190, 13, 138, -90, 122, -69, 143, -146, 267, 104, -52, -215, 60, 4, -192, -206, -175, 21, -132, -123, 15, 288, -13, 216, -194, -70, 163, -103, -333, 10, -159, -132, 45, -14, 163, -325, 265, -136, 63, -295, -136, -62, 161, 36, 23, -87, 26, -200, 28, 49, -66, 53, -2, 68, -185, -114, 7, 234, -261, 84, -12, 64, -125, 189, -90, 155, 174, 32, -77, 123]
5091A23j5k63JK0J73Q8l05K30k2J6K44m66J28L6l2P5q0j12J21M3l7k72L39J48
5115A81k28L9j56J89R5POj83J10k80J37R1K40m52L51l1j04o6J03j36J44p6j52
5138a71J69P5j46j19J57O0P6k50J82j24m8J78K0k3p4O8J03k20N7J65k98R9N5o1
5162g0r0R9K86j18j36J66k76k9j0K23q8O0J2K94n29K58K8J15L7j45O0J1l51K86
5186I3O2k66K2Q7j21L9J07m4Q3k07J24J73j70J6j03j80L27k69K17j33P1J07j8
5209A7K2J54k35R2l81L49j61L6J73o4k15J51K3o1q8K69Q1p5j02j33K66J7k15K46
5233A66j2r0j51J11q0j20j00L45qL9k16M9J87k49K30k7J45k60P1k48J97j4J44
5256A09j59J56l6oj06J0J30O8K45l30j59K69K6j40P4k52M7J67k59K08j70O8J42
$$ y = [123, 108, -155, -154, -134, 39, 127, -178, 52, 30, 46, 290, -176, -48, -12, -44, 31, -49, -161, -40, 3, -34, -306, 33, 181, -47, -8, -164, 25, 120, 127, 133, -50, 60, -220, -83, 8, 248, -204, 147, 116, 12, -54, 49, -87, 57, -19, -171, -2, 73, -73, -192, -35, 25, 101, -149, 33, -91, -139, 39, 59, 36, -38, 30, 133, -87, -30, 135, -163, -64, -9, -70, -160, -61, 225, 107, -29, 137, -139, -168, -178, 45, -43, 17, 29, 323, -206, 52, 80, 195, 232, 87, 147, 158, -193, 93, 155, -111, -89, -2, -123, -84, 23, -21, 62, -145, -21, 152, -18, -2, -105, -285, 42, -227, -10, -143, -72, 35, 17, 39, 193, -42, 50, -331, 18, -143, -107, 66, 2, -213, -62, -39, -100, -188, 81, 162, 87, -15, -148, 118, 135, -80, 166, 154, 64, -87, 24, -56, -176, -276, 69, 61, 100, -116, -67, 120, -129, 101, 74, 219, -41, 30, -218, -21, -35, 109, -50, 106, 70, 64, -42, -32, 98, 166, 411, 81, -78, 191, 217, 77, 151, -101, -54, 113, -146, 62, -108, -40, 102]
5279A02k88K17O6J1k34J57k81L71j69K47m45K25rJ98p8l24l2J64K71R3l89J92
5301F5k51k28L81Q3j99J7J28j73L7J27Q5k56L3o0K45k95J87L45m04N52m20J85
5323A84L9k77Q2K20k10l5J32j93K30o4j4k85J06J61j02P8j68Q0m5P3o5K51L1k22
5347a3M4J65l00J4J4J13k7j1l7J1J23k64J29K7k95M65q9k28L12l15J83o2J68n4
5371G3N0j92L3j12j9M41k61K44j96j60Q8M4J10o8k38K49m40L74k69K72M5kk22
5394a56K88m1k7Q9j25k3J8k98L84j19k15M98l81K34j88K46l92L62j52P4rM7p7
5417C7o7O8q7O3p6k48J19L44k53K35r4o1Q9J88K8k31j77K5P8l38N49j10OJ6j81
5442g8K54k17j64J41J03j16q1L0j39N34j10j29K25j49K23k62J68l08J80J22l09
$$ y = [102, -186, 31, 97, 108, -126, 31, -250, 121, -48, 199, -246, -21, -30, 168, 90, -234, -266, -102, 169, 262, -127, 65, -186, -414, -33, 50, -149, -132, -4, -177, -140, -13, 72, -184, -151, -211, 34, -261, -74, 271, -133, 419, -1, 184, 223, -54, 28, 248, 38, 3, 135, -58, 172, 108, 94, -191, -85, 76, -26, 52, -116, -36, -81, -8, -73, 178, 209, -13, 31, 196, -104, -90, -76, 37, 10, -1, -38, -27, 96, -168, -39, -12, -307, 158, 69, -159, 153, -162, 21, -41, 127, 73, 123, -69, -36, -148, -167, 274, 13, 257, 61, -99, -11, 33, 143, 75, -163, 86, -354, 20, -249, 23, 68, 66, -156, 132, 91, 64, 153, 28, 5, 23, -275, 109, -10, -225, 273, -108, 126, -62, 184, -208, 154, 2, 76, 67, 114, 37, -30, 38, -49, 14, -62, -310, -191, 153, -100, 135, 41, -20, 69, 257, 285, 54, -123, -98, -20, -358, 191, 81, 87, 103, -78, 176, -41, -205, -64, 39, -77, -158, -128, -267, 267, 157, 28, 253, 104, 327, 65, 233, -75, 105, 227, -82]
5463h2m54L44j0O0K83r5k7j63L05j16R9N3k56k6K3j7P4j42n7M30m49jN78k91j51
5488h8Q5j71J56l0K17n9k57J40k3j32J28j63N07j55j09k18P0n7J49J05lj71Q3
5511DO9j07o0K00om59M58J03l7MJ51l17O5j96K02j13j5j54J76K8J01j54J96l65
5535b26J95M0j83K46l62K89j9N1p1R6o0J1J36j14pp7J24J6j80J05L67o00L49n9
5559F7m8M5k55J71j8K76k59k9P7M4ql14L09p7n3J24j37NJ4J08j57N3O3J17j37
5584a9O7k94L39j91j49J35J65J46r0r6j19p2J47P2k09q3J74k23J88m2J46O6j96
5607a38K50J17m20K29L5k38L05J34j79j75J76K2j62J96l49O4j9q2N89k82k13K96
5629A56l33J53j4Q4l2j3p1J90j70o6J50k66K02J59j19O9r2K92n92M44O0l26L7
$$ y = [-82, -536, -192, -202, -142, 141, 46, 19, -144, 161, 45, 144, 197, -59, -85, -62, -79, -5, -147, -204, 226, -223, -224, 354, 63, -88, -3, -174, -18, -48, 169, 110, -147, -7, -30, -162, -34, -197, 310, 155, 46, -172, -102, -159, -10, 95, 92, -79, 4, 73, -34, -94, 106, 100, -359, 99, 202, 165, 169, 320, 3, 68, -128, 74, -39, -54, -208, -32, -4, 97, -57, 139, -226, -31, 9, -174, 72, -290, -1, -20, 31, -40, 56, -4, 7, 143, 29, 22, -55, 69, 85, -95, 10, 377, -223, 126, 67, 19, 64, -191, -20, -38, 238, -21, -50, 27, 71, 63, -251, 58, -19, -72, 52, -85, -80, -66, 42, -115, -62, 1, 118, -19, 48, -246, 93, -98, -247, -112, 53, 199, 109, 13, -106, -178, -31, 41, -168, -251, -77, -300, -112, -154, -8, 58, -138, 112, 229, -191, 38, 73, -165, 140, 274, 95, -80, 96, 118, -44, 152, -197, -133, -152, -234, 355, 73, -140, 156, -177, -24, -38, 46, 14, 1, -70, 120, -50, -116, 34, -232, -30, 129, 10, 79, -13, 279, -313, 131, 191, -135, -98]
5652i8L3o9J80m64L06j05J94r3L8N6j07p5J70k38J12K16r2J08M0n9j71K5K12n9
5676F0j71r1K65j3J04q7J03m02J57J35k07Q1J71J16j41k38r2J33K69j30k6l3p3
5699a10J28j14N4j25J80N2Ok68J89q1Q8J37k6j37L4j52K24q8J0K6J45q9k8K14
5723B69l25j33p5L27L1K5q0J28o4l6k92L45Q0l59N3L2n0J92J44n26J74M2K88k85
5747i5K5l9J70m7j90J46qJ48M4l62J76J45j25j69L7q1L8k14K58J48J05J26k81
5770d5j34K42j59K69l37P6J15J10k21n4q1K32m8J44J84l07j4J5q1q8K54k86J88
5793b6m6K31k64K99q9k04J40k5j05J75R1j32P1L5l86L49j41J17k2k77K54k5j12
5816i2L15l49J96J30l61K10j77J57J02N9J10l41N3k7O8p8lk23K83r4r5M16j67
$$ y = [-98, -65, -134, 46, -418, -112, -217, -23, -116, -78, -22, -129, -204, -34, -272, -160, 56, -36, 72, 112, 53, -118, -93, 119, 60, -111, -202, 63, 50, 154, 67, 170, -232, -75, 60, -147, -66, 105, 221, 80, -158, -250, -117, 152, 22, -4, -37, -110, 18, -96, -42, -167, 13, 65, 71, -197, -8, -89, -1, 136, 110, -27, 7, -145, 79, -9, 1, 27, 172, 83, 55, 269, -56, -189, -264, 63, 94, 119, 39, 167, 103, 67, -225, 120, 200, -159, -106, -74, -124, 68, 212, -314, -140, -98, 190, -95, -70, -109, 61, 14, -176, -30, -38, 110, 154, -208, -32, 113, -12, -181, -144, -225, -187, -401, -143, 5, 110, 236, -45, -179, 63, -96, 173, -164, -88, 27, 137, -84, -138, -219, 13, -35, 109, 293, -14, -28, -13, -94, -182, 72, -214, -26, -72, 159, -105, 194, 105, -99, 41, 16, -89, 86, 177, 45, 116, 151, -235, 114, -27, 90, 68, -209, 45, 20, -92, 223, -126, 70, 200, -161, 49, -128, 29, 131, 190, 300, -41, 12, -15, 53, -25, -28, -251, 32, -62, -157, 259, 92]
5839I2j86L9k55K04q4j41K34j16J53q8k3OM48m40K22k59M3J19j50K0K26l5J76
5862B05j87J20l00J94j17J18N6%j48N2K31n31L47l7j23J35O5j22J08j4K51l51
5884d8j10Q5K9J2J16l19M33k19k28J51K59j05K68k99M8j68J37j0Op0j64L28k71
5907a39R9JR5P5j77j54L69l52L14l84L21J31j0p4M5k41J58j52j39J35K2N1J63
5930A57k28J86r2j28K5l3J07K98j72k42O1J02N7j54K11l89J57RJ12N8K02k81J57
5953A80j49q4J86L7K29m89Q2P5k53J53K20l57K09L14j75j26N0J6j42k2J44j0q5
5976Cj33K12l48J93q4O3J76J69j82O5Nj64K9K15k39N7K51l82J50J27j97k72M36
5999A50o0lk24k1P8J15P0L0j01j55J08R5K4k24j96L69m50J68K22j33K42k09J68
$$ y = [92, -94, -55, -310, -106, -190, -331, -97, -213, -60, -148, -171, -165, 283, -157, 65, -194, -151, -32, -182, -162, 64, 29, 205, 18, 138, -162, 32, -85, 33, 89, 89, -59, -7, 224, -307, 40, 3, -120, 15, 80, -42, 66, 52, 303, -48, -158, -73, -44, -32, 84, -235, 198, -21, -249, -98, 161, 56, 324, 25, 73, -95, 42, 32, 38, -32, -196, 132, -139, -40, -39, 56, 131, -46, -200, 169, -183, 131, -253, 68, 199, 189, 115, 160, -81, 77, -75, -214, -79, -57, -6, 157, -71, 115, 23, -105, -80, -113, -6, 292, 120, -122, -61, 41, 98, -56, 155, -234, -77, -68, 44, 102, 304, 23, 180, 31, -53, 133, 170, 399, -90, -8, 67, -186, -33, 187, -170, 39, 353, 178, 52, 102, 118, -24, -46, 98, 88, 3, -130, 82, -266, -73, -157, -94, 82, 251, 69, 134, 139, -25, 4, 219, -20, 37, 288, -94, 56, 183, -14, -286, 150, 90, 87, -137, -158, -80, 35, 105, 135, 34, -121, -13, 82, 106, -118, -314, 55, -395, -227, -5, -138, 104, -105, 63]
6022F3l4m3N1Q1l25K55n7q6J48J15k60J3K41l79K25O9L8n04J91K64k98K90m7J44
6046A55j65Q6K70m43J60J33m05M18j15j44o4J74m00R5M84k95l6Q7k8J33m9O1k25
6069a13J5J15j97J81J22j54O7j25Q6p6j21K49J26j01j43l6j25K70K36j6j95l12
6091b47J38M39j95j66P8k25j15K08R8m9j67K64j06J75k97j20R0p3K12J47k41L7
6113a15N8J86j82o8p2L30l21K69P2p1k7q5pK01j50j34J66j22K27r8R3l6j68R2
6137C8j46K88%l37M36l63J95J92j07j73l5j34oL49r7j3m6O2J9k50K81j85j51o3
6161b46K41K08k76k5M1q2J50j12J55j72J91j7j58J09j88K43r0j55O2J01Q5j82
6183a17J5J48k39K01J30j71K5r0K91j82J17n2k29R4p9J85o9j59K40k31M91l53
$$ y = [63, 29, -14, 37, 118, -207, 48, -9, -95, 53, 168, -92, -79, 162, -217, 8, 77, 115, -389, -198, 66, -232, 58, 11, 155, -10, 76, 346, -97, 63, 196, -209, 209, 94, -50, -114, 60, -340, -245, 239, -56, -92, -5, -33, 100, 51, 112, -113, -98, 17, -180, 1, 123, -31, 36, -89, -3, -79, -200, 49, 175, 74, -69, -105, -230, 40, 276, 260, 65, -247, -109, 330, 135, -31, 47, -178, -293, -85, 13, -36, -203, 61, -45, 130, -167, -287, -197, -270, -58, 89, -152, -115, -57, 129, -53, -121, -193, 137, -184, 85, 157, 86, 59, -26, -33, 168, 18, -116, 50, -72, 155, 57, 150, 114, -54, 38, -108, 180, 180, -157, 279, -84, 111, 303, 196, 23, -12, -146, -152, 197, 100, 87, 41, 103, 122, -128, 153, -32, -183, -246, -5, 203, -73, -98, -57, -139, 11, -101, 54, -118, 73, 56, -102, 7, -181, 62, -28, -183, -121, -20, 65, -117, -102, 46, -193, 8, 138, -33, -8, -98, 193, 11, 128, 76, -153, -59, -138, 47, -22, -181, 59, -172, 319, -34]
6205c4j58J32P4rm6j5J9j98K90N4m6Mr1j48j18M64r4J3l7j0%j38j64L72j46N5
6231B5J45q8j09Q3k14K36j47J42M3j62j10K23K03k73m3rj45M38p0J47k39j98m8
6254a70J37K4J94N6k10p7J45k45J94K8l6K56k39N8j29o3N6j90NL44j72L7j17j39
6278b53N59k57k1Mj20O1J93j99q8m7o0L14j26O6J0k2J83k57Q3J16j10j09r5M74
6302B99l09j37NJ9o7J66r0K08r5J81k06J38j20L03k09o1j67P7k5LM4jJ31q3K5
6327B9K41l17J43j52O0p9Q4j31J83L4k34K28M3l06K17L5j00k3K8Q2j15L6P1J34
6351A91j77o2K4N4j37J06o0r0J10J86j03j52J82K8pj55M8m4J54q7N2RQ2M9k76
6376g5k42L62O4J7r1j0J60p5j43O0P2K5k74%K3J02J23O0k02K6L3j05K25l11J98
$$ y = [-34, -192, -60, 14, 5, -41, -56, -37, -235, 55, 109, 63, 67, -24, -172, -290, 174, 80, 93, 56, 46, 46, -92, -256, 116, -30, 25, 170, 82, -27, 56, -158, 78, -69, 73, 116, -46, -156, 67, 270, -3, -46, -55, -200, 238, 168, 315, 76, -122, -170, -33, -9, 185, 241, 31, -46, 99, -146, 48, 76, 40, 296, 57, 115, -14, -77, -21, -211, -206, 138, -34, 3, -114, -253, 306, 49, 28, 32, -88, -27, 166, -33, -121, -168, -228, 86, -40, 26, 36, 14, 197, -60, 23, 139, 29, -80, -175, 299, -10, -147, -142, -123, -190, -24, -114, 94, -1, 180, -26, 112, -8, 295, 86, 25, -142, -65, -90, -87, -43, -44, 87, 4, 29, 270, -47, 96, -56, 4, -75, 9, -122, 61, 95, -139, 89, 132, -174, 43, 78, -22, -45, -17, 65, -50, -14, 57, 191, 14, -48, -24, 30, -107, -1, -61, -151, -41, 145, 42, -110, 72, 100, 93, -62, -14, -58, 96, 9, 61, 70, 152, 201, -75, -317, 45, 109, 126, 35, 25, 185, 110, -33, 27, 99, 124, -150, -150, -127, -25, 98, 158, -44, -18, 15, -90, 135, -176, 22]
6401B2K21m63P5J49o4m0j69L60k1k44L04l62J36M5K07l61L03K5j93L06l88qL61
6424B01k46K01j08P0J07m02M45l87K23r5JJ68q7j49j3N4j9J11q2J19j31k75K95
6447Ao6J85Rj45N5j33K37p3R7j78Q5R2j44n1j46J22j6Q8k40K51J1O2l39L74j48
6472a0k40K02j4j49R7K46j23O3n9M6j44N7J67j22jj3K05j51Q6p1k56RQ9J04l58
6497c40L70J00k46k94L33K27k5k1k04J55j39L72k70J26o8j19J00O4k9j59j05K04
6519C2J42k8l31J52J7K81k15j78J40M0J18j4j36J28l25K11j04J48Q0J04l94J45
6541A3j17O0Q9q2R5j03n9j45J72J59o1Q8K13n12J03K49j76K5k82L87j94j96J35
6564a39RQ0Q8O4J10Lj33j2J99l52q3RJ81M5j31M7J09O0l37K26J00k62j12J94J35
$$ y = [22, 243, -220, -145, 4, -60, -100, -269, 91, 70, -174, 130, -232, -96, -51, 156, -205, 98, 123, -70, 236, -152, -160, 201, -45, 156, 48, 118, 225, -177, 268, -119, 104, 9, 10, 178, 91, -58, -71, -17, -36, 75, -7, 112, -19, -294, 1, -65, 120, 129, -16, 39, -94, 143, 70, 167, -11, 74, 166, 22, -29, -175, -53, -69, 19, -221, 30, 41, 103, -236, 138, -10, -250, -48, -62, -211, -114, 132, 9, 72, 13, 59, -85, -28, 139, 17, 16, 3, 208, 57, 143, 72, -184, -175, -86, 18, -340, 30, 130, -116, -410, -77, 150, 125, 104, -100, 55, -84, 288, 18, 144, 76, -43, 57, 121, 92, -67, -172, 32, 174, 146, -185, -33, -16, 265, 50, -128, 12, 52, 170, 156, 20, 148, -177, 34, -70, 78, 158, 262, -132, 13, -104, -44, 45, -37, 58, -45, -104, -249, -77, 82, 21, 109, 322, -190, -87, 162, -14, 11, -271, 116, -78, -274, -139, -130, -50, 38, 102, 212, 215, 82, 70, 269, -83, -166, -157, 24, 69, -62, -15, 94, 154, -183, 43, 143, -119, -231, -37, 98]
6589I8j39J38j41J15j16L45l83j7j39J60N8J31m57M60m24J41Q3K02o8j85N0J45
6611E7j9M0p9j46L00n24K12k7K84j35p1J35k03L70j61K07j46j1l52K09J15kJ90
6634B43m39K92r9n1J17M0j21k5j39K81J38j44j61j30Q7M0r5R5j56K74R1l32LK63
6658G2j08k68J25L13j49K0l5r3K10l06N0L64j94j6R7o3p4j9K39r3O4k04j14J71
6682a1k1m4j56M00j27K64l97O6p8J83R5K80l97q1K2P2j64J10o8O0J22j76J56j
6706A09%j01j83j1J61n8J74j78O9M0Q3k15L92l31q5J08p8J77j9p3k07L87j03j07
6730d9K37l50J42j49M6J48j08k6Q3L82k75j29K32j57k1J38j04j69J60j80L19j43
6752B7r6R8J97j84J31n5NK56m96oJ7N3j42K78J79j60k10J58j7m3L2nj61J08QJ65
$$ y = [98, -41, 97, -44, 71, -45, 300, -83, -100, -239, -79, -21, 110, -347, 113, -311, -170, -87, 115, 47, -138, -88, 57, 38, 78, -1, -147, 153, -371, -159, -186, 98, -37, -108, 27, -176, 194, 33, 240, 94, 83, -269, -60, 55, 53, 243, -196, 96, -3, -54, 63, 103, -18, -43, -182, 99, 237, 93, -68, -198, -111, -71, -166, -71, -227, 47, 138, -194, -191, 72, -36, -304, -179, 134, -15, 5, -30, -123, 87, -219, -169, 195, 1, -15, 82, 19, -55, -74, 165, 72, 136, -68, -182, -11, -32, -76, -232, 168, 41, 305, -92, -26, -104, 79, 174, 454, 57, -24, -2, 70, -94, 16, -52, 8, 130, -46, 110, 109, 109, 8, -175, -186, -25, -83, 91, -87, -18, 22, 105, -110, 282, -49, -134, -26, -104, 73, 54, -19, -226, 161, 58, -49, 188, -162, -20, -169, -123, 25, -83, -109, -26, 356, 81, -48, 184, 27, 6, 144, 40, -129, 31, -149, 170, 27, -69, 29, 226, 42, 173, 118, 123, 379, -117, -123, -106, -53, -195, 83, 262, 102, -108, 50, 33, -10, 22, 17, -144, -36, -28, 137]
6778A37k35R2j75J62L2r7j3N6K9J05j39L29l38J44j57K85m23K12J32r2q0R5j9
6801D2M1l92L65P3j47K7K02k28j26k02J78J83j20P8j96K15j40J23j11m2Q9N0q0
6824a18J98p1J62r5J50k01K8%n6K2n4K5L20m64J67j39J10N3J03o4q3mJ23J32m01
6849a57J82r9J35J3j72O2l6N6L9M8k16K43Q2j13L5o7k74N60k68j46P9J45l08k7
6873b04R7j62N16j46J05k69K48k33L7j76L09p6k3N1l00L9K0L26k13p2P2j21L04
6896A29j3J52l15r9JN1MJ17o3j66J74K48m93L02P8j03p9J4R0n3r5J22n6M02l62
6921a3o2OJ8o7p8L4J31m6k9J80j51J07j97N05m32K04o1j8J02R0k56R2l0N0l8k17
6947a76L65J9l44J08K05j96K65j02k6RN5k9j73j95L51p1p4nq3o8K30k13N4Q1j56
$$ y = [137, -98, -6, -181, -19, 13, -84, -97, -41, -12, 93, -46, 283, -55, 89, -68, 217, -206, 6, 138, 46, -34, 61, 42, 83, -309, 56, 129, -18, 9, 211, -17, -143, -345, -167, 16, -104, -26, -222, -7, -147, -24, -135, -177, -88, -38, -118, 80, 9, 171, 76, 226, 25, 53, 53, -3, 19, -35, -10, 310, -154, 13, -126, -16, 37, 140, 76, -7, -11, 112, 244, -157, 25, -74, 61, 74, -98, -36, -72, -16, 23, 71, -145, 98, 180, 67, 102, 35, -239, 321, 53, -93, -14, 131, -177, -204, -107, -269, 247, 101, 206, -63, 185, -48, -11, -187, 122, 46, 23, 74, -226, -187, -167, 159, -54, -126, -54, -175, 129, 116, 268, -47, -146, -145, -94, -90, 27, -36, -202, -28, 220, -273, 29, 107, 4, -75, -61, 29, -24, -119, 3, -53, 349, -13, -75, -69, -51, -118, -196, -162, -31, -77, -106, 74, -77, 30, -167, 338, -94, 110, 49, 31, 133, 223, -33, 59, 29, 79, 41, -176, 189, 208, -136, -28, 177, -19, 246, 144, 118, 127, 182, 153, -20, -215, 136, 65, -9, -14, -97, -165, 65, -148, -94, -13, -169]
6972a69K56j49m8L76k13j03N7j06L94k99P1j23N7k74L26k79M17n3k79J61O7K3
6994A10k78K73k25M5K9L66j66k41k7J91j75m0n5J54J83k05l8K35K8r8J08k1L5
7017A88k87K17j47K84k90Q9Q8p9K4j84J90M1QQk65J07j03L12k57qJ69J0K7k24
7041h2K66q0n7j96m7R1J54o4N6p4M8j2j39K43l38L15Jlj21k7rK1m0K04j61r9N0
7068a00K4K01k47j10L40m01J37L76p2j45j27J49j72R7K2j1J39j38q5M17l59Q2
7090A7N1r3p2J7J90k06J61j85J54n9k03n0J54K81j55o7J29o0M3n6K36k49o7mj15
7115b08K78j03O9K5K09k13l1j40Q2k74M01j12J23k93J11Pk8J21k5J6j63K91Q6
7138B29k20m1O8j01L25l38L10k65j28J76j7J39k11M3j08J37N8R5Kk73N2R9l93
$$ y = [-169, 87, -62, -110, 266, 53, -50, 7, -99, 295, -4, 67, -56, 1, -273, 53, -226, 191, 138, -141, 20, 87, 110, -168, 105, -120, -75, -46, 320, 154, -87, -114, 77, -98, -138, -193, -39, 144, -61, -99, 136, 164, 66, 174, 153, 188, -99, 118, -29, 255, -35, 54, 142, 63, 87, -97, 93, 134, 142, 150, -115, -8, -111, 201, -56, -64, 105, 115, 142, -82, 184, 104, 47, -149, -196, -105, 49, -15, 41, -33, 15, 3, -136, 107, -231, 84, 85, 82, -39, -66, -75, -54, -94, 110, -51, -150, -100, -76, 125, -122, -232, 108, -293, -156, 220, 148, 3, -124, 25, -147, -50, -28, -39, 100, -38, -123, 294, -65, 17, 68, -25, -97, -80, 110, -96, 65, -120, 34, -25, -228, -278, -124, 157, 2, -65, 64, 4, 47, -9, 227, -22, -89, -93, -208, 70, -33, 36, 61, 270, 57, 26, -114, -32, -306, 95, -17, 106, -187, -76, -69, -97, 24, -1, 15, -148, 143, 229, 9, -32, 36, -65, 260, -78, 232, -33, -161, 15, -2, 137, -74, -31, -139, -2, 56, 151, 153, -120, -68, 31, -362]
7161c62M82j12j48J19jP0P7k78K12j8m2N0J05l84R0N5P6J70q1j97j31J59n5K56
7185A12k44R4p2K71l01J33k6J4P3j71J7J05J36j07J15k5l64K97Pj48l16L97M01
7208C98l81m2l9J83k64K4j8K66n7j24K87k06k42J09J78k77J17K79k5j3k8J08m17
7231a84K76j31j13K20K1n6J50j59l2K20Lj68m8N0j07P4j26MK77p8k19N2K49j79
7255dLO7n2o9L4j4J90q1M5m88L77K10j29n6mj7k61J79j68J56J72n7K52m17K81
7280A49k79l8q5J8K93o9K04k29jK01m9j31K91m05J00J83J6k01Q8K44l46L0J1L5
7304C0k75M41j09n1o7L9o7r8L39k73K94l94J61J40j45j87J20J54k09K17L5P2j00
7327F7J7J08o8k96K44%R5k89L16J64j83J7j39K79n27L27j83m2M1pj5j35K98N9
$$ y = [-362, 120, 8, -140, -21, -22, 48, 125, -153, 59, 41, -1, 49, 154, -230, -140, -85, -9, 161, 80, -117, -248, -89, -144, 112, -132, -38, -110, 161, -140, -7, -33, -19, 54, -117, -100, 5, 141, 34, 149, 124, -240, 57, 64, -84, -400, -3, 398, 17, -25, -64, 119, -145, -121, -139, 127, 70, -54, 233, 27, -215, -106, 72, -205, -88, 191, 166, 153, 125, 233, -184, 92, -39, -152, 68, 89, 33, 183, 24, -8, 212, 215, 47, -1, 49, -58, 16, -110, -106, 171, 93, -126, -74, 175, -4, -1, 66, 14, -55, -21, -35, 155, 74, 119, -369, 8, 218, 89, 33, 29, 12, -249, -70, -238, -82, 90, 33, 285, -132, 149, -130, -168, -253, -235, 58, -11, 193, -36, -37, 164, 115, -16, 275, -130, -30, 153, 169, -32, 56, 300, -46, -16, -5, 30, -245, 196, 87, 36, -31, 8, -59, -157, 182, -91, 203, -191, -30, 110, -35, -222, -102, 52, -157, 60, 95, 167, 67, 84, 192, 124, -172, 72, 72, 167, -122, 194, 358, 175, 192, 53, 332, -195, 132, -51, -93, -52, -59, -74, -209, 89, 148]
7351A48k11M52n51J44m8j46L03j73K37J2l34j90M02j52K27j20J55j73J14L22m55
7372c7p2j35J87L68m51J0J12rn6n8L19m04L0K10q1L0J10J11j09j6L9k09K32k18
7396i7N05l16j41Nn9K39j73J6j20j23L70M0k01l0J54N1NK9k97K55j26j7j19J10
7420d0J35j48j54J52N1j03N4q2K05k48J18j5R0M9j64J00m7K07l89J15M38l01q
7443A5l0j12Q8J64qk23o2K59j49j17L14k37j54K72j98K81r0Q6n2j4j34J69k76
7466b08N22m92J65P4Q0k83J82n1J4J5m5J56j13J87N4j65j08j7j3r3J57J08j19
7489Gj27J70k1O2o9J47l95M94k20Mk39P3K44r4P0r2J6j71k2M22n74L91j71J27
7513C2l4k81K47m8J03J80j42O6K04j40l36J54p3k72L13P9m61J59J25J75j96J70
$$ y = [148, -63, 389, -162, -18, -66, -212, 91, -82, 155, 167, -167, -357, 45, -107, 120, 0, 155, -18, 96, 418, -37, -109, -244, -57, 311, -140, -130, -18, -27, -83, -141, 178, -226, -196, 14, -67, -37, 73, 184, 75, 59, 98, -111, 121, -97, 408, 92, -49, -44, -103, 136, -37, -21, -141, -264, 106, 146, -55, -85, 69, 120, 125, 154, -143, 112, -14, -31, -150, -40, 95, -53, -207, -55, -4, -107, -53, -135, 70, -178, -60, -75, 15, 64, -100, 0, -47, 160, -229, -114, 324, 23, 15, -15, -127, -39, 125, 117, -106, -168, 91, -58, -175, 139, -98, -252, 20, -178, 103, 13, 99, 47, 33, -101, 68, -208, 314, -178, -13, 61, 141, -142, 40, -11, 3, 18, -27, 129, 16, 203, 257, 92, -16, -33, -46, -139, 18, 126, 7, -120, 50, 29, 91, 22, 169, -226, 268, 48, 52, -187, -114, 130, 36, 106, 14, 30, -141, -163, 259, -315, 76, -95, 32, -2, -283, -36, -84, 19, 199, 57, 123, 327, 187, -149, 5, -68, -340, -27, 52, -409, -250, -125, 50, -146, 24]
7535B4r1Q7O0j9k14j7K22j38K00J47m54L45n4o8m7R0j22m6k6J19k35J96M4n2j18
7560a67K72m81J89K87m4K6k22J22o5j23Q0J19p7J27k3J63k37k01R5J03J5J61p1
7583D8p7MJ95O1k22M0j81J30J7Q3j15j57L30j58j12m5K7J75P7P9K1j13K58l39
7607B6j42L9K20J0j12k45K58k9n7p5n1M99m87nJ65L91m02j72L42Pj59q5O3o8k7
7632i6L27j02Kk2jj94J69k60K92k82n2P3n6J90mO2p0N6m6N8j42j66L90k31J77
7657G2j4qj15Q6J2qk07L02j28j40K60j26qJ4j05N5J6J66j45J2J8r8J53n4j11P6
7683b5N3M0R5l95L09o0L03m53J56n5o9M4K68k95r5K17q0J21Kq9j18K3Q2J16m64
7708c69oJ87j49L25J27k1J33k86L01k77K9N2K53o19L41j23K04j80K96q9j10kQ6
$$ y = [24, -67, 20, 80, 61, -153, -170, 52, -86, 114, 261, -193, 152, 98, 30, -17, 73, -49, -95, -121, -2, -237, -41, 3, -49, -167, 105, -376, -187, 100, 56, 82, -140, -18, -83, -206, -126, -7, -84, 43, 20, 183, -54, -255, -160, -57, -42, 119, 48, -29, -25, 170, 231, 9, 49, -132, -2, 15, 98, -17, -174, 156, -2, -114, -159, -132, 43, 120, 199, 220, 107, 365, 26, -116, -77, 143, 153, 41, -204, 54, 25, -32, -107, -158, 341, -146, -151, 14, 405, 3, -169, 173, 180, 21, -64, -1, -69, -96, 231, 129, 131, 109, 108, -86, 83, -177, 115, -167, -219, -146, -202, -12, -16, 46, -24, 32, -14, 44, -98, -264, 126, -105, 72, 58, 50, -65, 21, 33, 25, -182, 120, -8, -148, 112, -14, -22, -8, -113, -58, -42, 124, -21, -9, 9, -89, 64, 10, -101, -25, 28, 68, 163, -232, 77, 17, 320, -133, 23, -32, -101, -57, 211, -84, -179, 38, -42, 79, 81, -8, -126, -103, -21, 95, -369, -375, -188, -337, -12, 115, 94, 227, -59, 242, -35, -6, 46, 299, -320, 21, -102, 102, -78, 218, 129, 19, 17, 103]
7731A03r7j61L5m7J25J75p7L3m24N92j36k1k09M26m87J22N9p6%j38Q0J93J65k45
7755a0r7K49k12k1J08l22N66k64J98l70L51j33J10j91L24k02j58nK06k14J38j91
7777a40j8J09j47k4J78j9M2l0LJ73k31R8J19m7k82K36J01k20J42L8j36p9L12r3
7801H5r1J57k61J5m6L39k48O1p2j8J07r2J58j27j19K73j58J17q7j12o1J45k01
7824b36K48l7m08J62J60l6j22K35o3J69o4k5k8K90j48m21QJ87J98K91l34n1m3
7847f8J75k39J97j11m8Q2L15l13k46L36l32L04k22j35M99k18q1J46k13P2J52N1
7869A03l70L62j32M51m15m4J26k51M27j31j48j04L04m56O0J41J34P8P3l89l2K86
7891G3k14K12k9J79k41j64J71n7q3K17J06j2m07K79j97K84Nq3j7P9r7Nn2l29K18
$$ y = [103, 6, -155, -120, -167, -42, 133, 56, 89, -335, 257, 121, 100, -109, 317, -170, -48, 11, -65, -65, -203, -123, 70, 235, -10, -107, 142, -70, -91, 17, -305, 261, -3, 195, -175, 176, 43, 153, -38, 286, 84, -74, -79, 127, -87, 51, -140, -158, -49, -196, -220, -42, -61, -19, -49, -46, 127, -104, -6, 113, 66, -216, 20, 121, -99, 43, 81, -55, -134, 178, 85, -6, 151, -110, -95, -141, 198, -50, 11, -61, -79, 28, -64, 94, -33, -152, 121, -37, 80, -7, -119, -180, -35, -236, 12, -25, -433, -271, -111, -147, -269, -34, -97, 72, 8, -17, -45, 245, 97, -324, -316, -129, 69, 360, 26, -25, -68, 107, -132, 65, -46, -94, -12, 303, -10, -256, 80, -252, 52, -170, -305, 194, -24, -105, 41, -172, -100, 52, 103, -267, 95, -37, 414, -1, -45, 81, -170, 257, 126, -22, -126, 178, -278, -218, -77, 57, 135, 208, -181, -213, 73, -141, 71, 42, 221, -20, -184, -13, -70, -153, 64, 170, 158, -249, 30, -167, 117, 122, 39, 22, 101, 4, 9, -43, -372, -154]
7916a54L7J63j98k95O17l2k65J60j78K83j68M4J05l0Lk27N1K11P5m20J96J42j33
7939a3L8R1Q1j52J67l45K46k21J97k2K26j49k69J10k65J49M16l89J5O0K73k99
7961e5J70R0k31Kk4M4K18k10j90J44k48M60K0m9m05K86k14J09J50k19O6R3k22
7984b15J64R0j98p6K01L02j27j69j76QJ52n4J44r1K97j37k23o7J69Nj05K43o6
8007G1k24J77M7k7Q8l33q2J22R7K18L5k90m8K20j50J06r9J8K86r9j20j67J18j15
8031a51K54l41L93q3j55J54r1K18j46K4K2R4k98K31J02k70K53p1k80K98j54m7
8053d4J17o9j16J94J56j97l75L53J64k57K2q1L44n3KJ96l01k17j00j7J91j20L74
8076A66l17J43J92l26M79l03n0J84j26K9m86L19K37k72L08k23j6K66j04O9k77
$$ y = [-154, -117, 46, -152, -447, 170, 138, -127, 33, -145, 138, -30, 14, 119, 89, 92, -135, -84, 127, 202, -218, -22, 120, -13, 25, 116, 197, 45, 212, -133, 113, -108, 89, 67, 293, 144, -125, -15, -280, -131, 285, -104, -89, -29, 244, -55, 115, 205, -26, -24, -48, -4, 214, 4, -186, -42, -290, 170, 190, 141, -264, 22, -192, -83, 67, -152, -86, 7, -215, -51, 39, -159, -235, -34, 268, 141, -28, -204, -196, -44, -98, 46, -45, 252, 115, -108, -175, -6, -1, -106, 137, 71, -153, 24, 71, 44, 132, -201, -283, -161, -64, 154, 189, -101, -149, 71, -79, 27, -72, -54, 232, 133, 13, -154, -36, -151, 103, -238, 155, 72, -83, 71, -20, 198, 52, 76, 98, 192, -106, 125, 227, -43, 210, 139, -141, 157, 3, -44, 73, 4, -112, 82, 238, 41, -334, 19, 183, -74, -52, -133, 211, 158, 160, 356, 55, -162, -262, -279, -88, -208, 166, -151, -8, 184, -142, 337, 34, -16, 168, 42, 71, -415, -96, 141, -131, 177, -46, -62, 204, 100, 169, -108]
8097a08K13q5p0O5j26l7L61q4K7o1Q5m23J04LL40j11o2PJ10k16J66j13j94J52
8121e7l2M7O8Q1j8l1m4n3r5J11K62o5k80J30p0N8K72k74r8m9J88k08QK86j18j8
8147Al3N5j36K89l29J92R7l19K04o0J73l2k89J83L3k2J46j89l5J73k86J43K01
8170A60o6n3r4J34l30J85J07j95J56l3p9pJ84j65O2n6J30p5J0j12j16
$$ y = [-108, 105, 20, -50, 15, -111, -148, 213, 129, 156, 95, 180, -243, -139, -136, 204, 93, 31, 38, 148, -68, 98, -15, -209, -57, -89, -42, 26, 107, 89, 58, 14, -39, -134, -23, 239, 174, -106, 24, -46, 12, 284, 10, -88, -137, 51, -157, -149, 137, 19, 1, -32, 23, -113, 176, -153, 39, 136, -183, 21, -39, 134, 102, -187, -4, 29, 7, 153, -36, -71, 102, -184, -41, 160, 94, 41, -53, 81, -249, -64, 43, -152, 4, -29, -108, -115, 69, -96, -34, -90, 40, -35, -25, -137, -253]
8191b53
$$ Imaginary data points
##PAGE= N=2
##DATA TABLE= (X++(I..I)), XYDATA
0@%%%%%%%%%%Qj6J6j6K4l2L8m6N6o4P2q8J09j33J52j76K08k40K74l13L58m11M67
33B47n26N93o68P51q40R37j048J166j292J434j589J758j940K138k358K599k863
50a501L154l475L831m228M673n175N746o403P169q073R160j0494J2179j4384J7399
65I578k1782K8739m1447P1667k63976j45237Q17423k25255o63723L00095M51626
76C17708l29058j17648K31401j43161j19189L01752m3211k43893J56276N7605
86F8582k25328J78978K19115l37908j69995M04463M7946l58449J18940K47211
96A93555k86549j23628L85950O3444m09670n9672L66690P2444k78718n8897J74374
107C9323K7360j05302J2875R3811m3485j10151L8214J10973K9168q9065j31449
$$ y = [0, 0, 0, 0, 0, 0, 0, 0, 0, 0, 0, 8, -8, 8, -8, 16, -16, 22, -24, 32, -32, 40, -48, 61, -72, 80, -96, 112, -128, 146, -167, 191, -220, 247, -279, 314, -354, 397, -443, 494, -554, 612, -680, 754, -835, 923, -1017, 1121, -1237, 1362, -1501, 1653, -1822, 2009, -2219, 2454, -2721, 3025, -3378, 3791, -4282, 4878, -5616, 6563, -7821, 9578, -12204, 16535, -24912, 46755, -217221, -362458, 454965, 229710, -434013, -133918, 317708, -11350, -128998, 102403, -40758, -159947, 141805, 98594, -145299, 10977, 68582, -156746, 22232, 241347, -96561, -266556, 137907, 185853, -172596, -53656, 193555, -92994, -216622, 169328, 232772, -176898, -236570, 130120, 202564, -76154, -135051, 39323, 66683, -38619, -25744, 68067, 24582, -85569, -47355, 63618, 92786, 3721, -127728]
118a27728O2671K10760m7048k24244N7511J77257j17212q4258K18351l7266l03756
129b14962J54038L11960k24527k35318K42637J04832k30779L4078K02178j34238
139I899j48588J43703P5688n2116j2351r0829k2850K10427K6049k67668P201K57199
151A35764q5323j89013J82600Q5735k46373M176K43404m8162j84907N5906R4429
162D8236n5247M58N1892o2760m2239N8566L1080N652k7691q3740K3808J35230
174H3245j4212j50556J5047J35347m2769r5642Q3844N5186j10683m3848J15748
185C0707O4487j04384q6241P7638Q6165l8424o6575J0896L9739j5605p165M1571
197C2809j8526n9954J8330O4351N269n8877k3891M6102J9927k7020k98K0725k1912
$$ y = [-127728, -65057, 145703, 98655, -125589, -68078, 109179, -8033, -92291, 126060, 88794, -214962, -60924, 251036, 26509, -208809, 33828, 138660, -92119, -58041, 144137, 9899, -138689, 5014, 80702, 28586, 16235, -74594, -97444, 112983, 139032, -128636, -121435, 135764, 50441, -138572, 44028, 129763, -116610, -112434, 130970, 82808, -102099, -46193, 48236, -7011, -6553, 45339, -17421, -59660, -1094, 29986, 35638, 7947, -75793, -51985, 83245, 69033, -81523, -66476, 68871, 26102, -69540, 14304, 69490, -41193, -85041, 30707, 95194, -9190, -95431, -17793, 68372, 29948, -36627, -25731, 14008, -1597, -8762, 32809, 14283, -45671, -27341, 37010, 42279, -16598, -40489, 5613, 25540, -1480, -1778, 18947, -2965]
210b965m1152M4662P5613o2139r4135N8891R0017l6835p2700J9236M7518j9774
222F237j8573K7434K932l0287j5666L0898M2619l0623n7700K0623N3033n019l8489
235a2581J168J7640j8687P624M0020k5571m9895K0659M9770m046m4839l409K9617
248G470j856j0748Q830M611j4726j8953K1371L8240k3528m6393J1315M4954N696
261B6283l9928q437K6013k118p251J3478k531j8875n061K2972J6900k2627j7296
274a8478J0195J1626N957o997p093m82m387J0918J6736j3388k1203K309K4554
287A0267R084k3784q444J3511J916J166J849l095o124n944J2669J3529j2450j2805
301h655M19J2250J0643j0762r350K675J766P903K310q125n168k215J0957P955
$$ y = [-2965, -44117, 545, 76158, 14019, -80116, -21225, 68792, 31957, -40743, -21507, 26011, 6237, -12336, 15098, 18030, -12257, -27923, 2975, 45594, 14971, -42729, -22106, 30927, 25908, -12581, -11413, 6227, -12460, -4836, 35184, 9613, -40282, -19623, 30147, 26101, -18738, -22147, 7470, 5614, -5134, 3696, 8307, -6419, -25372, -4001, 34239, 10711, -35682, -24367, 20587, 26283, -13645, -22082, 3931, 1813, -5438, 8040, 5509, -13366, -18427, 4545, 21445, -1182, -18478, -8283, 3343, 9300, 2303, -4790, -5272, -9659, 1259, 17995, 4607, -16596, -14287, 10267, 19351, -4433, -12877, 634, 2550, 3716, 5565, 2470, -3654, -9598, 3071, 16600, 4150, -8655, -8236, 4014, 14657, 3895, -5455, -2780, -1014, 6889, 9199, 1074, -4094, -6309, 4648, 12603]
315A2603j1331n933J265L954P460l204n794l051q13J0511K588q840k947k049O274
330F93Q083p048n835j436L066Q584l082n816j736j290Q211L138p514j617k398
345e997L733P240m011m646k467K106Q444l379m076M68l542N595M926m828l001
360c435l009M879O849n664k528k82J22N514r17k331k00m546N418N698m760k958
376b150k246M210O270o221j325J900k373L841J615o59l114m868Q169M777q688
391h62n02K459O41O07j428L563l201o937Q487N184n401o635N1J0789K18j1575
407d542K852O264k560l603J056P350n709j0056J0687P222r082o018L392Q238l618
422A873o998O550J59o703M469M971k044r526n15J5529j368j6094K813J2575j004
$$ y = [12603, 1272, -4661, -3396, 558, 8018, 4814, -980, -4031, -4844, 5667, 8255, -585, -3532, -5581, 693, 8776, 1728, -4107, -5543, -2477, 6107, 3025, -2791, -4527, -5817, 2394, 5532, -1982, -3599, -5997, -2264, 4976, 965, -3681, -6148, -4042, 4402, 1023, -3053, -2585, -6127, -532, 4394, -434, -3435, -6444, -1565, 5284, -380, -2908, -3190, -3068, 2446, 1529, -802, -1002, -5548, -130, 5568, 808, -2150, -4396, -186, 6084, -137, -1462, 438, -1935, 1906, 3521, 2862, -252, -5120, 3049, 7826, -862, -1364, 1095, 1736, 2343, 915, 4478, 1277, -5660, 2827, 8011, 2610, -4025, -3974, 6815, 7033, -4542, -1690, 4574, 2014, -1589, -533, 6817, 1108, -8948, 1739, 8961, -121, -6139, -2747, 5491, 1873, -5125, 1425, 1584, -5119, -650, 4321, 2277, -7249, -7764, 7765, 6397, -9697, -6884, 5691, 4687]
437D687j3668J790J8744r180j9846J4333J7822j1541k0155Q384K2996r174j8951
450a3759Q119J2636m146j0386K789J3767q938j3158J3873J0886j2987j0880J2580
463C96J1953j7087n847K0969l120k0996P840K2078o586k8049P472L2387r323k9672
477a7585O946K6596k586k7800L509L0199q105k8571Q168K8417l776l3480L608
490a4460L5773p264l0592R563K3118j1673j9196J8577J4301k7987n641L1073j702
503A3890k7100K162K3732j551k3174K473K1939j144k2964o700L1598J4020m6124
516a8943j4908N6339J0790n9016o829N9413j899n6924J5999M5586k6292k9646
528b6330K6055J6404j7876r591R428M332k09k279p834P412R304j9990K844K9549
$$ y = [4687, -8981, -7191, 11553, 2373, -17473, -3140, 14682, 3141, -17014, -8630, 14366, 5192, -13759, -5640, 6996, 2850, -7536, -4747, 9020, 82, -13076, 797, 11683, -1304, -12184, 396, 12349, -4738, -10585, 10384, 7264, -13732, -5892, 16186, 9600, -18449, -10977, 21410, 12087, -17585, -10639, 15957, 13371, -14429, -10920, 19279, 11174, -17397, -9229, 19188, 15412, -18068, -14460, 21313, 14049, -16543, -6980, 16138, 4465, -14731, 3846, 18147, -9840, -15481, 15592, 13890, -13210, -11048, 12684, 11133, -12041, -9568, 12371, 11227, -11737, -18437, 13161, 27181, -18943, -33851, 22488, 33278, -25738, -32567, 26846, 24947, -31977, -15978, 29608, 3316, -26330, -275, 16129, -1747, -11338, -1910, 2422, 2213, -66, -7900, -488, 8816, -11174, -8330, 21219]
542B1219k0925l3395L7512L3954n1563l0537O5409J8744p2473n24O8681j2961
554B3141n8715J8028M9052j6781l8841J2975K4673j715j2974j3268J0444K4157
566B0176j5844k5422K2701K3207l1488j8454M4398O329n4590J4732N3002l5528
578C219m2023N1102K8975o4529j4169P3671l915p0745J7720N4829k0090l5264
590b1219J2349J9010o99p259j4848J835L4446r096n1515K7942N5874m8353m7016
603d8549O0427L1089o6188r388O5688j8654n4115M3321L2201n4520j1350N2763
615B2725k439m5265J1142L3529j4725j7967Q112N242R188l948k7966J1431M2379
628C1438k1094n2787L1830N8696m5335n4102N7316L8289n9943k0135N5996N093
$$ y = [21219, 294, -33101, 4411, 38365, -13198, -43735, 21674, 40418, -32055, -32579, 36102, 23141, -35574, -17546, 31506, 14725, -24116, -11141, 13532, 11817, -1157, -14425, -3981, 20176, 4332, -21090, 1611, 24818, -6670, -25124, 19274, 25603, -28987, -14255, 38747, 3219, -38804, 12298, 41273, -23256, -37425, 36246, 32331, -38414, -20694, 34135, 14045, -21219, -8870, 10140, 9441, 2182, -12666, -10831, 23615, 14519, -36996, -9054, 46820, -1533, -48549, 11878, 42967, -23221, -32609, 33079, 14425, -39690, 3631, 35832, -18688, -30038, 22725, 20286, -24979, -13837, 19692, 4967, -13000, -4888, 354, 9542, 5594, -22372, -10941, 31438, 10344, -42443, -10613, 48083, 2748, -51354, 5962, 44251, -15692, -35827, 20169, 25262]
640B5262m8849P747L9398j8377k4455K2569P916j7518J473J0347j996o525j129
653d137M141P974L07k2573J504L8780j0915m7317K2527M7844l1275m5966L9517
666D11M1461m7434l1123M8411J9474m0267j2474K8788J0257k0070q000J2082O320
679G836n342r017L693J3344r521j3505J7149Q829k2013m190K5571r85l0709R417
693i443L3796k0298l1084K5201K7338k4602k6952K3505K6243k2447k2640J7549
705c834K0224j1312k2426R493K4491j1412k3131J1685K0913j0364j9916J1232
717d357J7529j4276j0594J5165L365j3024n29J3426q91j6636M932J6955p188j5033
731a1156N785J6232m271j9932O434K2224q803k1248P821K1959o362k3660P777
$$ y = [25262, -23587, -15840, 23558, 5181, -19274, 3295, 11211, -6307, -4834, 5513, 3517, -3008, -4137, 4, 7978, 8285, -14288, -12784, 25996, 15081, -32236, -9709, 38135, 6860, -39106, 411, 41872, -5562, -36685, 11726, 31200, -9067, -21541, 7247, 17504, -2566, -10566, 1516, 7836, 2494, -6523, -2830, 10514, 993, -12512, 4637, 13466, -8547, -12737, 12834, 11849, -18860, -9443, 24353, 4055, -27029, -1828, 25510, 908, -26044, -2539, 23704, 1257, -21383, -3834, 16390, 5078, -17348, -7855, 16636, 5224, -17907, -6222, 14691, 4327, -15589, -4357, 13172, -1104, -11698, 3467, 6832, -6192, -6721, 6705, 5814, -10822, -5890, 11065, 3877, -11156, -5371, 10861, 6590, -13342, -6908, 15316, 6513, -14735, -6914, 15045, 8683, -14977, -7200]
744g200K2424r245j6730O219J3966l813j3535M539J1800n546q129M225O879k966
758B888p802N232O808r225k412J0090k43j0407M08J2976j701j5690M904J3353
772I179n329j0416K599J0379j030j1468J240J0586o63r651k234J1334K801j3444
786f117l9J1484k202q218K029O524k756n768N792J600n737J250L541j298j809
801a724o07L370j28m222J300L057J035m092l501P819K368r040l38P595J99o065
817b974r04O614k01o086K352L101j398j151j303L265Q29l247R61J007p96N47l94
834B22J260r00j636L088p72k047J484o9P89Q8k579K140J011k280k56J184J954
851B681k711j859M144j03l249K199n06k98Q13n85k83l89P92M79k566K239Q60l945
$$ y = [-7200, 15224, 5979, -10751, -4532, 9434, 5621, -7914, -3375, 8425, 2879, -5250, -1025, 5854, 2888, -4914, 318, 7126, -2099, -4511, 5579, 5336, -5071, -4663, 8313, 6612, -9078, -4174, 9179, 3850, -6566, -3967, 6412, 5382, -6086, -4846, 5740, 5077, -4574, -6808, 4526, 7327, -6117, -6156, 5328, 3126, -5092, -3063, 3461, 705, -5063, 729, 2329, -3408, -2158, 1383, 85, -1724, -2331, 1039, 911, -3311, -2011, 1046, 2081, -2011, -5512, 2307, 4675, -4365, -4703, 2892, 3091, -2974, -3878, 2736, 2535, -3551, -1199, 1902, 504, -647, -1950, 1315, 2144, -1103, -142, 865, 69, 616, 222, 1482, 582, -1054, 2034, 1262, -785, 699, 630, 1419, 1507, -1072, 1068, 2079, -201, -457, 727, 2681, -30, -1889, 2255, 2152, -1097, 1102, 596, 298, 1111, 526, 243, -146, 646, 1125, -1441, 798, 1658, -2287]
869b287K446J342k376O84M98r21K41L58L78j822N85J572k306Q42K066l621Q45
886a476K851j880r74M38J487j128j323K686j355j360K802j444o81K346k139n54
902a704J742K46j081q88K618o54k376L118J72l612K207J604j727Qj4J421j015
919F5m99J749j419J66R52j731K120j2k491J595J215j263o07K81J483j505o08K826
937B317j746j190J790n31J63k44q99J592n36o00N43m16J004j462n45L505k645
954A00k483L536L78k288o61K409O78l490N48L625k293j868J200O71R08k448m11
971a889K818k60j697r23J972J801m324J35M831k415k924K065K007j509k599K741
987a70K134m751Q74L926j566k405K9K997J362n002L20L968q4l082j855M869K316
$$ y = [-2287, 159, 1501, -875, -191, 307, -614, -373, -15, 363, -1459, -874, 698, -1608, -766, 1300, -2321, -1476, 1375, -505, -1479, -1041, 446, -682, -2005, 681, -674, -2034, 768, -676, -1357, 989, -1150, -1704, 38, 284, -797, -1685, 933, 279, -2097, 1021, 1193, -2419, -212, 1392, -335, -327, -341, 1080, 65, -434, 1315, -104, 62, 1014, -717, 1403, 1391, -1100, 495, 1710, 447, -160, 121, 1604, 99, -509, 2317, 571, -619, 1171, 640, 803, 559, -340, 1252, 716, 116, 659, 243, 1247, -215, -760, 2745, 100, -2383, 1153, 1531, -757, -1418, 991, 1669, -1821, -1273, 2352, 59, -1809, -609, 62, 970, -1478, -1889, 929, 669, -1028, -1951, 21, 1822, -2502, -2367, 2464, 49, -2875, -810, 1197, -312, -2911, -170, 1964, -2787, -1913, 2013, 447, -1958, -1929, 1068, 2430, -2572, -2252, 1716, 1632, -1450, -3305, 1564, 3880]
1004C880p389J10P198j052n597o9O868q29o661K383N003l175k264J745K159r14
1020A396l573K501K996l632j221K499K460l157l916O039K741q152m63P540J99
1035D257p446j483R130N48r505Q98Q270r09o407j873P859J526q804J34P432l15
1051C312o499p67P272o67p058K807N044l601l551L292M486n466m719Q419K368
1066D672q961j304Q855J409q776k212J0203P59r433o27P604L306p819n762J0045
1081A959O218j1503n100J1373N761j3220l924J4674r94j3068N514R064o896n291
1095e433O946L245p572j56O407j674l558R10N49M394k312p715N228R520p332j1862
1111a0415J0484J3924j5874j1776J9937O262j8891k695J6410O27j4209J949J0464
$$ y = [3880, -3509, -3399, 3799, 2747, -2850, -2919, 3949, 3120, -3541, -1158, 3845, 670, -1594, 151, 2310, 1396, -2177, 324, 3320, -312, -1533, 966, 3426, 269, -3647, 2392, 5133, -3019, -3482, 4058, 4257, -3189, -4672, 4458, 5006, -4499, -3601, 4669, 3760, -2647, -4520, 3339, 4865, -3939, -3805, 3627, 3312, -3187, -3954, 3318, 2651, -4407, -1600, 3444, -157, -3708, -416, 4070, -1396, -6115, 2304, 4672, -4289, -5593, 3262, 4671, -4105, -6317, 3886, 4645, -4788, -5415, 2189, 5495, -2324, -8086, 1959, 8177, -3326, -8426, 2947, 8708, -4512, -8436, 6238, 5244, -7824, -2310, 6754, -142, -5433, 1513, 4758, -2814, -2970, 3437, 1763, -1795, -885, -336, 4058, 1746, -5969, -741, 8779, 1447, -10415, 69, 13993, -1881, -13657, 6280, 12542, -6349, -9044, 7366, 7993, -6216, -4267, 6197]
1124F197l626n768K624J554R95j293l012K481L057l528l292N385L496r874m83
1139e087J3356n080j3878R215J2684j1794j2341J4797J0805j7800o693J7079L360
1152H623j3772k637J0929K684q547k202N286K379j358n707Q01Q904l429r258N832
1167a472Q315p627p079J0460M435j3426R75J4306p100j1856J0264R236j1583p463
1181i615J2864M902j1792k177Q439J806l889m990K329P923k329r366K007J1641
1195G753l065j3578O111J2855r228r070J0200N217r341k469Q739m30q174L692
1209g88N697m703l306L387L299k278n051K892N463k910o067J764Q957k775j1066
1224g485N009J0281n868q782N062P933m225q183N150O590n224m490K810M931k581
$$ y = [6197, 2571, -3197, -573, 981, 1976, 683, -2329, 152, 3209, -319, -3611, 1774, 5270, -4604, -5087, 8269, 3189, -10689, -1474, 11210, -584, -12925, 1872, 12677, -5123, -11816, 5263, 8623, -5149, -7786, 3143, 5827, -2720, -4922, 364, 2743, 1385, -4322, -3521, 5383, 1954, -7304, -1472, 6843, -784, -7863, 2597, 7032, -6394, -5419, 8887, 1787, -10069, 195, 9431, -2152, -9615, 3249, 8151, -3641, -5818, 2621, 4427, 538, -4452, -2123, 5800, 3471, -5895, -3888, 7753, 4688, -8890, -2779, 10076, 848, -8222, 1978, 7195, -2146, -4615, 4124, 3694, -4480, -788, 4909, 206, -3100, 287, 3586, 1308, -3743, -851, 4612, 1702, -4365, -2601, 6356, 3581, -7485, -2476, 7805, 1937, -6845, -1783, 6150, 1925, -6258, -1108, 5482, 258, -4232, -1422, 3509, 928]
1239I28n480L787M261m590k071L866J014l854j007N955j114o221K873N254k703
1254H98m872J484O224j611p205K919O752k959o478J718Q136k275q224L614O213
1269D334k832m765J103N167j086m932K244L330j754k907J681L361k942l143N116
1284A975N13m697J166L693j193l646R56M641k113l499J678K649J45l642j780O011
1300B857O72o559O28N616m22n501P55N858k302m695L430J621j790n79l0R57J27
1317F43j439M04Q81l61j225N0L358k712k768M633O18m665P47L664m64m123J241
1334a518L658k061j910J369L57J008j343k055K602J371k298j024J937J639l220
1349a488o05L762j475j900J761J80n69n7M23M94j345M28J231o85l14p7L98J333
$$ y = [928, -4552, -765, 3496, -1094, -3165, 701, 1715, -2139, -3146, 2809, 1695, -4526, -1653, 3601, 898, -3974, -2490, 3734, 2123, -5082, -2163, 4589, 1630, -4848, -3130, 5006, 2731, -5493, -1879, 4334, 1502, -3263, -2160, 3007, 1921, -3011, -767, 2563, 809, -2098, -417, 2944, 2, -3141, 1975, 2488, -2209, -1043, 2650, 1457, -2189, -1233, 3408, 1295, -2204, -526, 2123, 2268, -1374, -3154, 2857, 3529, -3030, -2402, 3214, 2792, -2709, -1954, 3904, 1602, -3093, 337, 1958, 168, -411, -441, 516, 643, -796, -392, 489, 128, -1097, -1047, 2311, -401, -3169, 1464, 2082, -2583, -1836, 1828, 1364, -2759, -1518, 2140, 79, -1831, -462, -105, 903, -440, -2495, 107, 1478, -820, -1844, 93, 1732, -1488, -2093, 1669, 194, -1706, 55, 235, -334, -391, 32, 526, -819, -391, 840, 155, -159, -236, 162, 1495]
1367A495k316k94K241k63r28k07O97P34j198l59J362o77J78n38j03J605j286p50
1385f07J307j60l10l31O32j93o11P46Q85k171P03J187j582P99K92n35j07J1K84
1404B39m19p1R17j436J94J458j412k8Q22n91K19k5L6Qn47N66k2r36J673o77r06
1425i38J239o13j35M6j19N80l77pN81j342J085M15j458J047J23r36R53j95l06
1444c57l40M26Q11j265K89J232j348L17Q01q90K65o2L19r3Q0N58q46k54J525j359
1464a91m38J611n16q01Q73j61m1m78O81N34j550R18M17j280N29N78n65J76n12
1483b16O57j39l11M59o31K22N54r31K13O96j121L83L79q6p2j066J317M32j448
1502g09P29L02o70J14j59K92J14r43J031l8m37L73m85M57K0r24R88R4p84J58N6
$$ y = [1495, -821, -1115, 1126, 863, -65, -272, 425, 1159, -39, -398, 964, 287, 465, -73, -176, 1429, 143, -607, 700, 540, 230, -101, 531, 338, -273, 473, 1358, -813, -110, 1077, -505, 294, 586, 51, -56, -45, 239, -180, -251, 666, -770, -576, 882, -530, -558, 264, -327, -108, -133, -97, -89, -636, -70, -92, -1028, 645, -32, -938, 301, -312, -447, -401, -520, 60, -317, -324, 257, -1085, 0, 415, -1043, 4, 127, -809, 144, -51, -357, -697, -271, 540, -725, -436, 796, -552, -235, 566, -324, -59, -121, 198, 105, 185, 743, -103, -357, 1168, -191, -629, 982, 466, -335, 538, 377, 336, -142, 539, 1073, -477, 441, 858, -422, 107, 685, 120, 296, -216, 441, 302, -9, 450, -181, 41, 595, -336, -123, 573, -548, -165, 214, 128, 56, -1010, 307, 739, -709, 20, 322, -348, -234, -393, -101, 13, -930, 101, 63, -374, -1, -486, -29, -9, -933, 55, 149, -635, -477, -421]
1523d21P45o23j002J909j87j403N76N72o3n83k03J240n2j273Q68J95r1k99p67
1542h62J460j64j086J007M55o47l36J79J073q37q28J430p3j151M53L54N70j144
1560a47p73K321n18j214m3J279P47k234m47K571q23j129L02R31K8j519K36J399
1578I67k95j443N49R82P7j517L49J458j179j196J521O31j262r74J480J334k740
1595a258l69K890n81j868k23K218K77k635J34K010p9j437l30J297J335k620m74
1612a713K572K8j770n42K055O04k785O90K302j501j628J639J348j424j575K526
1628H26J154l184K29K303r8j840n76J966J035k827N3J527J229j754j618J808K655
1645B888l284j816L628J402l344j810M132N55m317P42L872k276k126K150J578
$$ y = [-421, 324, -299, -1301, 608, 421, -982, -406, 166, 103, -480, -683, 557, 505, -768, 100, 295, 204, -95, -862, 598, 434, -652, 355, 810, 163, -173, 6, 1079, 242, -586, 844, 771, -380, 73, 427, 997, -147, -920, 1401, 883, -331, -374, 905, 1652, -582, -1029, 1542, 719, -410, -108, 823, 851, -668, -432, 967, 672, -771, -222, 760, 837, -680, -331, 1127, -52, -1248, 273, 904, -358, -1332, 148, 1482, -1258, -1627, 1263, 682, -1186, -1409, 809, 1086, -1549, -1415, 595, 516, -921, -1251, 46, 1381, -1239, -1713, 859, 887, -883, -1425, 630, 1234, -1551, -861, 1441, -60, -1688, -49, 1299, -125, -1700, 826, 1980, -1204, -975, 1328, 1230, -610, -1186, 780, 1815, -1012, -959, 568, 1797, 43, -1575, 233, 2888, -396, -2212, 1416, 2818, -526, -2336, 1796, 2351, -1966, -1224, 2648, 372, -1754, 396, 1974]
1660A974k708n39K836p62k027J639J02m69M85j207N6K343j118k669J092L774k009
1677G93m645M512L129n501j474N059J15m286N43L404r72k650J722P27q05K44o70
1694g55N83M65j010k19J258J13j145n39K564n00l304J811K881k347k468K457K745
1711B590l244k616M019K225m199j211L366J183l083q31L004j82j608k7P06J027
1727A119m45j659J048J527j616j239J656J773k783r87L765r01l623K359K428k224
1743A98k138K214K061k728r65K142O30j344r96M63K151p27k734J342K556j653
1759D72k496J973K503k973j481K743O25k008j8P70L69r28m18J415l59o70j11O91
1777I9P95k304p8K988j269k372J865J695r31k431J628J808k063j058J143J332
$$ y = [1974, -734, -1273, 1563, 801, -1226, 413, 515, 46, 531, -676, -620, 1723, 605, -2064, -972, 2802, 793, -3852, 660, 3789, -1712, -3186, 1873, 1988, -2298, -1755, 1649, 677, -1973, -251, 476, -329, -85, -755, -172, 293, -717, -936, 322, 435, -710, -1249, 1315, 815, -2489, -678, 2203, -144, -2612, -155, 2590, -654, -3270, 749, 2974, -1225, -2436, 930, 2113, -970, -1801, 1203, 1021, -587, -614, 92, 1119, 674, -985, 63, 1590, -26, -1265, 391, 2164, -619, -1606, 2159, 1258, -2365, -6, 2422, 198, -1940, 274, 2335, -393, -1358, 784, 1414, 70, -926, -463, 1688, 961, -1773, -431, 2125, 472, -2024, -51, 2452, -521, -2002, 741, 1366, -642, -660, 110, 479, -449, -867, 548, 189, -481, -592, 99, 894, -1410, -1488, 1500, 231, -2141, -276, 1419, 488, -1943, -315, 1493, -570, -1628, -485, 847]
1793H47n10j811N07K299q68k083J500J115o33j644J198J339j718n63J176K43m33
1810c9n20Q03P40j510j18J470l54r63P9J641m37j809Q62J751j586n91O21L94P2
1829E06q63k01J272j74q48j24J346L4k032Q02J978j443j210J450L00q82l70P68
1847C09j04o20Q81k33m11P59r15L22Q81j389L1P37M71j196j77J426p7k188Q48
1866f45J621j304m06O97K42j37o46M63K68n13K22k97L28O92j296K82O47m67m33
1885f82O20Q7p5o05J179j85j077N73M80k31j97m84Q89P6j312J177J85l84K14j38
1905A10J78p1j46J88o33L56J35m31N46M62q24M1O19k25j44k55O38l99l12R10o32
1926A11l95P80J70o04K54k86K60n02M06J99n64L87q6o05M47L21m69K81R5j42k89
$$ y = [847, 337, -1474, -967, 1332, 464, -1619, -119, 996, 363, -1281, -83, 1256, -462, -1025, 151, 394, -39, -559, 244, 984, -526, -644, 826, 472, -491, -412, 1229, 792, -1017, -155, 1596, 10, -581, 40, 434, 506, -357, -558, 714, 540, -308, -432, 914, 948, -1084, -282, 1696, 253, -957, 493, 793, -89, -459, 309, 205, -415, 466, 233, -178, 581, -334, -12, 869, -520, -489, 248, 719, -477, -654, 772, 695, -1493, -645, 976, -328, -734, -37, 205, 68, -578, -115, 153, -360, -138, -435, -107, 585, -711, -429, 218, -249, -682, -62, 25, -50, -655, 524, 339, -738, -165, 315, 84, -113, -597, 292, 368, -944, 233, 418, 34, 248, 110, 288, 217, 71, 259, -374, -18, 117, -314, 232, 694, -130, -89, 530, 305, 161, -94, 544, 145, -167, 743, 111, -284, 496, 666, 62, 316, 30, 290, -212, 194, 393, -171, 216, 130, -475, -28, 293, -176, 105, 200, 58, -231]
1947b31J29N13n88j13N64n06L0N39o87j32M24j49j00Q1K42j66k81N11r6n18P26
1968A92m46L2K00J4n5m99L20J12k81N20K33p71L32R4l70K61J84l04K52p9J03k18
1990a74K71M89p51K29M65n56N0M5J12j77J35O6k21q5Q24l54l30K74n5k98K24r2
2012I1J01J39j2L3l58J01J5l62O39L4n77M34q6j23%j18K52l21J85J63o07L73J86
2035A82m31J27K31l47K56j44j79K55L5J5n11N32N58j179K56N96o99L32J84j67
2055i8J6K61j02J23n99O44m19k96Q60o40l86Q51l60M7M9L03m43r7P27k17o17L70
2077b3K61k65L2j5M9L42m20J67N2k6J84n96N51M1n31m9Q10k84j34N8J44n9j94
2100I5j44M02j37L53n64K23J63n69L15J51l39q7L45N2r1o99R23m6q14M67M60o15
$$ y = [-231, -102, 411, -177, -290, 274, -232, -202, 337, -350, -482, -58, -207, -307, -226, 16, -150, -431, 80, -16, -534, 192, -254, -222, -22, -8, -63, -562, -242, -130, -411, 109, 342, -429, -97, -3, -373, -112, 72, -232, 20, -59, 44, -174, 97, 586, -165, 64, 529, -27, 23, 68, 180, 3, 138, 204, -17, -102, 722, 368, 38, 312, 257, -41, 183, 91, 192, 331, 319, 352, -6, 95, 110, -252, 387, 421, -156, 278, 192, 69, 69, -49, 203, -118, 67, 230, -377, -4, 182, -249, -122, 109, -238, 18, -126, -305, -50, -15, 0, -511, 21, 579, -600, -344, 252, -447, -115, 69, -98, -82, 179, 77, 200, -399, 245, -174, -470, 390, -250, -636, 215, -145, -98, -49, 254, -189, -286, 441, 224, -393, -23, 238, -27, 5, -10, 39, 381, -39, 128, 180, 154, 338, -258, 293, 334, -197, -246, 564, 280, 146, 204, 348, 289, 95, -49, 353, 216, 569, 5, 228, 391, -178, 137, 288, -51, -138, 207, 259, 168, -531, 392, 346, -468, -1, 459, -156]
2122a56q0J39N48m10l89L23J40J10m57l74O97N44j188K35O20m19j30k91O17P8
2142A57o63N96k06j22M63m17n9K31l35L56j19k98l8M41K68m45m56J088j22j240
2162i20P19O78l60n05j19J150k96q96L48K05O04o02m62J064N6j004J62N68m0l30
2182B0j01M63j66n78P69k88K25l98K16M46p67l54J280k72r70L99O82J01j164n6
2202e13J233l43q04kM76N51n68q50J078M78r12l41L98R30q62o83R26j6n44J59
2222b09K17k86l33M85P7o36N00N02p13K1J93K41J50l86n17N36Q15q50p12R85Q70
2243I50j673l64J545K39q35m14P59K65q09j69O81j89L66o25j62R54o18j63N58
2262B96l77J48Q2j5p7r9M75L83j203K85P08j26l39l95P89L46j086q9O77N50n89
$$ y = [-156, -236, -97, 451, 41, -348, -25, 115, 225, -232, -606, 91, 635, -553, -318, 302, -117, -247, -538, 79, 157, -506, 90, -116, -238, 225, -192, -251, -20, -355, 1, -118, -416, -454, -13, 255, -190, -646, 442, 320, -920, -201, 477, 117, -388, -507, 643, 347, -549, -201, 4, 608, 6, -456, 608, 664, -340, -178, 390, 350, 20, -81, 382, 216, -362, 407, 119, 344, -54, 162, 608, -159, -513, 767, 495, -475, -76, 606, 707, -457, -513, 720, 377, -427, -429, 47, 598, 30, -820, 258, 736, -176, -517, -119, 811, -51, -734, 192, 176, -368, -209, 8, -278, -611, -126, -49, -685, -185, 317, -396, -375, -182, 59, 209, -177, -694, -158, 657, -193, -905, 80, 950, -723, -1087, 458, 697, -138, -552, 207, 472, -337, -506, 175, -14, 352, -273, -435, 519, -99, -262, 296, -81, 67, 149, 134, 57, -42, 433, 816, -387, -102, 606, 480, 141, -254, 535, 881, -205, -294, 383, 933, 344]
2283C44j254R43O87n50n77O51K43L3j027J43J026n42j74K01J4J09m75M73k91l24
2303c47O36Lr64M44N47k54k61l97Q74K8q81L58m4P53j57j264O47Q59p82m95K94
2324d03Q68k23j272Q85N79p19K29j22k27J84K77l83J52J09L84n65lJ61j44M97
2344B64j13m71M32L16n57j89J21J047o92q72J291L25q88j22J07N45l54m25J00
2363a35N64j28k28m35O61L27m21j05L3M7K88l31o7k33j7N53n50J28L31k87k58
2384b63J49l1O37o44m18N56K33r0k26J72K97l43n51L71L28P5p34J35Q73m85l68
2405c27L39m42O05j1m69L65k25J64O7o93L67J81L1k5l5Q4J32k62l37M91J9R1n33
2428d23J83M89l87j27L93J32j32j13j25M55j83m3K48o08N12L6n81M20l7L1K2l0
$$ y = [344, -910, 33, 720, 170, -407, 244, 487, 520, -507, -364, 662, 120, -54, 147, 161, 270, -205, 268, -23, -347, 289, 292, -672, -228, 319, 65, -196, -593, 281, 309, -572, -214, -258, 495, 338, -926, -279, 580, -202, -697, -403, 465, 242, -1030, -145, 434, -285, -56, -178, -405, -221, 56, -327, -175, -66, 318, -247, -250, -89, -233, 264, 151, -320, 112, 428, -129, -318, -197, 850, 158, -714, 577, 902, 14, -108, -1, 544, 190, -235, -135, 429, 301, 73, -362, 299, 626, 205, 100, 133, 180, 468, 137, 70, -163, -180, 373, -177, -49, 282, -5, -263, -114, -145, 492, -152, -570, -14, 219, 129, -97, 75, 372, 29, -522, -151, 177, 252, -482, -347, 526, 41, -327, 12, -430, 175, 164, -305, 60, -165, -1, 66, -627, -260, -79, -48, -73, -108, -24, 108, -154, -491, 0, 19, 110, -423, -240, 249, -138, -265, 128, 260, 128, 15, -110, 345, 162, 119, 367, -241, 271, 307, -274, 146, 109, 140, 162, 132]
2450A32o2J19j30K31m43J94L11o20L93j68J89K8j80J62J20n7k58N4O4k8J2m5M81
2473D99o63L08j45J59J89j67O7j80r9L65l51k62L92j34n6J03j86K34j08n6J73
2494H2l48K89J15m22J38K96l11K82l48M13k07m26M31J81m74L28k45K41m2l34N09
2515A48j01l95O02n82L63j7lK50k96J29k04J54k85M40l22K72L3q1J42k53N4p9
2537c1q6L83j37j32R8K74l02J71j66J00p5J79O3m20J63K40n72N20J23n77J30K12
2559A58Q3n05N4M58l15J10J06k32j93L16P3j16Q6j35j31K49j0j82k53L08J96j29
2581dJ01R5l03L1q7k28L02j29N59k44k81M50j94R0l29j19L27j09l6K39R1k38j82
2604a98J96J47k71j32L28l0m4N0l41M18J71n21L07k71J11J67kR4r1JQ9k99J74
$$ y = [132, 70, 189, 59, 290, -153, 41, 352, -268, 125, -43, 146, 174, -6, 156, 276, 219, -39, 15, 79, 51, 63, 18, 499, -164, 144, -1, 158, 347, 180, 247, 67, -32, 333, -18, -280, 112, -22, -78, 25, -161, 73, -35, -91, 82, -266, 23, 138, -284, -146, 150, -161, 121, -227, 186, -21, -447, -16, 165, -309, 19, -226, 15, -27, -361, 148, 47, -348, 254, -328, 35, 18, 15, 265, -31, 98, -106, 48, -237, 203, -119, 153, 186, 105, 247, -6, 48, -31, -117, 266, 129, -3, 95, 369, 67, 238, 72, 172, 97, 276, 339, -81, 82, 322, -250, 270, 393, -184, -54, 158, 241, -264, -210, 248, -67, 43, 149, -83, -276, 40, 113, -3, 83, -52, -183, 66, 56, -126, -379, -71, 125, -4, 97, 192, -111, -80, -167, -395, -93, -222, 337, 93, -188, 262, 68, 158, -171, -290, 37, -72, -108, 131, 222, -16, -198, -2, 145, -126, -258, 70, 40, -4, 46, -295, 123, 294, -227, 80, -191, -80, 87, 85, 179, 88, 89, 178, -121, 53]
2627E3Q3k54M52m02k03N51k70j50K4L35k9M6o6J46m62K6O85o32K76k40j81L98
2649A86q4o5j8k10N07l89p9M90k89j35K03j32j32K43k88M42o9j86J59m29L20l13
2671b68K66j60j26Q8L78k97J32l3p1R6l85P8M53l79K79q6k2j65j1j37K90m7n1
2694a78J73J92P2m35o1M44j6j66K5q5L01l19J98P4n17N36j40l54K27N2J7M2l71
2717b89K88L24l02Q3k39L40J20n70L33L13l29J46m9l57M68l84k5M34l02J59k91
2738a29J7M21l23O9N9n3J06L9m04n7M57j36k67j16L45j61K9J01J3K9Rl07J68O0
2762c1J47lm43L68j8m56J40J96M9p7l00J64L67p3m18K87J22O9k17j72L59k67L97
2785A90l42p2L66r9n32K41L82K05N7q64M38K00k2q4l58N88K87p48L3L41J91n82
$$ y = [53, 136, -118, 334, -68, -271, 280, 10, -140, -116, 219, 190, 236, 170, 316, -146, -120, 565, -67, 209, -31, -212, 186, 102, 37, 19, -191, 316, -73, -152, 338, 49, -86, 117, -15, -147, 96, -192, 250, 181, -5, 154, -275, 45, -268, -2, -162, -288, -200, 178, -119, 13, -20, -91, 5, -380, -302, 151, -228, 51, -35, -57, -222, -233, -370, -80, -127, -178, -5, 187, 259, -176, -237, 207, 191, 25, 50, -35, 266, -53, 145, 219, -298, 238, 98, -256, -29, 23, 40, 82, -289, -1, 323, 21, 104, -135, 205, 325, -245, 88, 401, 72, 218, 169, -188, 280, -104, -129, 305, 3, 162, -129, -112, 309, -14, 55, 114, 61, 167, 206, -198, -255, 202, 66, -201, -317, 28, -133, -104, -3, 10, 39, 48, -259, -91, -31, 116, 113, -330, 38, 20, -436, -296, -100, -51, -128, -428, -264, 103, 30, -388, -101, 21, 90, -127, -299, 60, -207, 190, -152, -224, 142, 43, -489, -248, 134, 339, 396, -468, -30, 170, 148, 64, -294, 294, 581, -167, -134, 207, 398, -184]
2807a84R2M37j74n9R8l60L34J28m97R0L59k46J00n32M17K35k08J7L87j84L31l93
2829A88n08J31N16J11o19K66L94j94o67J73J93L95n20k63M77l20N1J47j63J28
2849h4J18j22l66L30K21K6o27N33K40l57Q6K5m5J86m31Q5J78N8M0k73l08N65J15
2872A93o16p8N98q8j75k8M20j7j03m52J68K60J44k33p0M1M20m49MN9L52k28J42
2895B64m98N05j03j02j9l6Q7K47n84K67M53m73r2j59J83K77j57j59L02O5N3n37
2917b16M1L88j61k74K19j45p7K09p9K10r1Q3k71Q3N12l61p5qq3K62j55k86L10
2940C5M8p2j23k28N23N6l99j4j1J34R7l43N2M53j07j29k59K52j9k62K42M1K2j09
2964a20r0K17J30j37m0j35K5%J62j10K8m2K0q7K07J51P4l86K67p3J73k35l26M54
$$ y = [-184, -92, 345, 171, 112, 210, -150, 184, 312, -185, -95, 264, 18, 118, -414, 3, 238, 30, 47, 434, 250, 581, 188, -320, -189, 327, 438, -181, 85, 479, 285, -382, -209, -16, 379, -141, -404, 73, -247, -196, -49, -212, -84, 34, -88, -454, -124, 97, 123, -504, 29, 269, -88, -2, 23, -22, 164, -267, -182, -4, 54, 94, -179, -487, 78, 193, -423, -501, 97, 9, -166, -194, 226, 209, 106, -346, -178, 82, 226, -7, -77, -36, 384, -65, -61, -2, 350, 122, 264, -234, 271, 168, 66, 47, 11, 98, 345, -239, 28, 481, 8, -84, -243, -60, 217, 60, -99, 203, 268, 321, -216, -175, 213, 52, -222, -3, -148, -225, -16, -95, 115, 24, 107, -164, -81, 431, 70, -5, -13, -96, 166, 11, -275, 35, 83, 11, -112, -340, 183, 239, -160, -174, -185, -51, 46, -297, -245, 208, 101, -28, -287, -35, -54, -316, -74, -33, -11, -120, -210, 7, 137, 0, -40, -175, -150, -150, 12, -98, -70, -112, -92, -179, 28, 179, 253, -133, 134, 61, 234, -1, -327, 127]
2988A27r4K78l51KJ76J15k59J60P9p7o9l06K25M47m21LJ92l05MO1n6K07J12l67
3012a17L76n67L41J5l0J30o02N09Jk4L1m7o6M3j91K58Kj38j15J38J78J87n88L03
3036B7l63L19r7J05O6p8j67k8j1J3L76k04l18K27m5K32k80M6N07n03J89l65O6
3059b86L21N3j30n4J68N4o7O5lk67K06J93k23m8j00L45k44p0K3N7q7J22J20k00
3083e2K55j09L8k54N0J73j96J15N3O0k14J77j47J40o3R7N7n62K57j51J00K74J71
3106B69m36K05J39k22Q3k8j45Q0j09k1p1N02k32l30K17K58j21k27k07M05o5K6
3128c0R5j13k13L74m18J04K71j01K0j12L8q1K47j36N1M3P3j79p2J49J91l99M13
3151B15l14J15J33j05k05L14K8j98k11K01J06l9l09L47m4M0o1K8M7k73K33p8m3
$$ y = [127, 33, 311, -40, -38, 138, 253, -6, 154, 233, 156, 87, -219, 6, 453, 32, 35, 227, -78, -74, -13, -69, 138, 250, -117, 259, -308, 33, 48, 18, 148, -454, 55, 56, 32, 63, 16, -50, -7, -198, 60, 62, -76, -191, -53, 125, 312, -276, 27, -336, -17, -114, -9, 57, -21, -188, -216, -227, -214, 162, -42, -360, -133, -178, 54, -226, -180, 327, -176, 13, -352, -286, 35, 88, -42, -96, 72, 126, 59, 124, 121, -146, 60, 253, 30, -18, -118, 227, -17, -87, -64, -7, -94, 28, 148, -52, 203, 94, 132, -122, -72, 101, -95, 20, 73, 133, -81, 96, -51, 89, 26, 123, 180, -382, -125, -276, -176, 98, 269, -167, 38, 177, -45, 38, 10, -135, -55, -164, -185, -256, 246, 14, -316, -99, 159, 38, -189, -396, 9, -56, -30, 65, -48, -261, 113, -305, -201, 70, -31, -11, -123, -85, -166, 81, -55, -4, 39, 112, -67, -139, 10, 201, -198, 215, -99, 16, 149, 44, -161, 153, 181, -17, -228, -27, 79, 40, -269, 78, 34, 74, 13, 41, 88, -185, 48, -30, -73]
3174g3J92j26Q9P4j09j2Q1j20L12m45J93m9j25Q0J56l96N64l8q3L6k03Q6r3q0
3198h9R2k4p5k6J13M2K08m41R7J17J94l9l87K11k04J21K18k75p9K73r9j3p5o9
3222b09J79J14j45J65p1p2O8k20L85l10k70N99j97j32L62m11J88m4L3o5nj31l0
3245b19j36L37K21n07K74M0q3j14J68J13P7m29L25L8R1j44L2j63j55J76L23j47
3267A18l99M89k57J81j57k82O68m11p0L06n8J74n15J72K34M2k90O12o52J20k05
3288a80j11N02k61j3m1J42j24o6n2K70j3Q0k3j44pM4J4j2k0o8L47j40j84l2J85
3313I3j01j07J70O1q7n46N52J51l52M8P6K23j1l60J72P3j20L3n5R3k58K57K7o5
3337c3K50k9l61M08m24J51K29k59Q1p2L28nn17L80J06j45q8M1J04J07j19j84O3
$$ y = [-73, 119, -7, 82, 156, 47, 35, 116, -4, 308, -137, 56, 7, -118, -38, 118, -278, 286, 248, 165, 201, -2, 84, -9, -89, 3, -21, -96, -122, -9, 33, 241, -200, -103, 14, 208, 169, -218, -7, -211, -90, 128, -147, -226, 47, -52, -65, -140, -209, -30, 84, -61, 104, 33, -39, 29, -191, 194, -116, -386, 213, 16, -116, 246, -165, 23, -21, 12, -53, -58, -189, -219, -355, -18, 203, -304, -30, 10, -73, -187, -19, 94, 171, -258, 67, 105, 196, 52, 84, -79, -234, -58, 265, 118, -281, 208, -49, 132, -25, -307, 361, -50, -120, 186, 128, 302, -213, -41, 193, 235, -55, 557, -95, 25, -180, -291, 211, -50, -63, -104, 38, -86, -152, -204, 66, 53, 133, 110, -34, -41, 3, 17, 5, -15, -83, 264, 124, -60, -92, 93, -8, -115, 55, 116, 29, -517, 35, 186, -166, -118, -42, 181, 170, -190, -18, 55, -65, -32, -87, 6, -252, 5, 32, -33, 217, 188, -173, 235, -189, -38, 191, -68, 13, -59, 269, 264, -253, 127, 233, 88, 0, 41, 145, 252, 133, -51, 12]
3360A2J14J19j55k24J29k0N0J15oj75j29k0L74m99M48l21L69j62J36j79J14k91
3382b01mK03j43k09N48r9k19o9L95l10j65K01K63n5j96k57O06J4l19r8J07J8M
3405A5J09p2j22J68K69n19N4P7L8R3l89J42J69r9k16L75k4J99m74kM38N7l48k2
3429h4n8K87n9k92M83r1k85K13j76K36j31j04k7J20nK06j90j27K60k29l9L50k75
3452a7M22k84j20P9j70J01j32n5L51j41J7q5p9K99k97nM4J97q5j3K8P6r7r9nN2
3478a8K1M6p7o1L26j25p2j42Q6P3O7k05r6K73j12n2j89L70j75r8n4L95j54m47
3502d20L84Rj3L12k40k11K31l72K05K16j25K28m29M20j88J60Po9k42J29J32O4
3524A88j66o9K99l01L15l58r6N2L08j62j03K81k57J08K7k0J26j74K28j78R2r3
$$ y = [12, 126, 245, 90, -134, -5, -25, 25, 140, 134, -41, -170, -190, 184, -315, 133, -188, 181, 19, 155, -24, 90, -201, -205, -2, -145, -354, 194, 95, -124, -193, 202, -108, -273, -72, 191, 136, -60, -317, 289, 303, -16, -114, -7, 11, 15, 124, 52, -70, 98, 367, -152, -98, -21, 17, 110, -279, -137, 32, -67, -283, 92, 68, 267, -207, -209, 229, 286, -62, -84, -142, 145, 86, -206, 277, 186, -99, 114, -62, 174, 43, -61, -88, 32, 27, 233, 43, -84, 176, -53, -92, 258, -17, 405, 121, 1, 80, -90, 11, -121, -176, 175, 34, 51, -34, -113, 186, -111, -116, -72, 125, 40, 27, 55, 131, 34, -65, -70, -18, 3, 49, -28, -89, 237, 112, 40, -102, -16, 57, 124, -81, -177, 96, -16, -68, -257, 113, -62, -160, -214, 181, 27, -420, -36, -27, -40, 272, 32, -179, 52, -320, -115, 101, -24, 204, -225, 195, 7, 167, 174, 105, -137, -8, 124, 188, 22, -47, 252, -49, 266, -92, -188, -136, 172, 10, -93, 188, -69, 39, 66, 46, 172, -2, 226, 48, 140, 47]
3546D7k25Q6L34o6l65M42l79N1j08J10R2j58k0J47J23j66p7j73J89j17J87L59
3568C13m50l72O56k57K8O1K12k98J02j29K91k25q1K15k1p9j89K01P2k98N28k27
3590E3n4j05L53l60N9K03k21L27n00M49j21k93K93j96J20l5j72J1N9J59j12p3
3612a56J84J85p4k87O6K64k34r2K76k21l4J58lj11LK62k45M56l10l0j48MK01k24
3636a10L24q7j40j12K41r0n6j2O1j37J3L47l04L2K08k27J69m2j44oK6J62k60j16
3660b60N07k63j38L78l27K46l18M5L33m05j25L58N0j82J14l3K38k45LPJ48j2k77
3683a58j6K99N1k61k62M51l85L12O0l5p1l0K13l30J96r3Q7J7Qk03K07j01J00J32
3707A88m38K32K08M1n3j7j43k13M48l93L64m89M07j14k38K69M7j53K14j10O7j03
$$ y = [47, -178, -92, 242, 176, -189, 253, -126, -75, -183, -73, 19, -139, -159, -12, 111, -55, -132, -305, -116, -233, -46, 313, -137, -509, 147, -110, -82, -21, 191, -107, -5, -134, 157, -68, -149, 66, 45, -34, -223, -22, 50, -248, 280, 53, -1, -106, 247, -113, -54, 149, -72, 255, -245, 204, 83, -210, 83, -113, 7, -28, -200, -189, -130, 29, -83, -156, 28, 213, 139, -148, -82, 182, -52, -144, 132, -89, -123, 35, 32, -79, -76, 186, -59, 397, 87, 57, -91, -87, 114, -110, 214, 127, -13, -125, 116, 26, -30, -42, 19, -118, -105, 242, -62, -30, 178, -49, 120, 78, -66, -72, -46, 116, -144, -260, 247, -16, -154, 224, -103, 143, -175, -130, 203, -202, -327, 31, 81, -101, 13, -20, 218, -27, -24, -17, 131, 119, -158, -174, 125, 176, -85, -347, 104, -281, 31, 91, 56, -15, -45, 168, -162, 34, -59, 28, 45, 53, -150, 57, -44, 56, 188, -250, -18, 190, 231, 178, 161, 18, -195, 253, -140, 224, -265, 142, 28, -210, 59, 106, -47, 167, 57, 124, 21]
3729B1r5Q4K7J33k78M8K00p4L0K5k96K15O0k20J83q0j76K78k86L41pP7k64MJ58
3754A08J25l55l5J0p7L37l01J23K3R5o4M5j34lJ27l78M13k19n0R9J62K0L9j90
3778h0j33lM52l79K58j63K03k75K30j73K41l29K89j5K7j16mj15K95p5j51m3j60
3801b19L27m8j29K83p6j83j87L90l2O2k58j26L04l1k86J47L17j77Q7m84L36r9
3823h2j54K35l26K58L4J86k08J6J00l0N8k38k4K15P3l47M27j06j66r2p4J11K94
3846A60j17j32L72l27l8r4M13j84L0k1k94M1j0K28K59k77jK67m67j02M49j67Q3
3869G1k05K07P7j83j2j25L46j38J02l99J33J86O8k17L15j50k86J09l8J84q1M22
3891C86m11J86L10n28Q4n3J66O2l11J81R7j19%Q1j89M56j7j92k88K77L8k48k59
$$ y = [21, -74, 10, 37, 170, -108, -60, 140, 66, 96, 121, -175, 40, 100, -120, 63, -17, -193, 85, -201, 140, 133, 210, -54, -50, 108, 233, -122, -157, -147, -224, 113, -188, -65, -42, 53, -11, 34, -100, -103, 24, -354, 59, -160, -210, -111, 51, 71, 110, -80, -213, -216, 236, -143, 115, -48, 155, -120, 110, -63, 178, -151, 138, 123, 150, 34, 30, -85, 210, 135, -16, -59, -219, 108, 60, -69, 214, 138, -45, -232, 158, 126, 188, -70, -196, 108, 77, -209, -62, 255, 78, 165, -319, 17, -82, -236, -1, -327, -69, -35, 151, -57, -41, 59, 29, 87, -151, -175, 40, 113, -234, 193, 87, -79, -171, -245, -134, 160, 43, -89, 283, -44, -82, -176, 237, 53, 83, 62, -232, -191, -201, 27, 286, 9, 8, 275, -192, -294, 155, -12, 71, -134, 73, 150, -33, -45, -170, 176, 38, 140, -259, -126, 60, 128, -89, 226, 76, -210, -101, -139, 45, -36, 386, -25, 161, 471, -57, 27, -26, 140, 202, -109, 72, 169, 50, 50, 131, -58, 398, 381, 189, -99, 178, 216, -32, -291]
3914b91O2L38j54l0J54q3j75On5J45J41l16J29M5L8k01K17O3J25n4m43K46J53
3937F0k4j05r2K48P5m07K86l5O9k32K91j67j20J72M9p2j19L56l79O8J33l68L01
3960a2K57k63K58k9j1l86J00J07J15j43Q3J19m6q8N4K7k12J90j61K7j10M38m84
3983a70R7J61j5m8k10R1N6n4Pk6J12K16j61j23J46K3J22k41J08R6m07J7L46n9
4007H4J45j35l4j04J0R4k08L24l5K18l12L03m16M2j10M2K52k12Q2O3r9J39o1j89
4031a17K4o0j9Q4K6r6J84k2J95j75m6L2r1K95k17r7L44m52J80J14nk66K93J15
4055B23q4k50J4j11N39k28j62j4L39j35k89K63j16j20K17p3r1K94k51K10j15k42
4077a82P8pK10J24m1r9j8K8m3k1K41k78J76J88m15j93m2M01j50K47k08o2JR4k6
$$ y = [-291, -229, 109, -45, -75, 79, -4, -179, -173, -228, -83, 58, -258, -129, -84, -46, -247, -30, 33, 158, 104, -339, -93, 60, 36, -69, -161, 87, 162, -245, 41, 6, 75, -157, 134, -33, -153, 19, 68, -4, -123, 233, -146, -78, 55, -313, -12, 245, -18, 240, 211, 200, -186, -86, 21, 136, -7, 76, 195, 149, 61, 115, 142, -70, 120, -41, -14, -124, 314, -170, -73, 88, 73, 25, -185, -94, -38, -92, -85, -111, 1, 217, 56, -67, 79, 102, 224, -17, 91, 187, -220, -203, 143, 84, 229, 94, 60, -44, -34, 60, -148, 176, 141, 359, 47, 350, -66, -24, -134, -92, 160, -52, 30, 93, -6, 133, 72, -117, -93, -153, -172, -88, -62, -158, 26, 4, 199, 24, -22, 10, -81, 214, -3, -100, 244, -208, -28, 86, 81, -185, 108, 223, 139, -111, -97, -208, 331, 103, -59, -73, 266, 131, -158, 105, -11, -131, 86, 13, -78, 216, -35, 175, 60, -182, -104, -111, 99, 223, 182, 83, 65, 93, 50, 29, 270, -8, 168, 356, -59, -252, -294, 107, -43, 204, -4, -66, -65, 29, 3]
4102Cj4J36J3j25l3l60L89k12L66j25jr5j18J06J01j6j06K6k35M9J75KmJ0J21
4127E3l60L41J0K24n60K29P0P0k27Q1p7N3J40ML7n4J30k00K65l8O0l25M31m24
4151f7J35Q3j37m6P2m06J47K48p2J73r5J93j60Kj8J8J2J79m03J79R5K5k82m5P3
4176i7J49j44K83j04j8K8oJ07k78J61J26k49k38N10m18J86Q0p3K73m37n2L66l20
4199a65JJ10j24J18k4O1j56J41J01j43O8PK4K31j95J70l05j45J2K64r3m1J70k38
4223a51lM19l83j14R1K98l16J55Q3Q8k71J80J10m84O03k22OJ8r7j68L34p4l3l09
4247b40L56J10j87R9Rk51L07j35J52n7j24R8j26j0q0J02K2l1O4j62K33l89K65
4270B5J55k69L3L54o2j02j97J06q6J43O0j96mM66m79qK78j53p0Jj73R4P2kj79
$$ y = [3, -11, 125, 138, 13, -20, -380, 9, -203, 163, 38, 37, -58, -176, -70, 31, 15, -91, -65, -300, -251, -76, -74, -78, -68, 53, -307, 34, 44, 268, -292, -63, 7, 77, -150, -69, -146, -93, 47, 51, 88, 34, 164, -36, 229, 191, 251, -74, 357, -67, 68, 151, 14, -32, 40, -366, -219, 29, -43, 130, 35, 228, 68, 70, 52, 70, 82, 261, -142, 37, 132, 157, -125, -170, -97, 52, -92, 191, 87, 69, 97, 91, 198, -80, 81, 207, -42, -280, 230, -188, -2, 78, 5, 278, -159, -211, 155, -165, -164, -54, -178, -60, -84, -23, -179, -38, 63, -80, -12, -5, 19, 250, 55, 225, -80, -225, -213, 51, -42, -83, 87, -151, -154, 265, -118, -232, -141, 157, -159, -4, 79, 167, -104, 76, 186, -298, 305, 83, 89, 107, 10, -158, 176, 102, 69, -240, 116, 226, 39, 138, 147, -104, 203, 68, 220, 163, 39, 137, 11, 1, -79, 23, 45, 14, 78, -84, 149, -240, 25, 180, -89, -56, 298, 236, 134, -63, 43, -43, 100, 160, -36, -40, 426, -53, -61, 217, 64, -6, -5, -178, -84, -12, -14, -193]
4295a93J8K81p0O9j5l28K31r3L2J7J35j7J12k83J8N1K09K6lr6k26k1k6Q4J52m1
4321B3j8m1L5K80k20M1j93K73k53O0N2P4k3Q8j22l6K5j71N91n71J62k4p3L85j92
4346A52j04M6j54j00L02j92%Q0J25m45QJ22N9J2J3J75k2r0r8j02K02N9j00N2j87
4371a87J18J13M0j49J53J08k08q5K00l46L53j71k43O5j2J37j40L10J12k51J79
4392I6O0k62O3kM5J63r0j42R5j26K7Q6J41n38K43J08R3m9j56K69k29K3J16N1r9
4417a4R9N7m86K11M39j73j7m57M97M3j63Q8n1Q4l86L56k55J72k54J64K2j78M59
4440B57j22K3q9M4j98o2J08J05J19l38K73k42K42l43J50j12J12J83k25J33k02
4461a84J51K33j60k09N5J03k01OJ86j29K50k48j47M40l98M6R8L21m18L05J06m95
$$ y = [-193, -175, 106, 36, 105, 90, -238, -7, -100, -68, -51, 84, 67, 179, -104, -86, -35, 174, 200, 197, 101, -125, -146, -172, -88, 64, 23, 5, -36, -1, 279, 59, 100, -93, 180, -73, -13, 39, 113, 90, 178, 56, 20, 45, -126, 465, -106, 56, 32, -41, 344, 152, 48, 94, -60, -160, 142, -50, -50, 30, 155, -290, -282, -160, -101, -89, -76, 99, 77, -13, -111, -213, -11, 48, -52, 0, -187, -69, 44, 84, -65, 88, 196, -12, -97, 103, -243, 110, -61, -304, -239, -251, -114, -254, 56, 168, -83, 96, 156, -106, -43, -45, 0, 163, 73, -69, 26, -100, -73, 13, 154, -384, -141, -33, 60, 11, -145, 124, -105, -82, 34, 85, -14, 85, 142, -344, -133, 306, 133, 116, -341, 156, 199, 36, 124, 73, 157, -229, 127, -128, 44, -210, -46, -24, -202, 257, 135, 158, 69, 113, -85, -147, -39, 66, 185, -153, 120, -122, 120, -223, -73, -185, -73, 110, -115, 18, -184, -33, 200, 40, -169, -114, -11, -212, -206, -20, -149, 101, -147, -294, 146, -252, -206, -108, 213, -205, 100, 206, -289]
4483b89N58l63J00p3L0p8Q6k03J08L74m00K70L2k13K2k01Q7K43m4p9j14L58l99
4506a88K98k84M0K07P7l78Q7J92K1m8K08j32J48j89j11K51p3o0K60k65p1m8K16
4529A58k49J05Lj49Q4j15J45q4q2J07M01j49k6p1J7j36O9j24l0J71n0k08Q3K16
4553H6n0J62m09J99O6m9k9j97J51k75L18j56L56k78lM2K84l01k4K65j46K08j25
4576I5j72j7k40O77k88k08L84k63k5J01j07K38k09n5J29k44L27j39m4M3J54J49
4598B86m05J34j10K4j42K88M6j49K31m19L93k62O1J63o0m85M30oJ22mO8j00k30
4621a26K57K6k66J65q8r7K56l10L52J34j39j34j98K63m4Q4n3J40j90K6q0J41L7
4644A56k47R4o3q8j21L36Q2k4j66N3Qo6j95K66j77J78K00P7l19jr3K43n2K52k82
$$ y = [-289, 269, -94, 6, -67, -37, -115, -29, -232, -124, 250, -150, 120, 152, -61, -39, -240, -153, 90, 46, -33, -147, 211, -188, 110, -174, -134, 73, 150, -228, -141, 51, 72, 24, 232, 100, 248, 59, -52, 199, 126, 66, 326, 61, -10, -58, 158, -91, 14, 17, -132, -48, -163, -18, -102, -184, -77, 324, 175, 149, 78, 95, -41, 28, -96, -126, 45, -5, -213, -130, 86, 36, 198, -211, -12, 54, 5, -24, -221, -70, -345, -27, -183, 173, -105, -108, -66, 218, -83, -107, 158, 12, 220, 95, -77, -94, -334, 343, 55, -153, 231, -32, -57, 44, -63, 175, -34, -89, 40, -204, 123, -16, -60, -17, 137, 286, -119, 15, -95, -71, -213, 75, 121, -28, 203, -216, 177, -85, -24, 139, 79, -406, 24, 18, 140, 136, 204, 104, -126, 131, 157, -109, 56, -32, -129, 127, -183, 169, 303, 164, 30, -168, 95, 51, 135, 82, 222, 32, 58, -22, 119, 156, -91, 3, -60, -148, -269, 67, 149, 125, -41, 12, 20, -46, -241, 25, -152, 26, 226, 303, -16, -17, -110, 133, 81, 333, 51]
4669E1p7M8k72L23r2J0j0J13j42j20J13P9l4Q1j21K1j34J69K45l24NQ4o4KK16
4694A70j87k2q0N4J00j10Jj19L38k32J66j00j6K02k19q9J64q0PL84l43j79L05
4717A15j6R0j74r7rk9R5N9n9L18m21j51M19k48P0K48k53j85K33pj01J76lJ72m19
4742a77O0L5J34J68j34j62Q9m3lJ25K37k77l26N09j93j85Q4k69N76k76K70q8m2
4765A12l97Q1L02l10P7K2J27Ol1p8j44L13k84L78l91J98Q6q9k50L82j40l6m8J51
4789C7j40J72j86m3L73k11J07n6j05J06J6K6R7k81R4j10J86Q8k80K14k09J54R1
4812A40oj48j82K96N5j38j46J93p5k17J51L25l05K88l81J07k8K55m2k55K7K77
4834A91l5k31j07Q3K82j76k44K45K02j96N0o9J02r1j61N2O8r5K14k9m5J78r4r
$$ y = [51, -26, 22, -250, 73, -19, -9, -19, 94, -48, -168, -55, 24, -10, 71, -50, -29, -163, 6, 251, -73, -68, 16, -48, -46, 170, -17, -39, -119, -65, 35, -75, -74, -193, 145, -87, 79, -21, -37, 165, -54, -143, 21, -59, -52, 332, -11, -190, 115, 99, 189, 15, -82, -91, -120, -25, 34, -25, 293, -128, -279, 140, -108, -38, 210, -43, -228, 5, -2, -103, 73, 70, 242, -177, -117, -82, 52, 220, 86, -76, 13, -30, -33, 92, 329, 52, -274, 235, 42, -143, -59, -328, 248, -28, 242, 154, 112, -285, -204, 98, -212, -135, -113, 14, 20, -11, -89, -233, 80, -204, 174, -217, -19, 67, -22, -272, 110, -30, -66, -114, 37, -103, 69, -117, -160, 213, 2, 109, 53, -52, 54, 70, 96, 193, -88, 6, -104, 82, 170, -110, 104, -105, 49, 140, 134, -14, -196, 100, 155, 17, -129, 64, -11, -228, -77, 248, -57, 231, -150, -43, -71, 184, 142, -113, -86, 191, 156, -75, -182, -99, 183, 7, -237, 8, 210, 14, 64, -5, 97, 6, -155, -103, -35, -130, 84, 55, 10, 188, 94, 85]
4858H5k32l27N72k18R1J32k01J86J8k01M9Q6j95K48R2k84K11k3Q0m13N00k48k
4881Fk6K47l17K96l75N04j46JJ17l74O3k82L76j35L1J29J4l09L52R1l46m6M1j95
4905b83L46K52l26n6J34n5q5J62n4p4J18J32l97J31L07l16O4j15j10M20l47q5
4927b37M61j59K7k01J53j2j91K52rj07Q3p1L60l51r7J46k26J80j20K20k8L30m41
4950c8J40Kl54k6L41r6J05p9J49j26k8O0j14p4J95k47L96P3k91P6j80K48r5j87
4974a50J84O1m0j1R2l31M39l59P7J28r4J05j61O9J81j57K48k70P4K26k25n7l7
4997hM3j39R6m1K87j39j97j28M5O1n4N3J59j75J19k73J86J87k39N0J08j20l8K44
5021H7k48K05j9%L6l09K36r8J38m8P0j57L1o5j0Q9K17j30J0J78l13J10P8K66m49
$$ y = [85, -147, -474, 98, -120, -29, 103, -98, 88, 106, -95, -46, 40, -155, 93, 185, -99, 112, 89, 169, -244, 256, 8, 6, -20, 227, -90, 206, -169, 335, 189, 190, 307, -67, -4, -286, 90, -45, -14, 115, 129, -180, 172, 263, -83, -129, -88, -283, 63, 315, -11, -67, 67, 12, -73, 89, 35, -39, 79, 211, -186, -55, 252, -64, 0, -115, -225, 195, -152, -237, 224, 65, 92, -109, 44, 32, -159, 93, 84, -23, 60, -11, 349, -2, -99, 47, -179, 1, -119, 101, 73, 403, -38, 102, 104, -250, -276, 65, -31, 74, -5, 144, 18, -10, 50, -64, -138, 57, -190, 206, 279, -12, 64, -116, 132, 37, -150, 34, 95, 55, 44, 136, -195, 244, -115, -38, 90, -4, 101, -60, 9, 190, 33, 281, 11, 85, 311, 86, 29, -8, 35, -104, -8, -49, 238, 99, -98, -226, -181, -120, -174, -121, 38, -137, -18, -291, -105, 82, -157, -107, 1, -119, -157, 87, -161, 44, 25, 25, 61, -248, -12, -110, 28, -20, 50, -107, -76, -141, -151, -62, 155, 25, 35, 213, -100, 10, 88, 354, -95]
5046i5l3K47m1J02r1P4M09l72j93Q4q8kJ28k62J71n1k47K13J07r1k58K27j59K63
5070D2PJ68k9M6l72O0L20l37J93j78J61j39K60k78R5n4k4L02j31l71O1J83J62
5093A47R1k99J03j12Q5k33L61j26n3J4K13m08N7J54P4J02o10K39J31j41J73k41
5115b79L72L9j22O6l49J65K05r5j07L48k78k3J86j78J08q2Pm0K34O2k27k62O6
5138a84J59n6J4j18J34J05k86J77P9j20M43o27N45l80J37j28MJ64mk25L85l52
5160a34J05J34p3q6m0J09K39j93k66L83k68J23r3J60J41k69J45Q2j3k38M9j98
5182b01K36o8J50J36l20j61Q4K33j83j35Q3k8M11l97K34j54R4ol47J45K60qk4
5205C4k92J55J28p4J78k97K80K38l07K26k22N5RPj37J13n3J01k7o8j89L23j91
$$ y = [-95, -128, 119, 78, 180, 89, 163, 572, 200, 7, 91, 3, 1, 129, -133, 38, -13, -260, -47, 60, -31, -289, -62, -221, 42, 49, 217, 188, 234, -138, -78, 242, -95, 98, -80, 81, -58, 202, -76, 19, -35, -59, 243, 112, -259, -198, -15, 147, 238, -61, 42, -70, 15, -218, 143, 17, -36, -22, 191, -217, -160, -6, 68, 170, -440, -201, -70, -211, -38, -279, 93, 132, 10, 76, -273, -108, 97, 2, -105, 243, -35, -58, 128, -50, 58, -24, -17, -57, 177, 239, 12, -250, -184, -25, -81, -67, -185, -51, 54, -232, -55, 24, -96, 347, -280, 265, -115, 22, -106, -102, 62, 58, -167, 218, -134, -29, 105, 32, -54, -94, 15, 254, 61, -205, 178, -90, 33, -60, 100, 241, -28, 117, 199, 186, -52, -3, -201, 35, -33, 117, 253, -67, -228, -144, 89, -94, -229, -146, -174, 237, -160, 74, -80, 14, 8, -339, -194, 66, 58, 34, -258, -103, 25, -49, 129, -168, 112, 350, 43, 269, 47, 102, 111, 118, -19, 94, 41, 142, 115, 47, -142, 181, -10]
5228a0Q7k93K96J38m38J35R0p1K89j01k45L02j45R2l61J37N9q0K83j19j33M5j96
5251b39J56Q0J53k72N6r0K0M8k1P3m6k23K97J9j09J01K4mm5K6L3k63K45J04m89
5276c66M78k4k22J39J33l9j98K3J56j99j32L45M5k40L6L8M9Rm4L62k13k89K75
5299A22l29J91j44K59l12L45k86J01j92L71l03P0M0j12J02K06K1j62R6j80J52
5320E6j4l21L99k99K28J42j48mk14J48m2l9J04l7J27M4j66J19m2K3p7J07j39J91
5344A46j70k3L88m25J96j73j46P1K33o5P0l92L94j19O2Kl82M74l57K83K90k30
5366A27P5%l14M99k51l12K27L36k55n04L55J90j05k47K76k63J56J6k90J55J30
5387Aj68L71m8k66p5L33j88J45j52j18J10K6j3PJ66j0r4r4j11j10L43N3j57J19
$$ y = [-10, 77, -216, 80, 218, -220, -85, 5, -66, 223, 122, -123, 179, 34, 126, -235, -98, -39, -119, 164, 45, -88, -43, -239, -83, -3, 150, -122, -66, -156, -136, -88, -109, -36, -82, -305, -8, 11, -98, 3, 27, 23, -22, 4, 37, -226, 19, 123, -366, 112, 88, -134, 5, 138, 99, -99, -76, 80, -119, -251, 94, 139, -101, -65, -27, 22, 31, -13, 349, 136, -153, 122, -207, -16, -160, 99, -213, 132, -154, -53, -245, 126, -177, -107, -67, -179, -77, 129, 150, -12, 84, -96, 56, 42, -279, 120, -179, 49, 191, 43, 39, -175, -27, -69, -108, -4, -41, 86, 130, -36, 83, 41, 64, -13, 94, -45, 146, -24, -47, 341, -84, 112, -61, -207, -136, 97, 32, 102, -290, 104, -15, 47, 49, -333, 141, -216, 67, 357, 127, 202, 202, -112, 387, 136, -176, 51, 387, 132, -372, -17, 173, 68, -179, 97, -166, -10, 6, -284, -129, 1, -167, 204, 156, -110, -185, 148, -40, 105, -47, -165, -55, -29, -42, -35, 131, 121, 27, -67, -178, -288, 55, 108, -49, 70]
5411G0m3P6Q6j02O9r5N6j63L9jQ8R8m03L88k92L9L22l23J58l30N53l53J79k41
5435a25J31K57j90j06L5J33j89K08O7j88j25K57j03J91l43J25J00K6k53J0M4J06
5457F8k45o3J56J15p9j7k2O5k3P3j72J67l15L97Mk08R2j58O2J88r0j21J29J88
5481A91m9Kj17%N3l06M26j93k22L44K8j55k28K24K39l64J99P6l55K28K56k30K13
5504B60n38K44k9K8J03n7K5n6j49K22K57l38N4R3L7j52J3o7J00n4l1j2J26k68
5528a89K30k38L61k52J74q5K73k81p5J88k02k4J56j91K03p8J81o9k17K98k09K04
5550A58q1J8J38n16NN06k52J09q0j16J50J17r2K7o8M26n42j27K36k4j7l54L16
5573f3J04K0J45m32J87J86j32j01J29j24K43m81K02J59j95L58l77Q9K3J65j36
$$ y = [70, 27, 103, 189, 87, 156, 61, 117, -46, -7, -8, 80, 178, -225, 163, -129, -90, 232, -91, 67, -263, 290, -63, 116, -125, 6, 263, 73, -33, 2, 135, -54, 154, 221, 33, -92, 165, 62, 253, -90, 35, 135, 161, -92, -82, -38, 68, -177, -240, -84, 31, -48, -65, -87, -22, -45, 28, -144, 23, -292, 105, 109, -99, -7, -165, -103, 85, -5, -126, 3, 191, 142, 144, 27, 27, 80, -226, 200, 7, -215, 129, 157, 2, -226, -2, 237, -127, 72, 148, -207, 21, 277, 47, 260, -278, -34, -63, -35, 68, 11, 36, -20, -169, 53, 310, -28, 26, 119, 156, 4, 17, -50, 50, -4, -35, -47, 79, -189, 41, -197, 164, -88, 86, 1, 274, -7, -82, 106, -96, -120, 36, -155, 48, -30, 151, 82, -135, 163, -46, 158, 77, 95, 233, -283, -278, 228, -24, 85, 5, -111, 39, 156, 64, 91, 23, 449, -93, -220, 16, -8, -25, -379, -63, 41, 61, 206, -226, -39, 147, 15, -86, 43, -81, 162, -319, -117, 42, -153, 205, -172, -83, -60, 105, -31]
5594c1pl9J47k6R6j54J44p8P0j02J24q1k42P4KJ54J15R8m53M02p2j50J06k66L54
$$ y = [-31, -38, -77, 70, 44, 140, -14, 130, 52, 122, 20, 144, 63, -179, -105, -103, 51, 166, 264, -189, 213, 141, -9, 97, -169, 185]
$$ [...]
8191A7
##END NTUPLES=NMR FID
##END=
