##TITLE=1H_Pr-83-4
 D2O, 8 sc, 
 29.6.2020
##JCAMPDX= 6.0         $$ Bruker NMR JCAMP-DX V2.0
##DATA TYPE= NMR FID
##DATA CLASS= NTUPLES
##ORIGIN= UXNMR, Bruker Analytische Messtechnik GmbH
##OWNER= root
$$ XWIN-NMR		Version 3.5
$$ Mon Jun 29 09:34:12 2020 Russian Standard Time (UT+4h)  she@DPX200
##.OBSERVE FREQUENCY= 200.1315
##.OBSERVE NUCLEUS= ^1H
##.DELAY= (6, 6)
##.ACQUISITION MODE= SIMULTANEOUS
##.ACQUISITION SCHEME= undefined
##.AVERAGES= 8
##.DIGITISER RES= 18
##SPECTROMETER/DATA SYSTEM= spect
##.PULSE SEQUENCE= zg30
##.SOLVENT NAME= D2O
##.SHIFT REFERENCE= (INTERNAL, D2O, 0, 15.7039)
##AUDIT TRAIL= $$ (NUMBER, WHEN, WHO, WHERE, WHAT)
$$ ##TITLE= Audit trail, XWIN-NMR		Version 3.5
$$ ##JCAMPDX= 5.01
$$ ##ORIGIN= Bruker BioSpin GmbH
$$ ##OWNER= she
$$ F:/spectra/data/she/nmr/H-F/1/audita.txt
$$ ##AUDIT TRAIL=  $$ (NUMBER, WHEN, WHO, WHERE, WHAT)
(   1,<2020-06-29 09:32:57.90 +0400>,<she>,<DPX200>,
      <created by zg, POWCHK disabled, PULCHK disabled
       configuration hash MD5:
       00 E9 B6 7A A2 85 ED C7 34 08 36 98 17 FE 4E 26
       data hash MD5: 16K
       6E 69 6A 94 25 4E 52 92 8E 19 57 AA B4 19 3C 56>)
$$ ##END=
$$ 
$$ hash MD5
$$ DC DD 41 89 49 29 2D 95 2B 4E 36 EF AE 4D BB 19
##$RELAX= 
##$RELAX= 
##$RELAX= 
##$RELAX= 
##$RELAX= 
##$RELAX= 
$$ Bruker specific parameters
$$ --------------------------
##$DU= <F:/spectra>
##$EXPNO= 1
##$NAME= <H-F>
##$PROCNO= 1
##$TYPE= <nmr>
##$USER= <she>
##$AMP= (0..31)
100 100 100 100 100 100 100 100 100 100 100 100 100 100 100 100 100 100 
100 100 100 100 100 100 100 100 100 100 100 100 100 100 
##$AQSEQ= 0
##$AQ_mod= 1
##$AUNM= <au_zg>
##$AUTOPOS= <>
##$BF1= 200.13
##$BF2= 200.13
##$BF3= 200.13
##$BF4= 200.13
##$BF5= 200.13
##$BF6= 200.13
##$BF7= 200.13
##$BF8= 200.13
##$BYTORDA= 1
##$CFDGTYP= 0
##$CFRGTYP= 5
##$CHEMSTR= <none>
##$CNST= (0..31)
1 1 145 1 1 1 1 1 1 1 1 1 1 1 1 1 1 1 1 1 1 1 1 1 1 1 1 1 1 1 1 1 
##$CPDPRG= <>
##$CPDPRG1= <>
##$CPDPRG2= <>
##$CPDPRG3= <>
##$CPDPRG4= <mlev>
##$CPDPRG5= <mlev>
##$CPDPRG6= <mlev>
##$CPDPRG7= <mlev>
##$CPDPRG8= <mlev>
##$CPDPRGB= <>
##$CPDPRGT= <>
##$D= (0..31)
0 1.2 0 0 0 0 0 0 0 0.06 0 0.03 0 0 0 0 0.0002 0 0 0 0 0 0 0 0 0 0 0 0 
0 0 0 
##$DATE= 1593408777
##$DBL= (0..7)
120 120 120 120 120 120 120 120 
##$DBP= (0..7)
150 150 150 150 150 150 150 150 
##$DBP07= 0
##$DBPNAM0= <>
##$DBPNAM1= <>
##$DBPNAM2= <>
##$DBPNAM3= <>
##$DBPNAM4= <>
##$DBPNAM5= <>
##$DBPNAM6= <>
##$DBPNAM7= <>
##$DBPOAL= (0..7)
0.5 0.5 0.5 0.5 0.5 0.5 0.5 0.5 
##$DBPOFFS= (0..7)
0 0 0 0 0 0 0 0 
##$DE= 6
##$DECBNUC= <off>
##$DECIM= 24
##$DECNUC= <off>
##$DECSTAT= 4
##$DIGMOD= 1
##$DIGTYP= 9
##$DL= (0..7)
0 120 120 120 120 120 120 120 
##$DP= (0..7)
150 150 150 150 150 150 150 150 
##$DP07= 0
##$DPNAME0= <>
##$DPNAME1= <>
##$DPNAME2= <>
##$DPNAME3= <>
##$DPNAME4= <>
##$DPNAME5= <>
##$DPNAME6= <>
##$DPNAME7= <>
##$DPOAL= (0..7)
0.5 0.5 0.5 0.5 0.5 0.5 0.5 0.5 
##$DPOFFS= (0..7)
0 0 0 0 0 0 0 0 
##$DQDMODE= 0
##$DR= 18
##$DS= 0
##$DSLIST= <SSSSSSSSSSSSSSS>
##$DSPFIRM= 0
$$ [...]
##$SUBNAM2= <"">
##$SUBNAM3= <"">
##$SUBNAM4= <"">
##$SUBNAM5= <"">
##$SUBNAM6= <"">
##$SUBNAM7= <"">
##$SUBNAM8= <"">
##$SUBNAM9= <"">
##$SW= 24.9337058887773
##$SWIBOX= (0..15)
0 0 2 0 0 0 0 0 0 0 0 0 0 0 0 0 
##$SW_h= 4990.01996007984
##$TD= 16384
##$TD0= 1
##$TE= 0
##$TE2= 300
##$TE3= 300
##$TEG= 300
##$TL= (0..7)
0 120 120 120 120 120 120 120 
##$TP= (0..7)
150 150 150 150 150 150 150 150 
##$TP07= 0
##$TPNAME0= <>
##$TPNAME1= <>
##$TPNAME2= <>
##$TPNAME3= <>
##$TPNAME4= <>
##$TPNAME5= <>
##$TPNAME6= <>
##$TPNAME7= <>
##$TPOAL= (0..7)
0.5 0.5 0.5 0.5 0.5 0.5 0.5 0.5 
##$TPOFFS= (0..7)
0 0 0 0 0 0 0 0 
##$TUNHIN= 0
##$TUNHOUT= 0
##$TUNXOUT= 0
##$USERA1= <user>
##$USERA2= <user>
##$USERA3= <user>
##$USERA4= <user>
##$USERA5= <user>
##$V9= 5
##$VALIST= <valist>
##$VCLIST= <CCCCCCCCCCCCCCC>
##$VD= 0
##$VDLIST= <DDDDDDDDDDDDDDD>
##$VPLIST= <PPPPPPPPPPPPPPP>
##$VTLIST= <TTTTTTTTTTTTTTT>
##$WBST= 1024
##$WBSW= 4
##$XGAIN= (0..3)
0 0 0 0 
##$XL= 0
##$YL= 0
##$YMAX_a= 146024
##$YMIN_a= -128317
##$ZGOPTNS= <>
##$ZL1= 120
##$ZL2= 120
##$ZL3= 120
##$ZL4= 120
##$ABSF1= 10
##$ABSF2= 0
##$ABSG= 5
##$ABSL= 3
##$ALPHA= 0
##$AQORDER= 0
##$ASSFAC= 0
##$ASSFACI= 0
##$ASSFACX= 0
##$ASSWID= 0
##$AUNMP= <proc_1d>
##$AZFE= 0.1
##$AZFW= 0.1
##$BCFW= 1
##$BC_mod= 2
##$BYTORDP= 1
##$COROFFS= 0
##$CY= 11.3945322036743
##$DATMOD= 1
##$DC= 2
##$DFILT= <>
##$DTYPP= 0
##$F1P= 16.9975609425685
##$F2P= -3.02152046262296
##$FCOR= 0.5
##$FTSIZE= 0
##$FT_mod= 4
##$GAMMA= 1
##$GB= 0.15
##$INTBC= 1
##$INTSCL= 1
##$ISEN= 128
##$LB= 0.24
##$LEV0= 0
##$LPBIN= 0
##$MAXI= 10000
##$MC2= 0
##$MEAN= 0
##$ME_mod= 0
##$MI= 1.114404
##$NCOEF= 0
##$NC_proc= 0
##$NLEV= 6
##$NOISF1= 3.799351
##$NOISF2= 2.8
##$NSP= 1
##$NTH_PI= 0
##$NZP= 0
##$OFFSET= 15.70392
##$PC= 1
##$PHC0= -9877.686
##$PHC1= 20.80087
##$PH_mod= 1
##$PKNL= yes
##$PPARMOD= 0
##$PSCAL= 0
##$PSIGN= 0
##$REVERSE= no
##$SF= 200.130013532006
##$SI= 16384
##$SIGF1= 3
##$SIGF2= 2
##$SINO= 400
##$SIOLD= 16384
##$SREGLST= <1H.CDCl3>
##$SSB= 0
##$STSI= 0
##$STSR= 0
##$SW_p= 3612.71676300578
##$SYMM= 0
##$S_DEV= 0
##$TDeff= 0
##$TDoff= 0
##$TI= <>
##$TILT= no
##$TM1= 0
##$TM2= 0
##$TOPLEV= 0
##$USERP1= <user>
##$USERP2= <user>
##$USERP3= <user>
##$USERP4= <user>
##$USERP5= <user>
##$WDW= 1
##$XDIM= 8192
##$YMAX_p= 0
##$YMIN_p= 0
$$ End of Bruker specific parameters
$$ ---------------------------------
##NTUPLES= NMR FID
##VAR_NAME=  TIME,          FID/REAL,        FID/IMAG
##SYMBOL=    X,             R,               I
##VAR_TYPE=  INDEPENDENT,   DEPENDENT,       DEPENDENT
##VAR_FORM=  AFFN,          ASDF,            ASDF
##VAR_DIM=   8192,          8192,            8192
##UNITS=     SECONDS,       ARBITRARY UNITS, ARBITRARY UNITS
##FACTOR=    0.0002004,     1,               1
##FIRST=     0,             0,               0
##LAST=      1.6414764,     0,               0
##MIN=       0,             -128317,         0
##MAX=       1.6414764,     146024,          0
$$ Real data points
##PAGE= N=1
##DATA TABLE= (X++(R..R)), XYDATA
$$ [...]
725A8941n424j1752j2653p598J292R521J3024J0371K850n930j1727j2071o801
738a7957J665R289J2491R902K704n847j1624j1924o562J979R501J2388R441K148
752A7594o116j1399j1416o188K066R459J2335R334J762o608j1633j1032n376K718
766a4500R446J1711Q622J396o502j1264j0659n151K839R494J1602Q245R32o767
780I444j1022j0163m674K964R279J1315Q004P67o850j1072j0007m292L381R421
794c505J1073P521L17o985j0897r652l898L687R486J0811P003j28p150j0678r161
809a2156l404L943R330J0321O564l14p042j0426q946l187M097R360J0133O206
823A4479o21p119j0285q652k881M313R392R967N854j010p328j0135q226k416M547
$$ y = [18941, 13517, 1765, -10888, -18486, -17194, -7673, 5351, 15722, 18572, 12642, 915, -11156, -17957, -16292, -7003, 5488, 15390, 18094, 12247, 623, -11301, -17863, -15884, -6383, 6005, 15446, 17594, 11478, 79, -11337, -17525, -15459, -6000, 6335, 15669, 17431, 10823, -810, -11842, -17218, -14500, -5054, 6657, 15279, 16675, 10173, -1091, -11750, -16901, -14062, -4568, 7034, 15279, 16211, 9444, -1578, -11741, -16415, -13451, -4172, 7143, 15147, 15914, 9064, -2008, -12015, -16307, -12926, -3505, 7568, 15089, 15406, 8421, -2476, -12128, -16026, -12339, -2853, 7958, 14961, 14833, 7683, -2995, -12156, -15560, -11617, -2287, 8034, 14598, 14284, 7242, -3184, -12130, -15317, -11220, -1860, 8273, 14479, 13858, 6739, -3546, -12198, -15079, -10766, -1374, 8593, 14447, 13437, 6109, -4026, -12252, -14668, -10121]
838a0121R273R604N477j242p398j0031p886j972M888R163R107M924j456p180r639
853d489p626j880M825R167R095M713j839p423r456p153j484M884Q950Q854M562
868A3700j981p572r536o881r82N311Q897Q355L986k237p428r132o563q39N306
883g596Q886Q216L675k629p556q825o014m84N247Q521P912L548k588p520q803
898f010n918k28N513Q569P638L121k886p467q505n625n3N584Q523P479K788l205
914I318p549q247n119L12N547Q199P089K622l198p435q112n002N42N740Q126O739
930I572K215l309p231p825m792N64N727Q151O657J974l602p335p616m381Q96N741
946d594P893O368J789l692p363p501m069J252N930P677N869J389l713p072p149
$$ y = [-10121, -848, 8756, 14233, 12991, 5593, -4438, -12324, -14296, -9408, -245, 8862, 13786, 12330, 5150, -4489, -12115, -13995, -9170, -3, 9092, 13805, 11966, 4543, -4913, -12066, -13550, -8666, 284, 9138, 13700, 11719, 4147, -5389, -12270, -13252, -7941, 956, 9311, 13297, 11060, 3632, -5500, -12063, -12902, -7596, 1290, 9506, 13181, 10552, 2996, -5829, -11843, -12327, -7080, 1441, 9353, 12901, 10313, 2793, -6010, -11928, -12156, -6643, 1926, 9564, 12685, 9799, 2332, -6173, -11798, -11851, -6267, 2256, 9735, 12523, 9318, 1769, -6478, -11597, -11285, -5738, 2461, 9550, 12172, 8974, 1539, -6573, -11575, -11033, -5293, 2833, 9572, 11787, 8478, 1247, -6578, -11370, -10806, -5079, 3072, 9729, 11703, 8101, 766, -6850, -11231, -10335, -4594, 3299, 9667, 11456, 7764, 401, -7100, -11169, -9917, -3987, 3690, 9559, 10948, 7235, 163, -6986]
961f986l927J263N878P642N789J177l962p128o947l542J543N828P405N517J036
976A0586l993p121o847l325J797O011P279N153O46m125o943o518l048J911N958
991b579P133M975M07m327o894o215k649K136N808O790M686L73m197o816o190k592
1007a0151K297O001O795M399qm395o650n830k322K359N904O686M263k23m566o644
1023b085n572j919K567N799O315L965k89m446o539n456j807K717N890O189L632
1038H961n78m479o237n154j682K626N751O138L653o95m663o330m991j349K929
1053f100N721N866L299q51m615o173m801j178L046N754N690K952j107m583n882
1068b962m485j030K937N573N586K943j150m682n934m337p52L137N520N284K664
$$ y = [-6986, -10913, -9650, -3772, 3870, 9659, 10836, 6874, -254, -7201, -10743, -9200, -3372, 4033, 9550, 10586, 6593, -528, -7375, -10700, -8903, -2892, 4387, 9540, 10186, 6061, -882, -7400, -10448, -8537, -2579, 4554, 9529, 9936, 5609, -1285, -7500, -10149, -8013, -2205, 4585, 9271, 9644, 5447, -1369, -7559, -10151, -7854, -1853, 4942, 9341, 9333, 4938, -1712, -7542, -9864, -7505, -1601, 5085, 9348, 9125, 4559, -2085, -7657, -9576, -7009, -1210, 5105, 9070, 8781, 4335, -2204, -7660, -9467, -6750, -860, 5329, 8961, 8383, 3904, -2333, -7487, -9169, -6543, -792, 5346, 8999, 8304, 3641, -2689, -7680, -9029, -6100, -379, 5487, 8786, 7935, 3320, -2853, -7654, -8832, -5786, -32, 5658, 8610, 7503, 2920, -2962, -7447, -8477, -5540, 33, 5619, 8562, 7412, 2730, -3204, -7541, -8293, -5156, 364, 5648, 8312]
1083H312j194m561n805m289p09L265N628N267K381j548m676n599l885m50L253
1098d610N428N049K280j611m741n523l667j41L329N252M716K030j575m482n358
1113c624l701k13L409N363M749J829j868m625n208l332L0L393N191M572J746j936
1129E775m714n186l151L24L569N125M240J419k011m523m971l022L59L570N106
1144A909M125J217k189m506m724k735M62L430M871M066J272k153m598m790k699
1159g042P07L679M874L775R43k274m462m596k516P61L681M886L667P16k492m462
1175a55m312k189Q83L551M611L514P60k424m468m364k082J072L691M519L251M95
1191F353k398m261m168k089J002L706M614L272L46k664m403l976j738J244L622
$$ y = [8312, 7118, 2557, -3248, -7537, -8246, -4981, 647, 5914, 8295, 6747, 2071, -3528, -7413, -7863, -4610, 818, 5867, 8147, 6536, 1795, -3728, -7395, -7536, -4207, 1045, 5761, 7791, 6216, 1734, -3624, -7325, -7538, -4129, 1234, 5983, 7812, 5944, 1319, -3889, -7221, -7191, -3798, 1393, 5965, 7711, 5775, 1061, -4125, -7276, -6952, -3383, 1742, 5982, 7401, 5390, 867, -4104, -7126, -6767, -3197, 1909, 6034, 7251, 5062, 556, -4168, -6903, -6441, -3011, 1860, 5926, 7198, 5045, 447, -4343, -7042, -6335, -2656, 2218, 5993, 6936, 4662, 200, -4396, -6912, -6151, -2470, 2416, 6083, 6799, 4307, -155, -4467, -6656, -5773, -2222, 2389, 5903, 6663, 4239, -229, -4593, -6675, -5603, -1912, 2607, 5858, 6353, 3955, -306, -4474, -6563, -5561, -1855, 2759, 6031, 6377, 3713, -690, -4666, -6404, -5160, -1538]
1206a538M374L038K87k623m347l955j618J434L745M234K746L7k605m107l708j560
1222f166J301L662M269K791o0k777m218l571j265J471L603M066K591n4k712m170
1238a239l616j250J676L775M054K340l79k829l987l287j068J614L615L954K307
1253E680m10k912m022l140q45J741L556L714K132l89k811l954l152q60J838L688
1269a46L703J974o56k901l821k911p02J808L590L664J913p00l018l872k772m58
1285e305J999L502L393J683p14k865l750k744m67K045L585L340J528r01k890l573
1301b134k547l69J938L495L337J570r51l053l681k439r4K174L422L058J313r65
1317D074k871l533k444j32K226L528L054J108j214k937l310k131k3K067L330K981
$$ y = [-1538, 2836, 5874, 6161, 3538, -809, -4764, -6382, -4948, -1203, 3031, 5777, 5814, 3209, -898, -4606, -6166, -4865, -1203, 3066, 5857, 5797, 3020, -1198, -4769, -6034, -4563, -960, 3106, 5697, 5643, 2931, -1239, -4855, -6105, -4429, -654, 3400, 5740, 5361, 2532, -1455, -4742, -5810, -4196, -581, 3373, 5680, 5270, 2358, -1664, -4804, -5649, -3908, -352, 3362, 5494, 5105, 2294, -1660, -4812, -5672, -3834, -146, 3557, 5531, 4875, 1974, -1847, -4758, -5460, -3652, -62, 3602, 5515, 4815, 1797, -2075, -4847, -5305, -3306, 196, 3589, 5272, 4558, 1693, -2057, -4801, -5268, -3223, 362, 3702, 5230, 4329, 1439, -2134, -4681, -5050, -3112, 383, 3720, 5290, 4339, 1286, -2395, -4834, -4928, -2754, 668, 3726, 5039, 4074, 1203, -2330, -4774, -4906, -2680, 848, 3902, 5010, 3796, 859, -2451, -4582, -4605, -2538, 792, 3773]
1333C773J187j140l006l422k080J61K257L307K761R64j184k845l285k110J34K290
1349b238L434K805P75j437k972l093j763L04K168L188K685Q22j373k957l165j720
1365d537M35K317L174K464O14j375k831l001j695L63K310L225K497N27j557k939
1381ik869j461N07K255L064K396N35j557k969k927j370P08K420K992K117L22j572
1398B582k754k723j367O42K345L012K161K44j667k844k650j156P58K295K875K075
1414C828K51j636k876k696j103R04K463K829J849P7j701k708k511j090Q62K420
1430h38K866J857j3j859k777k354q38R76K341K610J727L0j700k722k432q85J035
1447b976K447K666J597j40j794k629k239q39J009K403K691J630k54j938k712k113
$$ y = [3773, 4960, 3820, 814, -2608, -4688, -4527, -2270, 1037, 3798, 4762, 3578, 733, -2552, -4662, -4528, -2238, 1196, 4001, 4776, 3339, 367, -2726, -4489, -4185, -2017, 1171, 3856, 4678, 3305, 348, -2817, -4537, -4102, -1785, 1389, 3853, 4467, 3092, 261, -2740, -4435, -4072, -1762, 1463, 3960, 4487, 2930, -9, -2878, -4339, -3832, -1577, 1487, 3883, 4418, 2861, -108, -3035, -4405, -3697, -1277, 1715, 3832, 4154, 2582, -172, -2895, -4262, -3620, -1275, 1737, 3898, 4142, 2475, -369, -3019, -4175, -3417, -1122, 1753, 3828, 4079, 2443, -433, -3129, -4232, -3328, -865, 1964, 3813, 3890, 2189, -519, -3030, -4120, -3258, -838, 2028, 3885, 3872, 2013, -764, -3118, -3956, -2980, -639, 1971, 3698, 3728, 2028, -694, -3126, -4011, -2976, -529, 2137, 3734, 3594, 1800, -829, -3068, -3907, -2898, -495, 2196, 3826, 3572, 1634, -1078, -3191]
1463c191n84J166K331K440J442k18j801k607k124o40J203K436K468J297m07j864
1479A347k443j937n59J111K300K447J383l87j954k572j935l58J274K313K288J221
1495C539m32j880k518j903l55J346K417K276J038o48j946k336j629k88J247K236
1511A64K222J096n89j973k411j658j31J391K220K056R38n78j872k343j665j84
1527c317J408K355K090Q38p73j958k242j462o8J372K227K030Q60p72k017k289
1543a718j402J08J496K155J820O73p33j860k127j443PJ459K236J911O15q87j947
1560C63k072j268J11J425K127J840O38q64j994k151j229K53J589K117J645M47
1576B977q86j869k011j181K10J558K145J677L61j026j925j895r91K96J457J987
$$ y = [-3191, -3775, -2609, -278, 2162, 3604, 3386, 1585, -1022, -3146, -3786, -2583, -147, 2321, 3618, 3211, 1347, -1096, -3033, -3592, -2481, -181, 2266, 3649, 3262, 1308, -1264, -3199, -3557, -2283, 30, 2318, 3539, 3107, 1227, -1291, -3194, -3549, -2203, 214, 2490, 3528, 2880, 934, -1402, -3031, -3319, -2072, 164, 2386, 3482, 2893, 920, -1491, -3149, -3280, -1889, 331, 2387, 3325, 2747, 875, -1468, -3133, -3317, -1909, 446, 2536, 3374, 2601, 643, -1599, -3061, -3129, -1757, 470, 2500, 3360, 2588, 571, -1718, -3120, -3012, -1516, 639, 2459, 3132, 2399, 539, -1588, -3031, -3024, -1565, 671, 2582, 3197, 2310, 363, -1709, -2977, -2866, -1441, 686, 2526, 3164, 2300, 306, -1845, -3074, -2821, -1232, 885, 2530, 2977, 2091, 222, -1789, -2970, -2760, -1202, 943, 2620, 2981, 1955, 30, -1865, -2856, -2560, -1103, 884]
1592H84J596M65r49j936j979j033L86J612K024J482K80j003j867j853r91L73J580
1609i29K044J499K27j139j919j757q05M72J527J867J398K46j040j893j787q29
1625b818N31J623J885J268R0j065j782j649p88M54J542J926J352Q6j189j887j644
1642b065o24O08J544J793J219O8j139j832j654o38O83J635J779J090p7j159j714
1659d83j495n99N92J545J802J144p6j244j798j449m60P06J525J652J035n9j160
1676A178j753j499n00P39J640J704R42k37j233j678j351l95P25J553J632R53k08
1693B212j299j719j291k69Q16J486J532Q33j95j178j669j332l42Q28J591J590
1709A594P69l47j282j587j186k37P94J509J537P87l41j316j647j153j28R10J493
$$ y = [884, 2480, 2945, 1996, 60, -1919, -2952, -2566, -954, 1070, 2552, 2832, 1829, -38, -1891, -2882, -2509, -929, 1115, 2614, 2841, 1702, -217, -1974, -2779, -2307, -780, 1087, 2485, 2731, 1691, -202, -1989, -2818, -2287, -664, 1221, 2489, 2579, 1514, -268, -1917, -2705, -2251, -709, 1217, 2569, 2655, 1466, -421, -2065, -2689, -2081, -537, 1256, 2475, 2543, 1404, -428, -2082, -2720, -2037, -402, 1377, 2467, 2390, 1231, -483, -1978, -2577, -1985, -440, 1362, 2506, 2430, 1186, -612, -2061, -2521, -1815, -290, 1362, 2397, 2338, 1178, -575, -2074, -2574, -1835, -195, 1509, 2451, 2214, 981, -697, -2048, -2443, -1718, -165, 1467, 2420, 2212, 913, -806, -2097, -2366, -1550, -64, 1468, 2301, 2106, 928, -741, -2073, -2415, -1587, 4, 1594, 2363, 2016, 734, -853, -2039, -2276, -1482, 27, 1564, 2351, 2010, 694, -953, -2106, -2234, -1324, 169]
1726A69J403O66l60j225j551j151j83R20J541J418O06m56j283j489j014j08Q31
1743a266J456J413O56m23j330j591j018JR81J485J279N00m78j236j476r89k3R51
1761a108J510J301M42n53j311j386q48L1R09J403J243M79n07j301j473q47J12
1778a904J004J420J148L55n55j208j386q59P3J006J480J183L18o79j318j317p02
1795a941J94R92J344J084L13o15j302j339o95K41J051J345R97K33o45j218j259
1812a220o78J87J031J368J055K06p56j297j218n71K86J010J297R73J91o85j289
1829a10j243n80L58J099J316Q65O6p36j226j109n23L20J048J272Q86P9p75j246
1847b39j107m54L84J012J217Q46Q4p37j257j128m72M21J129J225P76m1q05j188
$$ y = [169, 1572, 2238, 1878, 653, -898, -2049, -2232, -1312, 229, 1647, 2253, 1797, 514, -975, -1989, -2097, -1266, 190, 1603, 2259, 1836, 506, -1085, -2103, -2102, -1121, 364, 1643, 2143, 1665, 429, -1047, -2036, -2059, -1108, 402, 1703, 2145, 1592, 281, -1105, -1953, -1922, -1013, 390, 1633, 2112, 1605, 304, -1169, -2016, -1904, -900, 520, 1668, 2023, 1468, 260, -1126, -1985, -1912, -906, 574, 1757, 2075, 1396, 78, -1239, -1941, -1747, -755, 589, 1673, 1986, 1371, 69, -1270, -1965, -1724, -673, 672, 1669, 1902, 1257, 39, -1220, -1898, -1711, -680, 688, 1743, 1949, 1193, -104, -1322, -1893, -1607, -597, 700, 1673, 1864, 1179, -110, -1353, -1933, -1575, -476, 840, 1705, 1771, 1035, -191, -1300, -1823, -1503, -455, 817, 1703, 1782, 1007, -239, -1346, -1800, -1416, -404, 813, 1659, 1743, 1006, -251, -1379, -1851, -1430, -301, 924, 1700, 1659, 854, -334]
1865c34j031l93M21J048J221P64m7q45j229j005k88M87J039J108O95n5p71j178
1883c93r84l49M91J081J132O61j09q39j117r38l08M53J051J163O87j22q89j203
1901e32r16k00N67J040J069N64j53q13j133r01k27N68J084J056N32k32q56j086
1919e69q04j67N21J015J040N55k08q78j126q17j18N96J036R92M77k34q40j104
1937f33p83j57O27J093R96M31l28r10j024o89n7N87R96R42M32l08q69j061o93
1956a408k4O60J002Q75L67l04q49j016o82l5O15J059Q98L36l68q96r88o05J2O50
1976g01R76Q75L32l81r12j004o00Q7P13R73P79K49l90q53r27n65N1O83R87P79
1996A151K40m14q81r18n06R0O62R46P85K30m15q98r40m95J48P22R48P06J53m27
$$ y = [-334, -1365, -1758, -1337, -289, 932, 1696, 1649, 804, -425, -1430, -1718, -1231, -192, 916, 1611, 1556, 785, -393, -1377, -1726, -1235, -154, 978, 1639, 1530, 691, -426, -1364, -1672, -1219, -168, 995, 1682, 1560, 671, -532, -1448, -1648, -1081, -41, 1028, 1592, 1439, 626, -507, -1408, -1635, -1067, 17, 1073, 1605, 1373, 517, -569, -1373, -1540, -1019, -4, 1036, 1591, 1383, 505, -621, -1438, -1556, -960, 76, 1068, 1545, 1311, 471, -633, -1416, -1573, -946, 147, 1143, 1574, 1246, 336, -688, -1377, -1434, -847, 149, 1091, 1523, 1215, 346, -715, -1408, -1432, -772, 230, 1105, 1472, 1168, 319, -697, -1379, -1414, -799, 260, 1158, 1494, 1126, 230, -758, -1363, -1351, -701, 275, 1150, 1482, 1101, 189, -815, -1415, -1328, -615, 358, 1137, 1386, 996, 143, -784, -1349, -1298, -615, 372, 1151, 1391, 977, 96, -822, -1328, -1238, -576, 370, 1155, 1385, 970, 72, -868, -1363, -1215, -493, 455, 1161, 1314, 887]
2016H87q43q77m96J38P10R56P15J28m93q64q43m07J82O99Q62O78J29m26q54q59
2036h78m13J85P31Q99O20J04m85q50q08l84J99P18R06O33N2n35q55p76l13K57
2056i93P16Q28N82L1m87q35p61l34K56P53Q48N55j3n30q14p17k96K69P20Q40N45
2077A163j7n41q45p11k46L05P28P98N07l1n62q24p02k13L46P40P87M54j01n64
2097D71p73o31j91L08P13P74M58q0n80q17o26j59L56P13P43M14r9n67p88o07j68
2118a136L88P29P33L83j39n86p65n77j12L79P13P20L75j65n98p72n44p5M03O99
2138E3O59L39j56n67p39n41r4L97P16O82L16j94n84p33n18p0M26O97O66L02k18
2159H39o12p27m82j4M42O95O13K64k24n81p00m80oM39P06O10K30k46n94o78m21
$$ y = [887, 44, -833, -1329, -1191, -481, 475, 1190, 1318, 825, -39, -882, -1289, -1107, -408, 454, 1132, 1261, 835, -19, -878, -1291, -1106, -375, 524, 1144, 1248, 763, -87, -895, -1279, -1080, -362, 544, 1177, 1229, 694, -161, -937, -1250, -993, -277, 551, 1133, 1164, 677, -158, -919, -1253, -997, -244, 604, 1159, 1146, 616, -198, -915, -1211, -942, -222, 618, 1163, 1146, 605, -240, -951, -1197, -892, -164, 634, 1141, 1110, 548, -276, -978, -1191, -845, -105, 682, 1136, 1035, 471, -302, -933, -1124, -816, -103, 671, 1129, 1049, 469, -348, -974, -1133, -777, -64, 679, 1093, 994, 427, -361, -968, -1136, -748, -19, 714, 1097, 958, 372, -393, -970, -1082, -703, 10, 730, 1105, 940, 342, -430, -974, -1049, -646, 53, 712, 1051, 895, 328, -411, -952, -1046, -649, 67, 749, 1065, 871, 287, -446, -964, -1034, -608, 89, 755, 1057, 839, 227, -500, -982, -996, -554, 141, 754, 1018, 794, 213, -487, -967, -973, -534, 172, 782, 1012, 766, 172, -506, -927]
2180i27j7M37O72O02K42k43n95p01m36M8M64O79N77J88k52o21o70m02O1M82O82
2201B70N40J57k97o08o04l60N5M64O40N33J61k97o10o30l42J01M73O47M89J34
2221I16k93n94o27l36R2M97O55N07R5l39o07o00k91J33M91O49M68P1l47o03n75
2242f38k58J62M99N92M28P1l24n95n54k61J41M95O17M33M8l63n80n49k33J49N05
2263b15O00M22M0l66n94n53k20J96N29N86L78Jl64n88n06k11K08N20N77L59k6
2284G73l89n67m62j78K09M88N31L84l1l68n64m96j58K27N09N55L32l8l88n70m72
2305f73j60K36N25N56L17o9m13n56m41j25K54N10N17L11p8m10n66m18r9K63N13
2326fM77K88q2l92n30m11j26K56N09N23K65q9m36n38l94p6K86M96M93K36j02m34
$$ y = [-927, -944, -507, 165, 767, 1009, 766, 171, -530, -966, -918, -454, 225, 802, 990, 738, 117, -553, -955, -894, -412, 270, 810, 967, 670, 62, -542, -902, -847, -383, 257, 790, 951, 654, 44, -586, -928, -827, -354, 293, 782, 916, 623, 29, -598, -934, -842, -345, 310, 817, 912, 573, -34, -634, -925, -792, -301, 348, 816, 887, 540, -63, -638, -896, -734, -235, 357, 785, 856, 532, -63, -617, -878, -737, -242, 375, 808, 856, 493, -87, -636, -869, -720, -215, 385, 807, 847, 481, -113, -666, -886, -690, -161, 425, 803, 804, 440, -148, -654, -865, -657, -137, 440, 799, 773, 384, -183, -645, -823, -614, -126, 405, 789, 758, 390, -174, -670, -828, -601, -92, 463, 795, 757, 369, -201, -673, -833, -597, -72, 484, 801, 732, 319, -237, -678, -803, -549, -39, 478, 789, 711, 301, -265, -683, -782, -519, -6, 471, 759, 677, 285, -245, -656, -782, -526, -17, 506, 771, 682, 246, -292, -686, -762, -476, 20, 513, 749, 647, 213]
2348B13n33l88m9L10N14M56K11j33m06m93l68n9L02M97M71K04j49m31n03l41p
2369f82K88M76M52K04j29m39n05l38k8L28N14M25J73j84m29m87l17mL31M81M31
2390E61J50j82m26m78l04N1L08M56M02J69j81m26m86k88J6L52M76M03J01j85m21
2411F8m54k74K1L34M67M18J21k37m26m60k43P3L32M48L67J13k05m21m60k42O7
2432e93L66M58L43O5k12m09m13k29M3L38M72L52P8k51m37m31j98R2L65M39L30
2453E68M7k27m22m11k05R5L58M53L13K7k31m15l99j90J20L45M30L16M3k60m53
2474i8l60j64J27L53M06K96L4k60m05l83j95J44L86M47K52j7k71m13l39j36J55
2495d41L35M08K74j3k71m01l75j15J65L56L87K39k0k45l95l58j39J69L63M10K33
$$ y = [213, -320, -708, -757, -447, 67, 523, 734, 601, 195, -298, -666, -725, -423, 74, 545, 749, 600, 169, -334, -675, -682, -394, 82, 534, 738, 609, 170, -335, -673, -701, -373, 141, 566, 739, 555, 126, -361, -678, -682, -351, 130, 561, 711, 529, 103, -375, -679, -628, -320, 136, 538, 707, 526, 100, -386, -674, -658, -306, 170, 573, 674, 489, 68, -386, -660, -639, -305, 162, 580, 701, 464, 38, -422, -665, -592, -260, 188, 555, 668, 463, 42, -418, -660, -593, -227, 231, 574, 639, 427, 18, -395, -624, -581, -243, 229, 581, 659, 408, -29, -460, -658, -566, -201, 238, 568, 615, 388, -34, -445, -650, -555, -197, 256, 569, 596, 365, -50, -449, -639, -519, -174, 256, 572, 615, 355, -98, -458, -622, -495, -142, 264, 560, 594, 334, -71, -454, -649, -505, -119, 328, 580, 563, 292, -121, -460, -596, -441, -106, 302, 576, 563, 292, -109, -484, -599, -434, -78, 309, 548, 528, 283, -112, -470, -609, -440, -77, 333, 566]
2516E66m5l00l93l07r9J48L66L67K57l7k90m24l30p8K20L64L55K03n5k72l88l11
2538d83q1J81L62L69K07q4k80l72k97o6J81L35L68K15n5l05l98k97m2K07L66L48
2560C79J57q0k84l65k87o2K17L47L50J93j12l28l52k58j4K01L29L27J63q5k98
2581A38l79k49l8K14L65L16J39j08k66l46k71l7K19L69L52J26j33l27l59k07K0
2602d62K30L03L04J40j20l01l52k28OK53L38K84R0j30k84l11k18J1K01L32L16
2623D02J02j42l11l40j84K3K32L19K84J10j26l19l35k20L9K77L38K73L9j66k79
2644A6k93j74J7K28L24K87Q1j73l13l03j61O4K38K96K37Q4j44k81l26j73L8K72
2666a59L27K43M1j53l05k88j39L5K34L33K66M7k03l23k85j29Q9K50L04J89M4j67
$$ y = [566, 521, 221, -172, -479, -578, -430, -64, 303, 560, 523, 233, -191, -521, -599, -379, -15, 340, 543, 488, 216, -172, -483, -564, -383, -21, 348, 555, 471, 191, -181, -478, -544, -363, -28, 340, 555, 500, 195, -203, -500, -542, -335, 31, 379, 536, 456, 172, -193, -480, -542, -325, 22, 372, 565, 453, 125, -227, -485, -499, -298, 31, 358, 521, 436, 138, -241, -490, -528, -314, 51, 367, 506, 398, 132, -214, -485, -522, -303, 66, 418, 544, 411, 84, -275, -482, -462, -232, 71, 375, 515, 395, 94, -258, -486, -480, -227, 111, 395, 485, 355, 71, -240, -458, -447, -246, 86, 402, 504, 362, 51, -289, -473, -450, -218, 101, 385, 495, 369, 50, -285, -505, -466, -189, 149, 422, 461, 295, 16, -277, -451, -434, -206, 118, 405, 486, 313, 0, -303, -464, -400, -162, 134, 371, 455, 311, 30, -296, -469, -431, -159, 168, 411, 452, 299, -6, -294, -433, -398, -164, 169, 435, 482, 279, -44, -329, -458, -369, -119, 185, 374, 418, 251]
2688B51k71k99j42Q4K57L20K17jj84k91k50j42Q2K38L03K39K6k07l15k69r5J28
2710c21K32K94J73K1j75k81k78j17R7K83L01J88k2k25k61k32q5J01K37K68K03
2731D01Qk05k93k53p5J27K61K60J47oj92k72k48r5J18K76K99J56n1k19k78j95
2753c29o7J22K34K59J80l2k11l01k28l9J47K81K20J28m5j87k50k07p8J34K69K67
2775B67J38n3k30k63j96l5J46K38K37J25l0k23k76k11j2J64K50K53P0o7j97k31
2797a36j87m8J41K59K47J16q6k39k57j64MJ46K38K18J06l8k39k67j78JJ63K68
2819F8K14O4q8j98k34j73jJ58K48K41P7j08k32k44j19K3J55K15J95Q6o3k20k54
2842a90j65OJ97K42K01N6j21k02k07j43RJ61K30K15R1j51k18k57j01M9J71K32
$$ y = [251, -20, -319, -461, -377, -120, 200, 417, 416, 232, -59, -309, -451, -369, -131, 172, 411, 437, 230, -85, -354, -449, -321, -89, 205, 378, 399, 224, -57, -335, -452, -355, -72, 229, 417, 395, 170, -91, -323, -408, -307, -70, 198, 401, 409, 204, -89, -342, -417, -290, -29, 231, 378, 372, 180, -92, -340, -435, -317, -41, 258, 414, 363, 144, -134, -329, -396, -274, -40, 219, 399, 367, 156, -145, -373, -412, -265, 16, 236, 364, 319, 132, -118, -325, -403, -269, 0, 267, 405, 352, 122, -141, -337, -372, -226, 12, 249, 374, 344, 121, -155, -366, -378, -214, 36, 289, 359, 292, 95, -136, -323, -371, -230, 29, 276, 392, 306, 67, -190, -354, -350, -204, 34, 252, 358, 320, 81, -186, -364, -363, -200, 68, 282, 346, 258, 60, -174, -347, -348, -190, 58, 299, 376, 268, 36, -208, -327, -304, -149, 66, 261, 347, 284, 64, -190, -355, -349, -152, 90, 291, 347, 226, 24, -183, -326, -317, -156, 74, 289, 380, 229, 11, -246, -347, -298, -127, 105]
2864A05J62N4r8j96k60j18M5J93K38J66K3j26k06j96j10K5J65K21J95O7j41k34
2886b6k05j17O1J92K18J54K9j01k32j88j14N1J93K44J57lj45k09j76q9O0J52K24
2909A30J72K6j58k20j90q6Q5J80J97J40Mj10k01k06r1N5J97K34J44nj61k08j62
2932b34q0Q4J68K08J34Jj42k10k03l4R3J84J87J07Nj29j92j88n9O0J97K11J38
2955C06l8j59j98j56m5R3J60J94J22Jj42k22j86m4J12K07J72J05m0j58j66j52
2977b34o4J00K00J90Q1n1j44j88j36k5R3J60J80J03j7j62j92j59k7J14J99J73
2999A94Q8p3j34j74j34l7P8K00J97R0o3j69j96j08nJ05J76J39Q4m0j49j89j38
3022b58RJ05J92J46O6o9j37j64j18j7R1J96J55R8q2j86j71j13J0J29J70J35M8
$$ y = [105, 267, 321, 223, 27, -233, -351, -306, -113, 125, 291, 314, 188, -18, -214, -324, -299, -134, 87, 282, 349, 208, -26, -231, -348, -287, -95, 123, 277, 306, 205, -27, -215, -329, -278, -85, 159, 316, 313, 168, -41, -217, -306, -246, -94, 130, 302, 328, 170, -50, -240, -326, -241, -61, 136, 276, 280, 170, -31, -237, -328, -273, -76, 158, 302, 297, 136, -72, -234, -314, -230, -62, 146, 280, 281, 139, -71, -274, -308, -215, -31, 156, 263, 268, 139, -53, -241, -300, -240, -43, 168, 306, 268, 109, -89, -245, -290, -197, -37, 157, 279, 280, 138, -84, -270, -314, -202, 5, 177, 282, 242, 84, -82, -234, -298, -198, 2, 192, 273, 222, 78, -110, -246, -271, -178, -18, 162, 265, 248, 86, -106, -265, -292, -178, 21, 194, 282, 209, 75, -99, -233, -270, -192, 8, 205, 295, 232, 63, -133, -241, -246, -141, 35, 174, 258, 218, 69, -120, -258, -249, -144, 48, 194, 260, 191, 54, -110, -228, -245, -154, 42, 197, 295, 213, 27, -144, -257, -247, -118, 52, 187, 235]
3045B35l3j63j91j19K1J26J85J40M4q6j50j34j03pJ02J84J47O7r0j53j68q5J7
3068b14J17J66J19M9m5j70j64j00J2J22J95J29L1r0j63j52n7RJ19J53J37N7j00
3091A60j74j51p6K6J46J67R4M0p2j45j67r5K2J35J87J17Or1j59j26p6L0J15J67
3115H0J24L5r2j73j69o8O7J56J42R2J2q7j42j35p2K3J55J71J03pq6j67j22n8N3
3140a65J27J35J24lj05j55j43n7P7J41J56Q2l3q2j31j28o3M7J33J60J10l5j11
3163H1j54j14k1N1J35J37Q3Jj06j44j43l1P8J47J29Q3l6r7j38j08n7P5J33J56
3187A40P6k2j15j54j05jP2J27J20O2j0j04j53j19j8P6J46J27N6l8j04j35r4k5
3211a95O0J50J40N9l8j27j43q7j9P8J28J28N2k9j07j49r7rR1J39J30L9n0j13j24
$$ y = [235, 202, 39, -152, -271, -250, -124, 61, 201, 245, 159, 9, -125, -228, -235, -133, 51, 198, 265, 175, 22, -146, -231, -214, -97, 69, 188, 237, 192, 22, -142, -242, -230, -108, 87, 216, 247, 157, -6, -158, -215, -206, -87, 66, 203, 260, 160, -14, -165, -241, -215, -69, 98, 192, 232, 160, 15, -152, -247, -225, -90, 97, 214, 220, 129, -30, -156, -232, -202, -87, 80, 204, 239, 147, -26, -195, -263, -196, -40, 102, 194, 206, 119, -23, -158, -230, -207, -52, 119, 222, 215, 129, -38, -160, -218, -165, -38, 97, 221, 218, 113, -42, -185, -242, -165, -24, 132, 214, 181, 99, -32, -160, -223, -176, -43, 117, 227, 192, 81, -73, -187, -208, -157, -22, 115, 198, 199, 93, -51, -194, -225, -147, 0, 129, 212, 176, 79, -59, -167, -224, -149, -16, 140, 216, 194, 79, -75, -180, -181, -109, 18, 138, 200, 190, 86, -67, -186, -204, -128, 18, 145, 201, 163, 59, -76, -170, -195, -135, 15, 155, 214, 176, 49, -94, -181, -200, -122, 6, 134, 186, 157, 50, -99, -196, -205, -114, 25, 155, 194, 144, 31, -93]
3236i3p2j0O9J23J27N8n9j17j30q4lR2J39R7M9l6j14j25r9KJ07J36J05K0n8j04
3262B0j15p4jR0J36J08L2o6j25j29n1J2J06J04R7K0m8j09j21p4J0R5J25J12Qo2
3288A00j11j23l6LJ08J14J07K4p8j13j17n4K7J01J19P9J4n9j08j14m3K2J05J17
3312H4Q2%q4q3j08m9L1Q8J13Q2J4p1j29r5n0M3R8J08P3Nn4j30q9m5K5J02J34N9
3340A54lr0j10o2l9M7P7R8Q0pp0j16q5l5M3J01J08O2j2p3j00q9l3L7J03J09P4
3367A69k2q3j00q7k6M7J13Q8O4j1q6j16q9j0O8R3Q3M8j5o9j13p6j1M9Q5R9N6k0
3395A28p9j16o9j4O1R7O8N0j1p4j01q5j1Q0Q6R7L6k8r4q4p2mN9R9Q3N1l4r8q7
3424f6o3PN7J02P7K3k6p5r4o5QN8Q7R2K2l1q4r8n4%N5Q2Q8K9k3r7r4n3RO5J04
$$ y = [-93, -165, -175, -106, 17, 144, 202, 143, 26, -104, -188, -191, -99, 40, 137, 186, 150, 36, -89, -188, -186, -79, 57, 162, 182, 124, 20, -95, -169, -170, -80, 56, 164, 196, 130, 5, -124, -175, -163, -57, 47, 144, 164, 116, 7, -114, -188, -178, -83, 42, 154, 162, 100, -11, -134, -170, -167, -59, 55, 162, 186, 108, -5, -122, -176, -149, -48, 71, 150, 164, 105, -3, -117, -160, -138, -33, 84, 166, 166, 82, -1, -109, -158, -127, -39, 74, 156, 170, 99, -30, -125, -175, -132, -34, 74, 147, 152, 98, -32, -121, -166, -141, -39, 95, 154, 151, 61, -49, -111, -150, -103, -26, 72, 152, 145, 75, -41, -126, -161, -118, -17, 91, 153, 141, 68, -32, -121, -154, -117, -14, 95, 169, 147, 64, -36, -123, -149, -102, 11, 99, 163, 152, 66, -50, -139, -149, -81, 12, 95, 143, 128, 59, -54, -130, -141, -92, -7, 92, 148, 128, 49, -67, -136, -150, -89, 8, 76, 126, 115, 41, -60, -145, -156, -76, 10, 107, 143, 115, 21, -63, -135, -139, -80, 19, 102, 153, 119, 21, -66, -129, -122, -65, 37, 114, 137, 111, 36, -58, -123, -115, -57, 30, 122, 144, 113, 29, -69, -123, -123, -68, 14, 102, 131, 108, 11, -83, -136, -127, -62, 42]
3455D2O3M2m9q4r7n3J2P3R2O7K0m2o8q4n8MO8Q4R1K2m7q6q8n1J7O6R3O9Lk8r9
3486fq0l2jQ2R4O9Km5p7r4l0J8O8Q0O8K4m7j00p9l9L0O0R3O1%n6p8p7m3K6O7R2
3518E0O7jn3j00p9j0K1P9P4O0Lm5r9o8j6K1P6Q8N5rn3p9o6l3K6Q0Q1N0j0o5o6
3549b1p5l1N1O6Q5N4k4n1q4o6l3M7P9Q8M4j7o5q7o3rL2O8Q2N4k4o0q3n9k0M8Q4
3580A0O7L3pn8q6o8j6M9Q1P1L1k5o2o5o1lN5O4P6K2k0o2p5n7jM1Q1P7K6j4p6p7
3612d9n1j4O1P2O3L1l5n7q0m8j1O7P0O6K7l0p2q2m1RN6P0M9L8m4o7o3m0jN1Q9
3643C4M9J6k7p4o3m0RN3Q7M3J9k6o2q2l7J0N2Q4M6K8m7p1n3n3J9P0N5O2Pm2o2
3674Dp3k2K0N7O5M7Nm4o8o1l0J3N9O5N2Ll8p8m3m8L3O4N9N3J5o4o1o0l2J8P2O7
$$ y = [42, 105, 147, 98, 14, -83, -136, -124, -51, 41, 108, 128, 86, 18, -66, -124, -120, -52, 32, 123, 145, 98, 12, -76, -127, -110, -44, 49, 118, 121, 93, -6, -86, -118, -119, -37, 57, 126, 128, 83, 6, -88, -118, -100, -32, 48, 116, 140, 93, -7, -86, -125, -95, -35, 58, 119, 119, 63, -15, -92, -135, -109, -42, 50, 117, 116, 63, -37, -116, -126, -105, -26, 48, 108, 111, 66, -33, -101, -117, -96, -20, 68, 123, 114, 61, -18, -84, -117, -91, -11, 70, 120, 110, 45, -21, -96, -127, -76, -10, 75, 129, 105, 54, -30, -96, -129, -82, -3, 85, 129, 112, 47, -40, -103, -112, -80, -12, 70, 124, 100, 40, -43, -102, -122, -74, 10, 77, 110, 103, 45, -41, -109, -125, -76, 5, 76, 107, 82, 20, -45, -106, -109, -54, 10, 86, 108, 88, 26, -49, -106, -107, -66, 15, 92, 118, 104, 28, -49, -100, -114, -53, 19, 82, 113, 78, 21, -59, -107, -118, -51, 19, 85, 112, 82, 10, -72, -113, -104, -48, 22, 71, 109, 65, -2, -65, -105, -106, -55, 34, 83, 99, 72, -2, -65, -105, -96, -43, 44, 87, 106, 80, 18, -64, -101, -91, -39, 45, 91, 119, 72, 1, -52, -105, -86, -16, 39, 101, 108, 66, 4, -69, -91, -71, -14, 51, 98, 103, 59, -9, -70, -100, -87, -28, 37, 89, 92, 54, -24, -67, -115, -82, -18, 41, 94, 109, 45, -16, -76, -108, -90, -18, 49]
3706D9M7j9l4n6p9lJ9O4O8K7Om9m7o9j1K1N4P5J8J1m4n7o9j3J5O2Q3K9qm8o3n4
3738g5k2L2O5N7L5qn5p3n3mL2O1O4L4k8l8n6n8%L2O0N5L1j9m2o7l7j1L3N8O0L4
3770I7k1m4o4n2jM0O4N2N%n6o1m6KM2N1P0Nj8n4m6m4mM5N4N5K0k7o1m5m4JM9N1
3804A5M2J3j6m7m5m5MK8N6N9Mj2n0n1m8K7K9N3M8Oj8n5m5l3RL4O2N4mk3m6m4k7
3837f6jN2L3O0J2l1o7k9m6K0M1N5K1L4l4n5m8l4J9L5O3L3J4l7o0k9l7J6L0O7K6
3868E7J1k9n3m9k5J5L9O8K1Ol3n0m3j7J6M4N1M7k8k1n4k3j8J7L1O1K8kj9o2m4
3899e8j1J3M9N8K3j7l0l6m4k1J4N8L6J8Nl7l9m1j6K1N2L2K3J5n2m0n5nM0M6L7
3930C8K0ok5m9l5j2J7M8M2L2j9l5m2l5j2L7K9M8J8kl9m6m2J1K1M8M0J1ol0m6l6
$$ y = [49, 96, 77, 43, -13, -92, -95, -76, -12, 56, 83, 89, 40, -7, -76, -87, -66, -12, 63, 81, 92, 48, -9, -78, -91, -76, -14, 69, 98, 90, 42, -21, -75, -97, -65, 0, 57, 92, 84, 29, -44, -97, -101, -69, -8, 56, 90, 62, 24, -32, -90, -90, -58, 2, 57, 88, 69, 27, -40, -77, -88, -55, 3, 63, 97, 76, 32, -32, -84, -85, -45, 19, 71, 76, 76, 20, -41, -87, -85, -43, 8, 78, 83, 65, 11, -35, -79, -83, -38, 16, 71, 91, 64, 3, -42, -86, -85, -36, 15, 57, 70, 54, 7, -38, -83, -79, -51, 5, 64, 68, 56, 6, -45, -93, -66, -37, 16, 64, 70, 52, -3, -48, -81, -72, -38, 24, 78, 74, 51, 5, -39, -66, -67, -15, 18, 78, 90, 59, -8, -37, -83, -63, -22, 33, 54, 88, 54, -1, -49, -83, -64, -29, 34, 67, 81, 44, -16, -45, -82, -66, -36, 31, 57, 68, 39, -14, -63, -88, -73, -34, 34, 55, 61, 28, -22, -65, -82, -66, -22, 29, 76, 48, 27, -27, -50, -68, -51, -20, 41, 69, 67, 48, -14, -58, -69, -56, -7, 51, 74, 57, 27, -9, -53, -74, -60, -2, 34, 52, 57, 20, -19, -60, -76, -55, -3, 29, 52, 67, 15, -25, -80, -85, -45, 1, 38, 58, 52, 27, -22, -57, -69, -52, -4, 38, 70, 51, 16, -26, -61, -73, -36, -7, 41, 59, 57, 18, -28, -70, -59, -38, 10, 50, 61, 55, 25, -21, -57]
3962e7oJ1O4M3M%n2l6k6j2L3N0K8J4j0l3m2l4kK1N4K5K3k0l0o0j6%J7N3M0J8j9
3995D3m0o0j0J7J9K9L9J5k0l1l5l2jM0M5K7Qk2l2j7l6oL2L3N1Qk2m5m3j3%M6L3
4028B0L6J4k8m5l6k5KL3M0M7j2k2l7l3j0LK6K6L5Pj8l7m3KJM2K4K5J4l2j8m1q
4061d8lL7N5NNk1m5k9RqM8K9K9kk7m8j5k2K3J8L9K7nj7l7l8j9J3L5M3L0pl5k5
4095fl8qJ6K3L0L2nl0l6l2nJ5L2L3K6j4j6m5j9qJ4M1L8J0j7k1l5j3jRJ6N3J1n
4129D5k6l9k5kJ4M0L7KJk5l5k5j5L2K4L7Ojl3m4lj7M1K5K9%rk6m8k1RK9K8K2J8
4164D5k3j1l6k3LJ2L2M2Qj9l1l3j6LK4L1K1J1Ml5l3k3NL3K6K1Mk0k1k6qLNM3J4
4199C2J3k2k4l2k1J3K1L2J8Kj1k0l5k8J1K5M7J1Mk6k4k5llK2K8L0Nj2m2k0j6J5
$$ y = [-57, -63, -52, 12, 55, 59, 59, 7, -29, -55, -67, -34, 16, 44, 58, 48, 15, -27, -61, -63, -42, 12, 37, 60, 40, 10, -50, -66, -66, -49, 4, 44, 62, 43, 3, -57, -67, -50, -31, -2, 37, 52, 32, 1, -34, -66, -67, -27, 18, 45, 53, 31, -1, -18, -54, -60, -28, 5, 56, 64, 42, -3, -46, -59, -59, -13, 20, 56, 70, 42, -3, -39, -64, -62, -29, 11, 58, 46, 24, -13, -46, -56, -53, -27, -1, 34, 41, 23, -14, -57, -55, -54, -12, 12, 37, 51, 19, 1, -40, -48, -51, -14, 41, 46, 51, 30, -15, -44, -35, -43, 5, 34, 63, 61, 34, -14, -29, -51, -28, -10, 29, 56, 51, 34, -3, -41, -60, -47, -12, 31, 61, 54, 19, -6, -44, -52, -36, -13, 17, 49, 44, 14, -22, -54, -59, -44, -12, 21, 47, 33, 17, -28, -47, -55, -41, 0, 38, 48, 31, 10, -25, -38, -39, -30, -14, 39, 50, 45, 19, -20, -45, -47, -33, 7, 44, 46, 47, 22, -13, -38, -53, -21, 3, 40, 46, 45, 12, -32, -35, -52, -11, 14, 43, 43, 34, 8, -40, -61, -52, -23, 5, 27, 45, 22, 11, -25, -48, -45, -33, -1, 41, 49, 30, -1, -34, -50, -47, -23, 8, 29, 40, 44, 9, -24, -47, -42, -9, 17, 38, 42, 22, 1, -25, -33, -30, -25, 18, 32, 45, 23, -1, -33, -54, -41, -20, 12, 30, 32, 21, 1, -34, -62, -51, -26, 21, 32, 36, 10, -14, -39, -42, -45, -23, 5, 35, 40, 28, -14, -34, -50, -35]
4232c5K2L3J3lJl5l9K%K6N4J3j3k2k6k0j0J0L1J6K7Nk5k7l2j4K8J8L1Pppk5j7
4266b0k4J3L0J3K7Ll5j5k4j1KL4J2K6J1l2l4k2nK5J0L8J7j5j0k5j6k4J6L7K2K9
4298E3k2j5k9l2J5RJ5L2J5Ol6k2j3j0PK1L9kOj2l9k4mJ3K4K9RMm1j1k5NJ7J7K4
4333B3OJk3k5k4OJ8K2K2Jj5qj8k0KJ1J5L3J0j2j6k7j1nK5K4JRJ6l2k0l1J7J8J9
4368A2K4Lj7k6j9%pKM0QJ6pl2l6kJ5J0K2J1Pkj9k9qj4L9J5J8Oj8ol5rNRK0K9O
4406C1nm5k3QJ2K2J1Rnj0qkm1J8RM1Moj1mj6rLNK6K7Lj1l2j6k3J4K2J3J9j7%k1
4444hj9qJ2J7K1J6j7j0k0j7j0K1ROJ3Mkj9k4j0J9K5J4J1Lk5rj3k0K2K2J9J6ok1
4479A2k7j5nJ1K7OJ0J5k6j4k2mJ6J5J5PJj7j1j5pkJ9J6RMj3l2qPJ2PJ7J3j7Kl2
$$ y = [-35, -13, 20, 33, 30, 31, -4, -43, -41, -41, -15, 39, 52, 39, 17, -9, -29, -39, -29, 2, 18, 45, 50, 25, -2, -34, -48, -20, -2, 29, 36, 29, 22, -3, -20, -44, -31, -1, 12, 39, 42, 7, -8, -32, -43, -41, -7, 5, 31, 42, 10, -24, -46, -51, -26, -16, 22, 39, 24, 14, -11, -27, -51, -35, 2, 24, 53, 31, 16, -13, -45, -30, -21, -6, 26, 41, 47, 11, -11, -24, -34, -27, -6, 33, 31, 37, 25, -14, -38, -42, -29, -5, 24, 33, 37, -4, -15, -40, -35, -18, -1, 23, 29, 30, 7, -18, -42, -36, -18, 4, 26, 27, 12, 4, -14, -34, -32, -21, -6, 27, 37, 25, 9, -18, -29, -34, -9, 15, 16, 25, 41, 9, -11, -42, -25, -7, 12, 36, 39, 22, -4, -23, -23, -30, -28, 12, 20, 36, 29, -3, -39, -41, -26, -16, 6, 17, 24, 22, 3, -26, -34, -48, -9, 6, 24, 30, 12, 6, -29, -38, -33, -24, -4, 25, 31, 26, -19, -42, -34, -22, 0, 11, 20, 15, 5, -3, -5, -46, -28, -19, 22, 26, 20, 9, 5, -11, -20, -17, -12, 14, 41, 44, 33, 1, -15, -38, -24, -2, 11, 30, 13, 13, -8, -27, -35, -23, -6, 15, 31, 14, 4, -16, -33, -43, -22, -13, -7, 6, 10, 8, -11, -35, -45, -26, -1, 13, 24, 27, 2, -7, -20, -40, -18, 4, 23, 39, 33, 12, -15, -30, -35, -24, 3, 9, 19, 34, 8, -6, -28, -32, -16, -1, 14, 21, 22, 5, -6, -21, -28, -30, -11, 5, 14, 18, 5, -27, -35, -28, -16, -9, 8, 21, 4, 6, -26]
4516b6j0oJ0J6L1qkj1k8%PmL3J7J8ll8rk3QJ8J2J6J1j0ll6noJ6J1K1J3j3j0k6
4552a9LqJ0J6J1J2j5k6j6NmK4K3j1Kjj2rl5K6OJ4K5j2j3mk3QPkLK1QOk9j1plK3
4591gJ7JR%j2k7%oJ4J7RKpj2rmoJ4RJ9Qok3pj2mRJ7K1kj6ok2rJ0NJ7RpOk2j1J3
4634a1j4MK7PLpj6k0%NK4KJjpnnLJQNJ5%mk1qLNRQJ4lkk3j2mRRK4lmj0j0j2qJ1
4680a3JJ6J0lqj4j6JRJ7oOQJ6k4k2KJ4%QJ0lj5jrKKPJ9Pjj6qkrJ2J4KL%nk1qj6
4724c4L1J5QKqpnj7K%MJ6J1j3rkrNJJ5qJ2j3Mj8%mJ6J2rJKKj4rmJ0J4RJ7j3qo
4767aj2OnJ5J9qrJ2j2j4KRPMjnk0J4j8kJ9J0NKJ4k0j7qmJ7JJ4Krj3oj4OOJ5O%
4809G%j4j7PPoJ4J6Jj1j4j0Nj1K0RkQkj5nRj0J9PPJj1Nk2lQlQJ5jj7nnj2NK7q
$$ y = [-26, -36, -42, -32, -16, 15, 7, 5, -6, -34, -34, -27, -31, 2, 19, 37, 34, -4, -13, -36, -28, -10, 2, 18, 29, 19, 16, -20, -25, -31, -15, -4, 17, 30, 17, 7, -19, -16, -24, -14, 2, 13, 25, 10, -16, -32, -27, -31, -7, 16, 5, 7, 6, -6, -15, -50, -24, -18, -4, 21, 9, -4, -8, -31, -23, -16, -18, -15, 6, 14, 20, -9, -20, -27, -30, -7, 10, 11, 20, 20, 8, -19, -19, -25, -11, 6, 15, 17, 10, -2, -11, -15, -21, -7, 2, 21, 29, 23, 0, -7, -19, -23, -14, 3, 24, 22, 6, 0, -22, -31, -21, -16, 1, 10, 3, 9, -13, -24, -11, -25, -21, 6, 13, 16, 9, -7, -27, -27, -22, 2, 4, 5, 4, -3, -8, -13, -10, -9, -1, 4, 19, 19, 15, -6, -14, -11, -6, 3, 11, 25, 22, 20, -3, -15, -19, -10, -1, 23, 20, 16, 6, -4, -16, -24, -13, -12, 4, 14, 11, 3, -11, -27, -26, -17, 0, -6, 0, 8, 24, 0, -22, -20, -6, -6, 2, 12, 9, -6, -7, -16, -14, -12, -5, 14, 21, 20, 4, -4, -6, -15, -3, 11, 13, 16, 16, 11, -10, -18, -34, -3, 12, 20, 22, 14, 7, 2, -15, -13, -13, -9, 7, 18, 5, -4, -6, -15, -10, -9, 6, -2, 10, -3, 1, -17, -17, -21, -5, 7, -2, -1, 1, 3, -11, -20, -24, -14, 0, 9, 26, 13, 5, -1, -13, -7, -12, 3, 22, 14, 5, 17, 5, -9, -7, 2, 9, 13, 12, 7, -13, 1, -17, -19, 0, 10, 15, 17, 31, 11, -6, -14, -18, -1, 0, 14, 16, 7, -6, -12, -26, -20, -14, 1, 7, 7, 7, -7, -24, -17, -10, -16, -2, 14, 15, 4, -10, -20, -15, -26, -6, 3, 1, 9, 7, -8, -13, -4, -14, 5, 12, 19, 20, 9, 14, -8, -11, -3, -6, 2, 17, 16, -1, -6, -11, -23, -18, 9, 1]
4852AL0j6j0j4kj1PkJ6J0rJ6k8lqJ8ljK4j4mQk5MNJJ2lQj1oqkJ4JJ8Pj4rQj3K
4894fJ0qJ5Rlj1j0Mq%K0qJ5j0Jj6j1j%J5jQj4J4j2k9QJ3J5ONpoj8%JJ1PJLJj5
4936a2QqqJ0J7JMnpJqmJ7jkRlmj5j%RmK0Pmj0mj2LQJK0j5nmj1NmLOJ6Kk7lkmP
4984a3QpJ9lpnj6MJ4kJ6KnQj5j3nJ1J1KMKj3Mj1LLM%J9%oj1rrRJ0mJ8moj7kJ1
5028anLJ3Rorj6km%QJ1KJJk4oPPOJ7Lj5Jjj5kR%OJ5mRj2k0JOK1j0J0J6j6j0k0
5072a6J2Qj0J1J4j6Lj9Rj3jK1nJ6j5l%j4JMORJ0Pk3j3oKmJ2k%J5j0nlrJ8J0Ml
5113BmNj2%qMJJ0RqJ2j7j1OOJ4P%j3OKk3J2RJRnlj3j0lJ2mNJ3mjkrj5J9j4MNJ0
5158DlqNj5MK%J4qJ3Jj7lJqJ2K1lk2J8j1k6K2MJ3j0RRj4j0Oj3MJ4NKJ6qj5mrO
$$ y = [1, 31, 15, 5, -9, -11, -22, -15, -17, -1, 9, 0, 16, -12, -15, -23, -5, -8, -9, 15, 1, -3, 5, -20, -16, -11, -10, 2, -1, 7, -4, -10, -18, -20, -6, -5, 13, 20, 6, -3, 5, -8, -6, 4, -4, 11, 20, 17, 6, -4, 0, -8, -8, 12, 4, 19, 9, 10, -6, -17, -18, -18, -3, -4, 4, -10, 4, -8, -37, -29, -16, -1, 5, 10, 3, -3, -21, -21, -20, -9, -2, -1, 2, 3, -12, -4, -12, -20, -10, 7, 8, 12, 7, 0, 1, -7, -11, 6, 5, 3, 12, 9, 5, -10, -11, -11, -2, -6, 14, 21, 17, 7, 3, -9, -6, 2, 3, 23, 8, 3, -1, -12, -7, -11, -8, -2, 14, 16, -11, -14, -16, -20, -13, -5, -12, 7, 4, -3, -8, -24, -20, -6, -8, 8, 10, 5, 13, -2, -15, -20, -9, 2, 4, 8, 10, -3, 1, -10, -7, -4, 0, 0, 19, 19, 13, 2, -7, -16, -7, 3, -1, 17, 13, 7, -10, -12, -1, -6, -3, 10, 19, 13, 4, -12, -14, -18, -18, -10, 1, 3, 4, 5, -19, -25, -18, -11, -5, 12, 15, 0, 1, 0, -15, -17, -8, -8, -2, 13, 9, 18, 6, -14, -13, -7, 14, 4, 14, 30, 14, 4, -16, -4, 4, -6, 5, 19, 3, 6, -13, -4, -17, -18, 3, -2, 14, -1, -4, -4, -18, -17, -13, -7, 2, 12, 19, -4, -17, -23, -21, -25, -13, -15, -15, 0, -10, -15, -18, -27, -9, 1, 5, 2, -2, 3, -9, -9, -17, -13, -12, -2, 7, -1, 11, -6, -17, -11, -5, 9, 16, 16, 3, 9, 11, -12, 0, 9, 10, 19, 14, 11, -2, -12, -15, -3, -7, -2, 11, 7, 6, 4, -5, -20, -1, -15, -11, -6, 4, 1, -7, -2, -17, -13, -11, -11, 3, -5, 8, 9, -8, -11, -10, -18, -6, 15, 12, -10, 8, -3, -29, -7, -3, 10, 0, 9, 18, 4, -6, 0, -13, -9, 5, 10, 12, 28, 20, 5, 1, -8, -2]
5200bOJOKj0Jj3lRRnKkqKknJRlRjqrKJQMLjj%kj7%J6%J6Pj4qJj8JK2pLJ0Rj4j1
5251dmMLJ0jMj6loJ3j1LJ4Pj4nNnj8J0J3KoNmjj0OqPRnJ1j1mM%lJ3pNJOorOkR
5299Gl%jNj2kj0J4OJ0j1J1nKk1MrJ5P%olj3OkJ9j0LJ2j2JpRj1jNj1K5j0oJnKj0
5343a7J2J2j1J0lljJ0j4LJ8j0MOj2pRrJ4mMmOppLk%J4NJ0j5nj5NRpRJj0LMqjj7
5388a8J2MJ4oLj8jooK5j1JNJlpPoJ1KmO%mmkOjJ0J1j6Jj3RLlOmNjJkloKOOJlj1
5438aJM%rpJ8JJnrnJ3j6kJ3jQlk4%MJ4PLLnnLKkjJ5qQj5rJQp%J3jNjqLqrMK2m
5489IMlmjJ%NlnJ2j9lj5%NJ5lJ5nmlmrOKlJ3joj1J0rLKLKJ6nj0pJqJ9kJ1j1Mj0
5537fnJJ3nmJ3NJ0j1k0%J0Mkj2QMmlKMNj3J4q%JqK%kMj1K1j7J4lj1Qj2J1mJ2j9
$$ y = [-2, 4, 5, 11, 13, 3, 4, -9, -12, -3, 6, 1, 3, 1, -7, -5, -7, -12, -11, -2, -5, 4, 3, -5, -14, -12, -11, -3, 1, 4, 3, 2, 2, 0, -17, -17, -1, -1, 15, 22, 8, 0, 1, -17, -16, 6, -1, 2, 12, 21, 7, -4, -8, -4, -1, 9, 8, 12, -4, -7, -13, 0, -11, -8, 6, 13, -1, -6, -1, -6, -24, -14, -1, 1, -5, 0, -4, -5, -15, -9, -17, -10, -1, -6, 5, -6, -10, -6, -6, -9, 4, -3, 2, 3, 9, 3, -6, 0, -2, 7, 4, 4, 3, 8, -4, -6, -16, -2, 4, 14, 3, 14, 9, 11, -10, -6, -15, 0, 7, 7, 1, -2, -15, -9, -11, 8, -2, 1, 13, 1, 2, -5, 4, -7, -8, -3, -14, 11, 1, -5, -4, -9, -7, -17, -5, 7, -4, 6, 3, 0, -1, 9, -5, -2, 16, 6, 10, 16, 4, -3, 6, -3, 11, 7, 11, 7, 13, 6, -1, 2, 0, 0, 14, 19, 29, 14, 9, -6, -1, 8, 1, 10, 11, 1, 4, 8, 0, -1, -18, -6, -2, 12, 6, 9, -9, -10, -16, -22, 3, -8, -7, -2, -1, -4, -11, -4, -10, 1, 3, -1, 5, 5, 1, -3, -5, 1, 0, 10, 21, 5, 6, -7, 2, 5, 2, 8, 4, 9, 8, 9, 7, 4, -2, 0, 6, 12, 13, 10, -1, 0, 4, 4, -5, -12, 6, 7, 8, 3, -6, -11, 2, -14, -16, -3, -4, 4, 1, -23, -23, -19, -5, 2, 5, 8, 3, -2, 1, 3, 1, 0, 15, 7, 15, 0, -9, -8, 0, -7, -7, 6, 5, 10, 9, 1, 4, -4, -13, -9, 13, 9, 13, 10, 6, 5, 6, 6, 11, 8, 3, 15, -4, -7, -22, -22, -17, -2, -5, 10, 5, 1, -2, -6, -15, -9, -7, -10, 3, 2, -4, -15, -5, -14, -11, -9, -6, -4, 12, 7, -3, -10, -9, -17, 2, 0, 11, 0, 4, -6, -11, -10, 3, -2, -6, 7, 12, 22, 11, -9, -9, 1, 5, 3, -9, -1, 3, -1, -4, -2, 2, 7, -6, 8, 0, 0, 1, -7, -5, -5, -7, -3, -14, 7, -10, 4, 1, -10, -2, -14, -3, -7, 5, -14]
5581a4J3j4QmJ0J7kj8J2qloJ0Qj0J8lj3OOj9J7j5QNrQpj2NLJ0mOmj6LKpKKJ2O
5624IrrJoMOpJ2JqPqPqJlJ8oOj2Lj2RJJ5k2J2OmrJ0j6K2lJ0j6%J3rKj9J6KMOp
5670A0nokrJ6KlNqj1pJ1j%J4rJ7j8lLlKJJ6k0J6j7NKj0MNmKMJ6k0mJ9k1LL0qj9
5714eJ7rnJLkoJ8kj2LlJ6j7MJQrQmnqLnQOKj3LqJpJK1PpokqLLlRJ0ojjlNoJ3o
5766ERnj4NMj0jJ9j0RJMj1j0pJ3Rn%lj3J5kj7J4lJ1lrNmOj0LjkJ1%j3rJ7llNJ
5811bpOjJ1k7KRJJOJ3nj5mRkJ4MMl%k0RjkjQPlj2OMpJkMQpkNj4J5j1nJ4j5J4n
5859BRj3mJQ%MJoj7J1nJ1jkJ2j6LmmRJ4k2JJ6Nj2Kj2QkJ0Qj4RMmpkj1J0J2rJ2
5903A5qOj5OrJRj4Qj5QlQl%Nm%QkjpLkLJ1nj0QmkqJ5pJ6klkonLJ4Oj2NmRj2nn
$$ y = [-14, -1, -15, -7, -11, -1, 16, 14, -4, 8, 0, -3, -9, 1, 9, -1, 17, 14, 1, 7, 13, -6, 11, -4, 4, 9, 0, 8, 1, -11, -6, -3, 7, 3, 9, 5, -11, -8, -6, -13, -11, -9, 3, 9, 0, -9, -8, -14, -10, -4, -11, 1, 2, -6, 1, -7, 0, -8, -7, -10, 8, 2, 8, -4, -1, -13, -4, -3, 12, -10, 2, 8, 4, -5, 5, -11, 11, 8, 18, 2, 2, 15, 6, 8, -11, 5, 7, 11, 17, 10, 5, -1, -3, -12, 4, 6, 3, 8, 0, -11, -18, -7, -8, -8, 6, -3, 14, -4, -7, -4, -7, -5, -4, 12, -8, 8, -9, -4, -2, -12, -8, -3, -7, -5, -1, 15, -5, -9, 10, -11, -8, 22, 14, -5, 12, 3, -2, -1, 2, 0, -6, 12, 10, -2, 1, -2, 14, -3, 1, 2, 10, 1, 9, 5, 0, -8, -5, -10, -2, 4, 6, -7, -4, -12, -11, -18, -17, 4, 11, 4, -2, -4, -12, -9, -6, -9, 0, 10, 4, 3, 2, -1, 4, -2, 11, 5, 14, 9, -5, 0, 4, -6, -7, 12, 2, 11, 12, 16, 5, -5, -12, 1, 10, 5, 5, 2, -11, 4, 2, -15, -1, -4, 7, 4, -5, 0, -4, 2, -8, -5, -6, -8, 3, 3, -10, -19, -2, -5, -8, -3, -2, -9, -3, -4, 7, -20, -18, -9, -8, -7, -1, 12, 7, -8, -12, -3, -5, 9, 13, 17, 14, 14, -6, 3, 2, 0, -1, 7, 14, 11, -1, 5, 9, 2, 3, 1, 5, 13, 6, 4, 9, -5, 10, -1, -6, 8, -7, 7, 2, 11, -2, -6, -5, 3, 3, 7, 8, 2, -15, -4, -9, 2, 1, -1, 11, -5, -2, -6, -10, -1, 13, -9, -8, 8, 13, 1, 3, -9, -1, -3, 7, 15, 1, 10, 14, 10, 3, 1, -10, 0, 12, 3, 15, 7, 13, -2, 4, -5, -4, 5, -9, -1, -16, -8, -11, -3, -6, -6, -1, -5, -5, 3, 1, 0, -7, -4, -6, -3, 8, 3, -7, 1, -3, -5, -13, 2, -5, 11, 9, 6, 4, -2, -7, -4, 10, 16, 4, 9, 5, 14, 2, -3, -8]
5953hK8okj2LmOlKkkOoRj7KjJ4mkQlj3J1j0rlJ2K0j0jpKmj3J9jJ0nnJ0knjMmQ
6000IjKjkkoONNKqj1OjjOjkmKm%llJ0NjJLLprLJ3j6OJ0j9K0j9nQloKJ9j2Rpj3
6050a2PrQJ2Mqn%JJ2j1QLJ1Pj4ojLj2J0J5Kj7Rnkj0kK%J3q%Nj6j0J4J1j7J5k%
6093Ej3OnRj4J5ljPj4J0j7J6j2QJ1j0QlrmKlJ0LJ0qnNmLOLlKj3N%Oj0J3qQloN
6139Hj2JJ2jjoMJj0JPj0NmMkkqkJ9j4J3NjooJ0k2K6k1K4lJMj5OlKPMMrj1PKnJ
6186DMjOmKlj1QlJ3j7JlJ2kolJ4Kjj4Nj%k%j1J3lqK1j6j4PlNOMMlPnj1J1mmQM
6234Hkljj2NLlNJ1oMkklPPL%lj1%mljMJ4j3LLj4OJ0rnJ0rJ2pkJj1lOPj3J6rnj
6283a2pJ1J8JjOmj4Jj4J8LmOrJRRk0NKJ3qj0J8j7LKOnJQpLj4Pj7J6qJ8knoj4J1
$$ y = [-8, 20, 14, 12, 0, 3, -1, 5, 2, 4, 2, 0, 6, 0, 9, -8, -6, -7, 7, 3, 1, 9, 6, -7, 4, -6, -15, -18, -6, 14, 4, 3, -4, -2, -6, -19, 0, -1, 9, 4, -1, 9, 7, 2, 1, 5, 1, 9, 8, 10, 9, 7, 5, -1, 5, 10, 15, 17, 9, -2, 4, 3, 2, 8, 7, 5, 1, 3, -1, -1, -4, -7, 3, 8, 7, 8, 11, 14, 7, -2, 1, 14, -2, 4, 14, -5, 15, -4, -9, -1, -4, -10, -8, 11, -1, 8, 1, -12, -5, -14, -6, 6, 10, 2, -3, -3, -2, 10, -1, 7, 10, 21, 28, 14, 8, 7, 10, -2, 8, 23, 25, 8, 17, 12, 10, 0, -2, 0, 0, 13, 5, 5, 10, -6, -16, -2, 9, -8, 7, 5, 5, -8, -2, -7, 2, -12, 3, 0, -1, 6, -8, 2, -15, 1, -11, -3, 8, -2, 6, 3, -6, -10, -8, -11, -1, 2, 12, 4, -1, 4, 0, 3, 9, 12, 9, 11, -2, 3, 3, 9, -1, 12, 4, 12, 9, 3, 8, -4, -3, 9, 8, 7, 1, 5, 6, -4, -3, 4, -6, -1, -5, -1, -3, -5, -13, -15, 4, -10, 3, 8, 7, 1, -5, 5, -17, 9, -12, 12, 9, 10, 14, -1, 5, 2, 4, 11, 15, 19, 10, -1, 6, 8, 3, 4, 8, 7, 13, 9, 11, 8, -3, 5, 2, 15, -2, -1, -4, 8, 6, 0, -3, 11, 13, 12, -2, 3, 2, 2, 0, 0, -11, 2, -1, -9, 12, -4, -18, -11, -14, -9, -3, 1, 5, 2, 9, 4, -7, 4, 0, -4, 4, 8, 6, 3, 2, -10, -5, -2, -5, 0, 11, 5, 9, 7, 5, 2, 9, 16, 19, 19, 16, 5, 5, 1, -2, -3, 1, 15, 2, 5, 8, -6, 0, 10, 1, -4, 6, -3, 9, 2, 0, 1, -10, -13, -7, 0, -13, 3, -6, -11, -12, -19, -8, 10, 11, 10, 16, 12, -2, -1, -15, 3, 6, 2, 8, -1, 0, 9, 18, -2, 3, 5, 18, 10, 0, 18, 1, 4, 6, 12, 7, 8, 16, 9, 12, -2, 5, -12, 4, -4, 14, 12, 7, 1, -13, -2]
6328bqK2oJj2J8j5oJ1j0MmNLj0LqJ6%LoJ1mMj4J3k3J8J1j1KmOMnnJJ4lnMJ5l1
6371cJ7j3Nj5K4j3jMJorpJ8J5k3J0kmpJpkJ0MlKJ0k1jlOOQnRmn%j8J7nOJ0mnN
6417Bj3QkJ2j1RKnmkoQJ1%Jqkmj3J0MJ0kpLOk7K1onJ9j3MKj1mLlNNpRoMj8RMp
6465a5J6JkMmJj1J3QojJ2k1Rj0jJ4kRkKj9Qj4J2jPQoj3Omj2QMnjJ2LpqNprJ9J
6511AkmlrlNJ0jj0J5j0K0pj4LPqPK4jqqpjj5K4NLrPj8QMNojPrMk0K1j8nJ3J3m
6557Erj0J5rOoPoJ9j6j4QpJ7kNQj6Rj7J3k3J1J3pJJ6mk0J2MNj8J4RNk5MKlKlN
6600@jJ2mJj6J3qoJ4%JnmnmjJ3Pj2J0j7N%jMPj0J1%j5Lj1KkOJ4N%qLj4J2pKJ1
6645EkMqJJj5J8j5J3ONj5llJ0kkmJ2Kj5J3j6nJ5ojPj2oLLoJ0j5K3nLj0Nnkj%J5
$$ y = [-2, -10, 12, 6, 7, -5, 13, -2, -8, 3, -7, -3, -7, -2, 1, -9, -6, -14, 2, 2, 5, -1, 10, 6, 10, -4, 9, -14, 4, 15, 4, 6, 2, 8, 12, 7, 2, 3, 17, 14, 9, 13, 28, -3, 14, 1, 6, -9, 15, 2, 1, 5, 6, 0, -9, -16, 2, 17, -6, 4, 2, -2, -9, -8, -15, -17, -7, -3, -6, -4, 6, -15, -16, -19, -13, -7, 1, -4, 5, 1, -4, -4, -22, -5, -10, -4, 6, 2, -3, 2, -11, -3, -5, 7, -4, 5, 7, 2, -2, -4, -10, -2, 9, 9, 10, 2, 0, -4, -17, -7, -3, 7, 5, -2, 1, 7, -20, 1, -5, -10, 9, -4, 0, 2, -9, -13, -10, -13, -8, -3, -10, -1, -7, -3, -21, -12, -8, -15, 1, 2, 0, 4, 0, 1, -10, 3, 11, 5, 4, 16, -5, 4, -6, -7, 7, 5, 14, 12, 14, -5, 3, -11, 1, 0, 7, 15, 9, -4, 2, -2, -14, -6, -2, -7, -8, 4, 7, 0, -8, -3, -10, -19, 0, 1, -1, -5, -8, -17, -20, -15, -5, -6, -16, -1, -11, 9, 2, -12, -9, -2, -10, -3, 21, 20, 12, 4, -3, -4, -19, 5, 10, 13, 4, 11, -7, 1, 5, 10, 4, 3, 10, 1, 5, -15, 6, -12, -17, -4, 9, 5, -4, -14, 1, -8, -2, -8, -1, -7, 12, -4, -18, -10, -17, 0, -2, 3, 11, -5, 4, -13, 0, -23, -12, 1, -6, -5, 11, 7, -13, -1, 3, 8, -10, 4, 13, 18, -7, -3, -1, -4, -2, -5, 0, -1, 11, 7, 8, -8, 5, -3, -9, 5, 5, 6, 1, -3, -8, -12, -13, 0, 7, -5, 5, -12, -7, -7, -8, -4, 3, -7, 4, 4, -11, -8, -19, -17, -19, -13, 1, 6, 6, -2, 1, -13, -1, -8, -6, 5, 3, 7, -1, 0, 1, -14, 4, -11, 2, 8, 13, -2, -5, -8, 2, 0, -2, -6, 6, 8, -7, 6, -10, -15, 0, -6, -7, 0, -12, -18, -15, -12, -18, -8, -23, 0, -5, -2, -12, -7, -12, -14, -15, -15, 0]
6690@Ljj0jLJj6K1oKNJJj0rJ4OlJ4j8KjlKJ1oRj5J6ojj0LJJ0Qoklmj2LOrK3j0
6736ClroPpJ9j7J4OqPqk3J8JnLlJ3jKopNJMJ4j0J9k9OMkLOMmm%lMrM%mJ1oNj1
6785bqJ2j3J4kPnj3NJ%nKLLj2OjMMpnR%k1L2Kk5OJJ4LQqorQLj1%PJ0qqlPLJ5n
6834A2j3J5j6LomjQLMLj3nPrJ1qK0qpj1OnMjQJPoljoNLjj1J4pqKpJ6Mj6J0%J1
6881Dj2JPJJ0qRlj0L%LnKNLllj2JJ7j4pQJnPnlqJ0mNRk1qLRmJJ0lJ6j8J5j0RK
6929Ej5mJ4J9j7pkloJ4%LoMKp%lK2r%J7pj2NqkoOJ8j3J1Lp%jnKjlJ2qj1j4J6K
6975bPj1q%J6j3JQjJ0kPloj4K%KJ3KlJ2k6K3j3JLQj0J0qmjj5J3ROqJj1JJ3j2p
7019a0JJ2J1j3lJj1J1%j0J0Mj6J9j2JJpLlMrJ7oJj5J6rJ3pO%l%j2J6kJ4j4Pjk
$$ y = [0, 3, 2, -8, -9, -6, -5, -21, 0, -6, -4, 1, 2, 3, -7, -16, -2, 4, 1, 15, -3, -1, -2, -5, -3, 8, 2, 11, -4, 12, 6, 5, -5, -2, -1, 9, 17, 11, 9, 6, 2, -10, -7, -1, -10, 13, 3, 0, -9, -15, -8, -15, 4, -13, 1, 7, -1, 6, -2, -25, -7, -6, -11, -8, -11, 2, 1, 3, -3, -10, -5, -4, 0, 14, 4, 23, -6, 0, 4, 2, 5, 11, 15, 11, 7, 7, 4, 8, -1, 3, 3, -1, 10, 4, 9, -2, -10, 2, -11, 3, 1, 8, 3, -10, -5, -4, -4, -9, -7, -4, -1, -13, -7, -8, -4, 0, -7, -12, -3, -3, -24, 8, 10, -15, -9, -8, 6, 9, 17, 9, 3, -6, 2, 5, -6, -6, 1, 11, 3, -5, -8, -1, 2, 17, 12, -1, 14, -2, 1, -5, -9, -10, -2, 1, 5, 8, -5, -10, -3, -12, -1, -9, 11, 3, -4, -15, -9, -14, -10, -11, -3, -2, 5, -1, -4, -5, -11, -6, -3, -4, -15, -1, -8, -16, -14, -21, -5, -1, -17, -7, -7, 4, -8, -7, 0, 1, 11, 3, 12, 9, -1, 2, 2, 5, 0, 2, 7, 10, 7, 4, -8, -7, 10, -4, -11, -3, -2, -7, 0, -5, -8, -16, -6, -10, -5, 4, -17, -25, -22, -13, -17, -16, -6, -9, 7, -11, 4, -6, 3, 5, -10, -14, 0, 19, 2, -5, -7, -10, -16, -2, -2, 1, -5, -1, 1, -6, -6, -9, 13, 4, 4, 21, 14, 2, 7, -1, -3, -9, -3, 15, 2, 13, 16, 9, 9, 8, 3, 5, 4, 1, 13, 5, -6, -20, -4, -2, 5, -6, -14, -14, 2, -11, -10, -2, -3, 7, 5, 12, 9, 3, -11, -9, -9, -7, 6, 8, 5, 17, -9, 14, 1, 2, 5, 13, 3, 13, 5, 1, 0, -15, -2, 7, 13, 5, 6, -5, -4, 9, -3, -10, -9, 3, 14, 1, -2, -1, -12, -1, -1, -11, -1, 3, -13, 6, -6, -5, -4, -11, -8, -11, -7, -16, 1, -5, -4, -19, -3, -12, 1, -6, 0, 0, -3, -3, -15, 1, -1, 13, -1, 6, 5, 3]
7061CmqJ1J0j3J7plj6J6KJpJLKj8J5j7JJ0nJ4nLnpOpmPoMKpQk1QJ3Mj2MPpQj4
7107a3oKJ3Qj0OLqNj3jJ2RLLpqJ1rJ1j0OLlpJ5j3mJ1p%MRl7J6KplJ4jJ0j1or%
7152a7J2JNNplLKj4M%J9nOmj1J3oMq%mK2j5NnjMqRnPnRjj7KRNjmLj6J8j8NKRn
7201CnQlpj0J5lJMmjrJ0j4JRJJ1lrpJ3onNJ5ljmKjj2OOnkLOnLkj6J7Q%LqJLj2
7251cJJ1j0Olj7J4mMNpk%J7j7LpMqLJ2Lj4pJ8rrOJ1%OnJ2j3PjkoK0j6J1k4J3j0
7295gPJ2oOqoLJLkpK0Orj1Qj3LpnNOkoK2k7NmmJ4MoMj3J4j1JJLLoJ2j7JKpPJ0
7343ajKRkjkJk1J8Nj3RNmj5J5n%J3%lmrNQj0RQqj0nJ4j4pjK1nRmlqj0Q%KPKlj
7392@%Mj9J1pJJ6rJ1npMJ3j6OLj0J2mkoOMolJ1kNj5LmRPprPJj4MPMmoMKqj9RJ3
$$ y = [3, -1, -9, 2, 12, -1, 16, 9, 6, -10, 6, 8, 9, 2, 3, 6, 8, -10, 5, -12, -11, -1, -6, 8, 3, 6, 1, -6, 0, -7, -11, -4, -10, -6, -4, -11, -3, -24, -16, -3, 1, -11, -7, 0, -7, 1, -13, -19, -17, -4, 4, -6, 0, 3, -5, 0, -13, -14, -2, 7, 10, 13, 6, -2, 9, 0, 11, 1, 7, 10, 7, 0, 15, 2, -2, 9, 2, 2, 6, 15, -22, -6, -4, -11, -14, 0, -1, 9, -2, -8, -17, -17, -5, -4, 1, 6, -1, -4, -1, 1, -13, -9, -9, 10, 5, 11, 7, -4, 9, 3, 7, -1, -1, -5, 17, 2, 7, 2, 1, 5, -3, 6, 1, 8, 3, 12, 11, -6, -4, 5, 10, 9, 5, 8, -8, 10, -8, -3, -1, 8, 3, -2, 6, 3, -4, -14, 1, -2, -1, 3, -1, -2, -11, -1, -15, -14, -5, -4, 7, 4, -5, -12, 1, -5, -10, -5, 10, 7, 6, 2, 4, 3, -9, -3, 3, -2, -4, -1, 5, 0, 3, 1, -15, 2, 10, 10, 13, 5, 6, 9, -3, -2, 9, -1, 5, 2, -15, -1, -5, -1, 4, -3, -5, -5, 12, -5, -2, -9, -5, -13, -10, 2, 5, -9, -16, 2, -7, -16, -10, 1, 1, 7, 2, 14, 1, 8, 7, 5, -1, 19, 3, 14, -10, 3, -7, 0, 12, 6, 12, 4, -2, 1, 2, 5, 3, -4, 16, 22, 13, 2, 10, -3, 0, -7, -12, -7, -1, -3, -9, 13, -14, -9, -13, -17, -3, 1, -5, -1, -14, 0, -11, -10, -9, -6, -3, -9, 3, -14, -13, -11, -18, -11, -1, -2, 0, 9, 7, 6, 4, 5, -16, 2, 7, -6, 3, 8, 4, -11, 4, -1, -1, 12, 12, 9, 5, -4, 1, 9, -1, 8, 16, 8, -2, -7, 7, -7, -14, -15, 6, 1, 10, 6, 3, -5, -15, -7, -7, -5, 2, 4, 1, 0, 0, 4, -15, -4, -11, -10, 6, -3, 8, 3, -4, 0, 13, -3, 3, 6, -4, 8, 4, 2, -4, 2, 6, 0, -3, 8, 6, 11, -4, -1, -5, 4, 11, 4, -5, 2, 3, -11, -7, 0, 4, 0, -6, -2, 0, -8, -27, -18, -5]
7441eJklJ5qnkKoPOkPj1%Kmj1J0K2j6MMj2Qj9K5KpOPj5MJn%J0rRjnOpqJ6qKKm
7490CkpJjPLj6J1Mj0LPmoQLkmqj3J6k%lJ2JlnjRjlQj3LR%%j8NNKJ0J4j8%mLj4
7539a1J5LlJ2orklpJ4j1J9k2oK4j2oQ%LPoJllMjlRjj3J2Jj2RNpOM%rNnoMPNO%
7588A6rQj1KlQj0LKpNJj3J1mJ2%j6qMNNk1K2qJ3Kj4rkJ4QnQrO%j1JkQJ2rJ0j7
7633bj8J0J1j1J3oMKq%j%J3j1RlLjj3PPjj1J0Mlj4PJ1j0mJ0QmrmOj3LMoNj2QK
7678hNrJNjJQmMk1NJ0rRmpJ1lKmJ4nMKKJ2j2j5J4mkKMNlNj3j0RJ2rqJ8oj5J9q
7725CRj6JJ6jql%oRj0kJ0%l%ojmJ0JmLJ9j0j5NrMOPJ0j4n%MnJ2j0J0JPqJmj3J3
7772DMklRj3knJ2noRJ3j4Lj1J0l%oJ0Jm%pOj5NJ1Mj1Or%LJ0rj2MJ2LKpMpJkJM
$$ y = [-5, -4, -6, -9, 6, -2, -7, -9, -7, -13, -6, 0, -2, 5, -6, -6, -4, -8, -19, -9, 13, -3, 1, 5, -7, 1, -18, 7, 9, 2, 8, 15, 0, 4, 5, 0, 0, 10, 1, 10, 9, 4, 10, 3, -5, 11, 3, 5, 7, 3, 1, -6, -5, -6, 1, 4, -12, -1, 3, -7, -4, 3, -1, -7, 1, 4, 2, -2, -10, -23, -7, -9, -9, -12, 0, 1, -2, -7, -8, 1, 0, -3, 5, -8, -5, 4, 4, 4, -14, -9, -4, -2, 8, 22, 4, 4, 0, 3, -11, 4, 7, 4, 16, 10, 1, -1, -4, -11, 3, -8, 11, -11, -17, 7, -5, -11, -3, -3, 0, 7, 1, 2, -1, -4, 0, -1, -4, 5, 4, -9, 3, 4, -8, 1, 6, -1, 5, 9, 9, 0, 5, 0, -6, -2, 5, 10, 16, 16, 7, 15, 4, 6, 3, 11, 1, 4, 6, -1, 4, 5, -8, 3, -1, 11, 11, -5, -13, -9, -4, 1, -20, 2, -6, 7, 9, -5, -14, -16, -2, 6, 1, 9, 0, 6, 6, -5, -4, -6, 2, 14, 5, 15, -2, -20, -10, 1, -10, 3, -3, 1, 3, -5, -5, -6, -6, 7, -4, 5, 2, 5, 4, -9, -2, 5, 4, -7, 3, 7, 4, -10, -3, 8, -2, -6, 4, 12, 8, -1, -5, 1, -12, -9, -5, -11, -6, -18, -10, -8, -3, -12, -11, -6, -7, -6, 2, -2, 2, -19, -14, -4, -13, -4, -8, -15, -4, -7, -5, -9, 5, 0, 4, 6, 8, 20, 8, -7, 7, 3, 1, 3, 7, 12, 9, 14, 1, -9, 0, 12, 3, -5, 13, 7, -8, 11, 3, 12, -4, -3, 13, 12, 4, 1, 1, -5, 4, -6, -8, 2, 2, -1, -1, -7, -8, -12, -2, -1, -5, -2, 17, 7, -8, -3, -12, -8, -2, 5, 15, 1, -4, -4, 0, -5, 7, -3, 7, 8, 15, 7, 8, 4, -9, 4, 8, 6, 3, 12, -1, -3, -8, 4, -1, -7, 2, 15, 1, 4, -7, 3, 0, 0, -6, 4, 5, 1, 1, -6, 0, -15, -10, 1, 5, -6, 0, -9, -9, -6, 4, -5, -17, -13, -1, 2, 4, -3, 1, -6, -5, -7, -6, -2]
7820bNoNj%Qj1QkRnNj8oJ7k1J4pK1j2llMLj0J9j6NMojm%NLQqj5OMOllJ3lk1QN
7868bJnkQLj4J6j5j3J7LlQJ%qjJ0kJ1qPj6QqMKJj4LJ7loLPk1LJ%Rpj2Qj0OLP%
7916cj3J4LqJ1k3PJ2%%mj1J5mj1OJ3k%pP%k3J9KOmmOL%j2Pj1QJLJ1mj2jOj5OJ0
7961Dj1J6j1krQoJQj1J2jj2JLoOmlJ4j5J3LnpNMRnqPJ1k2J1JKlPkj1J0njMJ4j2
8007BJ0qj7lPO%j0LRnKj0mOlJ3j0Rj0KJ5k4QpOJ0MJ3qj6oONMkqLlJ0LqOplNJL
8055ajNoRkJ2mj6K1qj7J2jjlOj2QLj7OKJ2jj3J1j5J5j3J3qJ2p%JqNnNl%rMKN%
8101bPmmJ1%j1oOoJ1lPKmklmOOj3jNKKJ6l3K2Nj8J9k0J0j0J5pj0Nj1J4pJKPkj2
8146a2lNlMkK2j9LOj3RRj2J0j3RmJnJLJ3Kj8KQj7J7jkKj1PKLj1J8KnkKKmj1J1
$$ y = [-2, 3, -3, 2, 1, 1, 9, -2, 6, 4, 13, 8, 13, -5, -11, 6, -15, -1, -8, 13, 1, -2, -5, -1, 2, -8, 11, -5, 0, 4, -2, -3, -7, -7, -2, 1, 9, 1, -14, -8, -4, 2, -1, -4, 9, 6, -15, -7, -2, -1, -6, -8, 0, 3, -11, 5, -10, -23, -6, -3, -6, 2, 3, 3, -5, -6, 4, 2, 13, 5, 12, -4, 4, -4, 0, 2, 3, -11, -8, 9, 6, 0, 3, 10, -11, -8, -7, -7, 2, -5, -17, -9, -19, -13, -10, -3, -3, -16, -2, 1, -7, 4, -19, -12, 0, 0, 0, -4, -15, 0, -4, -15, -9, 4, 2, 2, -5, 2, 2, -21, -2, 0, 6, 2, -2, 4, 7, 7, -5, 2, -9, -1, 0, 3, 14, 10, -2, -3, 3, -12, -6, 4, -7, 9, -2, -4, -13, -5, -11, -10, -2, -13, -1, -2, -14, -13, -10, -16, -10, -14, -17, -3, -18, -5, -2, -7, -14, -9, -5, 4, -1, -9, -2, 9, -13, -2, -1, 1, -2, 5, 3, -8, 2, -3, -4, 0, 14, 2, 12, 4, -13, -16, -9, -3, -3, -13, -10, -1, -6, -4, -14, -18, -12, -15, -2, -12, -3, -13, -11, 4, -20, -12, -19, -13, -3, 1, 14, 6, -10, -16, -10, -5, -1, -3, -11, -8, -11, -1, 2, -6, 0, -7, -10, -5, -4, -1, -2, 3, -3, 6, 4, 16, 12, -4, 17, 9, -8, 4, 3, 2, -1, 5, -7, 1, 4, -13, -7, -5, 7, 6, -7, 4, -11, 4, -9, 4, -4, 8, 1, 1, 2, -6, -1, -6, -1, -4, -4, -13, -9, -7, -2, -2, 5, 1, -3, 8, 8, -3, -9, -3, -9, 2, -1, 6, 8, 4, 2, -1, -5, 1, 7, -6, -7, -2, 0, 2, 18, -15, 7, 12, -6, 13, -7, 3, -7, 8, 1, -9, -4, -15, -1, -8, -7, -5, 2, 0, -12, -15, -10, -13, -9, -11, 11, -8, -5, 1, -12, -3, 6, -6, 4, -9, 0, -4, -3, -8, -7, -4, 9, 11, -7, -5, 3, -14, 3, 2, 0, 2, -9, -2, 0, 3, -8, 10, 12, 7, 5, 7, 9, 5, -6, 5]
8191E
$$ Imaginary data points
##PAGE= N=2
##DATA TABLE= (X++(I..I)), XYDATA
0@%%%%%%%%%%%oJ4j6J6j6J7k5L2l6M4m9N7o8P7q9J04j20J36j52J69j91K15k41
34a28K71l02L34l70M11m56N06n62O24o89P62q46R38j042J163j302J462j654J888
53A008k177K547l040L735m796O638j0719L5267k3629j00704l2447J7413P4970
66c5934Q2595O6008R936m3384q3994p8752m1920J9288O7326Q7884O2912J0298
78A22263m9645q1701p6664l4716K0287O7659Q2603N9758O243m8975q0316p1928
90h5132l1322K3419O6116P8593N3732M035m7532p6043o9418l0041K3965O7165
102b2463P7419M9889r94m9350p3440o3733k5153K5571O4521P2471M5613k138m7701
115E0512p0700o1290k3009K6967O3939O9286M1498m387m6709o7566n8223k1319
$$ y = [0, 0, 0, 0, 0, 0, 0, 0, 0, 0, 0, 0, -6, 8, -8, 8, -8, 9, -16, 16, -20, 24, -25, 32, -36, 41, -48, 56, -64, 72, -80, 89, -102, 113, -128, 143, -159, 175, -195, 216, -240, 266, -296, 328, -361, 401, -445, 493, -549, 614, -688, 774, -880, 1008, -1169, 1378, -1662, 2073, -2723, 3915, -6804, 28463, 4834, -95870, -128317, -110904, -35934, 46661, 112669, 122605, 79221, -4773, -83525, -125445, -106157, -38831, 49053, 111965, 122263, 72618, -9083, -85747, -120463, -100176, -32517, 50086, 109844, 116087, 67112, -13204, -85132, -116454, -93035, -26919, 51674, 105406, 109441, 61909, -14134, -83552, -113593, -89628, -22463, 54956, 104845, 103851, 54501, -18939, -82672, -107825, -82254, -17733, 54738, 100351, 98213, 50512, -20188, -81478, -104487, -77520, -13581, 55705, 97203, 92816, 46107, -21459, -79682, -101001]
127a01001K7172O3055O7579L9074o918m7953o6084n4026j7005K8379O0306O3356
139E5934L6516p193m7270o5089n2009j3817L0617N9206N9253L2306q629m5462
151C4363o1742m9228j2820L0003N8015N7925L0553j0704m6335n9862m5225r682
163h4739K9823N5064N4926K9390j0469m5945n9378m3862p387L1644N4747N2223
175E6037K5755j2700m5191n6107m0342n941L0618N2681N0535K4652j3517m5426
187B1054n4991l7831l326L1496N0919M7157K1975j3727m3429n2677l6811l304
199g3495L1635N1235M6367J9476j6267m3629m9996l3347j701L0716M9236M4841
211E5071J8724j6911m4109m9483l1176J241L2102M7603M1131J5796j6929m1807
$$ y = [-101001, -73829, -10774, 56805, 95879, 88961, 41008, -25076, -79102, -96107, -67728, -7422, 55934, 92450, 85257, 37987, -27102, -79111, -92928, -62311, -3105, 56148, 88454, 79825, 34363, -27379, -76607, -89427, -59424, -1409, 56516, 87069, 76365, 30030, -29832, -75057, -84739, -54916, 148, 55074, 84464, 73995, 28050, -31328, -75190, -82577, -50933, 3814, 56037, 81792, 69092, 23901, -32206, -72548, -78489, -47871, 4810, 55345, 79997, 66480, 21054, -33937, -71768, -75094, -43598, 7321, 54478, 76453, 62726, 19297, -33380, -70191, -73495, -41860, 9375, 55742, 75218, 58951, 15322, -34674, -68021, -69722, -39006, 10230, 55071, 73795, 56884, 12775, -36708, -67884, -66643, -34541, 13062, 54193, 69989, 53060, 11253]
223A1253m7178l0338J188L2290M7684L9987J3418j8731m1307m4661k7746K075
235f2066L1372M6119L8843J2814j9231m1656m4054k5854M283L2146M4648L6179
247E3543J0888j9352m0430m2635k4705N165L2608M4138L4465Q654k0592l9616
259B131m0228k2357N897L1523M2397L3291Q331k0637l9685l9769k0950P716L2213
272b0127M1117L0912O624k0645l8407l8408k0156Q120L2547M1057K9859M623k2313
285C4803l8212l6138j7441R201L1471L9128K8544M279k2315l8182l5578j5892
297e6332J0965L1931L7568K6029K735k1900l6497l4126j5479J0793L1862L7610
309B5159K5434J265k3192l6372l2358j3409J1625L1159L6178K4305P17k3403l6218
$$ y = [11253, -35925, -66263, -65075, -32785, 14899, 54886, 68304, 49573, 8266, -36395, -64141, -62066, -30694, 15425, 54268, 67082, 47851, 6195, -37859, -63713, -59430, -27284, 17364, 53543, 64431, 45079, 4649, -37986, -62691, -57526, -24918, 19220, 53685, 62339, 41747, 2131, -38097, -60454, -54557, -23034, 19363, 52654, 60985, 40348, 663, -39106, -60056, -52340, -20127, 20990, 51902, 58526, 37881, -526, -38934, -59090, -50970, -18423, 22634, 52493, 57116, 34803, -3409, -39547, -56988, -47787, -16316, 22812, 51356, 55635, 33320, -4862, -40440, -56332, -45367, -13436, 24132, 50161, 52896, 30996, -5501, -39627, -55106, -44313, -12451, 25159, 50593, 51858, 28666, -7706, -40064, -53473, -41848, -10689, 25489, 49794, 50511, 27108, -9110]
322i110l1600j1963J3047L1419L4841K2137p84k3257l4718k9972j1153J2990L0989
335g134L4343K1337j878k3948l4317k8461r492J3640L0256L2911K0223k184k3698
348B1598l3932k8034q740J4645L0816L2195J8461l789k3942l2758k6373p718J4802
361c2769L0369L1490J7500m869k4540l2183k4734n939J5343K9350K9758J6343
373D5119m893k3946l1643k4378n374J6127K9683K9036J4721o202k3928l0478k2974
386c9130m653J6131K9297K8515J4049p103k4600l0234k1573k932J6927K8578K6878
399C0150J2704p516k4157k9426k0742k104J7437K8378K5776J1208q355k3795k8072
412a8514j9454j652J7030K7719K5327J0895q835k4226k7968j8409k69J7743K7180
$$ y = [-9110, -40710, -52673, -39626, -8207, 26634, 48771, 47987, 24730, -9988, -39960, -51113, -38123, -7134, 27209, 48546, 46668, 22720, -11597, -40058, -49550, -35910, -5654, 27257, 47480, 45296, 21598, -12334, -40368, -49108, -34463, -3647, 28548, 47009, 43220, 19278, -13480, -39853, -47571, -32769, -2400, 29090, 46590, 41721, 17181, -15002, -39736, -45675, -30332, -982, 28776, 45119, 40226, 16280, -15363, -39741, -45115, -28988, 695, 29731, 44452, 38250, 14322, -16156, -39130, -43783, -27652, 1645, 30160, 44209, 37106, 12506, -17728, -39301, -42233, -25306, 3272, 30150, 42854, 35338, 11181, -18245, -38987, -41091, -23654, 4724, 30500, 41708, 33353, 9558, -18514, -37968, -39620, -22590, 5129, 30456, 41351, 32516, 8290, -19678, -38087, -38356, -20613, 6567]
425F567K3942R652r227k3820k7236j7691L85J8228K7134K3098Q226j0282k3704
438E272k5905j6157J116J7854K6196K2257P760j0544k3665k5410j5143K110J8050
451a6209K5413K0995O893j0504k3068k4785j4781K397J8422K5503K0463N747j1517
464B4969k3098k3720j3411L174J8219K4733J9636N131j1870k3027k3149j2354
476c4767M155J8426K3881J8272M210j1826k2270k2321j1853M384J8455K3688J7623
489C0057L282j2425k2036k1301j0790M779J8125K3029J7123K945j2718k2210k1045
502b3185r866N876J8587K2381J5751J824j2884k1486k0100r174O145J8585K2008
515A4462J4966Q84j3356k1046j8938q122O410J7981K1176J4502P81j3387k1115
$$ y = [6567, 30509, 40161, 30934, 7114, -20122, -37813, -37428, -19200, 7934, 31032, 39258, 28976, 5272, -20633, -36790, -35674, -17820, 8376, 30633, 38393, 27849, 4184, -21226, -36369, -34259, -16209, 9204, 30199, 37092, 26588, 3520, -21265, -36046, -33649, -15227, 10276, 30739, 36486, 24969, 1871, -21849, -35260, -32086, -13867, 10866, 30502, 35633, 23763, 736, -22413, -34767, -30612, -12186, 11695, 29967, 34177, 22351, 81, -22240, -34093, -29709, -11254, 12434, 30057, 33339, 20914, -1122, -22423, -33213, -28434, -10309, 12720, 29843, 32788, 20070, -2140, -23185, -33051, -27175, -8588, 13793, 29544, 31368, 18484, -3002, -23102, -32276, -26131, -7546, 14462, 29428, 30312, 16956, -4090, -23028, -31150, -24740, -6759, 14417, 28919, 29700, 16313, -4802]
528d802j8701p423P283J8274K0564J3325o1j3365k0427j7961p011P408J8301K0427
542A5831J2781q88j3994k0248j6966n820P939J7853J9415J1965j167j3818j9837
555f954j6470n283Q341J7786J8804J1135j736j3699j9244j5832m920Q388J7659
568b025J8561J0700k245j4067j9129j5157m035Q933J7501J7803R858k730j4020
581I948j8663j4535l486R245J7388J7268R063l314j4025j8085j3743k907R313
594a6533J7035J6721Q542l655j4017j7670j3154k409R437J6782J6222Q083l921
607B1463j4027j7490j2762j875R899J6841J5670P181m575j4011j6812j1875j392
620b3765R823J6428J5271O768m957j4157j6464j1119o72R985J5866J4479O277
$$ y = [-4802, -23503, -30926, -23643, -5369, 15195, 28520, 28459, 15094, -5333, -23294, -30305, -22897, -4596, 15831, 28612, 27724, 13730, -6518, -23484, -29304, -21365, -3512, 15903, 27868, 26701, 12883, -6954, -23424, -28707, -20366, -2580, 16224, 27359, 25623, 11924, -7320, -23152, -28072, -19684, -2025, 16536, 27236, 24991, 10924, -8205, -23362, -27397, -18464, -963, 16840, 26698, 23968, 9948, -8715, -23250, -26736, -17491, -103, 17165, 26228, 22914, 8889, -9196, -22939, -25846, -16533, 502, 17223, 25765, 22110, 8093, -9577, -22731, -25140, -15703, 1079, 17301, 25384, 21463, 7436, -10054, -22816, -24691, -14792, 2049, 17719, 24900, 20325, 6314, -10498, -22373, -23765, -13942, 2486, 17757, 24525, 19568, 5411, -11053, -22172, -22844, -12859, 3007, 17486, 23763]
633B3763m923j3817j6203j0905m13J0276J5942J4094N565n513j3791j5548j0129
646b1602n0J0055J5577J3841N408n815j4152j5522r440R06J0591J5087J2714M550
660B2148n818j3517j4855r193R19J0574J5100J2492L965o364j3546j4263q379
673b0737J322J0356J4576J2117L857o447j3642j4251p996K002J0822J4341J1289
686A7609L062o601j3210j3718p676K175J0939J4330J0882K360p084j3077j2959
699a2968o927K452J0675J3831J0452K137p159j2946j2653o500K788J0715J3476
712G373R972J827p190j2807j2478o249L170J1019J3431R404J072p592j2497j1753
726a3298n651L310J0801J3098R138P49p854j2550j1345m909L827J0669J2442Q464
$$ y = [23763, 18840, 5023, -11180, -22085, -22498, -12222, 3720, 17814, 23379, 17866, 4075, -11473, -21602, -21652, -11597, 3980, 17821, 23229, 17414, 3262, -12260, -21700, -20794, -10203, 4884, 17598, 22148, 16330, 2813, -12042, -21235, -20316, -9742, 5358, 17850, 21815, 15451, 1905, -12358, -20737, -19415, -9059, 5517, 17634, 21491, 15044, 1402, -12849, -20845, -18843, -8021, 6320, 17609, 20671, 14070, 860, -12858, -20534, -18359, -7420, 6910, 17792, 20152, 13068, -9, -12968, -19895, -17443, -6768, 7063, 17515, 19652, 12493, -453, -13106, -19606, -16818, -6103, 7373, 17345, 19172, 11982, -825, -13303, -19552, -16382, -5363, 8068, 17472, 18544, 10952, -1545, -13298, -18949, -15639, -4838, 8260, 17398, 18147, 10293, -2257, -13602, -18511, -14684, -4015, 8427, 16891]
740A6891N33p660j2193j1093m733L945J0736J2364Q118N7p936j2041j0557m211
754a7780M115J0528J2030P923r0q159j2204j0366l580M792J0644J1494P096o21
768A5822q072j1671r790l319M751J0477J1297O838r36q258j1544r318k775M933
782a1565J0235J0827O498j036q201j1402r164k527N222J0364J0647N994j499q325
796F068j1154q708k139N413J0323J0350N553j891q468j0910q197j654N633J0127
810C46R880N050k133q317j0498p869j491N645J0048R698M753k409q362j0318p503
825a3480j211N773R992R469M442k727q472j0169p111p53N992R851R056M005k940
840A1717q417r944o828m04O228R810Q629L431l241q251r443o375l07O082R571
$$ y = [16891, 17424, 9764, -2429, -13522, -18255, -14310, -3574, 8790, 16908, 16965, 9029, -3012, -13569, -17780, -13665, -3137, 8893, 16816, 16726, 8567, -3637, -14003, -17583, -12791, -2147, 9347, 16443, 15822, 7750, -3921, -13711, -17030, -12279, -1802, 9495, 16333, 15397, 7139, -4405, -13723, -16498, -11565, -1330, 9497, 15995, 14959, 6758, -4644, -13808, -16335, -11113, -749, 9898, 15892, 14393, 6068, -5086, -13794, -15933, -10520, -197, 10153, 15706, 13815, 5347, -5563, -13760, -15414, -9781, 346, 10226, 15276, 13143, 4826, -5672, -13541, -15032, -9387, 661, 10359, 15112, 12703, 4341, -5977, -13480, -14691, -8918, 1074, 10543, 14985, 12258, 3786, -6383, -13494, -14247, -8255, 1596, 10652, 14657, 11717, 3300, -6644, -13472, -13876, -7648, 2162, 10791, 14222, 10981, 2730, -6713, -13088, -13395, -7313, 2258]
855B258Q511L359l433q429r374n998J93O204R323Q094L085l448q363r351n845
870a3214N07O566R386P695K492l829q230q858n367O79O449R145P526K296m011
885I232q364q671m893J115O499Q749P016K093l919q134q506m837J229O619Q803
900D031O866J700m250q122q182m432J427O587Q619O662J477m443q195p985m005
915a2245J830O636Q299O164J200m388p953p729l887J911O691Q258N943Q36m604
930F962p781p352l548J934O536Q102N848P37m750p899p203l209K289O609P835
945E110N476M68m781p725p048k994K516O755P712N052J3m896p436o563k722K488
961h575O542P541M955n1n005p506o427k393K773O575P263M578k28m987p338o275
$$ y = [2258, 10769, 14128, 10695, 2266, -7108, -13106, -12913, -6709, 2614, 10708, 13793, 10345, 1982, -7369, -13214, -12707, -6141, 3245, 10940, 13432, 9603, 1373, -7485, -12852, -12173, -5724, 3421, 10947, 13243, 9232, 868, -7803, -12696, -11581, -5082, 3667, 10683, 12776, 8857, 723, -7783, -12620, -11391, -4772, 4031, 10897, 12597, 8347, 225, -7957, -12389, -10962, -4375, 4244, 10906, 12383, 7940, -255, -8240, -12245, -10415, -3779, 4520, 10684, 11884, 7496, -457, -8186, -12073, -10162, -3471, 4787, 10730, 11566, 6962, -819, -8171, -11719, -9785, -3249, 4853, 10701, 11438, 6688, -1211, -8414, -11623, -9334, -2725, 5110, 10586, 11054, 6273, -1452, -8500, -11494, -8978, -2223, 5489, 10541, 10554, 5658, -1778, -8341, -11063, -8575, -2033, 5508, 10463, 10412, 5407, -2099, -8526, -10919, -8146, -1571, 5692, 10270, 10042, 5055, -2283, -8558]
977h558k264K939O662P198M309o19n147p186n898j893L039O520O930M102p52n222
993D160p124n689j552L293O474O566L697q91n043o886n524j549L309O526O586
1008F353L548j194n272o807n179j174L427O336O356L358j270n336o783n000q40
1023i477L648O289N992K973j421n164o513m807q08L651O302N946K740j697n251
1038B403o299m433n54L577O047N745K726j662n300o338m391l13L849O101N510
1053F668K345j899n233o101m122j70L871O061N357K094k132n269n841l747K9L789
1069d300N794N119K038k055n204n870l708K21L988N806M860J717k180n091n609
1084d474l552K27L952N807M875J564k447n245n488l178N72L995N566M541J411
$$ y = [-8558, -10822, -7883, -1221, 5977, 10286, 9667, 4520, -2666, -8564, -10457, -7418, -898, 6032, 10134, 9382, 4160, -2964, -8653, -10205, -6912, -438, 6128, 9825, 8934, 3891, -2995, -8519, -10068, -6759, -233, 6353, 9901, 8707, 3435, -3372, -8551, -9725, -6298, 38, 6394, 9752, 8482, 3146, -3637, -8637, -9477, -5829, 460, 6452, 9425, 8004, 2840, -3673, -8480, -9288, -5637, 665, 6611, 9351, 7654, 2403, -3896, -8329, -8883, -5306, 741, 6486, 9212, 7550, 2250, -4088, -8479, -8792, -4943, 1158, 6668, 9013, 7114, 1881, -4220, -8342, -8512, -4641, 1420, 6777, 8871, 6739, 1470, -4371, -8118, -8089, -4300, 1494, 6613, 8651, 6596, 1392, -4478, -8186, -7965, -3977, 1829, 6689, 8406, 6226, 1135, -4474, -8026, -7799, -3847, 1960, 6835, 8399, 5952, 707, -4781, -7959, -7387, -3392, 2174, 6715, 8126]
1099H126k445n170n393l010P44M116N474M223J088k488m897n100k930O71L994
1114b997N479M285J038k684n114n013k602R72M041N258M021Q82k664n035m977
1129e110k519J167M222N232L734N44k836m869m653k249J153M114N121L636M49
1144G136k943m898m470j992J338M031M834L435M44k808m809m518k029J453M223
1159a573M932L243J11l018m721m224j760J512M109M818L156Jl157m755m048j443
1175f817J720M056M513K882m5l005m608m025j437J774M152M524K669l10l060m438
1191a455l738j332J685M024M470K763l33l251m590l676j039J992M064M227K405
1206F216m69l150m413l570r80K039M130M178K187p25l230m203l249q18J938L945
$$ y = [8126, 5681, 511, -4882, -7892, -7148, -3032, 2442, 6665, 7753, 5265, 368, -4732, -7662, -6991, -2997, 2482, 6767, 7805, 5121, 7, -5006, -7608, -6636, -2595, 2663, 6684, 7566, 4902, -133, -5110, -7629, -6462, -2240, 2992, 6726, 7270, 4434, -435, -5088, -7337, -6184, -2070, 3051, 6687, 7136, 4193, -705, -5175, -7167, -5829, -1798, 3036, 6471, 6915, 4107, -702, -5220, -7249, -5796, -1573, 3359, 6602, 6713, 3695, -1026, -5250, -7010, -5498, -1389, 3429, 6585, 6586, 3429, -1326, -5374, -6817, -5097, -1041, 3472, 6354, 6309, 3304, -1304, -5329, -6766, -4992, -840, 3684, 6353, 6043, 2983, -1455, -5193, -6525, -4840, -816, 3654, 6417, 6084, 2833, -1757, -5433, -6472, -4480, -416, 3811, 6216, 5747, 2597, -1816, -5386, -6366, -4327, -197, 3981, 6168, 5443, 2213, -1990, -5239, -6057, -4119, -174]
1222a74M035K241o76l286m320l226n97K175L954L833J992p82l181m182l147o19
1238e960K196M068L891J827j057l352m060k842l44K235L846L658J734j009l335
1253A496m048k784j80K356L833L451J513j061l207l884k727k25K341L886L506
1268D266J426j276l353l816k456j8K361L734L357J350j274l350l838k407J52K560
1284b582L748L105J058j345l212l623k260J20K486L723L130R81j506l292l482
1299b951k055K66K442L564K986R95j451l304l590k040M30K679L610K763O76j564
1315C456l160l327j915L80K569L637K782O29j754l317l215j609N90K521L361K603
1331D231O22j621l204l270j676O79K673L436K433L75j741l088l060j545O19K596
$$ y = [-174, 3861, 6102, 5426, 2140, -2180, -5406, -6003, -3828, 126, 3959, 5951, 5169, 1988, -2194, -5341, -5960, -3764, 304, 4195, 6022, 4965, 1613, -2447, -5289, -5633, -3398, 448, 4106, 5840, 4831, 1496, -2552, -5336, -5516, -3160, 673, 4124, 5637, 4576, 1369, -2515, -5242, -5467, -3126, 760, 4266, 5692, 4416, 1063, -2753, -5209, -5227, -2866, 868, 4225, 5575, 4301, 951, -2887, -5294, -5142, -2582, 1166, 4271, 5329, 3984, 772, -2851, -5111, -4991, -2505, 1218, 4348, 5329, 3823, 531, -2951, -5006, -4740, -2298, 1266, 4252, 5247, 3796, 492, -3098, -5138, -4708, -2029, 1581, 4344, 5020, 3456, 296, -3031, -4946, -4566, -1997, 1640, 4422, 5051, 3297, -20, -3235, -4844, -4254, -1733, 1628, 4231, 4853, 3232, 28, -3242, -4918, -4239, -1566, 1870, 4303, 4678, 2937, -151, -3211, -4756, -4137, -1541]
1347a541L440K502L48j920l270k992j236Q79K577L167K246L06j764l136k983j305
1363d682R20K706L202K115R0j878l038k765j168Q73K593L154K156R5j975l155
1379g57k724r83J066K612K981J960L0j908l075k714r89J157K752L010J761k28
1395C951j986k918k468q42J089K592K924J795j71k058k981k443p17J250K601K778
1411B396J633j98j990k920k443p28J310K732K820J470m36k104k790k200o08J282
1427b774K595K739J514m46k189k859k131m13J446K597K508J285m75k027k692k116
1443c438n12J384K647K613J259o34k172k660j926l41J379K548K511J271o22k228
1459A079k746j903j47J594K549K297R89o84k076k555j818k28J512K576K351R89
$$ y = [-1541, 1899, 4401, 4749, 2829, -441, -3433, -4669, -3790, -1213, 1954, 4200, 4506, 2742, -394, -3377, -4682, -3762, -1056, 2146, 4261, 4351, 2473, -565, -3330, -4498, -3625, -1032, 2122, 4278, 4373, 2398, -757, -3481, -4464, -3398, -786, 2195, 4155, 4185, 2277, -798, -3512, -4501, -3344, -592, 2418, 4179, 3951, 1965, -953, -3421, -4263, -3174, -582, 2342, 4137, 3966, 1908, -1073, -3516, -4233, -2983, -382, 2396, 4029, 3831, 1841, -1079, -3522, -4250, -2940, -208, 2612, 4082, 3646, 1542, -1248, -3448, -4056, -2774, -179, 2560, 4074, 3628, 1439, -1420, -3551, -3964, -2518, 79, 2587, 3872, 3397, 1370, -1322, -3438, -3950, -2566, 81, 2694, 3953, 3319, 1147, -1513, -3439, -3780, -2401, 147, 2658, 3929, 3307, 1079, -1667, -3570, -3717, -2123, 426, 2723, 3712, 3028, 952, -1603, -3421, -3649, -2137, 439, 2790, 3779]
1475C779q38k198k493j613n7J481K407K209J003p36k182k550j686J7J655K472
1491F70K121P86q44k130k415j583PJ649K507K126P08j021k216k342j336J80J611
1508a522K292J948P32r12k140k376j408K55J698K380J855N35r78k077k218j348
1524c284J94J664K389J920N26j122k188k198j143L40J689K229J789M95j075k157
1540F8k202j155M48J811K258J610K61j120k013j998j073L38J675K234J707L23
1556C172j213k131k008r48N17J705K112J555K99j148k104k036r62N81J846K162
1572A399J450P8j252k006j846q47N36J737K124J466R4j327k074j812o81O95J709
1589e57J945J293R9j208j959j840p65O79J803K053J253n5j339j955j671o52O84
$$ y = [3779, 2941, 743, -1750, -3363, -3420, -1939, 468, 2677, 3680, 2944, 762, -1788, -3474, -3457, -1802, 670, 2791, 3577, 2733, 603, -1812, -3395, -3388, -1739, 768, 2894, 3602, 2581, 365, -1977, -3313, -3133, -1522, 770, 2718, 3450, 2538, 398, -1978, -3386, -3131, -1433, 947, 2802, 3337, 2359, 282, -1936, -3284, -3090, -1426, 963, 2883, 3409, 2287, 99, -2099, -3242, -2902, -1213, 1016, 2805, 3300, 2225, 68, -2134, -3289, -2841, -1030, 1228, 2838, 3099, 1979, -34, -2032, -3105, -2767, -1092, 1142, 2849, 3172, 1959, -172, -2180, -3128, -2611, -906, 1206, 2761, 3060, 1912, -192, -2228, -3190, -2609, -763, 1399, 2849, 2927, 1675, -331, -2177, -3024, -2488, -751, 1373, 2839, 2933, 1606, -468, -2280, -2961, -2266, -557, 1388, 2681, 2780, 1572, -387, -2227, -2992, -2313, -510, 1543, 2796, 2741, 1402, -553, -2224, -2876, -2192]
1606b192J732J979J290p5j393k016j650n26Q34J733J848J095j03j282j912j632
1622b270n57P88J807J891J030k41j362j837j485m48P68J665J812J116j74j395
1638A108j958j513l45R20J741J736R13k62j344j840j470l70R14J784J762Q59l98
1655B237j428j753j296k53Q66J641J678Q92l25j418j851j322j77J003J691J549
1671A734P55l90j349j714j299k29R68J720J632P22n09j467j690j145q8R86J613
1688B50J519O99m71j459j712j139j5J078J636J416N68n22j355j604j103j04J023
1705a295J675J497N56o11j468j606r81O7J047J563J380N37n69j431j635r99J25
1722b148J133J603J292L82o34j381j492r11O3J071J597J318L87p10j443j469q08
$$ y = [-2192, -460, 1519, 2809, 2734, 1341, -675, -2325, -2851, -2017, -284, 1564, 2659, 2556, 1274, -638, -2270, -2827, -2039, -232, 1659, 2689, 2448, 1086, -751, -2236, -2684, -1916, -251, 1561, 2677, 2503, 1108, -850, -2363, -2708, -1788, -47, 1689, 2602, 2340, 996, -844, -2314, -2684, -1770, 14, 1776, 2635, 2237, 809, -944, -2240, -2493, -1627, 14, 1692, 2584, 2259, 841, -1010, -2332, -2509, -1506, 185, 1734, 2489, 2099, 750, -964, -2263, -2492, -1524, 196, 1828, 2550, 2041, 574, -1116, -2261, -2349, -1363, 250, 1769, 2468, 1997, 538, -1174, -2313, -2328, -1250, 386, 1802, 2370, 1848, 493, -1111, -2214, -2318, -1295, 380, 1877, 2433, 1822, 354, -1252, -2233, -2166, -1119, 444, 1824, 2361, 1792, 361, -1274, -2273, -2148, -1015, 588, 1880, 2262, 1628, 247, -1245, -2156, -2093, -1022, 575, 1893, 2280, 1570, 127, -1342, -2150]
1739b150J84J064J469J232M01o29j420j514q71K19J178J557J173K44p41j383j371
1756a358p66K19J105J512J187K48p96j429j354o43L03J115J410J067K30p20j367
1773c7j373p02L19J203J459J008J23q09j318j276o14L07J120J446J036J48q61
1790A179j435j276n11M59J157J361Q89N2p87j352j225n20M22J215J361Q51k6q54
1808I60j289j129m66M02J133J335R07J4r04j370j162l82N42J157J269P79m4q51
1826I01j299j142l89N29J213J306P37j75r20j277j007k87N30J151J207P24j23
1843A679r28j297r96k57N87J141J152O49j35q83j245j011l01O02J199J234O13
1860A803k51r82j238q93j75O13J125J145N98k22r82j250q95j15O85J164J055N03
$$ y = [-2150, -1966, -902, 567, 1799, 2200, 1571, 151, -1363, -2234, -2015, -837, 720, 1893, 2137, 1396, 13, -1358, -2124, -1905, -800, 712, 1899, 2147, 1351, -78, -1432, -2075, -1772, -657, 753, 1820, 2050, 1330, -37, -1410, -2112, -1793, -590, 869, 1877, 2000, 1191, -127, -1403, -2017, -1710, -590, 856, 1892, 2040, 1179, -256, -1532, -2043, -1584, -427, 934, 1823, 1875, 1088, -264, -1489, -2009, -1587, -372, 989, 1840, 1814, 960, -329, -1458, -1924, -1522, -389, 946, 1853, 1867, 963, -407, -1569, -1951, -1409, -252, 1017, 1796, 1752, 901, -398, -1540, -1929, -1400, -187, 1119, 1856, 1681, 761, -516, -1523, -1810, -1280, -129, 1078, 1802, 1679, 751, -546, -1542, -1799, -1212, -71, 1081, 1730, 1595, 712, -533, -1544, -1845, -1243, -44, 1190, 1803, 1552, 570, -668, -1561, -1736, -1123, 2, 1147, 1745, 1523, 541, -709, -1604, -1719, -1034, 130, 1185, 1688]
1878A688k88r10j156q54j56O44J148J094M91k98r64j167p96q9O39J103J076M93
1896A698k84r88j202q17j7P40J136R92L67l47r28j114p49n6P13J122J006L70m05
1915A237r82j098o59K3O93J050R47L66l63r58j112o82L6P47J106R10K95m04r43
1934B09j062o53L9P40J110R34K72m83j014j035n48J39P52J030Q28K51m52r52j028
1953i23n63J47P76J035Q07J78m86r25r55n25J19P63J012Q32J97n23r89r55m83
1972a461K19P66R89P59J51n03r70r59m54K25Q22J018O78R2n66r15q86m01K30P60
1992d06R60P22Q5n45r49q83l62K61P89R47O34Q6n45r49q58l83K93Q33R47O17l
2013A291n92q96q15l25K88P97R25O11oo18r23p88k72L48P94Q74N33k0n76q82p63
$$ y = [1688, 1400, 490, -666, -1520, -1676, -1032, 116, 1210, 1701, 1403, 439, -728, -1524, -1613, -974, 129, 1205, 1698, 1414, 426, -776, -1593, -1610, -870, 266, 1258, 1625, 1278, 350, -764, -1513, -1569, -856, 266, 1272, 1642, 1237, 255, -843, -1502, -1479, -786, 264, 1211, 1577, 1214, 256, -856, -1538, -1502, -755, 351, 1261, 1556, 1152, 209, -853, -1506, -1467, -727, 383, 1317, 1589, 1106, 92, -943, -1491, -1352, -600, 430, 1258, 1509, 1057, 105, -923, -1486, -1339, -563, 472, 1279, 1457, 971, 46, -909, -1434, -1315, -552, 460, 1292, 1489, 966, -23, -978, -1461, -1242, -476, 513, 1272, 1423, 920, -50, -1009, -1463, -1238, -416, 602, 1280, 1372, 806, -109, -995, -1396, -1166, -406, 554, 1276, 1361, 816, -133, -1016, -1378, -1117, -328, 619, 1253, 1339, 794, -155, -1013, -1396, -1103, -270, 677, 1294, 1291, 699, -197, -1012, -1337, -1049, -252, 673, 1284, 1278, 660, -263, -1051, -1323, -975, -181, 693, 1226, 1206, 630, -252, -1015]
2034a015l17L44Q18Q86N34o0o24q88p20k60L50P97Q79N22p7o37r17p03j81M02
2054h67Q13Q02M48j02o00q51o88k00L88P91Q36M60j49o54q43o18j41L85P74P86
2074G70M31j26o52q56o42j17M58P76P56L82j74o34q41o09r7M46Q06P53L49k31
2094I48o54q00n51m7M35P47P22L38j99o43p98n71m7M75P92O74L13k33o49p82n21
2115a051m2N08P59O88K72k63o81p65m60J2M80P47O52K56k75o62p59m67M2N07P49
2136B47O17K01k85o42o97m65K7M93P51O15K19l22o60p29m03O4N15P29N95J87l15
2157G42o84p08l89J03N30P23N51J37l30o45o71l68R7N28P09N44J35l49o60o48
2177f53l25J14N16O80N39J16l38o50o67l26J59N29O90N04R9l88o40o25l13J56
$$ y = [-1015, -1332, -988, -170, 716, 1250, 1190, 566, -322, -1042, -1302, -952, -155, 724, 1246, 1169, 532, -385, -1088, -1269, -867, -54, 748, 1196, 1094, 494, -357, -1045, -1245, -857, -66, 770, 1230, 1081, 427, -416, -1034, -1175, -790, -16, 770, 1201, 1075, 423, -433, -1075, -1192, -734, 42, 798, 1180, 1006, 372, -469, -1078, -1175, -729, 77, 830, 1179, 948, 294, -506, -1057, -1104, -669, 78, 800, 1138, 939, 296, -502, -1073, -1120, -645, 147, 821, 1134, 901, 252, -530, -1051, -1093, -585, 174, 862, 1134, 871, 190, -575, -1035, -1023, -543, 204, 856, 1112, 837, 175, -584, -1051, -1009, -502, 247, 864, 1065, 780, 138, -559, -1024, -997, -504, 247, 862, 1081, 759, 99, -630, -1033, -969, -454, 275, 870, 1057, 742, 58, -650, -1039, -936, -406, 317, 868, 1005, 675, 30, -641, -1009, -912, -384, 325, 869, 1004, 655, -5, -653, -978, -864, -348, 332, 871, 987, 649, -1, -668, -994, -835, -306, 384, 888, 987, 599, -41, -666, -979, -823]
2197h23N58O86M79N7m06o55n95k44J69N37O48M46M7l72o33o03k47K07N32O48M30
2218H66K2l92o31n55k50K04N45O42M22Pm16o42n44k11K36N63O19M05k8m20o40
2239a98n38j72K55N72O00L44m2m28n98m92j77K41N33O10L44l7m28o14n08j27K58
2260f02N45N70L33n5m34o08n01j35K82N86N79K98j03m56n83m65r8K93N60N46K75
2281H27j13m62n70m15o6K83N26N19K74j08m24n82m18r1L03N62N27K66j48m64n54
2302c28l94p7L24N53N16K30j52m78n51l83k6L50N20M82K05j48m62n55l63j3L36
2323d14N36M65J79j82m39n16l46k3L23N18M71K16j78m95n34l23J8L52N29M40J65
2344G62j96m67n30l20M9L61N21M46J22k26m50m92k96M7L45N16M22J37k31m64m99
$$ y = [-823, -265, 421, 900, 957, 551, -104, -699, -943, -774, -237, 411, 857, 904, 532, -101, -704, -951, -744, -212, 436, 866, 888, 496, -135, -690, -940, -736, -191, 451, 873, 880, 464, -178, -722, -933, -697, -134, 485, 890, 862, 442, -198, -736, -908, -653, -81, 519, 863, 821, 393, -205, -697, -874, -633, -100, 510, 854, 817, 389, -225, -733, -860, -602, -57, 513, 846, 791, 357, -251, -752, -887, -605, -19, 560, 858, 755, 299, -284, -749, -847, -554, 6, 552, 827, 714, 252, -318, -733, -799, -516, 10, 529, 803, 695, 271, -311, -729, -820, -517, 45, 572, 838, 690, 226, -328, -722, -799, -475, 78, 594, 824, 672, 194, -357, -740, -766, -416, 104, 586, 791, 643, 181, -374, -737, -750, -414, 122, 587, 766, 584, 145, -371, -717, -740, -417, 101, 572, 788, 610, 115, -419, -742, -724, -372, 157, 597, 762, 566, 99, -431, -751, -702, -341, 180, 626, 748, 522, 72, -420, -716, -669, -324, 192, 614, 751, 520, 56, -443]
2365d43k83P0L68N02M03J06k21m51m86k84O7L71N24L99P5k44m81m67k46R0L83
2386b48M86L75R7k63m79m60k22J14L72M76L38Q7k50m31m69k25R1L89N14L37N2
2407F81k92m53m20k07J23L77M69L44O0k67m70m45j82J44L96M67L06Nk65m49m13
2428d91j92J74L79M66L05j3l11m28l87j56J38L76M60K87K7k91m65m21j41J90L99
2449i5M31K69k8k89m27l69j57J74L99M52K64m6l18m29l51j01J78L75M08K68k8
2470E80l12m38l53r0J91L99M16K07l8l15m18l46j07J94M16M27K15o9l50m28l13
2491e32n2K08L83L76K16q5l06m21l21n4K17L92L67J95r5l05m06l03n5K10L76M09
2513D14J82j01l46m15k79k0K47L53L84J67j09l23m05k92k4K58M08L48J30j28l40
$$ y = [-443, -726, -656, -288, 214, 617, 723, 502, 51, -435, -719, -652, -281, 243, 642, 717, 473, -8, -475, -721, -631, -248, 238, 613, 710, 447, -32, -492, -714, -600, -228, 248, 586, 673, 423, -8, -477, -702, -611, -222, 292, 629, 681, 389, -64, -484, -691, -568, -191, 278, 622, 682, 415, -55, -500, -682, -538, -142, 325, 631, 636, 371, -78, -491, -683, -509, -130, 336, 641, 628, 317, -111, -498, -654, -516, -140, 320, 607, 634, 343, -122, -543, -684, -494, -95, 336, 605, 577, 288, -139, -508, -665, -491, -92, 360, 624, 578, 260, -169, -520, -621, -443, -68, 340, 608, 580, 268, -170, -523, -613, -422, -23, 393, 600, 562, 247, -171, -517, -624, -430, -14, 413, 628, 559, 209, -219, -532, -584, -376, 7, 383, 599, 514, 208, -213, -534, -588, -371, 21, 388, 583, 488, 183, -223, -526, -581, -371, 5, 414, 596, 495, 149, -266, -545, -565, -318, 35, 419, 586, 477, 154, -251, -543, -567, -309, 99, 447, 577, 449, 109]
2534A09l61k53k3K28L85L49J47j30l36l79k58K7K32L53L22J50j20l21m00k59J1
2555e27K56M03L23R1j45l42l40k31pK48L74L40J10j51l63l57k02M3K70L36L07
2576D36P9j36l34l34k25K2K67L69L06O7j60l18l34k09L6K43L62L15J03j91l52
2597A2l64j69J00K74L37K59N6j78l00l34j97M9L04L52K67L1k04l12l04j51M9K70
2619a53L23K72N6j88l45l07j66J00K70L37K24M3j62l29l20j71Q9K84L70K39Jk31
2641B36l09k71j20R5K52L20K35K2j90l29l06j12J19K84L06J99kj81l13k61j30
2662d56R0K82L30K12rk30l20k49j07J05K68L15K10jk16l32k94q3J47L17K75J70
2684D24m6j96k90k59r1J18K73L22J78k9k32l09k49m0J20K69K72J88j9k24k96k62
$$ y = [109, -252, -505, -528, -300, 85, 434, 581, 451, 115, -264, -522, -495, -263, 90, 412, 562, 442, 121, -279, -538, -527, -271, 132, 455, 546, 401, 59, -281, -512, -519, -271, 103, 443, 553, 402, 39, -318, -520, -477, -207, 129, 436, 515, 379, 45, -289, -514, -492, -225, 144, 450, 517, 357, 39, -295, -504, -468, -225, 137, 452, 555, 364, 12, -352, -521, -421, -147, 190, 449, 505, 327, 27, -307, -504, -455, -151, 201, 468, 499, 295, -17, -321, -472, -423, -153, 170, 442, 498, 310, -35, -342, -508, -408, -138, 199, 423, 466, 304, -25, -345, -516, -427, -143, 227, 466, 467, 236, -73, -344, -464, -369, -117, 203, 438, 460, 270, -59, -365, -477, -358, -74, 232, 431, 429, 248, -65, -326, -456, -366, -84, 246, 458, 449, 219, -101, -350, -457, -352, -84, 231, 441, 440, 224, -108, -402, -485, -338, -21, 254, 424, 378, 182, -108, -367, -458, -340, -67, 255, 433, 404, 172, -137, -386, -426, -306, -37, 235, 423, 404, 180, -116, -378]
2706c78o9J65K84K81J56p0k19k66k40p1J44K86K87J69r0k53k88k05j1J44K51K55
2728B62J42l9k17k93k45k6J74K79K58J05p2k12k79k03n3J46K91K83J27r3k69k86
2750b20j64QJ62K50K39J13o4k24k95j97j8J97K89K42P4r8k24k56j60j1J53K57
2772E3K68R4r7k59k63j68J6J96K58K08O7p6k28k63j84J0J96K80K11N5j17k31k34
2795b08j41J3J53K49K33Q9j25k43k66j23L9J95K33J88P2j06k32k30j73L6K11K55
2817A19K09L9j48k21k22j28M2J77K46K07N3j36k47k41j10N9K22K32J51M4j39k07
2839Ak29j25M8J98K52J98J9j64k42k15p7O1J81K22J76L2j44k47k18r9J04J98K16
2862A46J47lj27k04k03j02P0J96K47J53Kj69k19j92o9Q8J75K08J50K3j32k36k23
$$ y = [-378, -447, -282, 2, 283, 439, 369, 150, -116, -356, -427, -283, 3, 290, 459, 369, 116, -172, -377, -388, -244, 7, 262, 404, 365, 148, -145, -390, -416, -242, 37, 295, 400, 328, 116, -163, -366, -419, -273, 18, 301, 428, 335, 66, -220, -384, -376, -214, 36, 275, 388, 324, 100, -195, -392, -410, -213, 76, 318, 392, 294, 70, -186, -346, -357, -204, 53, 321, 415, 318, 59, -204, -372, -356, -160, 98, 306, 373, 297, 69, -194, -378, -368, -172, 108, 319, 374, 257, 26, -208, -349, -336, -183, 66, 299, 388, 263, 20, -246, -369, -330, -135, 98, 286, 358, 252, 20, -210, -383, -347, -136, 119, 328, 367, 219, -2, -224, -352, -310, -133, 113, 320, 373, 237, -10, -251, -361, -302, -80, 152, 303, 347, 208, 1, -228, -353, -305, -107, 145, 343, 362, 198, -44, -259, -336, -275, -94, 128, 304, 336, 192, -55, -273, -372, -268, -70, 146, 293, 290, 163, -41, -244, -346, -276, -80, 167, 320, 322, 153, -66, -258, -327, -239, -64, 144, 294, 317, 185, -51, -274]
2885b74o9J01K02K41J14k1j45k12j86o9P5K11K35J33k5j80k33j53n1J03J84J73
2907A54J57pj66k13k00n7J28K01K01J10m9j54j87j60o7Q9J99K03J33l7j77k37
2929a36j57j5J01K07J84J12m0j57k08j73k8J33K03J80Q6n9j47j97j43l3R9J94
2951FJ98J06m6j75k21j48OJ13K04J54Q9m2j57k05j56k2J47J93J86N9p6j68j85
2974a40j18j3J33J64J92P1p4j81j95j06J0J24J88J43O1m8j68j84j39NJ36J95J82
2997B38N5r8j60j79j01PJ24J80J62P4r0j72j98j08L7J44J81J36L0p3j57j70j30
3020b68K2J34K13J30L0j00j61j53r2J8J11J80J39P2r5j81j75r3L7J46J84J07L7
3043B42p1j78j60r1K8J40K00J36K1j28j74j30p6M7J18J61J29L6r2j73j63p7N9
$$ y = [-274, -343, -242, -40, 201, 315, 294, 149, -63, -249, -318, -243, -32, 203, 336, 311, 131, -102, -255, -306, -203, -19, 154, 311, 304, 138, -75, -275, -332, -204, -3, 198, 308, 259, 105, -82, -242, -309, -220, -21, 182, 315, 278, 101, -136, -293, -308, -207, 0, 184, 296, 256, 99, -109, -282, -310, -177, 26, 206, 292, 233, 86, -111, -254, -287, -188, 6, 204, 310, 264, 89, -132, -280, -274, -161, 43, 197, 286, 244, 87, -118, -274, -296, -149, 44, 230, 289, 213, 45, -140, -258, -271, -138, 26, 218, 289, 215, 34, -161, -267, -257, -133, 55, 198, 259, 211, 43, -141, -280, -275, -139, 56, 238, 293, 195, 35, -144, -245, -238, -114, 66, 228, 302, 212, 40, -158, -266, -229, -85, 96, 232, 262, 189, 32, -138, -268, -246, -112, 101, 231, 261, 161, 0, -153, -245, -227, -116, 64, 203, 275, 180, -1, -176, -269, -232, -86, 98, 205, 242, 171, -7, -167, -258, -230, -90, 110, 246, 267, 139, -35, -165, -241, -194, -76, 85, 214, 250, 158, -15, -178, -255, -196]
3066a96J43J63J17J7j03j35j57r4K1J52K05J15Nj37j56j45n1N8J28J50J16Qr5
3089A29j74j57m5O4J56J56R2qr9j58j47n0M1J57J62J07oj20j69j19m4P3J40J34
3113A15J06j4q1j69j58l3O7J65J45Q2k4j13j53j27k0N3J39J57R6k4j30j51j15
3136a87l3R1J18J39Q4j3j10j60j34k8P1J54J57P1m4j41j29j01k9P9J39J49Q3l5
3160A91j27j72j10nR3J51J08P4l6j11j31j17k4Q8J66J15O0m8j16j37j05jQ0J32
3184A8J42O6m1j35j56r4PJ06J28J12M6m8j12j35j01mR6J50J18L4n5j31j29o8L
3209a83Q8J24J21M1l8j42j38q5K0J02J41R9K7l6j10j49j02L8R7J45J25Qp0j22
3233Aj17o1J8R8J29R1L1m5j26j45o5K9J09J35Q7K5p3j19j11o7NQ9J61R6Pp0j35
$$ y = [-196, -53, 110, 227, 244, 141, 6, -151, -245, -224, -72, 133, 248, 253, 116, -40, -185, -236, -178, -50, 100, 216, 224, 129, -45, -202, -247, -183, -27, 129, 221, 213, 114, -44, -191, -241, -200, -43, 119, 226, 220, 100, -69, -188, -232, -159, -19, 115, 221, 207, 126, -43, -201, -234, -167, -2, 143, 225, 201, 88, -65, -192, -212, -159, -20, 137, 233, 209, 79, -72, -187, -220, -129, -11, 128, 212, 199, 89, -71, -205, -233, -162, -8, 149, 220, 176, 35, -94, -195, -224, -145, -6, 143, 226, 191, 64, -108, -218, -223, -130, 21, 129, 203, 167, 56, -75, -192, -216, -128, 38, 153, 213, 165, 49, -88, -193, -194, -114, 18, 160, 226, 185, 50, -106, -200, -193, -87, 41, 153, 199, 151, 39, -96, -197, -201, -105, 45, 163, 197, 142, 11, -118, -186, -183, -95, 29, 150, 191, 153, 11, -127, -212, -192, -90, 51, 150, 177, 141, 31, -118, -220, -182, -85, 60, 185, 193, 123, 1, -116, -177, -159, -61, 68, 159, 190, 145, 19, -126, -191, -162, -53, 82, 169, 194, 121, 2, -109, -176, -171, -82, 79, 175, 182, 112, -23]
3260b3j08m9L6J00J11J04Rq1j24j18o0N0J07J34O3%p1r9j06o4L1J16J19J00j1
3285A66q1j21j01n1N4J15J03Q4J5q4j29j07l6N1J01J23O7Oq5j26p7o6N3J15J09
3310I8Q8k3q5j35q3k6N6J13R8M0j0p1j07r6k8M3J19J13N2j8r5j09q6j7N1J05J27
3337A14N0k5q9j36o7jO3R4R5N3k4p6j12q7j9O6J23R6N0m0r5q2r2kN1J00J08M7
3365A63j7j02j17o6nP3J07P2N2m4q5j07p4mO9J14R0L0m5q8j04n6NM8J11R0K8l1
3393A07q8j05o1mP6J07O7L4j7j01r1p3J5O2J05R7K0n0r4r6m8J2P9Q7Q1K0m3p6
3421B2j14m3PR3Q0Q9Kn5p5q2o3%Q4J05Q4J1m7r9r4n5K1P9Q6P2J0l8q8r4n4L6O3
3452e7J04P3kn6p2r6k3JQ3R8O4J0n4r1q8k3M3N4R7O7j0k9j02r0m1N0Q1R2N4j2
$$ y = [-23, -131, -180, -144, -44, 67, 171, 180, 99, -25, -143, -203, -153, -46, 88, 151, 151, 80, -19, -125, -189, -158, -42, 77, 177, 166, 85, -36, -137, -188, -134, -19, 84, 168, 183, 99, -30, -137, -173, -122, -21, 102, 169, 175, 90, -36, -113, -179, -126, -11, 98, 186, 163, 78, -57, -140, -166, -110, 3, 101, 141, 131, 60, -47, -143, -171, -128, -9, 104, 156, 138, 43, -66, -152, -169, -118, -13, 114, 164, 139, 50, -86, -153, -154, -91, 3, 98, 151, 127, 51, -61, -148, -167, -101, 22, 118, 168, 128, 33, -49, -141, -143, -92, 8, 116, 163, 146, 44, -73, -139, -144, -71, 36, 108, 160, 116, 31, -76, -150, -154, -85, 29, 119, 149, 104, 16, -88, -144, -139, -91, 20, 110, 138, 107, 19, -86, -147, -151, -75, 32, 99, 133, 116, 15, -76, -149, -134, -72, 33, 130, 150, 100, 6, -90, -138, -126, -47, 40, 121, 141, 98, 22, -92, -135, -128, -35, 45, 134, 136, 81, 6, -76, -139, -139, -55, 50, 134, 145, 98, -1, -95, -150, -129, -50, 36, 108, 118, 80, -8, -102, -156, -120, -57, 47, 120, 118, 62, -10, -106, -129, -128, -45, 53, 117, 127, 73, -18, -106, -129, -86, -32, 65, 132, 122, 93, -9, -99, -140, -90, -9, 83, 137, 125]
3482A25n3q5r9oJ3Q6R1O3mp3r0o8k8J9R3Q8M3Np3p4q3k3L2Q3Q9L9ro5p1q0j0L5
3514i0O8Q6O2j2p6q3p9j0L8Q9R3K8po2p6p4j4K5Q5R5K7j5n8p0p5nL8Q2P8L6k2
3545A02p2q4n3j9O4P0Q7J4j7n5q8n9j7M5R4P4L1k9o4q0o7KM8Q6O2L4k0o3r2n0
3575a16KM2Q8P1K4k6o4q5n1lO3Q5P0J8k5q4o4m9RM2Q5P2J8l4q6o0m7K9L1Q6N2
3606I3K6l8p1p5n0K8N5P3M6J7m8o0o5n0J9N8Q4M2J8n2n9q2l2K0O8P4N1Mm0o9n5
3637g0l3MP6P0M1Lk6q5o5k4K5O2O5M0K6n2o7o9j5QP3N5O2lm8o6o1l0L1N9O6N2
3669A04qm3q4o0j3K9O3P4L2%o4n8n5j3K8N6O0M3j7l6p2n6k2M0O9P4K0jm8o8o1
3700h7k4M8N4O7L0Kn5p7n2mM8O6N4M1k2n0p1m7qM0M9O0L6k3m8o5l6k3N0M9N9L2
$$ y = [125, 72, -13, -112, -118, -105, -19, 72, 135, 131, 58, -32, -100, -128, -109, -16, 72, 115, 120, 47, -27, -110, -133, -101, -18, 71, 110, 101, 36, -35, -115, -125, -90, -22, 64, 126, 114, 38, -45, -124, -134, -96, -7, 86, 114, 107, 45, -31, -105, -119, -94, -9, 86, 113, 98, 40, -30, -105, -110, -72, 10, 88, 124, 102, 30, -54, -107, -126, -62, 8, 95, 109, 92, 37, -51, -110, -127, -82, 12, 86, 117, 88, 24, -56, -123, -121, -73, 13, 75, 109, 89, 26, -66, -116, -114, -72, 16, 87, 111, 85, 21, -64, -115, -118, -55, 30, 100, 118, 93, 9, -55, -104, -95, -53, 32, 104, 122, 88, 2, -58, -105, -76, -45, 41, 93, 119, 81, 10, -65, -115, -87, -32, 41, 87, 104, 56, -4, -69, -119, -100, -42, 42, 84, 102, 50, -9, -91, -123, -103, -35, 39, 90, 94, 54, -15, -70, -103, -99, -23, 47, 88, 91, 65, -20, -85, -109, -84, -22, 43, 83, 109, 57, -10, -79, -94, -86, -13, 42, 104, 101, 53, -13, -74, -104, -73, -14, 52, 104, 96, 53, -31, -91, -104, -75, -12, 62, 94, 94, 30, -28, -83, -96, -68, -12, 48, 91, 74, 38, -34, -90, -112, -72, -3, 71, 91, 90, 42, -26, -87, -111, -63, -9, 58, 88, 90, 35, -42, -94, -98, -50, 16, 70, 111, 89, 39, -32, -79, -87, -47, 2, 62, 98, 75, 27, -38, -74, -97, -47, 2, 61, 93]
3732I3po8o4m8JM4N7N9J8k0n5p8k3j2M2P8L7L2l0o0n7k0j0M3N8M6L0j1p1n8k7
3763h1lM6N2N5K6k4n3o3l7lM4O1N5J6l1m9p6k2J6M2O0M3J9l7o5m8l4J6N7M2L8
3794F2J5l2n3o0k0NN5O2M2Qm6l9o7j0lN4N4M4Nl3o2n6rNN7N9L4J0m4l5n6l8K4
3827f8N8M3N6j4k5o5l8j8mM5P2L7jl3n2n8k1K6M7N5L0j1k8m5o2jj3P2L6M5km1
3859B2m8m5j4K5N5L5J8Rl8m3n4%L0L5O1J9jm3n2l4j3K7O5L7J4J7o1n1l4j8M6L5
3891AM6L4pm8l9m4k4K9M9M6K5j7k9m9l7j4L1N0L6K7j7l3m9l6LL2M3L0J3km6n9
3923e5l3%L6N7M0Oj0l1n0k8J0L0M8L3K9k4m7l8m5J9K6M5K5J5ql9m1k8qK3N8M2
3955E7K0l5m1m0k3NK0O4L4J0k8m9m8k6J6M9M4L1Ml4l1m5k8J0K3N4K3J4j4m4m2
$$ y = [93, 86, 18, -46, -94, -93, -49, 8, 67, 85, 65, 10, -68, -91, -103, -61, 17, 54, 86, 56, -4, -61, -81, -91, -48, 10, 56, 86, 75, 4, -54, -81, -84, -38, 14, 69, 95, 71, 18, -45, -82, -85, -41, 20, 75, 91, 60, 11, -65, -87, -71, -29, 31, 74, 93, 56, -9, -57, -91, -75, -18, 24, 62, 77, 45, -8, -68, -88, -83, -28, 34, 76, 84, 38, -1, -68, -78, -81, -27, 27, 71, 76, 43, -19, -75, -84, -79, -22, 37, 71, 81, 37, 2, -54, -92, -68, -10, 33, 89, 75, 50, -15, -53, -71, -75, -30, 42, 79, 78, 45, -7, -65, -86, -60, -13, 42, 72, 61, 33, -12, -74, -75, -88, -16, 20, 65, 63, 22, -26, -71, -85, -60, -5, 30, 48, 57, 19, -24, -78, -78, -48, -13, 48, 67, 66, 23, -29, -63, -76, -49, 16, 53, 67, 84, 23, -28, -62, -80, -34, 1, 47, 81, 74, 26, -13, -57, -81, -52, -3, 43, 68, 51, 22, -27, -64, -78, -47, 3, 39, 66, 49, 16, -33, -69, -66, -34, 9, 39, 52, 50, 4, -55, -88, -88, -52, 5, 45, 51, 41, 10, -40, -68, -58, -28, 20, 53, 82, 58, 11, -27, -72, -53, -27, 18, 43, 58, 50, 11, -30, -58, -66, -43, 15, 57, 77, 42, 1, -39, -62, -57, -37, 27, 61, 71, 43, -6, -54, -80, -64, -15, 29, 60, 64, 30, -1, -46, -74, -64, -41, 13, 36, 50, 36, -8, -50]
3986e0j0LK8L8L3K5l0n0k8k4K0L7M1K2lj8m5k5j8JL1O2K1jk0n3j8l3K0L4L1K7
4018D8Nk3l2n7k1L1K4N7%Jj7m1k1l1J4M5M8J1oj2n2k8qJ4L1M0K1Ol0k5m1j4J5
4051d8M4L2L0j8k5k0l7mKK8M6M0j0m1m2k6LK2K8L0K6pj9n1l4OJ5L8K6J4j2l1l2
4084b7j0j6QK6N2J1pl8l0k5LL4J6L0QKk3m2l8J0J5M2M8pjl3k9j9j4L0L2M1Lqk4
4119B0o9MKK9K8J5K3k5j0k5l1j6L7M2J8Nj1l6l6MpJ8K7K5J8j6l7l0k7J1K9J7L5
4152C1Mnl7l0k2LJ4N3K2J3l4l0j2j0%K1J7M2Mpl6l0j5nM0L1K8j0k6j2k5k7QM2
4186@K2L1qj3m4k3j1J9L7RK1Jk0k6l2j1OJ7L6QLrj4l7j1J2J9M6LLl0k9j5nJK7
4222a7L1J1Mj5j8m0ROK2L8jOk2j6k1k4J1K8K8K6ml2k3k2%J5K5K4KJ3k5l3k7pJ2
$$ y = [-50, -60, -57, -29, 9, 42, 67, 37, -13, -41, -65, -45, -8, 33, 55, 52, 34, -11, -36, -54, -53, -22, 40, 61, 60, 40, -13, -31, -64, -44, -10, 21, 48, 53, 30, -2, -59, -80, -49, -25, 32, 32, 33, 16, -25, -46, -77, -63, -18, 30, 41, 35, 23, -29, -57, -65, -51, -20, 20, 41, 47, 17, -8, -49, -63, -48, -4, 28, 58, 40, 15, -5, -42, -46, -44, -16, 30, 70, 60, 19, -23, -49, -46, -24, 4, 34, 60, 53, 34, -17, -51, -45, -30, 8, 34, 48, 36, 5, -27, -37, -53, -45, -19, 33, 44, 37, -1, -31, -56, -53, -19, -3, 27, 35, 37, 14, -28, -66, -56, -41, 1, 49, 42, 41, 8, -21, -40, -54, -24, 8, 49, 52, 44, 20, -49, -45, -43, -14, 14, 29, 52, 27, 17, -8, -39, -55, -18, 24, 42, 47, 36, 0, -36, -32, -39, -21, 6, 31, 49, 33, -4, -34, -61, -50, -21, -4, 31, 35, 30, -7, -37, -59, -56, -42, 11, 33, 46, 12, -18, -30, -40, -40, -19, -2, 40, 44, 37, 1, -29, -44, -49, -9, 22, 50, 40, 14, 2, -23, -50, -42, 0, 22, 53, 45, 32, -12, -35, -46, -27, 10, 19, 40, 41, 21, -5, -37, -48, -42, -25, 11, 19, 22, 13, -1, -38, -49, -37, -18, 28, 31, 34, 4, -25, -40, -45, -44, -17, 14, 25, 29, 14, -4, -44, -35, -29, -7, 31, 30, 36, 14, -2, -23, -47, -36, -8, 20, 46, 42, 10, -13, -35, -35, -20, 5, 29, 31, 44, 19, -14, -41, -48, -36]
4257c6L7L3Nj6k6j6j7j0LK5L0K7j1k0k7k2%K6J3K2Lkj7k1l3mK0L3K1K4k3j4k4
4290a7k0J6lK8J9J8Pm2k5k7J1K1L2K0j2p%k3k0pJ2L0K3pqj7l0ppK6J1L7jj7j7
4325ck1k0RK1K0K4mk7%j5k6PJ2J9K5Mj6j7j4k0OK0K4J4J5j1k6k3j0RJ0K8K4kj4
4360B2nl5kj3J3L5L6pk1k3k1JrJ2K6K5oj5k2k9MoK4K2J6nrj3j8rqK1J8L3Nk3k2
4397hk3rJ4RK4L0j8pj6j4j8J8K5J6J2jk4j7%lKRQL0j9Ml3k3NQK2JL0Mk3m1j8N
4435c9PL4J5K0j6j9k9mqLJ7L4Onqk6j6MJ2J8J7Mjj6k5j3kJ2K2J9Pmj5j1k0%J1
4472a5K0J4K3j8j9j4j5nK3J6J2klj0k2k0lJ8K5K3Nk0qk1rOnJ9OK1Jl4l4QPJ3J8
4509ARJQj4k1j1j4J4K0K9j1Lk5nonK0J6PJ3pk9ojmJ1J2K4Jrpk3j7jJ4J0K5klj8
$$ y = [-36, 1, 34, 39, 23, -3, -19, -36, -46, -43, -18, 12, 39, 28, 8, -19, -41, -41, -15, -2, 20, 23, 21, 4, -17, -50, -54, -34, -1, 20, 44, 21, 7, -17, -37, -21, -24, 4, 23, 41, 48, 6, -19, -46, -35, -14, 18, 38, 26, 19, 19, -4, -24, -31, -19, 11, 34, 27, 19, 2, -28, -35, -42, -16, -5, 32, 31, 14, -3, -24, -44, -35, -14, 6, 30, 26, -1, -1, -16, -42, -35, -23, -4, 21, 25, 9, -8, -22, -42, -36, -16, 8, 22, 37, 26, 0, -23, -33, -24, -14, 14, 38, 36, 22, 17, -18, -20, -33, -20, 15, 51, 44, 23, 0, -21, -20, -29, -17, 9, 34, 28, 13, -9, -38, -34, -40, -16, 6, 22, 17, 8, -5, -23, -32, -40, -19, -1, 32, 37, 14, -8, -31, -40, -26, -17, 7, 37, 19, 12, -4, -18, -36, -18, 7, 23, 35, 34, 10, -7, -7, -10, -8, 1, 9, 39, 20, 24, -9, -32, -27, -19, 3, 4, 34, 38, 15, -26, -44, -39, -32, 2, 17, 37, 21, 2, -27, -31, -39, -36, -19, 15, 21, 16, 8, -18, -34, -30, -18, 0, 17, 21, 20, 4, -21, -34, -36, -24, -2, 17, 24, 20, 5, -6, -26, -26, -15, 5, 19, 42, 24, 5, -9, -24, -29, -6, 10, 22, 20, 17, 7, -15, -35, -38, -20, 5, 28, 33, 13, 5, -16, -25, -19, -24, -5, 1, 22, 23, -11, -45, -37, -30, -17, 1, 10, 11, 19, 5, -16, -27, -41, -27, -7, 22, 11, 14, -11, -16, -22, -27, -7, 9, 16, 29, 22, -7, -13, -14, -18, -7, 5, 29, 30, 21, 14, -9, -26, -27, -13, -3, 22, 20, 17, -1]
4549ak0lKJ1K5lNqk0k5NJ0J3QNQj5j4Jk5J8QK8%Ljl1mj1J1K6JjJ8pj1k8JpJ5K0
4590GJ7jnj8mj8QJ2J4K6ok4j6Mj3QPJ4LMJk2pj3mK2J7KNk2nl1NJ4PJ3J8j1Nj9
4630fj1k2K6%J6NKlj1j7oJ4J7JlK0j6nk0QmQKL7mj3j0j9JJ4jJ7%%oj9j1JK0KK1
4671B5j6lpoj1Nj1J2K8pOj5k2KpJ9PKJ6j3plk1OMJ4OJ3nj0pnj2MK2RR%pj2j0%
4713hMRK9j9jrj5rnJ8J5oL2k2k5j7OKJ2K1j8J4kk7j4J0lJ2K1jKj2kqjLJJ4J5m
4753A2j8koNkKJ0J6j1Rrk6ONPJ5J1nqlj3j1mL1oK5j4pjj9rJ8%RqMMj6qmkJ9J1
4796GlJ1j0Mj5j8j6L7PJ1jmj2j4nJJ3J1J8j0j0%j7oK3jJJ0Kjj7n%NJ3LJ6qj1o
4836Ck4%K1ONrJ6k4Pj9oQK7KOnk1j7LJ2j0J3O%J4k0j1nO%L0j3J7Kj3j7JM%POJ2
$$ y = [-1, -21, -24, -22, -11, 14, 11, 16, 8, -12, -37, -32, -22, -9, -1, 4, 12, -3, -17, -16, -41, -23, -15, 13, 13, 16, 15, -16, -20, -31, -20, 6, 7, 6, 24, 17, 6, -22, -21, -28, -13, 7, 24, 23, 18, 0, -4, -22, -14, -2, 12, 38, 32, 8, -8, -4, -17, -9, -2, 12, 15, 19, 20, -2, -9, -22, -26, -4, 13, 15, 20, -2, -7, -38, -33, -19, -12, 1, 19, 8, 13, -6, -17, -39, -13, -13, 3, 8, 10, 7, -4, -21, -27, -13, 4, 5, 2, 22, 6, 1, -19, -11, -15, -7, -5, 32, 28, 15, 5, -14, -13, 1, 0, 17, 17, 17, 11, -8, -19, -18, 2, 4, 25, 9, 6, -1, -7, -18, -13, -24, -12, 16, 9, 15, 0, -22, -20, -27, -8, -1, 1, 17, 4, -3, -6, -27, -21, -17, -3, 3, 16, 11, 1, -6, -11, -23, -19, 3, 12, 21, 21, 14, 2, -8, -8, -4, 5, 34, 15, 14, 5, -10, -19, -24, -6, 9, 3, 35, 13, -12, -29, -23, -21, -9, 12, -6, 8, 6, -21, -35, -25, -28, -16, 5, 4, 6, -6, -8, -16, -17, -14, -13, 1, 16, 12, -6, -8, -14, -9, -11, -9, 1, 17, 6, 15, 6, -20, -14, -9, -2, 13, 24, 19, 11, 8, -5, -16, -20, 11, 5, 30, 16, 9, 8, -11, -20, -2, -2, 7, -1, 3, 7, -9, -17, -21, -23, -4, 7, 4, 15, 5, 9, -6, -24, -40, -3, 4, 15, 14, 10, -2, -16, -21, -20, -7, 4, 22, 12, 2, 2, -15, -21, 2, 1, 2, 12, 14, 13, -4, -9, -9, -4, 9, 12, 28, 20, 9, 3, -21, -21, 0, 6, 11, 2, 18, -6, 1, -18, -24, -16, 11, 13, 19, 14, -7, -24, -21, -9, -19, -6, 0, 0, 14, -6, -17, -22, -16, -16, 14, 1, 18, 20, 7, -10, -9, -5, -5, 2, 8, 20]
4878B0qjj0j3kJ5J1j1K4Ql1lqKJJ5J1Kj6Jj8j3J3JPJ1PJk2j7J9rJJK7jj1Jk5L
4918a7nMNJ4LKj2j1L%J2nK1pRj6k2MJ5J0jQMkmj3j7LJ4J6K%j0Kkj1rJJ8J7j6R
4960A6k6j0OpK0N%Oppnr%PPJ2j0J2k1j1Rj5J9KJ1LonknlOJ4J6j2j0pmL%KK3jn
5004A1rjplJ3oJ0NJ4k0Kk1Qj3J4OJ1oJj8LjJ%QKmoqmKJ1%PlJ8j1j3qoJK5pJ1P
5049A6k5LqMJ1qJ3QNmk3MkJJ0J6rJ2j4opmJ6oJ6j0JNk3J2Lj3LJQkk1K0j4p%J6
5091bJ6qoNok6J2PJ2Lj3J9j4kk0J7MPQMj3JjmKlK1j7J4Loj3qKMJJ2Rj2qj3MNP
5135Dj2J4JnJqqMlJ4kJ3Jj7lm%nJ6pLJpjj4PKJ6J0Krj4QJoKJ7lNkmj7jK1jNol
5183FJ1lj2kkJJ6jpmj2lJ1lJjQNkplJjMQOqJ0k0j6MMJ7lojJ1j4nkMMRLJKJj2j4
$$ y = [20, 12, 11, 1, -12, -14, 1, 12, 1, 25, 33, 2, -1, -9, -7, -6, 9, 20, 22, 6, 7, -11, -24, -11, -10, -3, 8, 15, 16, -6, -23, -4, -13, -12, -11, 16, 15, 4, 5, -20, -17, -22, -18, -13, 1, 4, 6, -6, -17, -14, -14, -2, -7, 14, 7, 16, 0, -22, -18, -3, 7, 6, 14, 18, 16, 12, -1, -18, -15, -1, 15, 17, 17, 7, 9, 7, -4, -13, -12, 6, 23, 7, 16, -10, -20, -14, -21, -1, 4, 4, 10, 3, -4, -9, -18, -18, -11, -4, 8, -2, 10, -11, -22, -13, -28, -9, -7, 4, 7, 1, -4, -6, -11, -14, -8, 6, 22, 10, 0, -7, -11, -8, -8, -6, 17, 16, 11, 2, 1, -6, -9, 4, -2, 8, 13, 27, 7, 9, -12, -4, -17, -3, 3, 14, 8, 9, -9, -6, -7, -6, -6, 2, 4, 0, -6, -14, -18, -16, -5, -5, 2, -1, 17, 6, -7, -15, -21, -20, 5, -2, 9, 16, -9, -6, -14, -10, 1, -7, 6, 14, 19, 15, -8, -4, -6, -5, 5, 21, 12, 24, 10, 4, -3, -7, 9, 3, 19, 9, 10, 15, -8, 4, 7, -6, -3, -2, 6, 4, -17, 3, -11, -18, -18, -2, 14, 6, 0, 5, -1, -27, -15, -8, 4, 7, -6, 13, -1, -3, -23, -6, -2, 5, 13, 17, 4, 5, 4, 0, 2, -1, 20, 3, 17, 20, 14, 1, -7, -5, -1, 0, 12, 21, 9, 1, -12, -8, -3, 4, -8, 6, 7, 2, 3, -5, -13, -9, -12, 2, 0, 13, 14, -3, -6, -10, -10, -15, 1, -6, -3, -2, -9, -10, -24, -17, -15, 1, 11, 13, 4, -10, -2, -1, -7, -5, 12, 9, 14, 12, 8, -9, -10, 11, 10, 15, 9, 6, 17, 14, 2, 0, -2, -1, 15, 14, 7, 3, -9, -12, -1, -4, -3, -4, 4, 9, 7, 0, -3, -2, -3, 1, 9, 15, 7, 17, -3, -19, -15, -11, 6, 3, -3, -4, 7, -7, -12, -14, -10, -6, 3, 6, 7, 9, 10, -2, -16]
5232a6J8oOJ4Kkj2pKkNj1J0J5j7lJKj2LK3nlMj7QpnJ1J5j1J1j7Jj3OMmQJJPqm
5276dj0LJ0KJ4j8Lj1J2j2nJ5J5mJ3j6jj4%lK8j2QPj3q%JMJ0j4K3Jj6Jj0mkMJ3
5316A0j9JLl%nMNQjKj5jNKqK2j4NJ6k6QLj4MjNJ4KpMj7J1j3J3KJ6j4Noj2OqPJ5
5361A4Qoqj1nJ5lJ5kpj0KNj7nLJ0J2lmrojqJ0mJ4J6j7NLk3OlLJ9%jnj3KQL%RJ
5407A2Jk%k1J5jLJ4qkmnJj9J2RJ1Jk4J3omLOmJ0nnj2%m%PJKln%KMj4J3J6j2%N
5453AKj6NoOMJ6j9J0o%N%J1qJLOKj4qnJ3%P%Jj3mJ1j2OLJ1lrrJ8j1lmROlk%j2
5500a0LPrK3j0j0J8k0jlJ5k0J5LNj5NOj3jJ5QljJ1j6jj5J2jJ1pK0j0k6NJ1%J7
5539A8j1%Lj1mKj0J6RmjMj7Pjj7J2J5j8mNRj4R%rJ0j4K3Pqj5jJ8j8RJKOj7J1M
$$ y = [-16, 2, -4, 2, 16, 18, 16, 4, -3, -1, -3, 2, -9, 1, 16, -1, -4, -3, -1, -13, -10, 13, 8, 5, 9, -8, 0, -7, -12, -1, 14, 3, 14, -3, -2, -15, -9, -5, -9, -1, 0, 1, 8, 0, -4, -14, -11, -1, 1, 15, -3, 0, -11, 1, -11, -16, -1, 14, 10, 23, 7, 6, -8, -8, -11, 17, 5, 13, 20, 7, -1, -1, 0, 4, 14, 0, 23, 24, 8, 9, -1, -5, -7, -3, 10, -9, -8, -5, -8, -8, -13, -9, -4, 4, 3, 5, -10, -11, -6, -4, -12, 10, -4, 1, 17, -9, -1, 2, -12, -8, -9, -4, 10, 12, 5, 9, -8, 3, -10, 3, 5, 21, 7, 12, 6, -6, 0, -8, -1, 14, 22, 16, 8, -3, -8, 7, 4, 19, 17, 10, 0, 2, 7, -10, -15, -12, -2, 10, 7, 3, -6, -12, -13, -21, -11, -15, -1, 15, -2, 3, 6, -17, -11, -14, -11, 8, 8, 7, 2, -11, -9, -1, 2, 2, 11, 12, 13, 11, 11, -10, 5, 4, 7, 21, 13, 11, 7, 2, 3, -16, -4, 5, 16, 17, -7, 6, 0, -4, -1, 5, 1, 11, 6, 1, -11, -11, -15, -15, -8, -7, -5, -8, -13, -13, -11, -7, -21, -8, 8, -4, -4, 1, 3, -13, -8, -14, -8, -4, 12, -7, 3, -3, -3, 2, 2, 13, 5, 6, 9, 15, 17, 3, -5, -10, 3, 3, 10, 10, 11, -2, -6, 5, -7, -1, 2, 13, 10, 1, -8, 10, -1, -4, -8, 1, 7, 4, 2, 2, -10, -7, 0, -9, 14, 4, -6, 12, -8, -9, -12, 3, -17, -2, 1, 6, -9, -4, 2, -11, -12, 3, 11, 8, 7, 18, 2, 1, -14, -2, -3, 8, 1, 21, 11, -15, -10, 1, 1, 18, 7, 7, 10, -1, -5, -3, -13, 3, 12, 8, 7, 11, -6, 1, 0, -17, -5, 10, -8, -12, -7, 2, -12, -3, -3, -12, -2, -16, 7, 14, 6, -9, -10, 8, -10, -1, 0, 2, 8, -9, 2, 6]
5581Fj4NQmK0j6%n%Lj3K4nlnJ1j1rQPLj1%J4j4Qj0pJ5J1oJLk1LmKMlRj2KPrlJ0
5627aNj2J1kNoMj6J2NLmj1J1qRp%OoJ2j2PQj1koJ5lJ5ooj4J6j7Pj4KJ8j9J7%j2
5670gMLLqJ7j9Polql%K1mL%nJ6j9qK1J2oljojJ%jKOkjmQj4J4k%J3pjj5mPj5J0
5718eJ2OrJj8J3rlM%KPkkjj4KJ0lPPj8QnJj2%NK3j5Nj0RqLOkOJ5k4Rlj0PJ4Nj3
5765AJ7k0kOMOj2QLj0J2j1j6QMlmROJj4Rj1J2jKjJ0k0lMjjMkJ0m%j1NmPMKNJJ
5812A0k%j3jMJ4rNjKpoLoJ9NrJ3j2j0mJ5oNkj0J1pqJ2pj1J7Nj0J1j9j2J4pQQj4
5855a2JMk%nRKPJ0np%mmJ9kpRJqMj0nRoQOmqlJOjLNKPj2oJ1k0LOJ1q%Oj4qJ0L
5906BqRLppmKRmj2J1J5j0KKj4NPmQ%JpoLKKKLJ3mlrKOj1QKnknOkpJ4mPkr%lJ%
$$ y = [6, -8, -3, 5, 1, 21, 5, 5, 0, 0, 3, -10, 14, 9, 6, 1, 12, 1, -8, 0, 7, 10, -1, -1, 13, -1, 7, -3, -10, 5, 16, 10, 11, 14, -7, -4, -8, -6, -2, -5, 4, -8, -6, 1, -8, -11, -1, 4, -8, 3, 1, 6, 0, 4, -12, 0, 5, 8, 4, -7, 4, -4, 5, -2, -2, 4, -2, 10, -2, 5, 13, 2, 0, -6, 9, 6, 21, 15, 9, -5, 11, -6, 1, -13, -11, 7, -12, 5, 5, -7, -3, 0, 3, -5, 12, -7, 0, -6, -9, -17, -20, -20, 1, -3, 0, 0, -5, 11, -8, -16, 5, 17, 11, 8, 7, 1, 0, 1, 1, 0, 2, 8, 6, 5, 1, 9, -5, 9, 7, 7, 20, 13, 12, -3, -7, 0, -15, -5, 7, 13, 4, 5, -13, 0, -9, -12, -8, -8, -6, 1, -1, -3, -4, -18, -16, -6, -9, -2, 5, -13, -5, -10, -9, -21, -21, -16, 7, -8, -3, -13, -4, -12, -9, -3, -5, 1, 16, -8, 1, -2, -12, -5, 9, 14, 1, 18, -2, -4, 2, 6, 12, 0, 8, 11, 1, 13, 2, -14, -6, -2, -5, -9, 0, 6, 7, -7, 2, -9, 3, 2, 4, 3, 13, -7, -10, -6, -7, -8, -4, -6, 4, 0, 0, -11, -6, -10, -3, 1, 3, 8, 9, 10, 8, 8, -5, -6, -2, 12, 3, 8, 7, 9, 2, -4, -1, -7, 12, 17, 8, 21, 9, -1, -5, 10, 4, 9, 7, -3, 8, 1, -7, 5, -2, -13, 4, 9, -1, 10, -9, -21, -7, -14, -6, 2, -12, -11, -7, -9, -9, -14, -5, -3, 4, 14, 9, 2, 2, -2, -6, 13, 11, 4, 13, 14, 6, 10, 0, -5, 4, -2, 6, 12, 8, 0, -3, -2, 4, 3, 6, 11, 13, 20, 8, 2, 13, -7, -4, 2, 13, 5, 5, 11, -3, -11, -1, 2, -6, 3, 6, -1, -8, -12, -10, -1, -5, -17, -6, 9, -1, 1, 3, -11, -6, 1, -3, 5, 5, 6, -1, -7, -4, -2, 0, 2, 5, 18, 14, 11, 2, 4, 10, -1, 7, 9, 4, 2, -3, 3, 1, -6, 8, 4, 11, 9, 0, 0, -3, -2, -2]
5959bq%J7%lpOj7J6nkQoLrNnlPRkpJ3Qrj9J1oJ2KPj2PlloJ6mNJ1oKqjj5MJ0Kj
6008A2J0k4L%kOj4J5pJJj2kjJ2%%QopjkOLnQr%MqJ0kpLNKJplJNlJ8JlMpkj1RM
6059GlJ0k0J6opJnK6k1NJ4j1mj5J8j0pJ4NPk9K4k7J6j0J1rPMLlj3nJKJ4JJ4k6
6099a1QlQNqMJ1joOlljPj2RkQj2Nqj%QKqjmJ5j6NjJ3qRj1Lj2kJ8j6jKPkjmj2J3
6148dj0J9kPj5%JqNJ3j0J4o%mmmNJ3KMj1MmLj5J2LQj1Qlj2nJ5pQJJ0j2nkQlj4
6193hPRk%nmoOj0J9nJJnk%MNpmMkOqPj9K5qMoJ7j6JQrJOQQmqlqJj1RJ6nNj5J7
$$ y = [-2, -10, -10, 7, 7, 4, -3, 3, -14, 2, -3, -5, 3, -3, 0, -9, -4, -9, -12, -5, 4, 2, -5, 8, 16, 7, -12, -1, -7, 5, 7, 14, 2, 9, 6, 3, -3, 13, 9, 14, 25, 19, 21, 13, 12, -3, 1, 11, 13, 12, 22, -2, 1, 1, -1, 5, -9, 6, -1, 0, 1, -11, -13, -14, -2, -2, -2, 6, 0, -7, -8, -10, -4, -1, -6, 2, -7, -7, -3, -11, -1, -3, -10, -7, -2, 0, 1, -6, -9, -8, -3, -6, 12, 13, 10, 14, 7, 5, -6, 3, 7, 4, 14, -6, 10, 4, -3, -2, -7, 19, -2, 3, 17, 6, 2, -13, 5, -5, -12, 2, 7, 14, -15, 9, -18, -2, -12, -1, -10, -3, 1, 4, 1, -12, -17, -16, -14, 0, 1, 15, -11, -3, -6, 2, 7, -1, 3, 14, 13, 7, 13, 10, 7, 6, 13, 1, 10, 8, 16, 4, 9, 1, 0, 0, 8, 10, 2, 1, -3, 12, -4, 1, 0, 13, 5, 14, 3, 6, -6, -8, 10, -6, -7, -5, 2, 0, -1, -5, -17, -4, -14, 5, 3, 10, -5, -5, -4, -12, -7, 6, -4, 10, 4, 4, 0, -4, -8, -3, 10, 12, 16, 5, 9, 5, 8, -7, 5, 8, 16, 5, 13, 10, -2, -7, 8, 1, 9, 10, 20, 8, 3, 1, 9, 6, -8, -1, 8, 6, 6, 1, -3, -9, -3, -13, 6, 1, 2, 3, -2, -4, -4, 0, 5, -2, -6, -2, -4, 2, -6, 1, -18, 7, -1, 3, -3, 14, -2, -1, 7, -2, -1, 5, 13, 21, 17, 9, 6, -2, -1, -12, -3, 13, 8, 13, -2, 15]
$$ [...]
8191G
##END NTUPLES=NMR FID
##END=
