##TITLE=1H_Pr-4974
 CDCl3, 8 sc, 
 11.6.2020
##JCAMPDX= 6.0         $$ Bruker NMR JCAMP-DX V2.0
##DATA TYPE= NMR FID
##DATA CLASS= NTUPLES
##ORIGIN= UXNMR, Bruker Analytische Messtechnik GmbH
##OWNER= root
$$ XWIN-NMR		Version 3.5
$$ Thu Jun 11 11:58:25 2020 Russian Standard Time (UT+4h)  she@DPX200
##.OBSERVE FREQUENCY= 200.1315
##.OBSERVE NUCLEUS= ^1H
##.DELAY= (6, 6)
##.ACQUISITION MODE= SIMULTANEOUS
##.ACQUISITION SCHEME= undefined
##.AVERAGES= 8
##.DIGITISER RES= 18
##SPECTROMETER/DATA SYSTEM= spect
##.PULSE SEQUENCE= zg30
##.SOLVENT NAME= CDCl3
##.SHIFT REFERENCE= (INTERNAL, CDCl3, 0, 15.7039)
##AUDIT TRAIL= $$ (NUMBER, WHEN, WHO, WHERE, WHAT)
$$ ##TITLE= Audit trail, XWIN-NMR		Version 3.5
$$ ##JCAMPDX= 5.01
$$ ##ORIGIN= Bruker BioSpin GmbH
$$ ##OWNER= she
$$ F:/spectra/data/she/nmr/H-F/1/audita.txt
$$ ##AUDIT TRAIL=  $$ (NUMBER, WHEN, WHO, WHERE, WHAT)
(   1,<2020-06-11 11:57:26.68 +0400>,<she>,<DPX200>,
      <created by zg, POWCHK disabled, PULCHK disabled
       configuration hash MD5:
       00 E9 B6 7A A2 85 ED C7 34 08 36 98 17 FE 4E 26
       data hash MD5: 16K
       92 D4 7C 51 24 B2 EA D9 1D 90 6E 4D D8 79 15 E7>)
$$ ##END=
$$ 
$$ hash MD5
$$ 69 CA 31 48 8F 85 C4 EF 78 0C F4 5D B0 CF E5 CC
##$RELAX= 
##$RELAX= 
##$RELAX= 
##$RELAX= 
##$RELAX= 
##$RELAX= 
$$ Bruker specific parameters
$$ --------------------------
##$DU= <F:/spectra>
##$EXPNO= 1
##$NAME= <H-F>
##$PROCNO= 1
##$TYPE= <nmr>
##$USER= <she>
##$AMP= (0..31)
100 100 100 100 100 100 100 100 100 100 100 100 100 100 100 100 100 100 
100 100 100 100 100 100 100 100 100 100 100 100 100 100 
##$AQSEQ= 0
##$AQ_mod= 1
##$AUNM= <au_zg>
##$AUTOPOS= <>
##$BF1= 200.13
##$BF2= 200.13
##$BF3= 200.13
##$BF4= 200.13
##$BF5= 200.13
##$BF6= 200.13
##$BF7= 200.13
##$BF8= 200.13
##$BYTORDA= 1
##$CFDGTYP= 0
##$CFRGTYP= 5
##$CHEMSTR= <none>
##$CNST= (0..31)
1 1 145 1 1 1 1 1 1 1 1 1 1 1 1 1 1 1 1 1 1 1 1 1 1 1 1 1 1 1 1 1 
##$CPDPRG= <>
##$CPDPRG1= <>
##$CPDPRG2= <>
##$CPDPRG3= <>
##$CPDPRG4= <mlev>
##$CPDPRG5= <mlev>
##$CPDPRG6= <mlev>
##$CPDPRG7= <mlev>
##$CPDPRG8= <mlev>
##$CPDPRGB= <>
##$CPDPRGT= <>
##$D= (0..31)
0 1.2 0 0 0 0 0 0 0 0.06 0 0.03 0 0 0 0 0.0002 0 0 0 0 0 0 0 0 0 0 0 0 
0 0 0 
##$DATE= 1591862246
##$DBL= (0..7)
120 120 120 120 120 120 120 120 
##$DBP= (0..7)
150 150 150 150 150 150 150 150 
##$DBP07= 0
##$DBPNAM0= <>
##$DBPNAM1= <>
##$DBPNAM2= <>
##$DBPNAM3= <>
##$DBPNAM4= <>
##$DBPNAM5= <>
##$DBPNAM6= <>
##$DBPNAM7= <>
##$DBPOAL= (0..7)
0.5 0.5 0.5 0.5 0.5 0.5 0.5 0.5 
##$DBPOFFS= (0..7)
0 0 0 0 0 0 0 0 
##$DE= 6
##$DECBNUC= <off>
##$DECIM= 24
##$DECNUC= <off>
##$DECSTAT= 4
##$DIGMOD= 1
##$DIGTYP= 9
##$DL= (0..7)
0 120 120 120 120 120 120 120 
##$DP= (0..7)
150 150 150 150 150 150 150 150 
##$DP07= 0
##$DPNAME0= <>
##$DPNAME1= <>
##$DPNAME2= <>
##$DPNAME3= <>
##$DPNAME4= <>
##$DPNAME5= <>
##$DPNAME6= <>
##$DPNAME7= <>
##$DPOAL= (0..7)
0.5 0.5 0.5 0.5 0.5 0.5 0.5 0.5 
##$DPOFFS= (0..7)
0 0 0 0 0 0 0 0 
##$DQDMODE= 0
##$DR= 18
##$DS= 0
##$DSLIST= <SSSSSSSSSSSSSSS>
$$ [...]
##$SUBNAM2= <"">
##$SUBNAM3= <"">
##$SUBNAM4= <"">
##$SUBNAM5= <"">
##$SUBNAM6= <"">
##$SUBNAM7= <"">
##$SUBNAM8= <"">
##$SUBNAM9= <"">
##$SW= 24.9337058887773
##$SWIBOX= (0..15)
0 0 2 0 0 0 0 0 0 0 0 0 0 0 0 0 
##$SW_h= 4990.01996007984
##$TD= 16384
##$TD0= 1
##$TE= 0
##$TE2= 300
##$TE3= 300
##$TEG= 300
##$TL= (0..7)
0 120 120 120 120 120 120 120 
##$TP= (0..7)
150 150 150 150 150 150 150 150 
##$TP07= 0
##$TPNAME0= <>
##$TPNAME1= <>
##$TPNAME2= <>
##$TPNAME3= <>
##$TPNAME4= <>
##$TPNAME5= <>
##$TPNAME6= <>
##$TPNAME7= <>
##$TPOAL= (0..7)
0.5 0.5 0.5 0.5 0.5 0.5 0.5 0.5 
##$TPOFFS= (0..7)
0 0 0 0 0 0 0 0 
##$TUNHIN= 0
##$TUNHOUT= 0
##$TUNXOUT= 0
##$USERA1= <user>
##$USERA2= <user>
##$USERA3= <user>
##$USERA4= <user>
##$USERA5= <user>
##$V9= 5
##$VALIST= <valist>
##$VCLIST= <CCCCCCCCCCCCCCC>
##$VD= 0
##$VDLIST= <DDDDDDDDDDDDDDD>
##$VPLIST= <PPPPPPPPPPPPPPP>
##$VTLIST= <TTTTTTTTTTTTTTT>
##$WBST= 1024
##$WBSW= 4
##$XGAIN= (0..3)
0 0 0 0 
##$XL= 0
##$YL= 0
##$YMAX_a= 297756
##$YMIN_a= -191599
##$ZGOPTNS= <>
##$ZL1= 120
##$ZL2= 120
##$ZL3= 120
##$ZL4= 120
##$ABSF1= 10
##$ABSF2= 0
##$ABSG= 5
##$ABSL= 3
##$ALPHA= 0
##$AQORDER= 0
##$ASSFAC= 0
##$ASSFACI= 0
##$ASSFACX= 0
##$ASSWID= 0
##$AUNMP= <proc_1d>
##$AZFE= 0.1
##$AZFW= 0.1
##$BCFW= 1
##$BC_mod= 2
##$BYTORDP= 1
##$COROFFS= 0
##$CY= 11.3945322036743
##$DATMOD= 1
##$DC= 2
##$DFILT= <>
##$DTYPP= 0
##$F1P= 16.9975609425685
##$F2P= -3.02152046262296
##$FCOR= 0.5
##$FTSIZE= 0
##$FT_mod= 4
##$GAMMA= 1
##$GB= 0.15
##$INTBC= 1
##$INTSCL= 1
##$ISEN= 128
##$LB= 0.24
##$LEV0= 0
##$LPBIN= 0
##$MAXI= 10000
##$MC2= 0
##$MEAN= 0
##$ME_mod= 0
##$MI= 1.114404
##$NCOEF= 0
##$NC_proc= 0
##$NLEV= 6
##$NOISF1= 3.799351
##$NOISF2= 2.8
##$NSP= 1
##$NTH_PI= 0
##$NZP= 0
##$OFFSET= 15.70392
##$PC= 1
##$PHC0= -9793.485
##$PHC1= 17.60087
##$PH_mod= 1
##$PKNL= yes
##$PPARMOD= 0
##$PSCAL= 0
##$PSIGN= 0
##$REVERSE= no
##$SF= 200.130013532006
##$SI= 16384
##$SIGF1= 3
##$SIGF2= 2
##$SINO= 400
##$SIOLD= 16384
##$SREGLST= <1H.CDCl3>
##$SSB= 0
##$STSI= 0
##$STSR= 0
##$SW_p= 3612.71676300578
##$SYMM= 0
##$S_DEV= 0
##$TDeff= 0
##$TDoff= 0
##$TI= <>
##$TILT= no
##$TM1= 0
##$TM2= 0
##$TOPLEV= 0
##$USERP1= <user>
##$USERP2= <user>
##$USERP3= <user>
##$USERP4= <user>
##$USERP5= <user>
##$WDW= 1
##$XDIM= 8192
##$YMAX_p= 0
##$YMIN_p= 0
$$ End of Bruker specific parameters
$$ ---------------------------------
##NTUPLES= NMR FID
##VAR_NAME=  TIME,          FID/REAL,        FID/IMAG
##SYMBOL=    X,             R,               I
##VAR_TYPE=  INDEPENDENT,   DEPENDENT,       DEPENDENT
##VAR_FORM=  AFFN,          ASDF,            ASDF
##VAR_DIM=   8192,          8192,            8192
##UNITS=     SECONDS,       ARBITRARY UNITS, ARBITRARY UNITS
##FACTOR=    0.0002004,     1,               1
##FIRST=     0,             0,               0
##LAST=      1.6414764,     0,               0
##MIN=       0,             -191599,         0
##MAX=       1.6414764,     297756,          0
$$ Real data points
##PAGE= N=1
##DATA TABLE= (X++(R..R)), XYDATA
0@%%%%%%%JrJ6j6J6k2L0l2M0m8N6p2Q8j04J20j36J56j80K08k40K72l07L48l95
31b10M45m98N58o25O97p76Q63r58J062j178J306j445J599j770J963k177K419k698
49a423L017l387L827m360N013n841O933q449J0708j4484K2325o7817J59811J36194
63B42067k29677k03989L4450K06860P2465r8635j18190J6378Q2689N8073n063
74E7428k6792m3245l1079O889M8724K2969k9921l7832K2351N1096j918o7311l2460
87f1101N5494O8658j9630p2610j5164O5672N1076l2080p2291k5252L5730M1975
99B0477J4181m418j8011l0949j5381L1767M9245N256m9402l8583K3701N9270K5102
112G2255l4406n4672k7175J8866M9501L6266k1285o4005k8189M9121O4444j2099
$$ plain form
0 0 0 0 0 0 0 0 0 1 -8 8 -8 8 -14 16 -16 24 -24 32 -40 48 -56 64 -72 84 -96 112 -128 144 -163 185 -210
31 -210 235 -263 295 -330 367 -409 454 -504 558 -620 686 -759 840 -930 1033 -1144 1275 -1423
49 -1423 1594 -1793 2034 -2326 2687 -3154 3779 -4670 6038 -8446 13879 -53938 105873 242067
63 242067 12390 -191599 -157149 49711 122176 23541 -94649 -78271 4418 62491 57428
74 57428 30636 -12609 -43688 -36799 11925 34894 4973 -32859 -10508 40588 38670 -28641 -61101
87 -61101 -5607 63051 43421 -29189 -44353 21319 72395 40315 -31976 -57228 -21498 20477
99 20477 34658 30240 12229 -18720 -34101 -2334 46911 52167 2765 -35818 -12117 47153 72255
112 72255 37849 -16823 -43998 -25132 24369 60635 39350 -24655 -52844 -3723 60721 48622
124D8622p7894m0275N5520P5730r476q0632l9696N0481N6317k5927p2004j6676
136g5910O1246N3581k0223n7269j7866L2547L3445M089j4003j6784r348J5694
148a0801L6042J5012l5191m8631L878N6643L4489l3625m5044J5331N1912P342
160D7357m7637k7271L5343M5603j1891n0806j6659L7961L3212k0592m6221j6006
172c7607K3793K6463M148j2969j5740j0347j629J2838J9802J361k5952k4109R627
185c0321L0215J1355j8993k4299p146J0046J6119J6385O971j3403k4263k481L1908
198B093K8766j0996l3668q250K6412K4216n622k1881p621J0585O651p165k513
211A007J3553J3136o172j9690r751J1987K1395O563j7701k5755p147K0501K8398
$$ plain form
124 48622 -29272 -69547 -14027 61703 52227 -28405 -68101 -17620 38697 12770 -59234 -75910
136 -75910 -14664 38917 18694 -38575 -56441 -23894 9551 13640 -363 -17147 -26495 -10801
148 -10801 25241 40253 5062 -43569 -39691 16952 51441 17816 -27228 -11897 40015 47357
160 47357 -280 -27551 7792 53395 41504 -9302 -25961 12000 45212 24620 -21601 -37607
172 -37607 -13814 12649 16797 3828 -11912 -22259 -23888 -11050 8752 10113 -15839 -39948 -30321
185 -30321 -106 11249 -7744 -32043 -39189 -29143 -13024 3361 10332 -3071 -27334 -29815 2093
198 2093 30859 19863 -13805 -22055 4357 28573 22951 1070 -6551 4034 10685 3520 1007
211 1007 14560 27696 21524 1834 -7917 4070 25465 32028 14327 -11428 -18575 1926 30324
224C0324K555l6253l9763N985M8997L3473k3880n0448j2991L8114L7846r452l7561
237a3054j5326J8790K0291l88j0201o045j447k060O48O934P535K21o071j718L950
252B059K895N20J350N36m949o090K027R424N164q002j4063k204J1577R323m619
267D948o479K463N915l301p020K430R795M43j4569r018J0317J5983l416j9017
281a0526q374J0681J4261L49r956n738O625R016Q40p828p603K80Q338P568m887
296C046j4376n419J2231J3501l368j8493j0115J4340K2380K767k0253j5602Q717
309a0644J8136L604j3630j0932M701J0033j48p213j046O086P13n345k426N756
323b355Q123L628m603r881l651O756J1405L106j1522j4760R26J7329J2359q602
$$ plain form
224 30324 32879 -3374 -43137 -37152 11845 45318 21438 -29010 -42001 -3887 33959 24507 -13054
237 -13054 -28380 -9590 10701 10313 112 -5933 -7380 -9440 -8792 -1858 5677 5898 -173 -1891 2059
252 2059 4954 5474 6824 7360 2411 -3679 -1652 7772 12936 4934 -9129 -11333 244 9567 4948
267 4948 -1531 932 6847 3546 -3474 -1044 8751 9194 -5375 -14393 -4076 11907 8491 -10526
281 -10526 -18900 -8219 6042 6391 -3565 -9303 -2678 6338 7178 -650 -8253 -7973 365 7933 3046
296 3046 -11330 -16749 -4518 8983 5615 -12878 -22993 -8653 13727 16494 -3759 -19361 -10644
309 -10644 7492 11096 -2534 -13466 -8765 1268 1120 -6093 -7139 -1053 -340 -5685 -8111 -2355
323 -2355 5768 9396 4793 -5088 -8739 -1983 9422 12528 1006 -13754 -12828 4501 16860 8258
337H258j8311m628J3218J3921M07r855n451L670L374j956q03M379J605q156r267
352i595K967J4126Q618r964j6954k750J5135J6301k21j3912j2866J373J4726J1455
366A8439o111j7772q240R895J5413J649j3518j0169N973J0925np286r03O990K647
381G927p414q059L617J1332J845j3244j1647M889J5773O894j0351j5094j655J3843
395a344J3740k221j3618p769O009J2377N090r089j3589M30J2335P486o241r790
409f194N47Q625M029n965n579N360P679k353q957k505P383N801m357j1501m760
424a2747Q456J0621j692j2096p509N799J1928M117q823j1045R59J1662P472n551
438A551j0983m246P095R431j088r298k919P034O093k944n128K035P226K548o837
$$ plain form
337 8258 -10053 -14681 -1463 12458 12865 3010 -2441 1229 4603 2647 1844 6223 7828 -328 -9595
352 -9595 -6628 7498 16116 6152 -10802 -13552 1583 17884 17663 3751 -9115 -7742 6984 18439
366 18439 12328 -5444 -13684 -3789 11624 13273 -245 -10414 -4441 6484 6479 -807 -1710 5280 7927
381 7927 513 -7546 -3929 7403 9248 -3996 -15643 -10754 5019 11913 1562 -13532 -15187 -1344
395 -1344 12396 10175 -3443 -11212 -5203 7174 12264 3175 -10414 -9984 2351 9837 3596 -6194
409 -6194 -5647 2978 7007 1042 -4537 823 8502 6149 -2808 -5313 2070 7871 3514 -7987 -12747
424 -12747 -4291 6330 4638 -7458 -14967 -9168 2760 6877 -1946 -12991 -12032 -370 7102 1551
438 1551 -9432 -13678 -6583 2848 1760 -7538 -10457 -3423 2670 -274 -5402 -3367 3859 6407 -430
453d30n838N925J0615j31j1586q353M727J2113N340q812j2218l00J2437J0174
467A3663m328j2891n776P786J2440N17j0621q074L458Q310Q76n371m945K402O667
482D113j30o246j075P285N705m586r077n77J0759Q662n695j3896m227J0218J1771
497A3004j365j2687r000M964J3797N729r953j2306k4J0817P551m906j0418l803
511h600O882N090k832o399o14M010J236k784j856L714N380o63o737l276P107R114
527H772l36j0046o870N420J1806K833r325r738K566J0607P483m382j0389l460
541e059P456Q953k435q690m107M181N482k842p075k394N223L131o329p576J344
556a0737R812M214p477j1961j047J2992J0427p020j5598m738J1811J3901j001
$$ plain form
453 -430 -6268 -343 10272 10141 -1445 -9798 -5071 7042 12382 3570 -8648 -8948 3489 13663
467 13663 9335 -3556 -9332 -1546 10894 11411 790 -7284 -3826 4484 5360 -11 -4956 -2554 4113
482 4113 3983 -2263 -3338 3947 9652 5066 -4011 -4588 6171 14833 9138 -4758 -8985 1233 13004
497 13004 11639 -1048 -10048 -5084 8713 14442 4489 -7817 -7841 2976 10527 5621 -4797 -8600
511 -8600 -1718 3372 540 -5859 -6473 -2463 -1227 -4011 -5867 -2153 3227 2564 -4173 -7449 -342 8772
527 8772 8436 -1610 -8480 -3060 8746 11579 2254 -7484 -4918 5689 13172 8790 -1599 -5059
541 -5059 2397 11350 8915 225 -3882 299 5781 2939 -4136 -6530 -1307 1824 -4505 -12081 -10737
556 -10737 -925 3289 -4188 -16149 -17196 -4204 6223 -797 -16395 -21133 -9322 4579 3578
569C578j4085q560P572J3963M427p062p764J686Q498N774k240l866K57L681L58
584F217k636M39M398K145m305o631rQ152O964m150j0808m768O448J0350J956j1164
600B598j2149R70J2275P179o792j3254m800Q819R677j442r747m383N058P007j63
615H53n368j729M391L103l565m193L387P851P53q423n407O767J0963J842r547
630A678p817N754J2006J984q233q167K150Q251L946n507p276n74O030L354m011
645C568n246p01M893L689l012n882j218N223N143l090q447l984O268R854m30j2555
661e927q714P526J4624K718j2662j2336M242J5736P535j0372j4234m60J2365Q871
675H912m586j1347l986P025P355j338m959j818J343P11n1J717K891q66n626l533
$$ plain form
569 3578 -10507 -19067 -11495 2468 6895 -167 -7931 -6245 2253 8027 5787 1921 2178 5859 6217
584 6217 3581 4020 8418 10563 6258 -373 -382 7770 14734 10584 -224 -4992 1456 11806 13762 2598
600 2598 -9551 -8581 3694 10873 4081 -9173 -13973 -5154 4523 3081 -6666 -11049 -5991 1016 853
615 853 -4515 -6244 -1853 1250 -2315 -6508 -3121 4730 5483 -2940 -8347 -1580 9383 11225 1678
630 1678 -6139 -385 11621 13605 5372 -2795 -645 7606 11552 6045 -1231 -1805 4225 7579 3568
645 3568 -1678 -2379 2514 6203 3191 -2691 -3909 1314 6457 3367 -5080 -9064 -2796 7058 6628 -5927
661 -5927 -14641 -7115 7509 10227 -2435 -14771 -10529 5207 12742 2370 -11864 -12324 41 8912
675 8912 4326 -7021 -11007 -3982 3373 2035 -2924 -4742 -3399 -2688 -2739 -1022 1869 1003 -4623 -8156
691h156M347P570M43p860o360K667Q527N081m937q338j629P911P474r51o468m343
707e022K534O977L024l857o183l96N006N004j422o785k775O278O390l222q704
722c153j380Q061P019m593j2126l174J0552R269n296j3804m152R568J1158k235
736E714j2159o314P041J0603L09p744m863K862N522J394k037k281N81J003l29
751f98J037K664J316k086k174J99L575M042L7m158l235J320M759L149j844o045
767A858m096L191P106K009n678p225j365P071N898l295q955k664N728M963k534
782B012n742j834K926J747k965k811K846M255j988o107j769O215P168j725q914
797f686m676O798J0060O11r197p091L923Q894L917n044o969L86O337L938j791
$$ plain form
691 -8156 -3809 3761 4204 -3656 -10016 -7349 1178 6259 1322 -7016 -8645 -734 6740 5789 -679 -5022
707 -5022 -2488 4489 7513 3656 -2527 -2923 2083 7087 5665 -1120 -3895 2383 8773 5551 -3153
722 -3153 -4533 3528 10547 5954 -6172 -9346 1206 10475 5179 -8625 -12777 -3209 7949 5714
736 5714 -6445 -12759 -5718 4885 5194 -2550 -7413 -4551 971 2365 328 -1953 -1372 -369 -698
751 -698 339 3003 4319 2233 59 258 3833 7875 7912 3754 519 1839 6598 9747 7903 1858
767 1858 -2238 953 8059 10068 4390 -2835 -4200 2871 8769 5474 -3481 -6145 -417 4546 2012
782 2012 -3730 -5564 -2638 -891 -3856 -6667 -3821 434 -1554 -7661 -9430 -3215 3953 2228 -6686
797 -6686 -11362 -4564 5496 6107 -3090 -10181 -6258 2636 6553 1509 -5460 -5074 1263 5201 3410
812C410l906k094K651L392k77l221j573K912J627k024l420k80L560L348k445n863
828d203j925M864O152l75p351n386L075Q391K368o772o374O68O500M202l106n170
844d442n58M139K145j149j237J341O89j425j606J237M090J158m333n419J940P553
860D123L394n881o796P31P390N280l420p595k558N781O680Q5o764n569K423P576
876D880L181n635p017O21O650N059k915p408j363N914N152k094o459j587M274
891A253M334j640n642j191M803L319k924m976k30M618L429k456n154j415M568
906F96M417j396n438k930K548M776O51l705m247J456L600Q32j812o53R17M03j543
923a428j289J690L507K2n228m024L158O623K663n774p863j31Q635O457k969q915
$$ plain form
812 3410 -496 -2590 61 3453 3176 -45 -1618 1294 2921 897 -2523 -2803 757 4105 1660 -4203
828 -4203 -6128 -1264 4888 4513 -2838 -8224 -5149 3242 5610 -1162 -7536 -6868 -368 3834 728 -4442
844 -4442 -5000 -861 1284 135 -1102 239 928 -497 -2103 -866 3224 4382 49 -5370 -3430 4123
860 4123 7517 1636 -5160 -4429 2961 8241 4821 -2774 -5332 449 7129 7214 450 -5119 -2696 4880
876 4880 8061 2426 -4591 -3970 2680 7739 4824 -2584 -3947 1967 7119 5025 -1434 -3021 1253
891 1253 5587 3947 -1695 -2886 1917 5236 2312 -2664 -2894 1724 5153 2697 -2457 -3872 696
906 696 5113 3717 -1721 -4651 -2103 2673 3324 -381 -4628 -3172 428 1260 -552 -1205 -288 115 -1428
923 -1428 -2717 -1027 2480 2502 -2726 -6750 -3592 3031 5694 -80 -7943 -8074 561 7018 4049 -4866
939d866m584N450Q500J841o444p676N23P600M698k948o516j419M223L849j857
954C74l726O73L865P87l539k238K721N080J54o036m495L085P316K685n582o998
970e874O5O452N489j670o887l124L848N023J472m043l824K62L073J614j698j452
986a274R01Q54j057j429P65L263J478l798l783J777N849K464m629n189o7N874
1002A999M269k230o173j749M341M887L4m973k765K705M941J77m334k772K147L869
1018D373K34l227l213J698M181K09m165k839K086M305K95m596l008K634N046L49
1034D362n698l473K856N466O79m918m849J719N891K758l916n550m45N130M620
1049D632j763o009j916L839M053p61l884j906K381K299o59k563k25K419J419k436
$$ plain form
939 -4866 -9450 -4000 4500 6341 -103 -7779 -7256 344 5042 2094 -4422 -5841 -1618 2231 374
954 374 -3352 -2679 1186 1973 -1566 -3804 -1083 3997 4151 -1885 -6380 -3295 4021 6706 1124 -5874
970 -5874 -5809 643 6132 4462 -2425 -5549 -1701 3322 4794 751 -3073 -2811 262 1876 178 -1274
986 -1274 -373 481 -576 -2005 -1240 2023 3501 -297 -4080 -2303 3546 6010 1381 -3808 -3875 1999
1002 1999 6268 4038 -2135 -3884 457 5344 5378 405 -2360 345 5286 5463 1129 -1643 504 4373
1018 4373 4607 1380 -1833 -135 4046 4255 90 -2749 -663 3642 3937 -659 -3667 -1033 4013 4362
1034 4362 -1336 -4809 -1953 3513 4192 -726 -5575 -3856 2035 4793 877 -4673 -5118 12 4632
1049 4632 2869 -3140 -5056 -1217 2836 2075 -1809 -3715 -1334 965 306 -2257 -2482 -63 1356 -1080
1065a080l064J228M244J646l436n297J83N848M083k875o047k095M343N199P59
1080C639n118l675J526M930J933k016l149O6K140R19r43p63J604R91k486k409
1096b811J488L986J906l195n621m80N721N117k115p357l496M195O924P27o062
1111a073n149J643N776K480l254m573J4L555K330j272l044O32K752R03k192j983
1127b455J696M161O07m231l311K822O143J749m852m918J133O027M166l211o062
1142e36j614N220M270j219n108k711K867L706k99l961j686J611J820p11k284r07
1158a542J613J414j558k854j54K896J230k306l374n74M638K297k046m446q62M401
1174a227L732j057m671j856L474M264m1m067k699K920L732O9k798j915K029L054
$$ plain form
1065 -1080 -4144 -2916 1328 2974 -462 -5759 -5576 272 4355 1480 -4567 -6662 -2319 2880 3639
1080 3639 -1479 -5154 -3628 1302 3235 1219 -1930 -1864 276 1195 252 -511 1093 2084 -402 -2811
1096 -2811 -1323 2663 4569 1374 -4247 -4727 994 6111 3996 -3361 -6857 -2662 4262 4989 -1073
1111 -1073 -6222 -4579 1197 3677 423 -4150 -4136 -581 1749 477 -2567 -1935 817 1720 -472 -2455
1127 -2455 -759 3402 4009 -222 -3533 -711 5432 7181 2329 -2589 -1456 4571 8737 5526 -536
1142 -536 -2150 3070 7340 6121 1013 -1698 1169 4875 4576 615 -1071 540 2360 1649 -635 -1542
1158 -1542 71 1485 -73 -2927 -3081 -185 1045 -1261 -4635 -5209 -571 1726 -320 -4766 -5628 -1227
1174 -1227 2505 1448 -3223 -5079 -1605 2659 2618 -1449 -4148 -1228 2504 2573 -225 -2140 -111 2943
1190B943l38l259q03K727K143j530l268q44L280K923j594n219j618L715M127k92
1206C093n360m086K592N911J620n006m997Q88N225L032k845m848q48L677L549
1221A597j223l500o70K805K098j165k495M05L537M52k446k274J842L987P00l448
1237B02l976J448N198K530l505m920o13M941M328k318m668j951L394L435j66l548
1253a89j456J763K136k05k173o20J786J752k076j687O78K379J514j815k872m25
1269a510L403K855j542l941k195L246L842J96m080l584K034M378J419l448l872
1284b799N82L846J689l101k736J119K690J54l049j069K012K922j497l922p47L596
1300c10L781j812m823j309L562M771k91n000l214K359N198J420l754l730r8M241
$$ plain form
1190 2943 2605 -654 -1457 1270 3413 1883 -1385 -2229 1051 3974 2380 -2839 -4457 -742 3385 3093
1206 3093 -2267 -6353 -3761 2150 3770 -1236 -6233 -5345 -120 2912 67 -4781 -5629 -1952 1597
1221 1597 374 -3126 -3796 -991 1107 -58 -2553 -2148 1389 1841 -605 -2879 -1037 2950 3650 202
1237 202 -3774 -2326 2872 5402 1897 -3023 -3636 1305 5633 3315 -1353 -3304 90 3525 3359 -189
1253 -189 -1645 118 2254 2049 -124 -744 1042 2794 718 -969 -291 2088 3602 1787 -1085 -1510
1269 -1510 1893 4748 3206 -735 -2930 316 4158 4354 274 -3310 -1276 3102 4521 1073 -2799
1284 -2799 -2217 1629 3318 217 -2519 -1400 1290 1444 -1605 -2674 -662 2260 763 -3159 -3906 -310
1300 -310 3471 1659 -3164 -4473 -911 3860 3569 -1431 -4645 -2286 2912 4332 578 -3152 -3250 991
1316I91L428j712m171j442K964K887q2l217j902J291K339N1l265k30J998J235
1332A163j549k716J7K748K108k185m141m79M213L059k162l835j543L099L893q03
1348H87l731j941K900K873J48k579j474K045K472p48k498L18K870J157k545k182
1364b028P94L902J765k770l857L52M196K187j734l636j722K550L762L19l794l007
1380b721J175L534J897k260l583n59L291K375j789l181k48K530K213j681k953
1395a960N52L710N52l053l066K248M314q4l772l005K420N201J57m440l285K081
1411a430M357J624l162l921L58L869K457k078l638o19K334K829o63l358j243K151
1427a33K178n16k300m35J267J492p79k295l30K222J871j557l013n16K773K322
$$ plain form
1316 991 4419 2707 -1464 -2906 58 2945 2863 -354 -2256 -965 1374 1425 -1840 -2070 -72 1163
1332 1163 -386 -3102 -3085 -337 1771 -414 -4555 -5034 -821 2238 76 -3759 -5302 -2203 1690 887
1348 887 -2844 -4785 -1885 988 1136 -1443 -2917 -872 1600 852 -1646 -1328 1542 2699 154 -2028
1364 -2028 -1234 2668 4433 1663 -2194 -1842 2354 4541 2807 -829 -2551 -1 3761 4080 286 -2721
1380 -2721 -1546 1988 3885 1625 -1958 -2517 774 3149 1360 -1821 -2069 461 2674 993 -1960
1395 -1960 -1408 2302 2854 -199 -3265 -1017 3297 3213 -559 -3564 -1144 4057 4214 -226 -3511 -1430
1411 -1430 2927 4551 1389 -2532 -2174 1695 4152 2074 -1564 -2183 151 2980 2317 -1041 -2284 -133
1427 -133 2045 1529 -771 -1206 61 1553 774 -1521 -1851 371 2242 685 -2328 -2844 -71 2251
1443B251p41l774j616K652L216l07k710k480J279L117J167k573k382O56K584K83
1459F22j840r31J453J785j142k863J73L478K318k698m350k33M722L519j936n421
1475c344j970M258M771o34m396l376J786M734J356k308l661k73K819K427o89k537
1491a037j546J736K137k52k360j23J882J604j659k466M70K939K116k828l529J078
1507a838L236K412k321l067m38L313K677j471k804j024K535J752m50j994j088
1522e70J293J441l86j381m54J327Q73j094j737l0K216J245k112k805J49L301J736
1539C012j915l508m69L004K478r55l664j664K727K895L7l176j896J712L422M46
1555B486k534k023P89K686N92j576j852Q28K523N00k116j826J411K568p7k478
$$ plain form
1443 2251 1510 -2264 -3880 -1228 1988 1681 -1029 -3509 -2230 887 2054 -519 -2901 -2245 339 622
1459 622 -1218 -2149 -696 1089 -53 -2916 -2743 735 3053 355 -3995 -4228 494 4013 2077 -3344
1475 -3344 -5314 -1056 3715 3081 -1315 -4691 -2905 1829 3185 877 -2784 -3057 -238 2189 1500 -1037
1491 -1037 -2583 -847 1290 1038 -1322 -1445 437 2041 382 -2084 -1614 1325 3441 613 -2916 -1838
1507 -1838 1398 3810 1489 -1578 -2016 1297 3974 2503 -301 -1325 1210 2962 2512 518 -570
1522 -570 723 2164 1778 397 -57 1270 2143 1049 -688 -718 1498 2743 631 -2174 -2025 1276 3012
1539 3012 1097 -2411 -2880 124 2602 1647 -2017 -3681 -954 1941 1978 -1198 -3094 -1382 2040 2486
1555 2486 -48 -2071 -1282 1404 1996 420 -1432 -604 1919 2419 303 -1523 -112 2456 2379 -99
1571i9k027J595L280M42l816k503J629L813P05l265l697Q92L682J664k139l515
1587c359k55K295K161n88k536j252J504J905m17j468l31J182J127q47j330R0K108
1604a1J112j490k450R52K696K111k140l543J60L483K371j343k978j141K029K399
1620B217L12k827j112J333J700K77j933o01J052R27m53j700k99K075J332j392
1636I08k869j04L203J939j045l695j463L456L327l70l968k295J838L971R71l372
1652D32k543M08L597J172k024k353j2K215J236j314j649j08J726P78j438j283
1668a160J86K216N25k321j644O52L214R35k822k082O43K697J926k066k962R8K976
1685A011J684j312k199k28J639J447p95j493K58J085P78j228r43J63J648O43j601
$$ plain form
1571 -99 -2126 -531 2749 3191 -625 -3128 -1499 2314 3019 -246 -3943 -3051 631 2295 156 -3359
1587 -3359 -3614 -1319 842 254 -2282 -3534 -2030 -125 -542 -2010 -2341 -1159 -32 -879 -2209 -2119 -11
1604 -11 1101 -389 -2839 -1887 809 2920 780 -2763 -2603 880 3251 1908 -1070 -2211 -182 2217
1620 2217 2529 -298 -1410 -77 1623 1900 -33 -634 418 1345 892 -808 -1107 968 2300 908
1636 908 -1961 -2065 1138 3077 2032 -1663 -3126 330 3657 3287 -681 -2976 -1138 2833 3804 432
1652 432 -2111 -1703 1894 3066 1042 -1311 -1323 892 2128 814 -835 -943 783 1561 123 -1160
1668 -1160 -974 1242 1767 -554 -2198 -1546 1668 2603 -219 -2301 -1658 1039 2965 899 -2063 -1965 1011
1685 1011 2695 1383 -816 -1044 595 2042 1247 -246 12 1097 1875 647 -296 -133 1515 2158 557
1702E57k181M21K472J034k077k784l68K925K613k489l529r89L163K623j134l166
1718b909k052K539K910Q1k810j794J554K339K33j389j780R62K136M57j550p58
1734a831J306J455J52j538o94J560K155k95k294j536J874K987M6l136j709J355
1750a43K602Q25k340j951J43K590O62j450k032M6J723O96j310j721P47J224O1
1767C72j626j148J103K152M38k645j499J562K454Q68k232k500O80L442J886k014
1783A293l049n7K993K134j095k941p94K416K037n80k054n96J026J341j51j549
1799C74k51J199J089j255j120n57J501J362j007k544n10K098K086r77l113o91
1815b316J534K685k14k696j928J917K419n0k373r53O25J909O09j949p71O95J194
$$ plain form
1702 557 -1624 -1203 1269 2303 226 -2558 -2926 -1 2612 123 -3406 -4395 -1232 1391 257 -2909
1718 -2909 -4961 -2422 488 569 -2241 -4035 -2481 -142 91 -1298 -3078 -2116 20 477 -1073 -1831
1734 -1831 -525 930 1082 -456 -1150 410 2565 2270 -24 -1560 314 3301 3347 211 -1498 -143
1750 -143 2459 3284 944 -1007 -864 1726 2388 938 -1094 -1048 675 1371 61 -1660 -913 311 372
1767 372 -1254 -2402 -1299 853 1291 -1354 -2853 -1291 1163 2031 -201 -2701 -2021 1421 3307 1293
1783 1293 -1756 -1813 1180 3314 2219 -722 -1516 900 2937 2357 303 -293 733 2074 1923 374
1799 374 123 1322 2411 1156 36 -521 980 2342 1335 -1209 -1719 379 2465 1488 -1625 -2316
1815 -2316 -782 1903 1689 -1007 -2935 -1018 1401 1351 -1022 -1975 -1350 559 1168 -781 -1552 -857 337
1832C37j76j269m71J051J537o16k163m46J742K094p59k312j290J201K849N57k535
1849f69k898J520K846R89j547k508l22K741J627j416k156J14J880Q63q96j285
1865a117k4J933M75j352j340R26J915J16j237k087O84K224J268j768k345k30K921
1882I62J447j115k624q70J979K302p51k198j243J791J635k28j489p14R54J189
1898A027m48j302m38J703R83j114j200m44K173J175j082k080k24K231J372o29
1914A703k423q87J978K233n11j945j244R14K261O57k182j284N09J903N26j877
1930C31j094M35J784O4j528r62M93J584J18k004r25J055J946L26j907k050J068
1947a266K386R89k426k056K49K813J344j357k466l07J858J714n74k381m20J144
$$ plain form
1832 337 161 -1108 -1579 -528 1009 393 -1770 -2216 -474 1620 861 -1451 -2741 -1540 1309 1866 -669
1849 -669 -3567 -2047 799 1788 241 -2267 -2589 152 1779 363 -1793 -1679 201 1064 168 -1117
1865 -1117 -1141 792 1267 -85 -1425 -499 1416 1532 295 -1792 -1108 1116 2384 616 -1729 -1959 962
1882 962 2409 1294 -1330 -2200 -221 2081 1330 -868 -2111 -320 1315 1087 -402 -1116 -162 1027
1898 1027 579 -723 -1161 542 1525 411 -789 -1233 940 2115 1033 -1047 -1271 960 2332 1703
1914 1703 -720 -1607 371 2604 2093 148 -1096 -182 2079 2736 554 -730 -221 1682 2208 331
1930 331 -763 -328 1456 1520 -8 -970 -477 1107 1225 -779 -1704 -649 1297 1623 -284 -2334 -1266
1947 -1266 1120 2109 -317 -2373 -2124 689 2033 676 -1790 -2097 -239 1475 901 -1480 -1900 -756
1963g56J376j23j395m08J158L79o22p82K90J233K97j352q84N27J515R54j923j898
1981b414O47K117J285j314j972l59J611J839k87j917r30Q77J530L15j415j091
1997a478Q21J353k26j155m53Q71J264m45j772l88J860J392n82k351r09K093K373
2014B268n8k789j735J400K795L52j983k209N69K368J012j263j674M62R49Q22n93
2031F93j097J73P95L24p85n11M08J038L8r27n97J92J351M11j185j362N31J751
2049A241O12j303j515q4K118N74r09j458m01J689J219q89j371L0P65R38m64j482
2067f90L00R31J142q46j274k96J284J254j097j774o2J922J098j269j749o22J852
2084A04J927j135k111j092J475J891k36j738j180M34J849J01j042r78K57P22O94
$$ plain form
1963 -756 620 497 -898 -1306 -148 231 -391 -1173 -883 350 647 -705 -1589 -1062 453 1407 -516 -2414
1981 -2414 -1767 350 1635 321 -1651 -2010 -399 1440 1153 -764 -1694 -817 713 1028 -387 -1478
1997 -1478 -657 696 470 -685 -1138 -267 997 552 -1220 -1608 252 1644 1062 -1289 -2198 -105 2268
2014 2268 2210 -579 -2314 -914 1881 2233 250 -1959 -1390 978 1990 727 -947 -485 464 1286 693
2031 693 -404 -231 564 888 103 -408 0 1038 1076 149 -448 -256 1095 1506 321 -1041 -510 1241
2049 1241 1853 550 -965 -1049 1069 1643 734 -724 -1125 564 1783 894 -477 -447 318 1256 792 -690
2067 -690 -390 541 1683 837 -437 -733 551 1805 708 -1066 -1128 794 1892 623 -1126 -1748 104
2084 104 2031 896 -1215 -2307 -832 1059 823 -915 -2095 -1661 188 289 -753 -1731 -1474 -752 -58
2101e8o40p93K68Q11J87o17m06L72J166l30r06p84J194J730J77j634j228P69K319
2120A597L14j516j686L75K127N84r98j585J87J057P90p17r84j58R46K96p86o93
2138h50K60J008n9r60r30K53J563M81j186j595N32J871J022r16k252j76J789J652
2156A507o60j682n60J330J168O17j587m31O51Q19J25j021k83Q46R17l46q71o57
2174a18J275Q68q09j098n79J275J218m40j781j048J351J588J65j821j479O38K167
2191A372j05j362j307J69J914K32j245p06J44R40L05r56j97M74Q13k40j053j82
2209i90N44Q16M17j302r97R47J285L35j173j503L76J883N36j041j773J53J729
2226B42J046q90j493m67J539P23o10j319L10N56J000o56o60j7R08M78j087q51
$$ plain form
2101 -58 -698 -1491 -1223 -412 -225 -842 -1248 -876 290 -40 -946 -1730 -536 1194 1371 -263 -1491 -722 1597
2120 1597 1911 395 -1291 -916 1211 1795 797 -788 -601 456 1246 529 -455 -613 333 629 -157 -850
2138 -850 -590 418 359 -601 -1531 -1278 285 766 -420 -2015 -1483 388 1410 494 -1758 -1934 -145 1507
2156 1507 847 -835 -1395 -65 1103 1720 133 -298 353 1172 1297 276 -7 839 1756 1410 539 -118
2174 -118 1157 2025 1216 118 -461 814 2032 1592 -189 -1237 114 1702 1867 46 -1433 -795 1372
2191 1372 1267 -95 -1402 -1233 681 913 -332 -1038 -894 46 351 -605 -802 -328 485 245 -808 -990
2209 -990 -446 370 787 -515 -1512 -565 720 1055 -118 -1621 -1245 638 1174 133 -1640 -1487 242
2226 242 1288 398 -1095 -1562 -23 700 90 -1229 -919 -363 637 -19 -679 -696 212 690 -397 -1248
2244a248K00J480P21o94j494j86J663J026p17j933l23J176J613J72k082r96R67
2261f55J391J25j268q82N73P91L33r02n30N34O85k86q57R3P30O34l67j026l80
2280a264J054J102N3j517o67R79J798k03j231j220O08K145N96j415j357M16J803
2297A680M88r95j162N85R33L32j077n97M85Q91j03j112p14M90J033O5j096j231
2315a105M36J196N66j221j137l40J101J373r16j242n03R64J495l48j306n02J059
2332d30P89k25q29k67R76M20k98p24K93R81K97p99p83L84J074Q70j206j480K26
2351g31J337J051p42j472o59J069J435n32j245j068Q25J377Kj289o74L4J557J43
2369D18j097p16L59J272k02j006l35N68O46J6j058k42O19J066M48j190j022Q57
$$ plain form
2244 -1248 -1048 432 1153 459 -1035 -1221 442 1468 751 -1182 -1505 -329 1284 1456 -626 -1622 -655
2261 -655 736 861 -407 -1289 -716 75 408 -494 -1024 -490 195 -91 -948 -855 -125 509 142 -884 -1264
2280 -1264 -210 892 945 -572 -1239 -260 1538 1335 104 -1116 -508 1637 2233 818 -539 -123 1680
2297 1680 2168 1173 11 596 1529 1861 784 187 672 1563 1460 348 -366 124 1157 1222 126 -1105
2315 -1105 -669 527 1093 -128 -1265 -1605 -504 869 -47 -1289 -1792 -828 667 319 -987 -1489 -430
2332 -430 359 134 -695 -962 14 434 136 -588 -295 686 983 184 -599 -215 859 1729 523 -957 -731
2351 -731 606 1657 915 -557 -1216 -147 1288 756 -489 -1557 -732 645 647 -642 -1316 -1282 275 418
2369 418 -679 -1395 -1036 236 34 -972 -1307 -739 -93 -77 -1135 -1377 -758 308 756 -434 -1456 -599
2387e99J209P26j367j090J30J193R14n29j047k11R87J010q27r55J80Q94M86p57
2405C47n99L68P05n3p47m34L06R29L1p23m67J48R76N35q65j316J73J276R90n36
2425A044j680k97J124J196j34j616l83J104R02n20p18p02Q10Q84l73o10n12P87
2443C06M95l94q89k40Q18O74k74j363k72J301P51k01j059q18O33J253K91j254
2461b42p36M81J254L07p02j194O0J321Q4l70p57M7M52L48n05l94M12P89j85q73
2481d03m93M69J158l31q12j045Q10J054K92j073q03MQ23J013o46j051m84Q47J278
2500F07n32p79k9K00P68k54o36k86O62N54l81r95O03P22M91r07o45j71J701J28
2520H21o59q45k42O72J451k58j459m45J125R31K8j066n91J22J025N9m30n78L73
$$ plain form
2387 -599 610 1336 -31 -1121 -991 202 1116 587 -460 -671 316 1326 499 -456 -276 618 1104 347
2405 347 -252 116 821 768 21 -413 -107 822 853 130 -337 -189 787 1322 457 -859 -686 590 1580 1044
2425 1044 -636 -933 191 1387 1253 -363 -746 358 1260 740 22 -680 130 1014 641 31 -481 306
2443 306 801 407 -482 -722 96 770 496 -867 -1139 162 913 712 -347 -1165 -532 721 1012 -242
2461 -242 -978 -497 757 1064 362 -832 -772 549 633 263 -494 -447 5 353 -152 -546 -134 655 470 -403
2481 -403 -896 -427 731 400 -412 -1457 -647 407 699 -374 -1177 -1173 -350 663 17 -1034 -1518 -671 607
2500 607 75 -704 -733 -533 235 -19 -655 -941 -279 275 -106 -1101 -498 224 715 -192 -837 -1008 693 821
2520 821 162 -683 -925 -253 1198 940 -519 -964 161 1092 1120 54 -537 -415 610 669 239 -339 34
2539C4N69K85q00n44P25N41k51r11p2Q89P43o10n80m77K90J218M0j178m67M64
2559i2Q89J67r56p37L50R02O07o88q60J27P83J81o30k20K11N25K58j286l11P42
2579c8O23L4q84m15R27O64Rj096r22K86J441N05j012j120j12J277J007o92j122
2598f40p5N42R08k91q85k37L63Q89q79l97J10M58L37J6r24l30Q20N81l86p72j56
2619i48P00R78n39j068n00J105R13r8j254m60Q10P17J67n34j037N64N80L95o92
2638b01n44K67M60J82p01L9L44N39l00o43p7R2J088j25j000o34P78J221q9r07
2658b11p83N06J193J94p69p19k94J273Q56p89p47l17R13O70L1q57jL14K79k53
2678D89m03J59O00J08m17k75l34Q13J73m97j142K02P30Q17n08r66r5N83Q28m56
$$ plain form
2539 34 603 888 88 -456 269 810 559 -352 -424 465 1208 598 18 -459 -169 1049 1089 -89 -556 -92
2559 -92 797 964 8 -729 -379 523 1130 442 -418 -291 492 673 43 -177 34 559 817 -469 -780 -38
2579 -38 585 619 -265 -680 247 911 920 -176 -1098 -812 629 1134 122 -998 -1110 167 1174 482 -640
2598 -640 -715 -173 735 444 -441 -678 -315 574 -305 -702 -592 -134 203 219 -705 -1035 -215 366 -20 -792 -948
2619 -948 -248 730 191 -877 -1377 -272 641 543 -711 -1171 -361 356 523 -11 -1048 -484 96 491 -201
2638 -201 -745 -478 -18 164 -537 -498 -154 385 85 -558 -635 -543 545 420 -580 -1214 -436 785 696 -211
2658 -211 -994 -488 705 899 130 -589 -883 390 1246 457 -290 -607 306 976 1007 150 149 463 742 489
2678 489 86 245 845 953 536 261 -73 740 913 416 -726 -524 206 1023 515 -451 -546 37 865 409
2698D09r44J07K83O51m0p24m24M86L57k8m76PM14K78K8p01l29P32N53L0q08j45
2720b84L91R85N8j126o26K85J347P0r45o42J6J386m5q86o36L21P21L77o35j094
2740i62L79L52N33n27n58K10L95k64k77l23J34P83J55n40r53K45J509k79m79n38
2760a005n4J128O31l68j137l69J211M90l44r34K95L46J030n29o37k54O61K56l68
2779D9o34J49N64N48l87p31J92M29M55k25j002k04Q71O83l33q84j44O22O45J44
2799H07j024n30N39Q11J67j005o0L53M66K38p64n73N71Q48j67q15n2Q0P95l2p39
2820h6l98K50R44l5p86o38M31J038K75r77n93j79J238N18p07q11k50R92M66l07
2840C85p69J10O37L74o14m64K98M61J94l91o63j3R17L95q11n97M91J002j37l15
$$ plain form
2698 409 -535 -428 -145 506 466 -258 -682 -196 161 133 -343 -336 78 356 384 -317 -646 86 639 669 -139 -284
2720 -284 107 1092 1150 24 -602 -317 1030 1100 155 -487 -471 915 870 -16 -652 -331 390 767 132 -962
2740 -962 -583 -231 302 -225 -783 -573 -178 -442 -719 -1042 -908 -125 30 -510 -1463 -1218 291 12 -467 -1005
2760 -1005 -1059 69 700 332 -805 -1174 37 527 183 -751 -456 -110 920 391 -246 -500 161 417 49
2779 49 -585 -436 128 676 289 -442 -250 179 634 409 -593 -797 74 757 424 -460 -604 18 663 807
2799 807 -217 -747 -208 603 770 -235 -295 58 524 762 -2 -575 -4 844 677 -138 -190 -110 685 653 -86
2820 -86 -484 -234 710 675 -111 -749 -318 720 995 18 -575 -754 484 1002 295 -516 -766 226 692 385
2840 385 -384 -274 363 737 123 -341 -43 418 612 221 -442 -455 462 857 46 -551 -60 942 805 490
2860D90j132k9P49N38j18j027n80Q04Q21l66q03l98L99R26o47k33k00L98N40n73
2880d41l62J2O38K19j69p69M7R22J95j61p29m32R53Q19J59j174l48p2J569kj123
2901b49j72N6J064jn68l77J54N95K97n45l67M7O34l54m50j90L59N79j10n75m52
2922f25N20N07j07n25l89RR38J57n19q01K86P41M72n13l36o6M12O53l51o60j89
2943c86O18N74l24r49N69M62L02m48m39M2N07J15l29n32N4Q73M21m60j217rP57
2964B01R04n33q87m65P36P28o7q50J15J05P32l32m90l45K55O40l54m94k28N96
2984c3L31m5m62m85P26N18l73n06m64O33P20o10l55o60M60J127j53p12l07J21
3004e29P35J11l72p33J12P45M18o49m85P5N21M81o61l53J71P35Q4p18l24L41O72
$$ plain form
2860 490 -642 -671 78 616 498 -529 -1109 -305 516 150 -653 -1051 -652 274 -373 -606 -806 -408 132 -441
2880 -441 -803 -791 -153 66 -103 -872 -825 97 292 131 -598 -1030 -77 742 901 -273 -621 -693 876 874 -249
2901 -249 -421 -365 699 698 130 -247 -93 502 799 254 -113 -66 568 214 -236 -426 -67 512 402 -173 -625
2922 -625 -105 402 295 -230 -619 -610 328 485 -34 -835 -549 192 664 151 -185 -251 161 814 463 -197 -386
2943 -386 232 806 482 -467 102 564 866 418 -21 21 528 643 314 -218 -164 709 1130 670 -547 -556 201
2964 201 1105 572 -315 -780 -44 684 617 -233 -118 -13 719 387 -103 -448 -193 447 93 -401 -629 -33
2984 -33 298 253 -209 -694 32 550 177 -329 -793 -160 560 -50 -405 -1065 -605 522 369 -343 -650 -529
3004 -529 206 317 -55 -788 -676 69 487 -162 -647 -572 -51 430 -231 -584 -413 322 406 -312 -636 -295 377
3025C77L82l71q65J37P66M23m71q95K0P68K68j08p89m83R87J44j57n22j52M87
3045e4J75k26k15j31M76L43k67n66j1Q06J99j96q68J58P98M55o92m60j94O67O79
3066H76k94o11n82N96O80J19n64o79O95K43J76m02n79N23M05k8k62m56N45L88
3086G89Q4q14m90N08O96o2o97p91Q13L31L78o64p03J9P83N80p25m29N7M65M76
3107F04k83q27M0N87L34m09n05Q6N20L84q16m49J70R30L2l92q80O57L26J96j62
3128A43r26J68P33N50n40p78l88J057N15o49n13j92L76O72Km97l67M96K20J30
3148B12o34k46N27L09J05n65p7L90O52p24k39j63L07P68j48r26m63P01Q48j25
3168E09q29l72L09P94L9k93p17J41R08J0n74M8K8O18Q1q71m0J45M48J35p54l3
$$ plain form
3025 377 759 388 -477 -340 426 849 378 -517 -497 271 539 431 -358 -841 146 290 133 -389 -541 -54
3045 -54 121 -105 -320 -451 25 368 101 -465 -476 330 529 333 -535 -377 421 876 184 -276 -470 197 876
3066 876 582 -29 -611 -15 665 784 220 -459 236 479 655 253 -326 197 602 574 312 -144 401 789
3086 789 873 59 -431 77 773 711 14 -777 36 367 745 81 -622 -603 180 760 35 -394 -337 128 604
3107 604 321 -506 -466 121 455 46 -459 -373 147 531 -285 -734 -564 366 398 6 -874 -217 109 305 143
3128 143 -783 -615 118 668 128 -650 -1038 19 534 -115 -628 -820 -444 228 230 -267 -634 -138 82 212
3148 212 -422 -668 -141 168 273 -292 -369 21 673 -51 -290 -453 -146 622 474 -452 -915 -214 634 509
3168 509 -320 -692 -383 411 450 157 -560 -419 489 499 -75 -27 1 619 700 -171 -211 -66 382 517 -237 -270
3190b70J09P17j29r8q85K02Q10L42p16n57L89L35M99k94r07R8M53J56J27m47k57
3211c23O27J14l90J39r6K46J89m02n5k10M87M58o65l09j00M90O63o70n38K00L90
3232B45M5K96r22N9L12N45j04r24l23O87L82R6m78o91L65N46j83m0k34J35K57
3253G1j54m70j44M31O61l79p03j47M49O17j20o06m28P08M20K02q36m70L62P06
3273A70J78j64n69q2P34J36m78l03K90J89M44m44m39J33M33q1j45k80P7R19k69
3294D49o05l80K28M61K02n86n80J20N27O30n52m55%M93L54l46j22o2J63N26j58
3315C07l81NJ85L00j84J04p74N66O15n31j75m5O42N3j40j87m67M59M44m26m54
3336h4k47M83M84R0p31M9J00O6K09m48r9m5J66K41j98l04M29L18n31k69k3M50
$$ plain form
3190 -270 -161 556 427 329 -556 -354 456 798 82 -475 -86 249 748 454 -453 -355 98 254 381 -66 -323
3211 -323 304 418 28 167 71 317 506 104 49 -161 326 784 119 -190 -290 200 863 193 -345 -145 245
3232 245 290 586 -336 -277 35 580 476 -448 -771 -84 298 394 -84 -775 -410 136 -47 -87 -321 -186 71
3253 71 -83 -553 -697 -266 395 16 -687 -834 -385 232 112 -494 -922 -214 206 408 -428 -898 -536 170
3273 170 348 184 -385 -467 267 403 -75 -378 -88 101 545 101 -338 -205 228 147 2 -278 -201 718 449
3294 449 -156 -536 -308 153 355 -231 -811 -691 -164 466 -86 -541 -541 -48 306 -40 -162 -224 -61 465 307
3315 307 -74 -69 116 416 232 336 -438 128 743 212 37 -8 634 687 547 360 -107 352 796 370 -84
3336 -84 -331 152 636 726 -5 44 144 210 419 -29 -128 -173 -7 234 36 -268 161 479 -52 -321 -344 106
3358A06P3M57j012k07M05M21J24o46q9K01M59J60o89k33M84M7L41j83n62j63N08
3379BM59q5o68k4J9L05j02l29K24K27L21k58m54j69Q82n0n67j77J7N45K23n54
3401b13m16J92L92L87k22m93K8M39K40n95Q7m24O40K96l80k27k35M91L10k33n20
3422d56K80J54k5L32o44N8J92N10k20n52q9K95N38j90m00k37K06N31K24p37p3
3443c03K32K89L85n15k18J46M08K70m93k15L82J9p9l1m71J54N88o4o81N1L61K23
3465D38p1j92m39K38O56K7m55n47j54N75L90l67l62k69P17K33l86j81k92N23L97
3486D79m00n74K68L34M27o11Qj11M40J26j56q37J64N13K58M9r31J55M35L41j26
3507B51l63j18J10K46J94m31l64K72L72k30j80k01L77K93o22j33L07M1L85j33
$$ plain form
3358 106 179 636 -376 -583 -178 243 367 -279 -368 -167 292 452 -237 -470 14 61 402 219 -343 -506 2
3379 2 461 376 -292 -316 -297 8 -94 -423 -199 28 349 91 -363 -532 350 300 -267 -444 -427 118 341 -213
3401 -213 -629 -437 -45 342 120 -373 -345 94 334 -261 -174 -598 42 338 -42 -269 -504 -13 297 64 -456
3422 -456 -176 -22 -47 285 -359 -301 -109 401 181 -371 -460 -165 373 183 -217 -454 -248 283 507 -230 -303
3443 -303 -71 218 603 88 -130 16 424 694 201 -14 368 387 308 277 -194 -40 548 484 -197 -146 215 438
3465 438 367 175 -264 -26 630 657 202 -345 -499 76 466 99 -263 -532 185 418 32 -149 -441 82 479
3486 479 79 -495 -227 107 534 -77 -69 -180 260 386 230 -607 -443 70 328 377 -554 -399 36 377 251
3507 251 -112 -230 -120 126 320 -111 -475 -203 169 -61 -241 -442 -65 228 -394 -527 -220 -179 206 73
3527G3l39k09J87M78k42j30p36N61N39N3n02p12O93M94N4o93n4R7O47J66o55j0
3549b40k55O81k62J02j55k30K71O19o26n9J45L37J72o35l6J84J52K42k77l55N9
3570a66O41k5j92n02N6L55L78j97n36j09L72M63k75n64J10N77J59j79o58L30J63
3591B01K20k16l66K54J68K00k45n51J86M88R1n7o59L02O2K82om69l33K75O37l22
3613A42k20j78J97L30j32Om82M64J7l50K23m99M00M57k41n04M6M65R3L51q21o8
3635c04L29M35j04n76j94j9N02j83j5m55r6O45M58q04J12K4M97k61k55k07M8M90
3657F7k7q9m74K87M86n8l9n89J74J39M75n66k98P1N82J86r8p79j40J031L2j96
3679A77k71l18K53L66m6l57k65K88N08m74J2j37J31L45j48p5k63M98L65l74j99
$$ plain form
3527 73 -266 -475 -288 190 -52 -182 -918 -357 182 235 -267 -979 -286 208 262 -431 -485 -388 259 425 -230 -240
3549 -240 -495 186 -76 26 -129 -359 -88 531 -95 -154 -9 328 500 -135 -171 13 165 407 130 -225 -166
3570 -166 475 450 258 -244 -188 167 545 348 -188 -297 75 538 263 -301 -191 386 545 366 -292 38 201
3591 201 421 205 -161 93 261 461 216 -335 -149 339 430 373 -286 16 78 360 354 -115 -448 -173 464 142
3613 142 -78 -256 -59 271 139 145 -337 127 144 -206 17 -482 -82 375 134 -370 -324 141 234 585 -236 -304
3635 -304 25 460 356 -220 -414 -433 69 -114 -129 -584 -680 -35 423 -381 -269 -245 252 -9 -264 -471 -423 67
3657 67 40 -49 -523 -236 250 192 153 -436 -262 -123 352 -214 -512 -441 141 327 229 -550 -690 341 373 177
3679 177 -94 -412 -159 207 161 -196 -461 -173 335 -139 -127 -264 -133 212 64 -11 -274 224 589 215 16
3700A6p1J53O74n69l16q6K43N15n1m98l22L33O63p0o20P4J55R9J19o87j20M31
3722F5j0L15k60k93nN89j86l89K75j54O31o53j41K03p0N0O61o70k45K31K47k7
3744A64N6m08P8L35l33R8m48N1R6P82n79kk66L86q5j4j93K2O30k39o6l32j93N54
3768I4P0l11j86o7N59J82j49l83pJ03M63m18n85K55K92K38j95Qj47k22N50k38
3790i4K03l48o7M63j29p3l42L13M32l22J17m37lM48Q6m01m85L85K53J81l42M4
3812a18J97J10k43k75L14k88O06k30l5m32L10L09k24K7l13M55k00L80l02k37J32
3833e7M23j81Lo74K94M28P02j081q2J88N71j65l95nq7O06p2k2o14J80M09j38l39
3856a08j06O9J27J25k03l6J54J73j31k19P1k62N05P8o1l45j81L57M58j04n72j44
$$ plain form
3700 16 -55 98 772 203 -113 -199 44 559 508 10 -312 21 684 614 -6 68 223 322 441 -246 -366 65
3722 65 55 370 110 -183 -188 401 215 -174 101 -53 578 -75 -216 -13 -83 -33 628 -42 -287 -56 191 164
3744 164 220 -188 -110 225 -108 -10 -458 -407 -311 471 -108 -110 -376 10 -75 -89 -282 -260 370 131 65 -267 -460 94
3768 94 164 -147 -333 -400 159 341 192 -191 -198 -95 368 -50 -635 -380 -88 150 -45 -37 -184 -406 144 -94
3790 -94 109 -239 -306 157 28 -45 -387 -74 358 36 153 -284 -287 161 247 -154 -639 -254 -1 180 -162 -118
3812 -118 79 189 -54 -329 -15 -303 303 73 38 -394 -84 225 1 28 -285 170 -30 350 48 -189 -57
3833 -57 366 185 188 -486 -192 236 938 -143 -225 -37 534 369 -26 -31 -118 488 416 394 -220 -40 369 231 -108
3856 -108 -214 -145 -18 107 -96 -132 22 195 64 -155 -84 -346 159 237 176 -169 -350 7 465 361 -211 -355
3878c55L66K14J17n14P0J06K03j95J49j93q7J70J8K51l96K2J94n4n07J29J26K63
3900I7o2j28l18J8L91J51m10P5J44L44N0k91l01K3K55j28q0j06j39M28Q2q0k2
3923gl10J98Q9j7m75N68onm1k77K1N88p0l01j75P0K25K36k23l43J16l7N35j82
3947A77l98k4L86J44K7j63o97Q55Lo9m40M01l54J96L5k48J0M76k24J57m98K53
3969Ej6Q7J46m20J85j10N04j46l82l22L70L99q1o9m17J92L43J55l11j43J40K97
3991D06m02p8k90J92N82l46k51K56j66L35l52L2O6J5K36J9k48j34l7K85K41k83
4013G8l54R7L34J27p21M97j33p1L62k21k72J8L29J5l12j52r6M82P5j97k94J5L30
4036f4P5M4j76l89K15P26n14k35l57L29M61j72j67J56%J53K16n04r4K47L47j6
$$ plain form
3878 -355 11 225 342 -172 -102 4 207 12 161 -32 -119 51 69 320 -76 -54 140 86 -421 -292 -166 97
3900 97 35 -93 -411 -393 -2 149 -261 -186 -42 302 352 61 -240 -217 38 -90 -170 -276 -415 13 95 15 -7
3923 -7 -317 -119 -30 -47 -522 46 40 35 -6 -283 -262 326 256 -45 -220 -150 75 311 88 -255 -139 -176 359 177
3947 177 -221 -245 141 285 312 149 -548 307 310 241 -199 202 -152 44 79 -169 -159 317 93 250 -248 5
3969 5 -11 76 222 -198 -13 -123 381 235 -147 -469 -99 300 219 150 -267 -75 268 423 112 -31 109 406
3991 406 4 -74 -364 -172 410 64 -187 69 -97 238 -114 -82 -16 -1 235 254 6 -128 -165 120 361 78
4013 78 -276 -179 155 282 -439 58 -75 -146 216 -5 -277 -259 70 85 -227 -379 -475 7 82 -115 -409 -394 -64
4036 -64 11 55 -121 -510 -295 431 -83 -318 -675 -346 115 -57 -224 -68 -68 85 301 -203 -297 -50 297 281
4058B81l31n8q0K76j54q8K58m33M29N2r6k45M62J56j95m74J71J72J61Q2l88j13
4080a55N1J80J0L3k41J16k3K01k37R3q3K00J60m45J50J14J45n3n47L90m2j08L44
4103B53l64%J4L73j41j08j58j20J98L93l30Nj45K57M70m55J4m26L09K63l7j65
4125A00m30M52J83k68j26l0J65P9l10j26K01J85P%k60K2M47J67k38m70J74j51
4147b27L65Q1k64l68K50P9K35r2l56J86L17j62k13J09L9K51m9l22j02J38J86P0
4169A51n8m56K61K77k62K24o65K20M99r6l92j9J27K66N4j42k27p6M60J6j82l16
4191c36J82M40l49J16l81M28Q7l4l4k79J40O4J36j83o2j38P24m08M3n35N49K21
4213C91k32j08j8RJ45J44j37k88J8m3M62k93j47J16Q1J44j58P9j78l9K56k26K75
$$ plain form
4058 281 -50 -108 -188 88 -66 -154 104 -329 100 152 56 -189 273 429 234 -240 -69 103 264 346 -42 -155
4080 -155 -104 76 86 119 -122 -6 -29 172 -65 28 -55 145 305 -140 10 124 269 216 -331 59 17 -91 253
4103 253 -111 -111 -97 276 135 27 -131 -251 -53 340 10 15 -130 127 597 142 156 -270 39 302 265 100
4125 100 -330 122 305 37 -89 -119 46 125 -185 -311 -110 75 82 82 -178 -156 291 458 220 -250 -76 -227
4147 -227 138 219 -45 -413 -163 -84 151 59 -297 -111 206 44 -169 -60 -21 230 181 -141 -243 -105 81 151
4169 151 93 -363 -102 175 -87 137 -528 -308 191 95 -297 -316 -189 77 131 -11 -238 -314 146 162 -20 -336
4191 -336 -154 286 -63 53 -328 100 187 153 119 -160 -20 44 180 -3 -65 -203 521 113 156 -379 170 391
4213 391 159 51 33 42 187 331 194 -94 -76 -119 343 50 -97 19 100 244 86 165 -13 -52 204 -22 253
4236B53n08M00J0k9j61j7K04j49L0j37k13K21N2K88p0m9k63L49q0k1j65J65K9
4259A39K70n93J77l2J11L6K00j45r5N2j64K68m49K89j4L91m61R1k46K31J46m50
4281b48l0J80J80o2K83q03L46k8J79m9R5q4M0K44k49j33k39O97n07J35j61J00
4303a14M4K7J69m19L79J67j0j92m31qO07J89k79k52j24K01L48m06j53R8K36J47
4325B24J38m75M8m9J86n4r3J74n9J95l7l0k98J26K34o4N6k13k42L37l33J93j94
4348b30M08M3l7r7l49R7M40p8j72j44MJ72L67n80J80J79k00J69M8l69J56K50r6
4371A61O9k84j5J70K72l83qn5J78L79m33m8l26N35j6k61J17j07K30J66l03j21
4393h3J39K1l2n4J11l17K94n5q8n4k43L26J19p2l30K41Q1o1N34p62pJ93M9N6m29
$$ plain form
4236 253 -255 145 155 126 -35 -52 152 3 33 -104 -317 -96 -44 244 174 125 -138 211 131 110 -55 110 139
4259 139 409 -184 -7 -39 72 108 308 163 68 120 -44 224 -225 64 50 441 -20 71 -175 56 202 -248
4281 -248 -278 -98 82 20 303 -500 -154 -182 -3 -52 43 -41 -1 243 -6 -139 -378 319 -188 -53 -214 -114
4303 -114 -70 -43 126 -293 86 253 243 51 -380 -388 219 408 129 -123 -247 -46 302 -104 -257 -159 77 224
4325 224 362 -113 -65 -114 72 18 -75 99 40 235 198 168 -130 -4 230 166 222 9 -233 104 -229 -36 -230
4348 -230 178 221 184 87 -262 -165 275 197 25 -119 -115 57 424 -156 24 203 3 172 220 -149 7 257 161
4371 161 230 -54 -69 101 373 -10 -18 -73 105 484 51 3 -323 212 196 -65 52 -55 175 341 38 -83
4393 -83 56 77 45 -9 102 -215 79 24 -64 -118 -361 -35 84 12 -318 -77 4 -57 477 -285 -292 -99 -50 6 -423
4418d23J31J18K58k08r5J93k11J55L16k53k19N1M22j15j61k5M3J71J59n49J3M92
4440B63l9j77K50o26L12j83M68l73j31M1K84J31m05O2PK94N0k08r6j3Q0K53j30
4463A14l33K00n8P8J07j53j03L41m8J13l73J85J43N3l23K0N1l5K41j18l22K62
4485D2J85j9Q8l58m3J74K25r6k20J02M3M25m57r9j5J45J39k60K55j18K89j95Q5
4508C17k44l68N33j43K29n41P1M18m50J69o5M21n17K01N6l23K58jJ96k23j70r
4530a85k56N74j81m1j70K42M0n1J34l79N23l43p3K58k13JK69K70o62n1J00M34
4552B40l90J70k07J10J33J89l46J03o6J14R5m6O5k10L24J02m80j53O7K4L38m05
4574b29J73l25L80L17k04j37k6j65K54R8k57k93M26J72j48o2J16j23M32m14R1
$$ plain form
4418 -423 -292 -174 84 -124 -219 -26 -237 -82 234 -19 -238 -187 235 120 -41 -66 -23 148 307 -242 -229 263
4440 263 224 47 297 -329 -17 -200 268 -105 -236 -195 89 220 -185 -123 -116 178 228 20 -76 -89 -9 244 114
4463 114 -219 -19 -77 1 108 -45 -148 193 145 258 -115 70 213 266 -57 -37 14 -21 220 102 -220 42
4485 42 227 208 296 -62 -105 69 294 198 -22 80 123 548 91 -8 -23 122 261 1 256 138 427 232 317
4508 317 73 -295 238 95 324 -217 -146 272 -178 -9 -74 347 -170 31 87 -236 22 21 217 -6 -176 -185
4530 -185 -441 133 -48 -89 -259 -17 23 -28 106 -273 250 -93 -166 92 -121 -120 149 419 -243 -294 -194 240
4552 240 -150 20 -187 -77 56 245 -101 2 -64 50 145 99 164 -46 278 380 -100 -253 -186 -162 176 -229
4574 -229 -56 -381 -1 316 112 -25 -51 -216 38 136 -121 -414 12 184 36 -26 90 -33 399 -15 76
4595G6q7j08J95m9l26L34J46K72k88k68N1K55j39J81L7l50N9K05k83K69j86p9
4617h3L94l32M6j02J69K2j53K05Qm96N26P1o35M97l8J66j64L5k82o8M76O0l56
4640c4j55M6M79j98j5m26K15L78l0m55m3q0L60j14M7K1j56Q6K91k40k02n0J16
4663a59K59k33j42m3M73r0k23j76J87J94K88k61o7j15J05K40r6k82k55K21L54
4684A79k34j8l12L75J88j98j16j46L20Rk8k21K71m1M7J33n32J0J42Q9qK28n07
4707c70L64L32l09J3m18M24K79l89K71l47J74K78j21m9j29j5L6j3J83j88P5R0
4729A71QN9m36K70m2K45l15n5J34J19k0k1m50k5L74J22m9n0m9K32J12k78M4%o2
4754C8O5K77m50K01J5k45J72J29k41k6K59j48k0L9p5J32ol52r6R7J33m7K22l44
$$ plain form
4595 76 -11 -119 76 27 -299 35 181 453 165 -103 -52 203 64 245 282 -68 -9 196 -87 182 -4 -83
4617 -83 311 -21 25 -77 92 114 -39 166 174 -322 204 275 -360 137 99 265 101 136 -146 -214 262 322 -34
4640 -34 -189 -143 336 138 123 -303 -88 290 260 -195 -238 -318 42 -72 -25 -4 -160 -74 217 -23 -225 -275 -159
4663 -159 100 -133 -275 -318 155 65 -158 -334 -147 47 335 74 7 -108 -3 237 141 -141 -396 -175 179
4684 179 -55 -73 -385 -10 178 -20 -136 -282 38 47 19 -202 69 28 75 208 -324 -314 -172 -83 -91 137 -370
4707 -370 -6 326 17 30 -388 36 315 -74 197 -150 24 302 181 132 3 -12 24 11 194 6 81 171
4729 171 179 238 -198 72 30 275 -40 -95 39 158 138 117 -333 -358 16 138 89 39 -10 222 334 56 100 100 38
4754 38 103 380 -70 131 146 -99 73 202 -39 -65 194 46 26 65 -10 122 116 -236 -332 -235 -102 -149 73 -271
4778b71L18N4J81k68k06Q4K96j79j63R8J19J26k81P3m3O1l58K29j27J56L18J5
4800B32k50k4k17p3N49j51j48R4Lk05L63k71j35j70K80L86N8k47k39K02j2k10
4822a85J1p7j8J46K52k67n2L43R9J13l96R5L20p1k80j23L19k71K26l42K19j83
4844a22R9k4o3N2j34J64L18m21k2J10J93L52n64k45J92J5L16N2k82R5N1J8j96
4867d6K57j92l5M14m00nO9J16Q5j69r6rJ4J11k48L36l07j29L11J79j44j38O5N1
4891I0N3l31%J81J79k40J06j05j65L23kl09J90j8j95L22o9k0k92L26l16L75j56
4914g3m86M50M90l87l47M38K01k48R0m23L63q3K43n12k8M96q5j73K81l21l5k21
4936c70M56k48k70L13M70k68k68Q7p5L38m2R1n84J78K51J34k12l80J92J55j99
$$ plain form
4778 -271 47 101 282 14 -192 -108 188 9 -154 -56 63 189 -92 -19 -62 -1 -359 -130 -257 -101 217 232
4800 232 -18 -42 -259 -332 217 66 -82 12 15 -190 173 -98 -233 -403 -123 263 321 74 -165 37 25 -185
4822 -185 -174 -251 -269 -123 129 -138 -190 153 252 365 -31 64 384 313 33 -90 229 -42 184 -158 61 -122
4844 -122 -23 -47 -110 -58 -192 -28 290 -131 -153 -43 150 502 -62 -307 -115 -100 216 268 -14 81 132 150 -46
4867 -46 211 19 -16 398 -2 -7 62 178 263 94 -2 -11 3 114 -134 202 -105 -234 77 256 112 -26 39 90
4891 90 143 -188 -188 -7 172 -68 38 -67 -232 91 89 -220 -30 -48 -243 79 10 -10 -302 24 -292 83 -73
4914 -73 -559 -109 381 -6 -353 85 286 38 128 -295 68 -15 228 -284 -312 184 99 -74 207 -114 -149 -370
4936 -370 86 -162 -432 -119 351 83 -185 -98 -173 165 123 214 -370 -192 59 193 -19 -399 -207 -52 -251
4957b51J59j34M57j47p0Q3n3l20P1M23j55j86L97j04j74J50j50r9J70j02R2N7
4979A14k45j3K53j61p1L4P6K86J29m92K01k19L27j31o1k00L08m0J51k08j44J32
5001B6J11k31j76K38K70K8L5l62n4P4j00J34K07l29M36m66K05j21r3N05k33j10
5023fL91l93n9M2KR7j99J88K0P2j53K66k08N1J64J0k84qPK97l92j2j01N57j02
5048B47l50l38L93j04K60M2j96k35J46J79j42l55L90m5j57K88o1J45j03J53l61
5069b04J78k5p2O1L25l89J02k70N1J74j66p7J08K00j0J95l75L79j5r4j52k77M00
5092D7L89k71j01l43L20J24k34K62n66L22j5K03j22J80n4j22K14Q5l56j91K28
5113aK1Q2l0M8Lj71K37l51m0M63q3l8n8j94K98K53k54j45k64L68k20J65j20k10
$$ plain form
4957 -251 -92 -226 231 84 14 97 44 -276 -205 218 63 -123 274 170 -4 146 -4 -103 67 -35 57 114
4979 114 -131 -144 109 -52 -123 -89 -13 273 402 -90 111 -108 219 88 27 -173 135 95 246 38 -106 26
5001 26 137 -94 -270 -32 238 266 301 -61 -115 -41 -141 -7 200 -129 307 -159 46 -75 -168 337 104 -6
5023 -6 385 -8 -67 -25 -23 74 -125 63 83 155 2 268 60 111 275 285 1 -7 0 297 -95 -107 -208 349 247
5048 247 -103 -441 -48 -152 108 150 -46 -281 -135 44 -98 -453 -63 -108 -265 23 -38 107 4 157 -204
5069 -204 -26 -51 -123 -62 263 -126 -24 -294 -243 -69 -235 -312 -204 -4 -14 181 -194 185 170 76 -76 -353 47
5092 47 436 165 64 -279 41 165 -69 193 -373 -51 -66 137 15 195 141 19 233 318 -38 -229 -1
5113 -1 20 102 72 120 123 -48 189 -162 -202 261 178 140 82 -112 186 439 185 40 -224 144 -76 89 -31 -241
5137b41J9L92k09j44j10J17L16L13p60K94K64k01q6K11l23K16J78J6k23PJ10J57
5159C13L8l46P8j26J28J38j93N7p3J70q7m5k27P1K02l17J23J59k95N02k09j04
5181d3R0k41N7M34m89j41L76K32k18j47k43Q0J35K89m65k8P9J84K42l87P1L8n2
5204a47J23M5k17o0J58J77j32N7k26N1J71q3J89m13L01O7j48k37L72J9j75L44
5226B36n07J89K39M0j84k91p5N36j20R6k28L3J23N5j32j14m1K62j42o9K25m33
5248c02M17j32J83k00o8K41J57m27m2r9K75m4J02o5P8k50jJ37K20j74k4K24J2
5271B18j70jN8R4j43k6J23q5l6j43P6k01J04N59j73k72l62M45J29Ko6l17K56k2
5295D7L65k82l78L60n0n6J7j10n0O4L8Q5J07j69k22K74m7J07l15R3K10M0j33j37
$$ plain form
5137 -241 -222 170 -39 -183 -293 -176 140 453 -307 -13 251 50 -36 175 -148 68 246 262 39 46 156 313
5159 313 351 5 83 -43 85 223 30 87 14 184 97 52 -175 -104 98 -219 -96 63 -232 270 61 -43
5181 -43 47 -194 -137 297 -192 -333 43 275 57 -90 -333 -253 -118 171 -294 -322 -243 -59 183 -204 -133 -95 -147
5204 -147 -24 21 -196 -256 -98 79 -53 4 -222 -171 0 -83 106 -307 -6 61 -87 -324 48 67 -108 236
5226 236 -271 -82 157 197 13 -278 -353 183 63 159 -69 -36 87 142 10 -104 -145 117 -25 -94 131 -302
5248 -302 115 -17 166 -34 -102 139 296 -131 -173 -272 3 -41 61 -4 74 -176 -177 -40 180 6 -18 206 218
5271 218 48 47 105 199 56 30 153 68 32 -111 -35 -236 -132 427 254 -18 -380 65 194 196 130 -187 69 47
5295 47 412 130 -248 112 62 6 23 -87 -137 -73 -35 50 157 -12 -234 40 -7 100 -215 -122 88 128 -5 -142
5319a42J92j18N4J29k61J67J15mj89k21J98r1K25j70R0N8j82L32m83K09J89m05
5341c08K20k96O57n29J73J2J65r9l0K11l21j05K5J90ll8J87k80L25j53J17r1j32
5364a03N9K57l31M42m34L53jl39K24n73K46J57J78j37J39j79pJ2J99j99j94l1
5386b62K52n2j43L50m31L45k24R3K77k38K92j82l25L9M3J89l08K19O1J07J25k35
5408hL42o94N13j6l65N0K55l6J22N6j82l1j01K68K8M5j80k44K36J50l02j3J33
5431B6l1J44p7N5k09j41O4k7PJ28J62J19j73k8L1j06Q1Qj39Q3r4L79l11m80M28
5456a01J82L4m73L61J35O8j19k03J63k00Q0%Ol21N12l91K33m19L65M03l19j41
5478a45J52p0L7l6m1M27m08J49l17L21q5n6n0m4J8K78j85P7Q1k91J13J47j1m3
$$ plain form
5319 -142 50 -68 -14 115 -146 21 136 132 -57 -278 -80 -171 54 -116 -26 32 -150 182 -301 -92 97 -308
5341 -308 -88 -384 273 -256 -83 -71 94 -5 -35 176 -145 -250 -225 -35 -38 -76 111 -169 156 3 120 29 -103
5364 -103 -44 213 -118 324 -110 243 242 -97 127 -446 -200 -43 135 -2 137 -42 -49 -37 162 -37 -231 -262
5386 -262 -10 -62 -205 145 -286 59 -165 -72 205 -33 259 77 -248 -209 -166 23 -285 -66 -5 102 227 -8
5408 -8 334 -360 153 137 -228 -178 77 41 163 219 37 6 -95 173 201 246 66 -178 58 208 -94 -107 26
5431 26 -5 139 62 117 -92 -233 -169 -196 -189 -61 101 220 47 19 50 -56 25 33 -106 -23 -117 262 -49 -529 -101
5456 -101 81 115 -358 3 138 206 87 -116 47 -153 -73 -73 -67 -388 124 -267 -34 -453 -88 315 -4 -145
5478 -145 7 -63 -26 -62 -103 324 -84 65 -252 69 -16 -72 -122 -166 -148 130 -55 22 103 -188 -75 72 61 18
5502A8q5J05j25R2K7j63N97m94o9K20K06m05j24R6J18rO0q2N4n9J43J15m95L08
5526D9Rk83N07l47J70l48K65N7j8M8j71n2J62p2p6R1j77L18l08O3O0nk0L23j18
5551A27l58K21L6k5J9L2Rl7j07l0K47k32J14K71k04Q9j26j11J27j16K58l43J71
5574C2N1l01J94k83L54k76J64J65j43K0L7J60k08n5k13l2M19j15O8m3K81m81M4
5597a61J44J0q9o7M0J51P6O0m04L01k61K14J36O5p31P55k78k19N28k10O9j66r
5620d6j08p0N1qJ19kL2j30OO3O1K1l90L90j1j27K26R2l67K04j41K26j93J76K35
5645C09l58j58K14M3K94k15j77N5J82j45j27N9lK21l12K78N1n82J63L52p2m4j70
5668a42n0K98R5k95r5L48k20N1M09l06J5r3K10k38j0pR2j35J2k1l3J08L68k64
$$ plain form
5502 18 -67 38 -87 5 32 -131 466 -28 -97 123 329 -76 -200 -104 14 5 65 -17 37 -22 121 236 -259 49
5526 49 58 -225 282 -65 105 -243 22 79 61 109 -62 -114 48 -24 -100 -9 -186 132 -176 -113 -53 -58 -78 245 127
5551 127 -231 -10 26 1 20 52 61 24 -83 -113 134 -98 16 287 83 172 46 -65 62 -54 204 -139 32
5574 32 83 -218 -24 -307 47 -229 -65 100 -43 -23 14 174 -34 -89 -302 -334 85 -30 38 -5 276 -205 -161
5597 -161 -17 -7 -96 -163 -123 28 104 164 -240 61 -200 14 150 215 -516 239 -39 -258 270 60 129 -37 -46
5620 -46 -154 -224 -173 -181 -62 -64 -32 -162 -156 -93 -32 -11 -401 -11 -22 -149 77 169 -198 6 -135 91 -102 74 309
5645 309 -49 -207 7 50 344 129 -48 7 189 44 -83 -24 -27 194 -118 160 211 -371 -208 144 72 28 -142
5668 -142 -192 106 201 -94 -189 159 -61 -10 399 93 108 15 225 -13 -23 -30 62 -73 -61 -82 -115 -7 361 97
5692I7j11j62J07P3k99L45j85j48M41r5j65N9O4L4m7O7m0R8J39k72j80J07Q3q6
5716g6n1oJ32J77j44m48K82k19N98l85K13l07J36L0J84n4k66M8K71J94k11j69
5738g1qL4Mj02Q7J07KJ19j77K85l25j08p8L68j11l23L22l5k09M7J71L04k42J13
5762A74j78o2L1L07j70k19j04K91n4j44K76J78m53K2J98k26K38n2K14j77j54J56
5784I2K9j43J91l85J54m5K07O4l9q0j95M55l49J68r7J21J9J56k22r7J33j90lk99
5808c55K30j71J74m1j59K60J3l1J48n3j24J1p8l7L78k83J40KJ78p7l25K27l47
5831c20M52k23m2L06l6l44R7K31k06M3O8J0j05K70k73J16o6j89Q7L28M8j75l87
5854c10J05Q3J59n4k14L10N9k07N7j54J14m8J02K80q0n00K84J14l5k09J77j19
$$ plain form
5692 97 -14 -176 -69 4 -295 50 -135 -283 158 63 -102 -43 21 55 8 75 35 133 272 0 -180 -73 10 -76
5716 -76 -127 -133 -1 176 32 -416 -134 -353 245 -140 73 -234 -98 -68 116 62 -204 -156 115 309 98 -71
5738 -71 -79 -45 -41 -143 -56 51 53 172 -5 280 -45 -153 -231 137 26 -297 25 -10 -219 -172 -1 303 61 174
5762 174 -4 -66 -35 272 102 -117 -221 70 16 -128 148 326 -127 -105 93 -133 105 53 267 90 -64 92
5784 92 121 -22 169 -216 -62 -107 100 164 125 45 -150 305 -44 124 27 148 167 323 101 4 137 -53 -56 -355
5808 -355 -125 -296 -122 -163 -322 -62 -49 -80 68 15 -109 -98 -176 -213 165 -118 22 24 202 125 -200 27 -320
5831 -320 132 -91 -133 173 137 -207 -110 121 -85 -42 26 36 -69 201 -72 44 -22 -211 -124 204 252 77 -310
5854 -310 -205 -122 37 -17 -231 79 138 -69 -12 -166 -52 -100 2 282 202 -298 -14 100 65 -144 33 -86
5876h6J93R4j78J54q8j01N9J35k61J14j47J40O7o7j98J53K18j80l1QM6L2Q8l18
5900a54J75j70k3M18j84l25L17n6J66m11J64M2R7L8K60l98M66k07k66M1K26k56
5922d0M07k12r4l03M54k16R7J32l49J66O5j27r2n0M4J23N1r6k36k6P81m87j98
5945b06J67k37O30o47M17Q9j12j28l7K01j43p4N3J42q0j05j26J47q6j30qK22L27
5968B76j33l1l15J62P1J3J67k97M2N7pL1j18J3o7M79k46j94L19k60L16m11l8J65
5992fm6J90k62K47Jl08R8J79M2l80M85l00jo6m3K24K17j41m01N7%k5J92R5j25
6017g7P6q9l01M55K35k50Q1l32K41K14j87J40J1n20K17K84j32j18%J75k29Q4N4
6040C2k18K39j76M22l18K9q2L16N7n11N1KM4J21L7o3p0J28j15k16J46J64j36j0
$$ plain form
5876 -86 107 201 23 177 89 -12 47 182 -79 35 -112 28 95 28 -170 -17 201 21 -10 -2 44 76 164 -154
5900 -154 21 -149 -172 246 62 -263 54 -2 164 -247 -83 -41 56 94 354 -44 422 215 -51 -10 216 -40
5922 -40 367 155 61 -242 212 -4 93 225 -124 42 107 -20 -112 -162 -118 5 56 -40 -276 -302 479 -8 -206
5945 -206 -39 -276 354 -293 124 213 101 -27 -64 137 -6 -80 -27 115 35 -70 -196 -49 -135 -265 -273 -51 276
5968 276 143 112 -203 -41 30 43 210 -87 -45 12 5 36 -82 -69 -136 343 97 -97 222 -38 278 -133 -171 -6
5992 -6 -52 138 -124 123 124 -184 -86 93 135 -245 240 -60 -61 -127 -170 54 271 130 -271 -214 -214 -239 -47 48 -77
6017 -77 -1 -90 -391 64 299 49 130 -202 39 253 66 206 217 -303 -86 198 66 -52 -52 123 -106 -22 32
6040 32 -186 53 -123 299 -19 10 -72 244 301 -210 -159 -157 -113 8 45 -18 -88 40 -75 -291 -145 19 -117 -127
6064a27K80R7m36K00R3q0k08L57l28j1K56l7J15j60K80l25P0j81J33J34k7j39
6086d4j87K95l85N91m34J53R0k06K27l43M68m36J83r4L0l1R4L16l24j0R2L2j01
6109b4j06J67j88k91N90m62P1J32M7o9k6J12m3j88L34k72L40j23k4k61K84K50
6131B50J3k9k29K53l14j13Q3R3L88n01o9J8N0J46K20m50L37l47J41n5l5K99j85
6154c6L94j94m53K45L49l31r9N2l9M9J70j94J01k34K75l85L25j79J12K42j41l76
6176c47O48k46j07J32R4j50P4k61L84l03J48Nk30L35j46k13O6J00m8L80k48j82
6198a15J2r4M07l04M33m57R2L6j62J55l21K85j23L37k65k00J48J65n21L25N06
6219C39n19K18K12j64l10n0J63M0r3q9K23J1m3j4p7J20J5o6J73j22R2J37j69p7
$$ plain form
6064 -127 153 250 -186 14 107 27 -181 176 -152 -163 93 56 171 11 291 -34 36 -145 -12 122 95 -44
6086 -44 -231 64 -321 270 -164 -11 79 -127 100 -243 225 -211 -28 -122 -92 -123 -29 287 -37 -47 45 77 -24
6109 -24 -130 37 -151 -442 148 -314 -243 -111 -64 -133 -159 -47 -90 -278 56 -216 124 1 -23 -284 0 250
6131 250 263 234 5 258 -56 -169 -86 7 395 -106 -175 -157 -107 39 259 -191 146 -201 -60 -115 -150 149 -36
6154 -36 358 164 -289 -44 305 -26 -125 -73 -112 -63 107 -87 14 -220 55 -330 -5 -184 -72 170 29 -347
6176 -347 301 55 -52 80 174 24 98 -163 221 -82 66 71 -159 176 30 -183 -117 -17 -65 315 67 -115
6198 -115 -103 -197 210 -94 339 -118 -26 10 -152 3 -318 -33 -156 181 -84 -284 -136 29 -492 -167 339
6219 339 -180 38 250 86 -224 -274 -111 -71 -164 -253 -30 -19 -62 -76 -153 -33 -18 -84 89 -33 59 196 27 -50
6243e0J78j19J94j96P1j90j8N8K43k32j99K06j43K14O8K04k3j44k63J59j13J04
6265Ij72M96l91l5k0J18K64k99L7l3j71L18j47Q6j42J03l2J01r1K2O3K43l35k7
6289c5J37k0k8K07k89n9K20K45l49k33j14M74k09J77J69r0n5k49L20m48K48pM
6312A6J60p8k8K0L16m59M00n77K95J85j04m38L44q6J90j90N2K5k80J40L15k86
6334f8L7J05o6J18j54j11K03m9j43L2K42l2J84j86n9k05J07J07j23N4j66L38j28
6357C7J77l44R9r2K31k57J49J81m19L13Q4j63Op5k18L48P5M2j33p6M8j37j66M39
6381A49k40k27J84K50j04J65o0n6j12j73K52k65j6K34J66r1l4j8j40O4nL61k40
6404D4r3J64J82l24j07J62l36N82n8k50o4K22k60o8q2J52l5M04l8k17r5J32Q1
$$ plain form
6243 -50 128 9 203 7 78 -112 -130 -72 171 -61 -260 -54 -197 17 85 289 266 122 -141 18 -95 9
6265 9 -163 333 -58 -93 -113 5 269 -30 7 -26 -197 121 -26 60 -82 21 -11 90 -1 21 84 327 -8 -35
6289 -35 102 82 54 261 -28 -87 133 378 29 -204 -318 156 -53 124 293 203 148 -101 219 -229 19 12 16
6312 16 176 98 70 90 406 -53 347 -230 65 250 146 -292 52 -34 156 -34 18 43 -237 -97 218 -68
6334 -68 -31 74 8 126 -28 -139 64 15 -128 -96 146 114 298 112 53 -152 -45 62 -61 -7 -173 165 37
6357 37 214 -130 -31 -123 108 -149 0 181 -238 75 159 -4 2 -73 -291 57 132 174 41 -35 13 -124 -290 149
6381 149 -91 -318 -134 116 12 177 117 61 -51 -224 28 -237 -253 -19 147 56 22 4 -136 -72 -77 284 44
6404 44 -49 115 297 -27 -134 28 -308 274 216 -34 -98 124 -136 -204 -286 -134 -169 235 197 -20 -115 17 98
6427I8k7j89q5k02M27J74p6j01R4r4j7r6p5L44j31J09nk87j8J93L1N8N0n26L02
6452d9J8r6K18O7m20L28q5r7r2L40j30J10r5n2O4K9k47J87K29l96p6P2Q4r2k6
6477b07M42k73Q4J07j48q6o9O4J1J9l3L43p8q0p9Lr0J12k52J96r8J65j52j19M12
6502A94n43L58k95K38q2J85m15P18k88r4m1r5L8K43k28p3J44K04j10k00K18k57
6524a81L4P7j5o2J32k7K99l94J77M20p41J46J31jJ7J48r2K6j58j06K42Jk62m4
6548b33K23N4o9J02j16R0j37qmk49L54l34M16j94K97j47q8Q5q0J36k64p1N49k62
6572E0l84O03o2n01M76k20L3J0k24M3M07l30L18l83P1P6j03J26k24L02j87K53
6594A50m0M9r6ok32K69j78k28K70k3K37k86J09j59m1L84K7m94J56J03K15j98j93
$$ plain form
6427 98 71 -118 -203 -405 22 196 120 19 113 19 2 -94 -169 175 44 153 148 -139 -157 36 67 125 175 -351 -49
6452 -49 -31 -127 91 158 -262 66 -19 -116 -208 132 2 112 17 -35 29 58 -189 -2 227 -169 -245 -173 -89 -181 -207
6477 -207 235 -38 46 153 5 -81 -150 -86 -75 -56 -89 254 176 96 17 20 -70 42 -210 -14 -112 53 -99 -218 194
6502 194 -349 9 -286 -48 -130 55 -360 358 70 -24 -65 -160 -122 121 -107 -180 -36 168 58 -142 76 -181
6524 -181 -147 -70 -85 -147 -15 -42 257 -137 40 460 -281 -135 -4 -5 12 160 68 94 -64 -170 72 73 -189 -233
6548 -233 -10 44 -25 77 -39 51 -86 -94 -98 -347 7 -327 89 -105 192 45 -43 42 -38 98 -166 -237 312 50
6572 50 -334 269 207 -294 182 -38 -5 5 -219 -176 231 -99 219 -164 -93 -17 -120 6 -218 84 -103 150
6594 150 110 159 63 57 -175 94 -84 -312 -42 -65 172 -114 -5 -164 -205 179 206 -288 -132 -29 186 -12 -205
6617b05K25Jr3K33j12K4O4r5j06qJ23N7l70K13L00l36j73M40l40J49L47n47M43
6640B34p1m98N08j50k0L14k94j22K41j48j7N9l8L35j69K04m66J81j4K8j97j17
6662b17K06k28K98j37K81n84M06J2k79M75k87J3K12k05P1L6k26K39K65n14K49
6683H6r9mj1q4J71j7j01L5J73l54R2l33N24Q1k56J0n6r5O22j06j86lJ74j44j18
6708AL98k07l18J69q8j98K78k36L05K5l33K46J12nk18P8M9n4j7J05J26l52L63
6731B29q9j69K70k75L1r8L49l03q0j69J26Q7K15j13N2o5l3N9j71M3K03q5j77J88
6755B5n8o4J70n9q3j60J79n0J44l03M94l89m0n5M11l04J18L59k4m16Q7J54j07
6778B9q0L4J53l58j44L67K6K03m18L33r6k8P1j75J61o8j32J13j16J71j32q7K53
$$ plain form
6617 -205 20 21 -72 161 49 73 137 42 -64 -72 51 108 -262 -49 251 -85 -258 182 -158 -9 338 -209 234
6640 234 163 -335 173 23 3 317 23 -99 142 -6 -23 36 -2 333 164 368 -98 83 69 97 -100 -217
6662 -217 -11 -239 59 -78 203 -381 25 37 -242 233 -54 -41 171 -34 37 73 -153 86 351 -163 86
6683 86 -13 -17 -28 -112 59 42 -59 -24 149 -205 -113 -446 78 159 -97 -87 -143 -238 384 278 92 89 263 119 1
6708 1 399 192 -126 43 -45 -243 35 -201 104 129 -204 42 154 149 -69 9 58 4 -13 92 218 -134 229
6731 229 140 -29 241 -34 -3 -101 248 -55 -135 -304 -178 -91 124 11 63 -2 -35 24 -147 -104 99 14 -163 25
6755 25 -33 -97 73 14 -69 -229 -50 -100 44 -259 235 -154 -194 -249 162 -142 -24 335 311 -105 -18 136 29
6778 29 -51 -17 136 -222 -366 1 27 230 -188 145 49 21 92 -83 78 10 -122 -9 -125 46 -86 -173 80
6801H0J20m26J68j69M42j29o5n6jp0L27k30K4k42M03J54k33j98L72k53J53j93
6823b2J78j44N1k98O7K79k85L01Q7J15n45J78R5J5j4L9M5j32o9j05L41k40J37
6846G4l9m39L09J8K06o1PJ30j80K6k60j2L55j54j05Q2j27N9j04L67j62k4K3j94
6870b05j20O8O25m43p5m0J61K3K33j08j98K57p4k09Kl05M23k19Q4J49o6r7R5J07
6894F8Qk15L77j43J21l49k02N40k34K94k2m03M78m23P5N3Q4j52j6q5Q8k13K25
6917d6n3J58K0O0M2l10J99J63j47q5n6J41p8q7J72J97o16Q5K16L3PpJ31k23M6
6942c8o4J47On1J79n6l14K56Nj74K50l9l7q5L%k2K32l65K71k8R6l57L2L97l44
6968a00l0K32j0k43L48j27j11j3k27N32k39P3k41N2J34P8k44K5O3N4j57M74j74
$$ plain form
6801 80 200 -226 -58 -227 215 86 21 -35 -36 -106 221 -9 15 -227 176 330 97 -101 271 18 171 -22
6823 -22 156 12 63 -235 -168 111 -174 127 214 329 -216 -38 57 72 58 97 142 10 -59 -164 177 -63 74
6846 74 35 -404 -95 -77 129 68 75 205 25 51 -209 -221 134 -20 -125 -43 -170 -111 -215 152 -10 -34 -11 -205
6870 -205 -325 -257 368 -75 -150 -190 -29 -6 227 119 -79 178 104 -105 -103 -408 15 -204 -120 29 -37 -134 -39 68
6894 68 76 -139 238 95 216 -133 -335 205 -29 265 243 -160 318 -105 -30 23 107 -45 -61 -146 -58 -271 -46
6917 -46 -99 59 79 139 181 -129 70 233 86 1 -55 86 8 -79 93 290 -326 -241 -25 8 15 8 139 -84 -38
6942 -38 -102 45 51 0 179 123 -191 65 70 -104 146 107 70 -15 -12 -12 -34 198 -167 104 76 172 -185 -153 244 -100
6968 -100 -130 102 92 -151 197 70 -41 -54 -281 251 12 85 -156 -104 30 108 -136 -111 -48 6 -151 323 149
6991A49l72j70M96J31l81J04J31J75k84k6Km2j73K52m9k43L73l8j43L03j64q6
7013e5nj33K63Lj26k6J48J20J4r0k52O2l0L69l51J42j62J26j16N4j15K53l16L33
7037A10r8m72M21K44n2j27j58l2p9J78o3K37J92l54l6o4J77K0j48J76l03J62K76
7060B07j09k02k7j5J72j30j11M6L19R6k99J72l7J8kj57L3R2qk02J50J09l13L43
7084A45q9m00J29K28k32J55j52K37j14q8K82p6r1K7j98L7J05n5L93k62L17m52
7106a54K37L0k53k8k46M63J26m11J61J88k32L13m20K01J40k74L6k52J86R4jJ38
7128D2n5n4j45L76j43j00J10j54M1j2N1J68o7k9K18j75n1J18l75K51l79K61J21
7151A8k05L77l2k83N7M8J02o8J27k3J57m31n7J80j96O5K19j44J68J6p7l0R5Q0
$$ plain form
6991 149 -223 -393 103 234 -147 -43 88 263 -21 -47 -45 -87 -260 -8 -57 -300 73 35 -108 195 31 -55
7013 -55 -60 -193 70 73 -53 -79 69 189 203 113 -139 -77 -107 262 -89 53 -109 17 -99 -45 -160 93 -223 110
7037 110 12 -460 -39 205 153 26 -132 -164 -243 -65 -128 109 301 -53 -89 -153 24 44 -104 72 -231 -69 207
7060 207 98 -104 -131 -146 26 -104 -215 -169 150 246 -53 119 82 100 98 -59 -26 66 58 -144 6 115 -198 145
7084 145 56 -344 -215 13 -219 -64 -216 21 -93 -181 101 25 -66 -39 -237 -200 -95 -150 243 -19 298 -154
7106 -154 83 113 -140 -168 -414 49 175 -236 -75 113 -119 194 -226 -25 115 -159 -123 -375 -189 -95 -96 42
7128 42 -13 -67 -212 164 21 -79 31 -123 -82 -94 -43 125 58 29 247 72 21 139 -236 15 -364 -103 18
7151 18 -187 190 158 -125 -68 -20 82 14 141 118 275 -156 -213 -33 -229 -164 55 -89 79 95 18 -12 83 163
7175A63r4j87J27J72l5l2k8j10J5k25O9L77k01L4M2M5L7k77M11j22j44K81j13
7198B05L6k50J06q4M8J62k44j52K79l14K32l02N53k44J56k6j14N3o5j6J4L4k47
7221a80K16n9K05m1m12N13Pj58J57l09J91k56n0K19m3R5J09l58N7J29K30l50j70
7244b58K30K8j47J25l12K59j07K74k76L02j44j89L08k06l2L24j36%j10J77k26
7265a16J51j75J12k94K19J49n1J62k12J59K93l81Mk32J77L1Q6N5m8P7p6k04j04
7288b18M1K9K24j37J6P5J3j55N24l94o7K22q2j38J08k93N2L9J15M2j32K11m0j21
7312f6Q4l6J38P6l2m7l04L03m25N24m56M61m3j00j07J49r5Qj53K33k2k68J71j01
7336a08J22K93l39j5k04K99j53J24K39l50K09o0j39K72j91j10L35k70M7j88K00
$$ plain form
7175 163 69 -118 9 181 146 114 86 -24 -9 -234 -165 212 11 45 87 132 169 -108 303 181 37 318 205
7198 205 241 -9 97 13 61 223 -21 -173 106 -208 24 -278 275 31 187 161 47 100 35 19 33 67 -180
7221 -180 36 -23 182 141 -271 242 249 91 248 -61 130 -126 -176 43 0 95 204 -154 -97 32 262 -88 -258
7244 -258 -28 0 -147 -22 -334 -75 -182 92 -184 118 -26 -215 93 -113 -145 179 43 43 -67 110 -116
7265 -116 35 -140 -28 -322 -103 46 -5 157 -55 104 397 16 20 -212 -35 -4 82 137 89 166 90 -114 -218
7288 -218 -177 -148 76 -61 -45 30 43 -112 412 18 -49 173 91 -47 61 -232 -180 -141 -26 16 -116 95 55 -66
7312 -66 18 -18 120 196 164 117 -187 116 -309 215 -241 220 177 77 -30 119 24 32 -121 112 90 -178 -7 -108
7336 -108 14 307 -32 -47 -251 48 -105 19 258 -92 117 57 -82 190 -1 -111 224 -46 1 -187 13
7357A3N8J69j72O3j40j16R6j98L18j65j83J60K97J30m08J89o8M7k75J84k11M1
7379a71o9j5L34j37Q3J14O0l71K54J52j97k65K88j23M49l61O0J10J5N3l67J69
7401F5k8m9NM8q1Mk8Q8j14J88k49K28K1j79KO8K4k3L62n62M20m3l98K12l2l64
7427d15L71J81j8k36K5J1o2K34j6J16n8L1j35K69l93R5j65K42L5jj78%m6K81N7
7452B25l71J58k03M8j10M58k96J89nM4N2j94N9K5P1k19N3p5Q1q2K3J37j68P1N
7477b4p1j75J35O6O2J5j29q3J33M4M5J85j59m1k6J51j55l0n6J7%J34j07J55J45
7502B31l00J48J72p0l90M29k82J8k99K01K00Rk21m5J77J32l40K71J9J0Mk09Q4
7525e1j91L16n02M15M8J3k32L3L49j18m0j26J65m9j47OjO9K05k99N2n3m8J04K08
$$ plain form
7357 13 71 240 68 131 -9 -125 -29 -227 91 -74 -257 -97 200 330 -78 111 43 90 -185 -1 -212 -171
7379 -171 -240 -255 79 -58 25 139 199 -172 82 234 37 -228 60 -63 386 25 85 195 210 263 -104 65
7401 65 37 -12 -7 41 -40 -36 -64 24 -90 98 -151 77 98 -81 -79 -11 13 -10 352 -210 210 167 -231 -19 -51 -415
7427 -415 -44 137 119 -117 -92 -81 -143 91 75 191 133 164 29 298 -95 0 -165 77 112 111 -67 -67 -113 168 225
7452 225 -146 12 -191 -143 -253 205 -91 98 93 137 189 -5 54 79 150 -69 -16 -91 -10 -92 -69 68 -100 -29 -24
7477 -24 -95 -270 -135 -69 -7 8 -121 -204 -71 -27 18 203 44 3 -23 128 -27 -57 -113 -96 -96 38 -69 86 231
7502 231 -69 79 251 181 -209 220 -62 -44 -343 -142 58 67 -154 -199 -22 110 -230 41 60 70 74 -135 -51
7525 -51 -242 74 -428 -13 35 48 -184 -151 198 80 40 -86 79 30 -117 -111 -112 -43 162 -137 -85 -138 -186 -82 126
7550A26k76J28K00Rl49J70K98k53J82l50J61o7K49k18j40L2j22O8j16L68j42J65
7572A23l19K58K3l26K04n7r0J67J53j49l6k08K48J79j12L4K4r4k21K73n2r4j42
7595b14k0L32j46L0j1q6K89k44K93O0l91K06k65K03R6o2k67L12k11K12R9l58o3
7618b06J31J80q0J49J52k97r3J41k37J93M01j47n51M54j91l1o8k27K89N2o7j11
7640a64K24Q4j32Jp5L10q0l7k78K36l39J07J6Q6o7j3K00K9J1j66K91j90L6M8j35
7665Cj70R4J25j05K80m94M23k82j32l0N05k03j57j1J63Nj51K77K0l33L85l61K68
7688A19m53M92p8j45q4J6K7nK52r6k27N27n1m12K23l39K84QQ9k17p0o3K95k64
7712a72K29n1j24K63j3k63M6K06j22k32L06j21J73j05k82J89JlJ87j31J32k55
$$ plain form
7550 126 -150 -22 178 187 -162 8 306 53 235 -115 46 -21 228 10 -130 -98 -220 -152 -268 100 -42 123
7572 123 -196 62 85 -241 -37 -94 -184 -17 136 -13 -49 -257 -9 170 58 92 116 22 -199 74 22 -72 -214
7595 -214 -234 98 -48 -18 -29 -115 174 -70 223 283 -108 98 -167 36 132 70 -197 115 -96 116 215 -143 -206
7618 -206 -75 105 25 174 326 29 -64 77 -160 33 434 287 -264 190 -1 -32 -100 -327 -38 14 -53 -164
7640 -164 60 144 12 13 -62 248 168 131 -147 89 -250 -143 -127 -41 -108 -121 79 108 119 -47 244 54 90 138 3
7665 3 -167 -73 52 -53 227 -267 156 -126 -258 -288 217 14 -143 -154 9 14 -137 140 160 -173 212 -149 119
7688 119 -334 158 80 -65 -149 -133 -106 -111 141 45 -182 345 294 -118 105 -234 50 58 147 -70 -140 -203 92 -172
7712 -172 57 6 -118 145 132 -131 -85 121 -1 -233 73 -48 125 20 -262 -73 -72 -75 112 -19 113 -142
7734a42j47N32Nj70l93L72j83J43O4k50J39J77m18K20J25r1J54l7M7m05J10q4
7756b32L91j88r5J14j17k35J93O4J65j17rj0J49J65k94p9L04j55R8j58P6j45K09
7779I4k8p7q7L26p9j23k73L14j13J65N2l00J89L68o30R3J4j1p1J10J57j31J22
7802H1P3l25K40m8J9J21k29j1K43k85K9J61m58N55k64q4J63J30K00l06p8J12j13
7825g4L07l95J8K02o5R1j05M8J33Pk3jl31K53j6k32j28K48oK5J45j70J76r6P4
7850H5M7J52l97N5Q3mk7j88M34m70P0K03j14j41M26k76j43J12NJ56q5P5k64k22
7874d28M64L08m03K6J67l12K71On02M08O5r1J18l20J31L52j46oJ72j93p6k5J8
7897DJ64N1m4k69J99m66K12J73J1k24j95M66j88L8R4m3K85n58J07LL66J2k72r1
$$ plain form
7734 -142 -289 243 248 78 -315 57 -126 17 81 -169 -30 147 -271 -51 74 -17 137 100 147 -258 -148 -232
7756 -232 159 -29 -124 -10 -127 -362 -169 -105 60 -57 -66 -76 73 238 -56 -135 169 14 112 -46 30 -115 94
7779 94 66 -11 -98 228 149 26 -247 67 -46 119 171 -129 60 428 -202 -109 -95 -106 -177 -67 90 -41 81
7802 81 154 -171 69 21 40 161 -68 -79 164 -121 -92 69 -389 166 -98 -182 -19 111 311 5 -73 39 -74
7825 -74 233 -162 -144 58 -7 84 -21 27 160 167 144 143 -188 65 49 -183 -311 -63 -69 -44 101 -69 107 11 85
7850 85 132 284 -113 -58 25 21 -6 -194 240 -230 -160 43 -71 -212 214 -62 -205 -93 -88 68 -17 58 -206 -428
7874 -428 36 344 -59 -33 134 -178 93 99 -403 5 70 -21 97 -223 -92 260 114 108 280 87 11 -14 4
7897 4 168 219 175 -94 105 -361 -149 24 35 -189 -384 82 -106 -68 26 -17 268 -290 -183 -180 186 198 -74 -165
7921a65k0J78k05L45m02O8P3lK93j94j4N0K04j76j09oQ0K6j37p7K79n8j5k88N70
7946B97j77l84M27K6l70M48k12p7J29k2J0m42Q4L23L6l37M22j68o8J37l43K5o
7969b42J7K14j47m2K53J51k06j45J98J10j54k0j73J59q1J18j62K53j77q7K23q5
7991b5J58k63J04j1k74L34n00K80M32l5k60o9J68N1p6j95Q4p5P6n9J96m0p4O0
8015a3J50l73K28j85N1L31j71J2o7N1j05J89qm18J68J25j29K73R7j93O6l97L22
8038DO7j13j54J68L90n62K4J86k40LQ9J09K18l21J27P1k28J38J3j14m6J55k55
8061b71J48L7J6J01J20pk52l0pJ84j75o3J74j42J78Q9oo1l12L02L5k09OJ97j81
8086a29J38J3l95M37q9M14k38j97j2KL78m15L80k82J31j85pJ10J99j50j61m2K82
$$ plain form
7921 -165 -185 -7 -212 133 -269 -201 -128 -131 162 -32 -46 4 208 32 -77 -83 -3 23 -114 -191 88 30 15 -273 297
7946 297 120 -264 163 189 -181 267 55 -22 107 85 95 -347 -263 60 96 -241 181 13 -55 82 -261 -236 -242
7969 -242 -225 -11 -158 -200 53 204 -2 -147 51 161 7 -13 -186 -27 -108 10 -152 101 -76 -163 60 -25
7991 -25 133 -130 -26 -37 -311 23 -477 -197 235 200 -60 -129 39 90 14 -181 -97 -172 -96 -155 41 1 -73 -13
8015 -13 137 -236 -8 -193 -142 189 18 30 -37 14 -91 98 90 -328 -160 -35 -164 109 206 13 79 -318 4
8038 4 71 -42 -196 -28 362 -200 -176 10 -230 -227 -138 -29 189 -132 -5 66 -162 -24 -11 -125 -171 -16 -271
8061 -271 -123 -86 -70 31 151 144 -108 -138 -145 39 -136 -199 -25 -167 11 100 94 33 -279 23 58 -151 -145 52 -129
8086 -129 9 22 -373 64 -25 389 151 -46 -58 -56 322 -93 287 5 136 -49 -56 54 253 103 -58 -100 182
8109A82k07k44M29j24r5r8N0R6M4l48K81j1k90L95J00k2j14J69k47K43k5j00M3
8132A07J34m56L51k70J94j00j23L47k6j74M4J41m11J88Q5K30j41k62J72j48J29
8153A1J98m93J31K51j64J43j82J01jj17pL09J22n76P6K16j87LN6M35l65j04k2
8176a66J04K23l97O6J24qj6R3r5J06j69K69j29l10J96
$$ plain form
8109 182 -25 -269 160 36 -59 -157 -107 -11 33 -315 -34 -45 -335 60 160 138 24 193 -54 189 164 64 107
8132 107 241 -215 136 -134 60 -40 -163 184 158 -16 28 169 -242 -54 31 261 120 -142 30 -118 11
8153 11 209 -284 -153 98 -66 77 -105 -4 -5 -122 -129 180 302 -274 -198 18 -169 -166 -110 325 -40 -144 -166
8176 -166 -62 161 -236 -170 -46 -54 -70 23 -72 34 -135 134 5 -305 -109
8191a09
$$ Imaginary data points
##PAGE= N=2
##DATA TABLE= (X++(I..I)), XYDATA
0@%%%%%%Qj6J6j6K4l2M0m8N6p2Q8j04J20j42J66j92K24k60L00l43L92m46N06n72
30c03O45p27Q15r12J020j136J264j405J560j731J916k120K347k600K882l196L549
47A868l949M408m941N566o311P220q357R828j1816J4666j9131K7175m6195J70354
61A40385J57371l24997j60031J03680K30013J1684j49518j16298O1584J01434
71E5307L4641n1939m8923l4131j721K5424M7590N222m1640l8726K2603L6817j7061
84f537o5061j4007O5125N6247l7039o7946N647P6397L7187m8998o4205O823O1484
97E117M2924p133k7419k3384j7048L625L7629L7687j3313n0053j9167M3909N6061
110F9435J658n1579m5690L209M2247M2944O227m4417o0278q049N6245M5421l5688
$$ plain form
0 0 0 0 0 0 0 0 8 -8 8 -8 16 -16 24 -24 32 -40 48 -56 64 -78 88 -104 120 -140 160 -183 209 -237 269 -303
30 -303 342 -385 430 -482 538 -598 666 -739 821 -910 1006 -1114 1233 -1367 1515 -1681 1868
47 1868 -2081 2327 -2614 2952 -3359 3861 -4496 5332 -6484 8182 -10949 16226 -29969 140385
61 140385 297756 -27241 -187272 -83592 146421 158105 8587 -107711 -46127 55307
71 55307 89948 38009 -10914 -45045 -46766 -21342 26248 31470 -10170 -48896 -26293 10524 -6537
84 -6537 -71598 -85605 -20480 35767 -1272 -69218 -63571 12826 50013 1015 -63190 -56367 5117
97 5117 48041 40908 13489 -9895 -26943 -23318 14311 51998 38685 -11368 -30535 13374 69435
110 69435 71093 19514 -26176 -22967 19280 62224 68451 24034 -36244 -44293 11952 57373 21685
123B1685p6588j4649P0711O1293l3617q2766j7945O6401M9265m0168o6965M391
135e8952O8400L5062m4882o1851j894M8380L1110j0141k2916j0429O728K2416
147A031K6559r66l8502l2371K2124N6765J6426m7672m3016K2308M8561m193n0189
160b3135j5697M4900L9807k2453m8263j320M6250K6502l1685m3980J279L5951
172H156K3020j0649k4571j4380n68R376J5597J2769n739k3609j1345K1242L0812
185C0111M23k7302k1291M528J8808J3624K844q099j9914j7802P271L1380J7557
198C2138k2109l2054K188L2716J9012j6645k6085l620J4947O655q683n061Q938
211B337N635j2382j7310p48J9258J8493j612j9906j6153Q556K6930J9567j1237
$$ plain form
123 21685 -54903 -69552 1159 62452 28835 -53931 -71876 -5475 43790 3622 -63343 -58952
135 -58952 9448 44510 -372 -62223 -64117 -15737 15373 5232 -17684 -28113 -21385 1031
147 1031 27590 26624 -11878 -44249 -22125 34640 51066 3394 -39622 -17314 31247 27054 -23135
160 -23135 -38832 6068 45875 23422 -24841 -26161 20089 46591 14906 -29074 -27795 8156
172 8156 31176 20527 -4044 -18424 -18992 -9616 5981 18750 13011 -10598 -21943 -701 30111
185 30111 30534 3232 -18059 -13531 5277 18901 21745 13646 -6268 -24070 -16799 14581 32138
198 32138 10029 -22025 -19837 12879 31891 15246 -10839 -14459 488 7143 -1540 -6601 2337
211 2337 7972 -4410 -21720 -22468 -3210 15283 13671 -6235 -22388 -13832 13098 32665 21428
224B1428l7337k2683K3950M8545J3800m0096m6061N317M8173K9513k3318l9260
236a8029l578L0533K0914q340j6942o257J643J005O03L435J996n947q766k560
250a0290M633K801j395k42K40l588k374M796P340M07j0710j1621J714J3323O186
265A220q767q723L250O454j113m493M802J0144K75j0633l049J4262J3174q032
279H771j8478l323J5019J2152n589j2530l363Q568Q532k055q235l418N149R607
293A0807L969p793j2211r81J3133Q465j0143j8554l958J7198J6902o238k3092
306a2496r310J5999J9157j358j5968p425R517J0716k146r587j537N513K17o277
320d985j439O458O692q98o827o388K020J0437R681k152j2338r378O755J6989N013
$$ plain form
224 21428 -15909 -38592 -14642 33903 47703 7607 -38454 -33137 15036 44549 21231 -18029
236 -18029 -21607 8926 29840 21500 4558 -1699 -56 949 1552 4987 6983 1036 -7730 -10290
250 -10290 -5657 -2856 -4251 -4493 -4253 -7841 -10215 -5419 1921 2328 -8382 -20003 -18289 -4966 1220
265 1220 -7547 -16270 -13020 -6566 -7679 -12172 -7370 2774 3049 -7584 -10633 3629 16803 8771
279 8771 -9707 -13030 1989 14141 8552 -3978 -7341 1227 9759 7704 -531 -3949 1200 10807
293 10807 14776 6983 -5228 -6209 6924 15389 5246 -13308 -17266 -68 16834 10596 -12496
306 -12496 -21806 -5807 13350 11992 -3976 -11401 -1884 8832 6686 -2901 -4438 1075 1292 -4985
320 -4985 -6424 34 6726 5828 -999 -7387 -5367 5070 14751 12599 261 -9117 -2362 14627 19640
335A9640j5318j7586J554J6397J0544n943j2900l950P514O109j736j199L195M55
349F776p147n645O081J1437J270j4450j4108L431J8156J0297q824j6184o271R024
363f157J5874O336j1313j5474j452J4480J2558n172j6922p532R695J0620k835
376B706q883m14P161J874o540m328O662J0156r65j3302p385R421J4269k86j4931
391d785j2562L717J6168Q346q577j4125k908J1498J1721N64j1813j0016N295J3283
405E806L816j0382r813K291Q633J722p734m603O048P053l351p861J091R452M993
420G161o414q880L38J1033P644n626j2865l544R973J0827p65j0667p486O033J3326
435A0088M756r055r686J107R994P345m821j0279j683O856M365n675o335K135N868
$$ plain form
335 19640 4322 -13264 -11710 4687 15231 9288 -3612 -7562 -48 6061 4325 3126 6321 6776
349 6776 -371 -6016 65 11502 12772 -1678 -15786 -12355 5801 16098 7274 -8910 -15181 -6157
363 -6157 9717 16053 4740 -10734 -12186 2294 14852 9680 -7242 -14774 -5079 5541 2706
376 2706 -6177 -6591 570 2444 -4096 -8424 -1762 8394 7429 -5873 -13258 -3837 10432 10146 -4785
391 -4785 -17347 -13630 2538 10884 2307 -11818 -14726 -3228 8493 9057 -2756 -12772 -7477 5806
405 5806 9622 -760 -10573 -8282 351 2073 -5661 -10264 -4216 2837 -514 -8375 -7284 2168 7161
420 7161 747 -8133 -7795 3238 10882 5256 -7609 -11153 -1180 9647 8882 -1785 -9271 -3238 10088
435 10088 14844 5789 -3897 -2790 7204 14549 9728 -551 -2234 4622 8987 3312 -3023 -888 4980
450D980J06p185l685O699Q559l497j1944m415Q406J0694p64j2158j0160L988J3319
465B943N612q906j2702k72J2317J0832k560j1251m548Q114R253L1p120l624M395
480B514O043j576o212n22P020L701o393p269L096J1027M959q785j2401K99J2645
495H146P547p510j4209n551Q348J1491r97j3371j0754M822J2669M307q244j0255
509a3561Q06Q818N075n001o217N87M794J056k967j611L075L823j646n856J23Q713
525A1P351l674r145k386Q914J0465j374j1638o742O351J0510K295q313r311K47
540f439R438O985m484r305j372P396M848l871o651k93N845K184p026n762L596
555d911Q795R47r270q493M150J3842O190j0454j3467J902J5249R888o806j4993
$$ plain form
450 4980 5086 -2099 -5784 915 9474 5977 -5967 -10382 -1976 8718 7954 -4204 -14364 -10376 2943
465 2943 8555 -351 -13053 -13325 -1008 9824 7264 -3987 -8535 -421 8832 8863 1743 -1881 2514
480 2514 8557 6981 769 247 7267 10968 4575 -2694 402 11429 16388 7603 -4798 -4499 8146
495 8146 15693 8183 -6026 -11577 -3229 8262 7265 -6106 -16860 -12038 631 4938 -3306 -13561
509 -13561 -12755 -3937 1138 -3863 -10080 -9493 -4699 -3643 -6610 -8221 -5146 -1323 -2969 -8825 -8702 11
525 11 7362 3688 -5457 -7843 1071 11536 10162 -1476 -8218 -1867 8643 10938 2625 -6686 -6439
540 -6439 2999 9984 5500 -3805 -5177 2219 7067 3196 -3455 -3748 2097 4281 -2745 -8507 -4911
555 -4911 3884 4831 -4439 -12932 -8782 5060 11250 796 -12671 -10769 4480 14368 7562 -7431
569g431m684J1413J2270j601j1346o568M075Q751K850m852m900J044M395K71k918
584G69M56K977K95m986m794J871Q116L916p700r514L03R745Q687j867j1294o751
600i771O596J3792L687j0365j1141J453J1468P427n035j0607k031P882O076k499
614F932n853r73M899K321l594m572L349O075k809r116l527O981P609l897j1826
629h001n403Q145R637j849j1276n744N790Q881Q42p032o578K641P264J748n084
644f019m378K092N639K252k959m444J963P348M064l986o138P38Q295P869m097
659H239j1556m119J1095J1806l006j4486q232R210J4962J746j4418j1697M945
672e511J3956M812r396j1803r15R251N428m783p292j342K392J246m8K58J056j834
$$ plain form
569 -7431 -12115 -702 11568 9967 -1379 -7947 -3872 4879 7729 2877 -2023 -979 3416 3687 769
584 769 1225 4202 4497 -489 -5283 -3412 4704 8620 920 -8594 -8291 1454 10141 8274 -3020 -9771
600 -9771 -3175 10617 14304 3939 -7202 -5749 5719 13146 8111 -2496 -4527 3355 9431 6932
614 6932 1079 106 5005 7326 3732 -840 2509 8584 5775 -3341 -6868 113 7722 3825 -8001
629 -8001 -13404 -5259 4378 2529 -8747 -14491 -8701 180 1022 -6010 -12588 -9947 -2683 -935 -6019
644 -6019 -10397 -8305 -2666 -414 -3373 -7817 -5854 1494 5558 1572 -4566 -3828 4467 12336 8239
659 8239 -3317 -7436 3659 15465 12459 -2027 -10259 -1049 13913 15659 1241 -10456 -5511
672 -5511 8445 13257 3861 -7942 -8857 394 5822 1039 -6253 -7595 -5203 -3957 -4005 -3747 -2691 -4525
688d525l757p74N661N947j928q050l389O158Q542J810p275o979K511R317N504
703H773l686o621j697N167P614Q45n568m409J923N952K834l477o661j144O788
718F633M519n405q508Q62Q765M607p517j0202R86J1403O234r097j2254l3J1891
733B884P833p022j2725k748J0172R028l779r473k998N582N811K56l842k320J437
748a904J741l61L67J167p7k591j745J231L514K112k134m085j696L270M790J231
764D830l933m961j095M809N743o65p240n428K816P478L772n692p921K42P972M386
780E113l929n252J03M342J595k731k186K802L008k621n391K24O634M431m454q352
796f664j565Q757Q344l806j0123m542O975Q405K7p671o565K497O891K477m033
$$ plain form
688 -4525 -8282 -9056 -3395 2552 624 -7426 -10815 -4657 3885 5695 -1580 -8559 -6048 3269 8773
703 8773 5087 -1534 -3231 1936 9550 10395 4827 418 2341 8293 11127 7650 989 -155 6633
718 6633 11152 5747 -2761 -1899 6866 11473 3956 -6246 -5260 6143 12377 3280 -8974 -9007 2884
733 2884 10717 3695 -9030 -11778 -1606 7422 3643 -5830 -8828 -3246 2565 2821 -1021 -3341 -1904
748 -1904 -163 -524 -157 1010 933 -1658 -3403 -2172 1342 3454 1320 -2765 -4461 -1191 3599 4830
764 4830 897 -4064 -5159 -350 5393 4728 -2512 -7940 -5124 2354 6126 434 -7487 -7245 727 5113
780 5113 1184 -4068 -3965 377 1972 -759 -2945 -143 2865 244 -5147 -4923 1711 6142 1688 -6664
796 -6664 -8229 528 8872 5066 -5057 -9599 -2624 5781 5808 -1863 -8428 -5931 960 3437 -596
811e96m511m03L408L631j358l302l66L273J714k348k449R00M125K202k976n170
827d226J78O305N064k899p014j857N875P844l21q168m634L938P481J339n287m472
843h54N05M489J778k796k077P82R44j462j243J752K677o30m971l336L540O442
859E540m84p142n527K805P965K366n736p047M81P557N376l426o832k920M640P820
875E436O41p172n988L387P788J834n101o479R62P094L965l995o567N20N709L542
891E576l419n382M75M957K086m017n060J588M974J654l959m519L33N408L122l274
907E43n148j108M053M451p96m816k899K542L642J70k552j134R49Q99r85n47K123
924f13K096o39n200r81M256N829m83o862n388K999Q753M214o758q985J0P547P191
$$ plain form
811 -596 -5107 -5510 -2102 1529 171 -3131 -3497 -224 1490 -858 -3307 -2407 1718 3920 944 -4226
827 -4226 -4048 2257 7321 4422 -2592 -4449 1426 9270 8949 781 -3853 85 7566 8905 3618 -854
843 -854 -349 4140 5918 3122 1045 1827 2771 1309 66 1818 4495 3865 -1106 -4442 -902 5540
859 5540 5056 -2086 -7613 -4808 3157 5523 -213 -7260 -6779 778 6154 2728 -4104 -7024 -2384 5436
875 5436 6077 -1095 -7083 -3696 4092 5926 825 -5654 -4692 2402 6367 2372 -4195 -3675 2034 5576
891 5576 2157 -3225 -2750 2207 4293 276 -4784 -3196 1778 3432 -527 -5046 -4713 695 3817 543
907 543 -4605 -5713 -1660 2791 1995 -2821 -5720 -3178 464 634 -1918 -3052 -2103 -1204 -2189 -2736 -613
924 -613 1483 844 -4356 -5337 -1081 4748 4265 -2597 -7985 -4986 3767 7981 1223 -7762 -7752 -205 6986
941F986j047q405n387M515Q219K184n527o152N30N585K823k730l984J142L636
956B388L11l769j397L556L948j321n917k213M709O595p45o698n174K860P543K860
972G536m787o690l84N445M645p69n147k459J772M191O31k369j540O78J336r62
988A127j234J034K334r1l760k739K994N344O20n609m419K240O069K070m320n710
1004d050r2N417L606k952n123j961L916M114j235m832j885L372L624p58l820j964
1020d623K677L737n80m684j680L801L954j435m313j551L908M487j179n651j856
1035d988M927N053j142n654k742L008N595R60n522m428J903N408L142m448n153
1050d081n81M998L520k557m375o74K709K012j623k334o18K605Q91k693k522K284
$$ plain form
941 6986 5939 -2466 -7853 -3338 4881 7065 1538 -4614 -4084 1501 4324 1594 -2390 -1248 2388
956 2388 2699 -1070 -2467 1089 5037 3716 -2201 -4414 295 6890 6145 -553 -5727 -2867 4676 7536
972 7536 2749 -3941 -4325 1120 5765 4996 -151 -2610 -838 3353 3984 1615 75 753 2089 1127
988 1127 -107 927 3261 3170 -590 -3329 -335 5009 5629 20 -4399 -2159 3910 5980 1660 -4050
1004 -4050 -4142 1275 4881 1929 -3194 -5155 -1239 2875 1640 -3192 -5077 -1705 1919 1161 -2659 -4623
1020 -4623 -1946 1791 1211 -3473 -5153 -1352 2602 1167 -3146 -4697 -789 3698 2519 -3132 -4988
1035 -4988 -61 4992 3850 -1804 -4546 -1538 4057 5017 -505 -4933 -3030 2378 5520 1072 -4081
1050 -4081 -4662 336 3856 1299 -3076 -3750 -1041 971 -652 -2986 -3604 -999 -108 -2801 -5323 -3039
1066c039M131M4m195l399K291O320J946m567n363Q70N944M184k149n315k365L890
1082g72N196P52l853k307J394K573P85j068r49R52Q30k034j365J911L264L0m555
1099G84l714J333O059K999m544o822q49O183N229j600p271l915M120O362K26n006
1115d26l550Q59M340J260k499k737J530K783J2k435j351K246L494j586m144j565
1131c769L579N170p58n827l316K887O215J685n190n300R94O117L025l490n158
1146c136r47M365L068j452m010r66K883J771j016k434q9J859J140j597k222J236
1162a547K865N15k721k730J549L415J460l058m143Q11M789K203l015m320m21M304
1178d4L047j721m683j082L542L230j469l857j130K279K985j425l027m24K801J801
$$ plain form
1066 -3039 1092 1136 -3059 -6458 -4167 2153 4099 -468 -5831 -4961 983 5167 3018 -2297 -4662 -772
1082 -772 4424 5176 1323 -984 410 2983 3768 2700 1751 2703 3533 1499 134 2045 5309 5339 784
1099 784 -2930 -1597 4462 7461 2917 -3905 -4754 1429 6658 5058 -2213 -6128 -2008 4354 4580 -426
1115 -426 -3976 -3117 1223 2483 -16 -2753 -1223 1560 1572 -863 -2214 32 3526 1940 -2204 -3769
1131 -3769 -190 4980 4222 -1605 -4921 -2034 4181 5866 676 -4624 -3630 2487 5512 2022 -3136
1146 -3136 -4083 282 3350 1898 -2112 -3078 -195 1576 560 -1874 -1963 -104 1036 -561 -2783 -1547
1162 -1547 1318 1833 -888 -3618 -2069 1346 2806 -252 -4395 -3584 1205 3408 393 -3927 -4348 -44
1178 -44 3003 1282 -3401 -4483 -941 2289 820 -3037 -4167 -1888 1097 -328 -3355 -3779 -978 823
1194H23j900k776P21L034K349k404l958J10N028L396k164n105j668M418N339k15
1210E028n774l359L205N850J314l809m423Q79N005K472l192l615K27K852J538
1225D198k123k430P38K573n7l218j953K892L007q87m534k548K419M709O75m644
1241a183m680K009N312K124l330m988M61M496K808j811l485m91K863K151p08j966
1257d18k16K483R32j659j610J184K351M20k086k133N80L733J453k885l811k26
1273a908L763K957j328m947k664L260M146j50m527k874J639M056K91l367k839
1288d492J705L184p23l116p11K973J674k080k955J71M123K505l139m364M48M914
1304A17L355k017n205j418M311M563k39m833l101K343M255K141l225m101mL902
$$ plain form
1194 823 -1077 -3853 -3132 -98 2251 -153 -4111 -4001 1027 4423 2259 -2846 -4514 -96 5243 5028
1210 5028 -746 -4105 -900 4950 6264 2455 -1968 -1089 3916 6388 3196 -419 -192 2660 4198
1225 4198 2075 -355 383 2956 2899 -319 -2272 620 3627 2740 -1794 -4342 -1923 2786 3461 -1183
1241 -1183 -5863 -3854 1458 3582 252 -4736 -4275 221 3029 1218 -2267 -2758 105 2256 1548 -418
1257 -418 -634 1849 2781 1122 -488 696 3047 3467 1381 -752 -172 3561 5014 2129 -1682 -1908
1273 -1908 1855 4812 3484 -1463 -4127 -867 3279 3129 -1398 -4272 -2633 1423 1714 -1653 -4492
1288 -4492 -2787 397 -326 -3442 -4153 -1180 494 -1586 -4541 -4370 -247 2258 -881 -5245 -4797 117
1304 117 3472 1455 -3750 -5168 -857 3706 3467 -1366 -4467 -2124 2131 4272 1047 -3054 -3058 844
1320H44K558j558l407j018K859J773p15k683n4K377J228k100k273Q34K865J032
1336B562k758l267J013M395J806l054m110P30L846K991k103m269n30L552K577
1351C381j445k933o85K770J673j342k324L05K809M86k511j918J288L556M40l762
1367b12k656J656M365R19l328l352j86L897K871j136l945j905K639L284P49l149
1383E11k905Q16L684J832k613l266O42L084J066k018k824J443K836M51l987j314
1399b562K460L674j317m400j592L466M123j404n028k249L749M011l05m417k796
1414d587J577M572J022l443k965L98L391J772j713k846n12K747J518p40k269o1
1430b139J658J347j208j869M33K336J267k189k465P50L041J271j805l189m7K862
$$ plain form
1320 844 3402 1844 -1563 -2581 278 2051 1336 -1347 -1401 976 2204 104 -2169 -1335 1530 2562
1336 2562 -196 -3463 -2450 1945 3751 697 -3413 -2683 1163 4154 2051 -2218 -2748 804 3381
1351 3381 1936 -997 -1682 1088 2761 1419 -905 -600 2209 2695 184 -1734 -446 3110 3550 -212
1367 -212 -2868 -1212 3153 4072 744 -2608 -2794 1103 3974 2838 -1107 -3012 -373 2911 3660 511
1383 511 -2394 -1578 2106 3938 1325 -1941 -1299 1785 2851 833 -1991 -548 2288 2739 -1248 -2562
1399 -2562 -102 3572 2255 -2145 -3737 -271 3852 2448 -2580 -4829 -1080 2931 2626 -1791 -4587
1414 -4587 -3010 1562 2584 -859 -3824 -3426 -35 1737 24 -2822 -3334 -587 931 191 -2078 -2139
1430 -2139 -481 866 -342 -2211 -1778 558 1825 -364 -2829 -2079 962 2233 428 -2761 -2808 54
1446E4K708j219l397j081J947L195jk924j857J627K536j83k369k35J158J736j414
1463B81k449J037L127J202l121l430J227M765K060l287n010J17N245L546k479
1478B831n099j710L770L654K42l544k953J168L500J538j958k990l52K552J986
1493B635j316k165j36K341P64j628j943O45L038P31k964k728J813L784Q12l446
1509B37k729R71L556K180k469l446j09K973J822j704j802n13J539J089o11j433
1525d49j38J440M17j372j412O80J759P58k175k580J378L224R01l276k612O58L946
1542A147J659k578l583kL616K178j356l693o78K357K877p47l156j149J846K540
1558A278j8k318j597J145K159J93k531j019J948J752k90l009r80K207L027q77
$$ plain form
1446 54 2762 1543 -1854 -2935 -988 2207 2206 -718 -2575 -948 1588 1405 -964 -1199 -41 1695 281
1463 281 -2168 -1131 1996 3198 77 -3353 -2126 2639 4699 1412 -3598 -3481 1764 5310 2831
1478 2831 -2268 -3978 -208 3446 3688 144 -2809 -1641 1859 3397 1439 -1551 -1903 649 2635
1493 2635 1319 -846 -982 1359 2123 495 -1448 -803 2235 2966 2 -2726 -913 2871 3683 237
1509 237 -2492 -1521 2035 4215 1746 -1700 -1809 1164 2986 1282 -520 -1033 506 1595 984 -449
1525 -449 -587 853 1270 -102 -1514 -834 925 1683 -492 -3072 -1694 1530 2431 -845 -3457 -2799 1147
1542 1147 2806 228 -3355 -3357 259 2437 1081 -2612 -3290 -933 1944 1197 -1959 -3108 -1262 1278
1558 1278 1260 -1058 -2655 -1510 649 842 -1689 -2708 -760 992 702 -2307 -3287 -1080 1947 1070
1574A070m028p91L037L000j28l621k247K035M234N62l432k389J074L030J430j063
1590A773l150J19K310J480p63j735k08J334O33o33j785P96J715M32k276k020J610
1607c68K868J47k872k597Q40L697J221k481l163R8K660K183j371k769m16J877
1623d46J554m9j990m25J039J285l96j346L27K053Q72j675j878P12L096J493k274
1640A952l001k05L842K840k328l926j308L381L096m71l783k148J796L338m6l055
1656b6j924O38K324L44j909j991P73J857j25j884j005Q06K022l11j804j427J771
1673a871K463o77k431j666J932K864R31k562k676J287K914J326k079j743O06K066
1689F84R80j455j045M22J565N14j243j137O02J693L71k134j270J132K360J48k540
$$ plain form
1574 1070 -2958 -3749 -712 2288 2160 -1461 -3708 -1673 2561 3123 -309 -2698 -1624 1406 2836 1773
1590 1773 -1377 -1258 1052 2532 1769 34 -174 1160 1793 1160 -625 171 1886 2318 42 -1978 -368
1607 -368 2500 2647 -225 -2822 -1982 1715 2936 455 -2708 -2610 50 2233 862 -1907 -2323 -446
1623 -446 1108 1059 -931 -1356 -317 968 572 -774 -447 1606 2478 803 -1075 -363 2733 4226 1952
1640 1952 -1049 -1254 2588 5428 3100 -826 -2134 1247 4343 3872 89 -2059 -263 3075 3029 -26
1656 -26 -1950 -1312 1012 1356 -553 -2544 -1771 86 -39 -1923 -2928 -2122 -100 -411 -2215 -3642 -1871
1673 -1871 592 -85 -2516 -4182 -2250 614 1545 -1017 -3693 -2406 508 1834 -245 -1988 -1382 684
1689 684 1664 209 -836 -414 1151 1665 422 -715 -113 1580 1951 -183 -1453 -321 2039 2187 -353
1706c53j958O98L256J070k685l339P86L633J748k244l654k97L234K343r51l106
1722a819j018K109K507p63j889r12J260K045o11j652m01J195J480n24j978k77
1738a248J859J558p74k611m60K531J877r29k608j516K404K554j75k762j690J536
1754d54K691K24k000j491Q34K002K33j562q67J092Q52M7j156j068J466J643l74
1771B112k365j270K269K365m27k914j932J810K791P33k916l000O56L373J061k113
1787B33k716k13K543J699j561k242rJ794Q16n62j726Q9J129Q21j045j618O13J818
1805a37M91j128j722L98K659J366j580k599K78K664J985j200k781q86K327K601
1821B736n67k931o65J486J730n05j475j043J295J438j058j471j74J439O30j003
$$ plain form
1706 -353 -2311 -1613 1643 2713 28 -3311 -2525 1108 2856 612 -3042 -3339 -105 2238 1287 -1819
1722 -1819 -2837 -728 1779 1016 -873 -1785 -525 1520 909 -743 -1144 51 1531 1007 -971 -1248
1738 -1248 611 2169 1395 -1216 -1676 855 2732 1803 -805 -2321 83 2637 2462 -300 -1990 -454
1754 -454 2237 2461 461 -1030 -196 1806 2039 477 -390 702 1554 1601 445 -623 843 2486 2112
1771 2112 -253 -1523 746 3111 2684 -230 -2162 -352 2439 3172 256 -2744 -2088 1285 2346 233
1787 233 -2483 -2696 -153 1546 -15 -2257 -2266 -472 344 -218 -1944 -1855 -726 95 -950 -2568 -1955 -137
1805 -137 354 -774 -2496 -2098 561 1927 347 -2252 -1974 690 2675 1475 -1306 -2192 135 2736
1821 2736 2169 -762 -1427 59 1789 1284 -191 -1234 61 1499 441 -1030 -1204 235 865 -138
1837a38j625k87J874J461j264k355o24K202K156o64k769j544K095K812M96k726
1853i00k151J309K483J321j618j988P00K110L74j280j107R54J230M49j479o49
1869b42P77J864k31k039r66J312K260J51k451j646M33K925R62k094k284JK371
1886A103J642j086k711j91J618J447r96j202p46J165J532j193j072j50J278O03
1902A041p85j343K47J601R16j552j980K97K442J227j663k068K6J923J419q47k383
1919a482l10J823J926q36k094j031J355J868k09k002q06J103J193q5j521m09J174
1936c43J329l57k203m53J748J284o33j481j160J286K597j68k766j481J271K648
1952A118P14k112k457O37K263J502j423k111J23J890J094p93j538L4J112P01j116
$$ plain form
1837 -138 -1763 -2050 -176 1285 21 -2334 -2958 -756 1400 736 -2033 -3577 -1482 1330 1826 -900
1853 -900 -3051 -1742 741 2062 444 -1544 -844 1266 1640 360 -747 207 1437 1886 407 -242
1869 -242 535 2399 2168 129 -837 475 2735 2886 435 -1211 -778 2147 3109 1015 -1269 -1268 1103
1886 1103 2745 1659 -1052 -1243 375 1822 826 -376 -1122 43 1575 382 -690 -840 438 1041
1902 1041 256 -1087 -840 761 1677 125 -1855 -1558 884 2111 448 -1620 -1594 329 1748 901 -1482
1919 -1482 -1792 31 1957 1121 -973 -2004 -649 1219 1010 -992 -1798 -695 498 413 -1108 -1517 -343
1936 -343 986 629 -1574 -2027 -279 1005 372 -1109 -2269 -983 1614 1446 -1320 -2801 -1530 1118
1952 1118 1832 -280 -2737 -2100 163 1665 242 -1869 -1746 144 1238 445 -1093 -1059 53 754 -362
1969c62p75R10J003k10j521l45Q61J661J82j832j434J203K357J79j562j959K22
1986a422K384J194j621j129o51J384J500m51j779k49J026J041o38j051l62J402
2002E78R87r24j605P2K196P40j053j962k25K481J751j237k804p88J984K606m08
2019B389k472j514J219K441L33j736j842O65J544N20j209o97J79P96K51p64p56
2036f53Q69K88l19o72n06M78J170l6j251j109O49J772p4j452q43L20J713P53j489
2055c92j541L63J817N61p67j543J83J598M92o84j361K31J753o1p10j141K22J514
2073E34P62j458j427M01K304M94j634j825K73K208J053j406k172J98J588J526
2089A419q25k215o79J551J324O7j839n56Q72J185m36Q1r44L15Q47r0m19l52J041
$$ plain form
1969 -362 -1137 -227 776 566 -955 -1300 -439 1222 1404 -428 -1862 -659 1698 1877 315 -1644 -1422
1986 -1422 962 2156 535 -594 -1245 139 1639 1188 -591 -840 186 1227 589 -462 -824 578
2002 578 1565 641 -964 -892 1304 2044 991 -971 -1196 1285 3036 1799 -1005 -1793 191 2797 2389
2019 2389 -83 -1597 -378 2063 2396 660 -1182 -517 1027 1547 338 -359 -180 616 867 103 -653
2036 -653 216 504 185 -487 -993 -515 655 619 -632 -1741 -1092 680 606 -846 -1689 -1369 344 1097 -392
2055 -392 -1933 -1570 247 808 41 -1502 -1319 279 771 87 -1274 -1043 710 649 -61 -1202 -980 534
2073 534 1296 -162 -1589 -1188 1116 1610 -24 -1849 -1576 632 1685 279 -1893 -1695 -107 1419
2089 1419 594 -1621 -2300 -749 575 642 -1197 -1753 -881 304 -132 -51 -995 -680 167 77 -342 -694 347
2108C47O2P0j143l98J283J395n13j642j034J315J891J41k006r65P99J954j6j326
2126B14j110L87J545L13n76j195K68J074l0n80p84Q10J039k66j045n47O60J470
2144A647k98j221r62Q26J814K04j241j830M42K258M12j159j927k41J689J252p02
2161I63j358n37Q64Q63k0j256l35Q72L37n78q26k21J069M62m56j324J19J452N86
2180F76m34j630o50K081J531q44k029p43J575J988k76j645j203J288J597o6j249
2197c3o08N98R88J29q94n11O16L77n43n53rL29P22k32j353m78O48J302k27j564
2217a296q98O91J709J58j459j473Q82J739K52j129j557N86J763M52r62q65L43
2234a064J274M98n51q58M77J118K11j176k28N93J212L27r41q84k65J655J081j229
$$ plain form
2108 347 409 479 -664 -1062 221 1616 1103 -539 -1573 -258 1633 1774 -232 -1197 -398 1556 1540 214
2126 214 -896 -509 1036 1349 773 -422 -154 920 890 310 -474 336 1375 1109 64 -483 177 1647
2144 1647 1349 128 -834 -8 1806 2010 769 -1061 -619 1639 2051 892 -1035 -1276 413 1665 963
2161 963 -395 -932 -68 795 775 -481 -816 56 393 -185 -1011 -1232 -163 299 -157 -1481 -1362 90 676
2180 676 242 -1388 -2038 43 1574 730 -1299 -2042 -467 1521 1245 -400 -1603 -315 1282 1216 -33
2197 -33 -641 -43 945 1074 180 -331 285 662 119 -434 -443 -114 608 376 -977 -1455 -807 495 268 -1296
2217 -1296 -2194 -1503 206 364 -1095 -2568 -1686 53 305 -824 -2381 -1795 -32 420 -542 -1407 -1064
2234 -1064 210 708 157 -701 -224 894 1105 -71 -299 294 1506 1833 892 8 -257 1398 2479 1250
2252A250j628j03J752J076o03k123o49J525J204j95j788n68J097Q39l36j014l11
2269e75N75M16k15r40J72Q57L78q62q55K11J141J038r82j611K30J210R50k86j543
2288f91n08Q96J857P8j611q80Q02J439l36q83j063Q45J152k09r40q54R83N33j36
2307D74r82n04R05R52q8j434m25L91J607K9j667q66O34J346N72j124j344J74J558
2326B08O30o07j552r9J393P73r05p16k73R35N41r60m15J57J130P2j175l08O01
2345e70P78J62j243o91K99J425M53q10j251M6J557J161p16j687k95J381J263n37
2363G25j302l85P93J423j78j030o28R58R95l74j006J5M50R68m45j023k43J129
2381H42P81n66j003o11P64Q90k33j276o36O06J094L84r00j000K65O65Q25q10q18
$$ plain form
2252 1250 -378 -481 1271 2347 1744 -379 -1028 497 1701 1506 -282 -850 247 1086 750 -264 -575
2269 -575 0 416 201 -739 -567 290 668 -194 -1049 -838 303 1341 359 -1252 -1022 188 1138 852 -691
2288 -691 -1199 -303 1554 1632 21 -859 -57 1382 1046 163 -900 -55 1097 888 -52 -906 77 610 474
2307 474 -508 -1012 -107 845 757 -677 -1102 -711 896 925 -742 -1608 -974 372 944 -180 -1524 -1350 208
2326 208 838 231 -1321 -1420 -27 746 -159 -875 -1148 -213 328 -632 -1047 -890 240 312 -863 -1171 -570
2345 -570 208 370 -873 -1564 -1265 160 613 -197 -1448 -1402 155 1316 600 -1087 -1382 -1 1262 725
2363 725 -577 -962 -169 1254 1076 46 -582 376 1371 997 -9 6 456 1424 979 -44 -287 842
2381 842 1623 1057 54 -557 207 1097 864 -412 -1048 -442 652 1036 136 -864 -599 66 891 81 -737
2400g37J42R88K34q26m33L96O20L4q40k80N82J247l24j160j73N60J377j28j127
2419A52p86O39J132L01q35j097o3J265P66n35j261o65J318P99j93j612l78J403
2437C50M59n47o68j80N76N61o35j223J14J355K57q82j244M57J210N77n70j387
2455a420j70J046J126k93j302n13O34J280K04j039p59Q33N08L51o33m60N9J050
2473E02j55o95l33P26N40n64n79l92J017L94j24q29l60O58R34j8q65q93L96J531
2493H91K62j061j218K88J266M55n59p07O4L31P81l27q23o8P92N06p69m12R7Q37
2513F26J51r19k67N10Q24K50j208p74L10J497J06n62j296j24J417N82m34j220
$$ plain form
2400 -737 -595 393 627 -199 -632 -236 384 418 -422 -702 -120 1127 803 -357 -530 30 1407 1279 152
2419 152 -634 5 1137 1438 603 -494 -557 708 1474 939 -322 -987 331 1130 937 -675 -1053 350
2437 350 809 262 -406 -586 -10 551 -84 -1307 -1193 162 419 -463 -1707 -1250 -40 537 -33 -1420
2455 -1420 -1590 -544 582 289 -1013 -1526 -892 388 592 -447 -1206 -373 135 486 -147 -607 -548 502
2473 502 347 -348 -681 45 585 21 -558 -950 67 461 337 -492 -852 -194 740 722 -143 -1036 -640 891
2493 891 1153 92 -1126 -838 428 883 324 -383 -319 12 793 466 -357 -425 367 873 104 -308 -211 626
2513 626 777 -142 -409 101 925 1175 -33 -807 -497 1000 1106 544 -752 -876 541 1123 689 -531
$$ [...]
8191C0
##END NTUPLES=NMR FID
##END=
