##TITLE=1H_Pr-4973
 CDCl3, 8 sc, 
 11.6.2020
##JCAMPDX= 6.0         $$ Bruker NMR JCAMP-DX V2.0
##DATA TYPE= NMR FID
##DATA CLASS= NTUPLES
##ORIGIN= UXNMR, Bruker Analytische Messtechnik GmbH
##OWNER= root
$$ XWIN-NMR		Version 3.5
$$ Thu Jun 11 11:51:19 2020 Russian Standard Time (UT+4h)  she@DPX200
##.OBSERVE FREQUENCY= 200.1315
##.OBSERVE NUCLEUS= ^1H
##.DELAY= (6, 6)
##.ACQUISITION MODE= SIMULTANEOUS
##.ACQUISITION SCHEME= undefined
##.AVERAGES= 8
##.DIGITISER RES= 18
##SPECTROMETER/DATA SYSTEM= spect
##.PULSE SEQUENCE= zg30
##.SOLVENT NAME= CDCl3
##.SHIFT REFERENCE= (INTERNAL, CDCl3, 0, 15.7039)
##AUDIT TRAIL= $$ (NUMBER, WHEN, WHO, WHERE, WHAT)
$$ ##TITLE= Audit trail, XWIN-NMR		Version 3.5
$$ ##JCAMPDX= 5.01
$$ ##ORIGIN= Bruker BioSpin GmbH
$$ ##OWNER= she
$$ F:/spectra/data/she/nmr/H-F/1/audita.txt
$$ ##AUDIT TRAIL=  $$ (NUMBER, WHEN, WHO, WHERE, WHAT)
(   1,<2020-06-11 11:50:15.15 +0400>,<she>,<DPX200>,
      <created by zg, POWCHK disabled, PULCHK disabled
       configuration hash MD5:
       00 E9 B6 7A A2 85 ED C7 34 08 36 98 17 FE 4E 26
       data hash MD5: 16K
       ED 1C 9D CA 59 B6 6A B6 EF 32 5A 9C BB 6A FF F7>)
$$ ##END=
$$ 
$$ hash MD5
$$ 0F 67 C1 37 7A 99 24 41 D9 DD D1 81 7C 94 44 62
##$RELAX= 
##$RELAX= 
##$RELAX= 
##$RELAX= 
##$RELAX= 
##$RELAX= 
$$ Bruker specific parameters
$$ --------------------------
##$DU= <F:/spectra>
##$EXPNO= 1
##$NAME= <H-F>
##$PROCNO= 1
##$TYPE= <nmr>
##$USER= <she>
##$AMP= (0..31)
100 100 100 100 100 100 100 100 100 100 100 100 100 100 100 100 100 100 
100 100 100 100 100 100 100 100 100 100 100 100 100 100 
##$AQSEQ= 0
##$AQ_mod= 1
##$AUNM= <au_zg>
##$AUTOPOS= <>
##$BF1= 200.13
##$BF2= 200.13
##$BF3= 200.13
##$BF4= 200.13
##$BF5= 200.13
##$BF6= 200.13
##$BF7= 200.13
##$BF8= 200.13
##$BYTORDA= 1
##$CFDGTYP= 0
##$CFRGTYP= 5
##$CHEMSTR= <none>
##$CNST= (0..31)
1 1 145 1 1 1 1 1 1 1 1 1 1 1 1 1 1 1 1 1 1 1 1 1 1 1 1 1 1 1 1 1 
##$CPDPRG= <>
##$CPDPRG1= <>
##$CPDPRG2= <>
##$CPDPRG3= <>
##$CPDPRG4= <mlev>
##$CPDPRG5= <mlev>
##$CPDPRG6= <mlev>
##$CPDPRG7= <mlev>
##$CPDPRG8= <mlev>
##$CPDPRGB= <>
##$CPDPRGT= <>
##$D= (0..31)
0 1.2 0 0 0 0 0 0 0 0.06 0 0.03 0 0 0 0 0.0002 0 0 0 0 0 0 0 0 0 0 0 0 
0 0 0 
##$DATE= 1591861814
##$DBL= (0..7)
120 120 120 120 120 120 120 120 
##$DBP= (0..7)
150 150 150 150 150 150 150 150 
##$DBP07= 0
##$DBPNAM0= <>
##$DBPNAM1= <>
##$DBPNAM2= <>
##$DBPNAM3= <>
##$DBPNAM4= <>
##$DBPNAM5= <>
##$DBPNAM6= <>
##$DBPNAM7= <>
##$DBPOAL= (0..7)
0.5 0.5 0.5 0.5 0.5 0.5 0.5 0.5 
##$DBPOFFS= (0..7)
0 0 0 0 0 0 0 0 
##$DE= 6
##$DECBNUC= <off>
##$DECIM= 24
##$DECNUC= <off>
##$DECSTAT= 4
##$DIGMOD= 1
##$DIGTYP= 9
##$DL= (0..7)
0 120 120 120 120 120 120 120 
##$DP= (0..7)
150 150 150 150 150 150 150 150 
##$DP07= 0
##$DPNAME0= <>
##$DPNAME1= <>
##$DPNAME2= <>
##$DPNAME3= <>
##$DPNAME4= <>
##$DPNAME5= <>
##$DPNAME6= <>
##$DPNAME7= <>
##$DPOAL= (0..7)
0.5 0.5 0.5 0.5 0.5 0.5 0.5 0.5 
##$DPOFFS= (0..7)
0 0 0 0 0 0 0 0 
##$DQDMODE= 0
##$DR= 18
##$DS= 0
##$DSLIST= <SSSSSSSSSSSSSSS>
$$ [...]
##$SUBNAM2= <"">
##$SUBNAM3= <"">
##$SUBNAM4= <"">
##$SUBNAM5= <"">
##$SUBNAM6= <"">
##$SUBNAM7= <"">
##$SUBNAM8= <"">
##$SUBNAM9= <"">
##$SW= 24.9337058887773
##$SWIBOX= (0..15)
0 0 2 0 0 0 0 0 0 0 0 0 0 0 0 0 
##$SW_h= 4990.01996007984
##$TD= 16384
##$TD0= 1
##$TE= 0
##$TE2= 300
##$TE3= 300
##$TEG= 300
##$TL= (0..7)
0 120 120 120 120 120 120 120 
##$TP= (0..7)
150 150 150 150 150 150 150 150 
##$TP07= 0
##$TPNAME0= <>
##$TPNAME1= <>
##$TPNAME2= <>
##$TPNAME3= <>
##$TPNAME4= <>
##$TPNAME5= <>
##$TPNAME6= <>
##$TPNAME7= <>
##$TPOAL= (0..7)
0.5 0.5 0.5 0.5 0.5 0.5 0.5 0.5 
##$TPOFFS= (0..7)
0 0 0 0 0 0 0 0 
##$TUNHIN= 0
##$TUNHOUT= 0
##$TUNXOUT= 0
##$USERA1= <user>
##$USERA2= <user>
##$USERA3= <user>
##$USERA4= <user>
##$USERA5= <user>
##$V9= 5
##$VALIST= <valist>
##$VCLIST= <CCCCCCCCCCCCCCC>
##$VD= 0
##$VDLIST= <DDDDDDDDDDDDDDD>
##$VPLIST= <PPPPPPPPPPPPPPP>
##$VTLIST= <TTTTTTTTTTTTTTT>
##$WBST= 1024
##$WBSW= 4
##$XGAIN= (0..3)
0 0 0 0 
##$XL= 0
##$YL= 0
##$YMAX_a= 224952
##$YMIN_a= -115952
##$ZGOPTNS= <>
##$ZL1= 120
##$ZL2= 120
##$ZL3= 120
##$ZL4= 120
##$ABSF1= 10
##$ABSF2= 0
##$ABSG= 5
##$ABSL= 3
##$ALPHA= 0
##$AQORDER= 0
##$ASSFAC= 0
##$ASSFACI= 0
##$ASSFACX= 0
##$ASSWID= 0
##$AUNMP= <proc_1d>
##$AZFE= 0.1
##$AZFW= 0.1
##$BCFW= 1
##$BC_mod= 2
##$BYTORDP= 1
##$COROFFS= 0
##$CY= 11.3945322036743
##$DATMOD= 1
##$DC= 2
##$DFILT= <>
##$DTYPP= 0
##$F1P= 16.9975609425685
##$F2P= -3.02152046262296
##$FCOR= 0.5
##$FTSIZE= 0
##$FT_mod= 4
##$GAMMA= 1
##$GB= 0.15
##$INTBC= 1
##$INTSCL= 1
##$ISEN= 128
##$LB= 0.24
##$LEV0= 0
##$LPBIN= 0
##$MAXI= 10000
##$MC2= 0
##$MEAN= 0
##$ME_mod= 0
##$MI= 1.114404
##$NCOEF= 0
##$NC_proc= 0
##$NLEV= 6
##$NOISF1= 3.799351
##$NOISF2= 2.8
##$NSP= 1
##$NTH_PI= 0
##$NZP= 0
##$OFFSET= 15.70392
##$PC= 1
##$PHC0= -9799.076
##$PHC1= 24.40087
##$PH_mod= 1
##$PKNL= yes
##$PPARMOD= 0
##$PSCAL= 0
##$PSIGN= 0
##$REVERSE= no
##$SF= 200.130013532006
##$SI= 16384
##$SIGF1= 3
##$SIGF2= 2
##$SINO= 400
##$SIOLD= 16384
##$SREGLST= <1H.CDCl3>
##$SSB= 0
##$STSI= 0
##$STSR= 0
##$SW_p= 3612.71676300578
##$SYMM= 0
##$S_DEV= 0
##$TDeff= 0
##$TDoff= 0
##$TI= <>
##$TILT= no
##$TM1= 0
##$TM2= 0
##$TOPLEV= 0
##$USERP1= <user>
##$USERP2= <user>
##$USERP3= <user>
##$USERP4= <user>
##$USERP5= <user>
##$WDW= 1
##$XDIM= 8192
##$YMAX_p= 0
##$YMIN_p= 0
$$ End of Bruker specific parameters
$$ ---------------------------------
##NTUPLES= NMR FID
##VAR_NAME=  TIME,          FID/REAL,        FID/IMAG
##SYMBOL=    X,             R,               I
##VAR_TYPE=  INDEPENDENT,   DEPENDENT,       DEPENDENT
##VAR_FORM=  AFFN,          ASDF,            ASDF
##VAR_DIM=   8192,          8192,            8192
##UNITS=     SECONDS,       ARBITRARY UNITS, ARBITRARY UNITS
##FACTOR=    0.0002004,     1,               1
##FIRST=     0,             0,               0
##LAST=      1.6414764,     0,               0
##MIN=       0,             -115952,         0
##MAX=       1.6414764,     224952,          0
$$ Real data points
##PAGE= N=1
##DATA TABLE= (X++(R..R)), XYDATA
0 0 0 0 0 0 0 0 0 0 0 7 -8 8 -8 8 -16 16 -21 24 -29 32 -40 47 -55 63 -71 81 -94 107 -120 137 -154 173
32 173 -194 217 -243 271 -302 336 -372 412 -457 506 -560 620 -687 763 -846 941 -1050 1177
50 1177 -1324 1503 -1718 1987 -2335 2801 -3468 4501 -6331 10556 -44233 63341 175487 52681
64 52681 -66743 -69872 17154 35704 -8130 -43296 -14312 24062 50222 67930 73295 23331
76 23331 -49136 -61489 9787 63676 31894 -28742 -8509 73813 99106 16004 -74314 -69309
88 -69309 3589 43702 32621 18870 22654 8671 -28137 -47225 -27265 -4762 -10817 -20471 682
101 682 28143 15605 -20767 -26972 -4654 -2293 -32197 -41525 -3 48453 43824 -3716 -34970
114 -34970 -26566 -10355 -4379 7374 28306 33497 18616 10915 19317 16449 -12995 -32452 -1489
127 -1489 51023 53161 -1582 -36651 -3276 47213 39371 -18269 -49740 -20016 29719 45800 27153
140 27153 1304 -20002 -36687 -31323 -2191 17558 -293 -26397 -15299 20083 22024 -23021
152 -23021 -55473 -26372 26450 30908 -12984 -36698 -9861 22110 14220 -17447 -30437 -17410
164 -17410 -2857 2613 11076 23284 18189 -7030 -22371 -9899 8168 7511 -1339 4363 16982
177 16982 11769 -11998 -23663 -6473 14081 10454 -8777 -10574 4749 12894 5463 -2462 -2982 -6320
191 -6320 -16893 -19979 -3976 15545 13489 -5432 -15627 -10143 -5245 -8714 -6710 6869 16291 8713
205 8713 -7034 -12649 -3769 3672 1223 -2251 -484 214 -1225 2595 12927 15151 3199 -9209
219 -9209 -6187 7915 13798 6546 2377 10810 15163 -1120 -20628 -16676 8631 26195 17204 -3700
233 -3700 -12127 -3575 8437 11279 6630 -1618 -10176 -10216 2946 15351 9367 -8686 -16371 -5421
247 -5421 8591 5181 -8377 -8199 9073 19945 8280 -12065 -17850 -7688 6131 12525 8989
260 8989 45 -8717 -11589 -2884 12155 16206 3237 -11634 -9472 5929 15790 11095 259 -5507
274 -5507 -5504 -4589 -3359 2110 7133 5175 -861 -2334 -705 -2329 -5594 -3313 4946 8788 1524 -10306
290 -10306 -12537 -4645 1894 -962 -5688 -6335 -5701 -6063 -5033 692 5624 3322 -7164 -15390 -12396
305 -12396 -693 7412 7331 -201 -10534 -15856 -9793 3563 12062 6601 -6203 -10432 -309 10904
319 10904 8385 -3342 -7529 -555 6315 4337 -2849 -5163 215 7184 8411 2233 -5577 -8767 -3139
334 -3139 9881 17625 9128 -7467 -16210 -8552 5381 11102 4951 -5366 -8207 -4865 185 3563
348 3563 5122 2674 -3012 -5612 -2497 2618 4495 2795 -502 -1023 -946 -3175 -4259 828 7616 9189
364 9189 4156 -643 -1245 853 3564 5125 7125 6848 2834 -3210 -3760 2480 7355 7361 4065 -664 -3863
381 -3863 -1969 4797 11253 10870 1834 -9289 -10655 -952 8777 7917 -251 -6744 -7025 -3126 668 1249
397 1249 366 -504 -943 -1969 -2097 -2084 -2561 -1840 683 1114 -3383 -8230 -7368 -465 6417 6146 -597 -6932
415 -6932 -6532 -2128 2540 5700 5516 309 -6077 -7881 -3852 2696 5726 2772 -2857 -5608 -4031 -464
431 -464 3477 5382 2034 -3742 -6587 -4831 -325 2992 1561 -2374 -4519 -4543 -4126 -2721 -420 1479
447 1479 1587 -364 -3087 -4698 -4110 -1559 1197 2814 1290 -4349 -8700 -6058 1947 7552 5676 -1661
463 -1661 -7194 -6223 1296 7366 8267 3316 -3059 -6475 -3495 3393 6804 4985 1069 -919 -959 1374
479 1374 3369 3968 4643 4068 2637 221 -478 963 2425 3816 3889 1530 -2036 -3121 -1783 2884 7105
496 7105 6238 505 -4256 -5018 -1130 4063 6613 3997 -2705 -6995 -5690 321 5534 5818 768 -4141
512 -4141 -4779 -1303 3138 5617 3709 -303 -2702 -2057 -111 1847 2781 1645 1139 1171 404 -1466 -1311
529 -1311 2173 5590 5850 2252 -3600 -5469 -1786 3672 5790 3069 -2953 -7561 -6602 -384 5274 4417
545 4417 -942 -6381 -7111 -3243 624 1523 -641 -2870 -5596 -6943 -5794 -2370 420 892 -1336 -4637
561 -4637 -5633 -3138 42 1492 1293 54 -2449 -3432 -2870 -624 1364 2787 1722 -400 -1939 -1958 97
578 97 3539 6414 5249 -433 -4903 -4608 576 6683 6862 903 -5664 -6490 -2136 3480 5401 1858
594 1858 -2611 -4424 -2961 -476 1572 2083 -126 -2688 -3145 -2207 -1525 -959 -79 1075 1853 1181 -2075
611 -2075 -3796 -478 4761 6759 4048 -684 -4001 -1961 3253 6604 6828 3871 -382 -2790 -318
626 -318 5747 9201 7472 1046 -3118 -1563 3104 5793 4400 1490 -25 -1424 -2034 -681 1626 2936
642 2936 1772 -763 -2710 -2095 -1033 -474 -487 876 1090 -1784 -5242 -5533 -1327 3433 4039 -793 -4951
659 -4951 -4623 -950 1832 3288 2871 1139 -2200 -4250 -3271 1947 6063 4223 -1669 -5051 -3893 254
675 254 4257 4791 1564 -2053 -4012 -3123 493 3155 2340 -2172 -4704 -3265 -477 -452 -3170 -3832 -703
692 -703 2879 340 -6102 -8569 -2742 4182 5582 -499 -7882 -9463 -3842 3201 5064 1784 -3959
707 -3959 -6983 -4602 1443 5802 4082 -1088 -4172 -2221 1473 2951 611 -1087 1110 2704 769
722 769 -2731 -2594 1779 5520 4559 207 -3130 -1847 857 2969 3246 2350 -92 -2270 -2437 -471 2698
739 2698 4161 2434 -760 -2007 -971 111 1748 3668 4458 1663 -3077 -5264 -1206 5351 7820
754 7820 2560 -3997 -4907 -214 5097 5222 2104 -959 -786 480 904 932 1350 1342 1069 1148 378 -1250 -1783
773 -1783 -47 2950 5323 2741 -2976 -6054 -1681 4953 6515 2406 -4026 -5451 -1999 1955 3212
788 3212 2497 752 -1396 -3534 -2479 1431 3909 2711 -899 -3799 -3465 -253 530 151 -253 -625 -1468
805 -1468 -2598 -2896 -1722 298 1308 -36 -1969 -3554 -3673 -2954 -430 1552 1352 -2693 -5796 -5156
821 -5156 -1451 2416 3188 131 -3424 -4331 -2319 643 2823 2529 216 -2672 -3785 -1819 1373 3946
837 3946 3069 -716 -2458 -1836 482 2154 2505 1206 -176 -451 -1158 -1339 -539 1234 1627 1002 -773
854 -773 -2361 -2606 -627 1354 2619 2110 -321 -4104 -3794 -175 4094 4294 980 -3563 -4481 -1304 3016
871 3016 4221 3280 104 -2540 -2115 1579 4732 4374 1788 -642 -580 1602 2417 1606 1468 2659 3414
888 3414 1789 -454 -756 853 3812 4305 2451 -787 -2339 -2096 304 3177 3878 813 -3063 -4019
904 -4019 -2171 1219 3546 2260 -1096 -3591 -3349 -1643 1388 3120 1115 -2756 -3778 -2268 -53
919 -53 1638 1245 -60 -569 -1036 -557 -983 339 1364 1552 875 -659 -2074 -2318 -109 2038 2296 506
937 506 -2099 -3754 -1948 1068 2283 1344 -884 -3048 -4357 -2833 346 2001 1008 -2377 -5342 -4750
953 -4750 -1301 1411 1706 -595 -3009 -4138 -2879 -312 1018 577 -810 -2141 -2272 -836 -291 -189
969 -189 569 1570 1148 -509 -1802 -838 1037 2957 3339 1349 -1429 -2234 -1043 2136 4958 3969 240
986 240 -3120 -2574 927 4096 3862 1358 -1818 -2178 -945 1000 1908 1848 -49 -1424 -1413 -1087 128 1136
1004 1136 1546 1178 -67 -1290 -1951 -388 2169 2432 1057 -54 -915 -684 370 1398 2386 2608 1820
1021 1820 -463 -1480 -225 2870 4354 3705 945 -2463 -2114 724 4131 5098 1928 -1621 -3286 -695
1037 -695 2931 3831 1614 -1089 -2108 -1017 74 290 -56 -495 -755 -1394 -1520 -2300 -2340 -1023 651 1021
1055 1021 -830 -3265 -4376 -2735 705 2376 632 -2442 -4196 -3618 -634 2156 2288 -81 -2520
1070 -2520 -2882 -1815 935 1951 1284 88 -1852 -2056 -942 521 2133 1806 -166 -1865 -1844 -759
1086 -759 1026 1308 685 -423 -1311 -1260 -911 -887 -426 -105 146 -493 -2091 -3083 -2243 416 2045 1601 -1687
1105 -1687 -4320 -3756 176 3124 3032 -231 -3539 -3459 -572 2684 3500 1597 -454 -1552 -375 1466
1121 1466 2694 2255 1110 1239 876 985 673 666 1964 3091 2442 773 -735 -599 872 2826 3628 1615
1139 1615 -564 -2043 -907 798 2336 2369 238 -1723 -2392 -1306 488 1866 1797 -426 -2397 -2562
1155 -2562 -936 1242 2370 1343 -948 -2022 -1512 128 1933 1990 917 -314 -270 100 476 870 1718
1172 1718 1627 1352 906 -751 -977 -51 2146 2850 1645 -1400 -3023 -1668 1455 2915 2071 -1071 -3385
1189 -3385 -3408 -1153 979 1134 -332 -2390 -3549 -3055 -1137 -176 -216 -1099 -2044 -2733 -2855 -1854 -651 8
1207 8 -368 -1488 -2706 -2363 -1094 -30 678 664 -569 -903 -1235 -934 356 1995 2519 792 -957 -2184
1225 -2184 -819 1584 3421 2854 242 -2015 -1767 -87 2886 3411 776 -1615 -2508 -983 1357 2003
1241 2003 860 -683 -1231 -1027 -596 -161 -227 15 265 -14 -795 -1579 -1399 102 1499 1208 255 -1376
1259 -1376 -1947 -941 1447 3017 1896 18 -1435 -1260 829 2775 3016 1958 183 -1003 -225 1565
1275 1565 2808 3198 2339 121 -1061 -171 1755 2742 2081 750 -339 -346 639 1005 903 1036 829 -140
1293 -140 -774 -847 -611 604 955 345 -189 -1151 -2037 -1797 165 2083 1271 -1711 -3434 -2979 -388 1726
1311 1726 1658 -634 -2396 -2603 -1498 -126 1661 1499 -671 -2193 -2166 -625 977 994 -360 -950 -363
1328 -363 -402 -523 -533 326 806 548 -308 -1248 -1497 -522 557 1271 507 0 -1939 -2487 -767 1125 2218
1347 2218 525 -2035 -3112 -1914 495 1415 749 -1003 -2277 -2293 -1155 556 994 426 -694 -1730
1363 -1730 -1732 -516 513 925 532 -175 -260 -702 -405 -97 1151 1806 1079 -295 -1287 -586 995 1873 2386
1382 2386 1205 281 -465 -468 850 2548 3179 1676 -1153 -1396 -463 2444 3004 1834 5 -1431 -935
1399 -935 -51 1527 2071 1067 -835 -1318 -922 787 1243 607 -447 350 178 -277 -927 -453 999 1667
1417 1667 1121 -535 -1431 -969 637 1463 1859 827 -443 -1982 -1186 1070 2727 1988 -204 -1741 -1674
1434 -1674 469 1839 1490 510 -656 -1681 -1142 -164 724 941 -209 -1184 -1810 -1361 -590 -188 -138 -32
1452 -32 -433 -1655 -1838 -1602 -1319 -79 870 -480 -1957 -2332 -1694 191 963 617 -786 -2109 -2141 -1315
1470 -1315 477 1811 1140 -821 -2209 -1602 63 1721 1558 251 -965 -974 -556 259 901 1193 199 -460
1488 -460 -682 -520 316 674 492 195 202 -100 -969 -941 -29 1515 1316 -201 -1278 -1740 -654 1012 1240
1507 1240 1170 -207 -1508 -1532 214 2013 2313 1138 -907 -1281 -532 1630 2212 1750 563 39 -168 445
1525 445 1179 1734 1325 936 148 12 645 521 611 1208 1385 831 -523 -911 -447 865 1910 1271 -104
1544 -104 -1340 -1407 -347 1272 1900 949 -1224 -1919 -1215 167 1286 1269 -155 -1317 -1557 -703 211 1063
1562 1063 873 -336 -1163 -795 -617 247 607 777 -22 -461 -915 -622 170 560 632 25 -373 -1089 -1222 -871
1582 -871 263 1124 697 -925 -2257 -1971 -684 755 1146 -156 -1699 -2458 -1964 -24 1068 608 -873
1599 -873 -2191 -1868 -729 390 902 -118 -762 -1337 -1244 -163 138 4 -8 -38 -280 -548 -629 -306 150 1427
1619 1427 1413 -246 -1168 -878 222 1557 1953 649 -885 -1265 -702 638 2215 1929 171 -1135 -1188
1636 -1188 -60 1025 1691 917 -413 -653 -612 -211 976 1004 725 -154 -810 -508 90 532 897 708 116
1655 116 -95 -223 -456 827 1339 1316 1085 176 -645 -544 452 1524 2105 1153 -445 -1504 -468 1676
1673 1676 2015 1619 42 -1295 -1158 531 1849 1841 750 -484 -1113 -525 302 763 498 -133 -590 -667 -914
1692 -914 -709 -557 -42 283 -127 -780 -1285 -1473 -449 870 612 -190 -1494 -1894 -1419 40 1108 813
1710 813 -930 -1532 -1538 -886 527 1175 361 -1031 -1526 -1096 -148 917 917 47 -673 -1220 -797 60 489 621
1730 621 -192 -590 -1201 -447 -138 96 79 39 -305 -670 -1225 -974 -45 1047 941 -31 -1629 -1948 -559 429
1750 429 1505 764 -509 -1871 -1631 83 1392 1718 526 -1088 -1234 -346 1123 1303 1114 680 55
1767 55 -434 318 838 797 1251 745 262 -34 -341 213 880 1793 1481 756 -370 -593 193 903 1865 1335
1787 1335 30 -1039 -700 289 1460 1648 710 -602 -1170 -713 243 1664 1368 -32 -946 -855 -373 504
1805 504 1131 674 -209 -791 -490 -394 257 912 740 264 69 -698 -460 -113 497 454 600 161 -912 -1284
1825 -1284 -499 891 1155 713 -800 -1672 -1087 42 1279 814 -446 -1241 -1772 -849 -8 767 352 -818
1843 -818 -1605 -1539 -395 66 -148 -579 -794 -1056 -1366 -716 -515 101 -175 -100 -681 -1383 -1030 -647 340 804
1863 804 455 -755 -1197 -1002 -333 1026 1371 6 -604 -1395 -926 619 1531 1008 31 -916 -864 -44 693
1882 693 1517 528 -138 -1039 -480 221 827 866 217 -151 146 -115 -241 216 553 842 520 215 -470 -633
1902 -633 350 1064 1443 598 39 -890 -629 664 1652 1291 361 -719 -707 230 1108 1769 983 -485 -1009
1921 -1009 -157 613 1142 1198 833 -109 -615 -448 347 858 743 381 8 -331 -256 79 3 505 744 367 -421
1942 -421 -851 -929 -169 1147 800 -178 -1018 -1046 -886 155 967 473 -430 -1452 -1089 -250 807 1064 140
1961 140 -936 -1441 -914 -222 553 214 -155 -679 -945 -523 -251 -124 107 -310 -510 -704 -689 -638 -221 270
1981 270 194 -129 -720 -1542 -811 296 661 260 -772 -1294 -1327 -392 278 879 558 -546 -1465 -1210 149
2000 149 887 854 199 -896 -1247 -531 570 735 556 -9 -165 -369 8 438 517 303 240 177 -93 -2 -238
2021 -238 245 1221 997 557 -449 -882 -368 1070 1724 882 -220 -889 -711 618 1429 1555 443 -560
2039 -560 -1074 -358 599 1608 1238 34 -300 -254 239 733 1030 941 233 42 -87 -255 354 673 537 487
2059 487 208 -599 -621 169 451 652 550 8 -778 -646 -142 790 906 438 -413 -986 -912 11 717 619 142
2080 142 -1046 -1246 -458 806 857 288 -675 -1084 -870 -364 -89 -124 -188 -331 -383 -700 -494 -270 133 423 175
2101 175 -252 -661 -891 -366 -1 614 304 -639 -1596 -1060 100 771 832 -151 -1025 -1023 -314 -9 641 933 -744
2122 -744 -1032 -1188 -369 466 554 124 -481 -591 -651 -194 98 318 276 -49 -378 -467 -243 193 247 231 27 -241
2144 -241 -497 -520 178 627 1012 589 -447 -795 -556 646 1307 1189 436 -585 -677 96 1080 1186 1065 79
2164 79 -753 -201 643 1098 871 482 276 109 -2 262 554 878 665 673 259 30 76 236 792 932 267
2185 267 -401 -515 -457 482 1049 777 -472 -611 -739 -50 512 650 276 -471 -786 -594 -251 608 884 155
2205 155 -703 -963 -318 142 594 339 17 -435 -265 -447 -216 -1 57 163 69 -434 -471 -339 -36 495 184
2226 184 1 -644 -994 -686 33 623 186 -524 -1478 -1474 -314 519 475 115 -822 -1303 -832 -112 603 206 -163
2247 -163 -821 -976 -366 -130 -67 -101 -223 -270 -535 -260 -188 276 582 49 36 -401 -447 -62 47 848 797 137
2269 137 -374 -615 53 535 1128 279 -347 -675 -541 205 1089 1106 324 -589 -538 -135 423 1348 778 299 -110
2290 -110 -117 43 377 443 610 462 300 -258 102 28 696 720 459 354 -222 -265 107 563 926 531 51 -319
2312 -319 -446 285 814 995 668 -242 -799 -261 449 1010 838 225 -393 -958 2 488 566 212 -463 -407 -149
2333 -149 91 148 84 164 -144 -281 -262 -617 -320 241 180 119 -485 -836 -864 -310 225 255 106 -836 -872 -740 -170
2356 -170 306 440 -377 -850 -1086 -390 259 244 95 -496 -636 -577 -384 349 461 -150 -314 -428 -403 -359 -98
2377 -98 -36 53 -205 -474 -577 -630 66 118 257 130 -212 -530 -789 110 430 620 258 -495 -889 -716 295
2398 295 558 657 103 -620 -684 98 815 1004 443 10 -499 36 469 543 554 264 122 120 261 424 479 373
2420 373 830 521 265 330 508 334 862 981 543 -377 -397 27 771 1073 725 70 -541 -493 -81 606 910
2441 910 270 -337 -624 -700 107 539 609 132 -454 -349 -418 -142 489 274 -27 6 -334 -450 -163 -12 136
2462 136 72 101 -285 -373 -321 98 448 194 242 -605 -811 -463 90 519 378 -247 -1072 -1008 -55 505 397 107
2484 107 -601 -1112 -519 67 198 54 -171 -606 -802 -632 -288 -19 102 -173 -359 -835 -480 -104 -80 225
2504 225 3 -91 -589 -859 -500 268 238 506 -73 -847 -692 -293 495 769 331 -243 -803 -517 361 823 842
2525 842 158 -211 -322 -280 132 814 369 194 -28 -51 104 77 504 374 181 -163 -85 -17 -182 342 308 499
2547 499 69 -465 -318 108 664 901 486 100 -276 -103 355 610 796 540 -427 -487 -317 378 848 660
2567 660 0 -52 -384 222 709 589 309 294 -314 -258 -39 287 504 438 321 -25 -312 -265 -290 381 700 266
2589 266 -295 -727 -691 13 396 591 64 -541 -923 -505 139 760 556 -295 -973 -783 -680 34 680 36
2609 36 -403 -759 -706 -267 201 422 -127 -373 -515 -572 -728 -253 7 58 -391 -508 -710 -442 22 -70 10 223
2631 223 -122 -652 -576 -247 243 399 56 -385 -944 -311 460 600 430 -74 -659 -428 -178 358 685 488
2651 488 -148 -396 -121 252 56 239 59 169 -291 -1 -210 404 298 490 447 86 -198 -289 -27 594 947
2672 947 179 -153 -432 -257 335 670 436 -161 -559 -278 221 719 601 35 -330 -431 -40 206 573 555
2692 555 485 -38 -57 114 143 671 713 360 338 69 128 215 88 584 538 141 275 -85 230 15 532 371 237
2715 237 -227 -923 -204 83 304 103 -255 -625 -601 20 81 234 -394 -623 -740 -762 -150 98 -39 -317 -274
2736 -274 -699 -474 -123 -131 -18 230 -210 -382 -687 -422 -122 369 138 -193 -760 -753 -387 133 323 140 -81
2757 -81 -645 -353 -285 166 414 -32 -201 -313 -148 -249 -27 372 -48 -317 -293 -57 -43 61 152 -53 -513 -544
2779 -544 6 -111 112 132 -128 -314 -449 -516 -98 -226 429 196 -36 -308 -245 45 247 365 394 123 -314
2800 -314 -180 398 625 821 416 -158 -271 631 653 672 656 356 -150 -102 553 359 348 459 336 5 115 223
2822 223 47 463 289 283 -215 -138 -350 36 317 860 467 38 -395 -356 164 314 577 104 -214 -369 -57
2843 -57 -43 553 157 152 -617 -603 -369 296 205 162 -353 -332 -601 -316 2 332 -216 -195 -339 -330 -307 -265 158 -39
2867 -39 45 -23 -495 -419 -183 349 308 -70 -503 -803 -324 29 270 102 -167 -383 -628 -329 -160 75 52 -532
2889 -532 -680 -525 -318 207 -49 245 -209 -185 -526 -127 -142 205 2 -58 107 -233 -17 -36 459 381 175 -143
2911 -143 -263 -302 -52 233 448 -136 -231 -483 -296 238 648 236 176 -65 -416 -39 526 414 390 142 -357
2932 -357 162 198 441 434 132 -136 71 199 -45 204 245 429 249 -32 200 287 170 224 475 249 65 -146
2954 -146 -193 68 462 434 -6 -358 -540 -3 378 472 202 -247 -452 -334 101 89 285 -23 -67 -248 -217 -64
2976 -64 213 69 77 -257 -159 -112 -103 115 195 -35 215 162 -362 -257 283 52 67 -242 -373 -633 -401 58 271
2999 271 -55 -346 -441 -490 1 239 401 -52 -452 -639 -701 -107 29 -80 -298 -312 -394 -338 124 304 51 126
3021 126 -227 -286 -442 -217 -131 -1 -53 -188 -283 -523 -288 -85 417 -135 57 -254 -256 -96 436 486 372 -161
3043 -161 -566 -339 222 356 144 200 99 -399 -11 195 357 433 233 47 24 295 56 315 91 345 51
3064 51 -69 -7 54 174 339 196 85 -136 -242 -44 239 759 175 292 -240 -303 329 284 559 176 -230 -171
3086 -171 -211 185 280 29 -317 -101 -10 -97 248 255 232 133 -128 -94 -309 80 498 73 112 -69 -186 -176 -167 279
3110 279 73 -126 -24 -453 -425 -232 164 146 55 -507 -531 -270 117 503 243 -51 -318 -795 -454 -15 68 219
3132 219 -372 -766 -390 242 -15 34 -226 -222 -348 -58 -133 -147 -189 9 119 -300 -469 -336 -218 231 220 -79
3154 -79 -339 -135 -282 223 308 515 -114 19 -486 -511 223 438 220 -192 -197 -169 -439 519 414 -164 -170 -272 -296
3177 -296 296 248 308 129 -96 -109 174 153 83 3 319 145 142 49 -19 202 21 408 154 -30 -244 20 294
3200 294 181 401 80 -90 -98 182 126 516 30 -90 -329 -53 107 604 345 192 242 -129 360 104 468
3221 468 -39 248 155 102 -317 -358 -143 212 213 30 -67 -55 -291 -246 242 -36 -199 -617 -482 -324 321 306 -149
3244 -149 -301 -645 -286 138 175 281 -108 -361 -294 -120 -75 -119 416 -129 -121 -341 -455 -33 171 -145 -39 -133
3266 -133 -355 -22 -102 -21 54 16 -68 -61 -325 -445 -96 -172 -237 114 -690 -247 -28 88 293 -2 -126 38 -362
3289 -362 445 55 -170 -220 -122 -25 -60 -178 82 313 -179 9 68 22 447 191 369 266 -54 -21 155 397
3311 397 -85 234 452 51 114 42 189 199 461 538 84 -81 -28 386 356 378 57 42 -258 -134 206 295 192
3334 192 126 44 170 74 109 295 50 126 109 -67 103 242 -177 336 155 24 -137 -300 61 184 89 159 178
3357 178 -131 -65 65 247 134 122 36 -296 -36 227 193 371 140 -89 -494 -15 61 -86 -89 -243 -168 -33 -316
3380 -316 -385 -245 -30 -302 -25 -145 -195 -263 -223 34 -233 -228 -241 -168 -288 129 -11 -43 -283 -279 -9 75 153 -8
3404 -8 178 -341 -230 -58 -67 195 82 18 -107 -122 -59 259 143 4 10 -9 -48 -92 123 121 105 -51 -263 -272 127 -66
3430 -66 -75 84 -76 212 -238 -208 -25 49 2 -8 97 -53 66 127 317 -41 79 -139 80 37 274 -124 262
3453 262 70 163 75 187 279 136 250 260 235 357 82 -97 297 58 124 376 380 110 218 39 280 98 -163
3476 -163 209 156 -53 -27 159 51 -47 -260 -54 390 -86 -25 44 -332 -15 11 189 -48 -46 86 -385 -187 82
3499 82 46 -49 19 -49 -44 -321 -81 223 181 30 311 -140 -488 -140 48 -28 150 -82 -272 -122 -132 -12 431
3522 431 359 -335 -277 -147 -156 218 130 219 -372 -346 25 -205 117 209 -74 -357 -236 -378 214 -14 -156 115 -100
3545 -100 -11 -113 -147 -156 -90 103 136 -243 -93 247 263 363 381 10 -68 -132 -92 227 388 59 -21 -295 -101 200
3569 200 511 541 334 129 102 85 162 509 68 -114 -130 -35 102 206 116 166 235 -58 185 9 244 329 74
3592 74 83 -96 -201 -224 215 15 230 283 -19 -36 -117 104 404 172 241 94 -290 -82 -30 6 84 -1 -238 18
3616 18 94 245 258 186 207 -27 -238 112 120 -200 241 -16 -320 -367 93 -296 -161 -51 -68 -259 -562 -222 -84
3639 -84 314 42 -273 -231 -293 -5 97 -161 -18 -246 81 -151 -16 -53 71 -105 62 -277 0 -356 -343 69
3661 69 82 38 -458 -196 -273 31 -53 -71 -70 -159 -112 -25 -348 14 187 164 -566 -366 -24 252 8 -31 59 -152 -163
3686 -163 -47 -34 267 315 -90 -65 -81 94 181 81 316 308 -96 -25 84 499 -30 154 -57 -11 -169 10 357
3709 357 321 335 93 129 -278 -157 -141 323 322 62 64 117 22 122 520 237 -93 -197 -276 -140 -100 288 -39 110
3733 110 18 194 27 423 303 -266 -121 67 299 -175 218 137 227 -90 43 -113 34 -144 -248 -109 -115 -106
3755 -106 69 83 162 31 74 299 -83 -145 9 -60 296 97 -125 -44 -404 3 29 51 -139 -109 -380 -224 -16
3778 -16 -71 108 -158 -391 -281 -201 -40 -156 147 -37 -176 -151 -116 -150 -187 -45 80 165 -93 -152 -353 -80 29
3801 29 317 -182 -85 -98 -109 183 363 -56 -82 -220 -130 -211 353 163 -85 -204 163 -62 224 14 183 181 1
3824 1 -172 -227 29 -24 -62 155 -50 -24 -146 158 411 20 -196 -230 -15 -135 -78 280 287 381 252 19 -70 203
3848 203 187 177 44 -121 -158 -190 375 250 197 95 -18 -112 43 412 368 13 -85 162 -151 11 105 104 -163 271
3872 271 -274 33 -146 -38 -34 284 -308 -108 55 -362 -156 -4 92 -208 -196 -455 -28 -241 -82 -152 -121 -247
3894 -247 -194 51 -98 126 109 -69 -113 -81 -102 -89 391 174 29 150 116 205 -71 -33 -36 -87 -13 28 -83 -136 -62
3919 -62 65 -184 -217 -132 -107 -365 109 66 -149 -225 -200 -125 27 -187 171 -277 -268 4 -13 26 4 150 -122 -183 -267
3944 -267 -55 -120 282 -142 94 50 154 133 176 163 108 2 -132 239 -21 206 138 15 219 -61 16 241 252
3967 252 58 399 104 9 -162 216 376 212 281 -28 74 -155 19 377 240 124 -94 4 -335 56 451
3988 451 336 104 -177 102 -8 -32 143 392 -211 -136 -68 -360 -27 27 260 224 245 -144 -341 -127 169 77
4010 77 -49 -143 94 -27 -247 42 180 -114 -286 -187 -170 -290 -118 -92 7 -467 -91 -256 -191 -42 -288 -398
4032 -398 -430 -153 -87 -94 27 -41 61 138 -379 25 -262 58 -146 170 -240 39 -92 -38 56 -225 -124 65 60
4055 60 -141 213 29 25 -172 -362 92 23 261 -85 255 -266 -210 -125 25 -29 89 175 -42 -132 -92 -270 326
4078 326 92 165 138 23 -32 -214 5 95 29 292 -212 168 -34 249 403 104 57 -182 -178 47 -22 221 62
4101 62 301 233 157 197 -413 137 262 -146 191 -71 -10 102 32 64 116 103 -211 352 27 92 -29 113 82 -48
4125 -48 -147 125 202 108 288 -67 96 -62 -221 201 163 270 -118 -22 -120 37 123 181 -301 13 -121 -383 -107
4148 -107 18 176 -147 -4 -131 -100 208 79 104 -140 33 -38 136 -158 25 159 109 -230 -9 -128 -6
4169 -6 -157 18 230 -246 -230 106 -265 -44 -14 98 -228 -294 -144 -60 103 -305 108 -79 -167 -58 -117 76 60
4192 60 -16 174 187 -73 64 -19 188 -202 -127 33 -158 134 380 197 221 77 -147 121 191 117 235 209 -74
4215 -74 -141 192 254 -56 -71 -77 92 19 276 -17 -216 56 245 -288 -209 -93 162 226 4 130 -187 -55 137
4238 137 112 298 181 -15 -97 -294 -162 196 -39 313 39 -188 -35 -69 8 -265 -101 48 30 -193 203 -40
4260 -40 -46 67 -240 7 31 -32 94 223 267 8 -97 -111 -163 331 22 182 -90 206 -117 -14 5 102 -292
4283 -292 -207 -52 -269 -127 134 -34 280 128 154 -54 -119 333 -390 -104 -299 -92 -43 125 53 -251 47 -37
4305 -37 2 -83 -25 -42 3 474 -272 64 42 290 -93 262 -79 -103 -139 -225 -12 -178 -108 166 -237 -69 -13 148
4329 148 96 67 -18 16 76 -25 310 117 -6 92 -1 70 514 -20 350 -136 223 91 -195 193 103 201 92
4352 92 224 180 -62 28 -81 141 160 -2 -343 52 166 16 163 234 340 90 258 -29 6 -33 87 112 310
4375 310 -78 85 -73 -248 -187 -71 -201 -290 -56 -187 101 85 -94 32 329 -7 153 358 192 -302 -58
4396 -58 -145 -78 -11 232 -20 181 -4 -101 52 92 62 -25 260 -104 -185 162 145 37 101 -49 -128 41 102 280
4420 280 -56 136 82 -80 -431 -264 62 162 -39 -158 -62 33 -259 103 136 -39 -316 -20 -91 292 -39 -173
4442 -173 193 27 387 -49 -6 408 -94 21 -3 -197 -170 170 52 14 182 -190 -42 -201 -53 126 73 174
4464 174 41 45 -24 -4 4 -185 151 160 83 61 43 -33 -269 -108 218 -166 -86 -49 3 -14 70 -85 12 119 111 71 -95
4491 -95 -6 164 32 64 -160 -101 54 169 47 -4 -126 219 -304 62 0 -165 121 46 162 -57 -35 145 111
4514 111 73 -91 -113 -45 -20 107 -40 -286 27 104 -80 -183 -33 92 13 -117 -27 -83 -57 -22 -130 -181 -98 79
4538 79 24 112 -206 -117 -52 300 -204 112 -13 -42 -121 -178 231 -41 -98 243 19 -169 -170 76 -267 77 141 36
4562 36 44 -150 -326 55 -56 162 7 49 17 3 -21 9 168 72 -103 -185 -179 6 -152 3 -326 -185 -172 269
4586 269 -176 109 86 -103 301 -68 -179 251 118 -105 145 304 231 -57 -45 -31 -28 139 256 227 -71 166
4608 166 403 232 392 78 83 194 174 651 121 -181 15 160 337 338 86 -139 371 132 25 -72 181 74
4630 74 190 364 0 -149 226 170 -15 36 150 64 -203 -146 158 113 283 150 -161 283 -140 -155 -319 81
4652 81 127 124 -55 -129 -8 -67 116 -6 -288 12 -23 113 -9 -34 -196 -88 -94 222 -65 117 41 -245 -192 -257
4676 -257 20 134 33 266 54 329 25 37 15 -65 -123 92 142 161 53 153 106 148 -143 -40 -152 6 27
4699 27 -57 -314 -136 79 -297 128 201 95 -388 291 91 221 119 -111 -83 118 -158 -104 79 239 81 -145
4721 -145 105 -32 -232 -125 -24 -95 4 229 62 128 123 50 46 15 8 16 93 -13 51 165 409 105 -72 -276 81
4746 81 62 289 160 206 112 169 395 329 -29 103 372 -235 111 -260 -26 121 -28 144 -268 -185 -43 122
4768 122 159 136 -23 -44 144 128 188 -19 -30 -20 161 -193 -223 95 1 213 185 38 188 60 -53 4 -125 168
4792 168 269 27 -344 -225 -30 163 -47 -230 205 195 -141 -27 -260 139 -43 -13 -275 173 65 47 -76
4813 -76 -204 -179 -164 161 153 94 -125 -50 163 40 43 64 -344 -46 112 -49 -179 0 -26 -120 29 124 -189 -4
4837 -4 -101 -128 -60 -46 214 -105 36 279 -58 -189 63 -18 -43 -117 322 77 136 0 -188 -253 47 87 40 -214
4861 -214 -193 -300 -19 88 -216 -162 -90 78 -129 144 48 -30 103 108 -60 -48 94 164 -108 511 -16 -44 120
4884 120 220 -93 63 -89 -22 303 -157 72 38 -270 -179 326 269 -51 -159 175 -198 70 -167 -176 193 67
4906 67 -196 63 -97 136 -16 -178 46 211 67 24 -94 51 377 -115 -6 -308 253 -49 -40 -250 -107
4927 -107 -116 211 64 -71 -110 34 -331 305 93 -34 35 -283 -144 -179 67 -49 -70 -20 -116 -180 37 -128 74
4950 74 -21 -49 83 95 -18 -110 96 -129 144 -31 -169 102 -152 79 163 -106 -258 138 227 41 -88 36
4972 36 -156 -268 113 100 64 -36 -23 279 -242 -33 -76 73 172 82 21 354 -45 -98 215 134 -361 -37 40 -102
4996 -102 87 93 96 -90 123 -281 362 -230 263 141 -249 27 139 128 31 -89 -215 -28 5 -139 -44 28 130
5019 130 90 104 7 -206 -69 -113 160 129 -128 -198 132 -109 -126 -345 38 288 127 -134 -154 7 124 -71 -375
5042 -375 66 -111 -118 -96 42 -30 146 -12 187 -80 -188 188 15 105 167 -129 77 -210 -131 152 -94 -115 -166
5065 -166 -291 110 -328 -95 221 26 147 -142 124 79 32 195 -111 79 -210 -15 146 -99 90 22 -58
5086 -58 -231 -404 15 282 -15 137 136 -76 -37 44 12 48 64 -259 201 -183 305 -52 -163 -220 98 -13 -2
5109 -2 189 36 23 6 -49 -245 232 187 258 -75 -246 -43 -247 52 58 132 -51 -58 -32 -63 -9 -47 -119 -192 81 -236
5135 -236 -16 -28 23 405 -96 -220 -161 141 218 124 286 160 13 -39 224 -50 -320 4 156 87 113 165 -149
5158 -149 -145 -58 -40 241 47 80 44 -107 238 -9 -202 -90 20 -40 -137 73 225 -214 -53 -256 -9 -197 -86
5181 -86 -302 -260 -408 -71 -223 -133 39 -192 1 94 231 -237 279 8 46 -242 -108 77 -57 -51 -1 59 146
5204 146 120 -324 -63 30 193 -12 19 148 -136 82 -201 138 -30 -53 -181 92 170 69 -89 -89 -33 -157 -74
5227 -74 -314 -100 -92 16 28 8 276 -248 223 216 27 -101 -262 -314 250 -50 -164 -198 -4 203 97 -151 -32
5250 -32 29 345 440 75 -135 182 248 -125 113 176 65 93 -30 121 65 -6 -226 -148 33 154 -144 -193 77
5273 77 -198 -75 -66 -71 226 -125 -16 -312 -218 46 110 -79 -48 -135 -34 -16 -177 134 -67 13 186 33 -9 -241
5297 -241 -95 -53 -23 -195 -106 -148 -158 67 -101 325 -236 83 149 161 244 138 130 -19 -108 98 -166 -16 -84 -207
5321 -207 116 85 -205 -1 -276 106 -154 -64 309 -7 -54 -378 -145 -13 -19 4 59 -42 -179 85 -227 87
5343 87 -248 -419 -196 92 1 190 17 38 -62 -273 -23 -304 -156 6 1 -301 3 -317 195 -7 -67 -28
5365 -28 168 53 7 -120 186 -17 -185 104 -30 -66 -202 -76 -63 80 -76 -167 273 -55 -177 -188 -204 -96
5387 -96 -16 10 -106 -36 171 -9 226 171 181 -66 77 -43 80 -114 -72 -294 54 30 -303 17 -91 382 218
5410 218 22 291 156 -56 -102 167 -183 -53 158 1 189 17 123 413 179 267 122 -26 -97 -154 -60 -162
5432 -162 165 12 -102 207 38 -42 42 -209 21 38 -33 -72 -179 -137 46 -62 -214 161 -38 -82 -142 -310 -16
5455 -16 -300 21 -10 6 9 -31 -14 -85 -25 3 233 24 168 -47 -178 -178 96 8 -118 65 151 40 71 61 128 22
5481 22 -260 197 -69 107 -141 -124 -193 58 24 -371 85 139 38 -10 175 44 -37 -145 35 287 174 134 83
5504 83 100 -88 51 43 62 169 329 95 -14 -150 -117 -13 211 -27 -183 -249 -106 166 -170 93 54 -162 4
5527 4 16 -23 90 149 179 -125 115 153 -225 85 -15 72 14 -90 -51 172 254 141 -244 -96 56 -39 -216 546
5551 546 71 132 196 -237 262 15 -127 198 348 -59 -122 -201 136 49 65 -77 -93 211 -15 309 -403 61
5573 61 15 -68 153 22 -182 328 -121 57 -68 -159 -147 201 44 -3 -39 -4 8 54 109 208 81 120 137 -93 118
5598 118 -49 -36 59 -21 26 -73 150 130 -95 21 402 -28 64 -316 65 -48 44 -15 104 132 284 83 -211
5621 -211 -50 -34 -174 -268 13 186 -238 56 9 -83 -133 57 338 -35 -1 92 78 -138 -148 -280 140 74 -136
5644 -136 -57 -433 39 135 155 175 61 -161 -302 -208 132 122 93 99 -49 299 141 379 30 50 167 274 190 202
5668 202 167 254 -168 99 -24 259 183 67 -64 155 -106 -25 71 49 18 213 -37 123 -68 26 157 -53 75
5691 75 -280 -133 -265 -49 -72 12 -199 164 246 -224 91 53 150 241 99 12 -51 146 -156 129 -58 138 4
5714 4 232 261 -186 97 291 -293 322 66 -214 -10 223 -282 202 -173 -34 195 -406 -124 137 -124 -208
5735 -208 -38 -312 -346 109 -20 -128 -21 -14 -7 -125 -48 -110 260 -114 35 -58 -30 -426 -64 -313 283 19 34
5758 34 157 166 9 -166 -55 -326 -235 165 -67 -128 -38 64 64 197 293 14 127 -9 -59 195 -171 -137 -72 -297
5782 -297 -1 31 104 52 125 101 36 -32 224 67 -37 194 113 -79 -4 -117 -36 23 -9 121 443 125 -223 20
5806 20 3 -129 71 24 176 -23 176 -25 153 6 -168 77 138 -92 -315 162 -38 43 -189 -11 192 32
5828 32 195 17 -27 68 -159 -14 -189 -84 -74 99 146 -201 76 -43 165 -111 -4 257 -136 313 115 -6
5850 -6 -93 -23 -34 -14 -472 236 -140 -218 69 84 -30 -125 -214 -132 324 -216 -44 -187 -226 -72 152 -37 235 -26
5874 -26 141 -337 -4 -17 -130 -172 -166 244 -47 -124 -260 -145 10 -40 -47 -80 369 94 194 15 -114 93 -103
5897 -103 217 -50 93 90 150 260 -57 51 61 21 -59 -154 -25 -131 45 122 -66 152 -205 -46 142 220 362
5920 362 -288 23 228 55 186 227 106 -67 77 243 -84 -71 -35 80 287 211 129 -24 44 107 42 35 -260
5943 -260 -170 -81 -13 -339 175 6 202 -44 -84 77 47 -159 -85 -161 -240 31 10 149 -129 -72 -6 41 -23 29 -10
5968 -10 -35 119 229 -47 121 31 -34 -119 180 -234 -8 295 163 188 -29 -54 -84 -118 -212 -218 175 0 154 211
5992 211 42 -44 -70 65 -153 28 -19 -16 -133 -370 -6 -34 -14 -105 -36 16 43 188 -130 -171 70 87 -35 -129 -3
6017 -3 245 0 -36 229 -86 -89 15 -50 -135 -187 -373 -104 128 108 -11 73 255 0 155 304 -81 73 27 32
6041 32 -66 -93 240 114 -193 137 -40 -226 27 47 -182 80 -302 -161 -30 48 -22 -9 -96 169 -113 91 -50
6064 -50 -274 -49 105 83 -180 154 -112 91 206 193 -31 11 17 175 -210 -182 11 104 26 -7 354 126 96 5
6088 5 4 60 -15 132 -193 -181 -143 -81 256 109 1 -93 29 25 -266 103 168 69 203 82 185 -177 42 55 -81
6113 -81 -96 144 163 -223 -66 -198 28 -38 -105 -3 -5 161 79 -303 -79 28 -145 -85 99 -276 14 86 -152
6136 -152 63 -53 141 -157 62 189 -28 10 10 344 44 62 47 76 -90 144 10 54 -43 -301 89 -268 277
6159 277 -68 -87 48 -282 -31 36 61 -214 117 9 222 146 -117 25 288 -30 9 151 -320 157 -77 141
6181 141 62 -26 -123 154 56 112 68 -123 -105 -18 232 -32 460 88 -246 281 147 -103 137 -2 155 -208 113
6204 113 -61 240 20 265 27 64 -31 74 11 46 27 -77 -38 -280 0 108 -178 149 34 -87 52 -226
6226 -226 -174 150 -193 367 30 8 99 10 35 -17 -147 154 36 212 -22 44 -32 10 268 66 -150 -337 -379
6249 -379 39 182 -272 -29 -79 -81 42 -24 250 -62 174 -31 -182 191 36 222 132 -236 -120 -17 462 157
6271 157 -22 267 122 -87 157 51 -219 80 -131 -20 -309 147 103 -17 -106 -341 -100 -100 9 -166 62
6292 62 104 -60 37 -6 359 332 -28 329 49 -38 -140 -95 89 -262 120 0 247 41 -168 -107 106 389 144
6315 144 110 299 102 -20 -86 339 -36 46 -49 91 -58 -73 90 -120 -76 -287 140 51 205 301 -8 -24 -63
6338 -63 108 -217 117 -293 -2 -131 -102 53 129 17 32 75 -30 64 -286 -133 107 -154 71 -36 -226 -33
6360 -33 -371 31 121 64 -17 -68 32 209 102 74 35 281 525 83 106 -65 -185 -261 16 -217 -22 -115 140
6383 140 -265 -190 -116 111 7 5 98 -131 219 35 130 128 70 -283 -330 -176 -318 -114 94 -154 41 313 -208
6406 -208 -3 280 -156 28 112 26 76 -268 -70 -138 282 159 -61 4 -94 -97 -135 7 -57 -114 -371 203 164 132
6430 132 -55 -16 303 15 8 349 116 223 -100 47 -22 -210 94 57 112 -58 -127 -412 202 -215 211 -118
6452 -118 160 -78 -105 -235 133 -73 -269 45 91 129 -23 -247 158 -192 112 24 201 147 253 361 28 47
6474 47 48 -27 -118 143 17 -35 -7 106 -29 8 -174 94 -114 88 111 -17 88 -91 255 -103 -159 -79 -169 4
6498 4 -126 66 -7 166 -199 -32 -55 -6 -103 207 -164 -209 139 -185 40 145 -111 6 -29 -174 44 -72 117
6521 117 -18 -155 104 -149 -17 -114 46 142 -3 118 -226 -117 37 107 -124 -243 -6 -90 62 42 112 -270
6543 -270 -70 -47 33 130 62 99 51 121 -82 141 183 34 -293 285 -7 -75 -203 18 55 -1 30 40 -186 94
6567 94 36 249 101 14 46 30 11 87 -106 -137 193 -5 -107 -1 -39 26 99 143 120 213 267 100 14 -67 106 -130
6593 -130 -6 74 103 -197 82 22 88 178 -126 221 -121 15 -67 86 -240 -209 -23 -65 -122 166 -168 265 -221
6616 -221 -95 -225 110 -197 83 -54 -89 -73 -258 -386 -39 -108 -28 0 -23 13 -111 123 -197 -195 -79 -80 -221 10
6640 10 -58 -292 10 77 -102 -129 -83 -72 94 -222 -36 63 -4 75 -126 385 -254 113 -221 128 139 -273 38
6663 38 -95 74 -132 71 -134 -92 -416 48 300 -152 128 324 9 -35 215 83 127 6 106 -108 -16 -195
6685 -195 -167 51 179 -36 -188 -199 31 -28 -147 129 -36 58 -152 -98 -89 176 106 -227 -55 161 10 37 39 -16
6709 -16 -10 22 -90 -217 -258 -44 119 -217 -153 205 -133 -295 303 112 -38 -161 155 61 98 129 -199 1 186
6732 186 -113 -38 151 -145 141 146 -87 -18 54 250 235 -268 25 1 21 337 16 14 -10 116 43 -83 79 -100
6756 -100 52 -40 -186 -17 117 -91 -24 -53 -125 70 106 -336 -19 134 -86 -323 -230 -54 -122 -127 -212 -78 -97 -45
6780 -45 150 185 132 187 190 130 95 -1 -84 -126 -73 -95 119 -105 308 -187 -144 -2 -306 198 341 116 93 60 126 -64
6806 -64 44 25 17 -279 12 74 257 -115 -75 190 70 131 86 49 -9 80 -139 -22 -70 114 6 117 -133 50
6830 50 -53 -353 247 -68 174 -120 157 171 80 -150 -14 274 23 -133 -140 -85 148 -232 181 -259 -95 167
6852 167 -78 180 23 281 173 98 -1 -2 -83 203 100 -99 102 -88 -129 -34 37 -38 123 137 145 97 -96 102
6876 102 -60 124 -40 137 -91 -157 -129 30 -210 -39 206 -162 10 -190 255 -95 180 -29 -115 66 110
6897 110 -179 -243 -271 -186 -9 -98 80 -68 -87 -73 -84 -162 25 37 131 145 -227 -47 208 125 -355 -37 24 179
6921 179 -23 -99 -153 232 -63 54 -208 -33 205 14 130 -73 -215 -95 85 54 213 129 -39 161 -348
6942 -348 280 -18 31 89 233 116 167 -196 -9 265 174 -117 -70 200 -79 167 123 -344 41 -384 119 -28
6964 -28 282 -226 -113 48 54 78 -166 291 -112 89 -18 -68 84 -69 64 236 -39 -58 14 24 -319 -60 91
6987 91 136 -88 161 -27 -61 135 17 221 62 72 265 20 -98 -108 188 -89 -104 30 -157 -68 -56 -103 -144
7010 -144 50 -14 126 -118 -96 12 494 -1 2 86 -112 167 65 1 -32 165 83 74 160 -123 -34 -242 204 63
7034 63 -379 45 -36 -118 -178 200 121 72 -86 9 29 193 60 -110 -191 140 74 -136 203 309 82 212 -111
7057 -111 93 111 -47 155 -101 389 100 64 3 -238 -215 -274 -156 124 -144 306 54 163 -23 128 -91 -9
7079 -9 -11 84 -281 17 87 -119 98 -279 218 -234 41 -141 19 36 -185 96 -157 318 51 243 -80 -118 158
7102 158 133 12 -63 -177 166 125 150 138 -159 4 -52 230 136 65 -175 0 -128 112 -98 -44 130 -131 -30
7125 -30 123 -319 7 185 160 126 224 -108 8 -191 -212 -198 -33 -125 -105 -277 -111 -31 98 76 -78 -27 351 -17
7149 -17 -4 5 -69 287 70 -120 -77 124 69 107 -226 229 -30 65 54 -211 -332 186 -343 53 -165 110 98 -179
7173 -179 91 32 113 -136 -145 -13 -137 -108 13 -8 -376 -249 -211 376 -105 317 392 11 455 -120 -7 -46 -5
7196 -5 61 -12 4 267 122 140 201 123 -19 63 -76 6 101 154 27 234 186 -169 -49 -45 -92 102 -302 99 -184
7221 -184 -164 90 -43 151 -83 78 160 -387 126 142 100 193 136 -299 -191 -258 56 -70 -126 372 -111 52 5
7244 5 -285 -134 173 100 124 146 84 64 -162 68 -110 -5 236 201 -171 19 29 -63 163 44 -215 -109 -167 66
7268 66 -62 163 102 229 -94 -158 91 -36 -137 42 -2 -105 11 12 -72 156 87 -346 -1 -21 -321 121 31
7291 31 -188 143 -235 18 -1 -158 -263 -88 -119 80 -7 -213 4 94 205 -270 106 -69 26 -71 50 -43 14
7314 14 -118 19 227 99 41 -35 -103 113 -118 199 6 217 50 -4 -177 -53 266 26 108 -33 323 32
7336 32 20 145 145 55 -51 8 -12 169 -122 -120 65 194 -72 -223 181 57 -99 65 -12 97 98 203 -1 197
7360 197 -149 31 4 -153 -109 96 -197 51 113 107 157 -149 296 -22 -90 182 15 118 -54 -70 21 109 103 -138
7384 -138 -201 -68 -67 241 116 53 112 135 -183 309 -47 106 221 -302 169 75 104 75 -110 342 -126 -53 246
7407 246 279 169 -83 71 -134 -172 108 -231 -73 107 159 -212 40 -14 -300 48 -15 -66 -30 -205 109 -54
7429 -54 -91 -189 -14 41 38 -48 81 46 147 -42 5 -169 141 186 78 140 -5 135 124 -101 112 140 77 -82 -137
7454 -137 9 66 -62 -110 221 -214 25 25 42 86 46 -181 158 148 113 22 341 -21 -397 240 67 74 -114 102
7478 102 -40 168 3 131 -171 18 -3 386 81 -7 32 123 -94 79 122 -55 99 -211 61 94 -112 68
7500 68 -8 -253 -154 -294 -322 -105 350 -79 -1 -44 -147 92 461 105 43 65 -187 -435 128 210 -136 -111 -43 -24
7524 -24 124 143 -40 -19 -174 33 -342 23 121 47 -48 -114 -19 80 -50 -150 206 71 -281 -81 -246 -230 -211 76
7548 76 217 -35 -298 -141 43 72 16 237 -77 -29 -154 -272 -154 63 -37 -115 -159 -22 -74 115 -28 239
7570 239 195 200 -24 8 -24 -478 -18 -157 67 22 58 2 -66 353 -17 144 190 59 154 -202 4 -32 46 117 151
7595 151 72 -172 -32 -4 137 -92 -66 54 101 16 -229 22 -145 19 73 -265 219 127 -125 -118 -61 -77 -219 -46
7619 -46 -59 -18 -296 -239 273 39 -134 315 -134 115 2 173 -173 -214 -170 -26 -69 85 -213 -32 372 -71
7641 -71 277 230 -71 25 93 79 154 -50 -31 38 -112 -45 -63 114 93 12 -289 -11 178 -191 -211 -193 17 -204 117
7666 117 154 40 -56 -136 -32 -144 -208 3 10 -262 -13 -165 -117 -199 -49 -34 -184 -68 27 -132 -220 -79 2 -83
7690 -83 -107 7 -57 -245 184 39 -36 26 -2 55 -87 -54 -143 48 -155 141 165 -104 222 -19 -160 -105 -91 31
7714 31 -91 -48 140 -48 59 17 -99 -7 178 -320 138 285 -75 76 -191 -16 -76 305 300 -48 78 10 -1
7737 -1 335 33 155 -92 175 -84 8 24 -253 -16 173 37 -127 -38 -2 56 -231 76 -161 -108 124 168 201
7760 201 -25 -54 -100 69 109 36 -120 338 158 96 109 174 -13 -20 201 178 18 -89 285 -323 56 33 -190 237
7784 237 -31 211 -93 20 3 -19 209 -116 -293 220 93 -51 120 -98 -91 -163 -112 -198 -23 -238 108 117 -156
7807 -156 92 -93 154 27 -108 146 129 99 -139 -137 -113 325 234 50 -85 17 -84 -52 -6 194 18 -152 -276
7830 -276 -80 170 -177 -17 -150 125 -51 119 291 -93 40 -147 42 -217 136 131 241 -81 -90 6 152 155
7852 155 -319 -248 213 59 -142 17 -175 197 -212 178 35 -24 221 51 -25 200 -197 -127 -32 -184 -49 64
7874 64 13 128 45 98 240 224 137 81 -44 13 -192 -32 2 55 4 -29 -91 -89 -156 7 320 202 60 -9 31 317
7900 317 -169 83 70 -9 26 108 292 -160 -4 -68 -108 115 -112 -71 -147 -75 -102 -27 175 -116 -50 5 23 -51 -65
7925 -65 -150 -136 -59 63 298 -23 -228 54 75 -114 -38 -55 -79 134 199 -139 136 -50 210 -26 121 -81 -38
7948 -38 -78 -232 -164 -33 -46 129 225 44 -115 -83 14 180 -52 179 110 -214 -242 160 -135 -69 -106 -474 -2 54
7972 54 237 -242 -21 -127 141 234 57 -14 122 462 -167 -79 0 -114 -89 -277 54 147 -70 65 -58 124
7994 124 -103 211 76 -243 -278 19 -107 149 -298 289 -12 -294 -46 -187 75 -5 -85 -27 -359 77 -132
8015 -132 98 245 -146 55 -136 -96 60 1 76 62 -148 -124 -167 -50 -273 203 -75 63 14 177 45 157
8037 157 124 -249 -224 -113 -29 27 175 25 -46 -111 121 -285 76 -302 -23 -145 -140 215 -48 -74 -45 -49 -104 -290
8061 -290 -144 -177 -218 114 176 -50 -33 -9 -52 206 159 -23 -60 -150 -17 -66 -329 -137 106 -107 -324 177 149 52
8085 52 178 39 -145 68 87 -329 77 -81 -126 -17 297 -284 -29 184 -17 18 -116 -76 73 87 -23 -149
8107 -149 140 -13 -23 113 104 370 -57 113 -373 10 84 284 87 -43 -23 -169 -15 136 -1 139 98 -93
8129 -93 -250 -38 79 3 68 -228 121 -84 -117 -153 -161 366 -8 -113 126 -109 -135 138 2 155 -83 -434 -6
8152 -6 272 -18 279 -138 75 188 129 92 -102 183 -59 -218 283 566 71 -82 -262 -104 61 -43 -231
8173 -231 -11 145 29 -89 -11 53 -55 152 -35 191 31 -166 86 36 -192 209 75 38
8191C8
$$ Imaginary data points
##PAGE= N=2
##DATA TABLE= (X++(I..I)), XYDATA
0 0 0 0 0 0 0 0 0 -8 8 -8 8 -16 16 -16 24 -29 32 -40 48 -56 64 -77 88 -102 118 -134 153 -173 197 -223 251
31 251 -281 317 -353 394 -440 488 -542 601 -666 738 -817 906 -1001 1111 -1232 1370 -1527
48 -1527 1706 -1915 2162 -2462 2830 -3295 3905 -4747 5991 -8010 11869 -21930 104473 224952
62 224952 14743 -98917 -68533 46692 53415 -292 -30886 16863 56211 63329 44541 25775
74 25775 -23763 -65096 -44518 37277 72819 20682 -42431 -19522 44786 39545 -54753 -115952
86 -115952 -65828 30780 60766 22839 -9418 -10723 -18955 -41170 -42857 -10316 15024 6448 -8400
99 -8400 5319 21548 2384 -31513 -27845 4963 15073 -4312 -3442 37198 65768 36456 -20999
112 -20999 -41592 -14489 13414 17995 19896 27374 21575 -189 -9845 -863 441 -16722 -20491 13822
126 13822 50121 30551 -30329 -54139 -11743 30516 7060 -49188 -60203 -10173 37481 33279
138 33279 -4636 -32596 -38122 -31753 -12910 15390 24354 -1144 -26551 -13910 15287 8590 -32269
151 -32269 -46908 -3808 45007 35463 -14155 -29474 6740 35198 16350 -18806 -23214 759
163 759 17539 15843 12315 12761 1850 -19364 -23791 -1143 20089 16328 3317 4674 12172 2967
177 2967 -17783 -21714 -915 16633 5987 -14515 -13288 4720 11142 5 -8454 -5530 -2785
190 -2785 -5676 -2592 12478 23335 11868 -11574 -18181 -6198 3181 1889 3654 13586 17282 5995
204 5995 -7598 -6525 6847 14482 9419 2941 3628 4674 2590 4119 8624 5958 -6648 -13561 -4422
219 -4422 11897 15602 4819 -1153 4892 6407 -7944 -20360 -8582 15318 21564 2400 -19554
232 -19554 -20799 -4466 8113 6848 -1407 -6909 -8992 -3505 8799 14447 2850 -14873 -17278 -1872
246 -1872 9816 2953 -10039 -7444 8800 13993 -1627 -17526 -14008 4105 16540 14579 3462
259 3462 -7123 -11932 -8644 1150 10560 8319 -7509 -17343 -8454 8919 14308 3707 -8031 -10390
273 -10390 -5321 -599 595 2801 3285 -1828 -9164 -9568 -6068 -4747 -5907 -1924 4739 5364 -2798 -11054
289 -11054 -8782 1587 6551 789 -5959 -5768 -3245 -2497 -910 2659 4780 415 -7534 -9136 307
304 307 12353 15706 8520 -1920 -8524 -7953 1577 13021 14087 2808 -8760 -7674 5269 14063
318 14063 8206 -3644 -4618 4804 10832 5733 -1840 -2970 2750 6804 3568 -4124 -8820 -6972 2130
333 2130 11950 12561 552 -13720 -13676 507 13788 13003 746 -9196 -8864 -1578 3754 4241 2550
348 2550 -684 -4186 -3842 2073 7474 7358 3240 -131 -37 876 154 -159 3708 7757 5269 -1905 -5147
365 -5147 -2790 1365 4282 5062 4504 2608 -1681 -5197 -3009 2754 5011 1063 -4521 -8067 -7685 -3240
381 -3240 2721 5286 795 -8015 -13648 -8692 3209 9818 3751 -6929 -11481 -8173 -2542 1007 -748
396 -748 -2990 -3304 -2980 -2742 -1856 -564 -351 731 2220 1350 -2844 -5801 -2223 3620 7009 2575 -4914
413 -4914 -8594 -4295 2643 6204 6645 2798 -2714 -6445 -3978 1897 6492 5407 -858 -6583 -6591 -2306
429 -2306 1741 3374 2632 -1368 -5435 -4935 -467 4528 5573 2078 -2987 -4449 -2294 -858 590 1894
445 1894 2765 1046 -1051 -2069 -1607 1452 4042 5780 5393 2149 -2329 -3554 828 7655 9013 3068
461 3068 -4049 -5742 -807 6887 10570 7264 702 -3960 -3422 2374 8125 8189 3063 -2474 -3363 -1353
477 -1353 1115 2561 2271 742 814 -745 -2138 -658 1103 2269 2288 521 -2128 -4976 -4468 -977 2405
494 2405 3549 183 -5275 -7692 -4048 1768 5496 5191 -106 -6073 -7032 -2207 3529 6053 2652 -3686
510 -3686 -7243 -4508 1166 4818 4242 763 -2839 -3208 -840 2018 2822 1647 -16 -1898 -2016 -2396
526 -2396 -3072 -2312 561 2553 510 -3672 -7139 -5588 97 4491 3098 -2241 -7373 -8701 -4732 1774
542 1774 4256 327 -5999 -8654 -5755 585 4091 2627 -530 -2867 -3205 -2423 281 3092 3942 1904
558 1904 -927 -2880 -2280 1737 4525 4801 3205 1277 -63 312 2173 4053 4764 3972 1551 -1181
574 -1181 -1604 -421 2258 4234 4485 1492 -3574 -5146 -1566 4223 7420 4062 -3115 -7745 -4898 1393
590 1393 5541 4001 -1386 -5289 -4750 -472 2697 3768 2387 422 -1346 -369 1096 2186 2747 2403
606 2403 2158 1936 1061 -1150 -833 3015 7039 6804 1894 -2794 -2914 1508 6149 6596 3103 -1517 -4540
623 -4540 -4045 -299 4619 4981 -98 -5971 -7444 -3061 2616 3561 -34 -3672 -4578 -4456 -3336 -1678
639 -1678 -133 -414 -2316 -4356 -5137 -2718 -696 12 -95 575 -172 -2534 -4218 -2421 1924 4549 2477
656 2477 -3300 -5709 -2845 1989 3911 3048 957 -1180 -3298 -2982 58 4433 5109 1317 -4689 -6873
672 -6873 -2541 1983 3587 1607 -2745 -5043 -4428 -1497 1708 2792 409 -3550 -4838 -1603 1297
687 1297 194 -2100 -2591 900 2557 -528 -5330 -4703 2695 8048 5773 -1844 -6618 -3973 3748 8656
703 8656 6448 348 -4226 -4229 561 6419 7547 2889 -2252 -2888 595 4751 5028 1643 -230 1385
719 1385 2553 29 -2236 -999 3119 5077 2028 -2515 -4046 -534 2902 3814 2896 297 -1601 -2442
735 -2442 -1120 1303 3211 2991 -9 -2843 -2917 -106 1681 2349 2882 1879 -939 -4074 -3161 1630 6575
752 6575 4863 -1850 -7397 -4877 1634 5377 2912 -1544 -3844 -2527 301 826 382 204 10 -612
768 -612 -971 -1709 -1990 -2047 -234 2141 1938 -1500 -5976 -5607 606 5638 4505 -2087 -6566 -5156 99
785 99 3204 2524 -610 -2873 -3936 -4035 -1691 1899 2799 183 -3671 -4762 -2417 671 1698 -107 -1567
802 -1567 -1770 -2387 -2847 -1894 -71 915 1067 -875 -2238 -2459 -1240 953 2187 3161 1255 -2319 -3699
819 -3699 -1104 2940 5217 3330 -854 -3133 -1718 1545 4345 4843 2549 -527 -2205 -990 1469
834 1469 3939 4228 1728 -2376 -2855 -840 2467 2814 2020 31 -824 -558 -276 -30 631 2144 1506 -341
852 -341 -1798 -2254 -883 1740 2678 2296 845 -1821 -3111 -1112 3310 5951 3823 -840 -3584 -2126
868 -2126 2275 5263 4427 1046 -1620 -2576 -658 3115 4976 2925 -822 -2256 -855 1410 1939 443
884 443 -609 183 385 -1780 -3200 -2170 -119 1579 1185 -2003 -4383 -3839 -1748 831 1824 637 -3085
901 -3085 -5512 -4227 -617 1912 1886 -736 -3400 -4610 -2475 491 2826 2387 -481 -3667 -3239 -275
917 -275 2289 2075 441 -1123 -1676 -1026 -416 171 749 1273 597 -805 -1901 -1984 -1058 1393 2093 513
935 513 -1979 -3673 -3239 -668 1843 1652 -515 -2274 -3233 -2759 88 2501 2499 193 -2840 -3942 -1732
952 -1732 2221 3796 2027 -677 -2150 -1660 1032 3250 3504 2081 157 -455 239 1735 2626 2148 2137
969 2137 2139 1203 -159 -709 862 2821 3856 2913 -165 -1910 -1211 923 3497 3739 1266 -3037 -4203
986 -4203 -1342 2161 4099 2097 -1615 -3415 -1883 91 1859 2168 607 -1082 -2136 -1299 144 1280
1002 1280 1406 1202 -58 -837 -1059 -482 1414 3238 2580 192 -1016 -1042 -3 1420 1992 1908 648 -881
1020 -881 -1467 -1828 277 2787 2808 675 -2685 -3789 -2329 1458 3330 1232 -2282 -5458 -4214 -986
1036 -986 2130 1479 -2060 -4187 -3491 -1439 -141 -387 -934 -1916 -1357 -1362 -2053 -1828 -1603 -323 875 629
1054 629 -1626 -3308 -2229 320 2705 3016 33 -2735 -3053 -23 2383 3480 1909 -590 -2777 -1494
1070 -1494 1342 2594 2798 1070 -1053 -1658 -802 620 1608 2204 855 -1346 -2292 -1671 175 1522 1326
1087 1326 -514 -1564 -1240 -803 -110 504 927 730 364 -656 -1422 -1347 644 2807 2968 1349 -1774 -2519
1105 -2519 -260 3704 5041 2854 -606 -2656 -753 3048 5118 3811 330 -1293 -599 1200 2893
1120 2893 2677 1798 240 99 310 382 545 601 1234 1520 91 -1703 -2223 -1366 431 1559 927 -1410
1138 -1410 -3391 -3103 -914 1004 1706 384 -2196 -3307 -2466 -583 1483 1872 47 -1809 -2697 -1172
1154 -1172 831 2305 2005 148 -1861 -2035 -268 1526 2248 1165 -517 -1008 -603 60 418 691 806
1171 806 114 -152 -830 -1806 -1459 -122 1384 882 -1282 -3589 -3969 -1714 1415 1713 -1154 -3822 -4401
1188 -4401 -2709 42 1630 512 -1765 -3210 -2744 -1073 916 1218 273 -867 -1372 -1209 146 1136
1204 1136 1709 1556 1038 -63 -525 387 1828 2639 2246 1788 396 29 175 1113 2205 3050 2249 430
1222 430 -1306 -1031 978 2843 3113 943 -1563 -2475 -836 1263 2757 2030 -892 -3185 -2185 32
1238 32 2103 2133 -276 -1900 -1454 -197 675 434 427 658 424 92 -235 -619 79 2063 2463 1306 -115
1257 -115 -947 -478 1292 2814 2714 1080 -1010 -1388 -132 2353 3214 1929 -31 -1301 -1325 -58 1718
1274 1718 1911 1231 -468 -2240 -2127 -550 1071 1250 -446 -2012 -2511 -1770 -378 21 -502 -648 -1111
1291 -1111 -1738 -2304 -1887 -631 113 -618 -830 -1828 -2325 -2042 -874 508 1253 -248 -2788 -3082 -1256 1699
1309 1699 2266 917 -1533 -2698 -1402 444 1634 1875 761 -1215 -2034 -864 1154 2178 1402 -169
1325 -169 -983 -269 234 -11 -75 656 972 214 -665 -1342 -529 648 1237 988 -30 -1072 -1821 -1318 508
1344 508 2354 1530 -524 -2241 -2123 398 2650 2293 399 -1277 -1472 -243 1045 1921 2109 775 -453
1361 -453 -677 259 1353 2178 1430 860 279 49 391 978 1430 1938 1854 1045 -508 -687 518 2077 2051
1380 2051 1116 -395 -806 -878 -55 941 1835 1506 -544 -2447 -2051 173 2092 1763 -577 -2577 -2117 -933
1398 -933 491 874 1114 -505 -1960 -2001 -806 739 881 -288 -1145 -529 -28 -503 -896 -384 978 1097
1416 1097 -458 -1318 -1496 -492 1175 1583 795 -335 -1794 -1931 -440 1475 1871 136 -1976 -2958 -1530
1433 -1530 929 1259 254 -1532 -2152 -1924 -1054 -43 235 -142 -1118 -2000 -2015 -707 -53 122 -287 -599
1451 -599 -833 -1221 -684 -303 429 938 906 -138 -1345 -973 229 1637 1961 662 -640 -1092 -682 1128
1469 1128 2365 2490 759 -1112 -1537 63 2158 2409 1655 12 -1326 -556 677 1378 1569 1127 -124
1486 -124 -608 -533 -106 924 1140 413 -123 -34 -40 -570 -144 880 1626 655 -331 -1382 -756 972 2192 1854
1506 1854 458 -341 -1229 -754 1268 2641 1513 -264 -1600 -1127 646 2209 2103 570 -566 -911
1522 -911 -131 368 946 978 56 -293 -797 -626 -200 309 -5 331 1 -1146 -1594 -1236 -197 496 328 -251
1542 -251 -1824 -2182 -1297 26 1097 996 -900 -2545 -2305 -549 834 1318 183 -1596 -2064 -1254 141
1559 141 948 1089 167 -1229 -890 -789 200 652 611 -147 -737 -885 -878 -649 120 429 249 -550 -1121 -1131 -847
1580 -847 27 695 631 -101 -1604 -1974 -606 604 1441 571 -467 -1565 -1726 -226 1473 1895 531 -1057
1598 -1057 -1633 -431 1316 2186 894 21 -442 -219 492 1122 1214 1148 680 277 259 426 781 1056 1380 1648
1618 1648 934 -423 -951 -116 1398 1617 1390 -23 -1388 -1097 93 1482 1683 698 -721 -1815 -337
1635 -337 352 1311 1138 125 -990 -915 -297 409 1128 916 -215 -662 -315 -163 707 1108 862 297 -203
1654 -203 -279 -157 229 1075 980 600 13 -721 -448 -249 587 1619 916 -400 -1698 -1863 -197 1110 1303
1673 1303 -135 -1854 -2293 -1216 566 1108 268 -1314 -1926 -1733 -815 518 142 -846 -1212 -1489 -939 -901
1691 -901 -681 -372 -10 83 -586 -1483 -968 -387 256 1071 274 -999 -1728 -1195 65 1141 1765 398 -1155
1710 -1155 -1662 -449 719 1351 1161 -63 -1057 -1436 -180 1070 1193 782 -532 -1011 -544 384 910 995
1728 995 671 -381 -515 -597 114 491 675 353 53 -19 -196 -459 116 860 1666 905 -383 -861 -501 1050
1748 1050 1747 1659 934 -715 -1069 -231 1916 2652 1592 141 -813 -406 866 1904 1661 648 88 -293
1766 -293 -228 773 1148 571 370 328 -196 -301 -126 111 665 731 193 -854 -1170 -951 60 824 893 -344
1786 -344 -1321 -1596 -668 576 1208 511 -1027 -1759 -1222 -451 634 599 371 -967 -1555 -808 -197 558 579
1805 579 -16 -1319 -1275 -632 178 216 337 6 -492 -530 -517 -503 -126 361 104 -352 -733 -1299 -1150 108 784
1826 784 652 -494 -1687 -1718 -598 756 1121 129 -1047 -1863 -1316 -36 1096 773 -490 -1189 -1449 -568
1844 -568 569 716 204 -304 -462 -452 -169 -145 545 786 569 -7 -110 -271 166 562 1168 908 605 -858
1864 -858 -774 227 1304 1831 1131 87 -850 -533 393 1608 1637 626 -938 -866 43 858 1545 1220 265
1883 265 -740 -631 -60 593 1140 938 -119 -305 -226 9 353 714 422 674 -32 -276 -544 -77 813 936
1903 936 830 -227 -879 -1173 13 1244 1600 654 -608 -1427 -991 389 1366 1179 -18 -901 -970 -476
1921 -476 400 877 237 -678 -1189 -1319 -507 359 274 -38 -497 -915 -780 -568 -325 -85 -139 -125 -511 -1197 -1067
1942 -1067 -519 333 559 287 -898 -1541 -833 -121 721 898 -290 -1273 -1604 -501 564 942 705 -733
1960 -733 -1637 -1290 -12 528 582 305 -537 -916 -416 -10 278 721 607 -218 -173 -327 -337 -113 562 533 646
1981 646 -522 -493 -607 507 976 1095 345 -469 -573 -377 1069 1196 704 247 -491 -424 61 1072 1734
2000 1734 1049 -192 -807 -494 452 1193 978 459 -57 -73 123 340 704 773 350 127 173 64 233 344
2020 344 442 893 632 306 -961 -267 594 1349 980 -17 -1002 -1160 -2 646 1099 1092 -397 -1008 -936 -24
2040 -24 822 1230 455 -733 -971 -131 25 513 293 -49 -464 -619 -520 -208 99 100 254 -300 -649 -680 -566
2061 -566 0 451 209 -333 -885 -925 -783 -14 398 -83 -641 -1359 -1272 -509 341 639 -52 -809 -1491 -1050 101
2082 101 620 296 -334 -1188 -1111 -574 217 439 259 31 -325 -568 -278 -28 57 145 640 119 -509 -688 -71
2103 -71 212 712 666 117 -727 -895 -50 1145 1346 458 -464 -1117 -295 514 732 854 525 -464 -535 -131 615
2124 615 955 953 82 -515 -101 194 680 601 320 283 -277 95 -113 256 1206 711 541 244 140 -26 59 834
2146 834 1016 926 270 -432 -693 248 1372 1308 512 -320 -708 -374 549 1068 880 -275 -629 -892 -31 583
2166 583 847 305 -314 -861 -360 37 -1 308 -148 -6 -244 -792 -337 -462 43 188 48 -681 -1155 -1118 -370
2187 -370 126 396 -83 -957 -1456 -650 -1 488 323 -435 -771 -1213 -577 -26 517 417 -614 -1051 -688 -301
2207 -301 176 658 206 -766 -925 -589 -203 7 71 281 -386 -326 -325 -374 -153 281 235 128 -520 -891 -756 -443
2229 -443 648 808 61 -782 -966 -385 671 893 850 -299 -720 -567 152 662 996 417 -61 -404 -211
2248 -211 484 634 454 263 162 42 111 331 473 740 599 441 61 -169 82 386 1067 746 429 -350
2268 -350 -600 83 719 1069 1046 216 -604 -652 110 1000 943 811 -206 -788 -649 216 707 810 -52 -321 -530
2289 -530 -308 -44 307 368 120 -225 -581 -236 -44 -90 420 110 -131 -231 -646 -407 315 604 331 -310 -850
2310 -850 -825 -268 138 486 500 -564 -1258 -984 -209 327 633 -86 -795 -1092 -772 -246 426 180 -136 -705
2330 -705 -787 -344 130 55 -394 -539 -232 -710 -538 -216 -231 155 19 24 -732 -808 -425 98 729 341 -219 -938
2352 -938 -682 -85 560 871 -117 -568 -729 -492 496 977 533 115 -386 -721 -74 418 548 432 69 -491
2372 -491 -431 -261 339 401 494 418 -20 -316 -132 92 683 798 250 -125 -236 -482 16 704 747 428 190 -106
2394 -106 -60 268 636 1002 481 -255 -359 12 430 1210 709 2 -389 -69 331 598 762 583 -26 -104 246
2415 246 185 402 243 99 249 223 -79 -190 34 541 262 298 -301 -735 -667 -170 612 380 -29 -765 -968
2436 -968 -974 177 357 419 -229 -904 -982 -85 81 233 139 -283 -790 -680 -398 8 365 -1 -327 -449 -486 -421
2458 -421 -23 225 -129 -223 -244 -431 -354 -651 79 248 129 -271 -605 -716 -297 807 449 -709 -615 -972 -772
2479 -772 340 531 172 -742 -689 -863 -167 685 518 32 -299 -508 -531 -90 375 293 141 -65 -354 71 83
2500 83 400 303 607 258 -62 20 34 496 875 779 141 -308 -87 211 609 966 637 470 -351 -340 363 637
2522 637 1023 471 -241 -50 -104 325 343 615 371 -142 -45 -79 161 402 329 328 88 -520 -140 -53 226 540 344
2545 344 95 -304 -283 -365 321 911 668 84 -328 -491 -63 660 651 308 -366 -839 -754 -162 757 596 -8 -418
2567 -418 -481 -130 326 466 -6 -6 -596 -633 -606 -122 -6 22 -149 -116 -450 -820 -508 -252 113 161 -43 -522 -671
2590 -671 -392 53 401 -93 -357 -926 -839 -237 164 303 262 -602 -888 -720 336 552 192 -493 -794 -693
2610 -693 -296 28 33 135 -12 -383 37 -84 33 130 312 14 -36 -289 -186 52 596 410 522 147 -128
2631 -128 -281 282 708 931 442 -102 -552 0 607 596 881 584 49 -370 118 552 1058 633 -127 -347
2651 -347 -471 -182 427 425 201 150 -266 -234 -7 -290 325 313 144 392 -330 -105 -81 596 564 370 89 -433
2673 -433 -379 233 628 693 172 -231 -666 131 234 462 434 4 -386 -304 92 291 351 256 62 -242 -393 -140
2695 -140 410 61 -82 -479 -284 -210 -183 -107 49 125 -404 -388 -793 -775 -185 235 10 -493 -361 -661 -856 -375
2717 -375 -87 275 -385 -625 -1103 -848 135 399 334 -444 -702 -672 -244 109 92 22 -406 -429 -514 189 413 -21
2739 -21 56 259 -18 -169 -172 323 350 596 360 -105 -320 -211 116 688 489 220 -245 -201 -72 574 912 778
2761 778 -14 -521 -411 302 511 438 376 -251 -595 -92 196 320 319 213 -254 -381 125 179 651 249 365 -14
2783 -14 154 73 104 99 411 450 79 121 -4 27 516 860 380 586 -165 -109 56 856 859 260 -46 -433 -538 253
2807 253 218 363 151 -410 -168 -68 -6 140 214 -173 -150 -432 -314 -72 -165 124 94 -237 -358 -453 -157 -198 336
2830 336 12 -545 -745 -589 -229 -97 337 -38 -281 -570 -575 -347 308 340 -69 -631 -439 -356 -160 191 -72
2851 -72 126 -438 -79 65 -105 55 231 -70 -347 -291 -267 -134 -225 43 -74 42 -417 -75 -53 138 239 -2
2873 -2 -81 -384 -380 -221 412 661 571 -644 -335 -627 122 561 518 -35 -325 -379 -236 310 143 183 86 -108 -64
2896 -64 -19 538 409 239 265 -296 -114 227 236 310 207 346 295 262 -51 194 471 441 265 -7 120 -392 152
2919 152 571 506 190 -127 -153 -205 455 558 349 -2 -411 -62 86 296 342 165 -129 44 -409 61 113 -1
2941 -1 57 212 -149 -216 -323 -113 -214 295 78 57 -310 -416 -65 130 512 -329 -249 -590 -776 -107 309 264
2963 264 -338 -528 -633 -500 182 236 -14 -173 -298 -453 -8 135 -44 -63 -247 -306 -481 -81 118 -117 88
2984 88 -26 -349 -501 -518 -234 358 80 97 7 -398 -320 -54 569 149 -103 -387 -548 91 451 224 300 -415
3006 -415 -153 -337 -40 20 239 217 -124 -82 -105 72 86 568 301 21 -201 120 97 57 438 298 250 -118 -354
3029 -354 20 41 440 613 77 -6 -30 223 132 655 490 247 -243 -232 303 334 637 216 -490 128 -157 273
3051 273 422 351 85 -258 -378 -62 96 281 190 -58 90 7 -82 -28 70 -138 280 39 -163 -49 -242 57
3073 57 188 202 -289 -537 -405 191 454 326 -2 -507 -575 -477 7 438 126 -110 -431 -423 -235 -319 -116 -108 -230
3096 -230 27 -395 -505 112 183 114 -204 -44 -324 -758 -60 -20 -14 150 -156 -306 -552 -107 -3 89 -263 -277
3118 -277 -372 -485 -453 39 87 -128 -384 -357 -378 -62 370 163 -137 -155 -162 -304 129 262 28 162 -4 9 -40
3141 -40 181 174 206 174 -193 -112 57 199 207 332 282 -70 -214 -90 -13 488 584 315 -57 -283 -258 377 441 408 -107
3166 -107 213 76 -133 228 353 290 267 -154 -137 -14 354 191 262 -101 -244 192 157 115 383 378 99 69 187
3189 187 -26 315 232 270 162 -139 -224 -338 -15 314 340 -40 27 -597 -174 166 230 243 266 -226 -581 -87 -46
3212 -46 337 147 -87 -341 -520 -154 -264 -212 -215 -128 -177 -470 -294 -113 -178 -2 -124 -187 -388 -83 -148 143 37
3235 37 -51 -206 -639 -302 -327 271 379 38 -206 -452 21 106 262 260 -233 -395 -254 75 27 -1 -257 -296 -329
3258 -329 -38 -400 194 -28 37 49 -189 8 -15 110 266 123 10 3 -274 -209 134 144 150 -5 155 190 -42
3281 -42 -127 515 436 115 30 -329 337 250 447 346 -264 105 -2 306 658 275 354 150 -103 225 54 126
3303 126 269 438 -109 55 -97 107 293 168 458 -229 -188 -266 -150 -32 93 40 -18 -184 -149 78 -98 315
3325 315 51 -134 -207 -150 184 356 70 186 -69 -263 -7 -109 -50 40 165 -163 346 25 58 303 -320 95
3347 95 -245 -302 -312 -2 177 101 148 -180 -158 -472 5 208 -10 422 -212 -203 -810 -12 -335 298 48 19 -609
3370 -609 -316 164 54 83 -546 113 -61 -89 -215 211 102 -283 -287 -162 90 7 -172 80 112 -125 -49 -299
3392 -299 117 -151 179 302 329 -160 -253 219 293 456 324 137 -237 39 310 372 200 296 32 167 236 364
3414 364 157 249 272 96 -212 71 371 174 283 -49 66 145 115 38 14 118 225 -143 43 -16 173 179 384
3437 384 265 -49 -140 -7 67 285 123 -2 -27 -18 -94 -217 290 128 -53 -333 -34 423 318 275 -3 265
3459 265 12 -117 183 -4 -116 -196 -26 -114 -322 -230 -341 49 -176 -46 -204 -310 -567 -116 42 3 -284
3480 -284 -169 -508 -131 -460 29 28 -234 -408 -596 168 42 -11 117 -295 -361 12 71 111 -100 168 -148 62
3502 62 116 -143 -83 81 -278 -100 -81 -371 -309 -152 74 112 -65 -217 -315 -336 -12 138 -14 -99 -58 -424 -61
3525 -61 108 142 212 -76 -370 -65 66 215 362 12 -35 -76 134 356 11 259 52 79 38 -27 289 209 212 374
3549 374 203 195 55 157 95 327 319 272 -42 227 232 222 69 253 47 -8 -119 70 -151 464 9 -70 -14 -98
3573 -98 -11 106 235 67 28 99 27 -66 15 262 -194 -95 -184 -266 -17 -48 157 -99 140 -140 -215 -221 -248 133 207
3598 207 -151 -46 -87 -352 -14 262 -98 -16 -211 -503 -136 -38 71 2 -360 -274 248 -93 183 -164 31 -446
3620 -446 -480 -364 -455 -39 81 -287 -235 -109 -106 -229 -28 134 115 243 -97 45 -64 -126 141 235 -9 -138 -17
3643 -17 129 -44 -54 -49 -256 -323 255 113 -28 205 -281 75 142 -4 68 -78 -42 142 -21 -18 -2 96 331 142
3667 142 -159 36 -166 277 175 -51 494 3 298 -138 -128 187 345 144 -2 203 -65 42 -59 220
3687 220 357 29 392 80 183 61 170 39 88 292 -99 15 25 435 368 151 -305 -8 -209 6 -168
3708 -168 295 -131 -99 -38 -190 -161 145 160 43 -211 -578 -105 -295 21 67 -28 -492 -261 -246 34 74 -33 -56
3731 -56 -10 -197 -50 -61 140 354 -90 -133 -80 -156 290 -99 -20 -29 -81 -352 -105 270 -184 75 -95 -187 -379 -46
3755 -46 -243 -132 -250 -105 -22 -483 -171 -197 416 -365 -92 -112 -316 -162 -34 13 -144 -404 -25 272 -249 124
3777 124 179 -186 -116 -106 -54 415 -44 -105 -12 10 -28 -213 298 267 -23 261 150 -109 60 347 16 265 196
3800 196 -17 -11 -111 103 -86 -4 57 272 -161 -80 -84 327 163 55 -99 -121 -56 -117 247 29 265 160 -136
3823 -136 -120 209 70 143 -160 -108 -28 12 67 -205 42 150 86 214 -119 5 293 -30 361 199 -36 -29 69
3846 69 192 24 117 -224 -192 84 240 -143 90 -101 -144 -327 -303 128 -68 -172 -189 -465 -505 -198 -1 -218
3868 -218 68 65 43 7 -162 -245 -21 -109 -18 -102 -150 -165 157 63 11 44 -112 -324 -361 86 189 245 -130 -163 -193 17
3894 17 16 289 127 -38 -338 304 388 149 -28 -27 -118 121 -123 -301 56 -169 12 -249 41 90 -163 38 -126
3917 -126 -199 64 -332 245 -305 284 -34 197 28 -203 15 -66 -82 183 51 303 207 215 -86 321 290 228 243
3940 243 -285 148 237 204 436 115 -165 136 -8 88 -9 333 29 103 -112 91 -110 -180 193 113 256 -133
3962 -133 0 -117 -76 -45 180 68 -204 -292 -53 78 78 266 -109 -292 -292 -13 -65 -210 -230 -211 11 -37 -53 -118
3986 -118 71 -253 -144 -18 -230 -148 -21 -187 -59 68 -423 76 -285 -36 184 -14 -30 -350 -241 -110 43
4007 43 171 25 58 -358 -192 174 64 89 62 -71 -193 23 -205 -69 11 207 -228 387 35 -47 103 93
4029 93 203 -15 -118 -45 -164 18 258 -27 238 -366 225 -32 221 211 -165 300 83 125 -31 21 280 237
4051 237 -269 -10 31 -116 160 21 202 -108 300 -35 -263 -104 22 113 -101 -34 -83 11 -92 80 -294 20
4073 20 90 122 147 -25 183 49 81 194 -115 -82 350 126 216 -157 -145 -272 220 82 147 42 -75 -8 -242
4096 -242 119 23 41 8 62 -163 -229 171 331 147 154 -124 -307 -160 -1 -15 380 -5 -356 -67 -181 -94 -153
4119 -153 131 -6 -201 -340 -13 -180 136 -87 -248 -52 -281 82 -57 327 104 -109 24 138 61 70 81
4140 81 147 24 -184 119 -74 -91 -52 46 75 -17 -301 173 -40 34 -283 115 158 -90 -132 -393 24 -135 182
4163 182 -296 66 65 29 117 132 160 -59 -81 -15 -88 159 203 -67 -56 23 -12 -81 261 14 154 -186 244 -58 -110
4188 -110 44 -46 157 -234 145 -70 -201 2 8 89 49 48 -63 275 95 152 79 -229 -15 0 208 131 -84 13
4212 13 -43 -422 -10 160 213 -13 -249 -180 -113 -43 110 108 129 -121 177 86 -121 92 -22 150 296 -27 120
4235 120 126 6 -210 12 -286 141 -205 -179 252 96 -41 -58 -41 -384 -197 -186 99 -1 -227 -59 -160 -73
4257 -73 -26 -63 -90 128 -136 -287 202 -130 213 -212 -183 -358 -458 92 -209 -19 93 -286 -78 -314 106 -220
4279 -220 17 226 124 214 67 52 -47 289 271 93 -81 -163 49 -27 187 111 -135 -72 -73 -36 105 243 -150 17
4303 17 -360 -55 278 -45 -61 -53 213 169 97 206 -330 137 84 70 -102 57 188 -36 59 -8 54 236 2 180
4327 180 310 -79 53 88 7 121 -33 45 89 236 -102 105 227 92 228 -125 145 -84 24 -471 142
4348 142 -68 209 -304 -78 68 -199 68 -12 245 -257 -101 -139 53 1 -134 -296 35 -69 -19 -103 62 133
4370 133 -301 -155 -218 -180 77 -52 13 230 -106 80 2 5 62 244 -108 145 -399 -373 -62 -102 -152 -267 -146
4393 -146 131 -287 -184 -154 -198 -37 -341 -220 -19 -22 -69 163 -315 163 -21 174 -193 -69 -14 -25 -135 -233 -57
4416 -57 -3 -172 60 -3 121 -138 181 164 245 124 208 40 -41 11 159 -58 38 181 303 -195 31 144 -67
4439 -67 294 -37 219 292 -17 -28 -10 205 77 -4 -11 267 -106 -58 198 -52 38 -77 56 -75 121 364 51
4462 51 124 -184 280 306 39 -45 -72 -75 -7 -147 107 -78 -165 86 -42 -130 -178 -76 -73 -120 34 -143 102 -233 -173
4487 -173 445 358 89 -119 -90 7 131 246 -75 -2 71 26 -73 -96 -1 33 96 -62 -132 -12 -26 87 8 58 -2
4512 -2 -329 -202 79 -258 -312 313 11 -25 -65 -174 -283 -367 109 282 -60 -68 -218 -125 -69 -42 -146 -97 -26 28 22
4537 22 -118 84 -268 -167 -260 -22 5 -67 -340 93 41 45 -67 96 15 262 163 48 14 -97 113 135 107 112 -9
4562 -9 -187 -323 -167 152 -38 407 -201 143 2 70 163 -122 286 -186 142 -256 -35 349 -92 118 48 185
4584 185 224 -14 -42 -122 174 -122 -56 -74 16 -10 73 9 166 260 249 -3 293 281 197 131 53 63 -73 -54 132 122
4610 122 63 -233 5 -116 -307 -104 -129 -287 47 92 -206 136 -300 -594 -95 89 112 -272 -9 74 119 214
4632 214 -27 -11 43 160 -340 117 130 178 -413 -83 51 368 -267 -93 -28 -150 -391 107 82 20 297 155
4654 155 -328 -103 -83 -205 -54 -156 -424 -80 77 -34 5 23 -150 -120 82 144 216 152 -117 -233 26 -166
4676 -166 -72 27 -85 -226 -137 -30 35 -11 -175 -47 267 -31 -249 67 155 219 21 15 -112 72 -30 285 -36
4699 -36 159 21 219 63 140 27 -28 194 -8 234 -92 82 -65 193 -121 -1 -81 -65 6 -137 1 -83
4721 -83 11 6 -142 107 137 234 118 138 -102 -29 66 141 -82 101 0 -77 -17 -174 -26 132 159 -76 232 -223
4745 -223 84 117 -171 -355 -138 -76 43 69 205 230 185 171 -49 283 -97 270 22 143 -174 -99 -30 -346 193
4768 193 39 -13 -160 42 -3 127 -52 24 -287 -250 -273 250 340 -67 -278 -97 95 -146 -151 177 15 -92 153
4791 153 63 6 35 -138 -250 -296 -184 -395 23 -81 -296 -106 33 72 69 -133 7 -81 50 -5 71 -149 193
4814 193 99 -16 129 274 -234 -2 111 -130 309 195 57 231 86 65 177 -20 53 40 22 -129 102 40
4836 40 -77 123 397 297 51 -91 1 -162 5 197 49 -365 -243 102 155 314 -234 -22 334 23 237
4857 237 372 -6 200 212 -87 -23 58 -108 -197 -127 109 159 149 37 -37 128 197 -63 -58 45 -5 244 -60 365
4881 365 89 -62 -94 135 -199 -21 -79 -92 -110 -282 220 -219 377 -83 -289 -87 36 -199 20 112 -140 187
4903 187 -233 178 211 119 49 -3 -106 153 4 69 149 -110 69 73 -29 122 -268 120 188 155 208 70 19 165
4927 165 -112 66 13 -247 90 30 61 132 -65 -71 -39 65 -5 -65 -29 159 -4 -173 6 54 122 -187 -30 65
4951 65 95 -203 -65 86 164 161 136 157 167 211 202 129 -26 103 -196 54 147 45 0 241 101 -292 91 137 102
4976 102 224 -20 300 -102 34 -193 185 -21 -41 -178 -73 10 112 311 28 -42 -154 0 204 -209 69
4997 69 347 -62 12 -106 169 -30 -26 174 -42 -33 16 466 -76 35 510 12 113 -237 -138 97 120 -30 -180
5020 -180 66 245 46 195 -47 -135 -80 12 -18 -50 -194 -27 -26 90 320 -270 -116 229 -39 7 65 40 -8 -251
5044 -251 -215 13 -51 43 -132 110 -403 -93 238 189 183 -207 185 -139 -263 -209 102 -183 155 -180 -12 -104 85
5067 85 288 232 -191 -276 50 171 138 -20 -55 -35 -151 -185 29 1 -64 105 145 -299 212 34 -168 -60 462
5090 462 -118 -22 -27 -240 15 226 114 64 -93 56 -36 214 46 41 42 -22 118 155 110 -140 50 -119 -46 -72 32
5115 32 -110 115 -8 -221 243 95 22 176 68 -6 -48 -43 -186 -52 8 -93 77 185 50 170 38 245
5137 245 227 153 -4 115 -127 184 222 -56 82 -8 -202 -107 -94 -323 52 -230 -80 80 138 -121 1 -127
5159 -127 8 8 -271 -412 -23 -54 -77 33 -217 -98 -317 124 -346 -219 95 -185 -139 72 1 218 -65 97
5181 97 -3 -140 5 192 46 -7 133 -86 -210 -392 49 -151 50 355 -134 -131 -144 -16 -92 -214 -26 146
5203 146 -145 -84 240 80 -255 237 34 -52 11 169 244 257 254 -88 51 1 -191 -222 169 -44 -86 101 354
5226 354 201 -56 -34 -180 63 -25 106 -144 135 -28 -10 166 -37 165 153 111 -166 241 -25 121 41 28
5248 28 28 -18 -66 -275 41 34 28 -194 -64 216 69 15 93 -71 94 -38 189 214 -159 122 -84 109 104 -21 -182
5273 -182 -136 -16 -3 -238 -18 12 -172 128 202 148 -484 -140 -154 71 -461 -187 -77 -164 139 132 -148 -22 -86
5296 -86 20 19 -19 75 98 30 55 -27 -120 -363 55 67 -20 -102 27 -54 207 113 -85 -25 57 -14 150 -49 -133 -245
5322 -245 156 -61 150 68 -146 2 98 -101 227 191 -206 -23 3 -11 203 81 29 -9 40 241 147 230 62
5345 62 -70 252 35 186 -142 69 210 -156 13 35 -269 204 -128 -189 -56 -48 235 -20 134 271 271 -39
5367 -39 68 109 -91 393 -17 44 122 122 12 -3 -150 -46 -143 339 -29 -346 -57 177 98 36 80 -101 100 -44
5391 -44 -98 -93 116 32 208 84 60 -19 -61 -121 -148 -113 316 -117 -195 -214 -32 -15 37 4 -24 -95 -7 -6 -82 -143 430 49
5419 49 128 14 -154 -46 -78 -80 -186 -253 166 127 -65 -9 20 -43 17 119 136 -16 136 331 119 -47 -159 207
5443 207 -51 200 -14 -109 -11 262 -139 6 174 -239 0 -63 372 -149 212 -94 170 115 83 -227 -93 -197
5465 -197 23 119 157 -94 130 229 -83 292 281 -148 31 103 89 76 -172 32 143 -127 206 -180 379 -82
5487 -82 -15 229 76 -161 -133 151 162 334 -105 294 -12 290 -62 323 102 130 -184 -84 -127 313 159 145
5509 145 121 -102 110 148 89 -10 -1 166 -167 -38 85 -178 86 72 -39 -196 -250 -22 -247 -13 -195 97 -147
5532 -147 -296 80 91 -136 -73 -55 -106 103 -80 58 201 -5 339 -267 -145 3 -100 -194 55 -146 18 5
5554 5 -107 19 -171 -226 -117 -56 -221 81 -172 118 -134 14 113 -69 66 253 -19 -167 115 30 -89 -174
5576 -174 147 -285 -62 133 22 -184 125 176 175 -105 -214 -293 26 -136 -60 -244 18 -3 -61 274 57 74 -45
5599 -45 62 114 -7 70 -50 -56 -34 -98 86 325 2 -117 156 71 59 -136 75 98 273 11 193 28 117 -188
5623 -188 -146 -171 -117 160 -82 36 101 213 -26 -251 -57 -241 256 137 -105 -101 78 303 -202 -122 60 -114
5645 -114 -89 -66 -174 250 33 -63 159 141 80 -39 386 -142 38 76 -150 -37 92 15 -30 -119 106 10 84 -46
5669 -46 -112 -14 -79 7 51 -57 -7 255 -26 -42 -75 -338 81 -191 64 -70 86 -145 -203 -228 -47 39 248 28
5693 28 17 -283 18 -48 -16 -230 197 113 -185 307 -243 29 19 67 -171 -314 -48 -23 148 160 -30 -255 -24
5716 -24 -319 181 1 -88 -46 -140 -91 4 -67 158 153 169 43 183 -204 -124 151 188 226 35 22 83 341 -220 231
5741 231 -239 78 -200 10 183 -44 -37 282 165 5 89 23 -60 83 -24 84 162 -108 -5 19 -74 381 -141
5764 -141 59 12 -27 44 -22 15 75 -205 -159 96 -222 32 -317 22 188 -70 192 171 187 159 -35 -159 139
5787 139 13 -164 35 -217 -69 -11 -34 42 -219 -265 39 108 9 -76 72 106 31 120 -219 -24 140 -94 140
5810 140 -167 -38 -2 59 9 15 -175 114 -299 -183 -46 -85 -114 -112 -184 40 -151 -362 144 212 108 -147 141 -11
5834 -11 -88 29 -41 -218 -68 -193 127 -62 154 258 18 58 -339 -87 -45 108 -45 110 -193 82 242 -66
5856 -66 287 -84 -289 -87 25 352 231 236 -286 258 315 -119 -54 -151 435 -41 -257 101 -203 8 -91 210
5878 210 -115 -55 180 36 -192 -128 139 34 129 -51 -18 -99 -11 -164 11 373 -115 5 117 413 186 -64
5900 -64 -182 47 -210 -102 187 42 12 -70 133 -129 80 -265 -98 -24 -102 207 311 233 -102 -5 -144 93
5922 93 44 96 -19 425 -134 7 -168 -13 -125 78 -72 -85 129 142 -212 -104 -4 -84 47 12 -136 2
5944 2 -68 -44 -252 -176 97 1 -35 -23 221 -120 -61 -34 -89 -59 -88 -28 -54 56 78 -120 -34 -100 -39 -19 24 121 258
5971 258 38 25 124 -266 114 143 68 -98 -167 109 -366 -53 -117 -105 88 -147 150 54 -203 103 88 -237 25
5994 25 -122 -38 -78 42 184 65 136 -445 -306 -184 -41 83 233 -82 -95 -72 -14 -139 -106 -279 -22 -110 226
6017 226 88 68 191 146 -12 -275 112 184 184 -117 351 -185 161 -132 -156 -307 97 27 -146 -238 -86 -199 52
6040 52 56 89 78 -121 -105 -180 20 247 -51 179 -53 191 49 76 186 81 87 -50 28 -102 -176 -81 -72 -28 147
6065 147 252 -99 -119 -141 104 -67 -22 -238 -262 -254 21 74 48 71 -125 352 24 39 53 137 44 -29 251 230 189
6090 189 -385 -285 -61 -117 -235 199 -385 -82 138 -117 -10 -89 135 -238 285 51 -70 542 140 -75 -39
6111 -39 122 -96 12 137 -28 51 -333 192 -78 58 156 357 -133 129 -50 1 133 148 70 -65 19 -396
6133 -396 -159 283 -54 -354 100 -233 -53 67 382 96 152 52 124 -64 98 -35 -336 -117 -124 -203 46 101
6155 101 -27 69 -273 -241 37 209 -45 95 215 194 111 -102 -79 58 -46 136 -23 -49 -42 -308 141 -45 -50
6178 -50 -103 -196 -3 206 -31 -125 225 -170 134 -110 -19 -10 54 -120 495 515 91 100 -241 -124 -119 78 19 -98 -82
6203 -82 229 -1 -267 29 -247 -177 0 41 101 -110 165 -78 -170 177 -359 -335 125 195 36 -19 318 -86 -159
6226 -159 230 -18 15 -22 76 -115 -10 218 -132 -107 90 -157 -93 167 -52 -40 -71 -240 246 125 76 -309 -51
6249 -51 -115 -100 336 -155 -6 27 41 132 -17 -339 -172 -23 10 21 -106 -77 22 -209 113 115 -31 59 127 -24 -29
6274 -29 52 -80 -85 -27 -211 -71 181 -48 216 -229 -81 -144 138 -262 -138 -150 214 197 66 33 67 -136 -178 -179
6298 -179 2 -200 44 44 12 -37 -51 -146 61 -11 -144 210 158 327 -166 -182 232 73 -80 -197 9 -13 155
6321 155 -73 40 -165 -113 -32 294 22 -114 269 -17 -253 -91 -100 -170 -68 42 -231 73 274 -52 107 139
6343 139 -114 33 173 57 -176 -30 -197 -114 20 -110 87 58 206 454 -286 -55 53 -48 8 -271 177
6364 177 -191 -224 25 -77 -16 104 -368 -43 139 271 -37 286 45 73 -151 125 2 102 -193 -73 86
6385 86 104 179 108 -181 22 -112 -55 320 -116 41 -88 -123 75 -130 156 26 227 277 67 65 -1 69 -106 225
6409 225 -113 149 -72 -2 -70 360 -61 164 142 112 -4 147 -177 15 318 -45 -67 114 22 -51 -4 71 92
6432 92 203 -24 -59 107 133 -263 24 16 55 205 201 -5 -17 111 162 222 -157 -171 162 -117 -39 129 -84 -254
6456 -254 -105 16 90 183 255 -41 -45 151 -186 -12 65 -125 -52 22 -18 -308 -32 53 -71 -161 -174 -28 -150 100
6480 100 157 393 -229 -31 -230 -116 34 -219 93 -49 -86 -201 129 -149 177 -116 177 -275 77 -237 -269
6501 -269 91 235 9 -237 -130 -220 -19 -179 -73 241 -14 -83 -54 161 -302 86 29 522 -106 15 124
6522 124 75 4 -85 186 -37 6 79 -350 -58 59 -18 51 256 270 -189 158 -85 24 143 265 -240 45 -37
6545 -37 138 -116 -187 -132 -45 -101 -101 -43 -85 -4 -34 172 -98 29 -54 -129 180 -140 -70 13 -124 6 -131 211 156
6570 156 232 -239 1 232 -42 -121 83 158 128 84 10 -123 202 219 -388 8 -136 -49 96 143 -113 -169 -197 38
6594 38 -14 -9 173 -81 111 -130 -300 -146 -79 49 120 24 154 -194 -173 -81 -18 -19 95 -72 -190 -76 -30 93
6618 93 -36 -19 -134 -113 -75 -95 -205 -99 178 131 77 96 13 -66 82 31 18 -187 110 149 -7 -69 -266 55 337
6643 337 -46 -185 -20 -49 -3 25 -12 24 -156 139 71 80 -135 337 237 204 199 -113 105 -149 26 18 243 84
6667 84 -122 -66 -130 -65 141 -283 24 -108 -171 -126 -276 -354 -114 -88 -11 63 150 -247 -138 -387 -15 44 134 94 18
6692 18 120 146 275 -111 -198 39 133 218 14 -71 -13 29 -77 -71 -64 89 -114 84 182 128 -276 -205 157 557 -45
6717 -45 262 214 -260 9 -177 39 -260 -36 -1 7 -182 -107 -198 -153 -332 -192 -294 -16 87 -268 -79 57 58
6740 58 119 -229 2 70 -93 264 -67 -40 -31 -53 -228 -32 17 40 -75 -210 35 26 245 -11 55 10 -132 91
6764 91 -252 233 144 -63 -74 122 155 9 79 105 15 -27 -41 230 -41 -36 -205 42 48 36 -433 155 59 -46 88
6789 88 -213 251 144 84 95 -110 57 -101 -44 -77 -47 -130 242 -53 206 52 117 35 12 165 80 -143 57 -86
6813 -86 66 131 -72 -85 -11 -189 40 223 189 -131 32 -98 -91 24 -10 88 41 31 -206 123 -170 158 23 71
6837 71 -37 -158 310 12 -60 -16 38 -60 68 130 -128 294 -53 -333 -6 -243 262 194 223 159 141 -118 -15
6860 -15 246 192 105 -68 -120 -15 91 36 -10 -10 -123 -359 -60 -49 -314 87 218 -80 -36 10 16 -58 14 85 11 111
6886 111 1 5 -53 96 20 -11 -68 24 -548 14 149 -45 29 9 -98 309 62 247 -73 64 -7 -37 -20 129
6910 129 83 165 -151 35 10 153 226 -18 105 170 -39 -111 -99 91 79 -178 -20 -52 100 -190 116 -192 102
6933 102 -206 114 -104 91 -90 111 54 -131 244 321 -92 -46 -5 -57 -28 17 142 -142 -9 -95 -67 -275 -102
6956 -102 26 5 -56 149 70 98 -3 -51 -12 115 134 25 -125 105 157 68 -62 -52 340 -33 -41 243 -173 160
6980 160 -242 -360 -93 -63 -151 56 53 -69 -174 -200 4 -531 27 -45 22 52 -28 -34 72 -22 -41 -176 -31 -308
7004 -308 -189 41 -13 42 115 -110 -255 90 10 48 -233 179 -152 114 150 32 156 -17 211 -148 191 -12
7026 -12 4 187 -162 151 -100 -74 83 42 -232 270 155 139 -93 6 -181 -28 -76 -81 -2 -28 25 -448 -207 -64
7050 -64 -219 -10 -1 21 76 -85 -34 18 -113 -289 -145 169 192 -12 -252 103 185 -114 59 177 -98 -16 93
7073 93 29 9 62 -151 332 -63 202 -70 118 -197 -200 -142 81 16 -369 -39 -82 157 176 218 387 -13 19 -129
7097 -129 31 183 16 1 110 68 -87 46 173 -147 -211 90 257 -160 64 64 -68 170 -143 -11 -119 226
7119 226 -11 -66 -77 -195 177 79 439 -82 -336 1 93 296 -295 -29 36 -207 115 125 -65 -24 -2 -188 -361
7142 -361 -149 67 298 259 317 -15 -134 -6 189 126 23 -98 -101 -130 108 -126 -253 -82 -65 -111 -175 81 -17
7165 -17 51 -45 133 -64 -44 89 224 -169 124 -135 11 -19 259 295 184 52 101 -78 -221 120 -53 139
7187 139 185 32 139 42 -97 -42 24 159 28 36 269 13 81 -68 89 203 -32 46 -120 95 196 255 12
7210 12 -28 -235 42 137 -69 -24 146 -375 -242 -20 -50 -171 304 41 -113 111 -165 280 -157 341 283 -178
7232 -178 -62 -22 257 -135 -80 -246 -70 -3 -138 -29 -32 -158 -86 -71 101 150 8 267 65 23 0 -152 111
7255 111 131 131 -32 -32 -291 -123 -179 -108 -241 -195 -28 -131 -126 394 -92 -122 -137 -95 -27 -218 275 -137 -209 45 -260
7280 -260 -151 7 -104 155 -106 50 -200 181 -58 -1 -11 -40 5 93 18 -61 -54 45 174 -222 37 119 43 78
7304 78 -28 70 38 -196 -115 110 153 -34 -214 -213 -21 -39 11 -68 -86 61 25 -274 181 -6 21 224 265 8 62
7329 62 10 -76 247 -109 85 120 102 141 -265 54 12 -77 -192 139 40 172 -53 -244 216 9 -123 86 127
7352 127 -147 211 -20 -10 184 218 -55 -94 351 181 -199 -36 -306 -59 -35 -33 -64 73 230 -133 -62 102 49
7375 49 0 220 226 -72 -149 57 114 7 172 37 189 -37 -59 157 -64 -51 34 -432 -7 -125 -15 -151 76
7398 76 -37 155 -17 -149 -208 -183 -112 33 65 -71 -170 65 -195 143 -238 -44 -17 -148 -234 42 -7 72 81 42
7422 42 301 -208 -155 -315 191 4 229 32 -29 -36 -367 -240 -18 204 -233 9 -90 -100 -168 21 316 -42 148
7445 148 -66 264 169 -14 58 -134 121 -12 237 79 62 197 54 106 -317 89 -58 334 -96 -318 -119
7466 -119 64 -64 -157 -174 125 -13 339 124 40 66 -90 50 -38 394 404 346 -151 -159 -29 -193 -89 22 76
7489 76 113 258 239 -70 -29 -274 43 207 -173 -95 4 82 50 -174 52 13 38 139 -241 46 159 91 -22 -170
7513 -170 -1 -316 -87 34 -99 55 51 116 -92 -147 -143 -78 -198 -25 130 -14 123 237 -204 -18 -11 -8 -66 109
7537 109 359 196 119 369 189 155 -143 83 -45 -41 30 -286 40 -76 -18 1 -84 -163 96 -269 124 -8 146
7560 146 95 193 67 -269 -63 58 -275 84 94 -140 -94 -123 155 223 -33 65 63 -78 214 263 2 323 -118
7583 -118 6 156 88 -219 -213 -12 -16 3 -128 -27 235 245 -6 -48 -148 -230 -60 -24 39 152 171 0 -161 -14
7607 -14 -19 142 111 -152 158 60 -46 -32 100 -45 214 8 153 20 -121 72 -10 -175 101 38 -210 16 -136
7630 -136 41 -128 -7 305 45 -63 -103 -43 111 272 -193 -32 -35 -30 -122 52 13 364 139 148 11 -8 71 -14
7654 -14 -201 -35 13 256 -53 135 98 129 -273 -19 -44 66 175 -211 -91 -129 129 -188 -50 -122 -11 -80 -21
7677 -21 -127 369 315 -92 -19 -145 -160 245 -227 -76 41 -7 -19 -188 -10 -85 -121 -11 -113 -79 244 -73 -156
7700 -156 -36 -118 94 -33 199 -104 91 165 339 253 169 80 13 217 -105 -37 182 -243 66 238 -91 -101 -248
7723 -248 -171 -211 107 -261 -257 -53 64 -107 96 -120 83 326 61 77 186 34 -311 -333 -88 51 46 -94 -5
7746 -5 -28 141 -105 -241 21 130 -15 -147 -84 -232 -25 -11 149 -76 -23 -182 640 -114 251 -31 -266 120
7768 120 -48 -195 -297 -187 20 -5 -151 -117 241 -146 -33 15 -144 -156 95 -195 -72 42 -246 -143 -41
7789 -41 -229 161 145 -65 -99 -34 -60 -211 -9 -292 87 111 -132 67 0 106 101 119 -425 96 120 -241 -176 -66
7813 -66 61 90 90 187 -25 -56 -63 -143 -291 -178 118 13 -25 29 -24 -21 -175 84 127 162 -107 73 120 19 332 -361
7839 -361 98 -235 -150 -18 -125 -274 -68 184 86 20 67 170 408 151 170 35 -46 -46 295 235 -48 178 -106
7862 -106 -121 14 26 -239 -30 14 -38 45 -200 15 121 180 43 -297 148 29 -64 26 150 99 168 81 83 84 189
7887 189 56 -216 -2 158 5 101 133 -198 -63 -111 351 23 -328 -55 35 -96 -59 60 58 -88 119 -101
7909 -101 74 257 179 -171 -48 -131 -230 92 -15 -10 118 208 120 218 -94 41 -137 -130 -183 -270 -158 213 365 -330
7933 -330 -153 -203 80 73 130 -140 -152 -286 -111 -123 137 1 -128 -23 32 -14 -300 126 -86 64 -189 -27 -21
7956 -21 42 -111 8 62 -244 200 -50 -10 118 -185 83 -100 60 53 -95 139 -8 -69 -30 -139 296 -169 232
7979 232 -267 -275 64 -65 177 -291 123 25 -191 109 11 403 67 26 82 89 25 15 -83 95 13 127 -14 -77
8003 -77 93 -13 -306 210 -153 109 -172 491 -40 -148 150 -92 98 -9 -220 -96 155 -7 -165 -40
8023 -40 371 109 -240 -465 -96 -56 -286 -172 -355 -88 14 12 -11 -44 9 133 123 -240 269 -280 53 -59 -170
8046 -170 -102 125 102 -86 -100 74 81 266 239 164 -124 -8 46 -50 326 -8 48 -38 80 -30 106 176 83 294
8070 294 263 -141 70 -58 -29 -154 180 17 52 -73 -60 -63 223 115 5 147 -148 11 -319 -19 -254 -129
8092 -129 -32 213 -214 -390 7 67 75 86 100 53 -50 -108 153 -354 -296 46 -52 9 275 77 157 -23 -204 176
8116 176 41 -181 52 78 68 178 -40 86 -275 357 299 -312 62 118 -87 -110 153 178 -53 -17 99 -253
8138 -253 -149 -168 -213 39 -79 -136 166 -346 -185 -210 -193 28 175 8 197 -96 57 -93 373 262 -215 -58
8160 -58 305 -47 -201 193 -51 144 97 -205 -130 -5 24 47 8 87 33 316 -231 246 -60 -15 111 -62 -153
8183 -153 -52 -143 148 -63 0 -95 73 -14
8191a4
##END NTUPLES=NMR FID
##END=
