##TITLE=1H_Pr-4-Ac
 CDCl3,8 sc, 
 11.02.2021
##JCAMPDX= 6.0         $$ Bruker NMR JCAMP-DX V2.0
##DATA TYPE= NMR FID
##DATA CLASS= NTUPLES
##ORIGIN= UXNMR, Bruker Analytische Messtechnik GmbH
##OWNER= root
$$ XWIN-NMR		Version 3.5
$$ Thu Feb 11 12:31:55 2021 Russian Standard Time (UT+4h)  she@DPX200
##.OBSERVE FREQUENCY= 200.1315066352
##.OBSERVE NUCLEUS= ^1H
##.DELAY= (6, 6)
##.ACQUISITION MODE= SIMULTANEOUS
##.ACQUISITION SCHEME= undefined
##.AVERAGES= 8
##.DIGITISER RES= 18
##SPECTROMETER/DATA SYSTEM= spect
##.PULSE SEQUENCE= zg30
##.SOLVENT NAME= CDCl3
##.SHIFT REFERENCE= (INTERNAL, CDCl3, 0, 15.7039)
##AUDIT TRAIL= $$ (NUMBER, WHEN, WHO, WHERE, WHAT)
$$ ##TITLE= Audit trail, XWIN-NMR		Version 3.5
$$ ##JCAMPDX= 5.01
$$ ##ORIGIN= Bruker BioSpin GmbH
$$ ##OWNER= she
$$ F:/spectra/data/she/nmr/H-F/1/audita.txt
$$ ##AUDIT TRAIL=  $$ (NUMBER, WHEN, WHO, WHERE, WHAT)
(   1,<2021-02-11 12:24:15.12 +0400>,<she>,<DPX200>,
      <created by zg, POWCHK disabled, PULCHK disabled
       configuration hash MD5:
       00 E9 B6 7A A2 85 ED C7 34 08 36 98 17 FE 4E 26
       data hash MD5: 16K
       00 8E E8 11 15 7E 44 EC 9C 4A 01 A1 AF 86 65 65>)
$$ ##END=
$$ 
$$ hash MD5
$$ 07 8B 93 E8 6E 37 F4 C4 36 6E 4D 02 93 FF B3 A7
##$RELAX= 
##$RELAX= 
##$RELAX= 
##$RELAX= 
##$RELAX= 
##$RELAX= 
$$ Bruker specific parameters
$$ --------------------------
##$DU= <F:/spectra>
##$EXPNO= 1
##$NAME= <H-F>
##$PROCNO= 1
##$TYPE= <nmr>
##$USER= <she>
##$AMP= (0..31)
100 100 100 100 100 100 100 100 100 100 100 100 100 100 100 100 100 100 
100 100 100 100 100 100 100 100 100 100 100 100 100 100 
##$AQSEQ= 0
##$AQ_mod= 1
##$AUNM= <au_zg>
##$AUTOPOS= <>
##$BF1= 200.13
##$BF2= 200.13
##$BF3= 200.13
##$BF4= 200.13
##$BF5= 200.13
##$BF6= 200.13
##$BF7= 200.13
##$BF8= 200.13
##$BYTORDA= 1
##$CFDGTYP= 0
##$CFRGTYP= 5
##$CHEMSTR= <none>
##$CNST= (0..31)
1 1 145 1 1 1 1 1 1 1 1 1 1 1 1 1 1 1 1 1 1 1 1 1 1 1 1 1 1 1 1 1 
##$CPDPRG= <>
##$CPDPRG1= <>
##$CPDPRG2= <>
##$CPDPRG3= <>
##$CPDPRG4= <mlev>
##$CPDPRG5= <mlev>
##$CPDPRG6= <mlev>
##$CPDPRG7= <mlev>
##$CPDPRG8= <mlev>
##$CPDPRGB= <>
##$CPDPRGT= <>
##$D= (0..31)
0 1.2 0 0 0 0 0 0 0 0.06 0 0.03 0 0 0 0 0.0002 0 0 0 0 0 0 0 0 0 0 0 0 
0 0 0 
##$DATE= 1613031854
##$DBL= (0..7)
120 120 120 120 120 120 120 120 
##$DBP= (0..7)
150 150 150 150 150 150 150 150 
##$DBP07= 0
##$DBPNAM0= <>
##$DBPNAM1= <>
##$DBPNAM2= <>
##$DBPNAM3= <>
##$DBPNAM4= <>
##$DBPNAM5= <>
##$DBPNAM6= <>
##$DBPNAM7= <>
##$DBPOAL= (0..7)
0.5 0.5 0.5 0.5 0.5 0.5 0.5 0.5 
##$DBPOFFS= (0..7)
0 0 0 0 0 0 0 0 
##$DE= 6
##$DECBNUC= <off>
##$DECIM= 32
##$DECNUC= <off>
##$DECSTAT= 4
##$DIGMOD= 1
##$DIGTYP= 9
##$DL= (0..7)
0 120 120 120 120 120 120 120 
##$DP= (0..7)
150 150 150 150 150 150 150 150 
##$DP07= 0
##$DPNAME0= <>
##$DPNAME1= <>
##$DPNAME2= <>
##$DPNAME3= <>
##$DPNAME4= <>
##$DPNAME5= <>
##$DPNAME6= <>
##$DPNAME7= <>
##$DPOAL= (0..7)
0.5 0.5 0.5 0.5 0.5 0.5 0.5 0.5 
##$DPOFFS= (0..7)
0 0 0 0 0 0 0 0 
##$DQDMODE= 0
##$DR= 18
##$DS= 0
##$DSLIST= <SSSSSSSSSSSSSSS>
$$ [...]
##$SUBNAM2= <"">
##$SUBNAM3= <"">
##$SUBNAM4= <"">
##$SUBNAM5= <"">
##$SUBNAM6= <"">
##$SUBNAM7= <"">
##$SUBNAM8= <"">
##$SUBNAM9= <"">
##$SW= 16.9725356469052
##$SWIBOX= (0..15)
0 0 2 0 0 0 0 0 0 0 0 0 0 0 0 0 
##$SW_h= 3396.73913043478
##$TD= 16384
##$TD0= 1
##$TE= 0
##$TE2= 300
##$TE3= 300
##$TEG= 300
##$TL= (0..7)
0 120 120 120 120 120 120 120 
##$TP= (0..7)
150 150 150 150 150 150 150 150 
##$TP07= 0
##$TPNAME0= <>
##$TPNAME1= <>
##$TPNAME2= <>
##$TPNAME3= <>
##$TPNAME4= <>
##$TPNAME5= <>
##$TPNAME6= <>
##$TPNAME7= <>
##$TPOAL= (0..7)
0.5 0.5 0.5 0.5 0.5 0.5 0.5 0.5 
##$TPOFFS= (0..7)
0 0 0 0 0 0 0 0 
##$TUNHIN= 0
##$TUNHOUT= 0
##$TUNXOUT= 0
##$USERA1= <user>
##$USERA2= <user>
##$USERA3= <user>
##$USERA4= <user>
##$USERA5= <user>
##$V9= 5
##$VALIST= <valist>
##$VCLIST= <CCCCCCCCCCCCCCC>
##$VD= 0
##$VDLIST= <DDDDDDDDDDDDDDD>
##$VPLIST= <PPPPPPPPPPPPPPP>
##$VTLIST= <TTTTTTTTTTTTTTT>
##$WBST= 1024
##$WBSW= 4
##$XGAIN= (0..3)
0 0 0 0 
##$XL= 0
##$YL= 0
##$YMAX_a= 265063
##$YMIN_a= -403360
##$ZGOPTNS= <>
##$ZL1= 120
##$ZL2= 120
##$ZL3= 120
##$ZL4= 120
##$ABSF1= 10
##$ABSF2= 0
##$ABSG= 5
##$ABSL= 3
##$ALPHA= 0
##$AQORDER= 0
##$ASSFAC= 0
##$ASSFACI= 0
##$ASSFACX= 0
##$ASSWID= 0
##$AUNMP= <proc_1d>
##$AZFE= 0.1
##$AZFW= 0.1
##$BCFW= 1
##$BC_mod= 2
##$BYTORDP= 1
##$COROFFS= 0
##$CY= 11.3945322036743
##$DATMOD= 1
##$DC= 2
##$DFILT= <>
##$DTYPP= 0
##$F1P= 15.9154993809931
##$F2P= -4.1035820241983
##$FCOR= 0.5
##$FTSIZE= 0
##$FT_mod= 4
##$GAMMA= 1
##$GB= 0.15
##$INTBC= 1
##$INTSCL= 1
##$ISEN= 128
##$LB= 0.24
##$LEV0= 0
##$LPBIN= 0
##$MAXI= 10000
##$MC2= 0
##$MEAN= 0
##$ME_mod= 0
##$MI= 1.114404
##$NCOEF= 0
##$NC_proc= 0
##$NLEV= 6
##$NOISF1= 3.799351
##$NOISF2= 2.8
##$NSP= 1
##$NTH_PI= 0
##$NZP= 0
##$OFFSET= 15.70392
##$PC= 1
##$PHC0= -10913.05
##$PHC1= 9.600948
##$PH_mod= 1
##$PKNL= yes
##$PPARMOD= 0
##$PSCAL= 0
##$PSIGN= 0
##$REVERSE= no
##$SF= 200.130013532006
##$SI= 16384
##$SIGF1= 3
##$SIGF2= 2
##$SINO= 400
##$SIOLD= 16384
##$SREGLST= <1H.CDCl3>
##$SSB= 0
##$STSI= 0
##$STSR= 0
##$SW_p= 3612.71676300578
##$SYMM= 0
##$S_DEV= 0
##$TDeff= 0
##$TDoff= 0
##$TI= <>
##$TILT= no
##$TM1= 0
##$TM2= 0
##$TOPLEV= 0
##$USERP1= <user>
##$USERP2= <user>
##$USERP3= <user>
##$USERP4= <user>
##$USERP5= <user>
##$WDW= 1
##$XDIM= 8192
##$YMAX_p= 0
##$YMIN_p= 0
$$ End of Bruker specific parameters
$$ ---------------------------------
##NTUPLES= NMR FID
##VAR_NAME=  TIME,          FID/REAL,        FID/IMAG
##SYMBOL=    X,             R,               I
##VAR_TYPE=  INDEPENDENT,   DEPENDENT,       DEPENDENT
##VAR_FORM=  AFFN,          ASDF,            ASDF
##VAR_DIM=   8192,          8192,            8192
##UNITS=     SECONDS,       ARBITRARY UNITS, ARBITRARY UNITS
##FACTOR=    0.0002944,     1,               1
##FIRST=     0,             0,               0
##LAST=      2.4114304,     0,               0
##MIN=       0,             -403360,         0
##MAX=       2.4114304,     265063,          0
$$ Real data points
##PAGE= N=1
##DATA TABLE= (X++(R..R)), XYDATA
$$ [...]
1037D49j341R21n9N0m55O7J83N75r33k57J797q34j332J312R66j756J3J344m91
1056B19m73j69J076k7r88LJ241m09j327J206L50p82j16N66J2k05k25o0R94q03
1076H3p09Q05Q05j473l32J853q82j030P44P48r56l11M31N05m90r56J226L97j199
1095g41j46J483p80p26R06n3j50MnJ05O49r21j17J487q79o31Q72M76j038K80M70
1116E45j06m0n34O74J84o86l10J198n58q34J033k03n18K51K3m70P82o12o60J356
1136E15m75r72O82P53j127J10M96n4j59o00P50M49q81m38J730m64j483J377N20
1155G29j180J2J034m46j32o4R6O91p22m46R94K23j421O76P84q31k89L22M86n55
1175c9k85J76Q15r10n94J353k70j000M89Q65j058K8N68k74l1P1m0Q6K87o15L14
$$ y = [449, -892, 29, -30, 20, -435, -368, -185, 390, -543, -800, 997, 163, -1169, 143, 1109, -647, -634, 710, 219, -254, -423, 653, 626, -362, -359, 882, 473, -854, 352, 702, -80, -196, 370, 382, 177, -48, -108, 886, 83, -626, 179, 984, -489, -821, 1032, 150, -880, -136, 612, -344, -655, -224, 281, -209, -1165, 61, 458, -741, -887, 596, -184, -910, -4, -57, -207, -203, -208, -103, 546, -375, -492, 995, 116, -515, 357, 833, -205, 75, 545, 439, 399, -135, 539, 723, 37, -273, 925, 367, -467, 566, 363, -155, 96, 119, -351, 431, -181, -841, 515, 40, -932, -250, 503, -624, -514, -18, -72, -231, -831, -81, 368, -513, -951, 779, 315, -1168, 209, 729, -451, -439, 595, 149, 17, -47, 49, 740, 18, -428, 566, 789, -632, 44, 828, -3, -292, 30, 516, -39, -324, -148, 667, -243, -837, 516, 246, -754, -265, 600, -458, -430, 138, -136, -167, -96, -136, -50, 237, -378, -64]
1196f4M36m80J77m9O5R1M5n94Q34N1j032P50N68q95l38J179n59m95L58J88k0l82
1218a66PK96L12j051L48Q26p65n04P61L56r41J21M75K57p45k30J077j76j027L92
1238c77J204j183l86J160o9q13J98P63m26j58j42N78lo46K84N51m52n63R53k57
1258B16l71L20r4o9J44j25k51P57n17l94O85o3n94K64M03n87M13j22j70M43k36
1279E2m14N44K30q77M97K98l52o1P8K12p5k58j69Q97n55o47R09K12j047K19Q17
1300E10o31j58K02J25M2m13n4O78k91q84R75K23r42K38O46l40l69L33O6J83m68
1321c29j8O75q7p06N02O80j020J50N61j70k11J71N0N5L4n54P01N5o69J86N56m81
1343A31k71N68k99M0j28j20L45n2o35L06N22q61J26N26l08l30L92m6j90J63l72
$$ y = [-64, 372, -108, 69, 20, 85, 176, 221, -373, 461, 512, -520, 230, 798, -97, -435, 744, 185, -310, 48, 236, 216, -166, -159, 137, 449, -602, -254, 572, -193, -697, 64, 420, -521, -400, 75, 332, -413, -643, 434, 258, -769, -377, 827, -356, -742, 418, 349, -464, -266, 497, 71, -87, -229, 349, 346, -300, -16, 535, 83, -480, 473, 216, -155, 165, 71, 2, 146, 21, -230, 527, 10, -384, 301, 238, -356, -92, 311, -276, 137, 15, -155, 288, 52, -362, 182, 412, -465, 32, 330, -22, -83, -5, 207, 132, -126, -295, 602, 47, -600, 309, 521, -526, -307, 510, -121, -279, -77, 48, 90, -323, -377, 301, 10, -874, 101, 324, -618, -380, 266, -74, -443, -110, -44, 139, -329, -347, 328, 241, -465, 37, 717, -303, -153, 408, 238, 27, 198, 248, 303, 337, -217, 484, 539, -130, 56, 612, 131, -140, 428, 129, 169, 41, -79, 266, 214, -421, -115, 407, -454, -328, 198, -110, -440, -48, -94, -284, -121, -493]
1364d93L66J55n00P0N91m09l24O98j18l76J55J66L8j69o7L09K87l09p5O40m76
1385A59k96M61J93j72m59M2q3O97k04k88L84M2q93P04K88n98Q3K49j99J3l05J16
1407f6N50p51j18Q57l98o31N66K81p12K75J44N5j56j04J71J55l03j85O53k63l66
1428c46L32L00l89r8K62l8Q6k96J84K15k23l50N90J7o20M86J14k77j9K67j62Q5
1450A20m0j88L22r7j40N2K21l28J26N8j43K43k95q4L67k3o01N24K54o76J09M66
1472B47j96l59K82O1l0j85n4M34j45m04K11M89n93j19O44k73k72K17J78j06k6
1493Aj93L78R3o14K98N79n70l45Q09j62n55L69J83k09r4J96p5J47k55K9L22l47
1515a5j29K45k0l18M11j72j33K37k51n3K84p5m03M82Pm11K36M8n5Ml3n4L56k88
$$ y = [-493, -127, 28, -472, -402, 189, -220, -544, 154, 36, -340, -185, -19, 19, -150, -217, 92, 379, 70, -5, 635, 159, -137, 324, 517, 345, -114, -72, -155, 542, 338, 50, 434, 476, -417, 287, 575, -23, 60, 309, 110, 123, -182, -66, 484, -267, -385, 472, 74, -557, 9, 290, -422, -147, -3, 52, -104, -208, -37, 118, -185, -370, 283, 20, -346, -14, 286, -103, -201, 61, 23, 109, -187, -3, 212, -11, -361, 229, 246, -374, 112, 226, -51, -70, 197, 35, 120, 80, -108, 214, 117, -23, 29, 250, -78, 48, 106, -37, 206, -89, -173, 194, 171, -430, 94, 348, -328, -219, 247, 51, -308, -26, 35, 5, -180, -234, 200, 55, -349, -138, 351, -242, -361, 283, 10, -262, -45, 133, 27, 1, -192, 186, 279, -335, -37, 542, -28, -373, 436, 274, -281, 88, 271, 62, -32, 164, 89, 236, -19, 10, 332, -15, -144, 101, 81, -237, 174, 2, -131, 106, -145, -198, 86, 11, -392, 90, 97, -314, -78, -30, -85, -81, -114, -168, 188, -100]
1539a00j80M89j22l16K07K36k69L7J9L6K08l84J06L80k61n39P30K0o54L69L06
1560C18l47j99L72n5Nk52J01L55l94j13L87J4n17K59L03k87j3J22N6r6J5j71L13
1583A76j16l15M07K3k48M0K80k73N1O1n4R7j34r0K05O9l92K43R0k31K4J25j33
1606i5J5J12l00K33M7l27J40K28k40j58L79r8q4N6%L4M0j08J69J65m11J77K88
1629B62k57n5K84n3j95J85p2Q4J4j58P6J93k88r9M41k43j43J18O8j62K6nk3J19
1653A17l21J14K34l10j02L10j8l08K46k2r5O2j5M0P5j61j09M80k54j84L12K8k36
1676a17Q9J39j36O1j90J57J92j58j28K42L8m84M13p9J4j93J13K7P8j19m6K66j78
1699Am49L01L11n62J63J75J21k53l5K24O8J6k29K48J30l12J17K21k32MJ32j3l3
$$ y = [-100, -280, 209, 87, -229, -22, 214, -55, -18, 1, 37, 245, -139, -33, 347, 86, -453, 277, 297, -357, 12, 318, -29, -228, 144, 89, 94, -158, -57, 298, -96, -209, 178, 192, -325, -66, 237, -50, -63, 59, 115, 19, 34, -137, 176, 60, -255, 152, 175, -73, -33, 247, -26, 25, 86, 32, 129, -5, -95, 110, 179, -213, 30, 120, -111, -87, 38, -95, -80, 32, -268, -35, 12, -315, -175, 53, -187, -345, 34, -64, -148, -92, -92, -58, -18, -126, 43, 208, -203, -26, 262, 5, -50, 234, 181, -14, 171, 99, 183, 197, 39, 115, 308, 20, -79, 362, 119, -24, 94, 162, 0, 26, 21, -2, 117, -204, -90, 144, -166, -268, 42, 24, -284, -38, -60, -155, -93, -108, -68, 7, -154, -263, 217, -37, -221, 91, 119, -117, -28, 111, -25, 36, -154, 3, 195, 37, -91, 151, 189, -295, 118, 39, 53, -140, -27, 0, 78, -41, -87, 179, 1, -448, -147, 164, -398, -235, -60, 61, -192, -227, -3, 65, 81, -148, 100, 230, -82, 35, 256, 24, 28, 160, 147, 114]
1722A14K4j51K76m7k98J60K29l53k6K93j69q0j1N9rr9m2J42n7k92K23J70k78p8
1746c00L64j92j99K35Oj4o8J3J68Jk19J25J74k21k0L13n4j34K61j36l3J3M7K0
1770A50J01k27L0J58j73K2J26j76n9J68k27n2K43k33Q4L7j49QJ90r5pJ37n0j33
1794a27J28j94K18P4o3k14K78j55k18L29J1j74PJ57M6p8q6J8L28k31k27L72k27
1817b8j86R0J57o2o9J64r1j20J58r0K63k26r9J55J12m36L38L37l98k33M98j23
1839A11N1q1j60J25P7j86J25N0M1k49J3R2j07J74j22m9L57j70M0k46n6Q1M44m08
1863e3oK2j21J36j33J50k16N37k19j87l4K9j95K75p8j27K71l97L80j6j5K57k8
1886B32r9j10K75o8k04N9L43m05n1J49k8j69QJ87J17o3Kl12n2k48L66K88l79J71
$$ y = [114, 138, -13, 263, 216, -82, 78, 307, -46, -72, 221, 52, -28, -39, 20, 11, -88, -130, 12, -45, -337, -114, 56, -222, -300, 64, -128, -327, -92, -86, -100, -168, -155, 13, 14, -205, -80, 94, -127, -147, 166, 112, -22, 239, 103, 70, 83, 130, 150, 251, 24, 54, 212, 39, 61, 187, 11, -48, 120, -107, -159, 84, -149, -65, -28, -177, -169, 21, -74, -81, 56, 6, -127, 1, -193, 25, 99, 36, -178, 100, -55, -273, 56, 67, -107, -100, 57, 103, 25, -61, -43, 285, 54, -173, 199, -28, -214, -124, 33, -29, -98, 66, -25, -145, 13, -77, 186, -40, -139, 16, 128, -308, 30, 367, -31, -264, 234, 111, 162, 81, -79, 46, 123, -63, 62, 112, 153, -96, -83, 9, -98, 76, -46, -95, 262, 92, 132, -114, -170, -89, 355, -53, -59, -37, -158, -22, -155, -5, -221, 316, 97, -90, -124, -95, -290, -15, -93, -220, 51, -346, 34, 18, 3, 260, 232, 133, 23, 298, 230, 26, 85, 428, 23, -28, 121, 93, -76, -68, 119, 236, 173, 175, -137, -189, -437, -71, 217, -162, 9]
1910Ij77J76J47k65j07L15k72k27M18J08k11lp3R6l2j01O5J69p8L4l8n0RJ22P
1935D1j43J80j18J53M4j81lK22j46l7J95k23J14J0lk20J11M8j21J33l1p2P2Rj45
1960a11J15Jj46R0J5J6j6N1j47J20k9q3J56j5j22O8Q8j50P6N8no0J1k7O4K4j21
1987g9J35L4k08J27R5j13m7J00m9QL2n8J03j9j76P4J63k22O0J17j03p6J23Pq6
2012e8P6j06J67l2j04N3Q5j62K7K28j85L9N3m9l7J03q1l2O4m2l6Q9o1RN0q2n2
2039g6J31j34P4R1j43l5J39o0q0J05Oq6L8j3j8N4r3PJ51q8p0J41j9j37J30N7j57
2066h5P3K4K3Np9M7Q6j12l2J45m1r0J11L7j54M6N0o3N1m5N0%r0M0M3qr1J54k0
2095G5j58Q7K3m9O0l2j6K2N1j09j3N5r5O4P0o2K9Pj17R3L1o5O9P5j70R4qk6k6
$$ y = [9, -168, 8, 155, -110, -217, 98, -174, -401, 17, 125, -86, -89, -162, -66, -98, -199, -134, 35, -43, -9, -47, -97, -88, 34, 41, -102, 78, -40, 113, 157, -24, -27, 195, 49, 12, 207, -16, 98, 108, 105, -115, -4, 44, -77, 56, 25, -47, 25, 34, -111, 4, 5, -141, -51, -36, -20, -36, 15, -132, -12, -41, -124, 32, 17, -105, -37, 51, -99, -23, 35, 30, -30, -19, -46, 18, 42, -79, 56, 90, -118, 9, 104, -9, -56, 44, -5, 3, 35, -23, 80, 61, -115, -41, 122, -100, -40, 77, -26, -102, 21, 28, -58, 18, -88, 79, 47, -57, -4, 81, -81, -54, 174, -11, 28, 81, 32, -5, 98, 17, -15, 49, 7, -29, 60, -1, 8, 58, -24, -76, 55, -79, -5, 86, -57, -92, 47, -13, -93, 12, 18, -68, -30, -43, -61, -7, -100, -93, 58, -30, -100, 41, 22, -115, 15, 72, -85, -12, 12, 35, 40, -39, 8, 94, -18, -50, 95, 54, -36, 75, 112, -42, 4, 54, -9, 42, -3, 47, 47, -43, -3, 40, 32, -59, 95, 75, -83, 4, 27, -22, 38, 6, -10, 12, 63, -46, -59, -4, -99, -35, 35, -27, 2, 9, -108, -15, 16, -49, 20, 95, -75, 19, 11, -15, -41]
2124d1L7n1M3N6j39J41n8p0O7J45j49n0J85j12j1m2M4K1Mj7N7N1j73J62k2j39
2150f1MJ21k7l2K5J2k1k0N8p9J03j45L9R5p9j2J5j4n5L9k1K4L3n0L5Qrl8R5o9
2180b6m5R1n1K1K2n2j3P8o2J2L6n1L9JL5q3P9J1l1K3r2P9O1j03n0J06Qp7L0L0
2210B6k0lOl3L6Kj12J76p5j0L2K6r3M3M2lmm9O3J6r4nP1l1q6L3P4l1j4P6m8k2
2242a1lPN6l7k8J1N9j47J37nr4N0ll5O5j8p2J38q0l1J14n0p0J7M4p0L7N7q3M9
2272DOL7n6K4m9MR7j27Q9J0r0N1M6l0K%k2O6m1k6l1J04p3m9P3l0K1l3MJ5O4q8
2304b8k6J08r0K8L6k3k9K8Oj9j6J7rL9p3l3R8m0l2J05k9q4O2Oo4Q8o5Q9Ml5m8
2335b9J4M5n1Q9n0OJ5n7M0n6M2q5Q7qj5L3p9LJ10j08K2J5o5O4Mj2K4J3l2k3N4
$$ y = [-41, -4, -55, -12, 44, -95, 46, -12, -82, -15, 130, -19, -69, 116, 4, -7, -49, -5, 16, 20, 3, 60, 111, -62, 100, 78, -61, -57, 64, 37, 5, 30, 42, 21, 1, 59, -20, 83, -62, -23, 72, -7, -19, -4, -18, -73, -34, -55, -31, 2, -48, -13, -5, -14, -52, 43, -26, -71, 20, -31, -10, 12, -40, -53, 25, -37, -25, 11, -40, -1, 0, 35, -48, 31, 42, 11, 34, -58, 21, 82, -21, -71, 35, 43, -34, -4, 26, 6, 3, 9, -24, 12, 14, -98, 78, 3, -7, 25, 51, -42, 1, 43, 40, 36, -13, 50, 66, -28, -33, 38, 7, -79, -46, 28, -3, -17, 59, 11, -11, -14, -7, 49, 12, -16, -5, 54, -93, 44, 39, -55, -5, -8, -43, 22, 4, -68, 70, -10, -41, 73, 23, -47, -30, 14, -56, -19, 38, -45, 4, 10, 47, -9, 15, -34, -30, 67, -60, 29, 39, -51, 0, 46, 16, 18, 18, -4, 62, 21, -5, -36, 68, -5, -54, 19, -11, 10, -23, -19, -4, 60, -28, -54, 54, -36, -8, 28, 5, -24, 4, 10, -9, -25, -8, -17, 22, -51, -84, 14, -26, -58, 47, 18, -66, -4, 2, -62, 26, -39, 50, 54, 19, -29, -15, 30, -21, 68, 18, 24, 39, -18, 22, -34, 8, -77, 10, 2, -13, 20, -59, -56, 54, -54, -32, -17, -82, -18, -14, -26, -2, 11, -21, -44, 10]
2366A0K7l5M3k9m4K7mq1J37o1rj0N2p9M1L7r9P5L3Mmm6%J4M6j23R4Roj4L6q9L3
2399a5O1j00J13n7%M7O7j29K5l8rO1Oj00M8J26j20o1R5p4R6j03l4J08R3j0j73
2426g7K41k30N6Q1j52O2J39k40J7j94J96J77R7j61l7k0L4J43l84K26r1J55j2K
2450B8n8J09j36K64j48p9q2J88Q8k17o2mK98q1k20J43J3j29R9q1n9J56l7J84l38
2475a61K56K29k78Q5j11J60M1m75O56k34J5k71L19m05q9J22J48j19r7M02O3k20
2497C6l89L10lO9k59J17J48j13L44k09N1p0M4j22j9J80p3l1j14J41o3q9J45O9
2521A00j58mk9N8j54L59p4k02l1K13n0m6r8R6Q8j15P1k2j1p5J33p0O2k1Qn6J7
2548a1oJ3j8J3k7L8k0J6n8N5k0L2m0RJ6n3L5Q0P1j29l7L8Nm7P2l0K5o7O3j3nJ4
$$ y = [10, 37, 2, 45, 16, -28, -1, -5, -86, 51, -10, -19, -29, 23, -56, -15, 22, -77, -2, 31, 35, 31, -15, -15, -1, 45, -78, 16, 25, 19, 5, 41, -48, -15, 46, -54, 59, 2, 2, 49, 116, -13, 12, -26, -35, 26, 32, -68, -20, 106, -14, -75, 20, -54, 42, -61, -95, 13, 106, 96, -77, 164, -66, -10, 71, -81, -19, 120, -120, -103, -297, -101, 76, 173, 12, -25, -45, -11, 132, -252, -26, -117, 38, 26, 28, -30, 79, -57, 207, 59, -20, -102, 86, 174, -43, -105, -109, 189, 108, -112, 31, 44, -85, 14, -67, -126, 30, -7, 177, -161, 95, 324, 46, 131, 20, 180, 221, -254, 402, 168, 183, -88, 231, -174, -263, -141, 7, -112, -209, 193, 256, 36, -353, -43, -46, 23, -236, -119, 29, -84, 260, 51, 102, 32, 76, -46, -65, 115, 42, 11, -103, 38, -25, -114, 31, 100, -58, -62, -91, -33, -187, 172, 98, -104, -135, 78, 28, -18, -116, -20, 68, -47, 24, 2, -9, -84, 49, -21, 41, 20, 28, -28, -11, -17, -4, -22, -9, -36, 2, -18, -2, -60, -5, -25, 7, -33, -24, -8, -61, -26, 54, 125, -4, -41, -3, 2, -45, 27, -3, 22, -45, 18, 5, 0, 14]
2580A4l0O0n2j2M4l3N3n2N4q4M1J4O8j37J04q3jnO9p1J6q0K05j75j0K08k48K94
2608A71k40J56j53J0k6J06o4N8JL4r9J66j23lj00K18j58O5n2Q9J9KM7j86KJ18
2634E8j3k1O2k8n1j7r9m5M58o2J2J4k37K10q6rk23KN09o17K86p4K99l47J04j03
2660a8J95l14k76O88m58J01K03p2K39m16J90J16l49R8K40j17j5q8j11K09J63O
2682B14l0l00L07l73n5n1N96j80%j27M9p5j21J68O4op0j80M03o90M12J55q21Q68
2706A57J36n0P8m05L1Q3l22K29j71K50j59lJ68k18N07l13j43M47j79j74P5K4j17
2729f9OJ48M3j06K2l5lJ34j08J12j45k04J72j01J80k21K97j11Q9k54N4K72k42
2752g0j32K31M3j07j82J79O2JKk77L51j44n3qN2J62L6m87N09l73J35K29J15m95
$$ y = [14, -16, 44, -8, -20, 24, -9, 44, -8, 46, -38, 3, 17, 85, -52, 52, -31, -32, -37, 32, -39, -23, -103, 102, -73, -83, 125, -123, 171, -69, 87, -66, -56, -82, 24, -40, 18, 19, 53, -46, 120, -3, -6, -106, 112, -46, 19, -33, 56, 75, 77, 124, -62, -60, 58, 45, 24, 86, 58, 7, -10, -109, -154, 304, 242, 254, 268, 31, 241, 155, 146, -77, -75, 434, -183, 103, 29, 328, -19, 85, -18, 177, -137, -413, 275, -183, -82, 121, 49, 288, -128, 62, 178, -171, -73, 167, 50, 35, -53, -164, 45, 208, 214, 184, -116, 191, -182, -237, -288, 308, 128, 128, 1, 50, -25, -146, 22, 86, 80, 10, -170, 233, -457, -45, 110, -711, 157, 293, 243, 321, -84, -53, 30, -292, -63, -234, 16, -143, -146, 22, -196, 311, -2, -145, 302, 123, -51, 24, 48, -69, -63, 85, 128, 22, 44, 9, 6, 140, 32, 144, -1, -205, -33, -134, 46, -175, 122, 11, 100, -154, -100, 172, -70, -202, 29, 72, -35, -217, -38, 24, 25, 27, -250, 101, -43, -96, -104, -52, 110, 146, -341, 168, -205, -70, 159, 274, -221]
2776b21L95l17N27j77m17N5m3J90M9j7j29j79L20K6l3J24j29k5l1j1j62K71N0
2799A16j16lM8M8k36K46k60K61R5j88M5n9l7J92O3j35j01j6n0J15M2k26K23k03
2823a36J0L26j08j68n1J91Om00L96K6k40P5M38l71K6j73p1J24l9P8q2K48j37j44
2847a76K24m4J83l16J9M2J79j83J28J58o5j14l3J96l33M65j41k87k36L73M4J10
2869A93l25L68l46qn6K19k94L15j93J11n2O4j47P2J95p1j05L4j90K85j71L2n0
2892a20N6k6J52l12K37J83k87K14J16j84j80j27P4J5L94l17j03J89K49j68j18
2913f3j22k89J72K14l3M40m68o7M30o88Q28m44O3m30M08L98k38l29L47o7m40J31
2935b47J38Kj46L32J51j19k33K16or3P3k18J08N3K17j77p1k30L02p5k40K17n1
$$ y = [-221, 174, -143, 384, 207, -210, -155, -198, -8, 41, 24, -105, -284, 36, 62, 29, 153, 24, -1, -32, -43, -205, 66, 116, 0, -3, 45, 93, -143, 103, -157, 104, 199, 11, 56, -3, -40, 152, 215, 80, -21, -37, -87, 28, 70, -156, 67, -136, -126, 200, 92, -76, -127, 64, 70, -330, 66, 92, -148, -73, 365, -6, 20, -153, -224, -100, -139, -61, -143, 105, -32, -176, 48, 4, 187, -129, -110, -68, 111, -72, 56, 214, 149, 35, 2, 198, -135, 330, 189, -98, -334, 39, 83, 193, -132, 236, -110, -118, -174, 45, -249, 66, -127, -16, -68, -4, -151, -79, 116, 45, -60, -26, -216, 69, -102, -70, -120, -64, -90, 62, -250, -13, 170, -117, 97, 213, 29, -151, -278, -204, -189, 205, -112, -215, -26, 223, 55, -63, -185, -474, -302, -88, -121, 319, -149, -216, 214, -474, 354, -90, -27, -457, -49, 349, 111, -218, 129, 62, -378, -247, -109, -107, -253, 79, 230, 111, -122, 94, 88, -5, 68, -150, -42, 11, 228, 51, -20, -250, 52, -23, -263, -46, -97]
2958i7M6q1K66l13N4J67J2M24k79j99j16L56k32p0J57J2j31L23k41j18J29mK7
2981I2P9l69N6J07J60k95J80rk01L26Rm28L57K01m25K4l1J37r9J74K0R9n5l44
3005b35J02P8Kj62J55K80l48K64l1n2l71L30q6j66P9M80l99q3K64M7k14M60m48
3028e4L1qJ98n25J31N5L88l45K08m40O00l08p1L3J87J16p4K25p12K58j62L03q4
3051e0n6K40l65K37J48j03k2K00J13m57J72j15j28J59j25P5j2K58r0M1M9k70J68
3074F7K6k5p3J01j2K3q6l2k0lo3K20j03j40K15Rm0j18K35l43K45m0J19j70j52
3099a60P3m1M6K12l02K43j71K17J8l33J66j58K83r4J22j3l1Nm4j83J36J66j19
3122C8J19J16K7m39J16j5K99k60r9J74J5l17QM6K05L84l06j73LR8p3Rj08J84Q7
$$ y = [-97, -51, -132, 134, -179, -125, 42, 54, 478, 199, 0, -116, 240, 8, -62, 95, 107, -24, 299, 58, -60, 69, 65, 92, 171, -198, -142, -35, 125, -170, 10, 1, -200, 126, 135, -293, 64, 265, -160, -136, -167, -30, -129, 45, 65, 164, 109, -235, -133, -55, -53, -215, -60, 220, -128, 136, 105, 53, -318, 12, -74, -240, -161, 319, -80, -163, 101, 148, -66, 394, -54, -23, -31, 167, -358, -227, -172, 216, -129, 79, -361, 239, -69, -140, -107, 80, 196, 122, 347, -365, -107, -269, 34, -50, -106, 134, -231, 6, 154, 51, 29, 229, 342, -115, 57, -58, -186, -27, -152, -77, -89, 169, 79, 120, 169, -101, 67, 93, 68, -5, 96, 84, 107, 21, -11, -31, -34, -97, 123, 20, -120, 95, 104, 64, -54, 181, -162, 83, 43, 162, -8, -160, -87, -128, -82, 130, -172, 71, -100, 117, 135, -198, -32, -190, 93, -1, 121, 108, 77, 82, 38, -145, -9, 157, 38, 157, 273, 300, -139, -23, -38, 261, 1, -98, 76, 91, -226, -218, -172, 33, 417, 111, -62, -59, 39, -34, -25, -133, 51, 138]
3147A38p4nqN5O5k47L1p3J82k47K43m1J37m48N23k55j06R1K43m15K2K28j35J35
3171C9j27J82R1j05J03n4l34K69k04P0J51RK1k13K10j99r2J78j01k25O29j37j70
3194iJ32j78j57L19q7M9j5J89k47k0J6J4J89j95J38k14O0L6m3K5N5J11j38%L9
3219F9n1l1L1j02O8m7J2J42l9r2l2R5n2P6k0p9k8M5N3j4o5O3L1M1m9O1j08l8Q0
3248B0k27L85j26j41J61Q0q2p5Q6l8J16p0j61K60m43J54k6o6OJ15J07l0j52K44
3272I7j11k03K71k2P7j41M2n1J54j74J82j35K63k92q9J10l1j59L22l99N4O2N01
3295C28l49P1K9j95J53j6j04R9J11j50j7Q3l1M9o2o8L34k86J36J48J57n69L81
3318B32j33K24k77j3k84J12J65J79k76K33k3j77j80j14M60m68K31K52k21kL18
$$ y = [138, 64, 59, 51, 106, 171, -76, -45, -118, 64, -183, 60, 19, 156, -292, 231, -24, -130, -39, 204, -211, -189, 39, -96, 39, -88, 94, 185, 80, 183, 129, -205, 64, -140, -70, 81, 90, 111, -102, 108, -91, -183, -5, -106, -331, 298, 161, -9, 123, -55, -212, 107, 20, 69, 54, 243, -4, -24, -8, 6, 195, 0, 138, -76, -16, 20, -23, 2, 57, 168, 30, 30, 69, 18, -13, 18, -84, -16, -63, -51, 91, 52, -40, -72, 23, -29, 47, 27, -52, -80, -35, 18, 4, -61, 2, 33, 74, 25, 86, -22, -60, 20, -207, 178, 52, -89, 72, 152, 70, -5, 81, 43, 159, 89, -72, 188, -255, -101, -127, -193, -187, -72, 35, 5, -147, 97, -14, -217, 54, 32, 109, -32, 10, -41, 113, -61, 121, -14, 249, -43, -132, -22, -53, -212, 110, -289, -235, -173, 328, -21, 50, 79, -116, 37, 21, -83, 16, 127, -23, -40, 43, 12, 61, -1, -69, 265, -21, 115, 263, 420, -149, 232, 99, 323, 46, 33, -251, -139, 26, 205, -71, 162, 139, -38, -218, -332, 128, -340, -109, 143, -78, -80, 238]
3339B38N5k3m24K40k88O52p52k14J048o91J50jk3j37J50j20P5j97L71l84J15K14
3361E4k22L99QL7p8l4j81l33K37K20RK74q82P13k65n26N08j73J9L86J00j58k17
3384a05k2L16n22P1M52J24k51r6j00JJ05j90j8k6M97J49q94L72L7m4O8K18m31
3407b89M12j28J25k98L52l12L87l79L32p8j5O1l60O7j46L98l29M41l39j69J79
3428h8J1K48n1N2l75L38j17j3p2J33j76J27p2r1J58P2Q9j81k24K72K07k50K88
3451B85p33N61j04k7N4J53m33M99k05l95N71l03m8J78j83N14n05K66j28R2J57
3472B66n58J97L34j5j11j33J89o10P73m17J66j60m6R1l2K11l26R7J13r2L94k14
3494A17j93j52m5J57j27J87lJ86l8k93L35k52N4l5p6N18k84J31k38l1J16P5O3
$$ y = [238, 293, 270, -154, 86, -202, 450, -302, -516, 532, -159, -9, -10, -33, -170, -20, -140, -65, -262, 109, -275, -160, 54, -168, 231, 239, 276, 198, 164, -17, -350, -113, 107, 116, 390, -492, 221, -44, -570, -62, -235, -216, 170, 270, 112, -105, -127, 189, -333, -262, 190, 314, 63, -33, -133, -132, -27, -217, -235, -261, 236, 385, -509, -137, -100, -144, -76, 142, -289, 123, -5, 120, -178, 174, -138, 249, -130, 202, 124, 109, 170, -190, -123, -269, 129, -200, 241, -98, -267, -88, -77, 171, 120, 172, -203, 135, 18, 5, -67, 66, -110, 17, -55, -146, 12, 84, 173, -8, -232, 40, 247, -3, 285, -448, 113, 9, -18, 36, 189, -244, 255, 50, -345, 226, -77, -125, 53, -130, 384, -121, 145, 17, 109, 266, -292, -95, 239, 224, 113, -20, 169, -441, 332, -85, 81, -79, -125, -34, -66, 145, -181, -84, 29, -63, 331, 117, -76, -228, -273, -116, -243, -56, -59, 127, 89, -204, 131, -121, -67, -102, -178, 340, 56, 187, -51, -82, 34, 109, 172]
3517A72N3m29M20l78L34q7N6l22J24J68j39mj21J1L79m00j07P3N14k64R2%k15
3540g0Rj24J81N4N9l88R0J97o1L99l00L9n26M50l30K28j64J82K64l13L21j23J12
3563A86j56k24R9Q9Pj53J38L4j2L49j43m03n5O6K57j42p7N4j0M21n25J26P2l83
3587c85L06k63J24K32q9o0J56O7j81r0J38J68j16o5K88m65J27K01k13o1J39L65
3609C23j83j85J19j96q5M7K44j50k56J71J02l3j8P6j48J74K4K6j76J01j6j25J79
3632A5J14R4l10P2j15K97l86L67j71K12j82K47n31L44K39l39J34k43K78j63k55
3653b82L67m6j71j06J03K77j45J51k22q4L66J15j03j97K93l42K85n74L58M2J36
3674B21m2k17J03k03K2J59J45j91J23k45J1M4J71Nj28L7K01m2J0l91L91Rk69P3
$$ y = [172, 225, -204, 216, -162, 172, 85, 141, -181, -57, 111, -28, -32, -153, -142, 237, -163, -270, -197, 317, 53, 145, 145, -70, -61, -185, -4, 50, 109, -279, -189, 8, -53, 346, 46, 85, -441, 9, -321, -93, -257, -75, 189, -124, 197, 74, 186, 30, -194, -95, -6, 1, -152, -14, 20, 8, 357, 214, -189, -244, -178, 79, -63, -140, -86, -96, 325, -200, -74, -2, -385, -79, -342, -218, 14, -75, -135, 21, 88, -93, -183, -45, 123, 7, -58, 230, -235, -108, 93, -120, -181, -42, 323, 140, -45, 74, -122, -207, -160, 84, -66, -322, -151, -49, -82, -100, -24, -172, 2, 26, 52, -124, -23, -39, -164, 15, 129, 223, -87, -15, -130, 167, -219, 148, -23, 189, 7, 254, -277, 67, 306, -33, 101, -142, 136, -27, -282, 85, 39, -132, -238, -135, 142, -3, 148, -74, -158, 208, 323, 220, 23, 316, -26, 259, -315, 43, 85, 221, 179, -38, 65, -138, -116, 43, 188, -3, 120, -125, -114, -70, 101, 106, -22, 15, 216, 174, 184, -207, 184, 193, -76, -3]
3698cL94n66L32l56L20j67K7j07L16pp7j42j44J98K57j78o1M2m22M08j78J12J53
3721A51j91J89k16J08j9RM3K4k00J68j43K52j71j73J76p2n1j46J09M2k1j4K38
3744I2l54K49J48q2j34k9J25p1p5j81m9L00L2J05J37l06j83M51k68J74q3Qj02
3767i6J68j03k18J11K80l18J08O4j69J89n7J36n9J88l28L54m94j1K82J91l16o9
3789a67M02n7n8J87m41Q3j9j08J36OMk98M73o2P1k55j75J53J08J8o0J47k53K14
3813D9j62J57O2l3j9j15K03o6n3j75l6L18r9k5K19j03k10O3j07N2J50k04k9lj08
3838b74J39K60m16q3O02q7j33K56k38M3N4k66L80k02J82k51k32L60j01j09J55
3859C9R5k05K67p4j7j10M0l4o1O6n2J30k7L9k59J58k9J6O6j07k0J10q5Q7k1q4
$$ y = [-3, 391, -175, 157, -199, 121, -46, -19, -126, 190, 183, 106, -36, -180, 18, 275, 97, 36, 78, -344, 64, -114, -2, 151, -40, 149, -67, 41, 22, 31, 74, 98, -102, 66, -77, 175, 4, -169, 7, -65, -116, -262, -153, -111, -132, -146, 92, -262, -13, 135, 53, -81, -110, 15, -56, -131, -312, -361, -61, -29, 76, 213, -93, -276, 175, -93, 81, -2, 6, -96, 72, -31, -249, -138, 142, -176, -68, -4, -173, 16, -41, 95, 36, 224, -104, 250, -244, -255, 27, 218, -98, -167, 235, 178, 120, 307, -134, -51, -70, -178, -42, -36, -32, -330, 143, 81, 152, -103, -278, -125, -17, 1, -59, 88, -165, 49, -113, 44, 106, 73, 54, -61, 142, 76, 23, -152, -188, 130, 31, 6, 225, 122, -88, -25, -132, -80, 70, -134, -163, -166, -274, -135, 125, -291, -374, 228, 141, 8, 264, 26, 69, 123, -143, 237, 35, 217, -34, -266, 94, -7, -116, 39, 134, -71, 196, 122, 105, -5, 35, 1, -60, 6, -46, 84, 57, 96, -163, -5, -34, -18, 48, -59, -79, 31, -54, 33, 12, -72]
3885g2M1j33L17j52L5n3JP2J5m2o7L0qrl8N4K4k5K3j0L7q0O4j8k6K3K0J5o0K5
3915CJM9q4L5K5j2l4j1K4J7l3Pm4K6K0l8N1L6m2K2j4K0k9m6O6jo3K6N0n5QL5l
3948A2m1O7j06N4Q2o4k7K7N7j11L3OJ1K3n8L5N6o0k7L7l3J9J9j6j8M9k2n8M5M0
3978C1n1L3j8N1p8L1klK9j7n8Q8m1j5J8l6Q1n6j6N3j6p2R1l1k8M6l9M1p7O7j0
4009dJ1Pk6k3K9J9o3K6L3mj0PM3n3L1J1l4l0N9j5pJ9nJ2m9L6m0O7n6M8l5J7Jq8
4043f6J04m2J3K2Po8oL5rK1l3j7K1l8j7P9j4MqR4m6%k8N1o9N8n4qN7l2K8o0N7
4076C6j7m3O8ql1k9PLK3K4l2mk0M2o3J9K1KOK2k1k3L9m3L2l8J6K7m2M6j4N7n3
4109Ij2L0j0jm7J3OK4Ml0j9OK6j8ONJ0m5Q2l1k9L1N1r6okM2J7lJ3k1N6p3K0K3
$$ y = [-72, -31, -164, 153, 1, 36, -17, -16, 56, 71, 29, -38, -8, -16, -25, -63, -9, 15, -10, 13, 3, 40, -40, 24, 6, -20, 3, 23, 38, -22, 3, 4, 53, -31, 4, 29, 17, -17, -28, -4, 13, -20, -13, -57, -31, -11, -49, 2, 38, -4, 18, 4, 24, -5, -51, 15, 14, -49, -23, 27, -28, -20, 15, 12, -29, 38, -68, -14, 68, 4, -23, 4, 61, -50, -17, -11, 0, 23, -35, 0, 56, -4, -31, 6, -27, -8, 11, -5, -23, 26, 4, -54, -9, 31, -20, 13, -5, 46, -32, -1, -3, -6, 23, 6, -52, 36, -5, -20, -2, -38, 43, -13, -29, 24, 8, -64, 27, -4, -32, 14, -25, 16, -61, 6, -4, 7, 14, -12, -35, -6, 13, -50, -24, 9, 5, -5, 2, 45, -8, 23, 34, 0, -30, 29, 14, 7, 26, 21, 33, -16, 20, -20, 47, -9, 39, 4, 21, 22, -66, 38, -4, 9, 31, 38, -30, -36, -1, -10, 11, -22, -39, -18, -56, -73, 6, -8, -4, -12, 82, 36, 36, 8, 59, -10, 48, -6, -14, 43, 11, 39, -21, 36, 19, -24, 44, 36, 5, -24, -17, -14, 9, 33, 1, -3, -23, 19, -44, -25, -4, -2, 4, 26, 5, -18, 21, -22, 10, -28, -12, 15, -27, 19, 5, 62, 9, -3, 27, 17, 16, -31, -18, -12, 12, 16, -14, -33, -27, -1, -19, -13, -8, 2, -43, 39, 8, -21, 10, 61, -35, -41, -43, -1, 16, 13, 26, 5, 61, -12, 8, 31]
4144C1k5Rj3n2Q2m8oN7l1k6OL0n5P8j5p3P9o1j1L9M3p1J0J4l8K8j2J6MKpL7L2
4177E3p3K2k7M7oM2p1K5M4j03J16p4Pj5L3o1N5ql7P4r8N1O6n9m4NL4%qk9J9J2
4209hL4nj3J7m3nL7l3L4j1L9Okn4K2JK5o5O9mn0j1J4M5l7K1j8L9m1%J8n2N0J8
4243C7n5N3n2Kj2J0J7nl5M3M2j7n5N0j9J5nl5O0nj0k6O3Ooq2K8Km2M4l4Npj5L8
4278bj6k1K2J3k8J1MJj9OL5lo5P4k2K7j4lJ8o2L4J7m2M0j2J9rP0j01J0k6R3n7
4311hLlm4N5j0j6J1%L1l1m3L0JQM2l2p1O6j4m1R1m8P0o4j4P1k7oJ3Nn9M8L6l3
4345A7K3o7k4J05m0L0m2k0J4J2l0L4K1j7k5j2K9K2n8K1K5pk9J0L7l7Lk0j3M5K3
4376C0m4J7l1L2M3r2N6m4M1j1k6M3l2J1K0M2q3O3m1l3J1R7q8o0J14qj80J00n1
$$ y = [31, 6, 15, 2, -50, 32, -16, -22, 35, 4, -22, -16, 14, -41, 37, 22, -51, 28, -33, -44, -5, 38, -33, -23, -9, -47, -19, -31, -15, -11, -9, -16, 21, 53, -20, 2, -25, 22, 16, 58, -13, 12, 56, -47, 69, -5, 2, -13, 20, -41, 14, 6, -31, 43, -55, -4, 62, 3, -41, -36, -2, -2, -10, -39, -20, -8, 26, 21, 8, 25, -18, -23, 14, -19, 15, 4, 43, 49, 47, -7, 15, 16, 41, -24, 45, 41, -9, -20, -6, 39, 2, 23, 5, 44, 3, 3, 21, -31, 19, 37, -18, 35, -17, -15, -27, -17, 0, -5, -40, 3, 45, 28, -27, 23, 4, 19, 14, -21, 39, 34, 24, -2, 61, 67, 61, -21, 7, 9, -33, 11, -23, -18, -25, -40, -2, -18, -39, -17, -4, -32, -21, -17, -16, -35, -29, 6, 3, -62, 12, -10, 17, 3, 0, 18, -44, -10, 7, -35, 5, -7, 12, 3, 73, -28, -18, -44, 49, -8, -5, -8, -52, 3, -7, -23, -12, -12, 19, -12, -55, -25, -24, -16, 26, -6, -77, -11, -25, -66, 25, -23, 47, -17, -31, 40, 13, 7, 20, 25, -34, 14, 50, 17, 40, -27, -51, 54, 14, 44, 2, -18, -4, 8, -22, 12, 33, 16, -9, -21, 8, 30, -28, -7, 18, 11, -18, -8, 29, -8, -5, -25, -38, 7, 30, -14, 3, -28, 4, 47, -45, 11, -33, 8, -3, -29, 14, -18, -7, 13, 55, -28, 35, -6, -39, -28, 69, -19, -79, 35, 27, -153, -53, -104]
4405a04K41k70L15j18k89J35J52k4k6m1NJ6K0Jn3Q1nn5O3n2jJ8l2J1k1L2J0J3
4433B2k3l0OjJ3K6j8j29J25L7m8J2j0J4j0k1RL8J3km3j8N8J0k9j4K3J4l0k8%L1
4465coP4q6mK1l7K7oJ9J0q3R2l6K6m6J7K6K9o0lK3k2K3RN2m6j6N2k5o3j2O4mL4
4499D0n7K9l9L8K5l2k3J3PK4n6J6OJL8n3m4N2M5o8K0N8o2N5o3J9l8N0KJ8K5q6
4531d0l2O9nM9m2J6k6J7j3lK7j8K6p5K8N5o0J56j21K4K7j99J59m4Q4n8p9K1K34
4560A77j56j66J13m7Oj5kK82J28l45J3P6p7J67l48m0J05M88k22Q5k25K7K37J25
4584C86l39m33N03n8R8r0M3k40J41p0j60m5O6J31J35M6N8k41O5j00qJ74M4J17
4608B23k70L24m61M7K20P6j29R6k4L%j52K78p4j40J11k02J38k3P3j98k1Q5L0j8
$$ y = [-104, 137, -133, 182, 64, -225, -90, 62, 38, 12, -29, -24, -8, 12, 13, -40, 41, 36, -19, 44, -8, -9, 9, -23, -12, -33, -1, 9, 22, -1, -31, -25, -26, -13, 13, -5, -134, -9, 28, -20, -8, -18, -4, -14, -35, -26, 12, 25, 23, -20, -38, 20, 30, 1, -13, 10, 24, -6, -34, -34, -3, -9, 65, -21, -25, -4, -41, -14, -20, -1, 9, -74, 18, -18, 8, -38, -21, 5, 34, -26, -29, -6, -28, -5, 4, 56, 10, -6, 46, 21, -42, -54, 10, 6, 40, -17, 12, -27, 11, 36, 4, -19, -6, 1, 25, -31, -15, -9, -8, 30, -23, -67, -15, 30, -38, -18, 40, -22, 33, -30, -11, -49, 1, 3, 21, 46, -40, -72, -3, -8, 41, -1, 15, -11, 6, -7, -10, 17, -1, 25, -50, -22, 33, -27, 129, 8, 32, 59, -140, 19, -25, 59, 1, -78, -57, 177, 21, -145, -32, -79, -73, -88, -90, 192, 320, -25, -12, 64, -13, 154, -194, -234, -129, 359, 137, 222, -3, 24, 261, 386, 47, -386, 117, 59, 157, 67, 110, -130, 11, -59, -219, -264, -198, -67, 68, 114, 172, -69, -4, -104, -112, 62, 106, 223, -47, 277, -184, -137, 83, 159, 30, 126, 102, 105, 105, -47, 231, 157, 17, 128, -74, 64, 41, 114, -84, -105, -20, 10, -8]
4633hLj0RL1p3M4kqM3m2Ok6N6rl6JK0onK9Nj5j3J4Pm7O0j7k7K9k9Mj5nK2J2m1
4670c9K7N7o6M6n3N4q4O3k3K4q2P8%k5N6onl9K3k2K6Oon2M8%M3p2J8J1L6l8O8
4703G2q7j7OL4j6n0M1L1kkk3oQQROn0L1Mn5J2O1jN3o8l1J5RN8m8PJ4m5P5K0o5
4739HK8k3J2Ln0mO4l7Jn9%K2MJ3oK0NOL7o8M3%l4L9pj0k6K4rlNqRJL3J4k7j6P
4778A1o8L2K2m6M7Qrm5J13m1l2L1o1N3Pn4Qn0Q2j4M4k1n2M0L1k7J5k7J7QK4n9
4810a3K0J9Jj1orl2O2j5j0J0j2q5J00n3M0J3p0N9NK4n0JPj3M6j8j1O1j03N6m0
4842b7J5k4K4Nmj0J5mN2l7j9J7L6j9k9L9j3j7k5K7l7K4K1j4m2L8k9K7j2Lm5M5
4874a9j3l2M2L9l3K0l8LL1pJ0n4R8n9M8m8N5j2n0L6K2n7JrK5LK7Kk4qJ3m7L6K6
$$ y = [-8, -5, -15, -6, 25, -48, -4, -6, -14, 29, -13, -7, -33, 23, 14, -22, -21, -1, -7, -12, 17, 22, 7, -6, 8, 15, -32, 28, 11, -16, 13, -16, -12, -27, -32, -10, 2, -39, -12, 45, -21, 25, -28, 26, -58, 5, -18, 6, -76, 2, 2, -23, 33, 27, 22, -17, 6, -16, 10, 16, 10, -42, 6, 6, 49, -23, -5, 6, 42, 4, 72, -15, -32, -26, 8, -8, -58, -17, 14, 12, 10, -13, -19, -11, -3, 6, 12, -38, -7, -3, -58, -46, 15, 14, 67, -1, -32, -17, -8, 50, 2, 9, 23, -22, 53, 73, 8, 36, 13, 25, 28, -22, -26, 38, 1, 2, -57, -57, -35, -31, -18, -24, -4, 1, 7, 44, -24, 19, 19, -15, 24, 17, 7, -19, 5, -4, -7, -2, -10, -1, 0, 33, 47, 20, 4, 11, -57, -25, -3, -49, -2, 6, -3, -48, 65, 24, -8, 23, -38, 15, 22, -32, -24, -74, 8, -6, 38, 17, -35, 5, 36, 9, 24, -3, 14, 22, 46, -13, 7, 26, 27, 16, 10, 1, -31, 31, 16, 6, 16, 4, -81, 19, -34, 6, 19, -51, 8, 13, 37, -13, -12, -5, -18, 28, 10, -1, 60, -43, 13, -27, -12, -36, -12, -7, -11, -21, -6, -10, 42, 5, -14, 3, 39, 20, -9, 30, 17, 0, -25, 2, -35, -11, 10, -4, -46, -8, -37, -10, -22, -19, -64, -19, -32, -64, -22, 17, -16, 4, -34, -31, 0, -7, 3, -51, 47, -12, 36, -12, 43, 31, -19, 17, 39, -18, -17, -26, -1, 2, 29, 31, 7, -1, 12, -35, 1, 27]
4908B7l7J3N1j11L7J6JK7m4K8Km3L8p4Q4j0K3j7j5m6L3O0o6J8O1j8k1Pm0j4M0
4939A0j4l0K9oL8j3l6JM9n0K2j4M0j7j2O2k2l5m3j8Q1m3J6K5K8j3k0l8L7POPL
4972C7k4kK4l3m2M3M3J7p5K3K8l3n5M7Pn2K1k2N3L2r6Q8j3n0O9m8L7j8qL2j4n4
5004c8Pl9N0L4k9K8j1N%N2q4N7k0jj1m2O3o1N3l7%K4k2N7J3l8J4Rn6K6k1%qK1
5038enmJ8n5M4Jj6K2l4K6J9l8K2P8q4mk7M9%K2l1k1%L7ok7k7K8mJ7l6L5m5OO5
5073B0m2K8k7j7N0J1k7%J4J0k4%M8k3l8P3j09Q2j6j8kl6N9K6J2m0n4K2m3Q7l9
5104a3j9k0L8l0M6L4o3J2J4j3M5j5J3l0jM1k4k0L7rJ6j4j2M3jn0K4k2o2R2p6K4
5136a5J5P8l9n9J6K4m4RJ9NKo0Q0K9j10M0l8QJ8K0J2l7N9j8Lk2LJ0K3Kk0j0M3
$$ y = [27, -10, 3, 54, -57, -20, -4, -3, 24, -20, 8, 10, -33, 5, -69, 15, 5, 28, 11, -4, -50, -17, 43, -23, -5, 56, 38, 17, 24, -16, -30, 10, -4, -34, -5, -11, 27, 14, -22, -21, 28, -22, 0, -14, 26, 9, -3, 59, 37, 2, -41, -59, 22, -21, -5, 20, 48, 35, 15, -23, 14, 21, 27, 34, 37, 13, 11, 35, 2, -40, 3, 46, 63, -12, 11, 39, 6, -49, -2, 5, -47, -26, -48, 5, 37, -59, 29, 16, -34, 35, -13, 24, 6, -2, 30, 16, -38, -31, -70, -20, 14, -15, 13, 2, 7, 7, 59, -25, 32, 12, 11, 0, -42, 21, -40, 13, -24, -24, 0, -22, 35, 48, 10, 24, 33, -23, 3, -18, -18, -26, -5, -10, -14, 4, -51, -7, -6, -22, 0, -34, -8, 11, -27, -5, 73, -11, -15, -42, 7, 7, 29, -2, -23, -23, 14, 8, -19, -46, -18, -22, -5, -41, -6, -51, -45, 20, -22, 6, -21, -38, 12, 23, -4, -4, 10, 20, -4, -4, 44, 21, -17, 56, -53, 29, 13, -5, -7, -43, 16, 42, 54, 14, -40, -18, -61, 26, -13, -32, -52, -14, -44, 2, 36, -27, -15, -1, -14, 31, 16, 29, -1, -2, 39, 15, -5, 32, 23, 39, 25, 13, 56, 55, 5, 29, 7, -55, 37, -39, -15, 0, 78, 39, -20, -4, 20, -24, -15, 4, 9, 11, -49, 31, 60, -50, -10, -48, -40, -22, -2, 10, -27, 32, 14, 17, -5, -2, 8, 31, 33, 13, 3, 46]
5169D6l4%J5j4j2oj5N8k4k4K0l0N4k8j1l2L5k6M9p1Q1m1oK3j13N2M7j50N0K15
5199A08m2M5j07pJ22o3Q3pJ53k90j27K32k51K19J0Pj70J21Oj3m3J7j5OL6m4J5
5226ALj6QK4l8J4k4NL9p4N5l0j0M2K5j0rJ4Mm5P2p6qO5k0J3qRj8J1j6k7J5j6J1
5261a5J3j5Mjl0K8K1k4J5K1j8%J6m0L0L9oPq6L8N3k4l5k9K9M3k9OK1m4MM6o1J3
5295a0lJK9L5m5N6o2j0K4q3P1Mk1K9k8j1M3JQ2o3r0P1m6J9K4j4j1j9J3L8p9Q6
5327C1k8L0n3mM2N6r2K6Ko4P7k5j4lQj7NL2k5j8K1J3m8Q0o5K9N6l6%j2p0O8Mj
5361ELk3MrqJ8jj0K1k4L2kK5l0k4k2L8kk3koNL7K0J6m1k8J4K4MQM3p9j1j0N0K3
5398C5p4L7l3O6K2k2kp1N9J4kk7M7j2k8jj2k4M0j1M5k7k6k4M2k7k7P5rj2j13O3
$$ y = [46, 12, 12, 27, 13, 1, -5, -20, 38, 14, -10, 10, -20, 34, 6, -5, -37, -2, -28, 21, -50, 31, -10, -16, 7, -106, -54, -7, -157, -107, 108, 66, 111, 4, -3, 119, 56, 139, 132, 285, -5, -132, 100, -151, 68, 78, 85, -85, 36, 42, 29, -14, 3, -12, -6, 30, -14, 1, 4, -12, -4, 20, -18, -4, -28, -23, 16, -58, -3, -33, -43, -1, 24, 14, 5, 19, 23, -22, 50, -26, -34, 31, 11, 24, 16, 25, 7, 18, 2, -25, -10, -26, -15, -2, -17, -13, -14, -44, -16, 5, -19, -4, 17, -1, -1, 15, -25, 5, 44, 38, 45, -41, -3, 50, 26, -9, -38, -9, 34, 5, 11, 32, -12, -8, 38, -23, -10, -13, -12, 17, 52, 7, 63, 1, -9, 15, -68, 3, 7, -14, 15, -13, -24, 19, 20, 102, 39, -51, 20, -26, -7, 17, 3, -8, -27, -14, 24, -55, 31, 3, 33, -20, -24, 18, 74, -18, 8, 10, -54, 23, -2, -16, -19, -11, -28, -23, 9, -16, -34, -13, 0, -48, 32, -33, -4, 52, 16, 16, 4, -66, 2, 6, 5, 8, -15, -11, -20, -28, -10, -11, -21, 0, -24, 8, 6, 31, 1, -23, -45, -7, -9, -32, -34, -40, -35, 2, 22, 38, -3, -31, -17, 7, 11, 19, 62, -17, -28, -38, 12, 35, -39, -2, -35, 31, 53, 31, 29, -42, 17, 31, 29, 2, 49, 37, 9, 8, -4, -28, 12, 1, 46, 19, -7, -31, 11, -16, -43, 32, 23, 11, -102, -39]
5430c9kP0j04Q9l1R7m2J0r3P1nr4J15j8m3Pk4J9k7R2Oj06L9qQ2n2r0l4P7m8J32
5461D6q0n3N7nP4j03K8Q9j66J9J92j02o2N1m4N5P7j1ok0P4o1r1N3o1K46j46Q2
5489A32j52J4K17j06j27l8O0r8P6p4O3O4M8j65J48j84J50n3R9L6j46K7o2J21k46
5514a96J14P1J24R3k14L3k17K88K0j77j45Q9k2M60j07j33j04j93K22r6p9Q4J66
5537H1k09J54On1n8J23j82J44J42j64N0k1M5k3m0%j5M9m6J7MoL0j4m8M8m8L0j3
5566a5lK2j7J2J3n2k2N4M6l4K7l4l0K5N1l6M9k2J5m0pnJ4m1K3j3M3l8L0K9l9K1
5598B6l9rj1J03l4j5L3k0p7K9Qm9K0N6p6M3k8J6jK8MK8K0p4o4J05k8k0O1k9J36
5629A42q1j40R2l4J14j35J42j54N9k21K71j16R9j24M7m4J11P8r7N6m8j7m8J16
$$ y = [-39, -41, 29, -75, 14, -17, 80, 38, 48, -45, 26, 21, -73, 42, 24, -19, -12, -36, -17, -44, 48, 54, -52, -13, -21, 61, 9, -81, -115, -38, -86, 46, -34, -87, -30, -35, 39, -64, -36, 53, -113, -94, 98, -4, -66, -15, -59, -4, 73, 62, 56, 36, 110, 49, -42, 11, -50, 196, 50, 132, -20, -6, 211, 105, -22, -60, 0, -98, -22, -96, -33, 31, 79, -86, 62, -122, 28, -25, 74, 110, -36, -9, -71, 50, -196, -82, -11, 113, 206, -8, 25, -192, 96, 116, -61, -206, -117, -139, 321, 214, 81, -23, -216, 6, -90, -169, -85, 81, -128, 26, 32, -19, -77, 46, -136, 8, 150, -14, 36, 15, 60, 37, -3, -3, -18, 31, -15, 2, 6, 0, 30, 16, -32, 16, -32, -2, -15, -18, 4, -13, -1, 12, -40, -62, -8, 38, 4, 31, -3, -33, -8, 43, 7, 56, 34, 49, 9, 2, -3, 11, -30, -7, -20, 23, -15, 15, 44, 5, 26, -13, -22, -33, 70, 36, 21, 54, 34, -43, -14, -6, -55, -35, 21, -55, -12, -40, -24, -25, 3, 7, 35, 55, -19, -83, 22, -6, -26, 35, 6, 142, 61, -79, 13, -21, 93, -42, 100, -54, 5, -216, 55, -61, 38, -86, -39, -83, 28, 106, 9, 65, 17, 0, -48, 68]
5653F8K2j53O6O1o1jm0j0j8J4O9J2j14J37n2k0O7k1j12J66j47Q1j10K4m4K16j59
5680e9M9n5P3k04K49N0j55J58j83J36l11K28q6O9j66J39n7L33m71N66l69k16J23
5703a59M53j15l30N05n98J11L6P0Q1k56N4K56k42Q7K7r8J06lk0L8K2L3n4o1O4
5728Gk4J10q3Ppn9K8m4LL4j9M5Pk3pL2j3J1m1L1LM5o6jL3m0K7KK6lj5n1Q2o0M1
5763A8KrKL0k8k8J9L4q8L6k1jl7J02j2j8K5n8J7pnJ5pM8m4Rm9Q6p0J6lN9k4l0
5797b1K6k8J7j0K2j8K6j9lK3m0K9J2M8n8M0l8Om9K3j9L5m5J7rL0j5n4J0P5J7j9
5829A1Nk5K9J2j3K0n7J5Pj1j3K8J1Nl4J7Nj5Pkj7ok8j2K1K3K5oo1L1O2o9RK3k9
5864c2M1l1L4l2O2j9n7R3l9k1mJ1J1m9L1k3O7Pl6J9k2Nq3P5k6k5K7KK7k7L9j4
$$ y = [68, 90, -63, 3, 64, 3, 2, -38, -48, -66, -52, 17, 29, -85, 52, 0, -20, 47, 26, -86, 80, -67, 14, -96, -72, -116, 100, -59, -10, -65, 8, -196, 53, 103, -52, 106, -77, 59, -252, -24, -110, -41, -207, -68, -125, 208, -263, 303, -66, -282, -159, 294, 179, -151, 354, -244, -133, -97, -27, 54, -202, -148, 108, -134, -47, -20, -118, -12, -15, -35, 3, 25, 58, 4, -57, 7, -17, 93, 10, 17, 10, -49, -21, -65, -62, -28, -47, -2, 5, -18, -25, 7, -6, 5, -36, -5, -2, 43, -23, -24, 9, -31, -4, -2, 24, 21, 6, -45, 37, -23, 18, 20, 11, 13, 43, 15, -13, 6, 40, -48, -12, -33, -34, -71, 31, 19, 1, 26, -32, -15, -22, -27, -12, -19, 29, -15, -6, -55, 31, -39, -23, -26, 33, 9, -21, 5, -23, -6, -16, 6, -12, 14, -5, -8, 15, -25, 4, 16, 64, 6, 46, 8, 14, -35, -12, -31, 4, -41, -24, -33, -3, -18, -72, -62, 13, 30, 11, 16, -9, 20, 32, 19, 39, -18, -3, 4, -7, -20, 8, 19, 24, -10, 7, 12, -3, 4, 2, -15, -21, -49, -61, -40, -17, 8, 2, -59, -28, 34, -35, -26, -3, -32, 9, -22, 12, -20, 42, 23, -34, 59, 20, -1, -5, 6, 17, -32, -1, -24, 43, 50, 14, 33, 11, 16, -67, 8, -18, -43, -16, -14, 13, -14, 25, 11]
5896A1K8%n0M2l4J4nl6j8L6Lj4K6k4J4jJ3jJ4N3m0nm9N0p0M4j1j7RMJ4l2O2ok7
5931cj8m1L5j2J9M2p0L0NJ2j5j3Oj4J3M6l0Mj1OK3qL5m%K6o4k4N9l6J1L%qk1k3
5967d0L1jJ9Kq6O1K1k6M4o0QL4k0M7J2k7m4N9o2RJ8QK9L1q9N3p4KQQ2j13P8j44
6000a30P1J48j24J89J76n33K25j68J01k14P3M1J83l5L7j3L2k22oL97j47l74J71
6023a22q3o6K68J8K13j60k41K01J4k26K10N5j7p5M3m7k7L5o6J1J6q1J93p3J3k6
6049b0Ql7N7k5j01Q7kj3Q9N2o8ro0J8p6Q5O2j5j5pj94Q7J71k1m6j12K58k58J14
6078Ik5o1J45j68O3k43K76j53R5J19j52n1l6k0L04j43m13N64K1k04j63J93J41
6101I8o2q6p0K47l2m06L31p2m6j16L55k49K85n6j19K2M9J40k28l1o3MJ94j25L
$$ y = [11, 39, 39, -11, 31, -3, 11, 6, -30, -48, -12, -9, -23, 3, -21, -7, -8, 5, 4, 18, 71, 31, 26, -23, 27, -43, 1, -10, -27, -18, -14, 0, -32, 30, 24, -3, -21, -62, -27, -39, -20, 22, -48, -18, -13, -1, -16, -29, -23, -37, -24, 22, -8, -4, -15, -9, 14, 6, 41, 37, 37, 63, -1, -25, 34, -2, 9, 12, 12, 4, -17, -40, -9, -10, 9, 11, -75, -14, 7, -19, 25, -35, -27, 7, -13, 34, 46, 19, -25, 34, -28, -19, -1, 7, 36, 67, -22, 31, -43, -41, -33, 49, -64, 14, -130, -59, 89, -35, 154, 330, -203, 22, -146, -45, -259, -186, -145, 38, 3, 40, 27, 59, -163, -169, 228, 81, -293, -122, -205, -271, -3, 15, 228, 68, -173, 28, 42, -184, 26, 81, 64, -11, 32, -15, -42, -7, -73, -62, -46, -127, 66, -7, 6, -20, -12, -49, 8, -17, -118, -31, -33, -46, 43, 95, 27, 18, -42, -24, -100, -15, 47, 32, 17, 10, -184, -97, 74, 53, 7, -105, 153, -105, 9, -16, -77, 68, -100, -37, -280, -4, -157, -62, 57, -95, -146, -182, -202, 102, -41, -454, 110, 131, -73, -236, -43, 98, 36, -50, -120, 127, 95, -311, 20, -52, -98, -214, 141, -108, 177, 121, 2, 24, 73, 213, -15, -46, -109, -105, 89, -36, -33]
6126c3K2J9lk4M9m6k2K5mK0k1N0m2L9n7R7o1K7j1Qm3O7n5k7L9Ll3L4l9J5M7l8
6158BqL1n2QJ6l1j2J5L0m9Q6l9K2k0RJ7l1lM3p4M9k7%L2l7N8l0N2o0Kj5N8p0J7
6192a1K0m1OJ7QPN3j03J7M5qo0j9N3J2jj6L0j4l4M6jk1PqmQ0n9nM6r2M7J2J5o7
6227d3J0O0kl6j7L9nJ5l0K4J8k6m2oK6K7J3n6M0L2jk7l6K1%M5q2K2rK4ppRl9N3
6262GnL6l1m1O1p7N8M5o6J3j2K4K4Qo3JJ7L6n1M2j8Rl1M0J4p6K4o1O0j3M1%Mm3
6296b4Q1n7J3L1j7ll8N7j2K2k9K3n6j7P4J0m7J1j4k5kl7Q3K5J4m1l1K8n7K1kj3
6328b9l4N5lJ7J2l5M8k2k5Krj2J3M5k6J8J1Kn0j7M9l8L1OQn6M6k5mQ0n9NMJ9k1
6363FnJ8k0K0Om9K0Q5j76R4pL3o9n6Q4l9J07j24M7P3j13K7K29o9j38J20m1j86
$$ y = [-33, -11, 8, 5, -19, 30, -16, -38, -13, -17, 3, -18, 32, -10, 29, -28, 69, 8, 35, 24, 32, -11, 56, 1, -26, 13, 16, -17, 17, -22, -7, 40, 2, -6, 25, -27, -19, -3, -34, -46, -31, -1, -50, 36, -3, 19, -1, 8, 25, -6, -9, 34, -40, 9, -18, -18, 14, -23, 35, 5, 57, -3, -1, -16, 42, -28, -11, 9, -32, -26, -9, -1, 6, 59, -44, -27, 18, 10, -50, -69, -16, -4, -5, -21, 9, -5, -39, 7, 6, -15, -8, -16, -20, 60, 1, -4, 42, -50, -3, 9, 24, -43, -33, 27, 25, -11, -28, 11, 6, 21, -9, 15, 33, 7, -35, -41, -15, 12, 25, -31, 9, 41, 40, 13, -23, -2, -2, 43, -39, -17, -26, -2, -9, -16, -7, -46, 7, 2, 38, 7, -34, 27, -50, 8, 53, -13, 0, -12, 12, 36, 44, -19, -18, -1, 35, -16, 26, 8, 17, -14, 26, 40, -36, -12, -73, -13, -26, 15, 15, 19, -24, 57, 0, 13, 44, 27, 24, -14, 43, 31, 53, 24, 47, -9, -26, 48, 58, 11, 22, 8, -17, -19, -56, 27, 52, 66, 25, -6, 22, -35, -14, -16, -29, -63, -8, -11, 6, 18, -17, 31, 9, -16, -14, -23, -35, -22, 23, -3, 15, 26, 28, -22, -39, 10, -28, 3, 9, 17, -39, 7, -18, -22, 58, -1, 4, 8, 27, 6, 1, 19, -1, 19, 25, -24, -4, 81, -95, -1, -8, 25, -44, -100, -16, -55, 52, -72, -25, 48, -65, -38, 191, 122, -16, 104, 63, -123]
6391a23J43l1J41k5k04K23k42k9J14n5J98j29o8j14P5M05l80L72m92O9R5Q3J7
6414D3o8j0J22j40O9L4N5n4j6m6M6k8l3K4p9J21o3J3J7M8m9J0j8J0n3M0l9R6m6
6443Foll5M6k2M3n9P2n8J9j9k3J06k1k4k7L5n6N0n5K5L4p3jQ1p6O8K5r7O5om2
6475b8pL2j0j4N4Nn1L8k2J3M0l7m1K1m4O4k8K0qO3j12K2J5mN1J0oj0m4M6K3k5
6507B6Ql9n8J24r6R3l4m1KpL0l1J6Rj0j9Rl8M1rlNK6m2M4j7oON3l9M9m8J3mn5
6542d2%M7K8m7qP3n7l0M6kk8K0L8j8n1K5K6p8N2L7n9pK2K7M6p2kJl3N2KOomK1
6577B5k6J6jl5Rok2O1n0L4m5K4Q3n2m1K3L6m5NoK1J2o6O2l4L5%j4o0Q9o3J4J3
6610dJk1M1j3j1k2P5l9RKo0KN0j8jN3l2J7j1lQm0L2Nj7k3jP8k6l6j3m9J6QO5K
$$ y = [-123, 20, -11, 130, 105, -99, 124, -118, -147, -33, -88, 110, -19, -87, -201, -126, 279, -101, 271, -221, -152, -57, 26, 43, -25, -35, 87, -53, 16, 50, 105, 51, 35, -11, 35, 7, -26, -2, -81, 40, -23, -10, 7, 55, 6, 16, -2, 8, -45, -5, -44, 52, 6, 0, -3, -38, 8, -14, 29, -30, 42, -16, 3, -16, -39, 67, 46, 22, -5, 30, -26, 24, -31, -6, 28, -45, -46, 35, -41, 27, 52, -45, 20, 14, -28, -35, -3, -13, -27, 27, 32, -19, 19, -3, 10, 50, 13, -28, -7, -51, 13, -15, 5, -3, 60, -52, -30, -15, -19, 32, 42, 36, 26, -18, 28, 51, 26, 34, -5, -63, 61, -35, 58, 24, -17, -15, -22, 8, -23, -7, 2, -8, -27, -18, -56, -15, -24, -27, -22, 4, -38, 6, -11, -17, -11, 42, 3, 52, 4, 17, 13, -42, -42, 5, 33, -14, -22, 51, -6, -36, 10, 8, -20, 0, 38, 20, -31, -6, 20, -58, -6, 31, -28, -35, -13, 14, 60, -12, -14, -13, -46, 6, 8, 14, 8, 4, 25, -1, 15, 14, -21, -12, -18, -40, 21, -29, 5, -40, -16, 67, 15, -26, -3, 33, -12, -7, -13, 8, 20, -46, 16, -18, 17, 17, 3, -57, 32, -31, -17, -4, -3, -24, 17, 4, -7, -29, 46, 7, 16, 18, -42, -40, 10, -8, -9, 44, 12, 29, 18, 15, 23, -17, 15, 20, 3, -20, -21, 57, 31, -5, -18, -67, -51, -43, 22, 24]
6646B4m0LK0J2J0j21P0J2O3p8P6n4L3k1O8o1p1P3K5r9J27q1J83j17l3j85K74k7
6674H5l03L78j20JJ88m46J93J96l88K51K8j8n4P0K0j83K01j08k0M9k07K93k73
6697a67J41n5K24j29p1J5J31J1j52K9l6N6k2R0n7m3R4n0n7L0K3n6L1L8n6N1l2
6724a9k6L5k2kK4k0O7q0R7Nq7J8k5L1pM0J6o7L5j5Jn0L6J0JO6l8J8o9Rj2K1QJ5
6758A4j0lJ3k3P7o8rL8q9N9L1n8KJ8qlJ4j0NO3n1Jj1O3o8K3k8j6L7K0k5k0Q0p0
6792a2K5k8oJ1K3j6j5O0o1K5n5J8O9k1Mml8P2q4j1O2o2K3J3PqJ6J2m2J8j9J1K3
6825A0L5k1o4O4j8J9r6J08q9n5J11m0J2K6J4L5p3J2J6oJ3M5o7m5O5lmm9M7pm4
6856d9L5Pk7P9qmk9N3m9jk3M2J2j1M8p1k5M4l8k3L9J4k8k9M6j3jn0M2J5m7J1M5
$$ y = [24, -16, -13, 7, 19, 29, -92, -22, -10, 53, -25, 51, -3, 30, 9, 77, 16, -55, 18, 43, -56, 71, -10, 173, 56, 23, -162, 112, 85, -218, 160, 40, 41, 229, -217, -24, 172, -216, 35, 63, 45, -9, 61, 81, -102, 99, -9, -29, 20, -187, 106, -167, -26, -81, 143, 14, -57, -42, 89, 100, -52, -23, -59, -3, -25, 65, 8, -35, 59, 9, -48, -18, 5, -51, -20, 18, -38, 13, -19, -45, -10, -32, -34, -10, -30, 37, -43, 54, 59, -28, -10, -35, -4, -11, 29, 45, -22, 13, -2, -1, -51, -15, -5, -4, 62, 24, 42, -27, -18, -30, -9, -1, 14, 4, 1, 14, -9, 68, 0, -9, 29, -60, -1, 30, -28, -26, -8, -16, -19, -5, -15, -10, 53, 2, 3, -8, 55, -13, 10, -18, -34, 3, 23, -2, -22, 58, -12, 13, -15, -21, -10, 13, -3, -18, 42, -19, 6, -49, -31, 38, 17, 21, 17, -21, 51, -33, -44, 18, -44, -21, -8, -1, -9, 7, 19, -23, -5, -24, -13, 10, 45, 24, -40, 24, 6, 25, -71, 37, -52, -107, 4, -36, -24, 2, 16, 51, -22, -10, 6, 0, 13, 58, -9, -54, 11, 8, 4, -45, 2, -5, -49, -14, -7, -34, 45, 37, 33, 4, 57, 8, 7, -16, 26, 38, 27, 75, 4, -21, 23, -15, -38, 1, 15, -13, -42, 4, -9, -10, -60, -18, -3, -50, -39, 6]
6889Fm6lQ6l4K1J9o3QK8n1J1K1Ll8kM6Jp2M2L0nkMn5M2L7Po7N4p9Q7n4K7o6O9
6924A2n4N0p4L3nP4l6J6j8M1n3k5R3q2L3j2rP3o3J6k1nN3k26J72m1K74l78J39
6953b3P3j7R7k42J63j21J38n4o5k0KJ8n5J35l5jl1J40q2L9k0m3j5N0l6J8k7l6
6981e0O1m2N3J5k5o%j6j2k6jK2N2n4k5K6M8j4%rJ9l6J8k8NN0o4N9Qj4k5N0p2M4
7015A1M1rO6r2j7L4onK7nk8l1pJ1N4q2j0Q1p7Q8j04k4P4m6N1K0q3L1Q5o1pM7k
7048B5O7r6M6%m7L3O3j42Q6O7p6o2L6%n1R1L8k4l0k5M8q1L3M2p6J71j81R7m7j6
7078a1O0m0N0J09j47qL1K8RM0j39R9m6m0J02l8m3j0n1J43k69J67k5M4j50K43q0
7105B8kk6J46j39k57J59K09j54K0L6MNPq5o6J86j74J88r0o5J38k04J98l18L11
$$ y = [6, -40, -43, 43, 9, 30, 49, -14, -6, 22, -29, -18, 3, 6, -32, -34, 12, 13, -59, -17, 13, 8, 6, 10, -45, -3, 34, 41, -26, 28, -51, 36, -18, 9, -57, 12, -42, 8, -66, -33, -38, 36, 0, 16, -2, 39, -14, -39, 54, -28, 5, -7, -16, 57, -6, 10, -11, -16, 37, -189, -17, -58, 216, -162, -23, 50, 33, 130, -112, 51, -70, 68, 14, -51, -71, -69, -51, -106, 29, -6, -7, -38, 102, 20, 59, 39, -4, -19, 31, -5, 13, -14, -50, 11, -31, 22, 37, 12, 6, 6, -10, -22, -48, -49, -27, 25, -29, -54, -28, 20, 6, 6, -3, 16, -20, -2, -30, -25, 25, -39, 20, 28, 14, -11, 39, -33, 11, 52, 43, 109, 17, 0, 34, 28, 23, 50, 45, 17, -14, -21, -10, 44, -38, -48, 33, -44, 44, -60, -84, -10, -56, -5, 15, -68, -37, 48, -13, -20, 27, 25, 92, -4, 42, 42, -5, 28, 91, -51, 35, 102, 26, -36, 0, 0, -51, 40, 78, 54, 24, -1, 47, -34, -1, 41, -35, 136, -45, 52, 5, -11, 49, 9, 59, 168, 21, 13, 44, 72, 81, 121, -18, 81, 35, -5, 97, 59, 16, 6, -45, 98, -171, -4, -29, 15, -135, 108, 28, 26, 0, 146, 7, -250, -91, 118, -36, -16, 20, 24, 29, 36, -49, -115, 71, -103, 85, -5, -70, 68, -136, 62, -256, 55]
7130E5o0o0q9L07k55J4L6k1J19Jj15P9j3J52q7n4p6K6K6J9M5j12m0M3j33K66m58
7157c85L42J30j70p4L35R4k97J17l6M4j04L5j45J59r2J12J41k17L0o4m44M57j54
7180a86K63k7j93N1Q9J33k86J95R0J2k21P6K07l73j46J71J73k62L29k47j28M62
7202A82j64j61MJ72l98L24R5O1j95J89p5j07M3R1k5qj00K17k66J32J02J66m24
7225a45R2j32K00p1mK37n34M42j12l57M62q1l47M44j10l34O84n66j0K92o6n8L16
7248B42j70J7k84K41J82n08J24K99q3j40m7J7J39R1J38k25k08L35o11M94J7J13
7270A73r7L1q4j05J7r1O5K05k78L1K82j76m0L0J7r3J17k08K52Q0j06j56J60r7
7294g1K17k17J46K3k02J31L7k6j39K53j67L9k9m4L7Q5n1q2J17r2PKM8K1L1Oo1
$$ y = [55, -5, -65, -154, 153, -102, -88, -52, -73, 46, 47, -68, 11, -2, 150, 63, 9, -67, -41, -15, 4, 49, -63, -103, -60, -193, 73, -385, -43, 87, -83, -157, 178, 272, -25, 92, 56, 100, -4, 31, -114, 45, -47, 65, 206, -11, 19, -45, -489, -32, -186, 77, 50, -143, -92, -3, 130, -156, 39, 129, 141, -80, -4, 203, -170, -316, -145, 28, -234, 95, -152, -280, 182, 18, -143, -139, 33, -365, -41, 54, 115, -80, 109, 34, -73, -30, 61, 36, 28, -72, 145, -121, 11, 113, 279, -145, -53, -185, 15, -56, -60, 177, -357, 85, -27, -384, 78, -3, -350, 94, -16, -350, 334, -232, -242, 50, -16, -74, 242, 72, 89, -195, 46, 228, -280, -156, 143, 60, -80, -127, -110, 29, 120, 258, 33, -175, 160, -451, 43, 60, 173, 76, 107, 23, -82, -65, -156, -91, 114, -164, -133, 149, -27, -67, -37, -20, -113, 4, -204, 48, 128, 22, -134, 26, -71, 146, -71, 75, 98, -104, 27, 64, 38, -101, 152, -15, 24, -5, -49, -12, 73, 22, -60, 57, -35, -28, -26, 22, 43, 74, 80, 19]
7321A9kl0m5L0N8r6J9MO2n0l0M5Q1o0k6K2m6pK3M0o3rM4k2j3Q3J2r5J4P6q8j4
7353f4L9K7q5J43j6j1Or9N0n0R5p1M4k0M4j0o8m1J61n5L4k8K7nn2k7Q0n5j6L1
7383Hj5J2J7n7J3J7nnk4K9o6Q6J9m7J1l9Q3n8K0lL8J3r2J0O8pk9j4M0l5M9op5
7416d4L1l6P2k8L6p1O4l6J5j6nJ4NRj5l4L7%Kj8j5jK7k3L8L1l0J1M8k9j5K2r0
7449d4r4J56k9J2K3q5J7o9K19j31J23P9k16K7N9m0k3PJ03k14M5L9J33Q0j25l35
7475b83L67p1%pLo4J22j95K26j21K07J9j95k7j37n8J44JJ81j23k88M09l23Q7J38
7500A2J16k14K95l93k13K30L31ln0L00l49j51o5L78m88K78R1k11J22m8j63K95
7522A00K3o3k05L0J21nJ4l7R3q1J58k39J08lL4%m2j9J4J8rQk9l9JQ9o4l0MPRo
$$ y = [19, 17, -13, -58, -28, 30, -66, -47, -43, 19, -31, -61, -16, 65, 5, -21, 1, -45, -52, -29, 11, -52, -61, -17, -39, -52, 31, 43, -52, -38, 38, -50, -64, -25, 2, -83, 60, 44, 33, 39, -60, -10, -60, 35, -36, 8, -12, 32, 22, -46, -87, 74, 19, 53, 25, 52, 47, -5, -32, 48, -7, -23, 8, -7, 5, 22, -35, -22, -5, -10, -15, -39, -10, -76, 10, 29, -18, -7, -46, 37, -21, -1, -4, 34, 47, -45, -35, 33, 26, -3, -17, 23, -12, 37, 31, -44, -13, -49, 23, -5, 31, -40, 24, -12, 3, -13, -18, -4, 1, 10, -5, -39, -2, -2, 0, -18, -33, -34, -7, -30, 8, 39, 9, 20, 68, 39, 24, 46, -44, -138, 18, -11, 1, 24, -61, -44, -113, 106, -25, 98, 177, -39, -12, 47, 7, -16, -9, 94, -120, -75, -36, 97, 177, 52, -283, 84, 13, 13, 6, 9, -55, 67, -128, 98, -23, 184, 203, 8, -19, -156, -214, -70, -69, 112, -11, -299, 110, -213, -126, 12, 128, -86, 209, -184, -397, -167, 164, 161, 111, 411, 62, -89, -154, 224, -264, 14, 105, -106, 16, -32, -195, 100, 123, 60, -145, -115, 6, 1, 15, -22, 71, -10, 148, -91, 17, 14, 48, 48, 6, -13, 1, 19, 10, 18, -11, -50, -49, 40, -24, -54, -50, -43, -34, -40]
7554d0P5Jj7j1m3J6LK8k4M8pj6j5M6p0K7kQk9L6m2K2j0M1o6j0J02q7JqN3Kk1K8
7588A9l3L7oj3L8l6J3k0K1n9L8K2m1K3l7O0j9k9M9pK0q3P9k9J9n6M3m2K8L9n2
7619a4M4m7N5n7jL9j9nmo1R5K2p4L0L6k0mK4l4j5rN3Kjk0J1k1k5RK1j0mNl3K6
7654fMl7N7jm5O5k0M3q5%M1l7L9p7N6J1l1L7qJ8J6l4J6k0M3j6n2M0j2rNM9o1L
7688hPJ3pJ3k3j5M7J8o4L3k4Pj2K4l4L7l4L0qk7N7l3k7l8J00l6M4j06O0j7M0L
7720B0J15r4n4J12k25K48j64J61k2l84N19k76M01l35k58M68l31K47j33j4n3L5
7742a7qL5p5O3j29Q6K2K5q1L3K3PK6K4jk4J7J1m3j1j0L4k3Q4l3p6R3p1N9k8o9
7773e7P9p2O8o8M4J9o1L1m1R6k8j02O6kOK2n8lJ00k0O1j00r6J25MJ0nL2j16L4
$$ y = [-40, 35, 36, 19, 8, -35, -19, -16, 12, -12, 36, 29, 13, -2, 44, -26, 1, -1, 7, -22, 14, -28, -6, -16, 25, -41, -51, 51, -36, -35, -43, 10, 12, -9, 19, -14, 23, 17, 4, 42, 6, 19, -1, 20, -39, -1, 21, -20, 3, -34, 26, 7, -22, 27, 20, 40, -43, 36, 7, 26, -30, 13, -29, -1, 38, -14, 30, -17, 38, -19, -20, 19, 0, -5, -9, -70, 25, 47, -27, 3, 39, 19, 15, 39, 5, -10, -19, 34, 36, 35, 15, 26, 5, -20, -11, 10, 0, -4, 1, -32, -6, -2, -39, 18, 17, -28, 37, 17, 60, -25, -25, 16, -21, 18, -59, -3, 8, -23, 14, 6, 24, 40, 6, 22, 2, 45, 29, -23, 17, 5, -4, 1, 50, -11, -8, -1, 12, 5, 18, -5, -20, 27, 45, -19, 14, -10, -3, -15, 9, -25, 12, -22, 8, 0, -27, 30, -3, -30, -68, 32, -4, 40, -66, -6, -23, 17, 20, 135, 41, -13, 99, -126, 122, -42, 119, 97, -287, 232, -44, 357, 22, -236, 232, -99, 148, 15, 1, -52, -17, -25, 10, -65, -2, -131, -45, -23, 2, -79, -46, -23, -16, 10, 34, 33, 9, 26, 37, -6, -17, -27, 7, -16, 68, 35, -41, 52, -19, 40, 12, -57, 22, -50, 18, -50, -6, 13, -48, -17, -58, 38, 10, -92, -26, -28, -22, 0, -58, -61, 39, 19, 80, -20, -116, 9, 13, 23, 18, 50, -66, -32]
7803c2N6o5J34p5q4J6P3o0J3J53k82K36m9n2N1j25J3J11k7l8L1jKM2n6o6O0k2
7831d3K0P4q3M8n5N1L8m7K02l10K14q9K2m2J02j01N3r3P0l2M7K6j41J38m7k8Q2
7858G6j45O2n7n8J34j7J10j94J64j72Q2J55n4O1j74jO8n1j20J46m5n7J24P1k25
7883a17K76M4k14O0kj52m2J91Nm0P1K7k61K54q2R6j33o1K27q6m4j93L03k4j22
7908a9Oo8Pl8J96o1K4J66k57N9N5r8J74n4Jop4RLK94l20q9J39J25o9Q0l63K29
7936E1r9N2J36j71l0J43l65K94l2p0J51l3rM2O3l72J62R5L8J43k78M8Q7qJ34m23
7962b51L90j18j81J64o7L6M7m0l7j53Q1Q2K82M1l54j48R1L9J56K2k1J12l25J56
7986Dm2m9N3j06J53N9k3m7j00Q0N4j01o5K76q2k7p7j70K94j79N2J8J14l01q1K55
$$ y = [-32, 24, -41, 93, 18, -66, -50, 23, -37, -24, 129, -153, 83, 34, -18, 33, -92, -79, 32, 5, -33, -2, -3, -1, 41, -15, -81, -21, -43, -23, 51, -32, 16, -39, 12, 50, 3, 205, -105, 109, 20, 42, 0, 102, 1, 54, -39, 31, -1, 46, 72, -69, 69, 22, -6, 76, -69, -7, -64, -122, 12, -5, 105, -89, 75, -97, -15, 140, 86, 147, -27, -28, 40, -11, -131, 15, -30, -87, 37, 108, -117, 159, 203, -11, 49, 47, -105, -147, 44, 49, 9, 80, 107, -154, 100, 18, 114, -19, -80, 147, 61, 17, -176, 127, 103, -19, -13, -81, -74, -112, 84, 23, 47, 213, -44, 15, 70, -28, 146, 92, 93, 87, 13, 22, 25, 319, -1, -90, 49, 174, 105, 185, -178, 51, -48, 4, 140, -31, -61, 82, -283, 11, -21, -91, 60, 27, 18, 60, 123, -249, -87, 8, 46, 189, -89, -41, 46, 38, 172, -251, 139, 21, -160, 4, -63, -27, 20, -20, -57, -210, -129, -47, 235, 276, -78, -226, -135, -96, 60, 82, 61, 173, -152, 4, -38, -87, -34, -140, 13, 72, 49, 2, -98, -18, 36, -65, -130, 146, 64, 37, -40, -210, 84, -95, -43, -25, 89, -212, -293, -38]
8012c8K82j80j2k86K94k01K36j05k6j71K69n8k4NP9m5j10nJ5L17l17N7J93j34
8036C5p1j57K69P4J21m30K46j24P6J2k5m2j15J59j88p6J51K53j50p9k8J41j01
8059d9J44j22o6r5K39j36J30k66L33p6M3L4k57J31j50Q2j76J31P4P6Q5k2J4k79
8083a78N4m7K62k63L10j34K07n41K23N5J60l0j32J69m09L01j11k7l3L16n9K5R4
8106B12k37K11m79J49k59K6M19j45j90j11P9O39j35k04J10j38K06k67o7k0J32
8127f9J41j18j72O51j74J10o35M02j31M22q35j35N38m9j41K22K99l24k5q6K92
8148A83l60K0Q0M1j90O9l8J27n7L06n40p3M71l63N57k99l6J21l74M79J2n34O23
8171B25j5r8n57J53J98k44Q29n9q52P10j52l59J12m0k18L17j98L79n3J63
$$ y = [-38, 244, 64, 52, -234, 60, -141, 95, -10, -36, -207, 62, 4, -20, -15, 64, 19, -91, -96, -81, 236, -81, -24, 169, 35, -36, -193, 76, 150, 271, -159, 87, -37, 39, 51, 26, -16, -131, 28, -160, -236, -85, 168, 18, -61, -89, 52, -49, 95, -27, -93, -188, 51, -85, 45, -221, 112, 36, 79, 113, -144, -13, -163, -81, -257, -126, -52, 24, 109, 87, 101, -178, -124, -171, 91, -172, 138, 4, 211, -330, -107, -52, 108, 78, -54, 115, -294, 7, -104, -131, -164, 152, 93, 118, 212, -25, 186, -293, -144, -403, -377, 42, -103, -293, -404, -325, 314, 179, -25, 85, -53, 153, -114, -181, -201, -69, 72, -46, -218, 433, 259, 369, -266, 136, 5, 427, -408, -543, -5, -54, -195, 27, 326, 2, -23, -109, 183, -177, -157, -77, -36, -226, -157, -195, -68, -125, 181, -359, -432, 39, -324, 233, -66, -102, 19, -355, 124, 136, -398, 225, 210, 112, -445, -292, -94, -338, 491, 432, -420, 290, 138, -221, -109, -149, -367, -50, -248, 131, 78, 241]
8191B41
$$ Imaginary data points
##PAGE= N=2
##DATA TABLE= (X++(I..I)), XYDATA
0@%%%%%%%%Qj6J6j6J6k4L2m0N6p1Q4j01J20j44J71k02K39k79L26l75M31m98N70
31C03o50P41q42R54j076J210j357J518j697J892k103K336k589K864l167L498l859
48b024M255m687N163n689O269o911P627q432R342j0380J1577j2974J4632j6634
62h866J9111k2267K6439l2250M0963n5637Q6561k61040K70731J31299n98404L73449
74b9911J72336k42303P954J04938J8349J23j58123J52550J17859j96719K268K19840
86A69161q6232j14923J18143L8382r7379O408K2689J3353n869o1982M0022Q4494
98A26267j24522j3963J03003o8004n7975L5985J739K055n2633N7J07228r4242
110c5005o8617J56693n1563j32322J19663M2308j33565M1058R9988o3565m8560
$$ y = [0, 0, 0, 0, 0, 0, 0, 0, 0, 8, -8, 8, -8, 8, -16, 16, -24, 32, -39, 45, -56, 64, -80, 91, -111, 128, -151, 175, -200, 231, -267, 303, -347, 394, -448, 506, -570, 640, -717, 801, -896, 996, -1107, 1229, -1360, 1504, -1663, 1835, -2024, 2231, -2456, 2707, -2982, 3287, -3624, 4003, -4429, 4913, -5467, 6110, -6864, 7768, -8866, 10245, -12022, 14417, -17833, 23130, -32507, 54054, -206986, 63745, 195044, -403360, -29911, 142425, -99878, -91924, 13014, 31363, 31486, -126637, 25913, 143772, -52947, -50679, 169161, 82929, -31994, 86149, 124531, 27152, 33560, 56249, 69602, 63733, 1751, 41773, 126267, 1745, -12218, 90785, 22781, -35194, 791, 2530, 4585, -48048, -47991, 59237, -35005, -103622, 53071, 1508, -130814, -11151, 31157, -102408, -61350, 38638, -24927, -73487]
121g3487R0696J8481q8310K5886O1110l8292m2518M5940M5324n3655k2986Q8120
133E6309j2390r1071P3734K5696r0346L4776L3198m6111K0810R806k7770L6043
145B2684j1349l6471K8997N171l1275L48K3472j472r434l278K1988J3080l8153
158a5692m087N2501k2201n8451O2640K9965o9266J6839N8045l3043l0898L4996
170B1348O374k5708j1703K0434Q360k3784N162J6224j0463l666N104k0326J1548
183a096O637l8695J8252L1016m0862o299M9316k1986k5859K2399M106q080j2213
196b3364K580K6337r824k5488M2827Q118m4031K5569K0516l2628M854J9324k0025
209e235J2522J1685k1257J6043J2880k3321k157J7976j1140j2126K341J0160M848
$$ y = [-73487, 17209, 35690, -52620, -26734, 34376, -3916, -46434, -494, 44830, -8825, -31811, 56309, 43919, -47152, 26582, 52278, -38068, -3292, 29906, -16205, 4605, 14411, -13359, 22684, 11335, -25136, 3861, 9032, -22243, -21895, 1577, 105, -9329, -12607, 9381, 22461, -15692, -19779, 32722, 10521, -47930, 14710, 44675, -24591, -7752, 50293, 17250, -13648, 21348, 27722, 2014, -9689, 10745, 19105, -4679, 483, 16707, 6244, 2578, 7682, -12644, -1096, 5541, -33154, -14902, 16114, -24748, -31047, 18269, -3717, -29576, -7177, -3071, -11151, -23364, -20784, 5553, -4271, -29759, 13068, 21186, -22845, 2724, 23240, -9388, -4534, 14790, -5235, 7287, 18972, -2285, 13758, 26638, 3317, 1160, 19136, 7996, -4130, -1789, 8371, 13219]
222A3219k2894O458K7834k1064k7890L4256L970m1322J2762K5359j8218j3014
234b0544K0483M876r384m522L299Q855r058j1770J3474J2329j7883K573J8300
247A1028o210m275o05L432M512q701j0318K2128P98k4746J8254J6177k1855n173
261e554K0363r976j0037N595r84L221l724l389J0452j15j2339R801k200j0320
275i206J0974r091k718J8398j1202j1116K3716m371j6842J2885O73n082l067M33
289e616P276J252j0185O381J3992j2759q405J2043N765j6771j724J5653j453j0655
303e206K990J3545n480j1009N277R283r973p941P351P232j649j5911J2779J8040
317A9328k5801q045L1080j1261k4901K0972O410j1768l064O761R742r140j1179
$$ y = [13219, -9675, -3217, 24617, 3553, -24337, 9919, 13889, -27433, -14671, 10688, -7530, -20544, -61, 4815, -4569, -9091, -5792, 3063, -5995, -17765, -4291, 8038, -9845, -7272, 11028, 4818, 543, -62, 3370, 7882, -819, -11137, 10991, 11789, -12957, 5297, 21474, -381, -5554, 14809, 4833, -5204, 391, -593, 2628, -1096, -4485, 5967, 5852, -6487, 3314, 1114, -9206, 1768, -7323, -10041, 8357, -2845, -13961, 9755, 5384, -11458, 1427, 2100, -2982, -6049, -5616, 1660, 2912, -7273, -892, 13100, 341, -8064, 3979, 9744, -7027, -8751, 6902, 5449, -5206, -2216, 11329, 5849, -5160, 117, 9400, -573, -8514, -1163, 6069, 4420, -11491, 1288, 19328, -6473, -14518, 16562, 5301, -19600, 1372, 7782, -3986, -7050, -289, 9453, 313, -10866]
330a0866J4416M360j8500L741J0654j950q498J561J3867n638j0688P764Q051j2245
344c971l739J1725n11q893O121O676q881O043n36p915J0892m492j1702J4493J528
359F838j4677J1332L912r158L426K05k118n65l6l328J838M565l727m520R558Q45
375D390j2972P766L887p985j124M797J871k163k818L965O672q178l581P957J856
390D340r497n56J1949l677q017O828Q511r565m499Q650P02q157p13Q182l841j574
406i34J949n56L688k052q035O769O424j6451L118J4050q972p285J0504L425p876
421b234j509L682M984p308m665J0572J886j0789L243J2000p835n581O974J834
435E254n581j010L181O93N55m850K993N425n682m949O618J406q710M89M923J4
$$ y = [-10866, 3550, 7910, -10590, -6849, 3805, 1855, -6643, -5082, 8785, 3147, -7541, 223, 8274, -3971, -7710, 4015, 3504, -5389, 732, 7408, -1473, 4570, 4034, -3881, 7011, 2519, -9183, 5310, 6838, -7839, 3493, 7405, -1753, 1673, 1878, -240, -805, -841, -4169, -2331, 2234, -1493, -6013, 3545, 4390, -8582, -816, 3071, -4914, -6038, -1241, 630, -1533, -4351, -386, 6286, -1892, -5473, 2484, 4340, -5157, -5713, 6236, 2559, -5458, 1370, 9881, 316, -4183, 4467, 5169, -2988, -3701, 4481, 640, -934, 1015, 459, 4147, 2095, -5940, 829, 7253, -9198, -6080, 7970, -1002, -8287, 2217, 5642, -2234, -3743, -61, 4923, -2385, -7050, 3522, 5408, -5381, -2138, 9862, 2027, -3554, 3420, 5254, -327, -1337, 1844, 2537, 3092, -1758, 1235, 6660, 978, -3971, 2647, 4053, -4657, -4168, 755, 769]
451G69n347l25O459M4q612N63J0856q417p516J0822K441j0089L987O875n172P15
467a947O20j017M263j435p130Q811N806j2599L225J1658n416q219P818M658p554
482A542l063N637M991q461l209J0564J353j3900L885J2239j1952o589J1581Q20
496E438j2254M993O779p050j621L853p55k940J410j068O0J008j207P59O01O82
512a312j213Q26p02P95k35j549K473O68j256k94L065m72j592N30N31L54j370k35
530i88O00L130k727k792O020J669q409O78J0568p631p490J0913M073j2667K295
545b758J1779o867o728O407N255p107l278O104K938n904k447Q912j280p483L148
560F91N281n755k547M282j234k40q17j656L024K067q123P18R142q197o126R978
$$ y = [769, -4578, -4903, 1556, 1600, -7012, -6449, 4407, -4010, -11526, -704, 1737, -8352, -4365, 2510, -2662, -1947, -1327, -2344, 1919, 484, -6646, 2165, 7971, -4628, -1403, 10255, 4839, -3380, 4438, 9096, 1542, -1521, 4116, 9107, 646, -2563, 8001, 9354, -4546, -661, 11578, -374, -6963, 4618, 5438, -6816, -1823, 4956, -2094, -3715, 138, -617, -3557, -2147, -3215, -3155, -2147, -3354, -2595, -1994, -1312, -2525, -1699, -2401, -1606, -1841, -3390, -917, -249, -1505, -1799, 1266, 794, -798, -268, 263, 617, -753, -988, -388, 2742, 15, -2777, 3243, 4912, -3497, -2819, 7749, 118, -7372, 3541, 7614, -5053, -2758, 9021, 2154, -4574, 1833, 7088, -19, -3297, 2807, 5745, -159, -2606, 6306, 5026, -2457, 691, 5972, 217, -2330, 1952, 718, 478, -339, -1995, 1029, 3096, -5027, -4309, 4833, -3364, -9490, 488]
576D88J469j0500L373P502m955l662K825L762l059l226K500N619m770l749R184
591B801k4o794M128M355n231J702J695k400M132p88l996N555K720q870L267O429
607H681o965k530N628K26n481J638K538j389k779L08K355k919k177K070M17l636
623d015K343N44l247K888M20m053J877L326m673l12M254l48k875P04M885j924
639b06l551L258M273m940k252O725q0n271J987N607m127k044L800k85j298p17
655H79J50K018j72m527L375K670m911q53L447P4m614Q87L456j586l412K035L435
672B351l566k118L298J469m804J096L403k392j041K047N30j414J294q92L24R77
688E62r24o18R61J118j229m53J715J014k442q83L004m79k781K90M447k932k739
$$ y = [488, 1957, -8543, -5170, 2332, -2623, -6285, -3460, 302, -2757, -5983, -3483, 2136, -2634, -6383, 2801, 2777, -4017, 111, 4466, -765, 937, 2632, 232, 4364, 3576, -420, 5135, 7855, -1015, 2252, 8681, 1716, -814, 4814, 5040, -441, 1197, 3735, 2346, -433, -125, 2230, -689, -2866, -796, -379, -4015, -1672, -1128, -4375, -1487, -1067, -5120, -3243, 83, -4590, -4902, -648, -996, -3871, -3167, 1718, -206, -3757, -499, 3774, -1166, -3418, 3307, 3227, -2044, -57, 5550, 1423, -621, 3179, 2894, 1596, 879, 1029, 3047, 2875, -1652, 1723, 4393, -518, -1371, 2076, 2150, -2464, -1577, 1879, 293, -3119, -1084, 2351, -1215, -3333, -35, 1434, -3370, -2274, 1129, -1263, -2304, -257, 273, -1141, 153, -739, -415, 562, -362, -980, -19, 1099, -130, -583, 1132, 2146, -296, -1179, 1825, 1346, -1435, -1145, 3302, 370, -2369]
705b369L832Q32l419k58L068j529q50k18J186J044k497m70L388mm609K507K936
722B570l242j718L011J159k922j24K049J551l491o69M224j022m054K275L366m111
738a148k30K756m46j257j0N27N55m78k350K739N78k775P89J933j144j013J060
755H6m62Q11j346p98K640l77k622J625K483l101j45K039o15r24J67L42M98K74
773E75k084K224J079k730K00K592j238j699J760k4J4p56j34J906o86k059J052
790hK690l549m13K702o19k083J215R48q03q2j407J723M07k204J14K589j422j908
808b110K439K43j202m38P01Q69o48j354J238J918l138N3L095n27k583J415J374
825A345j094o34Q8J873p34j769R40K451k330k009L610O5k892M07K215j040j823
$$ y = [-2369, 1463, 2295, -1124, -1382, 1686, 157, -693, -911, 275, 1319, -1178, -1648, 1740, 1736, -2873, -366, 2570, -672, -2390, 621, 1780, -1142, -1266, 783, 2334, -1157, -1826, 2398, 1376, -2678, -403, 2963, -1148, -1378, 1378, 932, -325, -335, 192, 747, 269, -2081, 658, 1236, -1539, -750, 1183, 39, -974, 86, -376, 435, -911, -1709, 931, 554, -2068, -443, 2040, -1061, -1206, 833, 218, -706, -539, -197, 301, 575, -1509, 715, 1794, -936, -736, 1856, 618, -1081, 679, 655, 669, -87, -221, 1685, 999, -1060, -8, 2682, -867, -1280, 1422, 803, -1280, -65, 883, 80, -2, -1409, 314, 721, -1483, -1369, 1220, -202, -2110, 329, 572, -630, -1068, -367, 502, -146, -1500, -262, 1656, -1482, -1429, 1666, 1139, -1444, -29, 1345, 251, -383, -295, 1578, 844, -925, 15, 2466, 136, -1873, 1737, 1802, -1090, -683, 1532, 492, -1331]
842a331R41J140K8k324Q30K160j844k375L008M90l339K152J175j341k44P05m28
859e97M64l46n60J847k77j284Q87J267j646M23J078r72L90j67k21O22K29j115
877B2O52P44j278L42K39l12Om06k88J229r03j643J934M80k014j71J978m81k182
896b052R13J879j365j719J954J177j999q34K566N93l423J359K238j158j544J840
912D25N90r24k85J11J456j230o66J540J47j447J98J470o01p39p9J103l61j011
930c03q2J303j89j642J121O98j183m09J374o58n24P13j006Q64J93j077p3J874
948I94j409r82J831J4j075l17J263J19q27p54J874P11l103R65K859k322k285M001
966A557m19l106J979J157j254n46P06R1N39j298m97K409j142j768J824J394k691
$$ y = [-1331, -390, 750, 778, -1546, -716, 1444, -400, -2775, 233, 723, -2616, -464, 711, -630, -874, -169, -597, -133, -479, -1039, 808, 531, -753, 134, 1401, -245, 178, 1256, 284, 674, 507, 286, 908, 1137, 22, 674, 1418, 140, 482, 721, 409, 415, 9, -279, 950, 47, -1596, 338, 818, -1196, -1367, 611, 130, -2052, -1139, 740, -625, -2344, -390, 787, -1212, -2046, 520, 1113, -2310, -951, 1287, 129, -1415, 425, 1015, 91, -194, -83, 1373, 143, -523, 1017, 1164, -283, -85, 1385, 784, 45, -34, 1069, 708, -303, -385, 918, 729, -913, 208, 906, -277, -686, 688, 30, -494, 219, -787, 77, 270, -807, -880, 994, -415, -1397, 434, 448, -627, -944, 319, 438, -389, -1143, 731, 1442, -1661, -696, 2163, -159, -2444, 1557, 1138, -1968, 11, 1168, -86, -632, 74, 165, 704, -594, -1091, 1318, 176, -1592, 232, 1626, -1065]
983a065M67J469q23k78n6N69L35o31j196K305j28k736K073J125k522N9K361j336
1001hj90O54l55R4k53j56J57O07j089N39J31j02P8m23L75J77j54j184J582J07
1021E87j369O68O08o84q88J364k34p0l45R7P14o70m37N16O99j339L88P96k13l68
1041a80k31P05J98n09p98J725r1j596R21J141j488n56J763l41r83K29N74K23j064
1060c58Q0J095l16j329R26O73j083k52P18L51q14Q8n5N90l93r84R88O75j182p35
1080a317J944n74j191Q28Q89q30n57Q45J87k74p93Q69P51j244j15J302j56j300
1098g36J163K07o08K04j8L4L09l27n56J353m79j009Q31M68r13k31Q70m28r0l21
1118b77L22L30o59l27Q51M0j345R80K25p68K68K14l09K99Q3q71J194o8j112O61
$$ y = [-1065, -598, 871, 48, -230, -286, 283, 618, -13, -1209, 1096, 968, -1768, 305, 1430, -1092, -1033, 1328, -8, -198, 456, 101, 195, -58, -214, -57, 550, -539, 0, 131, 29, 107, -316, 59, 236, 82, -1102, 480, 587, -782, -114, 494, -190, -1078, 286, 52, -18, -363, -266, 448, -222, -659, -143, 556, -783, -395, 401, 188, -180, -411, 294, 492, -17, -815, 910, 819, -777, 144, 1285, -203, -759, 1004, 663, -320, -91, 483, 706, -358, -278, 817, 501, -828, 98, 771, -312, -564, 154, 505, -309, -221, -276, 314, -79, -1063, -75, 600, -582, -1317, 627, 53, -1138, -310, 579, -251, -808, 37, 224, -50, -843, 26, 777, -467, -582, 720, 564, -736, 427, 634, 26, 230, 212, 246, 555, 228, -328, 1025, 546, -463, 368, 836, -77, -308, 562, 134, 44, -277, 45, 375, -284, -611, 240, 280, -1065, -85, 140, -628, -360, -146, -455, -156, -73, -944, 250, 182, -930, -269]
1138b69Q48r53l12J079k76j06l30M42N55q35l80J262L4j670J152R56j330l03J164
1157G28k93o50L82j84N53n01n44P90M24j292R9J302j000l77N10L79m92l96L72
1176a90N44m43q66J312J00j254M57R68p69m97J095l62j44J94j05KK09l08q2P08
1196E69o33P5J88p7pOk56L31L91j164N18P09q60m35J064j12r92N93K41j64l43
1217c58O7K47J46o01J1J047o91n86P31M78r03j26Q24k5m37l46J027n2r80K87J088
1238H48o87r45J342M0r03P3Q41m32l19J45J91J95o63J37O02l02o29O92J60p74
1258c88L63J51j29L9k5k65M27n8p19P36P1n38J56M99m18m9L23m15M69j50l52L70
1280I8L24p33J60O02n40j03J57K04j34q4k50O11j38q81Q58L67j051m0J092n98
$$ y = [-269, 579, -374, -686, 393, 117, 11, -319, 123, 678, -157, -537, 725, 759, -911, 241, 1197, -133, -436, 728, 435, -215, 167, -17, 536, 35, -509, 281, 705, -587, -488, 814, -186, -563, -53, 326, -166, -562, -190, 354, -89, -955, 357, 457, -797, -340, 628, -141, -638, 457, 95, -49, 145, 40, 42, 251, -57, -139, 569, -64, 11, 199, 122, 115, 121, -135, 196, 587, -577, -59, 650, -210, -645, 419, 307, -685, -92, 149, -15, -358, -291, -44, 102, -499, -488, 559, -132, -718, 13, 491, -412, -538, 286, 261, -176, -522, 505, 453, -527, -240, 848, 161, -784, 558, 598, -305, -232, 609, 177, -142, 3, 194, 389, -274, -137, 465, 163, -466, 226, 386, -388, -25, 126, -3, 36, 11, -254, 173, 115, -604, 132, 203, -335, -179, 320, -98, -147, 176, -239, 230, 80, -272, 98, 422, -311, -151, 451, -89, -192, -35, 169, 35, -49, -299, 312, 174, -707, 151, 518, -533, -573, 519, -79]
1300g9m80N09Q7j2l66R5M82p5q22O90O25j078J66P01j94n25M11J60n8q9k42O21
1322E27q0o41J97Q54q71k42Q18k90k76J01J89j86J01m51K91L15p31Q1N83l14n71
1343e96O70j65k42J59k01K75L3m21N2P41o89k81Q36k62l96K92L06l66K21j31J09
1364e6M07n41J7N35j38n97P10R7n00K57o5O2O8l00P9M75n91j40O89k04l32J07
1386C9N32l28k48J49k74M39m78o5M54j52m39N45l8o89J57L35J13m45K06J0L19
1407A42k27m02P53k00m86K96N90o97O6K10J9j62p7K61O8j68l15O20n2n53K93L77
1429C56l77j13L59j55l8q4pL60k64k62L33K82o57K32L24l11j07K03Kj76K37k52
1451a15K11O1l47J33K19j69j69K47j43J57j46j99L76K3m59J48N59p10l3N81k08
$$ y = [-79, -559, -50, 37, 25, -341, -246, 236, 161, -661, 29, 654, -424, -258, 443, 249, -276, 135, 295, 237, 148, -94, 527, 447, -194, 3, 857, -14, -256, 562, 272, -4, 97, 286, 100, 201, -250, 41, 356, -375, -294, 289, -25, -596, 74, -91, -333, -174, -375, -100, -67, -488, -436, 305, -384, -665, 171, -91, -487, -195, 111, -255, -34, -165, -56, 351, -190, -173, 362, 224, -373, 337, 434, -66, 191, 126, 188, 256, -44, 35, 510, -81, -221, 468, 264, -68, 39, 571, 243, -5, 144, -130, 309, -169, -234, 220, 68, -371, 174, 136, -553, -396, -61, 52, -393, -187, -177, 142, -85, -487, 266, 66, -420, -124, 466, -231, -165, 45, 64, -98, -175, 86, 154, -14, -329, 291, 239, -314, -21, 356, -21, -134, 225, 70, 32, -52, -59, 301, 37, -225, 108, 390, -267, -35, 289, -22, -129, 74, 76, -100, 137, -115, 96, 157, -190, -57, 162, -7, -176, 71, -72, 85, -61, -260, 116, 139, -320, -172, 387, -323, -356, 225, 17]
1472A7l38K16K68k89R6j71L93m4m72K28N62m47m25P86k00l47K01K32j69j15L4
1493A6J40K14n81J20N43m12m35O37J26p31K89L68l65q1J93p5Jr0j27L89k00k10
1515b71K99J7m13L00J50l98L81j40j30K41M4l32K67K02m34K04J31j00J7m6p8K91
1537B02j32l33N19l9l68J20L22l12n5J88p6J40k57k4L48j32m69M76L13p99K28
1558a40M36l45k08L41O5k05j9o0L96l03j98L52J67n16J67M22m31j3J30J6o3%o7
1581g6J42P5l85L07J52l61m2L13j69j37J83j44J32p1j37J74J39l67R2L22l35N0
1603a43O4K1p4J10j21N3K53l29O6K59j57j83L47K1k62J94m0R9j48j3R0K23l51
1626b1j5M29k92k04K96Q5l66J66N8j01J17j91JK02j60k81L95Km36K35J03j53r2
$$ y = [17, -321, -105, 163, -126, -30, -201, 192, 148, -324, -96, 466, 19, -406, 380, 180, -167, 34, 266, 97, -18, 16, 156, 370, -211, -91, 452, 40, -395, 242, 368, -363, -74, 294, -71, -152, 41, -34, -33, -123, -250, 139, -61, -271, 28, 45, -368, -68, 82, -316, 65, -75, -205, 36, 80, -252, 15, 217, -217, -13, 118, 18, 35, -11, -89, 202, 70, -263, 256, 217, -151, -31, 291, -21, -76, 112, 36, 176, -81, -105, 243, 111, -358, 118, 431, -368, -140, 296, -49, -257, 84, 149, -56, -75, -135, 261, -42, -240, 112, 279, -237, -70, 352, -79, -92, 38, 54, -9, -9, -76, 66, 141, -244, 63, 215, -146, -188, 125, -44, -181, 2, -142, -10, -81, -218, -44, 95, -272, -180, 142, -193, -143, -79, -58, -132, -22, -143, -90, 163, -166, -100, 159, 2, -181, 166, 187, -75, 119, 79, 178, 30, 17, 107, 330, -21, -36, 393, 101, -103, 193, 278, -88, 78, 136, 35, 152, -39, -38, 164, 4, -277, 118, 120, -316, -81, 22, -131, -223]
1649b23J81j06P4j69J6L01j68k12L37M5l85K46J77k14K2O0O1L6n9j36L16o4l07
1672a71K92J25k46j35L10j75K2K9m0P8r8j22K26J94n41NL74m62L15N3j37J00j35
1695a39J3O8J61p2m6R4l19jK26k0j97K60J37M8r2j27M4K46l34N1K11j28j29J07
1719F2k4p6J01j10Q9rk35J67J81l30j00L39j24j47P2J08j08p2M9L3J30k60J22
1742a42K58k44j37L62J4k97J96R0p7pj7J08m4j6%K51k74L6K52k08n2PJ54k15J37
1767A35n0n9J25j59p0J63p6k63L67j36k05J08J73k97K38J3l12K15J32k80J99J81
1789A42k83L6K3N6nn3L6K06j80j49K34J36n02L75pj57j46K58K34k34Jn7K84l27
1813g9q1K05J52m12l9M13r3j57K50k57K18k46K00K58k66q5J64J9k71Q7J60Lk16
$$ y = [-223, -42, -148, -74, -243, -227, 74, -94, -306, 31, 76, -309, -63, 114, -100, -78, -18, 43, 79, 20, -116, 200, 136, -171, 121, 246, 0, -135, 175, 0, 22, 51, 11, 89, -9, -131, 95, 289, -252, -247, 127, -335, -20, 33, -104, -4, -139, -126, -58, 103, 31, -15, 79, -240, -241, -15, -35, -232, 28, 165, 213, 121, -6, 38, 284, -50, 1, 212, 84, -45, 62, 38, -38, 63, -47, 42, 33, -202, -35, 146, -184, -284, 55, -69, -216, -144, -36, -144, -216, -167, -134, -4, -264, -142, 116, -128, -265, 97, 111, -186, 10, 100, 23, 16, -1, 107, 63, 47, 47, 298, 24, 60, 312, 104, 52, 59, 213, -2, 135, 85, 26, 151, -8, -78, 85, 9, -254, 113, -23, -228, -120, 53, -244, -6, 7, -305, -90, 42, -238, -39, 142, -141, -105, -82, -26, -31, -84, -48, 158, -22, -171, 63, 199, -303, 72, 65, -92, -238, 20, 254, 20, 21, -36, 248, -79, -160, 45, 197, -215, -254, 159, 66, -91, 159, -98, 120, -126, 74, 332, 66, -19, 145, 164, -107, -20, 140, 143, -73]
1836g3m2K61p0m3j74L20j15P9q3K32k79j34J52k88K31K19l51P1J36P9j74q6%r9
1860b31K64j1pJ76k71j79L39j78NK67p9j07k66M92J8j52P0k68N97m36j22K81j08
1883I4O6j28r7K47K3j47l31J11O15m25j05J33j29J86ll63O18j57j41Pk31M6J23
1906A2L3k54l0L05k03P9jn2N0rQ0K5j25J45m2J38k39J68p8R1N1q2L8L6j11n3J81
1933A53mj49N8q1R7q7J14j17j3K7j57J79L1j16O0K01l33N4J92j75k7k4J5J51q2
1958c3j37J12J02j54M3R1j10O0j0L6K2P2k12J56M5j29K8J43j33l1J14p5j5L1L5
1983E1m8K0j22R5J24j75K7O0J4q9Q1no5N1r5J14%r8J1J72j82k0K13j43j02J17
2009FQ5j25P0n3J5K9p3O5L9o0m0J69j13j40J32J8m1L9l7n8J27l6q3J37p6p4P7
$$ y = [-73, -115, 146, 76, 33, -141, 179, 64, 143, 60, 292, 13, -121, 31, -257, -26, 193, -158, -87, 49, 128, -46, -132, -132, -231, 33, 22, 15, 191, -80, -259, 80, -98, -93, 174, 95, -12, -278, 214, 232, 80, 150, -118, 479, 43, -79, 202, 94, 160, 32, -65, 182, 205, 58, -273, -162, 453, 28, -77, 56, -73, 113, 110, -253, 365, 208, 67, 74, -157, -111, 12, 45, -209, -239, 66, -137, -58, -59, -111, -61, -70, 10, 35, -90, 55, 13, 151, -88, 80, 2, 93, 144, 62, 100, 136, 25, -28, 153, 149, 0, 58, -23, 74, -13, 101, -16, -29, -2, -159, 20, 51, -65, -5, 196, -137, -83, 109, -66, -93, -117, -102, 49, -33, -170, -58, 44, -110, -67, 24, -86, -26, -36, 0, 22, 94, -118, 38, 83, -46, -18, 125, -8, -39, 75, 0, -15, 16, 51, 3, 23, -99, -4, 120, -55, -28, 32, 46, -43, 38, 33, -32, 19, -76, 38, 38, -60, -49, 123, -59, -79, 134, -9, -111, 6, 91, -34, 36, -17, -2, 27, -46, 19, 58, -2, -42, 127, 14, -126, 6, 24, -17, 22, -15, -73, 54, 18, -65, 72, -4, -78, -1]
2036ao7o2J46o3o3J16r7M1Q0j1j83K12m8j30J42J1m8M4ko3J38o7j12J77m9j27
2062h6O6J09n6m4M4m5O1m1pR5o1j02J69o1j32P0J01j10n6J65r1l8N4JM7o1o7N5
2090b1M5j70J33O1p9l2K4lm0P2n2L9nk4N1Nm6k7J42j64P0Q8q7J0RNm6R9j15O1
2120CN1m4%n5Q7j1J0j16Q4P1j61J35K1k5j46K12r6j6nn1R8n6MM6M8j14J7O4r4
2149c9QR7N4j57M9o3N1J4n9O5Jn3JK1KoK5K4j12M1P0j07M8k4lO2jm9O3pr2R5P
2182B6j9J3m1J5j5N9q4Q7l0l9N5j4m1L2L8o5O7k0k0oL3p9Q9N6j23K6K6q2O7K7
2212C8l4j1L8j04M4L1m6O2O4q7j6M6p7N7qOJ7J9j8j3M5r1P9K6j01K6N2Jr3R3j14
2243f9O5M3q1l5J25o9j0R4j45P8lm5OM1p4M0Q6r1L5O1j08L0R2k5l7N8l5Ll8J8
$$ y = [-1, -68, -130, 16, -47, -110, 6, -91, -50, 30, 19, -164, 48, 0, -130, 12, 23, -25, 19, 17, -46, 92, 25, -87, 90, 41, -86, -20, 89, 33, -11, 33, -12, 49, 8, 1, 96, 35, -67, 102, 41, -91, -21, 80, -30, -86, 79, -12, -50, 4, 5, 52, -9, -76, -21, 24, -146, -13, 48, -31, -63, -39, -42, -82, -10, -62, -23, -28, -52, -1, 4, -42, -69, 73, -91, -21, 67, -20, -10, -1, 4, -42, 57, -58, 3, 54, 10, 10, -45, 42, 31, 41, -75, 9, 80, -81, 54, 75, 50, -96, 116, 20, 4, -1, -52, 46, -10, -6, 40, 88, -26, -9, 55, -39, -31, 66, 120, -37, 12, -51, 0, 14, -45, 20, 21, -32, -31, -10, -8, -14, 11, 35, -77, -36, 34, -73, -25, -49, -52, 10, 9, -40, 23, 16, -76, 19, 26, 7, 20, -21, -6, -21, 38, -46, 41, 11, -28, 27, 13, -28, 4, 42, -23, 44, 24, 4, -2, 31, -48, 41, 97, -26, 0, 26, -56, 11, 38, 4, -7, 31, -73, -29, 2, -44, 18, 82, -5, -21, 25, -52, 5, -3, 3, 20, 39, 21, 8, 53, -38, 41, 67, -34, -8, 44, 45, -48, 45, -69, -4, 39, -42, -77, 48, -21, -31, 63, -82, -4, -7, -52, -46, -5, -79, -39, 47, -44, -9, 52, -56, -26, 66, 41, 4, 62, 27, 30, -8, 10]
2273A0j5M8n9L9j5j8j8J01j6j49Q0j3%j1L7j2M9m0p9J27%j56J18nn9O5p2KQ8n7
2303c0J0OnJ4J2j8m0N0J9kL0l9k2L6J3q9P4Qn8R8k9j27L0J28o2p7P9n2O4m5K4
2334@K3J1j18Q7N8n5k3k0L2KOl8P8o5Qj0O4p5M7Mo4R1l9m3N8m4N8o1J07q9O1q9
2366c8J3%K8m1M2J6q4Q2op8O8No8P7OLn2L0J1l7J5k1l2P1l6LJ05q3m1R8n3l8M5
2399A0lk4km2L2L8p0P5J2jq9Q4n5qQ5K2j51K7%L8L7j7j05K06k72J56M4L2m3m7
2429c1p3PJ8l9K31j8M6j16J94l51K6K33j70L1P9J75k19K79k62j71K42q6r9J56
2453H2P0j76p9J24j25K23rk36L06l23J20rO0n2J00o8r8k4L72l26M7P3n6j84J89
2478AR7L5r0l7r9j42M73m70J27L68l86j14j59L54j04L79j60N0k61K65p4k88L52
$$ y = [10, -5, 43, -16, 23, 8, -10, -28, 73, 57, -92, -12, -25, -25, -36, 1, -11, 38, -2, -81, 46, 46, -110, 8, 3, -56, 9, -63, -61, 27, -30, -20, -14, -19, -5, 7, -11, -51, -1, 18, 16, 46, 7, -15, 21, 34, -55, 19, 27, -31, 67, 38, -89, -59, 69, 7, -70, 9, -43, 21, -24, 0, 23, 34, -84, 3, 61, 6, -17, -37, -5, -3, 3, -35, 43, -22, -14, -24, 40, -35, 12, 16, -48, 43, 4, -39, 19, -25, 33, -28, 79, -10, 51, -38, -25, -25, 3, -38, 4, 20, -64, 18, 12, -66, 2, 7, -61, 16, 22, 25, -27, 3, 14, -23, -8, -29, -61, 10, -26, -23, 82, -1, -42, 56, 3, -35, 10, 7, -17, -19, -61, -29, 9, -61, 14, 26, 25, -64, 20, -35, -43, 42, 64, -87, -60, -60, -22, 15, -2, -107, 99, -173, -17, 27, 59, 16, -31, -104, -97, -79, -118, 113, 95, 141, 25, 219, -132, -106, 127, -43, -12, 67, 242, 23, 302, 40, -131, 111, 25, -74, 82, 152, -24, -103, 21, -104, 119, 110, -126, 180, -143, -23, -32, 28, -24, 76, 8, -90, -114, 258, -68, -21, 52, -4, -188, 1, 98, 133, 43, 6, -93, -235, 238, -232, -105, 263, -123, -237, -396, -42, -146, 233, 73, 123, -138, 127, 53, -235, 117]
2501A17j20l74Q44o11p1K39k31J75J06j9m6P8k23k7J47N6j09N6q7J52j77J49j82
2524a58J47P9J8j56Q7j4N3q4j5k12J53J00L2m7l5JN6k0k3K1j2L6L3m7k4O3pk7
2552bpO2o5N4lKl6rL1q9O4J2j7k9n0J27q0jN8o1N7J6m0pJl0N2J8l5K3J9m7QM5
2586D1k7%jpN4n1J8qRj07l3J12L2j09P0L6o4J35j64o8K17j06%mM2m5N3q3O6l7
2616b9M7K4jLj47J34l9Mm9P1q7K07L2k41J02j0J45q2o6j26J02P5J3p7J55k9j32
2643aJ91R7m17j5L10q6j34L6K2M06m96JJ12P5M8K06k25Q5j28J5k05qJ91m9Q1j78
2669f6J65j23j4L3j03J58n2k2J36l23J31l4K35l87O1K81q9p9J67nl72R5K75k24
2693a56K97k09L76n66k5L81k07L16j03j25l84M07K0k9k73O65k72K86l67k50L7
$$ y = [117, -3, -377, 467, -144, -215, 24, -207, -32, 74, 55, 9, 87, -136, -163, -16, 40, -69, -13, -100, 52, -125, 24, -158, -11, 68, 86, -70, 17, 3, 56, -28, -43, -255, -102, -2, 30, -17, -52, -51, 5, -15, -38, -17, -29, 7, 40, -7, -31, 32, 25, -2, -9, 53, -12, 42, 39, 41, 5, -4, 27, -62, 2, 14, -3, -32, -82, 45, -35, -36, 22, -39, 18, 34, -6, -13, -12, -42, 10, 28, -7, 16, 35, -12, -4, 41, 14, 14, 13, 6, 60, 9, 27, 19, 28, -79, -112, 0, 32, -77, -7, 29, -35, 100, -64, -132, 85, -21, -21, -25, 17, -28, 25, -58, 8, -29, 18, 42, 41, 44, -103, 31, -8, -4, -53, 18, -69, 138, 170, -71, 31, 21, 166, 84, 18, -108, -6, 69, 82, 5, 160, 131, -1, 190, 287, -130, -145, 165, 79, -55, -19, 3, 409, -87, -86, 26, 101, 149, 355, 130, 215, 87, 102, -103, -111, 80, 31, 112, -66, 99, -24, -38, -5, -108, 50, -2, -24, 112, -211, -80, -114, 121, -266, -205, 76, -13, -92, 75, 70, -302, -207, 68, -156, 141, -68, 308, -258, -283, 98, -109, 207, 104, -21, -405, 2, 22, -7, -280, 385, 113, 399, 32, -218, -181]
2714a81O56n21k16J23OO3K33j85M50l29l6N7j04j19l2mOO4j38L01k59j13K78k16
2738b16ln2Q3L92k32j5j29K59jO5q8Q7k07K08J6k73J36p5l08L30J13j09O2K9k13
2763a41P2J87l02L28q3j56j42K17j80j4l5L87p9p8k08K79L85q26N89n64J71K99
2785A06j13J47j45j73N9K59n9j30J75j10l0lJ04K0k36J52j70K63k02l2K30j25
2807a3l07L39n1j4J14k61k8O4j71L75k18K45j99K30n7L04k88k99M29k23N3j2K30
2830B42q1j94r7K3n9K64m80M67p7J49r3M3K71k48p7J52J10k26jk38K47k36q1K23
2854CL2N4Q7n0j94jj28J63j71K69L24o25J37L50l02j82L10m09N83k02j35L23k13
2877B3l8m1M4p5K76M0o56L83L31l73k25Q1m2N08n8k13l05M25j82K32k79L1K17
$$ y = [-181, 475, -46, -262, -139, -133, -70, 163, -22, 428, 99, 63, 120, 16, -103, -135, -139, -133, -69, -207, 94, -165, -278, 0, -216, -219, -271, -188, 204, -28, -43, -172, 87, 86, 151, 63, 150, -57, 151, 167, -106, 30, -45, -353, -23, 90, -19, 43, 72, -141, -69, 118, -184, 144, 61, -95, -237, -20, -200, -214, -249, 138, 59, -19, -227, 52, 437, -389, 200, -364, -193, 106, -7, 140, -5, -178, -119, 140, 81, -49, 126, 16, -14, -17, 87, 107, -129, 23, -147, 116, -86, -118, 112, -13, -320, 19, -32, -46, 68, -193, -221, -157, -328, 47, -171, 74, -125, 105, 48, 352, 64, -235, 194, -29, 24, 12, 242, 161, -33, -130, -107, -166, 98, -382, 85, 8, 157, 64, 107, 378, 130, 53, 205, 315, 89, 88, -150, 97, -139, -220, 3, 35, 89, 176, 126, -68, -69, -197, -34, -205, 64, 388, -237, -100, 250, -52, -234, 76, -333, 250, 48, -87, 236, 23, -15, -56, -12, -87, 189, 229, -427, -44, 287, -86, -311, -230, -272, 236, 178, -35, -340, 85, -97, 135, -144, -113, 104]
2900A04L35n35j17J30J71j99J66l28L78n9l5K66j3n57L70K06k35J03m24M73j65
2921C5k26R0o9k52M30l2q6O9j36K00J85o12J32o2K00J08j35j77N91j19l3l0J23
2944A94k19K1K36J9k84J61j73J10p5J3j59r8J86J96l28K33r7k9l1J10J61p8j34
2967f5L7k2K4j91J39L9J96j18P4k6Q3k08l5J25r4J40l05K27Rk55N79j59k34l5
2991g5R9j43K7R3j09M6J1K39o2m19L58Q8k45L0J34j14j60K86r0m7J02q9j05K03
3015E8j90L51l39K49l12j5M11l07M5O4o8j63M75k03n34O71O8k36L45m68J19K77
3037B98l07m2j06K06l04K29j41J71L56l16Q9L55n75O6N1Q6j65Q4R2j27j48J33
3059a5K50k26j89K32lm2q1j6J51j29n5L24j24j03R7k29K0j3L14k69J03k18K52
$$ y = [104, 439, -96, -213, -83, 88, -111, 55, -273, 105, 46, 11, 277, 264, -293, 77, 283, 48, 151, -273, 200, 35, -191, -101, -170, -422, 8, -24, -110, -41, -177, 23, 208, -404, -272, -334, -134, -26, -161, -338, 253, 134, 101, 71, 194, -25, -4, 232, 251, -33, 128, -45, 65, -10, 3, -156, -254, -68, 128, -200, 33, -64, -93, -124, -14, 147, 69, -65, -28, -50, -26, -217, -78, -39, 157, 39, 113, 87, 170, -38, -73, 52, -42, 98, -207, 20, 29, -226, 353, 194, -40, -75, 24, -119, -92, 1, -108, -62, -51, 188, 126, -293, 65, 153, -92, -62, 72, -42, -202, 84, -6, -53, 49, -40, -145, 58, -132, 219, -120, 129, -183, -198, 213, -94, -49, 15, -53, -216, 259, 56, -478, 193, 261, 25, 370, -98, 21, 298, -9, -51, -157, 49, -255, -26, -167, 4, 360, 44, 133, 488, -87, -21, 30, 116, -49, 35, 127, 0, -148, -15, 235, 9, -180, 52, 49, 7, -74, -90, 61, -68, -123, 201, 77, -26, 71, -158, -138, -151, 163, -106, -3, -221, 31]
3082C1j42qL2J43j26p9L6K60k73j6O1J92Q2j55kj84N7K17p2q1pq1M7K51k79K53
3108A57K4j20k54L9K00p3J40j05q9j8J32P5L4k30J05LN2q3j29L76l33J02k14K13
3132DJ42m4j95K96k22J35l73N8P8o4N88m29q1J08J10j09R9o5L0J05M4l83K50J29
3156B11j2l09l2M60m55M12k44M6j20j22K4k5J15q2k05L44j46r8P37n43J19j01
3178b6J8Q0j28j19K6K9N9J24j19J18j09L04N8l79L34l42K0J40l7j81J23J48K3
3201A64K2k75Q8o6J18K2n5r9M8q7J06k2N7j23N1J06kl0p1PNN7n3R1o5N9j14J14
3229E3l5q6J14j4p3K0mK3J33k24P8R1n7k6o7N0K1j00M04j52k53J20O0k21J95k21
3255a71K45j76QK11n59K93J24j3o4j06K26j91J31j09K58j18n1j04J77J8k2oO0
$$ y = [31, -111, -119, -87, 56, -70, -149, -113, 147, -126, -142, -81, 111, 193, 38, 36, -148, -91, 126, 54, -27, -34, -115, -68, 183, -96, 157, 181, 61, -193, -154, 46, -27, 113, 8, -81, -99, 33, 108, 142, -88, 17, 20, 72, -11, -140, 236, -97, 5, -209, 4, 146, 102, -93, 203, -19, 116, -257, -199, -121, -185, 403, -26, -107, 1, 111, 2, 101, 36, 66, 171, 215, -168, 82, 211, 199, -110, -142, 318, -137, 275, 31, 77, -43, -165, -141, -166, -51, -133, -338, 6, -140, -238, 499, -44, 75, -26, -8, 72, -56, -175, -149, -120, -61, 63, -56, 62, -47, 257, 315, -64, 270, -72, -52, 88, 51, -130, -7, 141, 164, 186, -89, -1, -67, 51, 73, 18, -81, -33, -120, -14, -36, 21, -102, -51, 55, 53, 23, -48, -41, -36, 21, -32, 59, -6, 53, -61, 53, 18, -68, 46, 32, -41, -21, -25, -2, 131, -93, -15, 76, 19, -7, -74, -24, -3, -103, 301, 149, -104, 16, 76, -145, 50, -171, 74, -102, -94, 117, -442, -149, -25, -38, -102, -208, 18, -173, -42, -151, 107, -11, -62, -166, 11, 29, 7, 1, 61]
3278F1O5k76J54j08k8K45j20r7P4O2l9J98l01J32K3j99J3J64P6o4j39K89K26m34
3302b3P5j67K75m06K85M8p5j45K01k71O8k4M20j76k83J07k5m6j48J36k25P39l00
3325D0k02J38k5j42K38q2l06N63J87n31Q7l46J16M04o09P60n53J93Kr3LN31m26
3348e3j58J7L56j91J39m73Q37j37n22L26L36m03o73J003p37L89l1j75O2K54J0
3369A76K22j2p25K44m7k3N03o73N53J13O1q59K74mp3K6R61p88l12Q15j71j85l3
3392D3J58j58o5j33K43l72N0P0N8p7L0P2K88q5L27l23p3m8p0L75l26J68m8j53
3416d9J70j87K34j60j20K48M2k73J6l3L06p74M47l1j30J79K24j06l91M07j14K10
3438A15r4r1n6j67K08r9L10l07K65j20L7J07j83O4K21p5p3J94k47%q4l5j48L07
$$ y = [61, 126, -150, 4, -104, -132, 113, -7, -104, -30, 32, -7, 191, -110, 22, 45, -154, -141, 23, 99, 35, -104, 185, 411, -23, 52, -115, 160, -246, 39, 87, 12, -133, 68, -203, -135, -159, 261, 85, -198, -91, -116, -162, -310, -174, -399, 340, 40, -162, -24, -49, -191, 47, -35, -341, 222, 409, -122, -35, -381, -265, 139, -470, 290, -263, -70, -68, -161, -158, 373, -53, -211, -194, 162, -29, 110, -363, 474, 337, -185, 141, 477, 74, -599, 404, -333, 56, 25, -150, -88, 166, 176, 398, 386, -339, -95, -142, -165, 338, -335, 218, 331, 392, -467, -193, -197, -270, -244, 717, -71, -383, 432, 261, 76, 43, 201, 43, -22, -155, 88, -284, -234, -164, -106, -183, -153, -81, 207, 122, 449, 126, 53, 5, -65, 310, -16, 152, 104, -49, 121, -66, 168, 8, -112, 136, 178, -95, -79, -112, 194, -580, -133, -164, -294, -115, 109, 3, -388, 19, -95, 115, 21, -70, -126, -293, -85, -184, 126, -181, 84, -36, 1, 108, -75, -11, 210, 135, 62, 256, 9, 9, -75, -110, -258, 49]
3462D9J17J52l40k88L4N91k26j11K21k19j59L75L8m24k1M0K80k11l6L1R0k37M47
3485A93j03l12K93O9j30Pj12k18N61l28J11l79P44l56K1q3K08l90P2L61m57M40
3507B12m41P1K23L6k08J40J36k38J73q7M2j5rj1l1L76n57L02J37n42M61l56O37
3530D51n67M94l75N0oK0p2J67l66l94O46n6K49j97J59k62J88K2j65J9k33K26O
3553DL3l67M14q5N9m9k82K8N3o7N10l29K05m7l35L76q2k74L08j16J6J49k04P7
3577eO2k49J93J26j44M4k10r0J36R1J02K34m93J70J36m08L56l15O8M35l57L35
3599B17k73J77k25R8j10J11P8l21L32j69O7j43J06j96L20k08M33l72K06k07K40
3620A61m88N74K2k77k4J54J06Jj42K17j65j38k01J39J33rMJ0j15Q4p9O6k27J54
$$ y = [49, 166, 318, -22, -310, -276, 315, 89, -22, 199, -20, -179, 196, 234, -190, -211, -171, 109, -102, -138, -107, -17, -254, 193, 90, -222, 71, 140, 10, 17, -95, -313, 248, -80, 31, -348, 396, 40, 61, -22, 186, -204, -132, 229, -228, 212, -229, -158, 65, 101, -107, 33, 169, -69, 104, 17, 59, 44, 35, 24, -7, 369, -188, 114, 251, -291, 170, -186, 451, -116, 378, 3, 53, 47, 67, -5, 162, -204, -598, 48, -8, 241, 44, 203, -59, 129, 151, -14, 5, -228, -2, 4, 37, -330, 84, -1, 58, 9, -273, -245, -192, -259, 251, -78, 127, 80, -255, 121, 39, -235, 73, -43, -27, 122, -82, -5, 57, -192, 1, 127, -17, 27, -183, -273, -137, -46, 56, 290, -203, -33, 103, -305, 51, -264, -196, 239, -118, 217, -56, 121, -104, -6, -116, -5, 73, -248, 84, -85, -18, -161, -55, -251, 69, -139, 294, -78, 128, -79, 161, -327, 247, 269, -8, -32, 122, 228, 229, 87, 304, 139, 1, -200, -61, 72, 63, 67, 77, -38, 46, -33, 33, -194, -40]
3644d0J22J53k51p3J66J04O2k93L84l87N3K71k41j83n7J85P6Q8j13K9j9l81K87
3667e8q7J17K55j59r9k4M6Q4J65k52p3K98j06k04R0P0m5j72J99K77l55j40L5L14
3691A76k32J41L16l41j56K75kj72p1j5K25k63K20k60L0K56q7m7j94K49M3j15K69
3714B45j94L90n68p2J07j00N55j60j97J49j93J63p6q6j24K89k99K26J8k38J28
3735c7J32k30J34j25L21l85L14k68J25l6J06M1j25J65r8j56J90o6J6j4K3Q3l30
3758b20J0J98O8k80J50o0J92j12mj46K98j44K11k24j23L93k63J30O9k52LL4O3
3781ij13J61K51p07M94K16p47N09K26o1m04J02n31M59Q1j1P7j5%POP0q6j70J60
3806c5J71j41L9J2J10j31J57l47L12j67mR8j5Pj15K7J47j56k3q4L23j70l11N69
$$ y = [-40, 82, 235, -16, -89, 77, 181, 243, -50, 334, -53, 0, 271, 30, -153, -210, -25, 51, 139, 26, 55, 36, -345, -58, -145, -28, 227, 68, -31, -55, -9, 75, 240, -12, -85, 213, 107, -97, -7, 63, 18, -154, 45, 322, -33, -173, -138, 176, -56, 85, 401, 60, -96, 179, 177, 5, -66, -81, 144, -119, 101, -159, -129, 127, 40, -7, -201, 48, 91, -24, 245, 51, 441, -127, -199, -92, -192, 363, 203, 6, 155, -38, 125, 49, -37, -161, 128, -171, 55, 73, -165, -37, 95, -135, -1, -126, 195, -190, 124, -144, -19, -55, 51, 92, -33, 132, 34, -122, 68, 2, 18, 4, 27, 110, -220, -210, -12, 56, -224, -74, -134, 58, -54, -58, -204, 94, -50, 161, -63, -186, 207, -56, 74, 143, -109, -106, -72, -9, -122, 39, 290, -417, 77, 293, -454, 55, 281, 220, -184, -82, -613, -154, -73, -84, -7, -22, -22, -15, -9, 61, -25, -195, -35, 136, -5, 34, 46, 156, 25, 182, -165, 147, -20, -24, 74, 59, 66, -49, -22, 125, -31, -54, -138, 185, 15, -296, 273]
3830B73k55j18K89j41j40r1J45N7k01J56L4L11n66L87l37j28K91L52k14q6q0M9
3852a3J56k40k52L00K08j26J37k52QJ12l84L05J74j36p0N9M6pk87J85J8K28j25
3875D4q4M3O1O0j48o6PJ82j05R3k41J16J28p6o5Q6k02K36r3J0k4N3k6o7L4O1o6
3902d9O0J0k3rpL6pm0O7p6%M2k9jJ4m%M1n8RK2J7qm9O5j6L6o6L3j8O4p2nO2q0
3937c9K1l3O8nj16J15k2l5N5l5J3pL2n7N2n7K4L3J3j8J8k0J1o6L2N0l1j8jOM4
3968B7kk5K1kn1J0P3m9o2J5L1J2J0l3K5lm8K3M5J1j3Kn2L4j0p0R4K2n6k8N3j0
4000fK3n6J3n4M5j4R0m8L1%k9M8l6m0Q1p2kK2J8OR%k9kl5NO0j2j1rK4k4j00Q6
4034a8k0O2n5L3ko3P1L7o1P6p7O3p9JNL1k3L7mm6M3nK2k3j8L4k2Ll0JL0j3J8j7
$$ y = [273, 18, -100, 189, 48, -92, -183, -38, 19, -182, -26, 8, 319, -247, 140, -197, -325, -34, 318, 104, 18, -62, -13, 143, -97, -349, -49, 159, 33, 170, -82, -74, 38, -346, -41, 133, -3, -73, -14, 32, 25, -262, -77, -59, 169, 44, -40, 3, 64, 124, -24, -90, -83, 99, -6, 87, -154, -38, 90, 14, -51, 35, -167, 69, -24, -14, -38, 15, -11, -78, -44, 17, -49, 11, 21, -2, -11, -18, 18, 11, -29, 38, -38, -38, 4, -25, -26, -12, -16, -16, 25, -33, -24, -2, 15, 7, -42, 23, 7, 43, -23, 10, -8, 56, -16, -21, 41, -39, -18, -51, 17, 12, -104, 11, -11, -46, 9, -26, -13, -20, 12, -45, 7, -50, -26, 7, 20, 2, 20, 0, 11, -55, -23, 27, -4, -22, -23, -17, 27, 25, 0, 21, 19, -32, -22, 51, 2, -60, -45, -14, -2, 8, -25, 0, -3, -51, -28, 17, 28, 15, 17, -35, -1, -11, -81, 13, 35, -21, -49, 4, -6, 17, -39, -26, -80, -35, -49, 41, -7, 24, 24, -5, 43, 7, -33, 48, -24, -26, -4, 14, 20, 29, 29, 0, -2, -37, -32, 28, 16, 5, -4, 20, -4, -104, -18, -38, 24, -31, 2, 0, -63, 8, 45, -16, 60, -17, 46, -33, -32, -27, 4, -19, 18, 14, -32, 11, 6, 28, 5, -13, 21, -1, 2, -28, -27, 3, -10, 8, -9]
4068im6M4m8K5O4p2M7k1P1l8jJ4l4kL6k0J9n1M2m6L8o3K9L5l4L8k0j1J9m9M3l0
4100c1J3mK0k8L6nmK1l4j0J2M6r1L7O7l3n8P7m5qM7n6JL0J8n7M1Kk3K8M1o0J2
4133Bqk7LJ9M1k4qn8O1ok2nL8n2M5Kk7k3L9jK4l1mPK6jk4PN8p2K7qK7L5j9n1K0
4170A0K0J9p1j5k2L8K1K2J1j6o4L2K5K6j7o8L9K4n9j0NJ8N2k7M4q7RJ12q4J8P
4201A2J3m6O9r0O4l5j2J9l1lJ5J5j1Jk7O8Pm2rkM3n3K4j0m0N9j7K6p6M3j4J0P5
4234D5n5L8J7q5L7J1n9Q0ok7J9k3LO1j9j7n2L6J8p4N8K5n7j0O3m2J6Kj5K5m6L9
4266FJ2qp1M4K9k3j0jnO1m0rk5N0k0N6l7j4j7mM1k0K1j2o2O7k4L2J4m9K3nk8M
4300b4l3QL2Jj3N7n2L5mJ5j5k9l2O3j7m6P3k6%kPK3o6O9l9j4J0K6k7L4o5N1Ll5
$$ y = [-9, -55, -11, -59, -34, 30, -42, 5, -16, 55, 17, 16, 30, -4, -6, 30, 10, 29, -22, 20, -26, 12, -51, -22, 13, -21, 17, -3, -14, 5, -44, -1, -31, -18, -22, -2, -30, 6, 1, -3, 18, -16, -26, -14, 32, -59, -22, 45, 12, -46, 31, -14, -22, 25, -31, -30, 0, 18, -39, 2, 4, -19, 9, 50, -10, 2, -6, -33, -30, -11, 30, 6, -2, -60, 1, -5, -27, -32, 6, -46, -1, 1, -26, -49, -10, -11, 13, -18, -22, -15, 11, 10, -14, -7, 51, -21, 6, -2, 25, 60, 41, -10, 10, 30, 49, -22, -37, -59, -21, 0, 22, 33, 17, -47, -15, 10, 36, 19, -49, -10, 14, -45, -55, -50, -32, 20, -7, 37, -50, -41, 71, -13, 5, 12, 25, -21, 48, -42, 22, -13, -25, -6, -37, -40, -25, -10, -21, -20, -47, 21, 28, -14, -23, -25, 18, -35, -11, -21, -61, -2, -19, 7, -69, -26, -40, -30, 45, -10, 28, 45, -40, -3, 8, -51, 29, 23, -4, 15, -8, -5, 56, 37, 20, -32, 4, 22, -52, 6, 31, -26, -36, 27, -15, 1, 3, -12, 13, -33, 6, 18, 10, -61, -17, 12, -11, -21, -22, -27, 34, -6, -15, -40, 10, -10, 46, 9, -5, -22, -26, 15, -5, 16, 4, -58, 9, -15, 17, 31, -18, 5, 0, -28, -24, -57, -49, -17, -16, -29, 28, -24, 11, 7, 22, 7, -22, -54, 9, -8, -54, 19, -7, -7, -9, -2, 21, -45, 24, -15, -29, -19, 7, -20, 14, -51, 0, 3, -32]
4334c2J0%N9m4m9oO3k4mo7O5pK0K9j9nJQOmro4R0ll9M9L1j2p5K6k2oK6%J7l5M0
4371A4ko7J0O5k3K2nn2K7NpK2mk1J8J2j2Kj06O2j7N0K8l5NOJ7r8Q6J6r1m9J2n1
4405a61J2L70k50j23L27j63j6J7o1M4l7M6M9m4J1k4k4OM9l6J9%Nq8P0K4k0J8n8
4434c8N6m3M6o3M1K9L0m1qpLplj4QJ6K9j9k4PK8l3n4R8q1N2n6N9J6p3K0J0k4K2
4468a8l4M3m9N6l3M4rn0L7j0J9K9L5p8j3N2l0k1N8k3J5J4k9L4m2M0l7Rj7K4n4
4499c8%K4L8m8L4l1M7m7k1K9jlj2Q5r9Q4p9P9o4K4j4L6pm7L4k3JL0n3j1O1J0K4
4532D2n5K1q5R4l0J0K8J0j02Q4m6MO%N7q4N4k7m2K90k03j15L0Q6O5j52L0j03K33
4561A00o9j18Q1J8k32L69k69j43j25N33rk93N38n00k8M29k96k6l6K05m00J95P1
$$ y = [-32, -22, -22, 37, -7, -56, -62, 1, -23, -27, -94, -29, -36, -16, 13, -6, -11, -10, -2, 4, 0, -9, -73, 17, 14, -25, 24, 55, 43, -32, -6, -28, -34, -8, -8, 9, -26, 14, 12, -55, -45, 20, -3, 19, 14, -38, -11, -6, -13, 9, 5, -16, 2, 14, 2, 4, -102, -40, -57, -7, 21, -14, -9, -3, 14, -84, 2, 18, -73, -122, -110, -161, -149, 221, -29, -152, 175, 12, -4, 13, -48, -4, -41, 5, 54, 10, 21, -3, -27, -21, 28, -8, 11, 11, 16, -72, -2, 22, 2, 20, -38, 18, -25, 21, -42, -1, 28, 58, 17, 9, 2, 5, -2, -5, -19, -11, 5, 34, 15, -9, -2, 26, -7, -61, 37, -44, 8, -48, 11, 27, -46, -26, -16, -40, -18, -52, -9, -58, -2, -35, 9, 0, -50, -13, -23, -4, 25, 60, -18, -31, 21, -9, -30, 28, 5, 20, 34, 5, 39, -3, 37, 0, 9, -8, 16, -38, -38, -14, 24, -24, 10, -21, 26, -21, -42, -13, -14, -17, -29, 56, -43, 41, -38, 41, -23, 1, -13, 23, 16, -31, 3, -20, -19, 11, -42, -53, 8, 18, 42, -13, 8, -77, 17, -13, -3, 25, 35, -67, 17, -29, -25, -19, -19, 38, -46, 8, -19, -61, 229, 26, -89, -59, 27, 92, -60, -30, -133, 100, 31, -87, -6, 12, -220, 149, -120, -263, -388, 145, 136, -157, 381, -119, -147, 282, -14, -40, -76, 129, -271, -76, -5]
4584ej62P1k70J95K72O2l45K68j98J90J40l74J74o5O4J06l87J36Q4J57J11k62
4606c8J70j5j79p7LR0M9R9p8R2k90N6J96n3o6j98K39j40K34o4q0N4P1O4j93J72
4632A18j44J9K7o8Q8l9k7M8l6jM3l6oJ7K7j9LK6MK7n7k6%k7Pj1jL6m3M9qjj8J3
4666a6L2q9M3l7P1Oj8j3L3j5mM0p5P5o6L2kj1N2p2M8j2LmnqL9l7M9m5Qpn6O8L
4701A0qJm3RL5J4qppMnPK4l4N1m5rM2m1K0r2J02Ll9M0j3J2j0j7jNk5J8m0N6n1
4737d2M1L6p4J4J2m7L0kJ6M5l4KoK9jj3O5q5k9J5K3k9L6J9j6K2l2L2n5P7k4n5
4769c0M3o2Q2j3j2k9j1k2N9l6L4p0L4J3J5j8j7oP0m1k2R2j09O0K2l5L%j0K5m9
4800d0K6L%K8Pn7j1Q6l8j6N7l3o2J2J5K3p2J2J6J0K4J5K9mLl9j0j4K6m7Q2j1n1
$$ y = [-5, -167, -96, -366, -171, 101, 163, -182, 86, -112, 78, 218, -156, 18, -47, 17, 123, -264, -128, -44, 113, 224, -38, 132, 117, -62, -139, -136, -46, 3, 102, 24, 116, -174, -118, 78, 25, -41, -239, 0, -140, 94, 30, -50, 4, 75, 139, -54, 118, -26, -7, 20, -48, 40, 1, -26, 22, -14, -15, 28, -8, -14, 3, 30, 11, 14, 40, 44, 71, 14, -12, -12, -39, -32, -43, -44, -8, -51, -2, -10, -11, -29, -16, 16, -73, -30, -67, 4, 10, -8, -21, 12, -3, -7, 33, -42, 33, -33, -1, -3, -14, 38, -34, 14, 2, 5, 1, -4, -12, 27, -10, 39, -6, 2, -5, -61, 7, 10, 2, 3, -40, -31, 4, 18, 10, 3, -4, 0, -5, 2, 26, -8, 43, -2, -11, 31, -10, 10, -82, 20, 23, -16, 24, 11, 23, 13, -4, -5, 0, -25, -7, -47, 9, -42, -1, 35, -39, -25, -13, -60, -30, -32, -16, 29, -5, -3, -9, 20, 19, 6, 71, -14, -43, -28, -5, -34, 2, 21, 5, 27, -5, 27, -28, 49, 25, -30, 13, -49, 33, 20, 8, -21, -32, -54, 5, -31, 3, -67, -33, -20, -5, -23, -40, -46, 24, -17, -39, 53, -56, 4, 26, -9, -6, -6, -16, 9, -40, -14, -11, -11, 17, 24, -33, -44, 42, 4, -12, 45, 12, -50, -38, -23, 0, -72, -60, -44, -34, -10, 5, 34, 30, 33, -6, -16, -30, -4, -51, 31, 20, -31]
4833c1J7N9n6mj5N0j3m8N0n6L0P3n3k5l5K0O8j6pl0nMN2m0j4L5J9k7oN0m1l3K0
4866hm2M4j0K1m9PN0L1n9K3l8O1l9KJ6J3m6O5M5r6k1N2o4M1j6M0p7K7K6Qk6K7
4898Hk7K2J2k6j0K7j4l3O9j1K3p3Q6m1l0M7k9J1ML5o3k4O3l5J4M0l0J3lk9PlJ6
4931A6l8MJ1l7P1n7NL6p4P0j2l2OK7n5L0M8m8J1K4j7J3k4K9rN4nk6l9M2K0o0J1
4964en9M4j2P1n8M7m6K3K3m5k0L4pl7j3L3M5j01R5j7m8J5L9M9j3j8l1oL6oRJ4
4996C5l4pnNJ5J7mk1n5O5l5J4N6o0QkL0n0M6j3o3KM6k3P2j8j9Km4N1n4O3j0l0
5030b0l3J10m4Km1J6K1k7O4n7rMl7R4o2N1Ml7k5k6L9L7n7P3k3j9j1J1l8N5k1j7
5062b3k2K2NK3J1Klj5jL1m4K4l5PK3K5kkLn1RK4l1L7J5l7J1o0L3R8q4oJ6mN0m1
$$ y = [-31, -14, 45, -11, -15, -30, 20, 7, -41, 9, -47, -17, 56, 3, -22, -57, -37, 31, 15, 8, -22, -27, -23, 29, -11, -25, 10, 29, 2, -4, 46, 5, -28, -8, -50, -6, -16, 5, -44, -37, 13, 44, -15, 8, -30, 31, -8, -6, 10, 23, -23, 42, 87, -9, -30, 22, -42, -1, -17, 23, -54, -27, -1, 7, -19, 8, -19, 3, 15, -11, -21, 6, -8, -41, 28, 17, 40, -33, 53, 12, -18, 29, 0, 11, 15, 50, -13, -37, 26, -9, 5, 45, 15, 28, 25, -4, 3, 0, 16, -22, -18, -7, -44, 27, -30, -25, 11, -63, 7, -5, -37, -31, -4, -59, -29, 19, -29, -18, 6, -11, 2, -22, 7, -2, 52, 47, 21, -18, 24, 44, -16, -5, -64, -20, -32, 39, -19, 28, -18, 5, 28, -17, -37, -3, -10, -47, -60, -27, 18, -83, 12, -5, -53, -38, 1, 50, 37, 19, -12, -18, 18, 12, 21, 35, 1, -6, -11, -6, 9, 26, 22, 1, -54, 11, -24, -10, 46, -14, -6, -8, 22, -28, 18, 5, -58, -56, -10, -33, 39, 21, 2, 4, -40, 11, -43, 20, 10, -20, -53, 57, 13, 15, -26, -10, 11, -16, 48, -9, -18, -14, -51, 43, -19, 32, 36, -1, -26, -52, -13, 24, -33, 40, 17, -2, -13, -2, -40, 15, -6, -23, -45, -23, -18, 5, 16, 18, 15, 0, -1, 30, -14, 10, -25, -18, 5, 30, 28, 26, 29, -22, -13, 11, -20, 17, 32, -5, 6, -54, -21, 77, -7, -13, 3, -1, 49, 8]
5098Hj1M8l6j5L5j1M5p8j8J6K6LoL5l0K6m2L2j1QJl3K7j4LK1m0J9k2j9k6L0L3
5131DJ2l6J3mL9n6L9k7RrJ8M4j6J4m9L4k4j4JL9l6J7j2JJ9Pn4L7J2k9J6l0mJ7
5165hK8J6m3m2RO3l0J7l0L4k9k8Q0j8l3m7J8P3pk6J7m7L2M9j8K1j8o8M8LJ87j53
5197E0p4K7J9N8r0N3m1j2k8m8j50J9K24J3j77K06p9M5j5L3n6P5m7mNj4JL3k7P
5227FJ2j3l6N3l9J8M5k1o6N2o1P9j8k2N4m9j8K3L2j0o2L1M0j7m7L4j4J0mL0Mj2
5259A4m3K9K1j0m1M9j9k5J9N6k5o1Q9n3K%j1j1J5L1j09K7M8Jj3k6l3P8mK3l6p
5291b5O0p2L1K1o7Q6rj9k4L0l3J3j6K0J0%L0pjk0j9OJ1M4n6L0pq4Q1JK8q7M7m4
5325d1j5O4j2Jk0Lj3N5%k9j7L7j7j6LL0k9ppQ0n8N4Pn6j2K9J9j7K8m5O7q8M6m8
$$ y = [8, -3, 45, 9, -6, 29, 18, 63, -15, -33, -17, 9, 12, 6, 41, 11, 37, -5, 27, 16, 24, 25, -8, 19, 5, 8, 29, -11, 8, -14, -33, -59, -29, 4, 16, -20, -7, -11, 28, -28, 11, -16, -7, -16, 2, 46, 30, 44, -5, 29, 5, -9, -8, 31, -5, 12, 0, 1, 20, 27, -27, 10, 22, -7, 9, -21, -25, -8, 20, 36, -7, -49, -40, 23, -7, 10, -20, 14, -15, -43, 37, 19, -14, -61, -43, 30, 23, -3, 14, -33, -1, 48, 30, 51, 33, -35, 13, 16, 203, 50, -24, 3, 22, 80, -10, 43, 2, -10, -38, -86, -236, -217, 7, 20, -157, 49, -30, 15, 0, 33, -23, 52, 5, 1, 6, -8, -7, 26, -1, 6, 18, 5, -31, 22, -17, 1, 46, 25, -41, 11, -50, 29, 11, -11, 43, -6, -24, -1, 31, 21, -41, -10, 30, 13, -34, 0, -14, -4, -8, 22, 26, 14, -29, 0, 21, 11, -30, 19, 0, -25, -6, 50, 25, -36, 53, 0, 2, 2, -9, -20, -5, 26, -83, -56, -8, -7, -20, -46, -79, -1, -5, 18, -18, -25, 35, -37, -6, 15, -52, 34, 25, 6, -18, 12, -21, -8, -24, -4, 6, 6, 36, 29, 28, 8, -11, -5, 6, 50, -6, 24, 17, -67, 14, 15, 43, -44, 3, -41, -56, 8, -4, -3, -23, -20, -33, 22, 22, -7, -24, 13, -4, -20, -17, 13, -16, -23, -30, 50, -8, 46, 53, -3, -15, 14, 33, 16, 44, -1, 66, -22, 24, -24]
5359b4mj1N2k2l1NM0L5j7l4K0k1l6M0o4P4J8m2j0M6p1P5ml1K8j7M4k9J4j2l8J6
5391a1L1j0nnl9J4P8o2K4J2k1K6m8L8n3J0K0M0m4oqj5J8M9pm8J7K4k2K1kJ0j9
5424GL4j00Q3lN7q1J7k3K0p4L4J17q0m0O5n9m8P6J22j41o6K4JP3l7R8j87J24n6
5453d3r2K01n4r8l5J99m3l4n3J6J20r4j9m2kj5R4k0Q4j80J9O6J0j69K18j27O9
5480b4J22q0K8m0l8M7p0j6J76o5O6j46NK2R6Q8j72n4J38l05J72K57k04KJ23j82
5506e4Q3OJ54L9j92O5ol74L94l64L51j6p6J71PJ1l13L1J6J80r7J41l74L64j58
5531a1q3k35L34K25m04J94k20L07n8j36J60j19O3M5n8jJ9o5k6M8L8K3o5N2k3%
5557DpJ9k0lo9k3J31n0J4k5J9kJK1L6o7l3L0L1Ql0mM5k9J3%%j6KL3m9J1J3k3n
$$ y = [-24, -28, -39, 13, -9, -40, -35, 5, 40, 23, -11, 9, -12, -48, -8, -72, 2, 20, -22, -32, 14, -57, 18, 14, -17, 11, -6, 38, 9, 23, 11, -27, -11, 20, 10, 5, 0, -39, -25, 53, -9, 15, 27, 6, 32, -16, 22, -31, -21, -1, 39, -5, -11, -19, -34, -16, 33, 26, -22, -5, 19, -3, 18, 16, 26, 7, 41, -59, 24, 21, 78, -3, 14, -9, 11, -63, -29, 88, 8, -32, 33, -26, -74, 2, 124, -17, -83, -59, -58, 15, -22, 76, -111, 13, -43, -135, 66, 12, -86, -121, 78, 35, 1, -52, -36, 84, -10, -29, -71, -73, -88, 6, -14, 70, -110, -91, -25, -15, -184, 34, -93, -24, 98, 18, 46, 6, -32, 15, -55, -71, 105, 40, 106, -40, -35, -13, 83, 171, -1, -55, 83, -222, -50, 207, 3, 5, 128, -54, 29, 35, 189, 228, 36, 101, 95, -279, 115, -249, 102, 86, 10, 181, 188, 199, -114, -83, -67, 113, 16, 157, -217, 147, -11, -94, -329, 5, 230, -174, 20, -200, 107, 49, -87, 73, -46, 17, 62, 4, 3, 22, -43, -69, -21, 17, 40, -25, 27, 4, 4, -3, 16, -4, -7, -76, -99, 32, -18, -4, -29, -10, -12, -11, 10, 46, -21, -54, -24, 7, 15, -15, -19, 26, -3, 10, 10, 10, -6, -4, 29, -20, -9, 4, -19, -24]
5592b4l4R1pl4n3N7K8j2qk4Pj2M7j1m0mM5plk2K8k0K2m0K8k6M6K3j04L7j09J44
5624Im5L1pJ0J50k08O6Jr9J51o6J44j16j29K11j29j5J65k83J19m0J17oJ16k19
5649g2R4K6o1Nj%J4M7n4n5J7R1n5l0J30p4m6q6J19q1O3P3r5J4k9O8q0n4N4J25
5679F7k15k8J51j00J50j31j31J64j26L82k02n4k02L04J49j79k67L16q3O8R9j96
5701f4LK6k0k45J82M4j37K14q0oj09K5K13pKj63J73jj06rM3M5o6N8m3L9L2m4n6
5730e7j6L0O5J4K6p1Mj5J3NJ0p0N9J5j0k6L8K3l7J9Kj8rpK3mK7k0qjl0J0k2J4
5764b4L8mMl3m3M1J5O7n6J7Lk8j5J7l3K4Q2l8n2M5o2L8k5Q0q2J2J5j7J6j1J0j4
5796a3K7m1K6No8Q5j0n0K2m0L8L7l8J2J2j7O8n2l6L8rJ9J2%m1L1J0m9M5m6K4j
$$ y = [-24, -58, 33, 26, -8, -61, -4, 24, 12, 4, -20, -13, -25, 22, 11, -29, -33, 12, 5, 2, -20, 8, -12, 10, -30, -2, -28, 18, 41, -63, -26, -135, 9, -36, -5, -12, -2, 148, -60, 6, 7, -92, 59, -7, 137, 21, -108, 103, -26, -41, 124, -159, -40, -80, 37, 31, 147, -72, 22, 48, -13, -8, -9, -9, 5, 52, -2, -57, -40, 51, -4, -34, 96, 22, -24, -110, 9, -72, -9, 64, -31, -17, -46, 22, -58, -112, -58, 67, -148, -176, -25, -125, 25, -106, -237, -73, -199, 183, -19, -73, -275, 29, 178, -1, -268, 48, -35, 33, 132, -64, -61, -35, -55, -300, -118, -74, -211, 3, -77, -83, -192, -167, 46, 39, 41, -122, 51, 50, -56, -65, -22, 23, -43, 15, -28, 11, 43, -1, -57, -73, -43, 22, 36, 62, -9, -5, -20, -7, -2, 8, -62, -3, 12, 2, -24, 14, 37, 0, 19, 21, 3, -6, -13, 10, 6, 33, 13, 5, 4, -26, -16, -38, -24, 14, 10, 14, -19, -62, -21, -6, 61, 5, 22, 25, -3, -18, -1, -34, -10, 72, 34, -18, 27, -35, 3, -22, 58, -24, -12, 3, -14, 2, -9, 1, -13, 14, -27, -1, 4, -64, 21, 11, -39, -17, -57, -19, 18, -20, -8, 4, -13, 55, 3, -33, 5, -4, 15, 27, 27, -14, 17, 27, -22, 23, -23, 1, 0]
5828@kK6k2K7l5oN9m3j2K5k4K0p9L3L4L5k5l9rL1k7N0J1k7OJ1k2qLK0K2k5j5K4
5862A7J7j1q0P8J4o1K6K0k7K2m1m9M1J8JJ2L1m8M7l0j6K4l3K6K0Om9M8j5Qj9L1
5894B8j8k3J7K0k1k0j0L1j1J8m4M1N0j12Q2p6LL4jPJ1n1L0M5k9n1M7M0n9K6j2
5925hk9P1l1ml6L3J2L8l1k7P4q2N7l8m1L6J7Nnq0J01l3J7k5M9q1m4L7lL0OK1k3
5958a7J7MK0Jp0N6k4Jj6M0Rl2O9q8M0L3l1k7m2P8l8K8k7M1Jk8j7J4L9l3l4L1O
5991DN8o3j4KOj7J05Jj49J21Pj38R4J12Oj48K16j52j48J22R7m3n2Q8k16O6O4N5
6019H4j16k76L72J03J3k90m8J46J4p3N3o6P5jk4J11m2n9m8L8R0j11N4K6r2R1m8
6046b4PK7n7J2R0J7n7l0J06j62M9m1J29ql9l7J24j55l9j55J36J64j75J13o2J20
$$ y = [0, -2, 24, 2, 29, -6, -12, 47, 4, -8, 17, -7, 13, -66, -33, 1, 36, 11, -28, -37, -6, -33, 17, 28, 1, 7, 18, -4, -12, -9, 11, 33, 8, -7, 17, 34, 23, -57, 21, 35, -26, 0, 20, -7, 15, -26, -75, -34, -16, -15, -3, 28, -20, 27, -3, -19, 5, -28, -2, 18, 24, -25, 23, 8, 16, -3, 28, 10, -13, 4, 24, 3, -17, -27, 4, -7, 11, -33, 8, 58, -54, 28, -48, -45, -11, -12, -5, 6, -45, -15, 30, 1, -50, -3, 37, -22, 4, -8, -37, 34, 3, -1, -37, -4, 8, 46, 15, -12, 62, -20, 37, -1, -42, -6, 11, 16, 11, -69, 32, -1, 16, -9, 40, -41, -85, -48, -51, -21, -15, 6, -17, 0, 4, 24, 25, -45, 11, -13, -12, -28, 12, 21, -11, 58, -30, 10, 43, 12, -15, -57, 21, -17, 11, -16, 25, 26, -2, -19, -5, 34, 1, -33, -2, 4, 62, -1, -15, -13, -7, -24, 81, 82, -67, 54, 61, -77, 17, 129, 135, -13, 203, 51, -97, 25, 122, 79, 27, 115, -101, -35, 29, 84, -32, -308, 64, 167, 180, -110, -158, -12, 2, -71, -18, -84, -9, -10, -34, 77, 35, -24, -72, -34, 56, -55, -1, 25, -67, 24, -24, -17, 10, -47, -35, 55, 72, 15, -15, 91, -71, -22, -63, 66, 58, 19, -18, 106, -49, -88, -243, -107, 57, -118, -5, -67, 53]
6072E3j36J58k61K00J17j28KO0Nn1J63m44L73l06L01j17J77l12K2j57J44L4o8
6095a71K71J93j58k88M8k7K43k12q8J67J72k11K91k52j79J93n3O5J10k62O7J5
6117f6%k9m6J10N8l6k8J2L4j6P2n1j5j6K1Jj4OL5p8N4J5m5N4l6K0j4k4M5j7j7
6148a1M3m0m6J7P7l2l6l%J9J7mJ5jlm1N1k0NJ7%j0j7%k3L9l1K3J9l7M9J7p0lp1
6183i1J01p7N8l3RJ6L4l0J8Nn9P2l5M0m4J4km9K0JP6kkRo9J1l3M6Ok9L1j2l0L1
6217AK7JJ2k5L3n5N8p8nJ8qN0j00P5Qk9J2m5nK4jL6qjl0K3Mk1J7nM6K1p2j0N0
6252A8M5l9k1L1o9M0L7J2j2k6k0N3o5J4J1oJ7o4K7K9k6kJ2k5M5p3K2J8j9L8J2
6283A4k5j8K7M2k2%J2n3M7j8j7M0j1k9M9l6j4j2P2q2M9Nm0l2J0M8P8p5m4nL5q
$$ y = [53, -83, 75, -186, 14, 131, 3, 5, 65, 70, 19, 182, -262, 111, -195, 106, -11, 166, -146, -124, -281, -137, -103, -171, 100, 293, 135, -153, -105, -132, 111, -101, -189, -22, 150, -61, 230, -22, -201, -8, -61, 4, 114, -148, -81, -66, -66, -95, -141, -31, 27, -9, -37, -25, 9, -7, 65, 14, -1, -17, 4, 5, -9, -3, 32, -46, 8, 23, -22, 32, -4, 16, 2, -22, 23, 6, -11, 32, -8, -54, -37, 40, 8, -28, -31, -31, -12, 5, 1, 16, 15, 12, -29, 22, 2, 7, 24, 24, 14, -3, -3, -26, 13, -18, 5, 24, -13, 36, 53, -17, -20, -91, 10, -67, -9, -42, -33, -17, 17, -13, 5, 10, -49, 23, -12, 28, -16, -2, -4, -53, -33, -32, 44, 42, 40, 49, -20, -9, -42, 4, 10, -19, 12, 0, -30, 1, 28, 29, 41, 16, 49, -6, 52, -26, -31, -13, -21, 29, -71, 4, 12, -17, -5, -50, -55, -31, -32, 4, -4, -5, -35, -12, -8, -29, -12, -17, 29, 50, -22, -32, 18, 63, 24, 3, 34, -35, 5, 42, 54, 42, 16, -4, 49, -16, -2, 9, 3, 20, -44, -17, 12, -14, -16, -4, -29, 16, -57, -35, -17, -36, 2, 14, -11, -29, -2, 40, 18, 18, 30, -23, 24, 6, -11, 29, 18, -11, 38, 2, -12, -24, 48, -34, 15, 20, -20, -52, -42, 6, 84, 9, -35, -40, -5, -13]
6315a3K8j6K0oplJ8p8M2Q1q0J7j7N2J3m8J4k2M2o2L2p6K7Q5j5q4J03k1m6J1pP
6347iOJ9j8QLl8L1l9O0l8L5l3k4j1J9KM5K3j1n3M9QJ0L4m1m4M7n6q0O9R5q4j3
6380b9J62j58n3jP1J34m7j56L67k41O5j56j07J76j68lK38k65J39j51j07M35L4
6403A79k1j59K13q8k35O4K62Jk01J38j38Jr1M5M4J8q9J20j7p2K0o0PMN1n1M0K2
6431Gk0Nk%k7L7k1K7n5O2k0J8l4O3j7j7l6L0M4n8k3J5N8m5J8J9J6o9N3m2N2m8
6463a0NM9q1K9n1O2J3q5J4P4q0oL3L5j2nK6nLJ1j6K9q9P4p1Q4k8lk2N0J5q5L3
6496a0J7J3n2j6M0nl0L9OQk1K7m6K2nk2pJ02p3N7q9J3K0J2l3qj5L8j7N5nopJ6
6530A8kJ6l4k2J1j2K3j0L6%j6n5O0l7n7O6O1q9K9K0n3OJ31j16J4k3N1m3L4rj9
$$ y = [-13, 15, -1, 19, 13, 6, 3, 21, -57, -15, 66, -14, 3, -14, 38, 51, 3, 17, -5, 37, -25, 7, -69, -42, 43, 28, -56, 47, 26, -20, -9, -16, -9, -3, 16, -2, 6, 9, -29, 2, -37, 23, -15, 20, -13, -37, -48, -29, -27, 18, 41, 30, -23, 26, 34, 44, 78, 37, -7, 40, -16, -96, -27, 68, -16, -29, 133, -25, -78, -79, -8, 126, 79, -77, 290, 49, 114, -42, -149, 27, -141, -144, 94, -171, -32, -183, -290, 145, 179, 158, -1, 212, 124, -111, -47, 215, 216, 15, 153, 15, 16, -75, -30, 14, 32, -57, 63, 46, -26, -6, -66, -59, -55, -4, -55, -15, 7, -13, -8, -10, -10, -37, 0, -21, 6, -49, 13, -7, 11, -23, 40, 23, 6, -30, 0, 44, -14, -37, -22, 36, -9, 9, 28, 44, -25, 28, -14, 38, -10, -5, 44, -37, -8, -59, 3, 16, -69, -55, 19, -61, -67, -34, 1, -11, -16, 10, 5, 8, 19, 3, 32, -57, 17, -54, 30, 2, -1, -23, 27, 42, -43, -10, 7, 20, -32, -48, -8, -13, -43, -4, 2, 10, -11, 16, -30, -8, -13, -35, -42, 60, -13, 44, -45, -32, -12, 0, -33, -41, -56, -18, -35, 20, 15, 9, 2, 18, 16, 32, -2, -24, -13, -25, -2, -12, 24, 24, 8, -47, 13, -24, -81, -15, 46, -43, -14, 6, -47, -41, 90, -26, -12, -35, 16, -27, 7, -2, -21]
6561b1lj9L5%J2O0p3K4kk7J2l4N7l9O5m9mQm3N3p1M2m0J4M0l6K2L1k6o6O8l3L1
6594a2m9N7PM0n4j5M7K9j01O5j9K7m3J2Nk5N5p4N4k6qJ4kN6l9o8R9j3k0j3M7k3
6626A0l8j8L5M6m5k9K5LL1j3o7O0J7k8l4K5Jj3O3N2r7J1J0n5Q4j03J2Q4j19n0
6656a40P3L3O1m3j3O4q1K4j1l1P7Qk3M5j63J14q5j5r9L47l15K33P6K1O8Pm72J47
6684i3L9K68l48j2L24o9Qk02P0J1L4j4p1N0J9J03rp5j07j57K91o8o5P5r5N5O2
6711B4N9j17O1n5L1J2k2L9n0L7k1j6L7j5J7q3N2K4Qk5j2k5M4Ljm5M9K2J6K9r4
6742a7J9n0P6rm7kK9k0M0m4L8p0QRL3qL1Jj0J5k5j8L9pk3pkL6K9lm7J4mj6O0l9
6778IK1o9O2pk6Nl3l2M5plO2m9J01o9oolK7nn7P5l5K3lqk8J6j2RJ9m8M0L3q9L4
$$ y = [-21, -24, -43, -8, -8, 4, 64, -9, 15, 13, -14, -2, -36, 21, -18, 47, -2, -6, 2, -41, 12, -59, -17, -57, -43, -3, -39, -17, 14, -12, -78, -10, -43, -12, -61, -4, 3, 43, -11, -26, 21, 50, -51, 14, -5, 22, -21, -9, -4, -29, 26, -48, 6, -20, -28, -14, -16, 40, 1, -67, 32, 19, -1, -14, 33, 10, -28, -46, -11, 35, -10, -39, -14, -11, 20, 7, -60, 0, 17, -11, -45, -20, -19, -32, 31, 83, -14, -3, 7, -48, 36, -67, -55, 29, -90, -140, -67, -34, 27, -16, -29, 35, -46, -22, -33, -64, 13, 21, -2, 43, -120, -6, -91, -106, -205, 142, -173, 60, 136, 157, 225, 232, -240, -93, -54, 214, -134, -146, 178, 109, 117, -85, -15, -4, 30, 16, -55, -5, 14, 117, 108, 33, -74, -231, 60, -8, -73, 2, -93, -38, 24, 83, -34, 27, -28, 3, 15, -7, 32, -18, 19, -2, -18, 19, 4, 21, -62, -10, 14, 22, -3, -15, -40, 4, 7, 6, -39, 10, 32, 48, 77, -17, 2, -48, 28, 19, -28, -30, -1, -21, 19, -25, 13, -57, -49, -40, -7, -15, 16, 17, 7, 22, -3, -21, 18, 11, -12, -19, -21, 15, 44, 41, -6, 8, 4, -12, 48, 9, 30, -39, 23, 16, -10, -5, -38, -70, -25, -32, -35, 27, -22, 79, 10, 4, -2, -5, 22, 17, -40, 35, 0, 23, 20, 12, -16, 0, -12, -3, 16, -32, 8, 41, -48, -14]
$$ [...]
8191c30
##END NTUPLES=NMR FID
##END=
