##TITLE=1H_Pr-19
 CD3OD
 8 sc, 
 13.6.2023
##JCAMPDX= 6.0         $$ Bruker NMR JCAMP-DX V2.0
##DATA TYPE= NMR FID
##DATA CLASS= NTUPLES
##ORIGIN= UXNMR, Bruker Analytische Messtechnik GmbH
##OWNER= root
$$ XWIN-NMR		Version 3.5
$$ Tue Jun 13 18:39:25 2023 Russian Standard Time (UT+4h)  she@DPX200
##.OBSERVE FREQUENCY= 200.13135
##.OBSERVE NUCLEUS= ^1H
##.DELAY= (6, 6)
##.ACQUISITION MODE= SIMULTANEOUS
##.ACQUISITION SCHEME= undefined
##.AVERAGES= 8
##.DIGITISER RES= 18
##SPECTROMETER/DATA SYSTEM= spect
##.PULSE SEQUENCE= zg30
##.SOLVENT NAME= MeOD
##.SHIFT REFERENCE= (INTERNAL, MeOD, 0, 15.7039)
##AUDIT TRAIL= $$ (NUMBER, WHEN, WHO, WHERE, WHAT)
$$ ##TITLE= Audit trail, XWIN-NMR		Version 3.5
$$ ##JCAMPDX= 5.01
$$ ##ORIGIN= Bruker BioSpin GmbH
$$ ##OWNER= she
$$ F:/spectra/data/she/nmr/H-F/1/audita.txt
$$ ##AUDIT TRAIL=  $$ (NUMBER, WHEN, WHO, WHERE, WHAT)
(   1,<2023-06-13 18:38:11.68 +0400>,<she>,<DPX200>,
      <created by zg, POWCHK disabled, PULCHK disabled
       configuration hash MD5:
       00 E9 B6 7A A2 85 ED C7 34 08 36 98 17 FE 4E 26
       data hash MD5: 16K
       07 D8 31 00 93 F3 B2 48 B0 4E 14 06 16 FD 59 0E>)
$$ ##END=
$$ 
$$ hash MD5
$$ 1A 1A 87 EF EF C7 A4 08 35 A1 EF AE D6 16 B5 4B
##$RELAX= 
##$RELAX= 
##$RELAX= 
##$RELAX= 
##$RELAX= 
##$RELAX= 
$$ Bruker specific parameters
$$ --------------------------
##$DU= <F:/spectra>
##$EXPNO= 1
##$NAME= <H-F>
##$PROCNO= 1
##$TYPE= <nmr>
##$USER= <she>
##$AMP= (0..31)
100 100 100 100 100 100 100 100 100 100 100 100 100 100 100 100 100 100 
100 100 100 100 100 100 100 100 100 100 100 100 100 100 
##$AQSEQ= 0
##$AQ_mod= 1
##$AUNM= <au_zg>
##$AUTOPOS= <>
##$BF1= 200.13
##$BF2= 200.13
##$BF3= 200.13
##$BF4= 200.13
##$BF5= 200.13
##$BF6= 200.13
##$BF7= 200.13
##$BF8= 200.13
##$BYTORDA= 1
##$CFDGTYP= 0
##$CFRGTYP= 5
##$CHEMSTR= <none>
##$CNST= (0..31)
1 1 145 1 1 1 1 1 1 1 1 1 1 1 1 1 1 1 1 1 1 1 1 1 1 1 1 1 1 1 1 1 
##$CPDPRG= <>
##$CPDPRG1= <>
##$CPDPRG2= <>
##$CPDPRG3= <>
##$CPDPRG4= <mlev>
##$CPDPRG5= <mlev>
##$CPDPRG6= <mlev>
##$CPDPRG7= <mlev>
##$CPDPRG8= <mlev>
##$CPDPRGB= <>
##$CPDPRGT= <>
##$D= (0..31)
0 1.2 0 0 0 0 0 0 0 0.06 0 0.03 0 0 0 0 0.0002 0 0 0 0 0 0 0 0 0 0 0 0 
0 0 0 
##$DATE= 1686667091
##$DBL= (0..7)
120 120 120 120 120 120 120 120 
##$DBP= (0..7)
150 150 150 150 150 150 150 150 
##$DBP07= 0
##$DBPNAM0= <>
##$DBPNAM1= <>
##$DBPNAM2= <>
##$DBPNAM3= <>
##$DBPNAM4= <>
##$DBPNAM5= <>
##$DBPNAM6= <>
##$DBPNAM7= <>
##$DBPOAL= (0..7)
0.5 0.5 0.5 0.5 0.5 0.5 0.5 0.5 
##$DBPOFFS= (0..7)
0 0 0 0 0 0 0 0 
##$DE= 6
##$DECBNUC= <off>
##$DECIM= 32
##$DECNUC= <off>
##$DECSTAT= 4
##$DIGMOD= 1
##$DIGTYP= 9
##$DL= (0..7)
0 120 120 120 120 120 120 120 
##$DP= (0..7)
150 150 150 150 150 150 150 150 
##$DP07= 0
##$DPNAME0= <>
##$DPNAME1= <>
##$DPNAME2= <>
##$DPNAME3= <>
##$DPNAME4= <>
##$DPNAME5= <>
##$DPNAME6= <>
##$DPNAME7= <>
##$DPOAL= (0..7)
0.5 0.5 0.5 0.5 0.5 0.5 0.5 0.5 
##$DPOFFS= (0..7)
0 0 0 0 0 0 0 0 
##$DQDMODE= 0
##$DR= 18
##$DS= 0
##$DSLIST= <SSSSSSSSSSSSSSS>
##$DSPFIRM= 0
$$ [...]
##$SUBNAM2= <"">
##$SUBNAM3= <"">
##$SUBNAM4= <"">
##$SUBNAM5= <"">
##$SUBNAM6= <"">
##$SUBNAM7= <"">
##$SUBNAM8= <"">
##$SUBNAM9= <"">
##$SW= 18.05172834244
##$SWIBOX= (0..15)
0 0 2 0 0 0 0 0 0 0 0 0 0 0 0 0 
##$SW_h= 3612.71676300578
##$TD= 16384
##$TD0= 1
##$TE= 0
##$TE2= 300
##$TE3= 300
##$TEG= 300
##$TL= (0..7)
0 120 120 120 120 120 120 120 
##$TP= (0..7)
150 150 150 150 150 150 150 150 
##$TP07= 0
##$TPNAME0= <>
##$TPNAME1= <>
##$TPNAME2= <>
##$TPNAME3= <>
##$TPNAME4= <>
##$TPNAME5= <>
##$TPNAME6= <>
##$TPNAME7= <>
##$TPOAL= (0..7)
0.5 0.5 0.5 0.5 0.5 0.5 0.5 0.5 
##$TPOFFS= (0..7)
0 0 0 0 0 0 0 0 
##$TUNHIN= 0
##$TUNHOUT= 0
##$TUNXOUT= 0
##$USERA1= <user>
##$USERA2= <user>
##$USERA3= <user>
##$USERA4= <user>
##$USERA5= <user>
##$V9= 5
##$VALIST= <valist>
##$VCLIST= <CCCCCCCCCCCCCCC>
##$VD= 0
##$VDLIST= <DDDDDDDDDDDDDDD>
##$VPLIST= <PPPPPPPPPPPPPPP>
##$VTLIST= <TTTTTTTTTTTTTTT>
##$WBST= 1024
##$WBSW= 4
##$XGAIN= (0..3)
0 0 0 0 
##$XL= 0
##$YL= 0
##$YMAX_a= 270538
##$YMIN_a= -157334
##$ZGOPTNS= <>
##$ZL1= 120
##$ZL2= 120
##$ZL3= 120
##$ZL4= 120
##$ABSF1= 10
##$ABSF2= 0
##$ABSG= 5
##$ABSL= 3
##$ALPHA= 0
##$AQORDER= 0
##$ASSFAC= 0
##$ASSFACI= 0
##$ASSFACX= 0
##$ASSWID= 0
##$AUNMP= <proc_1d>
##$AZFE= 0.1
##$AZFW= 0.1
##$BCFW= 1
##$BC_mod= 2
##$BYTORDP= 1
##$COROFFS= 0
##$CY= 11.3945322036743
##$DATMOD= 1
##$DC= 2
##$DFILT= <>
##$DTYPP= 0
##$F1P= 15.7292609196834
##$F2P= 12.9074282941183
##$FCOR= 0.5
##$FTSIZE= 0
##$FT_mod= 4
##$GAMMA= 1
##$GB= 0.15
##$INTBC= 1
##$INTSCL= 1
##$ISEN= 128
##$LB= 0.24
##$LEV0= 0
##$LPBIN= 0
##$MAXI= 10000
##$MC2= 0
##$MEAN= 0
##$ME_mod= 0
##$MI= 1.114404
##$NCOEF= 0
##$NC_proc= 0
##$NLEV= 6
##$NOISF1= 3.799351
##$NOISF2= 2.8
##$NSP= 1
##$NTH_PI= 0
##$NZP= 0
##$OFFSET= 15.70392
##$PC= 1
##$PHC0= -20426.46
##$PHC1= 12.85272
##$PH_mod= 1
##$PKNL= yes
##$PPARMOD= 0
##$PSCAL= 0
##$PSIGN= 0
##$REVERSE= no
##$SF= 200.130013532006
##$SI= 16384
##$SIGF1= 3
##$SIGF2= 2
##$SINO= 400
##$SIOLD= 16384
##$SREGLST= <1H.CDCl3>
##$SSB= 0
##$STSI= 0
##$STSR= 0
##$SW_p= 3612.71676300578
##$SYMM= 0
##$S_DEV= 0
##$TDeff= 0
##$TDoff= 0
##$TI= <>
##$TILT= no
##$TM1= 0
##$TM2= 0
##$TOPLEV= 0
##$USERP1= <user>
##$USERP2= <user>
##$USERP3= <user>
##$USERP4= <user>
##$USERP5= <user>
##$WDW= 1
##$XDIM= 8192
##$YMAX_p= 0
##$YMIN_p= 0
$$ End of Bruker specific parameters
$$ ---------------------------------
##NTUPLES= NMR FID
##VAR_NAME=  TIME,          FID/REAL,        FID/IMAG
##SYMBOL=    X,             R,               I
##VAR_TYPE=  INDEPENDENT,   DEPENDENT,       DEPENDENT
##VAR_FORM=  AFFN,          ASDF,            ASDF
##VAR_DIM=   8192,          8192,            8192
##UNITS=     SECONDS,       ARBITRARY UNITS, ARBITRARY UNITS
##FACTOR=    0.0002768,     1,               1
##FIRST=     0,             0,               0
##LAST=      2.2672688,     0,               0
##MIN=       0,             -157334,         0
##MAX=       2.2672688,     270538,          0
$$ Real data points
##PAGE= N=1
##DATA TABLE= (X++(R..R)), XYDATA
$$ [...]
446D385J614j227l839m258j367J560J199R0J297L188K044n77k335k881j847L08
462b646J141j30q10J438M103K922j640m581k476P48kj731n6L246M043J765j018
479D316k690k707j938q96M64J515J791K342K212k8k849k880p30k77o80M79K400
496a56K473K58j144l9O92j543l414r97K264J921l12k21J368K086M11k358l533
513b244j771P93K396J613l33m45K450K755k170o109k830K934L631J27j538R99
529B58L134P17k981l226j074O53J580J751k87j140J243K654j78l634k558J055
545b033K224j37j873L44L041J873j265j797p65r16r02R1J033J302Q81N67O12M
563B284k121k552k58J328L07N30K221J024j573j399L21L93j596j945R25L214J230
$$ plain form
446 4385 5999 4772 933 -3325 -4692 -3132 -1933 -1843 -546 2642 4686 4109 1774 -1107 -2954 -2646
462 -2646 -1505 -1635 -2445 -1007 3096 6018 4378 -203 -2679 -1931 -1933 -3664 -3720 -474 3569 5334 4316
479 4316 1626 -1081 -3019 -3915 -3451 -1936 -145 2197 4409 4381 1532 -1348 -2078 -2355 -3035 -2556 -156
496 -156 2317 2575 1431 1392 2084 541 -2873 -3870 -1606 315 3 -218 1150 3236 3647 1289 -2244
513 -2244 -4015 -3222 -826 787 454 9 2459 5214 3044 -3065 -5895 -2961 670 797 -741 258
529 258 3392 4109 1128 -2098 -3172 -2519 -939 812 525 -615 628 3282 3104 -530 -3088 -2033
545 -2033 191 54 -1819 -1475 1566 3439 2174 377 -388 -1304 -2206 -2115 -1082 220 1101 1668 2280 2284
563 2284 163 -2389 -2647 -1319 -1012 -482 1739 2763 1190 -209 112 505 -1091 -3036 -2111 1103 2333
580B333j556r30P53L06n71m56j294j261J287K755N80j661o22J468J097j598l206
597b576j073K449K627mj182L7J298N56j842k962n18K223J890K97l61l90o4O87
615A092j30k185j612J644K407k31j449L06J517N0j634p45O51O4r46K99J563K47
633I08m01L68J29j095p48q2l34P4J335J240q9o25l49j21m54r98m11P29J214R91
653A281J99q93r45K76O09j033j128P48J311J42j61K82j37p11oM99l43j057n3J062
673e8O97p3O6J30o08p26K18K61r15k69J578J396o78r91J7o5n53l93K57M31N77
694B99O24N8n86p00J25J60o08k37P01M89j46J70M06m90p00L70M16o66o84M31P66
715A98L20K4M8j76n81k35L20l05o76M38J466M09r17l44J21k15m77j9K11K59N63
$$ plain form
580 2333 777 -153 600 906 335 -121 -1415 -2676 -1389 1366 1946 285 -337 1131 2228 630 -2576
597 -2576 -3649 -1200 1427 1423 241 278 1576 2132 290 -2672 -3190 -967 923 1220 859 469 405 1092
615 1092 962 -1223 -2835 -1191 1216 985 -464 -158 1359 1409 -225 -970 -319 -255 -1201 -902 661 908
633 908 507 875 1004 -91 -839 -921 -1255 -1181 154 1394 1305 680 331 210 -244 -1242 -1653 -924 290 1281
653 1281 1480 587 -358 -82 527 -506 -1634 -886 425 567 406 688 551 -160 -166 333 -10 -1067 -1120 -58
673 -58 639 566 632 762 154 -572 -354 -93 -1008 -1277 301 1697 1019 28 45 -20 -573 -966 -709 -278 299
694 299 923 981 395 -305 -180 -20 -628 -865 -164 325 179 349 755 265 -435 -65 351 -315 -999 -568 198
715 198 518 542 590 414 -167 -402 -82 -387 -1063 -625 841 1250 333 -11 110 -105 -582 -601 -390 -131 432
736D32M71n98n87R5N00l32p89Q6J025L38n38k65M21O4k61j66k17k32K41N29j20
757I7j74M99N06o31q01j33L87j4n4J58N18K72l4k50n40o02J79O89P7l65J94O11
779E89k1o22j61J28j65N5J97P3p6J25J91r5l36%J64o4k93M8K69J83Q2J15q1m53
803a48l01K67J67k16j31N55L61o9k41l33l56j0K97J36p9R1M01R0m16k51O3P7j83
826b29r3K98J77k5l7L7l1l4Qn6l05n1K56K60N1j38J00pk20j92p2P0K07J90K7j09
852H2J49M4k80n05o2N60L15k04q5J36Q1j21j37j40j47M7L07J78q5j65N7J10J8
875A53j01j75n9p5J79J44M4OP0K3j15k27j13M0O6J40Q5M6j6Q9l7l13k01J32K37
900B2Q8Rk6j28q7J10P6j16k36N0L62K11k11k36M9J18Q4k3j04k62q5L97K84j48
$$ plain form
736 432 903 305 -282 -187 313 -19 -808 -722 303 641 103 -162 259 323 62 -104 -321 -553 -312 217 97
757 97 -77 422 928 297 -504 -637 -250 -264 -318 -160 358 630 596 346 -194 -796 -617 72 149 -216 -22 589
779 589 568 -54 -215 -87 -252 -197 0 73 -3 122 313 218 -118 -118 46 -18 -311 -263 6 189 271 386 305 -148
803 -148 -449 -182 -15 -231 -362 193 554 485 244 -89 -445 -455 -158 -22 -101 -10 391 481 65 -186 -123 -46 -229
826 -229 -322 -24 153 128 91 128 97 63 71 15 -290 -341 -85 175 226 88 188 181 -39 -231 -303 -233 -26 164 191 82
852 82 231 275 -5 -510 -572 -12 303 99 14 150 231 110 -27 -167 -314 -267 40 218 133 -32 25 135 153
875 153 52 -123 -182 -257 -78 66 110 116 186 209 94 -133 -246 -206 -140 0 85 131 115 204 167 -146 -347 -215 22
900 22 110 119 93 -35 -122 -12 64 -52 -288 -238 124 335 124 -112 -63 55 139 116 12 -250 -335 62 346 198
924A98k95O6K11Rk70k78R0L07J46p9j01J26Mp8q6k76P5K63J33j05j52%J29R2p5
949E4k29N8J85P0l6n2m7j07P5J06M1m7k81n9K41L26j00l00M0J23NK6j15k97J11
974b09M49J94k02m07j10K51K94k64l83K42L99J0j96o1q4j8J78J9k64m2J31K41
996A68J15l29k30K22L64r8n07M2J96J58O5p9k06L4J24J5q1Mm4lK88K9k61r2M5
1021f1J1o2J63n0M7K7n1M8Q6k04k18K38J70k05m6J41K0l8O3p3q7J13O6j02r5j44
1047b43J43L87P5m15k61L59J77o2k66k20J59M30Q8l06l02N8K66R2Q1l11k63L17
1069a7K81j10k38j65N1K93L2j28j13J50k2m5J51Ok24kJ01L5rK5q2M9J20r8j59
1094a18R0Rr5J14J15k52R1K56j25j66nK5N9J27n2j82l2K82r3n9k7p0O3K10n2k06
$$ plain form
924 198 -97 -31 180 189 -81 -359 -269 38 184 105 4 130 134 56 -30 -306 -231 32 165 60 -92 -92 37 129 54
949 54 -175 -117 68 138 102 50 3 -104 -29 77 118 71 -210 -269 -28 298 198 -102 -62 61 66 92 -23 -320 -209
974 -209 240 434 232 -175 -285 -34 260 -4 -387 -145 254 264 68 7 -77 -95 83 102 -162 -204 -73 168
996 168 283 -46 -276 -54 310 212 -295 -253 -57 101 166 87 -119 -85 39 54 -27 -23 -67 -70 218 247 -14 -106 -61
1021 -61 -50 -112 51 1 48 75 24 72 158 -46 -264 -26 144 -61 -107 34 54 16 79 6 -81 32 98 -4 -99 -243
1047 -243 -100 287 362 -53 -314 45 222 160 -106 -326 -167 263 351 45 -257 -199 67 159 240 -71 -334 -17
1069 -17 264 154 -84 -249 -198 95 127 -1 -114 36 14 -31 120 126 -98 -100 1 36 27 52 -30 19 139 41 -118
1094 -118 -28 -19 -114 0 115 -137 -46 210 85 -81 -86 -61 -2 125 73 -109 -141 141 48 -11 -38 -108 -45 165 113 -93
1120i3JN2PJ05M5k48RK32l9j59Q2R5q0L4k1j23N1R2m4p0Q5j9N2J54j40k99P3K06
1148D0o8P8K1j94KK49K3j37r2L8r4J41J67k08j00L3J05J62M2l11j13K41J38j42
1172B1j03L2r6J03K16j12j56%J76k4O6m4j21J5J8k4m3J18m4J9M8J3p8M8L1j94
1198a15M3J31p1o1J16%r1P9R0j23J4qj11M5Q3j3L2K3j19K0J59n4j92O5J09n7K2
1225A6O6j15q3J58K0p1Pj1O0l0Ql5N9m1j2jk6K5j3J10n3j09j5J99j10n4%L2l4
1254e3N8P9k7j57MJ02J09j24j01J2J24j7M5Rn2j07J04J12j04r2P8l0j6J15Kj38
1280f5k4P6O8k6L0j16%J5j1j3R3o7MR0J6j25M1J41j10p6L5R1q6n2K8M3k6K6R0
1309I0l9r3oP2J00j04p8LQ3j7N6O6j85l5L6J10j7p9o7M6j7Q9P7j32k3O6P6o8j6
$$ plain form
1120 -93 -92 -40 -33 72 117 -131 -122 110 71 -88 -6 89 9 43 22 -101 -50 42 -2 -72 13 -6 46 200 60 -239 -166 40
1148 40 -28 50 71 -123 -121 128 151 14 -78 -40 -134 7 174 -34 -134 -101 4 166 208 -103 -216 25 163 21
1172 21 -82 -50 -146 -43 173 61 -95 -95 81 57 123 79 -42 -27 -9 -33 -76 42 -2 17 65 78 0 48 79 -115
1198 -115 -72 59 -12 -73 43 43 -48 31 121 -2 12 4 -107 -62 21 8 40 63 -56 -36 123 69 -123 -58 51 -6 16
1225 16 82 -33 -116 42 62 -9 -2 -13 47 17 25 -10 49 8 -4 -5 -31 -6 -19 91 38 -71 -86 113 3 -51 -51 -19 -53
1254 -53 5 84 57 -100 -96 6 115 -9 -110 -98 26 9 54 63 11 -96 8 120 16 -76 2 -28 -44 71 73 -65
1280 -65 -89 -13 55 29 59 -57 -57 -42 -53 -66 27 -40 -36 54 70 -55 -14 127 17 -59 -24 67 -19 -71 -43 0 -26 0 90
1309 90 51 -42 -48 24 124 20 -58 -55 28 11 67 133 -52 -87 -51 59 42 -37 -104 -58 -75 14 91 -41 -64 2 78 10 -6
1338fO3j12K4J1O8k2o9kO2M4l5L0Nj03m6N0K3K4p5O8Mo2M0O9p2J3n9L2J02j00
1368c1m0K3Q5jk9jL0j40O1Q2j8l6l3Q7l1M1k4m9J3m5%R8q9L1M8q1n4J43rM1j0
1399F2p9MqL8J0o2q1R5J21l3o3j5m4Q0m4R1n0p2J7L7N3Nl0m0N1K1j3k0j8q0K8
1430c9J02k2Qn4J9lK3nj9n5j4K3l5N9K8q8N0k3Q8J9L8j23l1M8OMk8j0p9J27L1
1461D5M3j45M9n2N9L5kk4r5Q5O3k9O3j17K5o6J18m8jk7m8J9N2K2p3N3KL4%m9p
1492a6j9J6n0Q1Pj7L7J3m0q4Q9Q0m4r9j7PJ28L7j28n7K8N6K9k5j4q2Q4J7l5M3
1522B5K0n5p0J43k2nl0J0j08O3Q6l0j33O7LJ0J02j2j07LK4j2Q6K9j66k4K06n6
1550D7j8N2j34j02K13P7r8nm4o7J52L8r1j35R9L3j0P5K3j44n6P1jN1km9o1J25
$$ plain form
1338 -6 57 -55 -31 -20 48 26 -43 -45 17 61 26 56 61 -42 -88 -38 -15 9 -66 2 6 -56 -16 53 -19 -6 -65 -33 69 -31
1368 -31 -71 -48 37 36 7 6 36 -104 -43 39 21 -15 -48 39 8 49 25 -24 -11 -56 -56 42 -47 -16 32 -49 -103 40 31 72 62
1399 62 -17 -13 -21 17 27 -35 -116 -21 100 67 4 -11 -55 25 -19 72 22 -50 -33 4 57 62 32 -8 43 64 51 31 13 -67 -39
1430 -39 63 41 49 -5 14 11 34 29 10 -45 -59 -36 -71 -12 16 -72 -22 -45 43 62 100 -23 -54 -6 0 4 -24 -34 -113 14 45
1461 45 88 -57 -8 -60 -1 34 32 8 -87 -2 61 32 95 -22 3 -63 55 7 6 -21 -69 -50 2 24 -49 4 6 40 40 -9 -16
1492 -16 -35 -19 -69 12 19 2 39 52 12 -72 17 97 53 -46 -63 -56 72 109 -19 -76 -48 8 37 12 -2 -84 0 17 -18 25
1522 25 45 -10 -80 63 41 36 6 16 -92 -29 57 27 -106 -39 -36 -26 76 64 -43 -40 -16 -28 58 87 -79 -103 103 47
1550 47 29 81 -53 -155 58 135 37 32 -12 -79 73 111 20 -115 -16 17 7 82 105 -39 -95 -24 -25 26 24 -25 -86 39
1578C9J11j21k0J4r9L4R9j1p9N9No4M6Om6NO3r2P2j0j1m8M6L8o4O8L2j60J20J5
1608D7j17N7M5m1j1M0N5j10M9Q3j52J4N3n2j8R4j9q1J24O5j36K5J2j06K6J02r0
1635d2LJ0L5K2N4k1j16k2Q4mJ8jr3M8N2N4m6m9Ml7N8O9j03n3M7nJ09l2J00k15
1665g2O4M1n6P2J5j10k4R6p2M2K4l4n9M2R3n0n9Q1p7OM3Qn0m9R3K1O7jj38RO4
1696C0J6q9J04p7l2K2L1j9MLjj2R0o1l2M8p6N6l2O4o1K5M7r8p2J33n1K5J4l0k6
1727e7R5Q0j15k6O2j13J04Jm6p0jJ05J5J6m5q0K7J29qj00j7o7L7J24r0L6p2M4
1755c2O4K5j4q4N1j9L3MJ9p1j5K2k3L6J0L7j0k6k4k7M1K1Qo9m8J32J6mn1p7O5
1786a0O8Ko5p9J2J04L5j5q8n8M3M2P5r8k7m5J30M4p3k2l1Q0K3Rn0Qp4P7K7p8%
$$ plain form
1578 39 150 29 9 23 -76 -42 57 46 -33 26 31 -33 13 19 -27 -22 41 -51 21 11 0 -48 -2 36 -28 40 72 -88 32 47
1608 47 -70 -13 32 -9 -20 20 75 -35 14 97 -55 -41 12 -40 -58 36 17 -64 60 125 -11 14 26 -80 -54 48 -42
1635 -42 -39 -29 6 28 82 61 -55 -77 7 3 21 20 -73 -25 27 81 35 -14 -10 -47 11 80 -23 -76 -29 -34 75 43 143 -72
1665 -72 -8 33 -23 49 64 -46 -70 26 -46 -4 20 -14 -73 -31 62 12 -47 34 -43 -37 6 14 -36 -85 8 29 96 95 -43 -34 30
1696 30 46 -43 61 -16 -48 -26 5 -14 -10 -7 -8 -20 70 9 -23 25 -51 5 -27 37 -24 1 48 -50 -122 11 -40 -15 -1 -31 -57
1727 -57 38 118 3 -23 39 -74 30 31 -15 -85 -86 19 34 50 5 -75 -48 81 73 -27 -44 -111 -74 50 -40 -4 -76 -32
1755 -32 32 57 43 -41 10 -9 24 28 47 -24 -39 -17 -40 -4 6 43 33 7 -17 -44 -3 18 26 -43 -91 41 57 53 2 -75 -10
1786 -10 58 60 -5 -84 -72 32 67 52 -36 -94 -51 -9 66 -32 -59 -104 26 70 -3 -25 -56 24 47 56 6 14 -60 17 44 -34 -34
1817c4O6k5RN4m4j8l5P8n1k5K7P0m4M3k7o8NJ19J5j45o4J8J11ljj02LO3J23k5
1847I3j12p8K7J80no5j00lP3O9k3l8r3O2M4K6o0l7JK8K5%n9Q3k2R3l3j45L5J9
1877a5O8k9p0j0L6P9jq2p8O7J14pk0j70J19K1R4o2r6n5R5J31jp2k30R0J43K1l6
1906D4q3j4O7M4K8j08r7L8J61l9pj47K4J05N9o8n7QR3Ko0j6m6J00M2n7r8pO4J43
1936A18K1j70q2O2J03O8j16p1m6J14J14n5j39m4P2J20M8j41j06jK10L0l9j35k9
1961i4Q7J61q0r6j21N3J05jj2r2j2J67nm8l1j3M2L6J8j52J4R3R2m0j71K5M7J14
1989H6K4j30m7N4k4J43j2k07n8K12J00n0n0j30nJ91M4r5j55J1N6R2Q2j44o9N4
2015b7J13k7j04J2m8J31L0p2q0K6J06k9J1j02m8P2J20m2j24j7J01P1J7j07q6L2
$$ plain form
1817 -34 32 7 16 70 26 8 -27 51 0 -25 2 72 28 71 44 -24 -19 100 115 -30 -94 -76 35 32 31 -71 -68 -5 118 93
1847 93 -19 -97 -70 110 105 40 -60 -63 10 79 56 18 -75 -13 31 57 -3 -40 -39 -11 14 14 -45 38 16 109 76 -69 -34 -15
1877 -15 53 24 -46 -56 -20 59 58 -24 -102 -35 79 72 52 -118 1 22 116 54 -42 -97 -2 129 128 56 -174 -84 59 80 44
1906 44 -39 -53 14 58 86 -22 -119 -81 80 41 34 -113 -89 16 75 7 -50 -42 51 53 -7 -23 -69 31 73 16 -82 -89 -25 118
1936 118 139 -31 -113 -51 52 120 4 -67 -113 1 115 60 -79 -123 -51 69 117 -24 -130 -131 79 109 70 -65 -94
1961 -94 -7 154 74 -22 -143 -90 15 14 2 -90 -102 65 60 12 -19 -32 10 46 64 -88 -74 19 111 71 -100 -75 -28 86
1989 86 110 -20 -67 -13 -37 106 94 -113 -171 41 141 91 41 -89 -94 97 141 46 -109 -98 -42 50 132 -12 -81 -27
2015 -27 86 59 -45 -33 -81 50 80 8 -72 -46 60 31 42 -60 -108 -36 84 42 -82 -99 2 73 90 -17 -103 -71
2041g1J46J7j35o6p0K35O0l0j41q7J27J33l5p2j85O9J64O7p4j23o0J27J64Qj79
2066a1j29J37O0Nl9j32LJ84N4q2j23M1J2J23J7k05k7J16J06q0p0n1M9J22P7k04
2092d7q4M4O8J17k4r7j60J87J59p7j38q0P7J16J13j62j51N8Q6P7Pj17p4N8K29
2117A85q9j72N3k1P7K5o1n2M4N3N8k5j20q9J21J19l2j82KJ08K8O9j28j16O8K03
2143A26j4j10j50M0R9J41o3j75n4K07J00m4l6j69lK34K4j14j77J1J32J16M1k21
2167e9j33J24J59no3j17%J20J07j32o1n5J25O6P5j88j35J18J56m9l5r3M7Q3J06
2192A61j16j77M1J49J2J2j64m5J09J28o7p2n6M5J43no2j96j1K12J09j09p6j44
2216a79J69J73q0j57M0k3J04O0r0k03O5J18J69j73m9mlJ98r7r8j9J25J3J0q9j23
$$ plain form
2041 -71 75 92 -43 -109 -179 56 116 86 -55 -142 -15 118 83 11 -174 -105 59 126 52 -71 -131 -4 160 168 -11
2066 -11 -140 -3 57 62 23 -109 -106 78 132 50 -73 -32 -20 103 120 -85 -112 4 110 30 -40 -91 -42 80 157 -47
2092 -47 -131 -87 -19 98 74 -23 -183 4 163 86 -52 -132 -55 61 174 12 -139 -81 5 82 89 -28 -102 -44 185
2117 185 96 -76 -23 -44 33 58 -3 -55 -11 42 100 75 -45 -134 -13 106 74 -108 -106 2 30 99 -29 -145 -77 126
2143 126 112 2 -148 -108 -9 132 69 -106 -160 47 147 103 67 -102 -105 129 153 39 -138 -127 5 121 162 -59
2167 -59 -192 -68 91 86 23 -94 -94 26 133 1 -60 -115 10 76 151 -37 -172 -54 102 53 18 -75 -28 55 161
2192 161 45 -132 -91 58 70 82 -82 -127 -18 110 43 -29 -85 -40 103 98 36 -160 -171 41 150 41 -35 -179
2216 -179 -10 163 83 -74 -34 -57 47 107 17 -186 -121 -3 166 -7 -56 -60 -63 135 38 -60 -79 46 59 69 -20 -143
2242a43J06J56K0j34j24R1M4R9k7j34m2J11J46m1j24j10J4J97J00k34j39L9J51
2265B2J33p1j72n9R4J95n7p7j02K1P0J30q6j35O5jJ16q1n1j9J22P5Pk14k9O3J52
2292A11J9j41j12OK07%p9j18kJ34Q3l7j86M5O1J43j8j68j7j3J65K7n1j70l2J49
2318FQ1Jj36q4N8J76rp1j58J5J39R7j04o4L7J5R5j6j33k5O9P5J3j06j38J54K5
2345A2N8j28jk5P4P5l4j31j1J16O7k0k9j27N2J41M8j16j09K5J00R0m4p0j40J24
2371cJ15j2o5j08M1Q4K7r7m0rN3N4ro1p6J24Q2m3p8o0pJ34Qk5j41O5J14M3p2p5
2401c7l1O2R9j4j21p1R4J41J5j03j27M0J00M9p6q7o6J47R7m2o9j03O2J38J5o6
2427D6j16l9J39N5j10n2LN0R1J4r9r9R8J5N6r4o5P2J35k2r0j7k1R4P9j46k7r7
$$ plain form
2242 -143 -37 119 139 5 -119 -28 16 115 88 -46 -88 23 169 128 4 -106 -92 105 205 -29 -168 -129 22
2265 22 155 84 -88 -147 -53 142 85 8 -94 -73 -3 127 41 -94 -29 -30 86 5 -46 -65 57 132 139 -75 -104 -41 111
2292 111 130 -11 -123 -117 90 90 11 -107 -109 25 108 71 -115 -70 -9 134 116 -52 -69 -82 83 110 59 -111 -143 6
2318 6 87 88 -48 -132 -74 102 93 22 -136 -121 18 115 11 -53 -16 -1 94 78 -55 -80 -11 64 77 -29 -167 -13 12
2345 12 70 -58 -59 -84 -10 65 31 -100 -111 5 72 52 23 -104 -52 89 137 21 -88 -63 37 127 83 13 -127 -3
2371 -3 112 100 35 -73 -32 52 79 -18 -58 -67 -14 40 31 -30 -106 18 100 57 -21 -81 -88 46 54 29 -112 -47 67 110 38 -37
2401 -37 -68 -6 93 79 -42 -113 -19 122 137 34 -93 -53 47 96 20 -67 -133 14 111 69 0 -103 -41 97 112 46
2427 46 -70 -109 30 85 -25 -77 -74 -24 67 81 -18 -117 -19 -4 52 -42 -107 -35 100 78 -12 -29 -50 44 123 -23 -50 -147
2455a47K12J2k9o5n4J3J26J3p5l4k4Q5P7r5n5n8J10R6n7q3j9QP6L9j24q3P4M5
2483a6M0k6l5m5P4R9q3p8l5N1Q0rJ7r9N9J5Q7p5j02N0R1lK1j45K8M9R7l3n4j09
2513h9L9J38K0j26n3PQ8L5k7o2o8P0J10n0j8r2J9J11K1k8j20N8OQ1Or3j03N7n
2542f8J12j3o5jN4L9p9j9K1j4O3K9p5jJ6L1qn6NN9l6N5p4n8O1L0Jk7Ol1J2Q6R
2575F4o7rk3Q7L7r2p5K0R7PKm3n6P2M0n0o9O1K3Kk8QJ0n9M9L5o9j1RMN7k5r6Q
2609h0Q5M0q0J7q8J8J49k8j9k7M1%O0k0j22L5Q1J6p8j8jj4M7N3r5K9l6J2Q8m0
2639B5k7p2Q7Kl0RKORk4j4MN5p6LO6k8k4O4J8m0m9O4o3L3L1n1n0Q7j2L9p8ml4
2673g2N7L6K9p7J7Ll2O4q5K7j0O2k4Q0o8p2LJ12n1k4L0l4P5J0l5o5J8M7k0m2K
$$ plain form
2455 -147 65 77 48 -17 -71 -58 68 81 6 -28 -52 33 110 15 -40 -98 12 108 51 -32 -51 -43 33 72 -52 -135 -61 -16
2483 -16 24 -2 -37 -82 -8 91 8 -70 -105 -54 26 17 34 -65 -6 9 96 21 -81 -31 60 57 78 -67 -39 10 107 74 20 -89
2513 -89 -50 88 108 -18 -71 -64 24 59 32 -30 -98 -28 82 32 14 -78 -59 52 73 45 -75 -17 -11 70 76 -17 -120 -63 -68
2542 -68 44 31 -34 -35 19 58 -21 -40 -19 -33 30 59 -16 -17 -1 30 22 -34 -29 30 -6 49 -25 -83 -22 8 9 -18 -12 -43 -31 55 64
2575 64 -3 -12 -35 52 89 -3 -78 -58 39 46 48 5 -51 21 61 11 -58 3 26 28 0 8 18 -41 8 43 -26 -37 -28 -24 33 8 -88 -80
2609 -80 5 45 -35 -18 -106 -88 61 33 14 -13 28 28 88 68 -54 -19 62 78 0 -18 -19 -33 14 67 -28 1 -35 -23 65 25
2639 25 -2 -74 13 15 -15 -6 -4 2 11 -13 -27 -23 32 -44 -41 25 -3 -27 37 55 15 -34 30 -33 0 31 -20 -70 17 5 44 -34 -38 -72
2673 -72 -15 21 50 -27 -10 -7 -39 25 -60 -33 -43 19 -5 75 7 -65 -62 50 -1 -25 5 -29 46 56 21 -44 -26 21 1 -41 -39
2704c9kL3Q4j07qmN0j6L4J4m3n1O4l9j4l0O0M0m4K2r5J03O1k3j01Q4p7K9Q5nq7
2735b2o1O4k6M8K9Oj12J16l1NJ9o7J4p1J52j02M8pj1K2K7l0L2m5J2%k7N5k3p7
2765f3R9r9N4O5q2L2K2o8M3oM9k9o4K9M7n5PJ2l2k8N2M3j4j0N7l8l9L5k0J7L3
2796D9o4KO4%r8K3L5l8L2l0QRrRK4j9Ok8KJ3k8P7n2l2L1qK0L7n5L5m8J3M1J8q8
2831d9N9J6mk2nN2p1k0O8J2m6O8l4Qq0K7qj8%Q4K5l2j4Mk1k0qP4o8N%K0m0Kl1
2866f7R6rn1lL9k1QM9q5ON6k3m4P5o7R5r0L4j9N5J7qj27J22o8KM5n8L5l4JJ5P5
2899E1n6L7q7R1n8MPj3k0j1N0M4m3Nm8J6Q8m2n0O0Mj6J3q3J50p7l5j5O3jm5pL7
2932A3m7P9l7N0m3k8NqP2p6N9r4QO1nm8P9k1M0n7O2k8o3M0nN0j6j1n3O4l2J0J7
$$ plain form
2704 -39 -41 -8 76 -31 -39 -43 7 -9 25 39 -4 -55 9 -30 -44 -74 -14 26 -18 4 -91 12 73 50 -51 33 -44 -15 70 65 -22
2735 -22 -83 -19 -45 3 32 38 -74 42 11 16 35 -32 -18 -89 63 -39 9 2 -9 13 40 10 42 -3 9 9 -18 37 14 -63
2765 -63 36 -63 -9 56 -26 6 28 -40 3 -3 46 17 -47 -18 29 -26 -19 -7 -39 -67 -15 28 14 4 61 23 -16 19 -1 16 49
2796 49 -15 -13 51 51 -47 -24 11 -27 5 -25 -17 -8 -17 -8 16 -3 3 -25 -23 -10 -38 39 -13 -45 -14 -22 -2 35 -20 15 -33 -20 21 39 -49
2831 -49 10 26 22 0 -5 47 -24 -44 24 36 -10 58 24 32 -48 -21 -29 -47 -47 37 62 30 16 20 -1 -21 -29 45 -23 -18 -18 2 -38 -36 -67
2866 -67 29 20 -31 -34 5 -16 -8 41 -44 -38 18 -5 -49 26 -41 54 -36 -2 -21 34 51 43 -84 38 -30 -28 17 -41 -6 -40 -39 -24 51
2899 51 -5 32 -55 36 -22 -18 -11 -24 -44 -55 -5 39 -4 1 -47 -31 57 15 -35 25 29 13 26 -57 93 16 -19 -34 29 28 -17 -24 13
2932 13 -34 45 8 58 15 -13 -8 -16 56 -20 39 -55 -47 14 9 -39 40 19 59 2 64 36 -27 13 8 58 42 31 -22 42 10 20 37
2965C7l2M7j6j5k0k0K6L2q2K6L9J4o9j6L5pK3o7N5k0lN7qk5O4j6q8L7l4O2k9l5
2997d8K1L1QJ1j0pJ0j0jl6L5K6p1N9k5j6qJ2rJ8M2p5N3o7M3L9J0J2m3n1M2J9Q4
3030I8j16J6J2O3r7M7j0j2m6K6jQm7R2n7k9N8m9L1L1p3Q4j1Qp5M8L9k8k8L4j3
3061Cj6O8m0k6K4Q2j22L5J7l1nrml2P9J2l8M3q9M1k6j0M5k6N4k9m5N8qNk0J9o8
3094e9L2L3n0L5j0L2l5O6kQk3p5N1k2j9K4K7k3%J0Qj0l8N9%J0j6l4M4l4J9J4r0
3127f8R3jJ3o9M8r8Q5M5Pk8p1P0n9J0J1K8o8kPP5j2k4o3M7M8rN0m6n5kM7k4L8
3160B3k6j1oJK2p4J7J37j23L6J3J9Lo1J0O0j9o2O7kor9O2L5k6k6K0kj6R4n7J3
3192A6k4Kpk9K6oj5L3K2jj8mk0OK1kj2M3n3J1L1m7K0k9R4n2JJm7N3m9J4nL7k9
$$ plain form
2965 37 5 52 36 21 1 -19 7 39 -43 -17 22 36 -33 -49 -14 -21 2 -65 -10 -30 -33 24 16 -9 55 39 -49 -12 -46 16 -13 -48
2997 -48 -27 4 12 23 13 6 16 6 5 -31 4 30 -41 18 -7 -23 -31 -19 -28 -10 32 -43 10 -57 -14 25 35 47 4 -47 -5 14 98
3030 98 -18 -2 10 73 -24 23 13 1 -45 -19 -20 -12 -59 33 -24 -53 5 -44 -13 18 -55 29 18 26 -49 -1 38 10 -18 16 3
3061 3 -13 55 15 -11 13 95 -27 8 25 -6 -11 -20 -24 -56 23 35 -3 40 -49 -8 -34 -44 1 -25 29 0 -45 13 5 10 -10 9 -59
3094 -59 -27 6 -44 -9 -19 13 -22 44 42 50 27 -48 3 -19 -38 -14 13 -10 -10 0 8 -2 -40 19 19 29 13 -21 23 -11 8 22 -68
3127 -68 25 24 37 -32 16 -82 3 48 55 27 -44 26 -33 -23 -12 16 -52 -54 -47 28 16 -8 -71 -24 24 15 65 19 -36 -38 9 -15 23
3160 23 -3 -14 -20 -19 3 -71 -54 83 -40 -4 9 28 31 -30 -20 40 21 -41 26 24 18 -81 -19 16 -10 -36 -16 -18 -34 60 3 16
3192 16 -8 -6 -13 -42 -16 -22 -37 -4 18 17 -1 -5 -25 -19 2 0 -12 31 -22 -11 20 -27 -7 -36 58 6 7 8 -39 14 -35 -21 -26 11 -18
3227a8POk1J3M6NJ8o1N0o8N0Pj4k4J0ol8l2K4M3nL1q7K0p0J03Qj0N6j13J2L5J2
3260a1L9m7M5k8K9J5m9L8q1J2N2rl7j8J7M7k1j3PKK7mj7n8L8PJ0K2lo4L8K6K2
3293C3j7J9l3q4N9M8q5P3%Om4K7M9k0j5mK0N1j06O6On6K7n1Q3k4n0nP4m6k0J9
3325@mQ0r5k3PK4P2p5N5o0K5J6L5j8j05N2n5J10p3M6Qp2Q6Nn0K3%l6L4J6mo3J0
3358b9K6j1jM5o2J7k8L4j8j6J6L6J2j4K2p7j1L2L4j5L0j6k9rJ7M0m5k5J9mM4l5
3390b1nL3K2m3%m1J16l8k6K9l3M5m1l4K8l8M9M2r6P4m3n2N8L6m2rj7K1Q5q6Om0
3422f1J09n0N2k2k9K5o7N5l2N1p9P1k7J5k0jm%J6K6m8K3kO3n2m8J4k1L8l9J5j8
3454d7O6J0r3K4rM8ML4J1p8j7O3n4KM1m2L2j0L2l9K2l8K2RpM1l1k0N9pj4K9o7
$$ plain form
3227 -18 -11 -5 -26 -13 33 38 56 -5 45 -23 27 34 20 -4 6 0 -38 -70 -46 -3 -8 23 -64 -44 -114 -11 -3 -13 43 -70 -58 -23 -11
3260 -11 28 -19 26 -2 27 42 -7 31 -50 -38 14 5 -32 -50 -33 14 -7 -20 -13 -11 16 12 -5 -63 -25 -18 -8 14 11 -53 -15 11 33
3293 33 16 35 2 -82 -23 25 -60 13 13 19 -25 2 51 31 16 12 32 83 -23 43 49 -7 20 -31 52 28 -22 -27 47 1 -19 0
3325 0 -4 76 -19 -42 -35 -11 61 -14 41 -19 6 22 57 39 -66 -14 -69 41 -32 14 22 -50 36 41 -9 14 14 -22 12 28 24 -39 -29
3358 -29 -3 -14 -15 30 -32 -15 -43 -9 -27 -43 -27 9 21 7 29 -48 -59 -27 7 -8 22 6 -23 -32 -15 25 -20 -45 -26 -30 14 -21
3390 -21 -26 7 29 -14 -14 -55 61 23 -3 26 -7 38 -3 -37 -9 -47 2 44 -52 22 -21 -73 -15 21 -21 -30 -47 -26 59 -27 -21 -61
3422 -61 48 -2 50 28 -1 24 -43 12 -20 31 -48 23 -4 11 -9 -10 -14 -14 2 28 -20 3 1 64 12 -36 -22 -43 -5 -44 -29 -47
3454 -47 19 29 -64 -40 -49 -1 3 37 48 -30 -47 16 -38 -36 5 -37 -5 -15 17 -22 0 -38 -16 -7 -14 27 -4 -24 35 28 14 43 -24
3487b4l3N3M6k7k6qL9r0P7Oqml8J6NQ7l6k2ok6J1j3m6O2l9N0M1k8MKNMj2ol8k0
3523d2P8m9J8N7o3k5P3m2m0L5k6l5N2K4m0N6k8m9K9k2J23l3n6Qm3N3o2P6o8O2
3553B1l1J6Kq5O9%M6rl4L5o5LN7n0P1J9j06JO5l6M3L3q4L5k7kL7p0Q1k2m1RlK6
3587DPK2o3K9J8r0J4Q9Qj8K6j22M8l7N7JoJ2j5k5L9j1k1J0M1m3K2J2n8O6l1j1
3619b6J5nj5J3kP2p3J8k8j3J8K6jL4m1RM2o7P5o0K9J5n7K2k4M3m0Q8j24M2PL1
3651B3l2j9N3m3K6l9K0j7M8o8LP1Pj3l1K5l1n8N5ll6P0k5J6qL3m7j8P3l7o9Q6
3683A5n1NN8Jo1RQK6j9M7l9j1L1k0J2l6O5n7MRk8L9j8L7o6N7p2P8n1lJ5L8o2K3
3717a7L0l9k3NJ8K5K2p9M2LPL6q1O7Ln5P8l5j2K0m1J8k0R4n5nOj7K6j1J7p4N4
$$ plain form
3487 -24 -57 -4 42 15 -11 -19 20 -70 7 13 5 1 -37 -21 -16 71 35 13 7 -19 -8 -21 -67 -5 -44 6 47 19 23 25 30 34 22 16 -22 -42
3523 -42 36 -13 5 62 -1 -26 47 5 -35 0 -26 -61 -9 15 -25 31 3 -46 -17 -39 84 51 -5 3 -40 13 -49 27 -41 21
3553 21 -10 6 8 -77 -8 -8 38 29 -5 30 -35 -32 25 -25 46 65 -41 -40 25 -11 32 65 -19 16 -11 -13 24 -46 35 13 -28 -19 -22 4
3587 4 11 33 -30 -1 17 -73 -59 30 38 20 46 -76 -28 -65 -8 -7 -13 -1 -16 -41 -2 -13 -34 -24 17 -26 -4 8 -50 16 -15 -26
3619 -26 -11 -16 -31 -18 -20 52 -21 -3 -31 -44 -26 0 -1 33 -8 1 43 -24 51 -9 20 35 -22 0 -24 19 -21 67 -57 -15 -8 23
3651 23 -9 -28 25 -18 8 -31 -11 -28 20 -48 -45 26 33 20 -11 14 -17 -75 -20 -23 -59 11 -14 2 -6 27 -20 -38 35 -2 -71 15
3683 15 -36 -31 27 28 -33 -24 -16 10 -9 38 -1 -12 19 -1 11 -25 40 -17 -13 -4 -32 7 -11 26 -40 17 -55 23 -28 -31 -16 22 -40 -17
3717 -17 13 -26 -49 -44 -26 -1 21 -58 -16 -13 -6 30 -51 16 19 -36 42 7 -5 15 -26 -8 -28 66 11 6 12 -5 21 10 27 -47 7
3750Gj8L0l5l0O6mJ7nk1k0m8Q2m1j1JPJ9qJ0ONj5j8J00m3k8K2r0M2J01j25K7K4
3783Fk8L8p6N4NK9j2L0m6m2J14q6l4Q6r0N9l9N8p2J1N5j7J8n9N6ln5K9k1j1O9
3814B6qj6Lj3l5J1Q6q9Pj7M1j8J0Ml7R7n1k1M8k0jk6P2o6rj1M2q5L1L6mP0p2L7
3848B2j8j0n1O0j7PK5Kom6O8k2L7k3n2j6Q2m0k1J6J3L4o0j0K3M9l3MRL2j19L8
3880b3K3K0j5J2m1L9J8j4n4N7m4O7n6K5j2j5PO1j16N1j0k0M2Kj7J6L9j4m6rL7
3911A0K7m9J6L8j01N6L5q0Q1m0K7K7n2m6M2o8O5N5n5M6m2J6Mm3M6l2O5l6j3K4
3941B3J9n4l2O3oJ6l%o4O5n6K3J8j2k6N2k9M4m3k9j0K8Qk9J8MJ9kl0l2K2P2m3
3974fj3N1l9m9j5Q1K4p9P1q1L2k8N5rK1m9PL4m0L1J0lk1J2J7l0J9Jl2L0J7l0l
$$ plain form
3750 7 -11 19 -16 -46 20 16 33 28 7 -13 -61 21 -20 -31 -30 -23 -4 -12 -2 4 9 -6 -24 76 33 5 27 -63 -21 80 -45 -18 6
3783 6 -22 16 -60 -6 -1 28 16 46 0 -42 72 -14 -48 38 -52 7 -32 26 -46 -35 20 3 21 -38 18 15 -40 -11 -32 -43 26
3814 26 18 2 5 -8 -43 -32 54 -35 -28 -45 -4 -22 -12 -8 -45 52 1 -20 28 8 7 -19 53 -13 -22 -33 9 -76 -45 -9 -13 57 -15 22
3848 22 4 -6 -57 3 -14 -7 18 20 14 -32 36 14 51 28 -24 -40 42 2 -19 -3 10 44 -16 -26 -3 46 13 17 26 58 -61 -23
3880 -23 0 20 5 17 -24 15 33 19 -35 22 -22 45 -11 14 2 -13 -6 55 -61 -10 -20 -40 2 4 -13 3 42 28 -18 -27 10
3911 10 37 -12 4 42 -59 -3 32 -48 33 -7 20 47 -5 -51 -9 -77 -12 43 -12 34 -8 8 12 -31 15 -17 48 12 -1 23
3941 23 42 -12 -44 19 13 29 26 26 -38 27 -29 -6 12 0 -26 26 -3 41 -2 -31 -41 -13 -5 -34 -16 -12 7 5 -25 -57 -35 37 -6
3974 -6 -19 32 -7 -56 -71 10 34 -45 26 -55 -23 -51 4 -5 16 -33 -26 8 -32 -1 9 6 -15 -3 14 -16 3 4 -28 2 19 -11 -14
4007a4J2J5k5K0j6L7M5j20PKk8R1k9K0k3J4m3j8J4J6QJ3O0r2J1M2l3m4M8L5n8
4038c3M2OLK5on0K0l1N2l2j3k4L3oL4p5L1j1J9Rj5K4l0N2l4j9J6P3rl4m9N0k7
4071iL1q1J07jp3R2Kl4m0M5l1l6R2j09j7Q6l2K0m8JM0n0L0J5l6K4pmj3MJ3N3j8
4104A6l1n5O9J5m3K9J0rl8k9J10j6l0M2n7jjN7n6J0L5k8N2l8k3Q1o0j6oN9n7K8
4136A9p7L7l0PJ4k0J6O0j01L3L8k6j9j0N9k4L9J8n8N9m0jj7P1m8OlmJ00n6l6K9
4168C5k8l7L7jl2OPm6M5L9j7q2O4l0J4N2l7l8LL9j5M3n7MKM2J3n5Pn9N3P9n0K0
4202B0j9L1k9k9O7j37P7RL5nk7Nl4J16j73J09l7%M0m6K1qmj7P6l7p7O1nK3l6K3
4234gloJ6N0q0J9mR9j20L9q5K0Q6J7l4n9L0J3l2L2L2k7J0%j0L1m4QL8N0m3m9Q3
$$ plain form
4007 -14 -2 13 -12 8 -8 29 74 -46 -39 -37 -65 26 -3 17 -6 8 -35 -53 -39 -23 -15 -2 58 -34 -23 19 -14 -58 -10 25 -33
4038 -33 9 15 18 43 37 -13 7 -24 28 -4 -17 -41 -8 -14 20 -55 -24 -35 -16 -7 -22 2 -28 24 -10 -29 -13 60 51 17 -32 18 -9
4071 -9 22 -59 48 47 -26 66 68 34 -6 39 8 -28 64 -45 -62 24 -8 12 -36 -35 5 -45 -15 0 -36 -12 -19 -23 -36 -32 -19 34 16
4104 16 -15 -70 -1 14 -29 0 10 1 -37 -66 44 28 -2 40 -17 -18 -19 38 -18 -8 27 -1 51 13 -10 71 11 -5 -11 48 -9 19
4136 19 -58 -21 -51 -44 -30 -50 -34 26 -75 -42 -4 -30 -49 -59 0 -24 15 33 -25 34 -6 -7 -24 47 -1 5 2 -2 98 42 6 35
4168 35 7 -30 7 6 -26 -20 -13 -59 -14 25 8 -74 -10 -40 -26 26 -11 -49 -46 -7 -22 21 -36 -32 -30 12 25 -30 -23 -82 -29 50 0 20
4202 20 1 32 3 -26 41 -96 -19 -10 25 20 -7 -2 -36 80 -93 16 -21 -21 19 -27 -6 -14 -18 -35 41 4 -73 -12 -17 6 -30 -7
4234 -7 -10 -16 0 50 -30 -11 -15 84 -36 3 -82 -62 24 41 7 -52 -22 -9 -41 -9 23 -4 6 6 -4 27 -17 -9 29 79 36 -13 70
4267G0l3m5nJ5r1J00n5L6m2rN2KJ4k4J3N8q8K7J7mmrN1l9K7ln3K1pK8p6m6J21
4300A9ql3M2o5M7J8Lk6J1o9R8m6j6pNL5ml9LL5q7M6N0q9M4k3M7N0q1PN6kK9p8
4334b8KK3K2K9n7J1k4K7J1k5m6L6m0R6J9m3j34R4J7L1k6k9j2O6o8j8O8k7J6J0
4364AM2l9m8L1K0JJ0K3p6N5%N5r1M6J5j7j3l1%L2L4j5n1ml6k0O7K2n2O9k2l3L2
4397Gj9J7L6o5j7J13j08J0j4L6opj8J1QM4J9k3j4j6Qj6n5Q2kJ2m2n5K6N9Rn4K8
4430fn9Q4p2M3ml0J6%L2k9JJ7o7Q1K6j9j8J8J1l5K0n6QLN2O4j26M6kK0K9p4K8
4463BJ7n9K5L4%p6K1P2j1qMj3Lm7M8o4O4L3J7j9m0l0J8JQmpK2K6n7oJ7L3N2r1
4498a5oK4l4P8m2k0K0l7O3o0L0j1l0J4%K6j9j8J2LL3jp7L1N0K1mn2o0O6%J3m5
$$ plain form
4267 70 37 -8 -13 2 -89 11 -44 -8 -50 -59 -7 -5 9 -15 -2 56 -32 -5 12 8 4 -5 46 7 34 31 -22 -1 -8 20 -56 -102 19
4300 19 11 -22 20 -45 2 20 23 -3 8 -61 37 -9 -25 -32 -27 8 4 -35 -32 3 -84 -38 12 -77 -33 -56 -9 41 -40 -33 23 21 50 -28
4334 -28 -26 -3 19 48 -9 2 -22 5 16 -9 -55 -19 -59 37 56 13 -121 -27 -10 21 -5 -34 -46 20 -48 -66 2 -25 -9 1
4364 1 43 4 -44 -13 7 8 18 41 -35 20 20 75 -16 30 45 28 15 -16 -16 16 50 35 -16 -20 -56 -76 -9 13 -39 30 8 -25 7
4397 7 -12 5 41 -24 -41 72 -36 -26 -40 -4 -10 -17 -35 -24 -16 28 47 24 10 -6 2 -14 -69 13 11 23 -19 -74 -48 11 20 -34 -6
4430 -6 -65 19 -53 -10 -14 -44 -28 -28 4 -25 -24 -7 -74 7 33 14 -4 14 25 -10 10 -46 -38 -35 17 81 -45 1 -1 19 48 -26 2
4463 2 19 -40 -15 19 19 -57 -36 36 25 17 21 8 11 -36 12 -52 12 45 62 43 3 -27 -9 -8 0 -4 -11 11 37 -20 -26 -9 24 76 -15
4498 -15 -21 3 -31 47 5 -15 5 -32 31 -29 1 -10 -40 -26 -26 0 -19 -37 -25 -22 11 10 -67 -36 14 35 31 -21 -81 -15 -15 -2 -47
4531d7R2o6J2k4m1L7j4M6J5Qp0K7J2M4n9K5N4p2K7Lkrl7K7QKj5k2QN9k3Lk9J5
4565f%Jl1J1LkL3K3q2j2O1J5m6Q1n0k5P4n0RKm8J8L9KJl1J8K9Po4J9Ql3L2j5J7
4601Hqp9J36r1O7l5j9PJ5ko1P0j7L0l2k7j4J7mK2K3m3nJ13l8J7q6M6P2o9K8p3
4633c2JP6k5pn0M9j2qk4L8l7J1J2K4l1m8R4o5m2M2N0lm5K5l7P0l5j7L5mJ4J7k7
4666IL0l3lj1j2K2lM9q3N0j5L0%m2m3M8k4L5KK6p6Q5o3nK2qj5m0N0K6l8MnK7J8
4701A4r0N8M0l7LK1l1QN4m8j7NN5k4jj9lM8n0N1l3l5J2K3l1L4k4n6P2k1MK4j8
4734a2j8J2K4j0pm2Q1q6P8pm1O1l9n0L3j0M7J3pko6M8K8l9J7n9K3J5lO1r5O4j2
4767@k7M3m2k9P5p7O3k9L3l6nL1j1k2O8n7R1p2p1M8L5m2L2j6M2kok4K9n6N6p0
$$ plain form
4531 -47 45 -21 -9 -33 -74 -37 -51 -5 10 18 -52 -25 -13 31 -28 -3 51 -21 6 9 7 -2 -39 -12 -4 -2 -17 -39 -31 28 5 8 -21 -6
4565 -6 -6 -5 -36 -25 -22 -24 9 32 -50 -62 -1 14 -32 49 -1 -26 48 -2 7 9 -39 -21 18 20 21 -10 8 37 44 -20 -1 7 -26 6 -9 8
4601 8 0 -79 57 -34 33 -2 -21 -14 1 -1 -62 8 -9 21 -11 -38 -52 -35 -39 -17 6 -37 -42 71 33 50 -36 10 82 13 41 -32
4633 -32 -31 45 20 13 -37 12 0 -8 -32 6 -31 -20 -8 16 -15 -63 31 -34 -76 -34 16 13 -32 -7 -44 26 -9 -26 9 5 19 36 9
4666 9 39 6 3 -8 -20 2 -1 48 -35 15 0 30 30 -12 -55 -7 -31 4 6 32 -44 41 -22 -27 -5 -13 -28 -68 -18 8 -30 -26 -31 -4 14
4701 14 -76 -18 22 -15 -12 9 -22 -14 40 -8 -25 -20 35 11 10 -9 -12 36 -14 37 4 -31 -19 4 -27 7 -17 -73 -1 -22 -18 6 -12
4734 -12 -30 -18 6 -4 -11 -53 28 -58 20 13 -28 33 -6 -56 -23 -33 14 27 20 18 -48 0 28 -11 6 -53 -30 -15 -18 43 -52 12 0
4767 0 -27 16 -26 -55 20 -57 6 -23 10 -26 -31 0 -11 -33 35 -22 69 -3 -74 -26 9 -33 -1 -17 25 23 17 -7 22 -34 22 -48
4799d8O6M0j5k2p6J8NML5o2N4J7k4l7QM6K5m6j8J3RK7j8L8l1p7Q3j4J3Kj01P6
4831a0j5J46j60L7J3n3K6nLK9m1N4l4O2l7j9RJ6k9k8j6Q7o2M8n0OM5l7j3j7J5
4862c0k7J01r5n6J04J9j3jO2Om8m2j1J24k8j04P1K5p2Oj6O9n5l4Q0l5K5j2k8L0
4892A5m6J1K5Kj8k2P7k6j6o3J0M9KPjRk4l2K4j6L9j4J0l2M2j0j9L5l5nK4K9J1
4925D2q7P9l3L3Ml8J9l1L9j1lj5j7J2l9oL0PK6n7P4k5k7J7RLll8R7q0J5K3j7n1
4959d9Q2r0N3K4j5n1J2L2j6M2J8m6l2L1MOOk4k4J2J7jk1LK4KQp5R8j8n0M3J8j9
4993Dk3L1k0M1n6l5J6N3Nj3k3N8j9j4K2l8O4m1m2M7KK4pjn7M6l7qpJ0K8jk2m6
5027e9J6j4L3%M7j1J7m5M8m8lkK5K5o0K9LM7n3l0j0N3Jm8P5qkk3RJ5Pj1l3k7P5
$$ plain form
4799 -48 18 58 43 21 -55 -37 -32 -28 7 -55 -1 16 -8 -45 -37 9 34 -12 -30 -17 -8 19 1 39 8 -69 14 0 13 15 -86 -10
4831 -10 -25 121 -39 -2 11 -42 -16 -21 -18 11 -30 24 -10 52 15 -4 5 21 -8 -36 -52 35 -27 21 -29 -23 22 -15 -28 -45 -30
4862 -30 -57 44 -51 -107 -3 16 3 2 64 70 22 -20 -31 93 65 -39 32 57 -15 -9 -25 44 -11 -45 35 0 25 13 -15 15
4892 15 -31 -20 5 7 -11 -33 44 18 2 -61 -51 -2 0 7 6 15 -9 -41 -17 -33 6 -8 2 -30 12 2 -17 18 -17 -22 2 31 42
4925 42 -45 34 1 34 38 0 19 -12 27 16 13 -2 -19 -7 -46 -52 -22 -15 11 -46 28 3 -24 -7 2 5 2 -36 61 -19 -4 19 2 -49
4959 -49 33 -57 -4 20 5 -46 -34 -2 -18 24 42 -4 -36 -5 -1 5 11 -13 -37 -25 -8 -9 -30 -27 -3 -1 7 -68 30 12 -38 5 23 4
4993 4 -19 12 -8 33 -23 -58 -42 11 16 3 -20 38 19 5 27 -11 53 12 -30 17 19 43 36 35 -22 24 -13 -21 -28 -18 10 9 -13 -59
5027 -59 -43 -57 -24 -24 23 12 29 -16 32 -16 -19 -21 4 29 -31 -2 1 48 -5 -35 -45 8 9 -39 36 28 26 3 12 27 34 23 -10 -37 38
5062C8p6M6ko3K6p9J69n2jJ8p1K5K4Pl0J7l1j0M1L7j05M6P5n9J8km4L2k8N5k0
5093Ak6K9J1J3Ll8K7j0l0K7l5N7l2M7n7J9kk4O3K3o5n5O1k2l5M4j1N7m6k0j9N4
5125Ij7k9PN2m9jM9oj5j0M2l0pM2j3J5k3qm0K7L2p2Q6m3j0pL1n1L4j0J4L2o2j1
5159d2M3L6ll4l6N5n5J0QRJoLL5Qm4L9l7J6NJ1p2M2j1L7q0L9pL9j0l1l4O6p1J16
5194D5l3qRPL8p5j1j3L1rj9L1k2K3j0k0N1k3k9R7n0l3K8j9qK9pM7l7m5O3MK1n1
5228BL2mk4j5J3lK0J2o0Mlk3N1j5K2Om6O7k2Pn2J1k1P4o1N0m6J7L6q2L8K6j9L8
5262C0l2Nm0J05p7M9r2M6k1K2J4l1L3l8L4j8M2m6M8l8l7J5K9l5j7M7n0M4KK7o
5293A4k4K8Nk0M9p9K6rK2j7o8Q0j6M1j1J7k3J7l3L0kj6K7q1RO5n0j6M7k8l0L1
$$ plain form
5062 38 -38 8 6 -57 -31 -110 59 7 6 24 -47 -22 2 9 -21 -4 -35 -45 -4 33 -72 -26 49 -10 8 6 -38 -6 -34 21 1
5093 1 -25 4 15 28 31 -7 20 10 -20 7 -28 29 -3 44 -13 6 4 -20 43 66 1 -54 7 -15 -50 -6 -17 40 -6 -26 -45 9
5125 9 -8 -37 -30 22 -27 -28 21 15 0 -10 32 2 -5 37 24 39 16 8 -32 -5 27 -45 41 -2 -12 -19 12 -39 -5 -15 -1 31 -31 -42
5159 -42 1 37 34 0 -36 19 -36 -26 -18 -9 -8 -14 -11 24 32 -12 27 -10 6 11 22 -50 -8 -19 18 -62 -23 -30 9 -1 -32 -66 0 -71 45
5194 45 12 4 13 20 58 -17 -28 -41 -10 -19 -38 -7 -29 -6 -16 -36 15 -8 -37 60 10 -23 5 -14 -22 7 0 47 10 -35 28 32 53 2
5228 2 34 30 6 -9 4 1 21 33 -27 -23 -26 -49 2 -13 9 15 -31 36 14 21 -31 -20 -41 33 -28 22 -24 -7 29 -53 -15 11 -8 30
5262 30 -2 3 -37 68 -9 40 -52 -6 -27 -5 9 -22 11 -27 7 -11 31 -15 33 -5 -42 -27 2 -33 -50 -3 -53 -9 -7 20 14
5293 14 -10 18 23 3 52 -27 -1 -10 12 -5 -73 7 -9 32 21 38 15 32 -1 29 27 11 38 -43 -34 31 -19 -35 12 -16 -46 -15
5325a5k4N1j3J9mj5nkO6m9l1qL6p3M4J3pK5J0j0pO8n4qNO8j9l6j7Qj3JML4k4l
5361A5k6k0R4j05P6k8j1L7l0k4L4KK2l4j0lLJ0M6o3%K3n4M4MM0l8K7n4J5L3n7
5393c2lKrK9jN5J2l0n2L0j1n8P9M6o5k0K4M7Mj16P9m2K2j9QJk4L8M0j3k5K9l6
5426a1L1mp0N0JL3l3l4K5P1o3j5L8j9j0k9R3o8M5n7k7N6K0Mk2o3N5k9L8o2O2j7
5458a1l6N1J2k4j6k3N1o1O2j4qrJ00k7n2N7n0Ll1jM5j2K2j2Po1L7K0okJ3pj5L6
5492C8k7j5M6j02Q6l7kK6k7N7r8Q4m9KJ7m4N0J0n5n8R4m1L8Rl8kJ4j3L2K0k8M9
5524C6l4K2l6J8j4J0j1l6O1K2r1J25q5JK6%m2l3J00o3j4J2pL9j6Q5p1K3j3o4M6
5555dJ1l9kM8l8QJ9NrJ9k5k6M7m2n4L2J0nJ4N7j6k7k5P2m8JK4K1j3k0K4q5N5o
$$ plain form
5325 -15 -39 12 -1 18 14 -1 -6 -8 58 9 -22 -30 6 -67 -23 -10 -17 8 18 8 1 69 15 7 12 80 61 25 8 16 3 4 8 42 18 15
5361 15 -11 -31 63 -42 34 6 -5 32 2 -22 12 14 36 2 -8 -11 -8 2 48 -15 -15 8 -46 -2 2 42 4 31 -23 -8 25 -32
5393 -32 -35 -33 -42 -13 -14 41 53 23 -29 1 -10 -68 11 57 -8 -28 -4 43 47 -69 10 -32 -10 -29 -21 -20 -44 -6 34 21 -4 25 -11
5426 -11 20 16 -54 -4 -3 30 -3 -37 -12 59 -4 -19 19 0 -10 -39 54 -14 31 -26 -53 3 23 27 5 -58 -3 -32 6 -56 6 -11
5458 -11 -47 4 16 -8 -24 -47 4 -57 5 -9 -17 -26 74 47 -5 52 2 5 -26 -27 18 6 28 16 23 -38 -1 19 13 11 24 17 2 38
5492 38 11 -4 42 -60 26 -11 -13 13 -14 43 -55 29 -20 -18 -1 -45 5 15 -40 -98 -4 -45 -7 2 -36 -38 -24 -37 -5 15 -13 36
5524 36 2 24 -12 6 -8 2 -9 -45 16 38 -53 72 -13 -12 14 14 -28 -61 39 -24 -38 -26 -33 6 -10 75 4 27 14 -50 -4
5555 -4 7 -32 -34 14 -24 -16 3 8 -1 18 -7 -33 14 -28 -82 -50 -40 -45 -31 26 10 -17 -42 30 -18 -17 7 28 15 -5 19 -66 -11 -17
5589a7N3o7j5L2N2n6nK0j0k6PMK7j4l5O9k4K1j1J6k9K5Ln3O2J1j8k6Kj5L%m0N3
5623am6M8P2j23M9K9o5N9n1L4p2N7KRK3n0k2M5K6m4Ql0J2P0jo9O4m7j2qj1M9m3
5656c9M6J1l4L4J5n5j3J0J1J1N4p9NK5k1n5L6L0o9O7PJ8j7J7m5lNN9l2j3K4j4
5688dN4n2k2RPJ5j0k0J6O8k3k1k6L1j9j7j9N9n8M9l8J8m4O5M1o5k1M4k4l4K5K
5720a4l1M5Ok5K2kk6M2M0m8rN0k3k5J4l0oOL0m9j2L4j0K0m0J8L9J5j0k0k1k4J3
5753c1N2k4l9M1Ll8M2J7n1Rj4qK0M3n6oL8N0p0N5K1o2M1l7O7o1KOm4J0J3L0j6
5786Cl4J5j5N7L0q8J5L6l8lK6j4kK1mM5o1j5K6j7LoN3k1K5qn6k2NN3J3pk2N9l2
5821B0K7o0n4Q3J7m0L1k9JJ1j6L1K7n3K8k8k8k5K6N6K4o4J4M6j2m7K4%k3J2k4
$$ plain form
5589 -17 36 -31 -46 -14 38 -18 -23 -3 -13 -39 -32 -28 -1 -15 -50 19 -5 16 5 21 -8 17 20 -33 29 40 22 -4 -2 -17 -14 -14 -54 -1
5623 -1 -47 1 73 -50 -1 28 -37 22 -29 5 -67 -10 -8 1 24 -26 -48 -3 23 -21 -13 -43 -31 39 38 -31 33 -14 -26 -34 -45 4 -39
5656 -39 7 18 -16 18 33 -22 -35 -25 -14 -3 51 -28 -23 2 -19 -74 -38 -8 -77 -10 -3 15 -2 15 -30 -33 -28 31 -1 -14 10 -4
5688 -4 50 -2 -24 -15 -8 7 -3 -23 -7 61 38 17 -9 22 3 -14 -33 26 -32 17 -21 -3 -47 18 59 -6 -27 17 -7 -41 -16 -14
5720 -14 -45 0 6 -19 3 1 -25 17 57 9 0 50 27 2 16 -14 -20 -14 16 -33 -45 -11 -21 -1 -41 -23 16 31 21 1 -20 -44 -31
5753 -31 21 -3 -42 -1 2 -36 6 23 -28 -19 -33 -41 -21 22 -34 -40 -2 48 -22 33 54 -8 33 -4 63 2 4 10 -34 -24 -11 19 3
5786 3 -31 -16 -31 26 56 -32 -17 19 -19 -22 4 -10 -12 9 5 50 -11 -26 0 -17 -14 -20 33 12 37 29 -27 -49 -44 9 22 15 -7 52 20
5821 20 47 -13 -67 16 33 -7 24 -5 -4 7 -9 22 49 -4 24 -4 -32 -57 -31 25 49 -15 -1 45 33 -14 10 10 -13 -1 -25
5852b5L4nK4nm0K6Ok1LpP0m1l9m2R7l3mj8P5p4QJ4Ll0OLLpkO7j08J31p0m8L2k4
5888d1oP8l7j2J6K8k2l4J3M4k0J0K5k7mmKk0K0J8mo6L9N7p2K9K2Mk3Mk5j7P1r0
5922d4L9K2m8rO8m0L5m0K4K0l0n7J8J3OJ0K0J1Ol5O5o6M0N3o2j3mP0q8qK1l6R0
5955E1m0J5k6L6k5l9j7P7l8Or1L9N2J0j3J7j4l6K2JJ4Km9M7L2J4Lp0J7k5M8n2
5987c2M4j5q4O9J4p6J14J9m8j1L6k8po4M3J7Pln2N4mo8O9k4P0Pm9l7O1n0N5l1
6019dK5j5M0J6q2J02n0nn8L2K2j4j8J6L8l2k9n3R8l2L7p2M3o1qJ6M2J7j4mJ9l2
6051b0PJ7k0J9oJ5q0O7pQn7J09n3OK5m2m2K8L7p1L8L3L5n1%O8o0k7N5n0j0L4l3
6084b8M8Mn6j5K1J5J0J5j9K0m2mj4L5l2L3k8M1Rj5j8JK9j8K4L6n2NJMM4j15O5
$$ plain form
5852 -25 9 4 28 23 -17 9 15 -6 -3 -10 60 19 -20 -62 35 2 -2 -20 55 -19 -11 3 6 -24 -18 -15 -12 -19 -21 46 -62 69 -1 -49 -17 -41
5888 -41 -47 31 -6 -18 -2 26 4 -30 -17 27 7 17 42 15 11 7 9 -11 9 27 23 -43 -4 53 -19 10 32 36 13 17 -8 -25 46 -44
5922 -44 -5 17 -31 -40 28 -12 23 -17 7 27 -3 -60 -42 -29 -23 -13 7 18 24 -11 54 -12 28 81 19 6 2 72 -16 -24 -3 -39 51
5955 51 11 26 0 36 11 -28 -45 32 -6 0 -91 -52 0 10 -3 14 0 -36 -14 -13 1 3 -46 1 33 47 50 -20 -3 -28 20 -32
5987 -32 12 -3 -87 -18 -4 -80 34 53 5 -6 30 2 -5 -69 -26 -9 -2 -5 -57 -3 -7 -75 -6 -30 40 47 -2 -39 22 -28 27 -4
6019 -4 21 6 46 62 -20 82 32 27 -31 1 23 9 -9 7 45 13 -16 -69 29 -3 34 -38 5 -56 -64 -48 -6 11 -3 -7 12 -20
6051 -20 -13 4 -16 3 -3 12 -68 -1 -8 0 -57 52 -1 5 30 -12 -54 -26 11 -60 -22 11 46 -5 -5 63 3 -24 31 -19 -29 5 -28
6084 -28 20 24 -32 -47 -26 -11 -1 14 -5 15 -27 -31 -45 -10 -42 -9 -37 4 13 -2 -20 -19 10 -8 16 52 0 5 6 10 54 -61 4
6117Dj2k0J6p5P7MrK3l2L2Jo3M9K7l1l5M2j9O2o0l0K1L1L3l1k7ok6M7Lj4pJ7Q
6151@k6j7N1J9l4JL2jr6P8J9j2l3L8m7Q1k0n1j1L1Ol2J3J9j6L8m7L1l1P%J8J8
6184B6Qm3j0K3k4rJ6M8m1Pm8O5m1Kj2K2K0oK1n6P8Ml6JM2p5J3P2r6L9p0J13m8
6217EK6n6M4Ro2N6k8rK3o6L3Lj8j8N6K6p2M6nnp4R9qNK1pj1k9J9k2O9k2l5K2j4
6252Alj4N1q3QJ29q7%rKj6k5J3Nk1qO6L2j4K1j8j9j0n7N6k9JL6pm4Q4QM6q8L4
6287D1Mp6LM0j1N6m2l3J1j7M1k7K3OJ6o7N8j3l4j3L8K1l2k2K6L7jr8O7nl8N2J
6320A2k7j7N4p4L4OM9m3J7Nk2O6o8N3Ok5K1l7M1o7%J5L6M5o7lNl0l3M6ll0%K2
6354a3M3m3JJ3k6K3l8l2M9RJ8nl0N6m5J6Po7K3qQ6l5K5l3lL2kj0j8k8J9k8L2J8
$$ plain form
6117 4 -8 -28 -12 -87 -10 -6 -15 8 -24 8 9 -54 -5 22 -9 -44 -2 -21 41 -19 -49 -28 3 36 5 -22 -28 -54 -7 -4 -18 -25 -8 0
6151 0 -26 -43 8 27 -7 -6 26 25 -71 7 26 14 -19 19 -28 53 33 -18 -29 2 8 -24 -11 8 -8 30 -17 14 -17 -10 -10 8 26
6184 26 34 -9 -19 4 -20 -29 -13 35 -6 1 -47 18 -23 -21 -33 -11 9 3 24 -32 46 50 14 15 57 -18 -5 67 -29 10 -60 53 5
6217 5 31 -25 19 28 -34 22 -6 -15 8 -58 -25 -22 -40 -58 -2 24 -48 -2 -7 -12 -86 13 5 10 31 24 13 -16 3 -19 50 28 -7 15 1
6252 1 -2 -16 35 -48 -40 89 2 2 -7 -5 -21 -46 -33 -28 -49 -57 9 41 27 48 30 11 1 -56 0 -29 -28 8 1 -43 41 49 95 7 41
6287 41 45 -31 -28 12 1 57 15 -18 -7 -24 17 -10 13 19 35 -32 26 13 -21 -34 4 25 -7 -29 -3 34 33 -65 2 -3 -41 11 12
6320 12 -15 -32 22 -52 -18 -12 37 -6 11 16 -6 60 -8 45 51 26 47 10 51 -16 -16 -1 35 80 13 10 15 -15 -48 -2 -5 -35 -35 -13
6354 -13 30 -13 -12 1 -25 -2 -40 -72 -23 -14 4 -1 -31 25 -20 -4 3 -64 -41 -49 37 2 27 -6 -9 23 21 11 -7 -35 -16 -44 -12 6
6388Fj2Q4n9kJ1r7M7l2pR2m2jl1K9k0qL5n6P8lk6Q1j07P9q1K7j2M6kJ2j3l1P1
6421E6n8j1L7k7L1j8o8P2o7P1MJ0o3k7N1L0pL5j15J16m7LK1J2q0P0Mn3Jj9JK0
6453a5J9O8p0%O6l6KKm3J3kpL3o1K2PL2m3Nj8%J7qL4N1j04M1l7K9pL9j2Lm3%k2
6489d5nJ4R0l6m1l9M4j9M1QL8q4M0m7J2M1jk3RJRO6l0l0J5k6J1j0o1L3L6K3p6
6522d2Q6o4pK3N3km2m3L2jj9J2L4n9J3L9%l9J9M8l0K3n4j%L0k6N8Kr4O6l8K1k4
6556b6M4l1j0m5Q9K9k9j6M4j04P2n6KK9Pn4N3L6Jo4J5k6N7J6p7m9J04J1k6j6O9
6587D9m2k2Ql5N8l8M6J7m1QOM0nj08J9J9j2O9n6j7J3M5qn7O7J2k2%k5k6L7L7K
6620C8m7K4N7j25L1P2ml3Nj0ok4K2j3l2M2k9kM8k7L7p6K4O2o9K3m3M2nm3O2Pl4
$$ plain form
6388 6 -6 78 19 17 28 -69 -22 -54 -61 31 -11 -12 -43 -14 -34 -42 -7 -63 15 12 -14 67 -40 39 -42 -15 -27 19 17 29 16 -15 56
6421 56 -2 -13 24 -3 28 10 -58 14 -53 18 22 32 -31 -58 -7 23 16 51 -64 52 5 8 29 41 -39 31 35 -18 -17 -36 -35 -15
6453 -15 4 72 2 2 68 32 34 36 -7 6 4 -3 30 -31 -9 -2 30 -13 -8 -26 -26 -9 -17 17 68 -36 5 -32 -3 -10 29 17 20 -23 -23 -45
6489 -45 -50 -36 54 18 -23 -62 -18 -37 4 12 50 -34 6 -41 -29 12 11 -12 -3 -2 7 73 43 13 28 2 13 3 -58 -25 11 34 -42
6522 -42 44 -20 -27 -4 49 47 5 -38 -6 -7 -26 -14 20 -39 -26 13 13 -26 -7 41 11 34 -20 -21 -21 9 -17 41 43 -51 15 -23 -2 -26
6556 -26 18 -13 -23 -68 21 50 21 5 49 -55 17 -39 -37 -8 -1 -55 -2 34 35 -29 -14 -40 17 33 -44 -93 11 22 -4 -20 49
6587 49 7 -15 -7 -42 16 -22 24 41 0 8 14 54 49 -59 -40 -21 -33 36 -20 -37 -24 21 13 -44 23 35 13 13 -12 -38 -1 36 38
6620 38 -9 15 72 -53 -22 50 46 13 18 8 2 -22 0 -13 -45 -3 -32 -34 14 -13 24 -52 -28 34 -35 -12 -55 -13 -18 -61 1 8 -26
6653b6jl9L8l3P0J8m6J17j14k8J09j0m7L0m7oJ7l8N7m4M4m0K3Rn9N1l6J1o2N0
6683c2J1L0n8J7K7mj2k1pL5K2K2k8p5M1J9J0J5J1k0J9L0l5m2J7j4L1J8k3MNoM9
6716E6n1RL9n5K5pm1L0kk3%L3j4o2L7j9O8l4J9pk0K2k3M3k7n1M7L4l0nP3o2L9
6749D1j6Qk1O9r1J2m0J07m3n5O9m5J0k2P5m6l6rL5J8JoKm1j1K4pLJJ5n2Q0n4j4
6783c9N4K9p3QM5koj1Rqj7J8kk2K4N5o7M9m9p1J34p0j6l2K3N8m8N2q3L9L2lm2
6816c2M0p0M4Kl0J8P1n2L2n2J5J7n6M3QJk4L0k6N9L8j02Q3n0j4jJ6K8K2o3JK7
6848B3n4M3j8R%l7N0m0N6l8Rj2J1m9M2j7KM5q3O5k9J1LJ5J4L8n5pPQm3K9J1K%
6883A1mM3n6j0M3n5J8K2j1N2k7K6n9M5Nj1m2n6R1k5j3J7o8Q4n2K2oJ8pJ5m0P2
$$ plain form
6653 -26 -27 -66 -28 -61 9 27 -19 98 -16 -44 65 55 8 38 -9 -15 2 -36 21 -23 21 -19 4 13 -46 5 -31 -20 -82 -32
6683 -32 -21 9 -49 -32 -5 -9 -21 -42 -49 -14 8 30 2 -73 -32 -13 -3 12 23 3 22 52 17 -25 -8 -22 9 27 4 8 13 7 56
6716 56 5 14 53 -2 23 16 -25 5 3 -20 -20 13 -1 -63 -26 -45 23 -11 8 1 -19 3 -20 23 -4 -55 -8 26 -4 -9 64 2 41
6749 41 25 33 12 81 -10 2 -38 69 26 -29 40 -5 5 -17 58 12 -24 -33 2 20 21 15 17 -24 -35 -11 -18 -15 -14 1 -51 29 -25 -39
6783 -39 15 44 -29 -21 24 22 16 5 14 6 -11 7 5 -17 7 62 -5 44 -5 -76 58 -12 -28 -60 -37 21 -27 25 -58 -19 13 10 -32
6816 -32 8 -62 -18 -16 -46 -28 43 -9 23 -29 -14 3 -53 -10 -2 -1 -25 5 -21 38 76 -26 57 7 -7 -8 8 36 58 -5 -4 23
6848 23 -31 12 -6 3 3 -34 16 -24 32 -6 3 -9 2 -47 -5 -22 -20 25 -58 7 -22 -11 -8 7 21 59 4 -3 4 12 -31 -2 9 11 11
6883 11 7 50 -6 -16 27 -28 -10 12 1 53 26 52 -7 38 43 32 -10 -66 25 0 -13 4 -64 20 -32 -10 -16 2 -5 10 -30 42
6915D2l3n7J2N8J1l9O7o7pPK0OJ6l8qj2lO4k7j6k1L7Lj0K1nQj6l2k3M3lm2R2m3
6950En9M8q2N1O6RJ7n6k4L7p7J13k7m1O5Jo2L2m0L0K4o6K1l7M3L8j5j4KJ5m2R
6982a6K5o2N5n0P0n4N7n3L5k8Jm9P5J3l6Ml9Q1p7K1J3j4k4P1o3P8j3k8N1n4J2
7013Bjl6Q3m9N5n7J6j5K4Qm7Rkj3L4pj3N8m1o8O6oN1j01J8O0n6J8J0%nN2l0k6
7047iPj1L3k9K7k7K6Km4KLL9k2L3j5l7j1P7n4K5lN1l2l7K9l7J8m9O6Ol2m3N4n8
7081e2L7QPM6m6k5L8j7K8j5Qj0l3l7J01Lk4qk8K2K6l4R8n2o3R3j22M9kLK7n8k4
7114e6R2l9J8l2O3m1JpK5j1k1n9J04o4K7j0N4n5j6O0m3Oj0J3k7K9OOl6O9p7K7
7146dO7r8N1J9p4M1J9L9q5L9j8ok1mM2o0K7L0j7J8kK1o7L8J1m9lJ13o2n3N0l4
$$ plain form
6915 42 9 -48 -36 22 33 -6 61 -6 -13 -6 14 20 36 -2 -10 -22 -25 39 12 -4 -25 12 15 5 26 21 29 13 -19 -42 1 -2 -44 48 5
6950 5 -54 -6 -88 -37 29 38 55 -1 -25 12 -65 48 21 -20 45 46 -16 16 -24 6 30 -36 -15 -52 -9 29 14 0 2 17 -25 -16
6982 -16 9 -53 2 -48 22 -32 25 -28 7 -21 -20 -69 6 19 -17 -13 -52 29 -48 -27 -14 -28 -52 19 -44 34 21 -7 44 -10 2
7013 2 1 -35 48 -1 54 -3 13 -2 22 30 -17 -8 -10 -23 11 4 -9 49 8 -60 6 0 51 -50 -32 28 -28 -10 0 0 -5 47 17 -9
7047 -9 -2 -13 20 -9 18 -9 17 19 -25 -23 -20 19 -3 30 15 -22 -33 44 -10 15 12 63 31 -6 23 -14 4 -45 21 27 -5 -48 6 -52
7081 -52 -15 -7 0 46 0 -25 13 -4 24 9 17 7 -26 -63 38 41 17 9 -19 3 29 -5 93 41 -22 71 -51 -2 -4 -1 26 -32 -56
7114 -56 36 -3 15 -17 46 5 6 -1 24 13 -8 -67 37 -27 0 -10 44 -11 -27 33 -10 -4 -14 -1 -28 1 7 13 -23 46 -31 -4
7146 -4 63 -35 16 35 -39 2 21 60 -25 14 -4 -10 -31 -35 7 -53 -26 4 -13 5 3 24 -43 -5 6 -43 -46 67 5 -48 2 -32
7178c2N3n8N6j3M1n7k0P6p6L2j3nk4M6M5n6o0M9L0m4MJ02p0l5K9K3j8nMo0N6J9
7210A9l1L6M6j08L8j6J1l5K3J0L0m7L7K9l9j4l1L8lK6Rjp8R2n6J7mk1oQ0j6m7
7242a2N3m0m2M0nPk5K2K1Qj6K4l4l9L9l6L4J6qo0L2M0j7PlJ0j0j3nM6p2N6l1M7
7276C4n9KJ9k2M7J8rOl1m6K2K1k3M4l9P2p5Lk8J2L9Qj6N9m3n6K5K6n2K7L9MK4
7309E2o3lQjj5O4L0jq9L3n1OM5k7N3k8j7L7n6J3o1O1j2J9k3j6kN7k3qkj8N7J2
7343C1l5J7n6L5l9L0M4n2L8n6P5mk4j6j3qJ4P9j3p1N3km2J3k4M7j3L6pp2Q3p8
7375c0O1n9L2M5p0M2l0J8J6rNm1J3L4m0k2K2M0l9NN3n7O9o5M9j06N3K6j8L4k3
7406Hjo0L7L4on2oJ3J4n4P6J6pn3PLlKJO8o4j9P5m0M0k4m3N5J4k2l1K7nK6n4Q8
$$ plain form
7178 -32 21 -37 19 6 47 -10 -30 46 -30 2 -11 -16 -40 6 51 -5 -65 -16 14 -30 -26 76 6 -29 0 23 5 0 4 -56 0 19
7210 19 -12 24 70 -38 0 -16 -5 -40 -17 -7 23 -24 13 42 3 -11 -42 -4 -7 19 28 27 -51 41 -15 2 -2 -23 -29 51 35 -12
7242 -12 41 1 -41 -1 -6 1 -24 -2 19 27 11 35 1 -38 1 -35 -1 15 7 -53 -21 19 2 9 6 16 6 -7 -12 34 -38 18 -13 34
7276 34 -25 -23 -4 -26 21 39 30 36 5 -41 -19 2 -21 23 -16 56 -19 -16 -44 -32 7 15 -1 58 15 -41 -16 10 -42 -15 24 28 52
7309 52 -11 -14 -6 -7 -22 42 72 71 -18 15 -36 -30 15 -12 41 13 -4 33 -23 -10 -71 -10 -22 -3 -26 -42 -44 13 -10 -18 -20 -38 19 31
7343 31 -4 13 -43 -8 -47 -17 27 -25 13 -43 32 28 4 -12 -25 -33 -19 60 47 -24 29 27 -15 -2 -26 21 8 44 37 -35 48 -30
7375 -30 31 -28 4 49 -21 21 -9 9 25 16 21 -20 -7 27 -13 -35 -13 27 -12 -7 46 -11 58 -7 42 -64 -11 15 -3 31 8
7406 8 7 -53 -16 18 12 -40 -46 -33 -19 -73 3 19 12 -41 -34 -31 -34 -32 -31 37 -27 -46 29 -11 29 5 -38 17 31 9 -22 5 0 26 -28 60
7442F0m5K4l9%L5m0k3j7P3np1Q1j2p7P1k7J3m4k8M9pk6LK5K2J3O4q7L4j9k0L0
7474A0k0KM5j2jJ6p3P2k1nj0j6J9K5%l5MK8Km8NQk6N7k1k5Rj8k2Q7p7O4k1K1R
7509C2j13O7%L1j4M0p2N9q6P5l7K5k2qM8l2J6L8j7n0J3k1R1p6j7N7m8oMN8n2O
7541a1J6j4O2jl3q9N4J5Ml0LJ1o1N4k9K6QK5KMl8k0M7m2Q7n8QM5m0LJ8Nn9M8m0
7576b0N4l8K7j6Nm8K2PL4ml4J9K1Lo2K6k0M1K6p7lO7o1J4l1P6m4K6m2J00o9qk3
7609c2M5j9K7l8KP1o0m3M4M3p2N8K7p8L3L5m8L1l4nj4P1m3%j8J2l1M7m6K3J0O6
7641F4n7RoqK6l0K6J1qOl9rN6n9J7j5jK9kl7K6j7rl2O4Nj6pL2l0K3%n3%N5k9M0
7678B5L2n2MPl5j8L6k1M6m8j4K3K7k2K2l5J5J2k7L6Rl2N1No5L6k9k3PJ7K7o7R1
$$ plain form
7442 60 15 39 0 0 35 -5 -28 -45 28 23 -48 33 21 -56 15 -12 1 -43 -71 -22 -29 -55 -52 -27 -5 8 72 -15 19 0 -20 10
7474 10 -10 -8 37 25 24 40 -33 39 18 13 3 -13 6 31 31 -4 0 28 30 -18 -13 -5 -31 26 5 -20 -11 -29 -51 36 -41 23 2 23 32
7509 32 -81 -14 -14 17 3 43 -29 30 -56 19 -18 7 -15 -23 25 -7 9 47 30 -20 -7 -28 63 -13 -30 27 -21 -27 -23 35 -17 -11
7541 -11 5 -9 53 52 19 -70 -16 -1 3 -27 -24 -13 -74 -20 -49 -23 -15 10 12 16 -22 -42 5 -37 50 -8 0 45 5 8 26 31 -28 20 -20
7576 -20 34 -4 23 7 12 -36 -14 -7 27 23 -11 8 29 32 -30 -4 -24 17 43 -34 -37 30 -31 -17 -48 28 -16 10 -32 68 -1 -9 -32
7609 -32 13 -6 21 -17 -15 56 -4 -47 -3 40 -32 26 53 -25 8 43 -5 26 -8 -13 -27 44 1 1 -17 -5 -36 11 -35 -12 -2 64
7641 64 7 16 10 2 28 -2 24 35 27 33 -6 -15 41 -18 -1 -16 -17 12 10 -27 -1 -18 -27 -59 5 10 -6 -13 19 -11 12 12 -41 -41 14 -15 25
7678 25 57 5 9 16 -19 -37 -1 -22 24 -24 -38 -15 12 -10 12 -23 -8 4 -23 13 22 -10 41 46 -19 17 -12 -35 -28 -11 16 -51 40
7711D0p2J5RJ9mnpk5l4M5oP3l9l1%L9jj9JJ5jJ5j1j2K6n2P4n2oL4l3PK0ml5K2
7747EL9m3J4j9P8n1o8N4q0M5pL9Lk5K8k8m7N0Mk9J7J2K1K9l5K3p2K0Mk1R2o2m
7780a4l9O7L5k9j7K2K0k8j3L5q6O4kl8N8m5LJ1l3j1K4L4qk1L0p4M2Lk9l6R7J0
7812C2j6Mj9n2J9P0m7L6o7M4nK2K5Ql4m0M1j6m3O1lMk2p3P1m6nN4j00Q2kqPK3
7846Ej4N9n3j5K2kNKl0J3j1m1J02j10Q2kl6M8j3k5J6l7M7J3p7Q3k2K8rm1N3k7
7878A3Mn2J4kM4J4J2m8K4l7j4j1N3nL9o8kpN2l3K5k7k9P1K2o7K7L6Lm7Rk3MN1
7912D5Om4PlM5m0J5j9j2nnkl9M2Qk9O2J2l2j8Mj0j2M6j3k6L1K8J3j13P1k0j7M8
7946B4p2N7J0k1OL7LMk2p7N3N7n5J5J1j2k3L4J8mp2P8l7L2r2RL0J2j8K2l3M5l7
$$ plain form
7711 40 -32 -17 -8 11 7 2 -5 -30 -64 -19 -25 48 9 -22 -22 17 16 -3 -2 13 12 27 16 4 30 -22 52 0 -6 28 -5 2 22 18 -17 5
7747 5 44 1 15 -4 74 23 -45 9 -71 -26 -33 6 9 -16 12 -16 -63 -13 -9 -38 -21 -9 12 41 6 29 -43 -23 -19 -40 52 -10 -14
7780 -14 -53 14 49 20 3 25 45 17 4 39 -47 17 15 -23 35 -10 -7 4 -29 -40 -16 18 10 -11 19 -55 -13 -10 -39 -75 22 32
7812 32 16 20 1 -51 -32 38 -9 27 -40 4 -1 21 46 54 20 -20 21 5 -38 23 20 24 2 -71 0 -46 -51 3 -97 -15 -17 -25 -18 5
7846 5 -9 50 -3 -18 4 2 7 9 -21 -8 -19 -60 42 -68 14 12 -24 24 11 -14 2 -35 12 25 -52 31 9 37 28 -13 40 13
7878 13 17 -35 -21 -23 21 35 47 -1 23 -14 -28 -39 14 9 48 -20 -22 -29 23 -10 15 -12 -41 30 52 -15 12 48 51 4 13 -10 -6 45
7912 45 51 7 14 11 56 16 31 12 0 -5 -10 -12 -51 -9 -1 -30 32 44 12 -6 -2 -12 -24 22 9 -17 14 42 55 -58 13 -7 -24 24
7946 24 -48 9 19 -2 4 41 44 48 26 -51 2 59 4 19 30 18 -5 29 47 43 -29 49 12 44 -48 -39 -9 3 -15 7 -26 19 -18
7979a8J3k7RM1j5ll5K3j4J3L1k7rL0L0k0Qnl3N8k6j9m8MJ6L8j8M0j8nJ8l3O0n1
8013Hk8Lj9O3l3MJ2n5P5o2%L3KK1m5J7M7q1N1n6j5P6k9J8j1k9N6M0j04N3J7pl5
8046a3j5M7m4N7k2Pm5j2J4P7j15J2L8M0j0l1L0L3o6R1p8j4L5J4LRl1Qj3N8j0o2
8078hnK2j6j6K0J5lOmnJ2Mo2J2K5J1n6K6JJ8K8q7J00p0J6mK8J8j2J0J3p6L2L8
8112C1p1J2L1l8L5K8n2K8L9J9j0n6j0K1j2k8M7K0l7Lj4J8k7RK9m3P2l6Ml0j5J5
8144a8k9L1N6m2l7J5m5J18m1N9r8P5l4OL3k9pLj4KRj4K8K6l2ol5%n9N3Ok8j0R5
8178C7m6o0L8O8o5N9p8J6JmJ5J1N6
$$ plain form
7979 -18 -5 -32 -23 18 3 0 -35 -12 -26 -13 18 -9 -18 12 42 22 30 25 -8 50 24 5 -43 -39 -23 15 -3 37 19 14 32 -1 59 8
8013 8 -20 -17 -36 27 -6 -2 10 -45 30 -32 -32 1 3 24 -21 -4 43 -38 13 -43 -58 18 -11 7 -4 -33 23 63 -41 12 29 22 -13
8046 -13 -28 19 -25 32 10 17 -28 -40 -26 51 -64 -52 -14 26 16 -15 15 48 -18 73 -5 -19 16 30 33 42 11 19 6 64 54 -8
8078 -8 -13 9 -7 -23 -3 12 9 15 11 6 18 22 -40 -28 -3 8 -48 -22 -21 -3 25 -62 38 -32 -16 -20 8 26 14 24 37 -39 -7 31
8112 31 -40 -28 3 -35 0 28 -24 4 43 62 52 -4 -14 7 -5 -33 14 34 -3 0 -14 4 -23 -14 15 -28 44 8 12 -18 -33 -18
8144 -18 -47 -16 40 -2 -39 -24 -69 49 8 67 -31 44 10 16 49 20 13 16 2 4 13 -1 27 53 21 15 -20 -20 -79 -26 -20 -48 -58 37
8178 37 -9 -69 -31 37 -28 31 -47 -31 -30 -34 -19 -8 48
8191D8
$$ Imaginary data points
##PAGE= N=2
##DATA TABLE= (X++(I..I)), XYDATA
0@%%%%%%%%%%%Qj6J6j6K4l2L2m0N6o4P2q8J04j20J44j68J92k24K56k93L33l76
33b00M32m88N45o17O96p76Q64r65J074j190J318j461J616j783J964k166K389k632
51a380K898l193L521l890M306m773N310n933O664p534Q594r919J1629j3934J7226
66I592k2345L1483n2774J93825J10757l20888n4700M9057m670r6671M3522J04632
78i180P7440L4833O0279k9816j28178j09770P671J2280j8332K8847J15444P8760
90A20278q206m4363k6168l5693n1038n5029k2999L7051R1280O7389R793K654J7237
103A02186m6662j17822p1189L3977M7639J5608M9590Q7744K2028o0101m7177j5643
115A78n6589p0541K0562R2679N2691R099L0809J8584n5855p6363k1509M051j1765
$$ plain form
0 0 0 0 0 0 0 0 0 0 0 0 0 8 -8 8 -8 16 -16 16 -24 32 -32 40 -48 56 -64 80 -88 104 -120 136 -157 176 -200
33 -200 232 -256 289 -328 368 -408 456 -509 565 -625 693 -768 848 -935 1029 -1137 1252 -1380
51 -1380 1518 -1675 1846 -2044 2262 -2511 2799 -3134 3530 -4004 4590 -5329 6300 -7634 9592
66 9592 -12753 18730 -34044 159781 270538 -50350 -105050 -55993 -60663 -157334 -113812 -9180
78 -9180 68260 103093 163372 133556 5378 -104392 -96721 -84441 -102773 -73926 41518 120278
90 120278 112072 67709 41541 5848 -45190 -100219 -123218 -86167 5113 72502 82295 84949 102186
103 102186 55524 -62298 -133487 -99510 -51871 -36263 13327 101071 123099 62998 15821 178
115 178 -56411 -126952 -106390 -13711 38980 48079 78888 97472 41617 -34746 -56255 -52204 -63969
128f3969R702N1677M0598O500J3080J7697l3938p7408m3506J2827K5426K1580
140a9734K9416K5610J4249J7163p05n8199p8186j5216M2332K4164j30L3688N8879
153G3331J3404m3752m9885l3628k1846N131L3653K4705N801K2874L6913m743n3895
166H063m3163m974J935j983J8801L4229J8455K209L555m709k6146l0239j5531
179c9498m651O990K8155L3960J2054l144K687p070l8744m1760k506K5461J8986
192i080J4254K2989J7501n287k0388k5217k7709j5753J2538K7865J6689P883J4575
205C0860R136j7351k9536j4241k244m499K089J8577K1549J0461K530l172j3211
218A0948j7268j1154p485o261P684K6420K3369L203o789m358j0303k2242j8875
$$ plain form
128 -63969 -54267 -2590 38008 44508 57588 75285 41347 -36061 -79567 -66740 -41314 -19734
140 -19734 9682 35292 49541 66704 65999 7800 -70386 -85602 -43270 -19106 -19236 14452 73331
153 73331 86735 42983 -6902 -40530 -62376 -57245 -23592 1113 6914 29788 66701 61958 8063
166 8063 -35100 -40074 -38139 -40122 -21321 12908 31363 33572 37127 32418 6272 -23967 -39498
179 -39498 -44149 -37159 -9004 24956 37010 33866 36553 29483 -9261 -51021 -53527 -28066 -9080
192 -9080 5174 28163 45664 40377 19989 -5228 -32937 -48690 -36152 -8287 8402 16285 30860
205 30860 39996 22645 -6891 -21132 -23376 -27875 -25786 -7209 14340 24801 27331 24159 10948
218 10948 -6320 -17474 -24959 -31220 -23536 2884 26253 29456 22667 18309 8006 -14236 -33111
231c3111j043J2719J8888K1662J3052n318j2976p856j1188k0794j0791J5042K3836
244B122J1717L945M685j945j3929j4752o705l452k258O995J6181J2941K943j697
258A6791l839q447j1554j0114n621L065J4302J6446O856o08n41m502j4754j6351
272a8871n460M850R380J4143J5404M947q385j0628p188r543j0061J479J3351J1243
286D661M131M570N008m762j4280j1376k424K354L573M997N788O582O349L18r001
301F488j1078m921j156k540J022R638J2186N835k22l551r441j2571n938L443M701
316h105L389Q565J1665K631q653r160n270o083m915M377J1162P515J564R89L41
331A0012n018q540n144J48J145R86M001P628N758j53m759n351m098l588k936L60
$$ plain form
231 -33111 -34154 -21435 -2547 19115 32167 26849 13873 6017 -5171 -25965 -36756 -21714 2122
244 2122 13839 17784 22469 20524 6595 -8157 -14862 -18314 -20572 -13577 2604 15545 18488 16791
258 16791 12952 4505 -7049 -17163 -22784 -19719 -5417 11029 17885 17277 16736 12234 -2520 -18871
272 -18871 -24331 -19481 -10101 4042 19446 24393 16008 5380 -1808 -11351 -21412 -19933 -6582 4661
286 4661 8792 13362 18370 13608 -672 -12048 -14472 -12118 -8545 -3548 2240 8822 15171 15489 6488
301 6488 -4590 -9511 -10667 -13207 -12185 -2547 9639 15474 15252 11701 2260 -10311 -16249 -12806 -8105
316 -8105 -4716 3849 15514 18145 9492 332 -4938 -11021 -15936 -11559 -397 7118 8682 9671 10012
331 10012 4994 -3546 -8690 -8542 -7397 -6411 -2410 5218 10976 10823 6064 713 -3385 -6973 -9909 -9549
347i549N057P003N219L292L83n505r560o108k9J458J598O275R799M276m524o706
363B379l951l852m342J44N798N777K360J925K241j760o331n707j731Q83J910K876
379a381K735K112K274J565k170n524m862j850M09J967L605M675L577J112j987
394F257m734n924l723L98K975L174L878M661K064k886n478m551k430j73J997L012
410a483L328K869J324j253k893k952k283j237N6J497K599K570J627Q92j74k244
426B243l846k849p47Q09K063L031K712J722O69j915m581m293j427J188K978L495
442A252K593J001k58j208l097m131k589J446M252K458j15M42K033J16l062l724
458b591j614M31J902J871N22J72J456K151N8l575m604j318K311J888J5Q60K954
$$ plain form
347 -9549 -4492 2511 7730 11022 11405 5900 -3660 -9768 -9797 -8339 -6741 -466 9333 13609 9085 2379
363 2379 -1572 -5424 -9766 -9622 -3824 1953 4313 6238 8479 6719 388 -5319 -7050 -6167 -4257 -1381
379 -1381 1354 3466 5740 7305 5135 -389 -5251 -7101 -6692 -4725 -1120 3555 7132 8244 6257
394 6257 1523 -4401 -8124 -7726 -4751 -1577 2301 6962 9026 6140 662 -3889 -6319 -6492 -4495 -1483
410 -1483 1845 4714 6038 4785 1892 -1060 -3343 -4580 -4524 -3027 -428 2142 3769 4661 4487 2243
426 2243 -1603 -4452 -5199 -4390 -2327 704 3416 5138 5807 3892 -689 -4982 -6409 -5221 -2243 1252
442 1252 3845 4846 4588 3380 283 -3848 -6437 -4991 -739 1719 1604 2046 4079 4195 1133 -2591
458 -2591 -4205 -3774 -1872 -1 521 693 2149 4300 4358 783 -3821 -5139 -2828 -940 -925 -65 2889
475B889K288o76l432l808j827M74J639J915J993J531R69l25k326l585j757R69
491c069J421N53J422K499R50j729k124n17L79j479k087R88L649J780j094p37R17
508A722M57j404k876j977L48K554K891J334r67j372Q58J080k947n232m43N228
524g46M434q07k667L34K311n56m023k666J209K572J884P56o69j202N89J361j205
541I09l381j184K253K626j06j573L59K316O68k288k415m21L45M63J100J207Q73
558A751K39m03o45j157j799j219J179K266Q51K59J116j76k465j614Q64O72j238
575a519o89J940K931J40k549j112J010J98r89m23k17k92J551K416r8k257r91J238
593B88Q08j739k407L59L300K434j038k208j88J182ok112j933J153L161J504r58
$$ plain form
475 2889 5177 4501 1069 -2739 -4566 -4092 -2453 -538 1455 2986 3955 3630 1304 -2281 -4038 -3069
491 -3069 -1648 -1095 327 2826 3776 2047 -77 -594 -215 -1694 -3781 -2793 856 2636 1542 805 1722
508 1722 2179 775 -2101 -4078 -3730 -1176 1715 3049 2082 710 1568 2648 -299 -5531 -5974 -746
524 -746 3688 2881 214 548 2859 2303 -1720 -4386 -3177 -605 1279 2035 1366 164 753 2114 909
541 909 -2472 -3656 -1403 1223 1117 -456 -97 2219 2887 599 -1816 -2237 -1892 -1429 -329 878 1751
558 1751 1990 1587 942 -215 -2014 -3233 -2054 212 1063 1322 2438 2262 -203 -1817 -953 -281 -1519
575 -1519 -2208 -268 2663 2803 254 -858 152 350 -639 -1062 -1279 -1571 -20 2396 2298 41 -950 288
593 288 1096 -643 -3050 -2691 609 3043 2005 -203 -391 791 785 -1327 -3260 -2107 1054 2558 1600
610A600j083n21j85J21j66j400o23K159K337o34j874J0J179k12j634n50Q27N97
628e2l17M27J237%r55j31j09j075m39O18M09K32J098R02o82j264o33J62l2m85
648a089J01J206J260J36p78j129o83M81N97p28n63J184J297l66o96J26k64p96
666g04L4P49j09q49K53J377N95o42o26j09l39o67L45O03j90j2J313P63j120j320
686f55p4J78k02P8O25N12K94K46k69r08p26M49M53l50k59Q09O74l91m03J92k86
707a3o45K97N44l83m57N63Q23K5l92k79l04m96J08N14L4m02O10J223j53j477o04
728h64N89l2l33J51O69L88J98o2o61o50J92M11j65m64L68Q88J43o44l20K87P2
749A61l14j09n1n5K33O41r5l93K09L59o64p88J57P17K64k56P5L26J23m15m44l85
$$ plain form
610 1600 517 -4 -189 -68 -234 -1634 -2257 -98 2239 1605 -269 -259 920 708 -926 -1476 -649 -52
628 -52 -369 58 1295 1295 340 209 100 -975 -1414 -796 -387 -155 943 1845 1163 -101 -734 -572 -604 -1089
648 -1089 -988 218 1478 1614 836 -293 -976 -495 102 -626 -1189 -5 1292 926 230 356 92 -704
666 -704 -670 79 -30 -879 -626 751 1346 704 78 -31 -370 -1037 -692 -89 -279 -291 1022 1785 665 -655
686 -655 -729 -551 -753 -675 -50 462 756 1002 733 -175 -901 -452 1 -349 -608 201 875 484 81 273 -13
707 -13 -658 -361 183 -200 -657 -94 729 754 362 83 -221 -717 -609 -95 -61 -463 147 1370 1217 -260 -864
728 -864 -275 -307 -640 -489 180 568 766 704 43 -607 -415 -4 -169 -633 -265 623 766 122 -198 89 161
749 161 -153 -262 -313 -368 -135 506 411 18 227 586 -78 -866 -709 8 272 16 91 417 540 125 -319 -704
771g04J9N23O91o2m52J17M27m32o47K2L28P1j8L52R7j55p6R1n0l62j73K75O2j60
795b16J49K89K09p0j62j86l74j67M20J52k21J50M64L4k00l27k49k08J49M89K36
816C61l07m0K18L6m12k74K16K20j7j39K58J76j49j48r1M5l4J12j37j15J25L67
838B71J07k38j19M6p0k64j25J98K46J27R2k5q8o7r2k87k26J22N89K36k82j75J04
861H0N5j32j17m9p3J31L08J11k09k62Q2K83j23j79j7m1J02J23J09o8K0q1q2q8
885a17q9NR6J88J86r9k5j47Jo1k09j10L18K99K8j88L3j01o0L4M7j31j88J99K86
910A95J46k44k75M0K29Q3j12k14j03N1L50K68l63j90Q8J80o7k12q6J27L10K9j80
933E0p1p3M2J6m8j12Q8L84Q5l35j57k0J48P6j43j91J13L27O5j61q6L9q2L6J46
$$ plain form
771 -704 -685 -162 529 467 15 132 559 127 -520 -498 -170 -99 -117 235 332 177 101 192 142 -220 -393 -118 -56 -216
795 -216 -67 222 431 361 199 13 -361 -528 -108 44 -177 -27 437 471 271 -56 -305 -513 -364 125 361
816 361 54 14 232 268 -144 -418 -202 18 1 -138 120 296 147 -1 -92 -47 -81 31 -106 -221 -96 271
838 271 378 140 21 67 -3 -267 -392 -194 52 179 271 246 158 91 -1 -288 -514 -392 197 433 151 -24 80
861 80 135 3 -114 -163 -236 -105 203 314 105 -157 -75 208 85 -94 -111 -152 -50 73 182 114 134 53 -29 -117
885 -117 -206 -201 -105 83 269 170 145 -2 -1 -62 -271 -381 -63 236 264 76 109 8 -52 -18 29 -102 -290 -91 195
910 195 341 97 -178 -138 91 174 62 -152 -255 -204 146 414 51 -139 -51 129 62 -150 -236 -109 201 230 50
933 50 -21 -94 -52 -36 -84 -196 -108 276 361 26 -131 -151 -3 73 -70 -261 -148 179 244 83 -3 36 -46 -10 136
958A36k4k18j62J61K92K21k74l13P4J31K5k5j07j06J01M07J1l25k57j9L34K19
980B82k41l58K55L70k5l17k02K3K45J84j08k29K2K08J26j18l08r8L15L03k57l58
1002b86N2L67N7j9r8k82Q7J56Kq1m1k3J44K27q5l20pQ8m2j8J17N2k2n4K7N3J10
1029A61k08j64K21K47k78j31J89M5o9L3r4m7J54M4j40o5P2J15J81p3l75k37L89
1052c0L33j92k52o6J72L69J8n01k25J55L07J5L3l16k5L38J71k30k47m0J35J85
1074A07O4k84n1K11kk9J10k7k11n1K32K2j80Q7M1j9N9j36m7O0R9j23J03O1j85
1099h9l3K44p6k10O3O5R6J01m8l15R1K41k2j77p6J12%J83kk24K0P3lK3M0k20o5
1126b08L07J8k83J67J12j15MQ1j87oJ79K5j74R4L7K5N8j32j54N5K66p0p7L0j61
$$ plain form
958 136 112 -106 -268 -107 185 406 132 -181 -107 24 49 24 -83 -189 -88 319 330 5 -252 -271 63 282
980 282 41 -317 -62 308 283 -34 -236 -213 32 216 108 -121 -99 109 235 117 -191 -289 26 329 72 -286
1002 -286 -234 133 190 171 73 -209 -122 34 36 -45 -86 -109 35 262 177 -143 -150 -62 -104 -122 -5 47 25 -29 -2 51 161
1029 161 -47 -211 10 257 -21 -152 37 82 13 46 -48 -95 59 103 -37 -102 -30 85 266 193 -182 -419 -30
1052 -30 303 111 -141 -207 -35 334 352 -149 -374 -219 88 103 136 -180 -205 133 304 74 -173 -213 -78 107
1074 107 171 -113 -164 47 45 16 126 99 -112 -163 69 91 -89 -2 39 20 79 -57 -104 -44 55 -68 35 96 -89
1099 -89 -122 122 46 -164 -101 -36 60 161 113 -202 -111 130 108 -69 -145 -33 -33 150 148 -76 -56 17 14 37 77 -143 -208
1126 -208 99 117 -166 1 113 -2 2 83 -104 -110 69 94 -80 14 51 76 134 2 -152 -97 169 99 22 52 -109
1151a09mK68m7k33j1J54L3O3K8j87j54J76J22jp2j33j34K76K10j56j52R3m9j7
1175c6J68j54j45L2K64j5j9q2k5j1mj5m2J05p5L0K9%l3jQ2j32QJ58n0j13J19J4
1203E7j45O7Q7k0n1k2l4L5J20m3l3%r3O0O5kj59M6J34K6j16P9r8p6Q5J36n9j55
1231a09J10J6P3j03mJ9J1n5j2L6m2J9R2J4j05N9O9m8p3k0N7l3L0J04j61k5J7J16
1259E2M5j32o4M6J42n1n4j8qp1P8K04j04j38Q8j9j9K8J4j34L9J07m6L2k4o3O6
1286dLJ6M1o9pj09J55K5j24J0K07j06m9K3Q1j10k1J1OO3J9K0p6j02M5J33Pn7o0
1315b9OJ6jL5j9r9J0P6P1j6p5m6N6K3Nl1q8P5ON4K8n6J6L0m6j7O3p5o1P3K0Lr
1348bQ5Jr4k3L9Q0o9m1m6J07r9P2M0o7k1l9J26P6j00j21O9L0qJ00k8j22l0J64
$$ plain form
1151 -109 -113 155 108 -125 -136 18 51 114 142 -45 -199 -23 99 98 26 -107 -241 35 245 89 -63 30 -19 -36
1175 -36 132 -22 -167 -135 129 114 95 13 -12 -23 -27 -42 -84 21 -54 -24 5 5 -28 -29 53 -79 -71 87 37 -76 43 57
1203 57 -88 -21 66 46 -5 -27 -61 -26 94 51 18 18 -75 -15 50 48 -111 -65 69 95 -21 58 -40 -116 -31 105 46 -109
1231 -109 1 17 90 -13 -17 2 13 -42 -54 -18 -60 -41 51 65 -40 19 88 40 -33 -53 4 -29 1 105 -56 -81 -64 52
1259 52 97 -35 -99 -53 89 38 -16 -34 -42 -113 -35 169 65 -73 15 -4 -23 5 19 -115 -76 31 -15 17 -7 -70 -4
1286 -4 -1 15 56 -13 -20 -129 26 51 -73 -63 144 38 -11 12 93 -17 -38 -27 -21 42 61 81 5 -97 -52 81 88 31 -29
1315 -29 -23 -7 -8 27 8 -91 -81 -5 66 50 -25 -71 -15 8 13 -18 -106 -31 -25 29 57 1 17 47 1 -16 47 -28 -89 -16 4 7 -2
1348 -2 83 84 -10 -33 6 86 17 -24 -70 37 -62 10 50 -17 -38 -77 49 125 25 -96 -27 3 -5 95 67 -55 -85 79
1376G9%j5j05l1J19p6Q2o1pk7K6L3L5k7J6j02k9j2J16P3n9n2L1j7M4J0Jr8n1O0
1406d4O1M4j01k6R3j8P7k8p2k2j2O9J2l0n6k7M0N9O6k5o6m5O9O0k4r5j6QK2oM8
1437A5j4lk6QL4O5n2o4l5N7Q6m9Ro8k4N9Q7l5m6m5m1R8N3n0n0QK4M0J1Kr8j1M7
1470hJ8M1k0k5q4J41m0%L5p0n1Q8l4K9q5N5N3o3P9j3n6Rqj2k1Q2k2q9J14m7nJ12
1502A03l0j34L9K7j7L6l5Qo2R2J0M1o8M3j33O3O6k8l1L6j00QJ07J6n1LRq5N1R9
1532H3r5j02J10K8l9Q7m7j25O6R4k6N6pj35n6J68nk1k0m3pL5Q8l9o7K0n9R9M8
1561H9j07q2M2Q0j9J13q1j31lJ65Pj20L9p7m2J59M0j26J9L0QNM2k4r1P6L0j03
1589f2J10K1n9j8J13n5j13J36j0j61O5M1Lm0L5J7o8Q4n5j5R9j30j8J01kn6L7K8
$$ plain form
1376 79 79 64 -41 -72 47 -29 53 -8 -15 -42 -16 17 52 25 41 -61 -90 -102 14 87 28 -24 7 -10 34 44 45 -53 -104 -44
1406 -44 17 61 -40 -66 27 9 86 58 -14 -36 -48 21 33 3 -53 -80 -40 19 85 60 -6 -51 18 78 54 -41 -57 -49 -27 -33 15
1437 15 1 -2 -28 -20 14 79 27 -37 -72 -15 71 22 31 -37 -61 -2 85 50 4 -41 -82 16 69 19 -31 -23 1 41 52 54 -44 -55 -8
1470 -8 10 51 31 6 -78 63 23 23 58 -12 -63 25 -9 20 -65 -10 43 -20 59 46 -10 -1 -9 -21 -42 40 18 -71 43 -4 -9 103
1502 103 73 -61 -22 5 -12 24 -11 -3 -65 27 37 78 10 53 -80 -17 49 21 -10 26 -74 -66 41 57 6 9 18 -67 -16 83
1532 83 -12 -114 -4 24 -15 72 25 -100 -34 60 34 90 83 -52 -108 60 55 34 14 -29 -36 -1 87 48 -19 1 -58 41 89
1561 89 -18 -100 -58 22 3 116 35 -96 -99 66 73 -47 -8 -85 -127 32 72 -54 -35 -5 3 8 50 26 -65 11 41 -62
1589 -62 48 69 10 -8 105 50 -63 73 63 -98 -33 8 11 -29 6 23 -45 39 -16 -31 68 -62 -80 21 19 -37 0 28
1617B8o5k6J90j19J9j7k6o1J30K4n1q7R4pl8J45r9j03M1Q0Lj0Mj28O2J33k7r1
1645bK8o2q0K20j6j23k5N8l6P3Om2p8J23n4j8QN7j64N3R2J9J8o3n0K5O5Ln6L3
1675A2Lq6K3J17p9m2L9MlL7P1j60KJ00n4OP3q8J1Q3K2p7k9Pm0P3L8o0LpM5n1N3
1708D6j8o3M0L7j15R0lk2lO1p1N0m2O1j6p8O9k2M3Pm8q9R9L0L6nq6l8M0MN4r1
1740d3m8N6M1O8qp6L2o8J7Q8rr7l1K6O5k9M6M0p9J8L1k6k2M9l5j2M7k6n6J28p3
1771A4n8P6kl2lJ4n9N1N0o3nqj6J01J6n3m9j7k8Q9L1m0n0o9J10N9k5J1q8j2R4
1802C9J2K6n6q3O0QQ2o4pk2L3j0n2m5O8L9k6k0NK1OL5k1m9lN7Rr0k7K0R8L7o7
1835A3q2K6L5L8rn9n5MK09m8k3r8KP7L3J1n0o9pL2R4p7j2q0O5Q7J3p4k7K1J9J5
$$ plain form
1617 28 -37 -63 127 8 27 10 -16 -77 53 77 26 -61 33 26 -12 133 34 -69 -28 52 55 45 49 -79 -17 116 89 -2
1645 -2 26 -36 -116 104 88 -35 -60 -2 -38 35 41 -1 -79 44 -10 -28 -20 37 -127 -74 18 37 55 -8 -58 -33 32 35 -21 12
1675 12 15 -71 -48 69 -10 -52 -13 -9 -12 25 96 -64 -62 38 -16 -10 63 -25 -14 69 91 14 -15 -8 -48 25 63 3 6 -1 44 -7 46
1708 46 28 -35 5 42 -73 17 14 -8 -11 50 -21 29 -13 48 32 -46 23 1 44 51 3 -86 13 43 79 74 -12 -50 -10 -6 48 -43
1740 -43 -91 -35 6 74 66 -10 22 -46 -29 59 50 -47 -78 -52 13 -16 30 70 -9 9 40 14 -8 41 6 -6 41 15 -41 87 14
1771 14 -44 32 30 -2 -5 9 -50 1 51 -12 -17 -25 -41 60 76 23 -26 -43 -71 18 49 9 -41 -110 0 59 34 45 -43 -55 39
1802 39 51 77 21 -62 -2 6 88 24 17 -5 28 18 -34 -79 -11 28 2 -18 -13 8 14 49 28 -21 -24 33 42 -48 -75 -55 43 80 13
1835 13 -69 -43 -8 30 21 -38 -93 -89 120 72 49 -49 -47 30 63 74 24 -45 -52 -20 74 -3 -15 -95 -30 57 70 -4 -31 -10 9 24
1867B4j9k5j4N4J1l4q3N7M5Nj1n0j7N5L5k3NjJN8L4j30q3R1J09m5p4mo2J22L0
1898F1l2k2j26P4R4O5j20p0K0R5R4o0j29LP1N1N1j74l9M1J07nl6l2qJ03K1p6m5
1927b3oN5Q0j23o3K4O3N2Qp6p8N9J49mo9j43K8R3J06o5j66m0J76Q6J0j98m4R3
1955a6J0R7p7j53O5J15K8j7q2QK5J04n4m8q9J5J39Q8j79o6Q3J9O1jj09k3J29M7
1983A19j27k8m5M9J45j4j23j20J09R3L9j04r6n9K19M1o1m5m3k4J44O6j89p5J03
2008b6O8O3p7q7l9R9J20p6j50J1P8K3J19j12p3k5J93Np5j05O4K8Q4n0j81J9J90
2035H8j9o9q3m2P5K15p3j48k6LJ40O6o3k23O9J56N6qj46q5M9K12j0j73j38J20
2061e7J08P6k3k13l8K33K6j9j19p6L3J37O8j35j08nJ61N6o7j17m8J05J40j01j24
$$ plain form
1867 24 5 -20 -34 20 31 -3 -86 -29 16 21 10 -40 -57 -2 33 10 15 14 15 73 107 -23 -106 -15 94 49 -25 -29 -91 31 61
1898 61 29 7 -119 -45 49 114 -6 -76 -56 39 133 73 -56 -53 18 69 120 -54 -93 -52 55 50 14 -18 -26 77 98 22 -23
1927 -23 -29 26 106 -17 -80 -56 7 59 67 -9 -87 -28 121 117 48 -95 -67 26 132 67 -99 -139 37 123 133 -65 -109 -16
1955 -16 -6 91 14 -139 -74 41 69 52 -30 -22 3 107 53 5 -84 -69 70 158 -21 -87 -4 15 76 75 -34 -57 72 119
1983 119 -8 -36 -81 -32 113 99 -24 -144 -35 58 97 -7 -103 -162 57 98 37 -8 -51 -75 69 135 -54 -129 -26
2008 -26 42 105 28 -59 -98 1 121 45 -105 -94 -16 7 126 14 -59 -84 109 114 39 -66 -2 26 110 60 -121 -102 88
2035 88 69 0 -83 -125 -50 165 92 -56 -82 -79 61 127 64 -159 -90 66 122 114 -32 -117 -68 144 134 -39 -177 -57
2061 -57 51 127 104 -109 -147 86 112 93 -26 -102 -69 68 136 1 -107 -112 49 105 38 -79 -127 -22 118 17 -107
2086a07N5K2Q4Q1j28j00N6J16j4Lj91k2J97R9j46q4l6R7R0N1j59j22Q2J65j5q1
2112gm2j20K15J00r3p0l6L8J09j8p5p6L0P5L6j09J5j2L4J24n0j59k6J82N8p9p3
2139b9j17J12J80k0k26k6R6Q3Q8j34j76OK37J13j32o1j24M6K02Q9k72o6pJ38J51
2164A51o0j77q6K18Q1k7k04m4O1J89M1j83m8K1J14Rnj38RP6J29rj88o4Q2Q5P3
2191A06j42j23J80J10j9q4r4l1J99K7j12j00l2J20J16Pj31j51P0J95K5j21n8n8
2215a01J19J18Jk54NP7J30L2j68n7K5J29L3j32j8nR4J05p1j50K0J47Knj38p1Q9
2242d4J67l4q4j34R4J30K8q2k11P4J44Q0p6j01o4J16J08J1j47j03nJ98P3r2j54
2267a08j00J94J09m2j47m3J11P6J14j73r2M1J10N2m8j46%R7Q6k8p8q0O0J00L9
$$ plain form
2086 -107 -52 -30 54 135 7 -93 -37 79 65 68 -123 -145 52 151 5 -79 -115 -18 72 123 -36 -158 -76 89 74 -7
2112 -7 -49 -169 46 146 53 -17 -53 -15 94 76 1 -75 -45 30 66 -43 -28 -40 -6 118 68 -91 -117 65 123 44 -29
2139 -29 -146 -34 146 126 -100 -126 -30 53 141 7 -169 -163 74 187 55 -6 -130 -84 118 207 -65 -131 -138 0 151
2164 151 91 -86 -172 46 127 100 -104 -148 -87 102 143 -40 -88 -67 47 56 51 -87 -78 -2 127 118 -70 -134 -52 33 106
2191 106 -36 -159 21 131 112 28 -66 -97 102 129 17 -83 -115 5 121 128 -3 -154 -84 111 136 15 -43 -101
2215 -101 18 136 137 -117 -112 -35 95 127 -41 -98 -73 56 89 -43 -61 -66 28 133 62 -88 -68 79 81 76 -62 -133 -44
2242 -44 123 89 5 -129 -35 95 123 41 -170 -96 48 128 52 -49 -113 3 111 122 -25 -128 -133 65 138 46 -108
2267 -108 -208 -14 95 53 -94 -137 -26 50 164 -9 -101 -60 50 102 54 -92 -92 5 91 63 -15 -95 -35 65 104
2292A04k03m9J23O0L4j24o8L8J58L3p8q5q7J68J7L6q3j25R0J26O7j37j48LJ96
2317F6J05j16j68oJ09J66m4j82n6P1J26K7q5j15L0J50J1p1o8l9J17N5j6j39j7
2342h9O2J21j3j22k7j3J73Ro3j75M1J19O2k9j47k4J18J32k3j11j20R3R6M4p7j06
2368f9o1J58R0%j97l1N9J49n6q1p6R5O9N9n0j27qJ24N2n6q9l6J02l2J14j65k3
2395h6M0J15Qq1j6J5M3M6J3j56o0J67RK9j48l3R9M8P6j27j21J03N1K9Jj21o3J25
2423EJ28n4j37l7RJ06K2m6n4k5J04N8q1rp7J03J02n3j12ML9Q4J7r4n7K5R3J9p5
2452Gp0mJ40N8j12r0m5J46M3rj29j1N2N8P4r4q6j3P6Q9j7j16k8J30M5kj28m9P7
2481hN5R3r4j46R6M6L1Qj07k6J13J7J2r3l3JJ23n0j06NO8K0O0o0r0J9P6M2j06
$$ plain form
2292 104 -99 -148 -25 35 69 -55 -123 -85 73 106 28 -57 -144 24 41 77 -6 -131 -41 85 152 15 -133 -130 66
2317 66 171 55 -113 -119 -10 156 112 -70 -126 -55 71 98 13 -102 -72 78 89 18 -50 -89 28 83 67 -72 -89
2342 -89 -27 94 81 -41 -68 -81 92 101 38 -137 -96 23 85 56 -91 -115 3 135 112 1 -119 -26 70 114 37 -69
2368 -69 -130 28 118 118 -79 -110 -51 98 42 -39 -115 -20 49 108 58 -69 -77 47 99 43 -46 -82 20 -12 102 -63 -86
2395 -86 -46 69 77 -4 -20 -5 38 84 97 -59 -119 48 57 86 -62 -95 4 52 128 1 -120 -17 34 63 64 -57 -120 5
2423 5 133 79 -58 -95 -86 20 42 -4 -58 -83 21 79 -2 -11 -88 15 117 64 -48 -44 -5 79 96 2 -55 -30 63 82 7
2452 7 -63 -67 73 131 19 -71 -116 30 73 64 -65 -76 -24 34 108 14 -72 -85 -9 80 63 -53 -81 49 94 92 -36 -85 -8
2481 -8 47 140 46 -100 -4 42 73 81 -26 -52 61 78 90 -3 -36 -35 88 38 -68 -63 5 25 85 25 -65 -46 30 72 -34
2510c4r8NJ38O8J1j15n6N0J10jl9q2o5J14R6l6q9m0M6M8M4n5j2p5L8J15p9n3q
2539e4Q8rl1Ql0L6K8K2n5o3M0J0npLk4R7k7p0LN8k9Q3l1o5l5R0M3p3L2m0r8J75
2572G0nj8k2l8j5M7ln2m7L3J43r8NOn4N8K5rq5L6J7N1o5nn6J8J18k4q0O1q3L8
2604c3P4l6q9O6L5L%k4p9P1Q8l7n2j2M2L9M1j22r8R1N3O7o7Jn0j2J03jn7m4L1
2635hMK5Lp2p4J07O0l3l0O1r4J0N5q3K7P1k8k1O9m7k1N6OK6q8P1q1O3k0o6J1M8
2667GN2k3m4oqQ2n0ml0j7L0O0j5m2o5RJ13p3J5Jn7O8OJ5j1o4J10Pp8J8MpN9n2
2701A0KL4rn1L4KORL6j0o1Jn9O7N1k2n4o7J23K9n3K1o4m3Q0lo3N9k7L1mO7p1j6
2735a5J7QK2j7j8m1N4L8l8Jj5L9n2J08p5j4m0O6l7k7M5j6J6l9M9l1qJ9Mk5K8o
$$ plain form
2510 -34 -132 -127 11 79 90 -25 -81 -31 79 78 39 -43 -108 6 102 66 -23 -63 -17 31 75 20 8 -67 -29 86 7 -46 -54
2539 -54 34 25 -6 2 -28 8 36 58 3 -60 -20 -10 -15 -22 -19 -43 54 27 -43 -40 18 -11 72 41 -24 -59 31 74 1 33 -7 -105 70
2572 70 65 47 25 -13 -28 19 16 -36 -83 -50 93 -5 0 6 -48 10 35 26 -59 -23 -6 45 -20 -25 -81 -63 55 31 -49 12 -71 -33
2604 -33 41 5 -84 -18 17 20 20 -4 -83 -12 76 39 -13 -25 17 56 97 -25 -123 -32 21 88 21 22 -28 -40 63 62 5 -39 -8
2635 -8 -4 21 24 -48 -122 -15 45 12 -18 43 -51 -41 14 -69 -42 29 1 -20 49 2 -19 37 43 69 -19 52 -29 34 14 -52 -41 7
2667 7 59 36 -8 -14 -22 60 10 6 -24 -41 -11 49 34 -8 -73 -64 49 -24 -9 -8 -65 3 9 24 13 -51 59 66 -12 6 10 3 62 10
2701 10 12 46 37 -14 20 22 28 37 73 63 2 3 -56 11 62 40 -14 -81 42 71 18 39 -25 -68 12 9 -54 5 -22 9 5 72 1 -15
2735 -15 2 10 32 15 -3 -44 10 48 10 11 -4 35 -17 91 16 2 -38 28 -9 -36 9 -7 9 -30 19 -12 -20 -1 3 -22 6 0
2767@j1N3p6QK4O5k8n0K3q5Q2L5l1K2J3n4L8JmLnm7P5q8J2K3k9P2j7j0K1j4l6
2800a5OJ4j8k2L6o8M3M7m4K4Lpqn5J00K3m2Mjk9K0L4r6M6j0K9M6o9j1PQkN3l3
2834A3mj4KL0q4L5k0KN2j1%O0n4J4k3M9j7n7L8l9P1p1NO6p5K0M8k1j8oL5m2Oj5
2868b5QK7J9l3K1M2n5JjO2q3Q2l7Jj4pJkj3j6L4m3J8L2L1l3m5m9J21kn7M3l3J9
2902A4L0k3Mk5J7Qj2N0m0m0KJ8M9%lo%p4K5M2o0M2m2L0J6j8J4k1K4k9N4j3l3j2
2936a2J2k8J0O2j9n7m4O8N6m8L4r2P8k1L1p5M3Pj0j7O2n1K1k2nL0pPO0n5l0J3
2968AJ4k8%K3j0j9K0M8r1K7j3K4lKn5M4rK6l9j0NL4M5K2o1K4l8OQ5j3m6Rn1L4
3002Gpj9K3k9J3j9%P1L2o1n4NK4Q2o5l0O3l3N1n4k2N9n4K7J0jL7l5j4N4j0J0o8
$$ plain form
2767 0 -11 42 -34 -26 -2 63 35 -15 8 -77 5 40 9 31 44 -10 28 29 25 28 23 -24 51 -37 -25 -2 -31 41 24 14 35 21 -15
2800 -15 -9 5 -13 -35 1 -67 -24 23 -21 3 6 -1 -9 -64 36 59 17 21 20 -9 11 45 -51 -5 -15 14 60 -9 -20 -13 -5 -7 46 13
2834 13 9 -5 -3 27 -57 -22 -42 -40 12 1 1 61 7 21 -2 47 30 -27 11 -28 43 -28 -23 43 -32 -12 36 15 -3 -9 26 -16 -10 -25
2868 -25 -17 10 29 -4 17 59 4 5 4 66 -17 65 28 29 15 8 9 7 -6 -22 12 -31 -13 19 50 17 -28 -77 44 42 -15 28 -5 14
2902 14 44 21 25 0 17 25 13 63 23 -17 -15 3 52 52 49 43 43 -31 -6 36 -24 18 -24 6 22 4 18 -3 21 -8 46 33 0 -12
2936 -12 0 -28 -18 44 25 -32 -76 -8 48 0 34 -58 20 -1 30 -45 -2 5 -5 -22 40 -11 10 -12 -17 13 6 13 73 18 -12 1
2968 1 15 -13 -13 10 0 -19 1 49 -42 -15 -28 -4 -7 -5 -60 -16 -25 1 -38 -48 -43 -9 36 58 -3 21 -17 -11 74 61 15 24 -27 7
3002 7 0 -19 4 -25 -12 -31 -31 40 72 11 -43 -38 -14 68 3 -27 36 3 54 0 -22 37 -17 10 20 19 56 21 7 61 51 61 -7
3035gM0o1nM0rm3N1J1PNl4K8o5M2JO0J5n4l4R0j09P1j03J5O1p4P2k5N5m7k7n0
3067h3M2N4q0Q6nJ8mj1k3mK3p2L5j6N6Rk1M2o0L6Kk4K8m6M2K4Nj06K9JO3k0K0
3100D0m9Rp3Q2Nqj7n4J02l1M0n8l3P4n6rN4N2r1JqOL1L3Lj00L8O3j1j4j5k1NO7
3134E7Jo0L6k8k8K4j7K5l6J4L6l8L0qm6O7l2k4MM7m4%N7o2J6K5k8lK3L0j4KJ9
3167D5jk9L2l6L3j3pn6L7K1o8O5ORo0P5r0lM4m6MK5j2J1K2l7M7Mm0ON8k7j2K4
3201C1k0Nj4O7q4M4n3P2K8j06M2K6r2M4N0p0O8k0n6oN7K3ql0O4j01J4K3J3l0O0
3232D1j8k1L8j0q6kN4j4J8Nn7J2M7OJ0l1j2M2Pl9L6Nq2M9M1j1r2N0K9K6K0n8m1
3265c8K9L2j4N5o0K1j0n9O4n1L2N4q8j1K9M4n0L9k8P0q7P1Qq1J9L9J6m3L2l8n3
$$ plain form
3035 -7 33 -28 -33 7 -2 -45 6 17 24 29 -5 23 -42 0 1 61 76 22 -12 78 -31 40 -63 -48 13 -61 11 -14 41 -6 -33 -83
3067 -83 -41 13 -67 19 14 32 28 17 -6 -10 13 -59 -24 -40 16 25 4 46 -14 22 24 0 28 -18 24 48 53 -53 -24 -23 40 20 40
3100 40 -9 0 -73 9 14 6 -11 -65 37 6 46 -12 -45 29 -27 -36 18 70 -21 -20 -28 -22 9 42 45 -55 -17 46 35 21 6 -15 -10 57
3134 57 58 -2 34 6 -22 2 -15 10 -26 -12 24 -14 16 8 -38 29 -3 -27 -23 24 -20 -20 37 -25 -9 16 -12 -15 8 38 24 26 45
3167 45 44 15 47 11 44 31 24 -32 5 26 -42 23 29 38 -22 53 -37 -40 4 -42 -38 -13 -25 -14 8 -29 18 22 -18 -12 46 19 7 31
3201 31 11 16 2 69 -15 29 -24 48 76 -30 12 38 -54 -10 40 -30 38 18 -38 -44 13 36 28 -2 62 -39 -25 -2 11 -19 41
3232 41 23 2 40 30 -56 -58 -4 -18 0 5 -52 -40 7 13 23 -8 -20 22 29 -10 26 31 -51 -2 39 28 -64 -14 15 41 61 3 -38
3265 -38 -9 23 9 64 4 25 15 -44 20 -31 1 55 -33 -44 -15 29 -21 18 -10 60 -27 44 52 -29 -10 29 45 2 34 -4 -57
3296e7M1L6L6k8j3pk6m9R9l8R9j50M3K7L3o4j4N8M5j13PK7j2K0m3N0Kl1jL2KJ9
3328C0l8MM7Jo7K7O6j20J15p4m7nO6L6n5M9j09O0qL2KNk0jK9L7o2l3K3J2M8n2
3360bo1k1J03k4K9m0K2n0P7j5l3K1L5n7kP9r1K3L7m5O2j6M1l6j1m3K2M6K3m2m6
3391a5N1p1J17j04K9m9L0K1m8N5ml9L2oK1k3Mk4J1j4O1m4L3om0PNOM1j2nJ6o7
3424c1K1K5l8K5j6j6P6k7k3Rk7L2J7l1L6p8J01o6oO7m8k8m9J15o4k0%k5L5NK1
3455hK7p8M8J1k5L0m0R1p2N9ko6K4j0K5k5J2J5qJ0j04Q7M%o5R1m9O7l8o1M5J5
3487A0j6Pj1m3N0k3L2l4J0M5qj0j1N1m9L0rJK4j03N8l9K0j0K7L3oJ2l6l2N4m0
3519a6L8M1q4R7r0rP2m5j5kKnk1m5R9l6K3k5MMM6km1JJ8K7n0k5O2l2L9q8J25m1
$$ plain form
3296 -57 -16 20 56 28 15 8 -18 -67 32 -6 93 -57 -14 13 46 -18 -32 26 71 -42 -35 -8 -20 0 -43 7 9 -22 -23 9 11 30
3328 30 -8 -4 43 44 -23 4 70 -50 65 -9 -56 -61 5 41 -14 35 -74 -14 -22 10 12 17 -3 -4 25 62 0 -33 -10 2 50 -2
3360 -2 -63 -84 19 -5 24 -16 6 -44 33 18 -15 6 41 -16 -18 61 -30 -7 30 -15 47 31 72 36 25 -18 4 50 73 31 -15
3391 -15 36 -35 82 -22 7 -42 -12 9 -39 16 12 -27 5 -1 20 -3 1 -23 -12 -26 35 -9 24 18 -22 -15 -10 -4 37 25 20 36 -31
3424 -31 -10 15 -23 2 -14 -30 46 19 -4 5 -22 10 27 -4 32 -46 55 -11 -17 50 2 -26 -75 40 -24 -44 -44 -69 -34 -29 -8
3455 -8 19 -59 -11 0 -25 5 -35 56 -16 43 41 -25 -1 -11 14 -11 1 16 8 18 -86 1 5 5 -60 31 -18 49 11 -50 -5 10
3487 10 -6 1 -10 -53 -3 -26 6 -28 -18 27 19 9 -2 49 0 30 21 22 46 -57 1 -38 -18 -28 -1 32 26 38 2 -30 24 -16
3519 -16 22 63 -21 76 -14 -23 49 4 -11 -13 -11 -16 -37 -82 17 -19 4 -21 -17 -13 33 31 -10 -9 9 36 -14 -39 23 -9 30 -58 67 26
3553B6k5N9pj6o9K3J9j2P1j28R5l8J5n6M8rL1k2n0J7K6k9M1j%k2J4J2Mn0M0on
3586dM9m8k5RM7k1k7L8Qn0nM9jo1N7n4P8m0%m9N7L4m5j4k6j0M4M7l3m9L8J0n6
3619e3N9o9K7M4L4m2L6l7jn2Q6l4pj7J5OJ8Mj2J8m5%M8Q0p3l3J5j9N0j03J10O
3651E9q2nO0k9n2L6P5o1M2l2n8Q2o0lN6k4K5nl1j3L6J9j18J07n7J5k6J00l8o1
3681d3Q9r2K3O0qk7J6m1P0k3Ok3nj5J6nJ3n9qK0QL2m2K9oj4m0Q5J4n4N3n8M3J4
3715B8n0N0n5OL0J8l7K1k6lM6l5j0%m4J05k8n3K4j7nK4J3O3j08P8l1J6nl8Qk6
3747d1RL0L5K7q5jJ6L8m4K2Rl6L2L1j7K4o5K4J5nK4p0%N8J8l7j9J6n5RN9m3m8
3780g0P6qk0K4J1k8J4nj7K9l2l5N9K7m1R%Pj6QqK4j5L6oj2n5N9Ok0N2o3O4o5J6
$$ plain form
3553 26 1 60 53 37 -32 -9 10 -2 69 -59 36 -2 13 -43 5 -4 27 5 -45 -28 -2 -31 10 9 9 -13 1 13 17 -33 7 1 -4
3586 -4 45 -3 -28 -19 28 7 -20 18 26 -24 -29 20 19 -42 15 -39 39 -1 -1 -50 7 41 -4 -18 -44 -54 -10 37 4 -45 -7 3 -53
3619 -53 6 -63 -36 8 42 0 36 -1 -2 -54 32 -2 -9 -26 -11 -5 13 17 5 23 -22 -22 26 106 33 0 15 -4 46 -57 53 59
3651 59 -23 -28 32 3 -49 -13 62 1 43 11 -47 35 -25 -28 28 4 29 24 -7 -20 16 35 -83 24 -33 -18 -44 56 18 -43
3681 -43 46 -46 -23 37 29 2 18 -23 47 24 30 7 2 -13 3 -2 11 -48 -56 -36 -28 4 -38 -9 -15 -29 -69 16 30 -24 29 -29 14 28
3715 28 -22 28 -27 -21 9 27 -10 11 -15 -18 28 -7 -17 -17 -61 44 16 -37 -13 -30 -35 -11 2 65 -43 35 4 20 15 -23 -15 -41
3747 -41 -32 -2 33 60 -25 -26 -10 28 -16 6 15 -21 11 42 25 49 -16 8 23 18 42 -28 -28 30 48 11 -8 8 -47 -38 21 -22 -70
3780 -70 6 -2 -22 2 13 -15 -1 -6 -23 6 -26 -61 -2 25 -16 -7 -7 0 -16 -8 -16 8 -7 29 23 11 -44 15 21 1 53 -10 54 -11 5
3815Ej1J8k1m0P8k9j4K8p6J04Lp2k9M7l5L0j5O2n6pJ7K5JQ1n5o8M2j0J7K9p7K4
3847dj8rN4j2Ln3K1L0K5l3J4l9O8o5O1l7j8K1k6K8rpk0M9j6M3m8o4M2k9K4M4l7
3880a7n7M4L2J0K5m7Ol4K4M9o0K4L5n0J6L2k2M7Kn3j3K0k6K0k4%N8n8Nj3N9m6
3912a2J1m6O6j5j5J8o4M2P2o2m6J9M8K9m5JK6o4L7k4L3l6K3k0jO0l6J7M0k7j5
3943A4LKj0K6l5J4L5n2n3KO7m0l2N5plQL2p9L2L6olJ4J5j5k1k3M5r3nJ45j9l7
3977A2n1P6Mj6n3M3n8N5j5Pj0Ol4O2j4o7L3K6jj4L7m1j8J02p5J7k0M1Jl7lk9j0
4010d4K6L6%m1m4P0pJ5n9L8J1L2n2j1K9qM4K8Jn4K1l6jL0j1J9l9j4l2O5o7M0j6
4043c1K0k2L9k2l7L0jM4l5K3j9P6o2l5P9o1M1o5K4kNR8p7P4p5p0L8O5p4LK0lq
$$ plain form
3815 5 -6 12 -9 -49 29 0 -14 14 -62 42 45 -27 -56 -9 -44 -14 -29 33 -23 -30 -13 12 13 94 39 -29 13 3 20 49 -28 -4
3847 -4 -22 -31 23 11 14 -39 -18 12 37 4 18 -21 47 -18 43 6 -12 9 -17 11 2 -5 -25 24 8 51 3 -61 -19 -48 -24 20 -17
3880 -17 -74 -30 2 12 37 -10 -4 -38 -14 35 -25 -1 34 -16 0 32 10 57 59 6 -7 13 -13 7 -17 -17 41 -17 -12 -25 34 -12
3912 -12 -1 -47 19 4 -11 7 -57 -15 57 -5 -51 -32 16 45 0 1 27 -37 0 -24 9 -27 -4 -24 -25 35 -1 16 56 29 14
3943 14 17 19 9 35 0 14 49 -3 -56 -54 13 -27 -59 -4 -11 -14 -6 26 -53 -21 15 9 6 20 35 20 -1 -24 21 -72 -77 68 49 12
3977 12 -39 37 41 25 -28 15 -43 12 -3 4 -6 0 -34 28 14 -53 -20 6 5 -9 28 -13 -31 71 -4 13 -7 34 35 -2 -5 -34 -44
4010 -44 -18 18 18 -23 -67 3 -4 11 -48 -10 1 33 -19 -30 -1 -9 35 63 64 10 31 -5 -6 24 13 32 -7 -21 -53 12 -55 -15 -31
4043 -31 -11 -33 6 -16 -53 -23 -24 20 -15 8 -11 65 3 -32 47 -14 27 -38 -14 -16 -11 87 10 84 9 -61 -23 42 -32 -29 -9 -12 -20
4076b0RJn6P3l1j5R1m7m0M0l3L1j2J7p1K0M4J4Ql8rMM9l1l6M6k1L4rmm5L6L6n3
4110a8K6m3M2%kMKJ0j5L3j3%j0o9M6lk9K5N3p2J7M1p0K3N1n1J5N2m6K1k3n7R8
4143C8l2R7r5J8j0l0P5qn7J5j4j9P6l4p6O6JL8q1M3o7J8j3J0O8Lq8L6J8K5k4r
4175a2mJ9J5l0N7l0j8J7l4p1Q7O1n5j2L3l8L5l8R6m3n7m7J12k0k7L5J0n1Q0j7
4205E3o8oP7p6L9ok9Kj2K0m9P2p8N8J4Kl9J7kJ8L4Nq3l4N7m3M9j4L0P4r2K3l1
4238a8J7J0j3p1J08m2J3pJ05q0q2M3K9k2L8n3j5qP4lQm4M9m3m3Q1lo1L9Jl8N5
4270B4m4N1o0rM6Nj3jkP8o6j8pPO5m2J3n6P0J4r0L0K0J8n1k0O8m0l9K5O5m5MJ
4304A%j6K1m2K5N4j4q1K2N0l3P6j01N9j5M1m0nj7PJQ7jn9m8K0N0l9Rm1M3l7JM7
$$ plain form
4076 -20 -11 -10 -66 7 -24 -39 52 5 -35 5 -28 3 -9 8 -63 -43 1 15 23 -15 -24 -20 29 -2 -38 8 -13 21 12 8 -37 -1 35 -18
4110 -18 8 -35 7 7 5 9 11 21 6 39 26 26 16 -53 -7 -10 -39 -14 39 -33 -16 25 -45 -22 29 -22 -7 45 -1 20 -3 -60 38
4143 38 6 103 8 26 16 -14 61 53 -4 11 -3 -22 54 20 -56 10 11 49 -32 11 -56 -38 -51 -41 27 30 -58 -22 -4 21 -3 -12
4175 -12 -16 3 18 -12 45 15 -3 14 -20 -91 -4 57 2 -10 23 -15 20 -18 78 35 -22 -69 43 23 -4 31 41 -10 70 53
4205 53 -15 -21 56 -20 19 13 -16 -14 -26 -6 -55 17 -61 -3 11 13 -26 -9 -11 7 41 46 -37 -71 -14 -57 -8 -22 8 82 -10 13 -18
4238 -18 -1 9 -4 -75 33 -9 4 -3 102 22 -60 -17 12 -10 28 -25 -40 -48 26 23 31 -13 36 -7 -50 31 28 -33 6 7 -31 24
4270 24 -20 31 -29 -38 8 13 0 -1 -3 75 9 -9 -16 -9 56 14 27 -29 41 55 -35 -5 15 33 -18 -38 30 -10 -49 -24 41 -4 0 1
4304 1 1 -15 6 -36 -11 43 29 -52 -30 20 -13 63 -38 21 6 47 7 2 -15 -8 -7 80 79 20 -28 -8 42 3 12 -29 14 -23 -22 25
4338B5k6l1J7R6q5m9%K6PJ8Ok4J6l5O3k0j4O3p1K3J3Rp7O5%jQJ1qoJ0j9Oj2k9
4373b5k4O1l4K2J2L2k2K1j09Q4k8O1l7k8Ql3N6p1K6RL1j0j8N1m0NKJj0k5MP4R
4406E5pp6K3k3K3J8l7q0Q7J6L5q6M1K2k7P2l2k4J0K8n1oO8k4q0O1jk9K1L7n1O2
4438D5j00mO1l4Q3K5p6K1n8J03n5j3Po0P0p8J34n5l4k1lL4K6q3K0P5o1L5k1J7
4468@J8J6q0O0m2M6j0J7k4n1j4J26r2M6o4P8m5kk4P9Nm5R8n1n7mP2k5pm8J02l7
4500D1k1L0o8l5P3n3N4rl7l7K2L5Qj5Mk3N9J2m6m9M7J8M1m0J9Rj7l1k5M6pQJ7
4533C0m0qMK7K8m5j5N1n8nK1O5p1O9n2K1J7n8Ll5N3J2m0K4Km1M1Kk9K8o3M8RN7
4567E2p5L7J3lm0pM1m8N7J5j1m7rM3J3m5J9OPn0M4n0lM4L2Jj02mK9M8k0J6m3L3
$$ plain form
4338 25 -1 -32 -15 81 -4 -53 -53 -27 -20 -2 4 -20 -4 -39 24 4 -10 53 -18 5 18 27 -50 15 15 14 22 33 25 19 29 10 16 4 -25
4373 -25 -49 12 -22 0 12 44 22 43 -66 18 -10 51 14 -14 -6 -39 17 -54 -28 -19 12 2 -16 35 -5 0 2 3 -7 -32 -28 46 55
4406 55 48 -28 -5 -28 -5 13 -24 -104 -17 -1 34 -52 -11 11 -16 56 24 0 10 38 -13 -19 49 25 -55 6 5 -24 -3 34 -17 45
4438 45 -55 -59 2 -32 51 76 0 21 -37 66 11 -2 5 -55 15 -63 71 16 -18 -39 -42 -8 18 -65 -45 30 -31 4 -17 0
4468 0 18 34 -46 14 -28 18 8 25 1 -50 -64 62 -30 16 -48 30 -15 -17 -41 38 43 -2 96 45 -12 -16 56 31 24 -24 78 41
4500 41 20 50 -18 -53 20 -33 21 12 -25 -62 -40 -5 3 -12 -8 -31 28 40 -6 -55 -8 10 51 11 30 39 22 -9 -34 12 5 13 30
4533 30 -10 -18 -14 13 41 -4 -19 32 -26 -31 -10 55 -16 53 1 22 39 -19 -16 -51 2 14 -26 -2 0 -41 0 2 -27 1 -62 -14 -5 52
4567 52 -23 14 27 24 -16 -23 18 -30 27 42 31 -16 -25 18 31 -14 5 11 18 -32 12 -38 -41 3 35 36 -66 -70 -41 7 -13 3 -40 -7
4601gl9L8rk4M0OMj6j1k6N8j6OM5l9k2j2M0j5k4N3OJ2o6k7L1qj3N3j0J6m5L7l6
4635b0K0j3L9r7O0m0J8K3jJ4jNm7P2j5p3J2N9L2l3%Nm0M3m7N5m8L5k5L5j8J8m6
4668a9k7L3j2kL1jo4P6LJk9j9J1j4MK8lj2k4L0oK0rk1KM4j1k6N8m3j0JJ8MK9l8
4704CKo5P7Q2q6L8l9j4j4O5m8NPLk2J0J5L4q6nP6m8J1k4N6n6Qk0L4l5O1m1N8j4
4738B8j8K4rJ6k5m9P7j2Rm9L9Omj4K5k7j6l6P3o2K3j7QM5m6K7k6J0n1%j0N2j0
4771a9m5M9k8j2R3p4R1k7n3j4L7l7L8J4j9j1K5k0MK3K9l2Ojk7J2ML4n8l8O8l3
4803b1j5M7k7j0M2rl1j8J9J5o2O6j6N3n2M9lj0Om4L6j4m1M9J6J0nNj7J4o3N9m6
4836a8j6O6k3O4m0k2j8P8q2nm7O9m4LK3L0o1P8m5K3j0lnRK1lL4j02M1M0m4L2K
$$ plain form
4601 -7 -46 -8 -17 -41 -1 5 9 -7 -18 -44 14 -2 4 49 10 -12 -24 16 1 -23 30 36 48 -18 -45 -14 -22 -35 18 8 24 -21 16 -20
4635 -20 0 -13 26 -71 -11 -51 -33 -10 -11 3 2 7 -40 32 17 -56 -44 15 47 14 14 19 -21 22 -25 30 -18 17 -8 27 9 27 -19
4668 -19 -46 -13 -25 -27 4 3 -61 15 18 19 -10 -29 -18 -32 -28 0 -3 -15 -39 -9 -15 5 -4 -25 -23 21 10 -16 42 -1 -11 -10 8 12 41 3
4704 3 5 -60 17 99 13 51 12 -2 -16 49 1 6 13 16 -6 4 19 53 -33 -38 38 -10 1 -23 33 -23 -15 -35 -1 -36 25 -16 42 28
4738 28 10 34 25 41 16 -33 44 32 41 -8 31 37 33 19 44 17 1 -35 38 -24 -1 -18 -10 35 -11 16 -10 0 -51 -51 -61 -9 -19
4771 -19 -64 -15 -43 -55 38 -36 55 28 -25 -39 -2 -39 -1 13 -6 -17 8 -12 -8 15 44 12 18 17 -10 2 6 40 -18 -56 12 -21
4803 -21 -36 11 -16 -26 16 7 -24 -42 -23 -8 -70 -4 -20 33 -19 30 27 17 23 -21 15 1 -40 9 25 35 30 35 18 32 -31 28 -18
4836 -18 -34 32 9 73 33 11 -7 71 -11 -16 -63 6 -38 -35 -12 18 -43 35 -10 13 3 0 -5 4 25 22 56 -46 -5 35 -9 23 25
4869B5k7K5n1N8o4O9j4l1k3N8m0O1Mn8O3m1m6R3j11R3k1j7L0k9Rk0ll1M5J2pK
4901A3q7Q1jj4K2K2l7l6N9l3L9J7qk6K%Lk6M5n8MJj5oR8q0N2n9k1M4K0k0N0rj25
4936h9P1L2o3j1J13j35P9j0K7m4L3k1J9K1J0J0n8PJ7k4K6k7O1Kl3Qp4O6J7o6L1
4967el5mL9M7j04L7kL2pl4O2j7n4P9Jj8n2J2J6K8J7Lo6L0nljo0O0J9l7M2n0M6
5001A6J6p3R3l7M6m7%J1K4n5%PL3o7K1J6k7L0qk2OJ4J6J0n3M0Jk7M6o1MN5n1J8
5035eJ3M6j16O3nL4m8k4M0K9L1j7p7M1k7M2j3J9ok6l3M1J3m9j2K9K2j2J7j7Ok7
5067b8J6Nm7k1J7K5M9nJ6o1M8j4L3pKm2K9j3J5o1RL7m5L6K0K6m4L0j3r1J05m7
5099b1j1Q2k9m3j5L4L2J9l0l3N5n7L3k8Rp9O7JM9J0j2m5L1J4m7L3k7K5j2pl0N4
$$ plain form
4869 25 -2 23 -28 30 -34 35 21 -10 -33 25 -15 46 50 -8 55 14 -32 61 -50 43 22 5 35 6 15 -5 -8 -39 6 18 11 13
4901 13 -74 7 6 -8 14 36 -1 -37 22 -11 28 45 37 11 13 13 16 -10 35 -23 -19 -18 -33 -39 59 -21 31 -28 -49 -5 15 -5 45 36 -89
4936 -89 -18 14 -49 -60 53 -82 -3 -13 14 -30 3 -18 1 22 32 42 -16 -9 8 -16 10 -17 44 46 13 21 -53 13 30 -36 -5
4967 -5 -40 -44 -5 42 -62 -25 -27 5 -2 -36 26 9 -45 34 35 17 -35 -23 -7 21 38 41 -25 5 0 -3 -4 -64 -4 15 -22 20 -30 16
5001 16 32 -41 52 15 61 14 14 25 49 -6 -6 1 34 -33 -12 4 -23 7 -1 -23 -17 -3 13 23 -30 10 11 -16 30 -31 -27 28 -23 -5
5035 -5 8 54 -62 1 -4 30 -18 -42 -2 27 58 41 -36 5 -22 20 7 26 20 -6 -39 2 15 -34 -46 -17 5 -7 10 -7 -1 -28
5067 -28 -12 -7 -54 -75 -58 -33 16 11 27 -34 14 0 33 26 28 -14 15 2 17 -44 -35 2 -43 -7 13 39 -5 25 12 -79 26 -21
5099 -21 -32 50 21 -22 -37 -3 29 48 18 -15 40 -17 16 -12 -3 -82 -15 -14 35 45 33 -12 19 33 -14 19 -8 17 5 -2 -32 22
5131B2RJ9l9mLl3L8rm0J2RqM8k5Kl2K2Oj8P9r4K9j3L9n4m2P0N7n5L5n6j8N2l7
5165b6ML0QKn8L6K5j8Nk1J2j0j8J9K6m0K4m2Q3m6Q8j19KK2J6k7Pm7M5L1Ll6j0
5198c0M0nLjl3l3M6mK0Qj4J9k6K9o9K9L1n6O8N2n9k7J5j1KM1j8K3m3l9M3k1K0
5231@ol8N6k2j9N6k3K%j2PNl8J1L6l3J4k6MJ24p7j0k0oO9j1lNj9n3J01r7l6N0
5265iJ9Plm1M7Oo9l9P7OL8q1M6K0j8Lk6j4J5K7n8O3j0J5l7L8pl6K4j5N7prK0n6
5300gN6kp4M9qk4L8k0M1l8j3m5KK1RpPk7J4K3M1q5M5L2j4%Mm2O4o9N4pj2Kl5R
5336a8N7pj7k5m7N8L3j8K8j09L9L6Qj4NKk1J9mj0n1O9j1%k5RL9l9%lK5J9rk9J7
5371Fl0N7l7rK2n5L6N6j6l7J9L6m8N3n8o1R5k9M4o1k2LkJ03j01o0N6Q9m4N5q2
$$ plain form
5131 22 31 50 11 7 10 -23 15 6 -34 -22 -13 -21 27 2 4 -28 -6 0 -18 61 -33 -4 -17 22 -32 -74 -4 53 -2 33 -23 -41 11 -26
5165 -26 -22 8 16 18 -40 -4 21 3 8 -13 -1 -11 -29 -10 16 -24 0 -42 41 -5 83 -36 -34 -12 4 -23 -16 -63 -18 13 16 -20 -30
5198 -30 10 5 8 7 -26 -59 -13 -17 3 11 -3 16 -10 19 -50 -21 10 -46 22 74 15 -12 3 -8 -6 35 17 40 -3 -42 1 -20 0
5231 0 -6 -44 12 -10 -29 27 4 6 6 -6 1 6 -32 -21 15 -18 -4 -30 -26 98 21 11 -9 -15 54 43 40 45 26 -27 74 -23 -59 -9
5265 -9 10 17 14 -27 20 26 -43 -82 -5 1 39 -42 4 24 6 9 -17 -31 -16 11 -47 16 6 21 -16 22 15 -21 3 -12 45 38 29 49 -7
5300 -7 49 47 -27 22 14 -10 28 8 49 11 -2 -47 -45 -24 -15 -22 -15 -42 -28 -5 36 -49 -4 28 14 14 18 -24 40 -29 25 18 6 8 -27 -18
5336 -18 39 32 15 -10 -57 1 34 16 44 -65 -26 10 18 4 9 11 -10 9 5 -5 -56 13 2 2 -23 -14 25 -14 -14 -17 8 27 18 -11 6
5371 6 -24 33 -4 -13 9 -46 -10 46 30 -7 12 48 0 53 -5 -66 29 0 44 -17 -39 -36 -38 65 -36 -96 -40 49 5 60 -22
5402b2j7K9%l7pJ6K6J7Oj8J6k7M4p0j9J44m3l0L9o0M3m5J1OJ5j2jrk8Q2p5JN5
5435C0J9n0k0L5r0N6M4j8M8j46O4J8rN2m7J1k5L1k2l3N3j2K3J3l7J1K9n6O0n9
5465b7L5OQq7P3P2j06M7k2nLJ6J9j8j4Ol1M1m4mM5Ol9n5N7J7k5m1N2L8Rkm9M1
5499B2qKm1M2m1k4O1q3J02K1rp6M0JK0j2j00O6rL6J1k7k6P5k0m0L3Qm8J2k9R2
5531E1n7jJ8Qk7mJ0L8o0nL5j6JK5RJ3Jl1j0M5k7p6L1L0K4k0kj4L4j0nJ2J1mk3
5566DM8n0m7N0j9oN2q3L0LqJ8k5L8o7LL3l4L4l1M5lJ7J5k9n6J12k4l7L1K1qk7
5599@nm7P0K0m7P0o6J3Ol2M6k8pL6l3j1l1M6j4M5q9N6M3r7Q2rm3N0m9J2NQ%M2
5633D2l5omK7j2JK4m7M7K6l1m0L7k2K4n8J8jJ8j5j4rJ7L2n7M3k4O6m1j4%pj1O0
$$ plain form
5402 -22 -39 -10 -10 -47 -54 -38 -12 5 11 -7 9 -18 26 -44 -63 81 38 8 47 -13 30 -15 -4 2 17 5 4 -5 -33 49 -26 -25 30
5435 30 49 -1 -21 14 -76 -20 24 6 54 -92 -28 -10 -19 33 -14 -3 -28 3 -19 -52 1 -11 12 25 -12 -1 28 -28 32 -27
5465 -27 8 14 22 -65 8 80 -26 21 -1 -6 -3 13 32 14 0 6 -25 16 -28 -32 13 19 -20 -75 -18 -1 -26 -67 -15 23 32 30 -19 22
5499 22 14 16 -25 17 -24 -48 13 -70 32 53 44 -32 8 9 29 17 -83 -17 -26 10 21 -6 -32 43 23 -17 16 24 -24 -12 -41 51
5531 51 -6 -7 11 19 -8 -12 -2 36 -24 -29 6 -10 -9 16 25 38 39 8 -2 43 16 -60 -29 1 25 5 3 -11 23 13 8 20 31 27 4
5566 4 52 2 -45 5 -14 -20 32 -51 -21 -18 -26 -8 -33 5 -62 -59 -26 -60 -26 -57 -12 -15 2 17 -12 -68 44 20 -17 14 35 27 0
5599 0 -5 -52 18 38 -9 61 -5 8 14 -18 28 0 -7 29 -4 -15 -46 0 -14 31 -58 -2 41 -56 26 17 -26 24 -25 -13 -8 0 0 42
5633 42 7 1 -3 24 12 13 37 -10 37 63 32 -8 29 7 31 -27 -9 -10 8 -7 -21 -30 -13 19 -38 5 -19 47 6 -8 -8 -15 -26 34
5667C4l8L2mq3M6K1j1MK2K5m1l1M1Mk2jK3K4Qo9L2nl6L6mJQp5J00m0l2%l1N1K
5702iL8n2J6%k2K0Qk8K1J5J2qk8K2%Oj3mM7k0K7p3L4m4L9qK8p4M3k2N0l2O0q3
5736c4M3k7O2o7J7Nj8L9q6P8l3kJ3O3r4L9m0JJ9K4J8j1Kj3K3k7M8o2lJ2nqK5N
5770Fl1L0j0L4k5J5Lm2K8m1O6m8K5l7L9nl6K8l0M8m1oO3km7J5rl1m0Q0J3NL4j34
5804h3J00k8k1OmK1K7K4j0J7j5%k0ok9J4j0kJK8l3Nj3K0OL7n9L5J7n0k2j5Q6j3
5838A1j9N1J0o7K8%nJ5mjJ0n7JM1j3L2Mj4l9K7K4n0N0m1QMP9l2j9j7kK4j9L7l6
5873B1n5Q3l7K6l1o6J11r5OK3kK5J5p4K4pL1K5k5J6J2J7q6J19j04L8N9j06L0J3
5903FJ0Om2LJK7M5n1m6L3Kk0J1L6n2n6R7K0mm5J1K9j9O5n4l9O8l7M8q0J8M0n4
$$ plain form
5667 34 -4 28 24 -59 -13 8 -3 1 23 48 7 -24 17 21 -1 -2 21 45 53 -16 16 11 -25 11 7 8 16 -59 41 1 -31 -31 -62 -11 -9
5702 -9 29 -23 -7 -7 -29 -9 -1 -29 -8 7 19 11 -17 5 5 11 -2 -6 41 21 48 -25 9 -35 4 -4 24 -50 -7 -29 21 -11 49 -34
5736 -34 9 -18 44 -23 -6 -1 -19 20 -66 12 -21 -23 -10 53 -41 -2 -42 -41 -22 2 20 9 11 -2 21 -6 42 -20 -23 -11 -16 -24 1 6
5770 6 -25 5 -5 29 4 19 22 -20 8 -33 33 -15 10 -27 12 7 -29 -1 -31 17 -24 -30 33 31 -16 -1 -10 -41 -81 -1 12 17 51 -83
5804 -83 17 -11 -32 -26 -30 -9 18 42 32 49 34 34 14 8 -21 -7 -17 -19 -18 10 -23 -18 -31 -11 -5 32 -27 8 25 -25 -47 -62 24 11
5838 11 -8 43 53 -14 14 14 9 24 20 19 29 -28 -27 14 1 33 37 23 -16 11 35 -15 35 -6 2 6 85 53 34 17 15 39 20 57 21
5873 21 -34 49 12 38 7 -59 52 -43 -37 -14 -16 9 24 -50 -26 -33 -2 23 -2 14 26 43 -43 76 -28 10 69 -37 -7 6
5903 6 16 22 -20 -17 -16 11 56 5 -41 -8 -6 -26 -15 21 -31 -87 10 30 26 -19 -8 21 2 67 13 -26 42 5 53 -27 -9 31 -23
5936b3O5o4Rj1M0k5K4pp1M6J9K5n9Q1l5j1k1L3l6M7j5n2nM5j3lN6o7j1M3l1j2
5968c9L4J3L4q0Q5j6r4J8L4M3k6J2Ql6P0r1j5L4N7o0L0n5L4Pm7L3Lk2L3j4K6J6
6000B9p1J7j4K8PJ4m9N3o0L9l0JN0M8p0j0K4n3J5O7l6k4L6p0J21l1m0P9q2KJ9
6031IJ3l9J8j9O1m7MK3j7K4m3M2rl0jL4lk1K1l9lJ4QNk8K0Jk1qQL1k3K1pl4J05
6067G0n4l3L8l7K7nj4l1J7OM9j7pn6N2l5j9O6o4kK8J5N4m3j6j9K7K3po1L4L5M
6100B5kjK0k7m9l5O1J4J0J8K6q3K7j5M3l7NmJ2k4l6N0pMJJ2n0M8J3k0j1Rj5K2
6134DJ3l6K8m9K3Lk8L4L8m4NN2l5M2k1m1N5n6J8O0j14J02n8K0ro6P6l5RJ8L6n1
6166g%o1Q3n4M0k5mN8m8rM2q2N8Knj3L2m2N8Pl5O0k3Ljj4LK2n9M3J9m9n8L3M7
$$ plain form
5936 -23 42 -22 -13 -24 16 -9 15 8 -63 -17 2 27 -32 49 14 3 -18 15 -21 26 11 -41 -46 -1 -14 -17 39 -28 -39 4 -27 -39
5968 -39 -5 8 42 -38 47 31 -63 -45 -11 32 6 18 26 -10 60 -31 -46 -12 45 -15 15 -40 -6 1 -46 -13 -10 -32 1 -13 13 29
6000 29 -42 -25 -39 -11 -4 10 -39 14 -46 -7 -37 -36 14 62 -8 -18 6 -47 -32 35 -1 -25 11 -59 62 31 -9 70 -12 -10 9
6031 9 22 -17 1 -18 43 -4 0 23 6 30 -13 29 20 -10 -11 23 20 -1 20 -19 -22 -8 0 5 -23 -3 -2 -23 -31 -23 8 -15 6 -1 -35 70
6067 70 16 -17 21 -16 11 6 -8 -39 -22 -16 33 16 9 -47 5 -30 -49 17 -47 -49 -21 -6 48 5 -11 -30 -3 20 13 -48 -14 21 25
6100 25 23 22 42 15 -34 -69 -8 6 16 34 60 -23 4 -11 32 -5 0 -4 8 -16 -52 -2 -9 -5 -4 8 -42 6 19 -1 -12 -3 -18 4
6134 4 17 -19 9 -40 -17 -14 -42 -8 30 -14 -9 43 8 50 29 -12 43 -13 5 65 -49 53 -5 15 6 -60 16 -19 -10 8 44 -7
6166 -7 -7 -68 15 -39 1 -24 -28 30 -18 -27 15 -67 -9 -7 -12 -25 7 -35 23 30 -5 55 32 35 34 20 23 45 -14 29 48 -1 -59 -26 21
6201B1m8NKPL9m8npK6L0K9Lj9n1J7n7K5qM0N2p5jK8m9M1k4L9m5mQ3o1QJ8oM5p3
6237b3N0n3OM4lQo3K7k8L1rk4L1L3j8l7J6Q9j39R9m4j5l6K5M6j8QJ6j4K6o0K2
6269gk1K8l0N4m1N8r0JO2l3L7j1lj5j2M5J5o3jL3kL5p4L6L2k7J3on9J1K4K3K7
6302C9q3J1MM0k7MJ2m7K7J8m6O8k5m3R2m3K9Ll6J8jj7J8mol4J5p2L6P9p0L0k3
6335c4L4K4p8L5j5j5N8K0l8k7M6j5k9k0N8rk2k4P1n2QN4o2N8j5pk5Q3r4M9K9n1
6367eL1J3m3J3l9O7Lm0J7o7N8o9N9k0pL3l4ml2O0j0J2oj7K3K0Rj7J8m0J1L7l0
6400Dj9J9jM8p5K2N8m6oLj4O1q9NL4K6m9lO2n8M4o5O3m9R9j01m5P1Pk4k4jK9p
6434b1N0J6p0L4lj9P1k3m6j3lN4j7Rj2m6K0J4L6J9l9nk3O7j5Jk6n7K6qP2p7L4
$$ plain form
6201 21 -27 -22 -20 -13 26 -22 -27 -34 -8 22 51 54 35 -16 1 -56 -31 -39 1 53 -22 -23 5 -44 -3 -27 12 -33 -37 46 -15 -7 11 5 50 -23
6237 -23 27 -26 -20 24 21 29 -34 -7 -35 -4 -13 -37 -6 27 9 -28 -12 77 -62 37 -7 -22 -58 -33 13 -5 3 19 5 31 -29 -7
6269 -7 -28 0 -30 24 -17 41 -49 -48 14 -19 18 7 4 -11 -23 22 37 -26 -27 6 4 39 -35 1 33 6 19 13 -46 -35 -11 12 39
6302 39 -44 -33 -29 11 -16 -12 0 -47 -20 -2 -48 20 -5 -48 44 1 30 33 -3 15 14 -3 15 11 5 -29 -14 -86 -50 29 -41 -11 -34
6335 -34 0 24 -54 -19 -34 -49 9 29 -9 -36 10 -5 -34 -54 4 -5 -27 -51 20 -32 -24 30 -32 26 11 4 -21 62 -32 17 46 -5
6367 -5 26 39 -4 9 -30 37 40 0 17 -50 8 -61 -2 -22 -29 4 -30 -34 -66 -6 -16 -4 -10 -27 -4 16 25 8 26 -14 -3 34 4
6400 4 -15 4 3 51 -24 -2 56 10 4 7 -7 54 -35 -30 4 30 -19 -22 40 -18 26 -39 24 -25 74 -27 -72 -1 6 -18 -42 -43 -14 -21
6434 -21 29 45 -25 9 6 -13 58 35 -11 -24 -27 27 10 19 7 -39 -19 -5 31 50 11 6 -17 50 35 36 10 -47 -21 -29 43 -34 0
6467@n5L0K3K7j8l3OqO8p7K8N1l7lK3m2N6l1Pj7j4P0k3l3N2n6M2n3nL5N5l3m9
6500a4L8l3N5k5o1J1P3l4j1j2j9J4L6k0Ok0J1k5M3k1k2N1Mj4j1J1o2K4Qn7J01
6531B5k8JJJ4Ll0L9k4QOJ1Ll4K4j8Pmm7RN2n0J9j8k8M5oK7j2k4j7M7j3k7O8k1
6566HL4k3m3M3n1N4R9r1j6K6l8j1L1j2M0k5j6M6k3l7l4L4l2N0lk1J2k4N6q4J3
6597c8O4j8pql1N2l0k1O7Nk6m8K9O6q0jQ1m3M1q3Q1m3jLJ7n9N5%l6L7K4p2N0J7
6631D4q1P4rj8k0J6j1L4mj8l5qK6j6L1lO4k8pll9J1OJ9k9M4n7L0j8Q0j45O5J8
6664A3m2M6mnOn3K9mN0l7l3L9L8nj00M9nL7j7J2n1K7k7L8jK4N0o8jK5l8N2p7P7
6698D4q2M2pk6R7m6l5L9NJ1l1oJ8j9mJ7J1rJ4o1L3jk9P3q2jQN2rm2J3kj1O9p8
$$ plain form
6467 0 -55 -25 -2 25 7 -26 -20 -28 40 -37 -9 42 5 2 25 -17 39 8 15 -2 -16 54 31 -2 50 -6 36 -17 -22 13 68 35 -14
6500 -14 24 -9 46 21 -40 -29 44 10 -1 -13 -32 -18 18 -2 4 -16 -5 -30 13 -8 -30 21 25 11 0 11 -51 -27 -19 -76 25
6531 25 -3 -2 -1 13 16 -14 25 1 9 15 26 29 -5 19 1 8 4 -43 -34 18 -32 -13 -31 -59 -14 -20 7 -5 -29 -46 1 -12 -39 29 8
6566 8 42 19 -24 19 -32 22 121 30 14 40 2 -9 22 10 50 25 9 55 32 -5 -39 -5 -37 13 10 -11 1 -23 33 -51 -38
6597 -38 26 8 1 -7 -38 14 -16 -37 30 35 9 -39 -10 56 -24 -25 56 13 54 -29 52 9 8 11 28 -31 24 24 -12 25 49 -23 27 44
6631 44 -37 37 28 10 -10 6 -5 29 25 7 -28 -36 -10 -26 5 2 66 38 31 28 -11 0 6 25 -4 40 -17 13 -5 75 -70 -5 13
6664 13 -29 17 13 8 14 -39 -10 -14 36 -1 -34 5 43 38 -62 -13 -18 19 2 14 -37 -10 -37 1 0 24 74 6 5 30 -8 44 -33 44
6698 44 -38 4 -3 -29 68 22 -13 26 31 42 11 5 23 4 0 17 28 19 33 -28 5 4 -25 48 -34 -35 -27 25 16 -26 -13 -15 -26 43 -35
6733c5K5M2J1Lk8K2o1K8k2L0K3j3j5pk6RO7j05J36p0m5J3J8L6k4mJ4rk1J7J1o5
6765d5R4m9j5J6l4K5Kj6J1K6p3P3K9j4m9L3nj1K0q6J02J2o0J6ok1k4M6j7k2N6
6796A4k0L3L5o4l3j2M2oj9J3L1m9J16q6j3K4J9k8J0L2n0L2Mn4O2j8k2Pn2J05k0
6827C3q0L5J15j28K7m3M8k3lL9oO7Rj05R9q5K3j2o5P9l3L3j6k8PL0k4K5n8N6k3
6858gk0L1J1K7o7L2N3j12L4M2o4L8L0J1l0o3R1JKj6j9NK8m0Q3m4l6m9RM2n2M1
6890hL6n7qL9lK5l2j2N7l9o8P6q2J00k1NNm9k0P0K7q1N7k6J6%J7l9K4k3J5pk6
6923c2L3l9O3qj5K1K7n0L5l4ppj0qK7J1J1J7L6r6j7K6rK4o4Q4p3Q2l5kj2M7o3
6956c7k9M4O7k5M0n3J3O1p3K1o2J6j0j1L0k6m8Q6k1J9l8K3rj4K2L2l6K0n2O1k
$$ plain form
6733 -35 -10 32 43 46 18 40 -21 7 -15 15 38 25 10 3 -23 -14 53 -52 84 14 -31 -18 0 36 12 8 22 13 -8 9 20 -45
6765 -45 49 0 -15 1 -33 -8 -6 -22 -11 15 -58 15 44 30 -19 14 9 -2 18 -68 34 46 -14 2 -4 -25 -49 -3 -20 -42 14
6796 14 -6 27 62 -2 -35 -47 -5 -11 -30 -17 14 -35 81 -5 -18 6 25 -3 7 39 -11 21 25 -29 33 15 -7 0 -52 53 33
6827 33 -47 -12 103 -25 2 -41 7 -16 -19 20 14 81 90 -15 84 -1 22 10 -55 24 -9 24 8 -20 -13 17 -7 18 -40 16 -7
6858 -7 -27 4 15 42 -25 7 60 -52 -18 24 -40 -2 28 39 9 -54 37 38 40 24 5 10 38 -2 81 37 1 -48 -39 3 -49 -8
6890 -8 28 -29 -37 2 -1 24 -8 -20 37 -2 -70 6 -76 24 3 8 13 -36 -56 14 41 -40 17 -9 7 7 24 -15 9 -14 1 -6 -32
6923 -32 1 -38 25 17 2 23 50 0 35 1 -6 -13 -23 -31 -4 7 18 35 71 -25 -42 -16 -25 -1 -65 19 -54 28 -7 -9 -21 26 -37
6956 -37 -66 -22 45 20 60 7 20 81 8 29 -33 -17 -27 -38 -8 -34 -82 4 -17 2 -36 -13 -22 -36 -14 18 -18 2 -50 11 9
6987Ik2Q%qKlj8K3L0k4j6mM0k2%O8j06K6N0Ll1L3m1J8l2P8oq5M9q6M1mJ5j0rl1
7023f5J17n1K6m4k1K5RJ0Lm6O0j7J5m0L7O8j04J6P4j54P5L4n1O9pol8OM8q8K4
7054a6M1Nn4N0j6J6q5J1K4m0O0jl1M1j0l7P8q1J2M3l1J1j0M1l0N0pj1l8L3j6J7
7086A9Kq5O2L6m5qj1N9j5J8l8L1oj2k3lL9J4k1k1k7l8Q9m9L7J1k2J4pmJ3l8N4
7119B5o3n2N5L3L1k9NL1k3J2oj7K3k8pK3j4nl9m5K8M7l6L3k7K7j5J4J6Qk7M4l2
7152a0O3k2n5N4l3J0m4oK3j9knPL9m1k5N4J0j5%K7J1k6J7j4J6P0n2l6K1o7Q4l3
7185AL3l6L6r5P9k7M7k8n1lP1k4N6l9n3l5L7j8N2l2JmJ5L0Rp4N6L0l0P4p1koK
7219AJ8m2J4L4nmL1p6M4n9J04m0qk4M8o6l0M0O3m6%pK3K1o6m9P9L9k2l7J2J0K3
$$ plain form
6987 9 -13 -5 -5 -13 -11 -14 -32 -9 21 -3 -19 -23 17 -5 -5 63 -43 -17 33 36 5 38 -3 15 -17 61 55 -30 19 -67 -26 -30 -15 -25 -34 -65
7023 -65 52 1 27 -17 -38 -13 -4 6 9 -37 23 6 21 -19 18 86 -18 -2 72 -82 -7 27 -24 45 38 32 -6 0 48 -40 -16
7054 -16 25 30 -24 26 10 26 -59 -48 -24 -64 -4 -5 -36 5 -5 -42 36 -45 -33 10 -21 -10 -20 21 -9 41 34 23 -15 18 2 19
7086 19 21 -64 -2 34 -11 -19 -30 29 14 32 -6 25 19 7 -16 -19 20 34 13 -8 -35 -73 16 -33 4 15 -7 7 0 -4 9 -29 25
7119 25 -38 -90 -35 -2 29 0 5 36 13 25 19 2 25 -3 -10 13 -1 -6 -45 -90 -62 -15 -51 -18 -45 -18 -33 -19 -3 5 -22 22 -10
7152 -10 53 31 -24 30 -3 7 -37 -43 -20 -39 -41 -46 -39 0 -41 -66 -12 -2 -17 -17 10 21 -5 12 -2 14 84 32 -4 17 -50 34 1
7185 1 34 -2 34 -61 18 -9 38 10 -41 -44 27 3 59 20 -33 -68 -31 -49 3 -29 -28 -32 -17 13 22 -52 4 34 4 78 7 5 -1 1
7219 1 19 -23 -9 25 20 16 47 -29 15 -44 60 20 12 -12 36 -30 -60 -20 43 -3 -3 -10 13 34 -32 -81 -2 37 15 -22 -10 0 23
7252B3j6nl5L1RK4n2ON4l7RNk7L7n0Q5l3k7rNJMO4r9J7M3K3m9K3L1n9LJ4j2J5
7287A6m5LJ7Jk9J0K1J7K5j5K1OJ1J1m3nqk2P2n0pL6l1k6J0qK2j3K5J6q5N0qj9
7321b4nN7m9P3r7K0L2l1LQoM8k0l2kK7L1r7Q6k2L4jo6L8k0KoM6n4K2J9K2qn1P
7356a6K1J4m8jl6J32j03J0L0K0m2J4nj0M1m1Q2o5k6JL1l3N1p1L1J7k3M4jm1L5
7387A2K0jj4n6J1j9Q8m9N9n8jK%K6o4N2J4j7m0M5MKn5J3K4p0J38o7K4l1J6J2o
7420A4j8L2l6k7M2nk0K1KN0r5L7J3K2k0jm2pP8m1mN0n5j0LL8m3qO6k2j4J3m3l5
7454f5QK6Q4p1j3m3R4k6K7kJ3m8K6p0M5KJ3o9O7qL8J3q6K0PjN8n3rN4o5M3J8q1
7488e4L4J9kK7o9P5m1M2kNj1m7N2Ol5j6K1j1J8M2l8lj8K4k4K%om9L6JP5j8j1k6
$$ plain form
7252 23 7 2 -33 -2 7 31 -21 -15 39 2 11 16 -11 26 -24 61 28 1 -8 -3 -2 2 66 -33 -16 27 50 1 24 55 -4 -1 13 1 16
7287 16 -29 -26 -9 -8 -37 -27 -6 11 36 21 42 48 59 70 27 22 14 -8 64 14 7 43 12 -14 -4 -12 10 -3 22 38 -47 3 -5 -24
7321 -24 -29 28 -21 52 -45 -25 7 -24 -21 -13 -19 29 9 -23 -25 2 33 -64 22 0 34 33 -33 5 -15 -13 -19 27 -27 -5 14 36 28 -23 -16
7356 -16 5 19 -29 -30 -66 66 -37 -27 3 23 -19 -5 -10 -20 21 -20 62 -3 -29 -28 3 -30 21 -50 -19 -2 -25 19 18 -23 12
7387 12 32 31 17 -39 -28 -47 41 -8 51 -7 -8 -6 -6 20 -44 8 22 5 -35 10 14 16 -39 -26 -2 -72 66 -1 23 -8 8 20 14
7420 14 -4 28 -8 -35 7 2 -18 3 5 55 -40 -3 10 32 12 11 -31 -38 40 -1 -5 45 -10 -20 -17 21 -22 -30 36 14 0 13 -30 -65
7454 -65 -57 -31 53 -18 -31 -74 20 -6 21 19 32 -16 10 -60 -15 -13 0 -69 -2 -10 28 41 -45 -25 -18 -19 39 -14 -23 31 -34 9 27 -54
7488 -54 -20 -1 -3 24 -45 30 -11 31 29 34 23 -24 28 34 -1 -17 4 -7 11 53 15 12 -6 18 -6 -4 -4 -10 -59 -23 -22 53 35 24 -2
7523bk1L4mj5jjO8o6QK2jm5O3n8K0rj9N3j5k0mJ5M6j4l5L6o1L1mRJj0J4J3J4L
7559D5l6O8o1jK5k9kmL2n2m0R8j8m2l6J9L0k1L9J2j4%q0P5k4J0K8j3o7R1ml0M2
7592D0j21R4orm8N8L1k7nQOqpJ3l1K8n1N2j7K1l6k3R1q0J1J0k5J8RQn0J6K6M9
7626D5m1Kk1Mj6L4kn7Q1op9N9j3PN6q8L6K2L1n5N3J8l8l5JK6l5M0o5L8J2k8mo6
7660h4P2j3OK1k7L0j4j3K5l2OK4L3n7K4k8L8j8O2l9k1k3N8N8m9Nm2L4l1K3n7N
7692b4J0L5k4K0nQmo0K2l7P7n8pO6m6N2k8kJ9Qn6N4j11R0k1L9J8r6N7OL3j3p0
$$ plain form
7523 -2 -23 11 7 -8 -9 -10 58 -8 0 22 21 -24 39 -19 1 -8 -27 26 11 -9 -13 2 48 34 -1 35 -26 5 1 10 11 1 15 28 42 45
7559 45 9 77 16 15 40 11 9 5 37 -15 -55 43 25 -17 -53 -34 -4 -25 14 26 12 12 -68 7 -17 -7 21 8 -59 32 28 -2 40
7592 40 -81 13 7 -2 -50 8 39 12 7 15 21 13 6 19 -12 16 -35 17 0 21 -15 -38 53 -27 -16 -6 -31 -13 -4 4 -46 -30 -4 45
7626 45 4 6 -15 -11 -27 7 5 -52 29 23 -56 3 -10 -3 53 -35 1 23 54 -1 52 70 32 -3 -2 24 -11 29 -36 2 14 -14 -18 -84
7660 -84 -12 -25 -19 2 -25 5 -9 -22 3 -29 -23 1 34 -23 1 -27 11 -7 55 16 -5 -28 30 88 39 44 2 36 5 28 -29 -24
7692 -24 -14 21 -3 17 12 20 16 -44 -22 -59 18 -40 -47 19 -27 25 -3 -5 14 22 -34 20 -91 -1 -22 17 35 -61 -4 2 35 22 -48
$$ [...]
8191F9
##END NTUPLES=NMR FID
##END=
