##TITLE=1H_Pr-18
 CD3OD
 8 sc, 
 13.6.2023
##JCAMPDX= 6.0         $$ Bruker NMR JCAMP-DX V2.0
##DATA TYPE= NMR FID
##DATA CLASS= NTUPLES
##ORIGIN= UXNMR, Bruker Analytische Messtechnik GmbH
##OWNER= root
$$ XWIN-NMR		Version 3.5
$$ Tue Jun 13 18:31:54 2023 Russian Standard Time (UT+4h)  she@DPX200
##.OBSERVE FREQUENCY= 200.13135
##.OBSERVE NUCLEUS= ^1H
##.DELAY= (6, 6)
##.ACQUISITION MODE= SIMULTANEOUS
##.ACQUISITION SCHEME= undefined
##.AVERAGES= 8
##.DIGITISER RES= 18
##SPECTROMETER/DATA SYSTEM= spect
##.PULSE SEQUENCE= zg30
##.SOLVENT NAME= MeOD
##.SHIFT REFERENCE= (INTERNAL, MeOD, 0, 15.7039)
##AUDIT TRAIL= $$ (NUMBER, WHEN, WHO, WHERE, WHAT)
$$ ##TITLE= Audit trail, XWIN-NMR		Version 3.5
$$ ##JCAMPDX= 5.01
$$ ##ORIGIN= Bruker BioSpin GmbH
$$ ##OWNER= she
$$ F:/spectra/data/she/nmr/H-F/1/audita.txt
$$ ##AUDIT TRAIL=  $$ (NUMBER, WHEN, WHO, WHERE, WHAT)
(   1,<2023-06-13 18:30:39.40 +0400>,<she>,<DPX200>,
      <created by zg, POWCHK disabled, PULCHK disabled
       configuration hash MD5:
       00 E9 B6 7A A2 85 ED C7 34 08 36 98 17 FE 4E 26
       data hash MD5: 16K
       EB 12 72 E5 F5 F8 A0 E0 65 F0 59 83 DB CD B8 27>)
$$ ##END=
$$ 
$$ hash MD5
$$ 42 B5 29 E8 AC CB 7C 1C 8B 76 C2 F3 A1 69 B0 F7
##$RELAX= 
##$RELAX= 
##$RELAX= 
##$RELAX= 
##$RELAX= 
##$RELAX= 
$$ Bruker specific parameters
$$ --------------------------
##$DU= <F:/spectra>
##$EXPNO= 1
##$NAME= <H-F>
##$PROCNO= 1
##$TYPE= <nmr>
##$USER= <she>
##$AMP= (0..31)
100 100 100 100 100 100 100 100 100 100 100 100 100 100 100 100 100 100 
100 100 100 100 100 100 100 100 100 100 100 100 100 100 
##$AQSEQ= 0
##$AQ_mod= 1
##$AUNM= <au_zg>
##$AUTOPOS= <>
##$BF1= 200.13
##$BF2= 200.13
##$BF3= 200.13
##$BF4= 200.13
##$BF5= 200.13
##$BF6= 200.13
##$BF7= 200.13
##$BF8= 200.13
##$BYTORDA= 1
##$CFDGTYP= 0
##$CFRGTYP= 5
##$CHEMSTR= <none>
##$CNST= (0..31)
1 1 145 1 1 1 1 1 1 1 1 1 1 1 1 1 1 1 1 1 1 1 1 1 1 1 1 1 1 1 1 1 
##$CPDPRG= <>
##$CPDPRG1= <>
##$CPDPRG2= <>
##$CPDPRG3= <>
##$CPDPRG4= <mlev>
##$CPDPRG5= <mlev>
##$CPDPRG6= <mlev>
##$CPDPRG7= <mlev>
##$CPDPRG8= <mlev>
##$CPDPRGB= <>
##$CPDPRGT= <>
##$D= (0..31)
0 1.2 0 0 0 0 0 0 0 0.06 0 0.03 0 0 0 0 0.0002 0 0 0 0 0 0 0 0 0 0 0 0 
0 0 0 
##$DATE= 1686666638
##$DBL= (0..7)
120 120 120 120 120 120 120 120 
##$DBP= (0..7)
150 150 150 150 150 150 150 150 
##$DBP07= 0
##$DBPNAM0= <>
##$DBPNAM1= <>
##$DBPNAM2= <>
##$DBPNAM3= <>
##$DBPNAM4= <>
##$DBPNAM5= <>
##$DBPNAM6= <>
##$DBPNAM7= <>
##$DBPOAL= (0..7)
0.5 0.5 0.5 0.5 0.5 0.5 0.5 0.5 
##$DBPOFFS= (0..7)
0 0 0 0 0 0 0 0 
##$DE= 6
##$DECBNUC= <off>
##$DECIM= 32
##$DECNUC= <off>
##$DECSTAT= 4
##$DIGMOD= 1
##$DIGTYP= 9
##$DL= (0..7)
0 120 120 120 120 120 120 120 
##$DP= (0..7)
150 150 150 150 150 150 150 150 
##$DP07= 0
##$DPNAME0= <>
##$DPNAME1= <>
##$DPNAME2= <>
##$DPNAME3= <>
##$DPNAME4= <>
##$DPNAME5= <>
##$DPNAME6= <>
##$DPNAME7= <>
##$DPOAL= (0..7)
0.5 0.5 0.5 0.5 0.5 0.5 0.5 0.5 
##$DPOFFS= (0..7)
0 0 0 0 0 0 0 0 
##$DQDMODE= 0
##$DR= 18
##$DS= 0
##$DSLIST= <SSSSSSSSSSSSSSS>
##$DSPFIRM= 0
$$ [...]
##$SUBNAM2= <"">
##$SUBNAM3= <"">
##$SUBNAM4= <"">
##$SUBNAM5= <"">
##$SUBNAM6= <"">
##$SUBNAM7= <"">
##$SUBNAM8= <"">
##$SUBNAM9= <"">
##$SW= 18.05172834244
##$SWIBOX= (0..15)
0 0 2 0 0 0 0 0 0 0 0 0 0 0 0 0 
##$SW_h= 3612.71676300578
##$TD= 16384
##$TD0= 1
##$TE= 0
##$TE2= 300
##$TE3= 300
##$TEG= 300
##$TL= (0..7)
0 120 120 120 120 120 120 120 
##$TP= (0..7)
150 150 150 150 150 150 150 150 
##$TP07= 0
##$TPNAME0= <>
##$TPNAME1= <>
##$TPNAME2= <>
##$TPNAME3= <>
##$TPNAME4= <>
##$TPNAME5= <>
##$TPNAME6= <>
##$TPNAME7= <>
##$TPOAL= (0..7)
0.5 0.5 0.5 0.5 0.5 0.5 0.5 0.5 
##$TPOFFS= (0..7)
0 0 0 0 0 0 0 0 
##$TUNHIN= 0
##$TUNHOUT= 0
##$TUNXOUT= 0
##$USERA1= <user>
##$USERA2= <user>
##$USERA3= <user>
##$USERA4= <user>
##$USERA5= <user>
##$V9= 5
##$VALIST= <valist>
##$VCLIST= <CCCCCCCCCCCCCCC>
##$VD= 0
##$VDLIST= <DDDDDDDDDDDDDDD>
##$VPLIST= <PPPPPPPPPPPPPPP>
##$VTLIST= <TTTTTTTTTTTTTTT>
##$WBST= 1024
##$WBSW= 4
##$XGAIN= (0..3)
0 0 0 0 
##$XL= 0
##$YL= 0
##$YMAX_a= 252380
##$YMIN_a= -311305
##$ZGOPTNS= <>
##$ZL1= 120
##$ZL2= 120
##$ZL3= 120
##$ZL4= 120
##$ABSF1= 10
##$ABSF2= 0
##$ABSG= 5
##$ABSL= 3
##$ALPHA= 0
##$AQORDER= 0
##$ASSFAC= 0
##$ASSFACI= 0
##$ASSFACX= 0
##$ASSWID= 0
##$AUNMP= <proc_1d>
##$AZFE= 0.1
##$AZFW= 0.1
##$BCFW= 1
##$BC_mod= 2
##$BYTORDP= 1
##$COROFFS= 0
##$CY= 11.3945322036743
##$DATMOD= 1
##$DC= 2
##$DFILT= <>
##$DTYPP= 0
##$F1P= 15.7292609196834
##$F2P= 12.9074282941183
##$FCOR= 0.5
##$FTSIZE= 0
##$FT_mod= 4
##$GAMMA= 1
##$GB= 0.15
##$INTBC= 1
##$INTSCL= 1
##$ISEN= 128
##$LB= 0.24
##$LEV0= 0
##$LPBIN= 0
##$MAXI= 10000
##$MC2= 0
##$MEAN= 0
##$ME_mod= 0
##$MI= 1.114404
##$NCOEF= 0
##$NC_proc= 0
##$NLEV= 6
##$NOISF1= 3.799351
##$NOISF2= 2.8
##$NSP= 1
##$NTH_PI= 0
##$NZP= 0
##$OFFSET= 15.70392
##$PC= 1
##$PHC0= -20261.63
##$PHC1= 3.05272
##$PH_mod= 1
##$PKNL= yes
##$PPARMOD= 0
##$PSCAL= 0
##$PSIGN= 0
##$REVERSE= no
##$SF= 200.130013532006
##$SI= 16384
##$SIGF1= 3
##$SIGF2= 2
##$SINO= 400
##$SIOLD= 16384
##$SREGLST= <1H.CDCl3>
##$SSB= 0
##$STSI= 0
##$STSR= 0
##$SW_p= 3612.71676300578
##$SYMM= 0
##$S_DEV= 0
##$TDeff= 0
##$TDoff= 0
##$TI= <>
##$TILT= no
##$TM1= 0
##$TM2= 0
##$TOPLEV= 0
##$USERP1= <user>
##$USERP2= <user>
##$USERP3= <user>
##$USERP4= <user>
##$USERP5= <user>
##$WDW= 1
##$XDIM= 8192
##$YMAX_p= 0
##$YMIN_p= 0
$$ End of Bruker specific parameters
$$ ---------------------------------
##NTUPLES= NMR FID
##VAR_NAME=  TIME,          FID/REAL,        FID/IMAG
##SYMBOL=    X,             R,               I
##VAR_TYPE=  INDEPENDENT,   DEPENDENT,       DEPENDENT
##VAR_FORM=  AFFN,          ASDF,            ASDF
##VAR_DIM=   8192,          8192,            8192
##UNITS=     SECONDS,       ARBITRARY UNITS, ARBITRARY UNITS
##FACTOR=    0.0002768,     1,               1
##FIRST=     0,             0,               0
##LAST=      2.2672688,     0,               0
##MIN=       0,             -311305,         0
##MAX=       2.2672688,     252380,          0
$$ Real data points
##PAGE= N=1
##DATA TABLE= (X++(R..R)), XYDATA
0@%%%%%%%%%%%%%%%%%%Qj6J6j6J6j6J6k4L2l2L7m5N0n7O4p2Q2r1J01j14J30j44
40g5J58j76J95k15K37k61K90l21L53l86M25m70N17n73O35p02P81q74R82j110J269
61F79j468J723k067K555l296M548p049J3880o5725k55085J5333J29877P3027R0303
75b765J48636R5058k499p6930j39988j79338j21884K5243J46092J35525Q1416
86A08566Q4558N9256p4612j74491j40548o7954j5775O3104J34530J29421P9542
97A85597K9049m4696j20511j35453r6640m4699L8870J33095J55723Q8654R580
108A98569l9919q4853j25229j23785n4715M9647J15502J27930J14130M8557o4849
119A60985j20050r1156p5762p1518L716J07274J40210J06559M3062l5675j00874
$$ y = [0, 0, 0, 0, 0, 0, 0, 0, 0, 0, 0, 0, 0, 0, 0, 0, 0, 0, 0, 8, -8, 8, -8, 8, -8, 8, -16, 16, -16, 21, -24, 26, -31, 33, -39, 43, -48, 53, -61, 69, -75, 83, -93, 102, -113, 124, -137, 153, -168, 185, -201, 224, -246, 271, -302, 333, -369, 412, -462, 520, -590, 679, -789, 934, -1133, 1422, -1874, 2674, -4375, 9505, -56220, -311305, -295972, -166095, -93068, -2765, 145871, 240929, 238430, 161500, 21512, -157826, -279710, -254467, -108375, 27150, 108566, 193124, 252380, 177768, 3277, -137271, -205225, -221000, -157896, -23366, 106055, 185597, 214646, 169950, 49439, -86014, -182654, -227353, -188483, -55388, 100335, 188989, 198569, 158650, 73797, -51432, -175217, -229932, -180285, -64783, 63147, 177277, 225834, 160985, 40935, -50221, -125983, -197501, -193785, -86511, 53699, 160258, 203320, 167645, 66771]
130F6771j18233q5639k8223J4848M9300J04985J32403O2795m2766q6602q6590
141a6951q2602n5833n600M6127R9123J28575P8839k4054r0184q9993o8514n6051
153a37118k6848L9515J03162J13555P3277R362o3396j09626r4803m7375j2123
164a52418K9665R3457J18060O6577l537m3928p7364j03485p6938n517N5124P9161
176b1143P9774O4920K5589l2973q1975r1898o8633k3581L8830Q3954P9033N1603
188A03500K9983j0845p0035r4621p0428k8089K2575O8811Q4059O6151L2732j1664
200A22129n8907q6222q0727l9733K1237O5314Q0557P3384L8417j7668n7944p1931
212a2094p4287n2937Q726O8890Q5845O6850L2836j0574m9996o9783o9446m6911
$$ y = [66771, -51462, -137101, -165324, -150476, -101176, 3809, 136212, 199007, 156241, 69639, -16951, -99553, -155386, -160986, -114859, -15736, 112839, 191678, 167624, 77440, -12553, -81067, -137118, -163966, -124451, -21289, 92266, 165543, 174905, 111509, 1883, -92920, -140295, -152418, -122753, -29296, 88764, 155341, 151804, 107876, 30512, -72973, -149911, -155428, -100304, -21143, 58631, 123551, 149140, 116167, 34192, -57706, -126339, -149920, -111090, -27136, 51897, 103500, 133483, 122638, 52603, -42018, -112446, -140535, -117960, -49149, 34910, 101061, 133793, 122129, 63222, -23000, -103727, -143460, -122223, -56909, 23648, 97032, 135449, 117781, 59837, -12094, -86381, -139318, -130592, -61702, 24143, 90993, 123829, 113255, 63259, -6524, -75970, -122881]
224a22881r39N2287Q1069P2275L3868q379l9235o0773o9542m9896m163L9959O5474
237a0876P2694M9872J533l8901n8811o6416n3224j1815L3427O1054O9820N6196
249A04553J6518l4715o8258p0028m6352j2507K2772N7729P5283N6677J4247k7716
261H8203o1342p2846n0576r685K4048M8699O5447N9464K1817k6170n7960o5007
273c5908m8989j7243J9832M8256N7605M9798K7028p817m7055o7617n6905k2390
285a01405J5365M4126N7032N1008K8820k075l6898o3968o2723l1177J0368M1444
297e0083N7410N3839L2409O66l3814o1205o4003l6050P686M1744N5611N1318L3621
310H9149K692l2905n5914n6944l7031k472L5565N8101N1326K8604L970k2016m8415
$$ y = [-122881, -123820, -71533, 9536, 81811, 115679, 107300, 68065, 7292, -62250, -112146, -116309, -76350, -10876, 61818, 111690, 113223, 74322, 15511, -50905, -104129, -115944, -82517, -21463, 48357, 104553, 121071, 86356, 18098, -51930, -98282, -110789, -88017, -30288, 44995, 101672, 115919, 88203, 26861, -45985, -96561, -106246, -82198, -33499, 31948, 91412, 113229, 87059, 29099, -35908, -84897, -102140, -82308, -34052, 23553, 73351, 100379, 92562, 45507, -22110, -79015, -101405, -86040, -41914, 15118, 66126, 94946, 92871, 55973, -7995, -70718, -101895, -91527, -50083, 7327, 61166, 93575, 94241, 60427, -778, -64781, -100831, -93145, -51401, 4210, 55528, 89149, 91841, 58936, 3022, -53922, -90953, -93425, -57860, 241, 51567, 80171, 84141, 62125, 13710]
323A3710n7040l8362p169K4396N0631N7032L5824K730k2323l8388m8857m4301
335g2117j8172J9569M7619N5130M2355J3342k0352m3989m9443m0949k0013J1968
347g5052M5063N7968M3885J4756j7037m1870n0730m1023j8253R633L7826N4036
359A9202M7007J9616j5207m2108m9029l7303j6509O727L0286M6286M6057K4818
371G9843p087l7023m8540l9717j8909M196K6384M1805M4146K9772J264l0477m9943
384d286m5038k3010L033K5624M0068M2008L1682P060k5213m7691m8066k9571k01
397g3601K7982M2091M0076K8909Q908k1610m4419m6092l0713m682K4636M1582
409f933M0307K7273P827j6656l6465m2854l4283j0324J9568L8656M0452L0074
$$ y = [13710, -43330, -81692, -88861, -64465, -13834, 43198, 79022, 81752, 59429, 21041, -27816, -72117, -90289, -70720, -23101, 32029, 74384, 87726, 67374, 23385, -26058, -67007, -87020, -75052, -29989, 27979, 71864, 86620, 69583, 27713, -23017, -64040, -82293, -72660, -34834, 19202, 66209, 85825, 70618, 28510, -20519, -57822, -74331, -67604, -37318, 8968, 55025, 79843, 72756, 35733, -12807, -52524, -71433, -67237, -40853, 952, 45098, 74870, 76134, 45657, -4286, -49324, -72334, -69301, -43677, -3609, 38399, 70081, 77141, 51928, 4237, -43829, -73400, -73601, -45619, -3528, 36548, 65457, 74365, 52755, 8336, -37756, -68469, -73151, -48515, -6933, 33374, 60647, 68474, 51818, 15353, -27501, -61784, -72108, -52540, -13884, 26568, 56642]
421E6642Q886j4738l0274l6744l5809j8587J1455L5638M3389L5268J1904j4046
433E2984k9080l4951l5379k1782N572L1470M5004M0305J5831j4122l0828l5340
445a0316l3370k0424K597K6314M3659M1592J7114j0366k7685l6213l4659j8733
457f0490L220K2284L7413L8517K0837m355k4611l5162l3633j9231j551J7679L5983
470c100L7333K1842J727j7337l5115l7656k2229k442J5978L1318L5694K6531R405
483F1949j5544l6765l8525k3755n927J4704L2106L4654K5241J1655j0722l4221
495A4850l9713k7475o233J6759L0282K9046K4700J5446p593l1911l7466k7729
507d7037r901J3402K8590K8704K3419J4891l622k3636l3003l3757j6386J1962
$$ y = [56642, 65528, 50790, 20516, -16228, -52037, -70624, -59169, -23531, 19858, 55126, 67030, 52984, 23904, -11047, -46426, -68208, -62636, -31166, 13838, 54143, 69974, 55852, 25024, -10316, -43686, -64110, -61513, -35199, 8460, 50052, 67166, 56800, 29115, -7098, -41757, -60490, -57270, -34986, 2427, 40944, 61781, 57426, 32815, -2347, -35980, -55211, -56762, -39083, -3100, 34233, 56075, 57802, 40465, 5350, -32306, -54535, -56977, -40999, -9681, 26013, 52544, 61949, 46405, 9640, -28885, -52640, -58567, -43863, -11757, 22897, 48138, 59793, 49071, 14850, -24863, -52338, -58571, -41812, -11530, 17516, 42216, 57662, 50069, 18158, -19308, -47037, -56938, -43536, -14946, 13758, 37177, 52068, 48446, 24810, -8193, -41950, -58336, -46374]
519d6374K8126K6476K3983J8211o24k0813l1489l3337k0201N635K3972L0434L0500
532C4499J7158m114j8284k7430l3699k2281L387K1479K8806L1797K0460j846j9291
545C0641k9587l1327j7281J070J3389K6407L4273K1352j527j6251k5579k9720
557b4140j9178k724J1018K5214L2571K0959K422j1083k4638l0024j9719n977N565
570c9734K3422L4952K4348M266j0726k3276k7239k0556j2424K631K5542L4976
582A6182K2660Q153o452k4573k9892j9672r822J384K0752L1882K4963J1479o615
595D0429k3736k7278j9095j2442J089J9940K6864K2894J5232j487k1264k6400
607e254k1483j4040O73J7030K2991K2863J8563J671j7839k4601k3216j7532k299
$$ y = [-46374, -18248, 8228, 32211, 50422, 49798, 28985, -2504, -35841, -56042, -50407, -26435, 3999, 34499, 51657, 47543, 29259, 1829, -31870, -54151, -50764, -29285, -479, 31318, 51778, 49932, 30641, 1054, -30273, -47554, -46484, -33095, -6688, 27585, 48937, 47410, 31159, 5580, -24140, -43318, -46042, -35024, -9810, 22761, 43720, 46142, 35059, 10421, -19603, -39322, -45299, -39734, -16312, 18640, 42988, 47254, 36528, 13252, -13987, -34543, -46967, -44336, -18794, 16182, 38842, 46995, 40543, 15970, -13922, -33594, -43416, -42032, -21280, 10602, 35565, 47044, 40429, 16693, -10585, -29680, -42122, -41033, -21093, 5771, 28665, 43897, 42410, 21146, -5254, -26737, -40777, -40104, -23074, -83, 22780, 41343, 43014, 25175, 574, -22642, -40174, -42473]
620d2473J5697K4277K3798J8152K170j3626k2095k5436k1511k054J5475K2255
632e371K4267K0149K356j3593k0230k3943k0929m696J2137K2008K4742J8505L818
645C9220r486j9050k5004k0331l529R473J6827K3555J9544O357n712j6526k6448
658a1110k1098n208P075J5618K2552K0102Q833k939j5265k4911k2201j0330M543
671c4339J7311K3337J9225J0243p16j5357k4491j9640j1265n55J5488K5945K0355
684B5541R142j158j3857k1797j9967j1421p93J2602K2364K0991J2077nj3155j9557
698A007j9189j3499k696J2107J9536J8951J4040M134j0689j9308j9067j4803m643
711c4119R956J8088J9094J5959N915r038j8290k0590j6562m392R371J6249J9412
$$ y = [-42473, -26776, -2499, 21299, 39451, 41621, 27995, 5900, -19536, -41047, -43101, -27626, -5371, 18896, 39045, 41401, 27808, 7578, -16365, -37294, -41990, -29853, -7845, 16897, 35402, 39220, 29734, 10684, -14320, -34651, -38180, -28707, -11880, 11675, 31219, 37576, 31864, 15338, -11110, -32208, -37416, -30341, -14723, 7829, 27931, 36764, 33825, 18560, -6351, -28552, -38882, -34339, -17028, 6309, 25534, 35777, 35061, 19704, -4787, -24427, -35692, -36247, -20759, 5186, 25541, 34683, 33525, 19668, -2129, -22096, -33517, -34310, -21708, 656, 21647, 33724, 33719, 20564, 1007, -18182, -31681, -34377, -22270, -2734, 16217, 30257, 34391, 23702, 4394, -14673, -29476, -34119, -24163, -6075, 13019, 28978, 34893, 25855, 7565, -13025, -29587, -33979, -24608, -8359, 11053]
724A1053J6914O514p510j7212k0327j7553n891Q327J6103J9064J6290O543n876
737B6439j5272j9039j6654o930M737J4441J9090J6755O796m274j2479j8109j6885
750b1384q389K596J2150J7795J8130R144k704j1286j7761j7835j0084R88J1544
763a7096J7440J7822J0837M0j0496j7911j8107j1226l78J0252J7634J7839J0647
776B7297J294r351j7444j7592j0974q08Q117J5807J7832J2204J712q478j5768
789C848j6815j1507k729P474J3922J6285J2999M263o513j4638j6196j2646n041
802b7294N242J3312J7225J3207M992m331j3090j6735j3570o163M183J2796J6907
815F681J4092N719l493j2422j6278j4246o700L443J2066J6300J3992O920k685
$$ y = [11053, 27967, 34481, 26971, 9759, -10568, -28121, -34012, -25685, -9582, 9482, 25772, 32315, 26439, 11167, -7872, -24526, -31456, -26719, -12278, 6812, 23567, 30363, 26089, 13610, -4499, -21384, -29773, -27177, -15027, 2768, 20898, 30042, 27338, 16052, -1709, -19544, -29628, -28640, -17096, 344, 18166, 29003, 29043, 18547, 636, -17471, -28697, -29075, -18823, -1189, 16650, 27297, 28591, 19240, 1796, -15796, -26770, -27578, -19461, -3654, 14178, 26382, 28094, 19616, 3848, -12967, -24474, -27203, -19729, -5807, 10478, 23477, 27740, 21227, 6589, -9607, -22253, -27294, -22052, -8740, 8485, 21692, 26684, 22353, 9263, -7472, -21042, -27205, -23022, -10226, 6681, 20773, 26492, 22999, 10577, -5701, -19947, -26647, -23204, -11138, 5162, 19154, 26074, 23389]
828B3389j2016j5075j4313p191J893J1149J4868J3753P656j205r363j5274j3883
841a5612p708O42Q622J4307J4377Q689l73q397j3805j3878r357j145P588J4052
855a998J4727R770J416p734j3527j4294r721k594O688J3571J5146J0303J703o615
869A6841j2980j3883j0051l098N738J2647J4408J0362K813n616j1721j3728j0022
882a8290m054M231J1158J4123J1058M120m126j1085j2931j0956m502K407R894
895h953J3265J1681N725k298j0087j3234j1517n730J758R660J2616J1446P108
908B1440j420r298j3071j1969p087J727Q952J2449J1695P506j151q522j2138j1895
922a2782p888J112Q629J1197J0931Q077L55p285j1564j1847p992L57O660J0220
$$ y = [23389, 11373, -3702, -18015, -25206, -23313, -12164, 2704, 16457, 24113, 22908, 13545, -1729, -15612, -23320, -22678, -14056, 251, 14628, 23317, 22944, 14547, 742, -13136, -22493, -23638, -16050, -1998, 12729, 22499, 23915, 16181, 2654, -11640, -21361, -23955, -17267, -3696, 11450, 21753, 23456, 16841, 3861, -10022, -20073, -23171, -17433, -4786, 9622, 19984, 22797, 17181, 5460, -8268, -18290, -22344, -18113, -6955, 7168, 18226, 22346, 18220, 7135, -5796, -16752, -21254, -18847, -8953, 4312, 15993, 21718, 19420, 9333, -3901, -15418, -21148, -19390, -9730, 2886, 14332, 21440, 20020, 10722, -2349, -14318, -21405, -19678, -10726, 1723, 13418, 20924, 19773, 11251, -887, -12782, -20670, -19558, -10929, 268, 11199, 19276, 19631, 12346, 782, -11065, -19057, -18700, -12040, -1820]
936a820J1391Q176J227n399j0138j2531r260j304O533J0218J0917Q558K492l969
950A5091r642j3368r749j866M752R239J2407R685K386l998q582j2523r998k842
964a9008L634R629J2086Q601K911k353q240j2404r591l311K070R037J1517Q962
978A3540L900j299q422j1455q136m974j25P625J2296R215M816j82p189j1274r307
993a0971n298k90O352J0504R696P209P83p947j0617r093o555j243O717J0783R323
1008I353P073Q90o764r474r049p909j727O537R420R538P908Q81o695q154p866
1023f038p672k631M121Q035J0406R353J297o047p585q625q268j810L913O252R002
1038C703R881L645m327p841j0160q276j730L149N215R789R692K804k255n595j0855
$$ y = [-1820, 9571, 17747, 18974, 13575, 3437, -9094, -18354, -19658, -13125, -2907, 8010, 16568, 19060, 15091, 5449, -7919, -17668, -19534, -14782, -5543, 6864, 16549, 18935, 14937, 6355, -6168, -16166, -19008, -15374, -5745, 6341, 14942, 17853, 15500, 7260, -5144, -14735, -18046, -15976, -6939, 4578, 13540, 17440, 16141, 7719, -3736, -11872, -16846, -16971, -9346, 2950, 12165, 16981, 16799, 9610, -1664, -10971, -16269, -16559, -10207, 297, 9993, 17202, 17985, 10038, -579, -9672, -16227, -17470, -10753, 30, 9353, 16426, 17316, 10552, 1078, -7971, -15880, -17607, -11070, -1650, 7888, 15796, 16677, 9982, 1828, -6038, -13710, -16341, -12220, -4185, 6221, 15574, 16871, 10824, 3239, -5386, -13654, -15464, -11551, -5299, 3703, 13584, 17229, 12902, 5061, -5099, -13375, -15105, -11956, -6741, 3048, 12740, 15544, 13289, 7694, -3161]
1053c161j0230k362L186N968R333Q351K950l55n426j0234r333l610J263N805J0328
1068B473Q205K474m62l910r089r211m120q44N118J0367Q166L639N84l799r773
1083a82p382m581k440L780R984Q229N242J734m111r477p593m781l043M225R381
1098a015P078N505L536m063r297p698n860k701M331Q276O804N935L782l856p549
1113C208p346o820l718M106P550O843O757L001l245o259o208p532m255K743O159
1128e016P168Q148L984l724o048o243o852m619J892M758O846R050M579k200n304
1143F419p442q412k858J617L827O400Q619M463r75m068p488q700l765J259M165
1158f939O230Q163L530N1k525p296q306m445L34K815P614P525L455J013k464o109
$$ y = [-3161, -13391, -15753, -12567, -6599, 2734, 11085, 14035, 13680, 8254, -1980, -11313, -14923, -13660, -7855, 2473, 10678, 13152, 12690, 8780, -309, -9520, -13640, -14484, -9366, 1001, 9167, 12806, 13390, 9591, -182, -7564, -12145, -14585, -10805, -821, 7408, 12650, 14384, 10273, 796, -6797, -11578, -14621, -10396, -1015, 6063, 11568, 15104, 11041, 1744, -5954, -11814, -14515, -10184, -1908, 4896, 10831, 14613, 10757, 3208, -4138, -10958, -14676, -10570, -3020, 3823, 10580, 13581, 10336, 4077, -2131, -9663, -13918, -11175, -5016, 2152, 10300, 14284, 10560, 4512, -1731, -8583, -13202, -11310, -6552, 294, 9344, 13923, 11723, 6419, -1023, -9435, -12293, -10676, -6849, -449, 8170, 12633, 11658, 7590, 102, -8598, -12363, -11104, -6939, -709, 7454, 10984, 11035, 8510, 1214, -7092, -11537, -11203, -8388, -774, 6751, 10206, 11219, 8755, 2646]
1174B646p895m904j714K263P242P902M442J097j643o667p170m814k588J726O682
1189c395P809M915K587k041o938p116m148l387J921O097O962N216L286j884o290
1204C594o514m962l405J253N660O056N646L915j363n168o021o076l345P57N108
1219d865N445O120M096q27m831n167o169m609N67M500N870O143M648p96l890n811
1235D24o252m237K93K771N207P273M983j45l309n628o706m439J54L102M597O254
1251D342M845O68k674m978o884m117p27K389M821N911M712J231j558m908o597
1266c524m569j580J535M811O345M755J532j125m253o460m827k152J024M581O100
1281B193M934K288q49m376o127m832k554O92M639N706M845K135l19l679n912n015
$$ y = [2646, -5249, -10153, -11867, -9604, -2362, 5540, 9982, 11079, 9436, 2769, -4401, -9215, -11803, -10077, -3395, 4414, 9329, 11916, 9875, 2937, -4179, -8327, -11714, -9793, -3696, 3266, 8482, 11768, 9884, 3594, -2920, -7882, -11287, -10034, -4374, 1682, 7328, 11243, 9880, 4712, -1309, -7385, -10730, -9973, -4865, 580, 6700, 10796, 9969, 5138, -29, -6198, -10807, -10240, -5740, 130, 6273, 10921, 10125, 6235, 424, -5828, -10065, -9772, -7001, -1794, 5479, 10462, 10317, 7008, 1380, -5326, -9765, -9611, -6509, -1912, 4342, 9187, 9855, 7181, 2203, -4681, -8798, -9525, -7136, -2315, 3596, 8308, 9539, 7981, 3073, -3524, -8093, -9673, -8138, -3327, 3018, 7773, 9305, 8180, 3927, -2533, -7360, -9512, -8488, -3907, 2193, 7127, 9415, 8566, 4190, -1937, -6769, -9323, -8631, -3992, 1714, 6559, 8694, 8375, 4696, -1216, -6231]
1297f231k558K68L993N651M746K969m99l478n196m780l385j36L342N153M848L549
1313H256K04k926n145n087l495m34L054M963N294L104R35k803m698n288l835r14
1329h815K458M772N577M041O26k364m505n168l917p52J534M140N568L916J501
1344H612k022m576n271l524j168J587M012M782M361J587j852l647n360l869j747
1359h095J239L856M436M229K272r29l110n063m499k398J100L185M538M482K506
1374G749o35l305m573m564k248K07L672M125M218K827K25l255m806m665k427l9
1390g494K986M626M270K308O12k587l782m658l376l80K918M367L971K814J71j715
1406E051l922m113l313j399K341M014M693K952R01j941l695m099l647j418J941
$$ y = [-6231, -8789, -8521, -4528, 1123, 5869, 8838, 8339, 4861, -335, -5115, -8500, -8636, -5294, -141, 4707, 8256, 8460, 5534, 389, -4698, -8193, -8627, -5573, -610, 4684, 7788, 8723, 5920, 1222, -4066, -7901, -8815, -6357, -1585, 3992, 8033, 8659, 6295, 1790, -3378, -7295, -8047, -6513, -2373, 3195, 7111, 8612, 6590, 2014, -3257, -6781, -7949, -6362, -2350, 2432, 6793, 8380, 6528, 2881, -2479, -6348, -8095, -6856, -3000, 1436, 5665, 7937, 7008, 3898, -1165, -5664, -8062, -6962, -3777, 761, 5243, 7749, 7114, 3809, -764, -5328, -7576, -7369, -3697, 428, 4646, 7473, 7698, 4443, -363, -5028, -7455, -7494, -4508, 118, 4388, 6696, 7308, 4721, 939, -3719, -7095, -7475, -4557, -190, 3781, 6595, 6766, 5051, 1129, -2984, -6297, -7696, -5355, -1341, 3352, 6304, 7205, 5264, 1569, -2530, -6177, -7595, -5654]
1421e654L741M370L538J223j454l752m064l949j303J762L064M174L651J552j281
1436E618l030m113l797j409Q94K890M105M089J579j165k548m273l803j530P58
1451e735K184L905M023J968l87k403l842m195k113O59J964M350L980J667n4j819
1467D152m382l596j978l94J823M404L620K447J97j978m179l838j918m46J513L946
1483f07L810K182Q93j475m200l843k085j032J797L782L036K505J371j051l540
1498A543l662k828j420J502L629L085K645J468j150l011l323k856k096J274L294
1513a906L341L149J986j612l179k568l066k121Q12K797K867L755J965j239k616
1528B365k956l359j934J189K042K344L849K309r22k008k635m245j772J090J655
$$ y = [-5654, -1913, 2457, 5995, 7218, 5764, 2012, -2052, -6001, -7304, -5542, -2478, 1696, 5347, 6899, 5618, 2588, -1525, -5322, -6731, -5837, -2947, 1158, 5247, 6826, 5661, 3113, -1160, -4963, -6493, -5735, -3551, 354, 4377, 6345, 5958, 3555, -287, -4482, -6595, -5936, -3972, 378, 4358, 6025, 5971, 4152, -230, -3826, -5804, -6198, -4375, 29, 3649, 6096, 6293, 4315, 136, -3702, -5620, -6066, -4553, -607, 3203, 5385, 6278, 4803, 603, -3240, -5325, -6357, -4560, -778, 2258, 4763, 6134, 5083, 1543, -2119, -4947, -6367, -4865, -1236, 1849, 4494, 5962, 4812, 1801, -1522, -4378, -6474, -5200, -1906, 1435, 4584, 6570, 4958, 1779, -789, -3855, -5976, -5164, -2367, 500, 4255, 6220, 4981, 2365, -591, -3950, -5884, -4695, -2653, -309, 3540, 5849, 4927, 2919, 284, -3961, -5733, -4643, -2988]
1543b988K498L879K174o59j211k790m196k421O16J484K588M220J669k83m50k742
1559A388m158k153q9P03L297M533J139j45n50k837l709j565q19M12L134M360J420
1576D361N94o98l151l396j331p17n13L173L197K044J418J32l405l635j621j286
1592d834M31K749K793J531K122L34k935l080k674j596M04L308K384J612K000L4
1608D583k433k389k200k682LK784K757K281K456q81k393j738k315k560j02J996
1624b833K428K713K813l83k520j888k752j949L78J612J211K983K944l59j428k212
1640G58k845k267J85J410J456K804K830r8r60j491l702k456K07J144J301L358
1656A634K222p2k85j627l529k081k11J40J933L542K152j25n1j915k903j923q72
$$ y = [-2988, -490, 3389, 5563, 4904, 3693, 903, -3293, -5714, -5098, -3614, -1026, 3194, 4863, 4580, 4130, 1388, -2770, -4923, -5012, -4309, -1012, 3521, 4660, 4515, 3965, 1128, -2581, -4146, -4965, -4553, -1419, 2941, 4361, 4955, 4257, 1106, -2290, -3621, -4338, -4851, -1678, 1519, 3563, 4981, 5113, 1708, -1927, -3548, -4834, -4403, -1654, 1139, 2670, 4792, 5126, 2191, -889, -3563, -5159, -4755, -1447, 937, 2549, 4549, 4583, 2150, -239, -2439, -5121, -5118, -2334, 423, 2704, 5160, 4279, 1886, 148, -2167, -4727, -4829, -2833, -405, 2308, 5121, 4738, 2218, 330, -2422, -4371, -3993, -2381, -1170, 1813, 4757, 4398, 2970, 758, -2087, -4354, -4169, -2759, -1303, 1501, 4331, 4233, 3273, 1782, -1920, -4376, -4169, -3025, -1724, 1634, 3856, 3784, 3499, 1872, -1657, -3738, -3949, -3809, -1876, 1666, 3818, 3693, 3642, 1727, -1176, -3099, -3971]
1673c971m3J839L281K028O40J2j846l014j566q16m88J245L005J969J468L88k099
1690B032k767j908j023j10J778K144J994J551P12k039k566j945j705k01K096K008
1706E1J613J670N48j035k500j935k153p07K087K059J929J602O19j385j462k230
1722a229j974r90J165K298J979K372L29j574j459j581k633n20Q21J642K309K375
1738C330L59j037j251k044k613k52N05J275K385K546O43r69j045k288k139r08
1754c503N22J290K326K338Q84r63j198k289j939n28k0R82K393K190Q42L0j306
1771B051k409j717j047k41R68K542J976R47L82j248k511j540r60j54P60J652J933
1788A384J491P69j340k246j983r29j35P27J771J611J556N76l48k131k255j720
$$ y = [-3971, -4014, -2175, 1106, 3134, 3774, 3786, 1940, -1074, -2640, -3456, -3944, -2699, 306, 2275, 3743, 4131, 2032, -735, -2643, -3666, -3776, -1998, 146, 2140, 3691, 4403, 2364, -202, -2147, -3852, -4053, -1957, 51, 1664, 3334, 3882, 2847, 347, -1588, -3741, -4448, -2361, -302, 1627, 3229, 3848, 2463, 1001, -1229, -3203, -4193, -3028, -730, 1249, 3621, 3950, 2376, 917, -664, -3297, -3817, -2996, -1354, 955, 3330, 3689, 2652, 1401, -643, -3256, -3508, -3003, -1728, 657, 3203, 3846, 2877, 1832, -456, -2595, -3503, -2981, -1691, 635, 2973, 3857, 2894, 1696, -593, -2532, -3060, -3080, -2098, 295, 2485, 3327, 3357, 2051, -358, -2075, -3122, -3363, -2395, 147, 2123, 3070, 3452, 2204, -307, -1847, -2807, -2961, -2201, -549, 1384, 2875, 3644, 2304, 58, -1925, -2854, -2989, -2262, -491, 1120, 2676, 3252, 2904, 773, -1482, -3202]
1804c202J50Q50J706J293J243R87K08j944k478j802l95J189J397K133J059L1O2
1821B487j180j645k218q84M35J885J838J461P16n19q83j427k197j395M96J876
1837a154J992J311M97q1j004j467j617j272l08J379K257J597N27m15p75j300j572
1854a405j303l39Q46K140K207R93n15j311j212j159j278l81M32J730J864J690
1870B999O2j181j818j459o27k35J16J171J590K170K61j110j725j674m76l77M30
1887a883J072J476J687O22n76j979j726q68n9L80Q39J203J583J179l99j491k308
1904a248j050r9Q41R45Q72J257J157j02j109k079j640m52O97J345J010Q76P81
1921B002M94p76j440k140j151M84J700J402P88O71o8k22j149k052j295R1J225
$$ y = [-3202, -3052, -2202, -496, 797, 2040, 3027, 3235, 1291, -1187, -2989, -3384, -2195, -798, 1335, 2394, 2425, 2487, 1307, -338, -2556, -3440, -3005, -1120, 718, 2179, 2895, 2376, 1493, 66, -2131, -3526, -3030, -1154, 838, 2149, 2646, 2565, 1561, 94, -1523, -2795, -3103, -1724, 533, 2130, 2657, 2242, 1467, 167, -1405, -2708, -3047, -2201, -61, 2146, 3139, 2624, 1313, 101, -1058, -2336, -2717, -2285, -555, 1309, 2999, 3061, 1880, 62, -1397, -2024, -2259, -2143, -972, 618, 2788, 3049, 1939, 214, -1460, -1936, -2313, -1883, -811, 665, 2352, 2974, 2398, 419, -1307, -2175, -2234, -1854, -1015, 188, 1771, 2950, 2551, 1060, -1248, -2298, -2397, -1556, -611, 261, 1518, 2675, 2573, 1464, -615, -2255, -2707, -2010, -665, 345, 1221, 2002, 2496, 1720, 280, -1860, -3011, -2527, -827, 575, 1363, 2034, 1966, 1744, 595, -1457, -2752, -2661, -1436]
1938a436J764J043O17j24l33q05j483j354o51Q58J825J789N42o83l02n28j146
1955d07j545n27M50J478K490O83o44r56p51p29q71q50l64J180K633J019J02r16
1973A475j358r88l43n57m87R31J790J580M96m27j713j139l65m71n56Q69J178J640
1991A555P48J09j401k057l58j61m8K46J214R37J711J45j632j611r55k60K73Q66
2009f79M18O72J553N98j246j709j120q66O50J162P7O93J337R74p33j134j968j182
2027b503N15J401L75N88P37O15J27p22j753k050K06J638J192L47N87k95N13o9
2045A449j496k299oQ03J464J387L50q07j16N67p20j790j094J42Q72K832J080j960
2063F58j28Qn06r21o34p98L05K760J506m27n79q95q06j58l15q23k81K172J358
$$ y = [-1436, 328, 1371, 1988, 1864, 1531, 726, -757, -2111, -2762, -1904, -79, 1710, 2252, 1569, 1267, 739, -407, -1952, -2479, -2029, -551, 1939, 2622, 1978, 1022, 271, -458, -1329, -2179, -2543, -1363, 1270, 2289, 2391, 1475, 117, -871, -1214, -1771, -2258, -1327, 463, 2043, 2539, 2112, 399, -740, -1105, -1576, -2132, -1263, -85, 1555, 2303, 2412, 1011, -1046, -1404, -1565, -1613, -1367, -153, 784, 2495, 2640, 1008, -603, -1558, -1818, -1545, -679, -261, 411, 1964, 2562, 1316, -393, -1513, -2379, -1729, -567, -490, 203, 1540, 2514, 1781, 647, -1321, -2503, -1988, -587, -212, 376, 1113, 1728, 1855, 1133, -620, -2670, -2464, -826, 366, 713, 1300, 1005, 1518, 1449, -47, -2346, -2352, -1549, -85, 1302, 1652, 845, 729, 1296, 576, -1214, -2308, -2166, -1294, 1538, 2618, 658, 530, 538, 32, -889, -1523, -2321, -2016, 744, 2250, 1823, 1244, 349, -457, -615, -930, -1753, -2034, 138, 1496]
2082A496M34J40j256j421j94k24p19J10J241J329Q42N51j300k043N51l05q32K91
2100a309N52J141J484P59j382j867j42j91n92O20K21O97J591J021r79j821p88
2117i85r37O55Q96j83q6J644J196l91r31j508j684N02J668J38l12J075P44L54
2135A855n10j369k368J84J458P47K81L64J07M10P35j060k621o71J130Q69J570
2152A111R2n54Q1R15o85j680j095n4P89J830J308r75j075Q13k10r47j069p04K1
2171b088K229J827m25p89j87p58k3k82j234m32J666J726L51J32j053q95j70po09
2190a021o53J260R18R54L25q30j667lM25q82k65P05Q70J318P38j034j507m42K17
2209e74j23q9J79M40J264J210m25k021p15j15j0P28j3l85P61J604K61j479j140
$$ y = [1496, 1930, 2070, 814, -607, -801, -1025, -1744, -1634, -393, 936, 1778, 2329, 1029, -1014, -463, -768, -1600, -1309, -757, 384, 1868, 2627, 1245, -622, -764, -955, -1547, -927, -706, -9, 1582, 2603, 1624, -197, -985, -1922, -1267, -371, -554, -640, 1004, 2200, 1809, 878, -630, -2314, -1812, -144, -6, -318, 757, 1501, 1855, 1345, -24, -2392, -2208, -750, -3, 278, 642, 749, 1159, 1894, 834, -1787, -2458, -1328, -459, 1111, 1203, 649, 730, 1645, 960, -720, -1815, -1869, -1080, 750, 2058, 1083, 8, 821, 611, -336, -1405, -2109, -2088, 141, 1968, 1543, 754, 567, -191, -214, -496, -1730, -2162, -496, 1230, 1581, 1713, 660, -235, -405, -412, -1021, -1674, -414, 504, 1458, 1783, 953, -714, -717, -292, -1174, -1439, -734, 136, 1454, 2192, 1158, -349, -791, -574, -697, -786, -607, -167, 1097, 2307, 1882, -139, -854, -969, -979, -251, -264, -649, 112, 1716, 1977, 498, -642]
2228f42q71M1J175J86m06M32J479K27j19j643j418n69J763N33l7L04L37N79M01
2247A752q32k139q72P50Q83Q10O37q43O05O71j43j861j285j74J014J534R67q62
2265F12j91N32l9p29j552n27M15J583J176j19r01L67j90j7p33j069l16J130J593
2284A025M17l78n46n12j6m68n13p59N70J688Q45J02p59j051J68N9p27l66r6J209
2304a08J362L78p03j125k17P1M8o76q6N16J258J164k70j333j052j68M95O0k17
2323f03l00R95J051M07n98j617o65K23O53K56k14MJ319O02l25j058j317k49N27
2342i09Q97j41J99Q9Q64N82j276j069q63N48P07O95k96lP50M09k37j462j147P5
2362a588J003Q13L96l45J51M59N1k49j566r16P33J101R80n29L3j99M70l71q13
$$ y = [-642, -1513, -1472, -297, -111, -517, -85, 1394, 1621, 1502, -141, -1559, -2128, -365, 168, 131, 435, 772, 1351, 1752, 920, -1219, -2091, -1341, -458, 352, 989, 146, 751, 1422, 1279, -582, -1867, -2041, -1027, 507, 1474, 612, 421, 953, 914, 185, -1367, -1894, -1479, 104, 1280, 1161, 260, 627, 437, 420, -313, -1382, -1698, -568, 1025, 1442, 1064, 518, 6, -10, -478, -991, -1750, -1180, 508, 1353, 1455, 696, -355, -187, -128, -855, -1221, -1317, -108, 1254, 1632, 929, -196, -413, -342, -294, -970, -1056, -540, 718, 1882, 1612, 279, -773, -941, -446, -386, -603, -903, 92, 1143, 1550, 952, -665, -1330, -1107, -454, -198, -412, -408, 911, 1513, 1188, 130, -1187, -1436, -909, -12, -153, 46, 135, 999, 1581, 305, -764, -1627, -1079, -372, 323, 27, 24, 774, 1183, 946, -516, -1663, -1588, -585, 228, 624, 279, 430, 889, 940, 691, -875, -1791, -1058, 43, 1023, 494, 527, 328, 798, 427, -386]
2381c86j020j64O91J412L60j93n53j1J2m59p17n12P67Q63J089J1o40o76J51l8
2401a3l36r54J51R90J213J91l28j025k4J55j14p16n18O78J305P95K3j206q31J46
2421d18K96m89k34J44O60J112N19n89j249o05J60M14R8l23J13R19Q74j96q33j123
2441g50j31L78N99n36K63L19R03k5k31j260q23M03L70N29j03K59L00M94k16q73
2461a31j105K33M76K64N22k3K89L63M07p26j378k83K01N20P65K16m67Q6N84k63
2481E50n71r91k85Q14J056J10l2l30M0J74o19n25o50M83R03P12l1l86l36J17K66
2502D69r64p90K24R33L93P74j74q06m62K57J49o20k50L51O83P75J48p24o71p2
2522c77j26j57K21j57L86Q16O62n90q36j18l10R0L00k62M3P87N90k06l25q15k99
$$ y = [-386, -1406, -1570, -879, 533, 893, 700, 147, 136, 148, -311, -1028, -1540, -773, 90, 1179, 1190, 550, -126, 25, -13, -349, -1303, -1152, -162, 1051, 1242, 914, -111, -135, 20, -94, -810, -1328, -650, 655, 1450, 1473, 267, -564, -418, -122, -611, -845, -701, -41, 1071, 1590, 1001, -248, -853, -693, -279, -181, -504, -391, 528, 1402, 1206, 373, -750, -881, -503, 96, -440, -177, 142, 1045, 1020, 789, -471, -1294, -891, -521, 8, -95, 164, 464, 958, 742, -131, -1236, -1003, -527, -263, 259, 236, 525, 888, 1295, 569, -809, -1092, -891, -371, 394, 610, 143, 229, 813, 550, -21, -1012, -1297, -483, 573, 683, 651, 321, 361, 535, -84, -609, -1259, -776, 127, 839, 808, 422, 86, 203, 469, -495, -1285, -1061, -128, 265, 1039, 865, 59, -403, -146, 3, -617, -867, -516, 167, 942, 1090, 366, -305, -377, -503, -660, -439, -596, -210, 606, 1268, 678, -158, -276, -586, -496, -196, -458, -415, 372, 962, 756, 431, -384, -683]
2543f83k91Q14j53j45R37M66l6k96o23r63R9N56j75J83P96K44K18k73n06j026
2563h57J23M83RJL50J59M62L75n85j456R9R8N90O50mn19M42P04m22r00k96o39
2585a133L95J006M08r16N85J42j44k69l50r00MJ249M75j36J62j36n55L81kr98
2605g32k14Q15O39j56L61l98l82P5M8m83k95K87L05O14N03l10j035J96J5l32j58
2626f37M89l17Q19M85k84m54k41j01n10M23j44J13M01Q92l58l55J6p49J4R2L55
2647e1k02N21L85j43K0m49l78m3J86l46j14O47K59L66o4o31n59L17L08l45l52
2668f68P56K19N4N31m75r42j55L60K65l9L55l40M53L27m2p21l92j93q5O51O09
2689E28n83J53M80j17o77L9l94j85M80M47J22R5J42n46J95l14m00l63M20Q41j75
$$ y = [-683, -974, -160, -313, -458, 479, 945, 909, 613, -10, -973, -874, -318, -493, -310, 486, 730, 948, 675, 169, -857, -734, -251, -242, -241, 109, 268, 730, 1105, 520, -936, -837, -739, -149, 501, 497, -22, 420, 1124, 702, -198, -494, -1133, -738, 268, 676, -240, 345, 487, 343, 74, -276, -1176, -1172, 77, 552, 416, 578, 442, -113, 268, 266, -732, -946, -131, 508, 352, 713, 315, -67, 8, 56, -427, -722, -435, -130, 484, 987, 677, -358, -162, -147, -479, -637, -148, -465, 354, 839, 555, 101, -140, -241, -751, -328, -472, -359, 42, 934, 576, 221, 237, -512, -498, -406, -51, -253, 268, 653, 510, 530, 81, -297, -340, -154, -500, -614, 33, 292, 658, 594, -37, -596, -279, 29, -316, -668, 88, 307, 361, 892, 417, -525, -680, -320, -55, -94, 261, -79, 374, 701, 659, -62, -454, -647, -732, -81, 528, -55, 98, 578, 461, -216, -177, -571, -756, -276, 171, 293, 388, 530, -16, 179, -135, -535, -898, -478, 363, 188]
2710A88L64k03l23j54M64n85l34L41L1L03O86j84o56Q1J60m81k68L07J18L84M91
2731G30j45k71l06k58j66j19N79l25K66M02j84K72m48q5m68O3K13j42J78P27j46
2752C67J08k29n68j49J13K3K96K04K62J06j47j90p62K02N2j18j78P58j35P15k63
2773D67o9m45k34k16K36K34J96j59J97J65km26l90k4j35L12M31J17j82K07k0j20
2795A40l14p4l78K73M70l8R1K40j72l4l45j31k16J09M12K2L82J37j79l46K1l19
2817b49k62J21M12j38M70l9j28O3j76m52k50j16M78L57rO10m10j57j51j4m71K07
2839c04j45L47L16K04J1n99L34n44j74K49k8O7K75K21K17l53q4l71R6n2O2L27
2861G2Q1K91J14m19j87j44K2k08O2J82M96P6j42J04m78k09j62L67k39J76K25M24
$$ y = [188, 552, 349, 26, -128, 336, -249, -583, -242, -211, 92, 778, 594, -62, 19, 179, -302, -570, -263, -145, 239, 730, 585, 314, 8, -250, -416, -535, 44, -281, -15, 387, 203, 475, 27, -58, -526, -463, -250, -392, -214, 513, 367, 475, 246, -322, -471, -358, -335, -39, 165, 427, 533, 386, 196, -566, -364, -312, -430, -608, 150, 15, 730, 467, 398, -47, -281, -497, -261, -27, 169, 10, 207, 372, 370, -56, -446, -470, -605, -293, 138, 255, 73, 280, 260, 140, -174, -248, -626, -353, 117, 79, 170, 410, 238, 204, -141, -272, -488, -379, 33, 55, 437, 574, 395, 49, 70, -249, -511, -390, 22, -116, 354, 315, 187, 250, 74, -378, -628, -744, -266, 91, 82, 692, 282, 125, -26, -40, -511, -304, -449, -102, 214, 418, 429, -170, 164, -380, -554, -305, -333, -266, 9, 230, 447, 94, 10, -361, -265, -317, -255, 72, 153, 444, 558, 139, -48, -192, -170, -378, -316, -134, 362, 438, 296, 400, -78, -287, -449, -82, -321, -145, 80, 504]
2883E04l76J03l0m00j18J17l12M84K64J01j68K27l66r7q4m82L08P2M47J81k12
2904A63K02j18q7m01l47K71J34M61m0J38j40m09M06l23j80J52o1J50K77J72J69
2925E89m72j08k56k04J06J34L9K61K47j31O3j82j49j01k81J36K41J26N2K8j44
2946fJ9j14l49k2K77J74J37LJ85Q8m24r8r1nj46L33k6K80k7j43P8q8k23l6k4Q9
2972a59L82r3L38k01j48k97l4j55R9R8J92K50l96M12j84l70m7j95K79J06K18Q
2994A03L5J04l40K17k55m71K01M65k97J06M49k18l05K32k50K1J31N3j25K12M20
3015D88k75j97%l39j36K86Q5J07k05M64k64J55k6n57j04K06K87O4Q2L79m56N7
3037A01Q1k83k68j0K06m1K55J30K10j8m21j04P6k30m1J19M07M48n64K97p9k61
$$ y = [504, 128, 231, 201, -199, -317, -200, -512, -28, 236, 337, 169, 396, 30, -67, -151, -633, -325, -253, 194, 375, 163, 365, 247, 160, -241, -588, -317, -183, 278, 238, 376, 236, -173, 233, -90, -270, -118, -179, -29, 248, 420, 589, 117, 9, -247, -451, -345, -211, -172, 89, 336, 205, 268, 86, -63, -164, -445, -309, -68, 58, 110, 138, -6, 13, -101, -450, -472, -195, -21, 116, 119, 304, 392, -32, -130, -221, -226, -372, -39, -65, 215, 188, 45, 123, 35, -188, -224, -248, -159, 223, 130, 468, 267, 119, -178, -212, -367, -268, -170, 22, 272, -124, 288, 104, -266, -313, -508, -229, -123, 95, 103, 138, 242, -98, 119, -136, -607, -406, 59, -238, -132, 317, 99, -206, 26, -224, -203, -72, -19, -144, 68, 488, 213, 16, 16, -323, -459, -173, -88, 19, -186, 278, 14, 169, 143, -414, -518, -312, -25, 39, 121, 500, 44, 101, 182, -101, -369, -379, -173, -214, 41, 171, 381, 363, -58, -162, -86, -316, -357, -238, 169, 617, 53, 350, 271, 10]
3059A0N8k14L80m83N48J4l04K86j00l59K1r4P1l0L69J88o18K70P0k83KJ40k49
3082c07K34J80j21N4O1K53n74Q2q5l17N25J10m2k3J38k10M2k3O3l63K09N8J48
3105I2M56k14j91j99J05m4k87K36j03R5L69J64l94OJ42o58o5P35l14j70N59R7
3127D17k35J4j07l06k56J37K59L3J72j27J36K41j14o62j29J49L20K28L64l51m93
3148c10N45Mn87J92J16l16j1O95k32j2K19m11p7K60k27l50L21M30k54K12M1l04
3170e6k75O16k53p2N11l43j40L92j30l87M3j08j00J58M99j1l9j65Q3r6M5k60j12
3193b00j5J91K44j22K15l86J3j0K68o53J41M94p4J02K12m47O7q7j73o6K27K14
3215A55m99N15K69l61j79K57l05j40K43P6j96L95k05K39k16J99n33r1n1N85k19
$$ y = [10, 68, -146, 234, -249, 299, 313, 9, 295, 195, -164, -143, -237, -166, -196, 173, 361, -257, 13, 83, -200, -198, -58, -307, -73, 107, -14, 40, 101, 354, -220, -138, -223, -540, -15, 95, 53, 30, 168, -42, 0, -23, 40, -323, -114, -56, 92, 548, 334, 143, -56, 49, 5, -282, -46, -149, -54, 315, 479, 85, 91, 233, -425, -490, 245, -69, -239, 320, 417, 182, 196, 89, -217, -473, -336, -77, -44, 128, 1, 137, 378, 264, -398, -527, -378, -58, 170, 534, 183, -310, 235, 239, -348, -156, -40, -356, -367, 328, 96, 84, 303, -108, -185, 75, -152, -502, -181, 249, -5, 207, 248, -56, -331, 285, 32, -40, 471, 128, -12, 380, 250, -137, -94, -202, -302, -144, 355, 344, 305, 140, 223, 127, 172, -88, -200, -215, -24, 220, 98, 313, -73, -60, -70, 198, -455, -314, 180, 106, 208, 420, -27, 40, -47, -220, -286, -59, 155, -344, 171, 440, 79, -100, 157, -148, -288, -45, 31, -165, 230, 25, 264, 48, 247, -286, -377, -428, 157, -62]
3236f2J52J39j67J89n3k34j21M9J84j8j56L06N6j8m8m01k5K54j59O8K49j28K46
3259C02k34j36k48K26j76J16QK36j29jL50j69n06J29JrmM89j06j08K71j73m87
3282c58J62M8k55N29JK9O3k2J5j07K76n52N5k76K86K71j37J12k14J12k71Q3n1
3305b01K59J6K1j68K48k8p7l88J02j62J61M14j99K47o7J2k99j21Q1J95L3R1J02
3328B72k52J23p0j3jk51Q8J60j40J08L8m8L57j82k40p1k07J43L36k68L76k9k72
3351d3j74L06k46L2J59k34M2K21o0r6m2R6k6j41K8K28J70j91p0j01J22J8J2k07
3375a97k6M24n1R1k44K49L0k98j3P0k03O1J84J91r4j45J7j94j0m5K84k9RK19L
3400B83j31q5J69n08LJ23K4J87o9K6Q0Q1j37j64K18l5L2k53J6M17k94M0L8j28
$$ y = [-62, 90, 229, 62, 251, 198, -36, -157, -108, 76, 58, -98, 208, 264, 246, 198, -203, -228, 26, -133, -65, 184, 56, 302, 68, -68, -316, -90, -266, -150, -142, 94, -35, -36, 314, 145, -361, -232, -231, -240, -244, 245, 139, 31, 302, 129, -358, -196, -148, -403, 126, 127, 156, 219, 197, 212, 105, 381, -171, -116, -392, -106, 165, 28, 140, -74, 38, -233, -150, -201, 58, 74, 95, -73, 175, 147, 70, -318, -216, -378, -217, 197, -2, 245, 178, 190, -109, -230, -149, 46, 79, 170, 272, 20, 143, 73, 60, 59, -192, -104, 56, -84, 24, 62, 14, 371, 189, -51, -122, -329, -186, 150, -118, 258, 229, -43, -217, 89, -157, -125, 34, -200, -158, 63, 3, -93, -135, -39, -65, -206, -178, 50, 220, 29, -41, -142, -20, -2, 10, -197, -223, 201, 150, 241, -3, 246, 276, -22, -35, 35, -168, -107, 77, 268, 174, 29, 46, -148, -158, -203, 81, 52, 61, 280, 283, 152, 67, 236, -272, -269, -146, -122, 65, -4, 22, 102, 183, 46, -118, 100, 65, 97, -156, -140, 277, -17, 23, 61, -67]
3424f7m1O6K9p7L39J28j52l12J91k19n3J64j34L85j05r0Q1k1J9l56J26J02k81
3447b78K96P1k11J44o7R0l21L15q8q1j34K70K58j03K39m83N7r8L7l7L5J43l17
3470b63L64L5j05k11J18l17L81N7j04J13k41M79k10J14k99J57J10m15J64K19l4
3491A12J35j49k76K54l54P5J2L20P6k73K16L31o54j73L95J42l16K32m06L57J07
3512A63j71Q7l94J74K14k64K28m9%LK14k07p3l93Q2N08j63J65k76J38k18L08r2
3535a6M5j76K87k17k35O46k34l92M64kk90P3P7j36R1K41j56q2j43P1J85j55J21
3558F7k78Q8K82j83O0p5L5q5L1K1K6j86L93m25L21J2l7j41j07K48l74L92J00l4
3582A51m01L91J3j27q5j09jK55j27M77k55j42Jl81N91l45k54L13j76K47L60l98
$$ y = [-67, -108, -42, -13, -90, 249, 377, 225, -87, 104, -115, -168, -4, -138, 247, 142, 52, 133, 112, 131, -225, -99, 3, -278, 18, 89, -122, 22, -45, 45, -276, 39, -49, -130, -264, 6, 264, 161, 400, -83, -26, -124, -87, -124, -89, 54, -263, 101, 136, 31, -180, -62, -379, 2, 59, -45, 68, -173, 306, 96, 210, -89, 68, 178, -237, -73, 146, 112, 247, 98, -178, 76, -278, -203, -191, 129, 205, -68, 148, 479, -175, -348, 47, 189, -127, 105, -301, 56, 163, -8, 79, -315, -141, 73, -191, 37, -12, -12, -9, 205, -2, -75, -468, -386, 122, -41, 124, -152, -14, -232, 76, -16, 29, -147, 140, -77, -312, 334, 100, -292, 172, 170, -120, -47, 30, -106, -15, 226, 70, -12, -155, -84, 101, -54, 67, -211, -123, 159, -24, 36, -39, -4, -89, -58, -37, -11, -197, 196, -229, 92, 104, 67, -74, -181, 67, -307, 85, 185, 151, -250, 141, 154, 27, -58, -167, -168, 87, -40, 437, 182, 40, 41, -340, 251, -94, -348, -35, -211, 36, 396, -2]
3604bl34K28K47l27K51J38l47J61O1J4j89K32l47j12O28j45k86J39J39j05K05
3625B49n0j6o32L62J80j08J89pl75J69n5J00j94J53j80RM10P4k55j14L83k03m3
3648D6o8k06K01N1r8k90K44k4R9j99J32J71n4J55q0k73Q8o1R2j81K42o6l9J08
3672a0n8o5L08k22k20K91J4j29Q0K09m24k0L03J45j39N5l06L6J16K05J4k36M44
3695C91o54Q9N94l32p7J12j52J3J79N4Pj62j55J16j28J61R4j62l7L26l41J63p8
3718B1k46K64OJ30l41J12J52j22N5q8Nj62M22m85J39K88n7j55J67K8l05K55k91
3741b08J03J01J87j59j62J88J27j24k6j43K74k17K40Nj14j87j70J47J48N5J08
3762A73k6l6k5Q2j15J27j40j54J59l11M23J3m86M35j17q2r1L21l04J43l6j01R2
$$ y = [-2, -336, -108, 139, -188, 63, 201, -146, 15, 76, 90, -99, 133, -214, -326, 302, 157, -129, 10, 149, 44, 249, 199, 183, -449, -87, 93, -15, 174, 167, -208, -39, -94, 6, -188, -35, -215, -206, 204, 278, 23, -91, 292, 89, 46, -22, -228, -27, 24, -74, -364, -120, -144, -45, -244, -112, 59, 5, 160, 80, -193, -105, -166, -74, -255, -13, -79, -118, -10, -68, -133, 175, -47, -267, 24, 38, -91, -11, 198, -226, -246, 57, 202, 63, 118, -188, -152, -36, 169, 183, -53, 391, -263, -174, 420, 88, 11, 123, -29, -16, 163, 217, 224, 62, -93, 23, -105, 56, 150, -12, -49, 277, -64, 99, 21, -225, 39, 45, 175, -166, -54, 98, -24, 31, -57, -52, -214, 208, -277, -138, 150, 93, -62, 105, 133, -172, 83, -208, -105, -4, 183, 24, -138, 50, 177, 53, 27, -116, 158, -59, 181, 186, 72, -115, -285, -138, 10, 65, 173, 147, 111, 86, 168, 53, 180, 40, -114, 45, -266, 157, 170, -316, 119, 2, -80, -171, 150, -154, -11, -47, -148, -56]
3785e6K18j56k8n3nk84M41K65k25j50J05J64l24J47N2k43J1J83j37K84k44p0Q0
3808b5l4K6K07m17K03K02m8J6mKJ17l56mK93k55J76q5L7K5J20m87L11k44L90j48
3833A8k24O0L10Nj25j27j21K06j31J17j97M52ml18J69j43L44n89K22j11j33K0
3855c00P4K97j68L05j36j38K25l54M68N5k82k31P0m6P1j21K00j39K3J78J24o7
3877A08k0j60j08J09q9L5J50J14ro9j96K21J7p8j50K67j29O7J4J9m9lq1n9m9j97
3903c25L69l8J08q7j83J21J32q6r7j08J66J62J28l25j55J70J55k77J07P7j04j02
3925a92l8L38j78O9k07M3j7nJ67J11j36P6R0l19N2m1P2K32k20Q2K43j29o8K8j45
3950i2Q4l2J66jn03K89J45P6k85R4j01M2K66J2k2J3O8l49K54Jj08k0O3j69l31
$$ y = [-56, 162, 6, -22, -75, -80, -364, 77, 342, 117, -33, 72, 236, -88, 59, 111, -132, -121, 62, -75, 209, -35, -105, -25, -59, -33, 174, -243, -40, 162, 114, 130, 126, 128, 245, -111, -115, 178, -77, 99, 14, 51, 76, 196, -291, 20, -224, 166, 18, -206, -146, 164, 169, 44, -83, -204, 2, -129, -12, -209, 243, 239, -79, 90, -53, 291, -298, -76, -187, -320, -300, -226, 71, -97, 208, 72, -66, 159, -195, 273, 328, 46, -185, -115, -161, -90, -211, -11, -150, -127, 51, 175, 108, 88, -72, -180, -71, -160, -125, 25, 139, 130, 61, -135, 86, 103, 25, -125, 142, 13, 80, 94, 113, 64, 61, -20, -79, -128, -325, 44, 6, 114, 27, -156, -35, 97, 11, -86, -194, -28, 134, 262, -63, -218, -48, 107, -170, -63, 14, -90, -192, -230, 108, -70, -1, -208, -165, -182, -187, -20, 91, -45, 31, 121, -198, -146, -187, -115, 117, -103, -21, 222, 93, 25, 53, -92, -8, -40, 126, 125, -378, -89, 56, 132, -153, -59, -160, -118, 148, 160, 138, 151, 219, -130, 124, 125, 17, -3, 60, -109, -440]
3975d40M43R3j07K27Q0j26m8k74j00K84R9p9q4L02j75j36J35k98J49j32L05j9
3997I9j8K18m12K53l64j65K36L60k67J47q1J56k34Q6nj72L79k65q8L91j86j43
4019g5JJ21k63j56J10L42j9m3Q4j06K9M8J77m74J68k77K07J31L21k78J28qr9O5
4043A34l50K07N9k99L93j28m4o3j84L59k32J86j91J30L6j28LJ02j72j08L84q0
4065A4L1j23j14J97j95J45k09J74j47M43L3j91j49j56L77J4r3j42N6j05M79j60
4087A79n30K64K41j49m4j43P0J31l0J37k4k85j9K59o8M1N4l01J75J61l56J91q7
4110a33kJ64j58O8J45O9j19K22l94MO0J21J11k1l54L84k63M06J13o14RK22p2O4
4134C2j59M02l42K00j58p4J53J20l56J11J58j55j34J08J89J37j11j67j93L47N4
$$ y = [-440, 3, 96, -11, 216, 296, 170, 122, -152, -252, 32, 131, 52, -32, 270, 95, -41, 94, -204, -55, -187, 118, 99, 81, 299, -113, 140, -224, -389, -153, 207, -60, 87, 6, 162, -72, 14, 9, -163, 216, -49, -137, 254, 68, -75, -74, 47, -216, -372, -262, 80, 61, 18, 102, -4, 25, 73, 250, -224, -56, -333, -126, 5, 326, 48, 176, 168, 69, 134, -216, -9, 50, -249, 144, 16, -28, -91, -275, 84, -148, 38, -153, -23, 13, -115, -112, -10, -182, -290, 94, 14, 45, -78, -192, 5, -190, -45, -254, -80, -227, 216, 249, 58, -91, -247, 130, 144, 51, -91, -35, -140, 339, 179, -351, -87, 154, 5, -39, -182, -112, 19, -11, 126, 102, -183, -202, 57, -11, 30, 84, -217, -42, 119, -237, -46, -133, -135, 29, -129, -61, 84, 153, 34, 256, -138, -134, -74, 47, 158, 137, -217, 167, -96, 310, 423, -191, -182, 40, -32, 32, -127, 275, -67, 133, -25, -99, 54, 174, -182, -71, 87, -68, -202, -94, 95, 232, 121, -46, -239, 108, 162]
4155A62k69j16K16R3j7J26k39l67O4O31l01Q0K97m80j29K48R5l98j9M99Mk56J28
4178E2lj01K6P7l07K39K04m6l57K36j02M7K47j30k53k5K33j4K13l10O8j10L25
4201B09m4j53k37J73r6J43P0k25L70j29p4J20j16m3j41J50J22J5j40m21L66K69
4223A88j1l33o5J3j11K85L70k31j52O7M1jj14j43Q7L16K18k41k46J52l9J31j86
4246eJ25k11n7R3r3L60l86J51j33M55m18k62M45j67J96K4M3j60P6k78J49Q7k54
4269b20l0J83L26j93k29J94J70j52j25J2Pk4K22J38k86q6j8K71k22K31j98j97
4291b26J68K23m26j7J50j88N52k42l3j80M19j72j09J43l46P8M00Lr9l57L84m6
4313G9QQ8n17K24J49j35K44j78OK91L0o3k49n3rP0M08m89k18K48pJ45k11J59K3
$$ y = [162, -107, -223, -7, 86, 69, 195, -44, -411, -347, 284, -17, 63, 360, -120, -249, -1, 94, -304, -323, 176, 180, -76, 52, 49, -52, -26, 51, -256, -17, 187, 141, -216, 20, -82, -35, 212, 82, -171, -196, 37, 23, 236, -74, -6, -116, 209, 165, 12, -225, -52, -148, -5, 65, -160, 210, 81, 7, 127, 11, -32, -173, -23, 99, 114, -26, -447, -81, 188, 177, -156, -221, -208, -319, -34, 336, 105, -47, 20, 61, 60, -54, -197, -110, 206, 424, 183, -63, 89, 50, 181, -5, 120, -91, -148, -55, -148, 212, -174, -23, -156, 299, -119, -381, 64, -103, 93, 117, 160, 0, 76, -202, -53, 34, -220, -250, -67, 259, 66, -163, 31, 201, 49, -76, -64, -57, -81, 141, 279, -7, -93, -111, 160, -62, 169, -29, -226, -58, 165, -261, -278, -128, -316, 236, -6, -39, -219, 200, 28, -81, 62, -284, -206, 194, 197, 98, -259, 125, 79, 87, 175, -342, -118, 31, -104, 140, -38, -32, 259, 289, 226, -23, -76, -85, -15, 393, -96, -314, -66, -73, 72, -139, 20, 43]
4338D3k43K47J90k77j25J26M8J26m0j86j51J22O6j12L43m65L13J10k9k25m5j57
4360c21M45J99m20J86l08J86L71q2k49qQ3k7J28ql17N0J52M49m61k94J1J22K11
4383I8J70k76p5oJ99j21j26j90L57Q1J89k45k14L1K0J19k13L29n14M02K8J13l18
4406a62N2O8QM4J27k18PK30k76L43k67j17KJ78J17l48K9k27N36l3o9o2jK39M1
4431B41m6m11J56m8J02J30k42K3J10J26j45K27k40J95n1J56Kk40j11J69K14j98
4453A19m4k73K76j88L72j58j17j63J35K44k16r2j6J10q5J05K3j31mO4R7J40o36
4476d38K36J45L3J94k17m4p7M23k87l7k68L89J76l92K62j33K01j85j0k04J71R7
4498C5M9J51l14r9OK39J3K0j85J26j49j49M01m03J06N8J21J6J12j7l03K14N8P0
$$ y = [43, -200, 47, 237, -40, -165, -39, 9, 135, 95, -91, -242, -120, -54, -166, 177, -288, 25, 135, 106, -119, -164, -321, 124, 323, -97, 89, -219, -33, 338, 256, 7, -1, 82, 55, 183, 175, -142, -92, 60, 509, 48, -246, -235, -113, 98, 268, -8, -83, -89, 110, -11, -137, -327, 30, 111, 300, 55, -159, -128, -108, 11, -202, 127, -387, 15, 43, 156, -162, -110, -42, -34, 10, 137, -81, -74, 156, -120, 223, -44, -161, -159, 19, 136, -212, -183, -410, 126, 93, 24, -38, -39, 200, 241, 195, -216, -60, -108, -6, 124, -118, -95, 15, 141, -4, 223, -17, 178, 127, 283, 285, 45, -66, 103, 317, 119, 75, -198, 78, -110, 262, 104, -13, -176, -41, 203, -13, -105, -121, -11, -96, 9, 32, -99, -103, -39, 58, 198, -438, -202, -57, -24, 170, -47, -91, -168, 255, -32, -69, -337, 52, 228, -164, 98, -35, 166, -19, -29, -233, -62, 35, 84, 235, -79, -178, -172, 67, 80, 100, -85, 41, -108, -257, 144, -259, -153, -95, 26, 42, 154, 137, -166, 48, 106, 176]
4522A76o5l78J44l41O16K1j32j39mK67j36J7k28L58O0k23k94Q0J32M0J24j31k02
4545b38M47K1j90o5J99m04J39J74j52K69k8k91J27J38k37L4J29J59p7l07O4k7
4567a16J44K19q4l68L48O2J00k97K63k55K6j22L53j77k43J25O9j7J70k46k1J53
4589H6J06o0k47R4l5J28j72J07p2J36j2n7J93j84k93M83K00m36q8J77J6p8K18
4612B10j63p9k23M80k28j38nP5K32J1r9j60J84k67J76Q8l14N2K57m7qpr8L9j48
4637a80P5L91m63K35p6L4l5j4j90O0K38O0k04K08j70M2J07p6j33j81L02J66o5
4660A31n6k96L01l15K41J40l50J61K3L29k6l33k41J44K82j60j04J41j39j77L70
4681F6k3m17J95J33Q1J65l34J66k02M10k52J9ok94M72%j30R2l39K26P9%K7k01
$$ y = [176, 111, -267, -123, -464, 152, 173, 41, -98, -102, 165, 29, 46, -182, 176, 236, 13, -281, -201, -69, -29, 95, -36, -238, 209, 230, 40, -25, 174, -230, -91, 83, -69, 200, 172, -119, 8, 146, -91, -57, 72, 231, 154, -153, -89, -116, 28, 247, 163, -205, 143, 205, 305, 8, 271, 16, 42, -80, 273, 96, -147, -22, 47, 30, 200, -46, -67, 86, 192, 132, -115, -21, -56, 72, -100, 7, -65, 71, 59, 2, 195, 11, -282, 201, 401, -35, -123, 54, 70, -8, 210, 47, -32, -255, 225, -3, -141, -146, -71, 161, 172, 73, -87, 97, -170, 6, 94, -220, -168, 89, 42, 34, 27, -71, -32, -180, -105, 286, -177, 58, -18, 16, -19, -33, -223, -163, 75, 135, -69, 139, -31, 11, 118, 42, -91, -272, 30, 196, 131, 75, -221, 80, -235, 6, 146, -204, -43, -20, 309, 283, -50, -291, -147, 135, -25, -129, 12, -127, -304, 66, 43, -374, -179, -46, 35, 200, -134, 32, -170, 240, -12, 7, 1, -293, 179, 179, 49, 141, -198, 28, 107, 107, 134, -67]
4705f7K1L2l4r7J55L6l3j5l4j89J31K71k45L10q7l00J81p3J49k27J4J12J48j6
4729A43j16q0K55k25J44M7ml49J00NJ05j13nJ67p9Pk48M16J15j06j16k20J04J28
4753G5J21m25Q9M0L23l73K05n2j05Q0J91l58M68r2j96J3k49N19m7ql60K5J91j71
4777i6J89m5O1n7l21L57J35m42K41J06j12J68j16j08J9Qj5L6k0J72k23r7J46P5
4801F1k41L89j29J11j99K19J9p6j55j8J46k76J21J03k36n8K12K4J75Q0q9j66J38
4824A55l7k08l2K51k42J67j45R7rJ74j43m18L59J59J66j99M7Q9k83j96O9N8J14
4847gP0m9J56J07k32J85j47k09NK47j53o8o3J43Q3j69L12k74j57K60J51m24J48
4870h5K34m18R0L9L5K9J55K2j65K23K4k28J55L83k87k56Q3N2J07j79j08N5Lj47
$$ y = [-67, -46, -14, -48, -145, 10, 46, 13, -2, -36, -225, -94, 177, -68, 242, 155, -145, 36, -37, 112, -115, -101, 11, 159, 143, 27, -53, 202, -23, 121, 168, 164, -185, -85, -80, 25, -88, -93, 74, -5, 2, -246, 170, 285, 179, 63, -157, -53, 75, 196, -229, -140, -100, 223, -150, 55, 3, -102, -22, 169, -189, 279, 187, -9, 4, -245, 274, 227, 219, -141, -116, 75, -96, 93, 48, 109, 52, -269, 88, 223, -219, 22, 128, 16, 184, 68, -40, -21, -13, -28, 8, -12, 160, -63, -160, -14, 61, -180, 209, 80, 191, -8, 211, 230, 154, -1, -19, 127, -149, -28, 75, -161, -219, -7, 17, 192, 272, 183, 17, 155, 118, -90, -122, 129, -113, 54, -91, 6, -3, 171, 28, -390, -31, 128, 294, 95, 142, 231, -52, -248, -179, -121, -7, 63, 14, 170, 277, 45, 230, 83, -126, -121, 126, -27, -95, -158, -15, 68, -101, 211, -63, -220, 40, 191, -233, -85, 149, -269, -179, -140, -105, -76, 79, 101, -64, 159, 183, -45, 110, 493, 206, -50, 33, 85, 192, 13, -95, -40, -37, -184]
4894a84j72N82j26r7l3J15r5j45q3M66l05N5l1K7K3J48pJ9k20j02L16j18P8J07
4918B18jk15M7j13K17k23J66J22k28m2K1j79K55K19m59J96J36j04nL7R8k68J20
4941A5pJ7j1J92q3J49k37m2J60m2j87M7m7n7L2K90k87J59m6mN1J4J0N7l13L79
4967B09j76o3kj1m3L0L6L9Qj69K56k68J04Qk17K92j07J57p8j85J74l8J16j80L
4992a05k0J05J06k83j64M09L3n6rJ03j86qN5k70L71m6k1o8m1K44k73J21N5kk1
5017B9j74j47N47n8m36L64j05k25J91J1k20J61J44po7j1p6k27L79J5N2m02L21
5040E9o4J40o8m7k9J73r1p4o7O8J3j09J42L9k72K75o3j5K77l67r3J40P2m7J05
5065I7k43K17k00R2j28P6o1K79k76J05R1m6J88k44KK07j27J9l8L7k73J40N2J54
$$ y = [-184, -356, 226, 100, 3, -30, 85, -10, -155, -238, 228, -77, -22, -53, -26, -3, 145, 138, 157, -63, -165, 151, 33, 111, 218, 217, 2, 49, -64, 153, -70, 96, 218, -10, -52, -31, -210, 45, 264, -195, 1, 137, 33, 28, 65, 163, -105, 15, 8, 25, 14, 206, 123, 272, 35, -7, 153, 111, -76, -29, -76, -133, -101, 189, -98, 61, 15, 11, 62, 76, 86, 143, -170, 209, 33, -30, -32, -43, -86, -56, -20, 19, 27, -142, 114, -154, -50, -42, -259, 33, -74, 83, 5, -180, -6, -44, 72, -108, -105, -125, -20, 86, -197, -361, 48, 81, 25, 16, 119, -67, -75, -20, -290, 81, 35, 14, -54, -95, 149, -124, -3, 52, 50, 29, -145, -292, 255, 197, -239, 125, 20, -205, -14, -3, -223, -62, 82, 75, 8, -3, -79, -306, 73, 88, 140, -262, 59, -5, 135, 67, 20, -9, 164, 73, -1, -68, 0, 13, -96, 46, 85, -187, 88, 25, 10, 287, -80, -173, -33, 39, -8, 97, -146, 71, -129, -37, -165, -89, -150, 129, -147, -42, 49, 3, 191, -53, -51, 156, 29, 48, 10, 47, -226, -86, -34, 120]
5089A20o0l45P1K14O9L07l44k56L89r3j88q6L87l76L2J27j35K54k92K76n6P8k70
5112a77P2Q4j3l33M74k61L99k21k73P47o23K60j1o8p8k4J89Mj61J88o8K4%j5j87
5137g2J18%N4j8r7K9k2j49J48Q3j9L11m60K33j80P9m0l3j60K00J91Q8k33L0j53
5162g2K99n23K95O7j85L8Q5J16l21J65J09L8k47P6K88m01J11J93k1j02j68K27
5184F7L0k14lK19k47J65N5r4P0q4j66J23K23k44J39K45j50m29M03j46k92L57J77
5207B04j45j84k00M91j21m4j03m7J22m4K58k22j37N1J49n7M7k1N9r5o0k9J38j44
5231a34oK03pj9K05j94NL3j82j7J00K5JP7l7o8j62N5K92m4k01N7k42K61J20r4
5257B7R6k03J99j5r3pl46J09O23l22J85n86J24K66p6j9J72p3MQ5j90P0J44k88
$$ y = [120, 60, -285, -214, 0, 69, 376, 32, -224, 165, 72, -116, -202, 185, -191, -159, -32, -167, 87, -205, 71, 15, 93, -177, -105, -21, -34, -367, 107, -154, 245, 24, -249, 498, -125, 135, 124, 56, -22, -46, 143, 147, -14, 174, 106, 130, 130, 115, -72, 46, 46, 100, 82, -15, 14, -8, -157, -9, 74, 55, 366, -94, 139, -41, 38, -2, -35, -195, 5, 196, 284, 51, 81, -72, 227, -296, -1, 66, -119, -81, 4, 120, -201, -36, 73, 111, -136, -60, 228, -173, -62, 131, 110, 8, -160, 67, 97, -117, -120, 99, -148, 17, 72, -22, 48, -36, -202, -79, 144, -100, 39, 284, 134, -295, 108, -38, -330, 27, 204, 59, -125, -325, 166, 45, 1, -102, -149, -27, -71, 187, -35, -172, -121, 28, -29, 18, -3, 56, -39, -99, -128, 10, -134, -140, 63, 56, 37, 242, 48, 53, 86, -96, -113, -13, 12, 13, 90, 53, -15, -177, -122, 170, 126, -75, -18, -260, 1, 121, 27, 123, -80, 119, 104, 11, 4, -342, -233, 390, 68, 253, -333, -209, 57, -19, -38, 134, 61, 65, 150, -40, 30, 174, -114]
5281a14J28M6O2m25L72M9m12K77O5j12J08k32J82o0L86k10j41L69j68r7j26K03
5303A50k33J03L4J0K49k64R4Lj78K24k41L8k68J80K53l44J11J54k06K89k35l9
5325a16M51l79J46j17k92L07L24n02R4J70k25j32L05L9q1KK6nJ58k91R5J03r6
5348a6K5J09l09K55j21K35j12k86M91j05j24j17J34j49k3q9J33NJ0M7k2K81n6
5371A96l77J7N59m10nJ83K17o59M56j88K9J88j48l8q0J56j89K66k09lO8r3K99
5394B35pk53N4P3l9p9J53o8J5l8o3J4n4K45r9O5l21K21R5l10J62j27j34K36k65
5419b89K35J81j27N5M6k58J80j22M59m62O7Q9K4k51K39k09M74l55K10j7j36J33
5441A66r9j03K12K17m47l0O6K59k17j85L87m96K38k2l75K85K44k39MK72j70K27
$$ y = [-114, 14, 60, 122, -303, 69, 118, -294, -17, 48, -64, 44, -188, -6, -66, 320, 110, -31, 338, 170, 73, -53, 150, -83, 20, 54, 64, 313, 49, 143, 146, -32, 192, -49, -11, -279, -99, 154, -190, -79, 75, -131, 158, -77, -116, 335, -44, 102, -15, -307, 0, 324, -178, -84, 86, -139, -271, 34, 73, -8, -6, 20, 15, 173, -118, -23, 80, -16, 9, 118, -191, 64, -57, 178, 66, -220, 271, 166, 42, -75, 59, -90, -113, -202, -69, -64, -54, -7, -29, 252, 196, -181, -164, 395, -15, -20, 163, 380, -279, 177, -11, 18, 206, 58, 20, -60, 96, -93, 173, -36, -39, 29, -64, 235, 228, -25, 29, 102, 63, -16, 137, 69, 84, 46, -17, -3, -57, 188, 89, 154, -167, 54, 149, -161, 1, -126, -260, -24, -289, -54, 127, 0, 55, 101, -157, 23, -99, 360, -102, -35, 54, 78, -173, 66, -143, 331, -24, 186, 169, 33, 166, 67, -36, 176, 393, -54, -84, -18, 241, 24, -161, 226, -270, -32, -54, -429, -144, 100, -139, -135, 137, -33, 194]
5463A94J0m1j33o2Q1J81k60n3J96j25k24Q3J62j94J32L42k75j65K00R1l34M50
5485B56k78R2O8Qj16J76k18J33j83L7k6p8r5L53j26p3K38m51J21J35j38K51j39
5508e3j7K29j74r3j10P5R1j40L38Nq4p5J62k59M0kl52M34J25m18L59o0q0K17j58
5533@k14M2L06k10J18Q0k66oL02j21q3o9j1N8K4O8k4r6J25j57K15k52K54j59j3
5558h9K10j02R9j51J98jj24j38K12j23n5n0j16K07L2n6%J0j8j15K55j47j56K19
5582Aj4k67J87m7J51j10L6K2L23m61J10J86j60J41j68p6J84j92K27j06J96l78
5604b15M32n45L61J94k48M4n5J45k33l6K90j15o3J67l46M17j18l18K60O2n3j34
5626a07K00Q1l08M8m3K23k37K21n1J55j59R6k68j2n7L59k90L91l61N4oJ90j44
$$ y = [194, 204, 163, 30, -32, 49, 230, -30, -83, 113, -12, -236, -153, 9, -185, -53, 289, 14, -151, 49, 140, -194, 256, -22, 70, 138, 146, 30, 206, -12, 121, -62, -25, -51, -129, -224, 129, 3, -70, 168, -283, -162, -27, -165, 86, -53, -70, 159, -15, -108, -218, -143, -52, -192, 146, 151, 67, -8, 154, -105, -65, -67, -419, 15, 140, -278, 81, 21, -59, 158, 0, -214, -172, 134, -76, 42, 122, -144, -150, 152, 31, -52, -121, -132, -74, -50, 18, -6, -102, 23, -134, 81, -171, 83, -76, -89, 121, 19, 118, -33, 165, 164, 40, -98, 114, -9, -64, -114, -230, -23, 9, -47, -47, -37, -55, -170, 85, -62, -218, 1, -13, -280, -93, -140, 11, -99, -63, -41, 282, -179, -69, 117, -43, 98, -70, -146, 38, -154, 73, -33, 163, -215, 217, -328, 33, 227, -21, 23, -32, 113, -120, -156, 134, 19, -44, 123, -223, 194, 76, -242, 18, 80, 27, -107, 93, 174, -134, -86, -129, 94, -143, 78, 27, 182, 23, 119, -149, -161, -218, 141, -149, 242, -119, -65, -71, 119, -25]
5649b5R8r7j1J07Q1k53j79L18o5L06j99m5l9NL42m19k0O5K51j30k44P7r8J15j33
5674a92R1J90J34j71j1qK20k99m4K07j58j97L2J50J95j80J08O8j19k59K06J5o3
5697h5J25l08rK72K54l75J96k13J6jL76j99j35P0r6P4P4k86J89Q8r2ppJ39j59
5722i9J6J24J4J25l43K56k17L34j34j67P9P0j23J97k50L2L4r6J90l8J34r2P0n4
5746F2r4L26j76m5Q1l86L05m2p1j1M6l05K37N9J30o6k31Q7J42j09o1L3J06r5M5
5771c3r7M28j04k70l6K4j20N3J66K50k54J47jj77L01k91j4O5o2l5M6k75J46J96
5795E3n3j3k16QN23k81J28pj74Q1p4j1K8N8J57l16K80j47K01j6k54j04P0P2K87
5820B80j57o3J63r4j99p7L45j14J7N9j16j06l4M4L02m30K93j15m0j07J91J73J4
$$ y = [-25, 73, -24, -35, 72, 153, -100, -279, 39, -26, 280, 81, 36, -3, 2, 344, -75, -95, -30, 221, 91, -153, -76, -174, -59, -192, -101, 89, 223, 52, 41, 33, 253, -46, -90, 117, -41, -238, -206, -56, 139, -41, 67, 135, 16, -243, -37, -22, -85, 40, -268, -277, -5, 249, -126, 70, -143, -127, -128, 248, 49, -86, -16, -112, -38, 36, -250, -61, 27, -65, -72, -79, 60, -99, -83, 41, 55, 180, -163, 93, -124, 210, 76, -91, -12, 58, -65, 132, -118, -86, -52, -148, 42, 4, 138, 46, 116, 62, -32, 294, 118, 73, 154, -232, 73, 31, -40, -51, -5, -310, -73, -14, 116, 50, -181, -94, 48, -61, -122, -89, 17, -78, -33, -130, 298, 194, -76, -112, -88, -208, -155, 11, 261, 7, 154, 153, -24, 277, -14, -28, 37, -25, -60, -14, -289, -143, 53, 0, -13, -229, -221, 302, 21, 149, 142, -32, 49, -25, -36, -8, 50, 207, -109, 171, 24, 225, 209, -45, -149, -79, -7, 280, 123, 60, 223, 129, -70, -147, 198, 84, 101, 160, 44, -62, -96, -52, 250, -180, 113, -2, -42, -149, 42, 215, 229]
5843B29k80J3k01L14N1k78L2J4k09L88k2j19J16j1J8K9o9l95N77l84J52j05L43
5866B03j61M6j06R0j52O8J07j69r3K53L0K7p2Q3k96P7p6O8j85K69k8j10Q7j77
5890b17L46j34j18K55j88o7J56j79K83j50P5j36m3J23K8m7L1l6j47K61L9k88N1
5913a02J38J11l28Q0J48j26p4K14K31k95q4K11j21K7J47k74o7K55k28O1%j1J22
5936C5J43j59P8l88M05j01KO8j08Q3L02k05q2J42j65J0k62L0K50O9k00P4K4p8
5960c3j88K71k4k06R5P9P2j47j76M61j28%q8j12L62j86l52L04k16J66K1j18J21
5983b2j82L65j84N2q7J11j26M38k04j51K6o3J70l69K96j74K9N89l90m3J1k29L28
6006A91j8r6j58o0J14ML7l19K84j93J45m3j6K98p1J11j55j51K09k57L00j26J98
$$ y = [229, -51, -38, -239, 75, 126, -152, -120, -106, -315, 73, 51, -68, 48, 37, 55, 84, 15, -380, 197, -187, -35, -140, 203, 42, 88, -18, 72, -80, -12, 95, -74, -167, 86, 116, 143, 71, 154, -142, -65, -141, -73, -258, 11, -17, -127, -40, -217, 129, -5, -123, 132, -56, -123, 33, -146, 137, -13, 62, -74, -117, 6, 34, -13, 18, -18, -165, 96, 135, -153, -102, 36, 147, -181, -101, 47, -79, -153, 61, 292, -3, -87, 124, 3, 30, 177, -97, -164, 91, -137, -76, -76, -87, 35, 178, 19, 97, -291, 114, 13, 15, 83, -25, 58, 360, 155, 73, 215, 50, 60, -202, -172, 78, 147, -53, 21, 45, -33, -221, 50, 26, -180, -85, -6, 66, -81, -257, 204, 76, 76, -12, -124, 238, 52, -300, 4, -212, -46, -25, -143, -22, -204, 161, -23, 29, -58, 53, -73, 365, 161, 10, 36, -27, 143, -226, 70, -104, -75, 514, 124, 81, 92, -137, 191, 173, 77, -81, -141, -27, -23, 14, -305, -21, -214, -69, -112, -128, 170, 99, 210, 55, -96, 113, -144, 156, 30, 228]
6029B28k64R5N4p0j22J63k11NJ81o7j95K25J17j10n9j98L99p8p5k47L55k36M8
6052f2k9qN4l50N26j10n6K64j37k56J85R0R0O6k84J95k35P4M8k8j23k30J12J90
6076a4M7o2l2j17O9R6J18j99J18Jj07L4j58J21l59M12j47L21k73J41N9L6n1j65
6100a11J79n7J45p5m8J17k40L63n2k47J41k90KK83l67J59N3P5L29l53r6K38K6
6123A74k6K25l05QJ76p9J06n33K72%M1j97J27M5R2k5j60J97nl7Mo7N5m53L22J4
6149b9J63m9j67J87l80K85Q8r8J77k09K1r0j32L48j62J03Q7j85K37k19P3J25o4
6172A10j37J26L3R7j19j53J70p7N5m8o4nj14K09rj84L19l24J50N7k17kK3J19N2
6197F7J9l82M74l76K54m2R0m17K33K81rj23Klj2m36P1O48m02K54j11j1j91K59
$$ y = [228, -36, 59, 113, 43, -79, 84, -127, -122, 59, -8, -203, 22, 139, 29, -30, -228, 171, 93, 18, -229, 126, -110, -62, -91, -99, -45, -395, 131, 21, -35, 229, 92, -164, 21, 111, 201, 267, -17, 178, -57, 17, 65, 37, -86, -316, -204, -14, 33, -29, -61, -178, -109, -13, 105, -94, 24, 25, -82, -48, -206, -85, -444, -32, -179, 142, -131, 10, 69, 105, 54, -111, 68, 11, 156, 81, 33, 150, -90, 273, 221, -26, 115, -175, -173, 110, -257, -98, -45, 30, 359, 6, -90, 148, 174, 148, 373, 68, 76, 252, 173, 279, -254, 18, 18, 59, -138, -11, 34, 126, 101, -59, 138, 133, 96, 100, 33, 88, -365, -43, -29, 134, 85, -82, 105, -275, 10, 98, 0, 177, -32, -11, -101, -233, 115, -47, 56, 143, -42, 195, -24, 49, 174, 110, -27, 99, 132, 229, 110, -43, 127, 50, 105, 57, -7, -12, -126, 83, 74, -110, 209, -115, 35, 92, -125, -127, -104, 15, 67, 86, -296, 178, -198, 56, 14, 104, -313, -80, 201, 192, 69, 71, 68, 56, -380, -309, 339, -63, 191, 80, 69, -122, 137]
6221A37q1N6J29l09J59q4j35q3L65o2j06j29J29J24N8k6j72K23k41J17lm9n1K15
6245A81N0k98K42k66J63j55p4L09k66J57j48p6L2J33j71O0Q2K05j11n1K51k37
6267A2j78J17l42L67p4J5J34l0o2R2j3K6k19K52l24K85k7r5K27k22q2J13J2l8
6291e4n0J22k27K53k27J36KJ33q1q5J24J3j70N5L80k89K8Q9m8l26M06J23l91J79
6315I5K05l71K0J13k72j29Q5N02P1l32j95P6r7R6k7J58Q8o1j47J71k44K16J01
6338A22l21P5N5mK28j38k80Q6K13L99m51J6K7o6K6j09J29j29Q7k74K67r9Pk7O6
6363i5l3J34j57L47j50K17n0k37M5p4J72l04O9J06j13N0j64L52k77MM0J96rk3
6387D6j26N7K52k54J54k77j48M20j63r7J60j14J73R2j77j40J84l06L30l6m5J78
$$ y = [137, 56, 112, 241, -68, 91, 7, -128, -211, 154, 92, -14, -143, -14, 110, 168, 142, -30, 193, -48, 69, 66, 17, -34, 181, 231, -67, 175, -91, 72, -83, -157, 152, -114, 43, -105, -181, -149, -16, -187, -127, -45, 160, 49, -2, 249, 12, -166, -49, -391, -24, -98, -83, 51, 21, -41, 51, 38, 64, -155, 97, -227, 58, 31, -64, 163, -59, -141, -28, -16, -54, -104, 18, -209, 44, -183, -47, -45, 88, 7, -78, 46, 59, -111, -56, 324, 35, 63, 152, 104, -222, 184, 307, -84, 95, 300, -71, -51, 62, -210, -339, -254, 248, 319, -13, -208, -132, -229, -133, -160, -2, 86, 25, -122, 49, -195, 21, 122, -199, -124, -69, -73, 155, 17, -263, -177, 36, 435, -16, 0, 27, -39, -13, -122, 7, -122, -35, -309, -42, -141, -134, -161, -95, -128, 6, -151, 196, 46, 263, 213, -24, 21, -53, 119, -185, -116, -10, -123, -73, -237, 115, -162, -158, -118, 78, 69, 46, -80, -23, 229, -25, 129, -148, -296, 124, -39, -136, 24, -90, 83, 175, -2, -142, 42, -264, 66, 30, -15, 163]
6409A63m11L75j37l1K38l98J26R5k36J95j26p3J28K40O3l83K98l05j8K18j07L8
6431d8K6j65J05J55n9Q9k41J08K2j09K48k20L97l18M9P6n7j13K71j03k07J32m8
6454a0J18j0o4k01J56K57n33J70j06j6L1L34n5j72J36l9J12k26K3O3j39J38j30
6477a63j70M58k61o9L09k02K82k7j50j8P7J57n16K80K14j72K35j58l5l54M13l8
6499I2r8K35j07k65J23k0r8J16j31K24q4J6J94m86N86k27j95j47L07MK4j68K71
6522A66q4j61K7j06J82N5J05n7j32j35L23j99K41m72K11n1M8q1M08m28J00J00
6544F0j9l9l0q1J47J83j29L1n72O23l32Q8LN7j30N2P0J11l9n9KQo7k8J31j43P
6571i5R1j64M7M8Q9K2K33k73N7j68J18j40J78k69K49K28k04J03k55K62j61J28
$$ y = [163, -248, 127, -10, -41, 197, -201, -75, 20, -216, -21, -147, -220, -92, 148, 211, -172, 126, -179, -197, 21, -86, -48, -22, -187, -82, 73, 14, 103, -138, -30, -8, -117, 131, -89, 308, -10, 39, 115, 58, -55, 216, 113, -94, 38, -10, 108, 98, 34, -167, -11, 246, -287, -117, -223, -239, -208, 126, 71, -101, 35, -4, 108, -118, -95, -32, -171, -33, -163, -333, 125, -136, -205, 104, -98, 184, 157, 7, -11, 66, 223, -293, -13, 201, 29, 264, 106, 71, -283, 130, 92, -6, 229, 122, -143, -20, -40, -138, -22, -153, 71, -13, 3, 197, -289, 297, 70, -125, -272, 35, 39, 63, -105, 166, 82, -79, -52, -158, 24, 79, 184, 127, -5, -140, 183, -16, 225, -247, -36, -87, -39, -120, 288, -140, -40, 60, 41, 2, -28, -109, 38, 221, 92, 123, -449, 174, -158, -70, -67, -10, -140, -88, -18, 93, 54, -5, -3, 5, -62, -90, 41, -102, -95, -4, -168, -121, -73, 16, 38, 271, -2, 55, -113, 5, -135, 43, -226, 23, 251, 47, 150, -105, 157, -4, 124]
6593A24j74J64k67J69K2r4q8p6J26J23q8r2N9L0L40q6k21P6j0k55K68j20J37k88
6617b21K88j77M60m34N2L1l5r8J64N6j40o9J89q4J92j9j43j49J71p9M8j1j42K79
6641A29M16l65k30l0R8J00K6j12o3o6L11Mk82K81l18J78p4K30k61k7k7o6L38k22
6665c2R8J78j61j63L08k39K38j17k28J53j10K61k54O9J44k41L54k07J27j50L7
6686F5k00J02P8N8k02k9J54J2oL9j42K07l58L98k17NJ81k44L86j82l02k4K93Q8
6710A60m39J72p0L03L7j99J63q7k5q5k30K85l7L91n41M6L48j28k08L95k20j05
6732g4J88q2K4K03j23j75J19J12O1K2k29q6o3J44M0l46L46r7j35k7K40j32j53
6755b23L24j71K12l9qk35K83j59k4r8l3J21J91j1n4j09J33N3j31k8Q5n4j33K01
$$ y = [124, -50, 114, -153, 16, 38, -56, -144, -220, -94, 29, -59, -151, -92, -62, 278, 192, -29, 47, 37, -218, 50, -70, 67, -221, 67, -110, 350, -84, -32, -1, -36, -134, 30, 86, -54, -123, 66, -18, 174, 155, 12, -137, 34, -45, 3, -8, -150, 129, 545, 180, -50, -80, 18, 118, 144, 32, -31, -97, 214, 218, -64, 217, -101, 77, 3, 233, -28, -55, -82, -148, 190, -32, 66, 244, 83, -80, 228, -11, 227, 110, -118, 35, -75, 186, -68, 1, 145, -96, 258, 51, 178, 28, 65, -135, -33, 45, 103, -99, -128, 26, 38, 32, 71, -71, 136, -222, 176, -41, -36, 145, -99, 287, 105, -197, -221, 72, 160, -279, -107, -177, 126, 163, -36, 127, 40, 15, -70, -300, -15, -52, 339, -202, -156, 192, 64, -144, 251, 31, -74, 114, 32, 56, 259, 136, -39, 80, 192, 253, 275, 46, -40, -103, 41, 81, -265, 81, -16, -151, -178, 62, -70, -223, 101, -70, 142, 103, 95, -140, 143, -16, -40, -138, -171, -50, 141, 130, 76, -33, 100, 153, 22, -6, 79, 25, -108, 93]
6779I3j87L05l45K7j93K42j6O0J36O6l45M30j36p5O1j33J27n3Pj4j96J82j18Q9
6803A4l62L95J22j60J9k2N8J3m5M6k33j2K19j34J57k62j5K42J65N4k14n06M17
6826d4N0J39l09R5J69j41j56M25l21K35K3j8j41j18J18J0j26K00NJ6j1j75K27
6849A52j94j6K1K01m0j03m5J91k53K79k23J04k27J87Q1k25l3J63k14K96J05K63
6871D70n40L54L7q3k20J52k06m2J0J29J29k49J56K6k83J10j20J30J09j66J05J42
6893A50j79p1J19n2R2q2J07m9J10k6k21R7j20J91j68K2L3j76J74k50J78L73j11
6916A41j10K09q6j24K06m53K01K31n7j84P6o0K06k15l31N12J03p9l82J8J41j32
6938a69P7O7o3J26q9O2j45J75j13J62j50J7q8J45J6pj81L56l01j26J5L84o6j24
$$ y = [93, -94, 211, -134, -107, -300, -58, -74, -14, 122, 188, -157, 273, 137, 62, 123, -10, 117, 64, 71, 57, -139, 43, -75, 14, -348, 47, 169, 9, 28, 6, 64, 77, 32, 78, -155, -167, 52, -82, 75, -187, -202, 40, 205, 259, 45, -461, -44, 6, 145, -164, -69, 100, -41, -197, 228, -93, 142, 165, 147, 6, -112, 6, 16, -110, 90, 95, 111, 100, -75, 152, -42, -58, -37, 164, 124, 21, -24, 167, -86, 193, -30, 74, -153, 34, 115, -110, -143, 20, -194, 102, 207, 470, -70, 284, 321, 238, 18, 170, -36, -78, -68, 61, 190, -59, 97, 123, -160, -50, -170, -40, 69, -97, 8, 150, -29, -100, 19, -33, 59, -23, 84, 35, 145, 119, -102, -5, -125, 66, -102, -80, -47, -223, -49, -299, -121, 252, 141, 31, 240, 154, 30, 236, -217, -16, 215, 158, -26, 50, -10, 196, -19, -350, 162, 265, 186, -196, -178, -37, -169, -92, -25, -88, 38, -51, 11, -134, 41, -72, 90, -60, -43, -131, 14, 30, 23, -158, 198, -103, -229, -214, 170, 104, -20]
6962b0lj53K90r4M73l55J10j9m23K16j07rJ79J90n26O1J94n4J44m2k83K04n4J23
6986D2K4m8j81L6j05N36k79k11j31K62k6M0L6k24K0m2L82j99J04j6l06K14M6k0
7010d6R5j09j00J76Q6l6nj1mO1j43j63M21l55lK07l9j62Q4J94r6j0k87J37r7Q7
7036a18J66j94J97j53J92m1m3K3Q2j02J22q4j3j50L12l73J49j21M03k86r7j89
7058c18L48p7j66L19j58K0O3J51k62j52K9L07k6L4l24K09K20k76j10K13j8P9j12
7081gJ81k20M6k7J21j15J76m9j57L11o26J82L21l3jj03J10k20M31k40j55K2L68
7104C16m48L6o7L8J48j3m9J06J66k09J12j99K8K72k41j21Q3R5k13J04rQ6l3P1
7128E9j63J43O9k53j17K5K05m8K00k78N7K08M6k31N8J63l47J18M3k4j5Q1k08k4
$$ y = [-20, -23, -176, 114, 20, 493, 138, 248, 229, -194, 22, -85, -94, 85, 275, -251, -190, 4, -50, 94, 52, -231, -27, -81, 42, 66, 18, -163, -127, -232, 304, 25, -186, -317, -55, -81, -41, -5, -229, -209, -251, 131, -68, 36, 20, -286, -72, -26, -46, 49, -60, -160, 16, 102, 66, 61, 50, 46, 107, -36, -199, 222, -133, -136, 71, 32, -130, -46, 148, 52, 42, -245, -108, -205, -118, 48, -146, 51, -102, 90, 49, 6, 29, 111, 9, 131, 47, 34, -116, 196, -177, -28, -149, 254, -32, -129, -318, 30, -47, -213, 106, -52, -32, 31, 182, -80, -232, -203, 104, 78, 112, -212, -3, 217, -59, -169, 44, 26, 105, -7, 174, -46, 0, -27, 94, -21, 155, 106, -51, 260, -366, -184, 137, 104, 103, 0, 110, -110, 321, 81, -74, -52, 316, -132, -96, -163, -125, 23, 10, -39, 67, 233, 24, 136, -63, -35, 237, -4, -125, -42, 53, -160, -56, -65, 21, -12, 59, -104, 39, 108, -145, -262, -237, -32, -80, 120, -158, -101, 107, 153, -78, -20, 143, -204, -86, -43, -67, -82, -1, -209, -233]
7152b33K78nm3P8J85Ll71L02o2R7k80p7J93p6N8m29N76k78J63k1O4k53RK42L3
7177A53j9j36MN3r7J51j99O6J86l2j54K6O0J53o4j68q4M1P8k7k62L29j65j08L32
7202A17r9rK2j74J84J21m86J58K01L0m9j47N6J0O7o8J51P6lk89J34o0P8k13R4
7227i8K70r2j73M88n78J84j9j6O3m8J62j05j42m3L01k63K11k59Q0R7J62l18L00
7250A64k13j82P7K59j05LK46o4k23q8J76R0j22M3j22L55R0o00K31q6j5J77j23
7273c2J6K7L43k33k47n3J03J0mK88m7O7k32n6K17o7r5j00K07m13M00k82L4M13
7297B64l20K81l51K15N9l89K31L4n7j56J86K08k03R0j82J8j32K96k96M39k01j61
7319a27P5LL35k47K86k43k22L08j03j8l2q7k17K98J43j37q9J42n5o0J82j43j04
$$ y = [-233, 45, 40, -3, 75, 260, 263, -108, 194, 132, 229, -51, -128, 65, -11, 47, -382, 194, -84, 79, 58, 122, -131, -122, 120, 153, 134, -2, 2, 55, -42, 109, -90, -24, 162, 130, -24, 2, 62, 215, 151, -17, -101, -60, 18, -9, -271, 58, -107, -215, 117, 18, 9, 31, -143, 41, 162, -324, -166, 35, 65, 16, -131, -75, -65, 2, -66, 85, 161, 158, -131, 3, -57, 21, -192, -98, 172, 80, -93, 395, -183, 1, -18, -34, 29, -19, 143, 38, -104, -147, 154, -109, 102, -157, -77, 20, 182, -136, 164, -49, -231, -154, 105, 0, 3, 249, 185, -38, -126, 50, 140, 18, 61, -61, 294, 384, -216, 15, -71, -86, 91, -32, -16, 11, 354, 121, -126, -179, -76, -66, -70, 218, 171, 238, 6, -50, 167, 100, 5, -95, 112, -301, 99, -183, -149, 264, -56, 225, -126, 89, 148, -241, -10, 24, -33, -189, -3, 205, 2, 92, -90, -72, -204, 92, -204, 235, 34, -127, -52, -49, 286, 39, 325, 82, -140, 168, 65, 47, 15, -72, -289, 9, 152, 15, -74, 68, 13, -47, 135, -8, -112]
7342a12J23j26K31m98L72j22K1jJ43J15k32J00Q4l16N49k28j89K15k71K19k5J92
7364B44k92l9j79J65m3K71p4k8j19J4L5P0k2P1r0J71k24r0L02r6M1j92K10L0O3
7389A99k33kJ50j65lj77J29P0o5J44M3q1NQ8k06K32j72j84K50J75k8J59p66K37
7413b01P8K2k08N17k66J87j49j7N2J76n5j39q1L1k35N42m38M55j83l80L98k15
7435a09K12r9PK48P5j41p8k30K52k05J26k1O6J06k12k7r7J44K38q7k07J25j8j32
7459f4J89K0J33j69L3j21Np3M2J53l7N9l19O8M54m12J87j75J61q7l49K17J76q7
7483DJ13l15q1M63j35p7j25L02j55k06L36j19K7k13K02j00J32j79K90k48P5J08
7505I9k19j77L25j44j45J27k0K01n1m8J09n1j3J02L5m03L12k9K3J34j51j46O7
$$ y = [-112, 11, -115, 116, -382, -10, -132, -111, -112, 31, 146, -86, 14, 98, -218, 331, 103, -86, 129, -142, 77, 52, 244, -48, -87, -266, -101, -144, 127, 53, 25, -94, -80, -45, 25, 3, 74, -16, 155, -69, -159, 143, 47, 88, -104, 106, 136, 199, -34, -36, 114, -51, -54, -231, -102, -32, -97, 47, 90, 9, 14, 102, -104, 128, -44, -228, 22, 197, 169, 328, -438, -201, -123, -101, -309, 208, -58, 129, -20, -37, 15, 191, 136, -3, -84, -53, -288, 254, -184, 271, 88, -292, 106, -109, 103, 4, 11, 259, 334, 193, 115, -115, 137, -68, 58, 37, 103, 209, -3, -30, -127, 17, 255, 168, -39, 86, 68, -64, 125, 145, 278, 109, 142, 21, 26, -47, -5, 148, 111, 170, -149, -81, 373, -39, 148, -27, 134, 47, -302, -85, 91, 4, 117, -198, -279, 184, 49, -28, -153, 149, -6, -212, 124, 5, 32, -181, 21, -79, 53, -126, 164, -84, -9, 99, -120, -297, 28, -116, -261, -134, -154, 47, -4, -52, 57, 6, -7, 95, 130, -273, 39, 10, 33, 167, 16, -130, -63]
7528f3J11K7j88J36j4j31K45j17ML07k17r4O8m9K52k45P5l23J80k50L96k44m3
7551a77j1M42j86N6k72M7k19J89k37K78m7J93k8mRj54pj32mM53j90o5L65j44j29
7576B6P1k29M6j33M25k50l9J47R5r1p7j47L03k56R2J18k72M9q6L45j93J16k07
7599a47L74m89K06L52m55lK13p6j0J93p2j91j45Q3M6n4K96j20M2q2M0J19J00j03
7623A17k19k0J80m1n1lo4j8J73P3Qk11n1P9j01O1P1m1qj9p7N2J21j43K86j4j51
7650a1j62L0J75n7N4J46j75O1J5k17k13N52l80K22o4K50j90j68m9r9J12J19k26
7673b75J10M26l46k0J45j28L37l59J8l5O8K39k27K44k35K40l29K67j24Q3j09R4
7695H4k23R7O7k86M21l53J49J6J98j38P4n1o2J63r6j38q1Q2P2j7L0k17K53k86
$$ y = [-63, 48, 75, -113, 23, 9, -122, 123, 6, 10, 317, 100, 6, 74, 25, 277, 32, 107, -216, -36, -286, 110, -134, -177, -188, 254, 68, 124, -148, -101, -320, -131, -368, -90, -137, 56, 28, 24, 33, -121, -128, -260, -264, 189, -1, -66, 299, 155, 26, 97, -132, -86, -219, 206, -44, -83, 64, 159, 68, -9, -156, 147, -109, -17, 101, -171, -122, -208, 137, -56, 60, -147, 227, -262, -56, 296, -159, -162, 51, -25, -35, 158, 86, -105, -250, -167, -121, -175, 121, 1, 43, -39, 1, 120, 220, 117, -102, -122, 58, 17, -34, -37, -101, -119, 54, 127, 135, -76, -127, -48, -149, -88, -17, -58, -66, -85, -162, -110, 11, -132, 154, 140, -11, -173, -143, 32, -25, 29, 175, 0, 61, 76, -141, -354, 198, -182, 40, -24, 226, 36, -132, -181, -280, -168, -49, -275, -165, 261, -85, -105, 40, -88, 249, -110, -92, -127, -59, 180, -47, 197, -38, 202, -127, 140, 16, 99, -10, 84, -139, -42, 25, -261, 160, -193, -44, -28, 170, 32, 106, 55, -7, 156, 60, -78, -159, -77, -5, -22, 8, -209, 44, -242]
7719b42j54O06k32J03j86O9J26J4L42l57J20J4k32J09r2K5K38k93l6j02Q0R6J26
7742A42j22j95K87l5J1o2R3j03J07j60R1r5P3j70P7N2M2J05k38J73P3P4l33J11
7766bj9L2j45k59K33J8J89K17j22j42J56q3O7p4j60o0J16P4j36M30n58L89R5j82
7790G4J44n9M9k61K15k03p6J46j50j29K57M0j31R5j54K83l11Q9M4M3m4j71O27
7813D17n37J44J43j57o9j33K72j0j56J01J85j32j41q5L8J16p3Rk5l9o8K15J11
7836A26k13Q8Lj6M27k94j62N3m9K84k98J43l3m98P61l54j73N5J5K92p0J10m00
7859b03K7J2J01Q5J36p8m2L38l80j2n0k20L21r5j95L03J80l43R5Q9L6k63K48k77
7883a87K92l21J80M9K12k0j74j63K46k96L00k15L11m20J83K23j82L59j09m7k42
$$ y = [-242, -396, 210, -22, 81, -105, -36, 90, 104, 446, 89, 209, 223, -9, 100, 8, 33, 271, -22, -58, -160, -80, 16, 142, 20, -175, 112, 77, 88, 26, 119, 16, 123, -37, 54, -41, 32, -138, -61, -9, 33, 138, -100, 73, 146, 220, -113, -2, -21, 11, -134, -393, -160, -142, 47, 264, 142, 0, 156, 73, 140, 66, -94, -154, -38, 36, -100, 330, -228, 161, 256, 74, 218, 159, 208, -53, 162, -41, -117, 29, -121, -250, 7, 47, -84, 11, -143, 140, -171, -82, -38, 5, -39, -210, 417, -120, 24, 167, 10, -59, -192, 80, 70, -86, 15, 200, 68, -73, -158, -120, -4, -77, -68, -93, -132, -200, 15, 126, -87, 1, 4, -12, 415, 121, -41, 12, -37, 247, -51, 92, 59, -439, 322, -32, -205, -150, -135, 157, 87, 197, -203, -176, -164, -63, 22, 158, 80, 38, 376, -4, -16, -66, -286, 35, -60, -255, 48, 228, -115, -20, 69, 105, -158, 90, -187, 105, -216, -36, 13, 225, 205, 31, -132, 114, -182, 118, -97, 214, -206, -23, 200, 18, 377, 268, 221, -21]
7904b1L05l44R9K14k44J63o7m29J74K02k7j44K09m69O03l57O3R7p2n0K21n9k22
7927a55r5M59k44M2K4r9J24k69q3J83K00j89J56N0m70M94j79J47r8O6q6Qn4O4
7951dN1M4K4j75j03M21m12k3M32j50j45q6J34j84L49k58L14m77K07J17K6j35J09
7974G6j28K30k01L26l16K56l12J33r8K09j26k37K6Q6n9L8J65j25K7M3j3K26J1
7997B37r0n4j67j25P1K30j08M7j59J80j78P4j48J01n4L02k28M2J92p4k28J83L22
8020C68l09L9R6j31M4j26J22k30J35qRn2J51p3j34L58m47J82M3O9P8k39M9OR4
8045I4L7jp4r1k2K55k87K46k54n6L49k14nj50L31N7j12o4K1LR8m90L78N0N5m16
8071b62J26O0L31j84k52K12j09J55J25l35J07Qk21o2M28j91J51l01J25P1J21r8
$$ y = [-21, 284, -60, 39, 253, 9, 172, 105, -324, -150, 52, 25, -119, 90, -379, 224, -133, -70, 27, -45, -95, 126, 67, -155, -250, 209, -35, 7, 31, -68, 56, -213, -296, -113, 87, -102, 54, 104, -366, 128, -51, 96, -2, 64, -22, -14, -68, -4, 47, 91, 115, -60, -163, 258, -154, -177, 255, 105, -40, -126, 8, -176, 173, -85, 229, -248, -41, 76, 102, -33, 76, -52, 178, -23, 303, -13, 243, -69, 64, -34, 175, 49, -188, -162, -76, -135, -97, 68, -57, -30, 13, 0, 226, 237, 147, 93, -74, -199, -128, 102, -6, 41, -118, 62, -116, -42, -190, -89, -143, 159, -69, -27, 165, 91, -137, 46, 368, 59, 98, 194, 63, 107, -19, 103, -127, 8, 0, 9, -43, 108, 35, -99, 259, -188, -6, 37, 106, 184, -55, -6, 0, 94, 131, 130, 56, -35, -57, 198, -89, 157, -97, -153, 196, -18, -23, -173, 158, 215, 103, 39, 60, 63, 161, -329, 49, 99, 154, -262, -136, -76, 255, 71, -181, 31, -78, 77, 202, -133, -26, -18, -239, -301, 127, -64, 87, -214, -89, -18, 103, 5]
8093ER7k77qL6k5J75N4q3J35P5k73j46L32j5m3J7K98l04J8Oj93j4J4L09k61J42
8119G1p2L58l50L74k89k18j00L41j36K62k78J51j61P6k76J48J24k50K33J97l35
8140a30J32j39K52n4P7r0K42l60M6J29R1j30J19q6j37J5J00Q8l51K81j22P2j71
8163a26J20M3J24l62J67K04k11l39L91j64J26O5j33lJ87J1LL0k9o5j5K8n2J17
8187A17R7q8m43K08
$$ y = [5, 102, -175, -183, -147, -172, 3, 57, -26, 109, 184, -89, -235, 97, 82, 39, 56, 354, 50, 68, 74, -119, -133, -119, 190, -71, 71, -1, 357, 7, 381, 92, -126, -226, 115, -21, 241, -37, 114, -47, 29, -247, -99, 25, -225, 8, 205, -130, 2, -137, 115, 61, 138, 48, 290, -70, -24, 105, 196, 66, 185, 99, -38, -23, 77, 165, -186, 95, -27, 45, -126, -6, 37, 161, -201, -34, 170, -41, -380, 11, -153, -27, 38, -95, -98, 89, 100, 103, 133, 104, 39, 24, 52, 0, 117, 214, 126, -317, -109]
8191a09
$$ Imaginary data points
##PAGE= N=2
##DATA TABLE= (X++(I..I)), XYDATA
0@%%%%%%%%%%%qJ6j6K3l1L2m0M9n7P2q8J04j21J45j69J94k26K62l03L46l97M52
33B39n10N77o50P33q22R19j029J146j274J414j565J733j915K114k334K574k837
50a487L124l441L793m183M621n114N670o304P039p902Q929j0180J1737j3741J6434
65H995k0263K6187l6680O0866k23458p3176L30903O1239N5244L0006p099j43165
77F9599j38634j33765o2954K3639J63921J93290J13322j7660m0190o3910j36953
88c0295j72553n2162O4303J09883J23002J29257N4708l6994r1827j15760j27308
99a45746p3701J5686Q3975J23336J42872Q8239k6067j09496j17594r9545p3529
110a91570j9478O7725J39050J38808P2720l69p2456j41252j35090m3648K0970
$$ y = [0, 0, 0, 0, 0, 0, 0, 0, 0, 0, 0, 0, -8, 8, -8, 15, -16, 16, -24, 25, -32, 40, -48, 56, -65, 80, -89, 105, -121, 141, -162, 184, -213, 239, -271, 306, -344, 389, -433, 486, -543, 603, -671, 743, -822, 911, -1004, 1110, -1224, 1350, -1487, 1637, -1804, 1989, -2194, 2427, -2687, 2983, -3321, 3718, -4184, 4745, -5435, 6302, -7439, 8995, -11268, 14919, -21761, 39105, -184353, -257529, 73374, 134613, 189857, 219863, 212764, 69599, -69035, -202800, -265754, -242115, -78194, 115096, 228418, 210758, 170568, 106658, -30295, -202848, -255010, -190707, -80824, 42178, 171435, 226143, 189149, 97322, -18438, -145746, -219447, -203761, -119786, 3550, 146422, 234661, 208594, 99098, -18496, -118041, -191570, -211048, -143323, -4273, 134535, 207255, 206886, 134430, -6822, -141912, -185560, -164590]
121a64590L6808Q6486J40552J02967L915p6242j18483j21108p2924L374O8197
132a11048R3010Q4888P7662N0075m0796j28009j20572n5443p988L2039P5774R4276
144D3868Q8005N6079k4486j14081j29706o8022j660K9582N3860Q9667J02084N4804
156A79994k4999q5902j12174r6901l2263M0516P3886Q0469Q9400O2132k1490r1319
168F1349r6390p3607m8056P094P8708J05541P6780L0179j1689n3016q6341q8862
180i8310m9503J0172N9085Q9323Q8195M0100j7729m6462o5083q3758o3785j546
192a39301N2930P9907Q3870N3716M49m3663p1049q0219o2087j5735M0763Q3654
204a6765Q7322N4162Q825l7080p6582q2589n1978j4553K4238P2023R4992O3956
$$ y = [-164590, -127782, -41296, 99256, 202223, 206138, 129896, 11413, -109695, -182619, -179245, -111048, -18038, 66850, 144512, 194587, 153791, 25782, -94790, -150233, -158221, -126182, -50408, 43868, 131873, 187952, 163466, 49385, -80321, -148343, -150003, -120421, -66561, 23106, 125190, 179994, 154995, 69093, -43081, -139982, -172245, -131729, -57843, 22626, 112026, 174158, 152668, 61349, -35041, -108648, -156704, -149610, -70902, 34639, 111419, 141598, 129909, 76893, -9448, -98310, -147813, -137641, -78556, 10767, 98962, 139062, 121333, 74871, 9788, -73970, -137755, -139301, -86371, -6464, 77406, 131122, 131571, 87908, 16859, -63360, -125447, -141182, -100419, -16765, 70557, 124719, 133544, 96464, 19882, -62707, -114685, -129238, -105000, -32977, 62015, 125971]
216A25971N647m1225o7792p4102n3832j7415K3221O1409Q2216O6109J8435l4643
228I3999o6168o7275n0544k5105J3384N6847P5177O0244K8066j4784n8450p3961
240b8570n6064k6615Q043M8984P2338O3104L2477o119m7778p5435o9685l1656
252a16976J4290M9313O3438O1968M1844l277m9880p1258o4653l7779O932N0336
264e5702O5110N5352L6277M696l9070o8939o6591l5499N259L9686N9808N7367
276E7754L4753K786k8613n3018o2717m7358q097L5787N9811N8616L8727P410k5175
289G0666m9218n8396m9918j8541K6737N8713O2089M3172J2277k2023m7813n8399
301c0654n1493k2366K1092N7555O4597M3582J1764j8832m4360n7808m9659j9921
$$ y = [125971, 131618, 90393, 22601, -51501, -105333, -122748, -99527, -38118, 44098, 110207, 128642, 93999, 27831, -39444, -89988, -115093, -101709, -44862, 30315, 90559, 118625, 103841, 45391, -28570, -84634, -111249, -103206, -54222, 18116, 81220, 113697, 107578, 59800, -15635, -85320, -116976, -102686, -53373, 10065, 72033, 113877, 110600, 60720, -10538, -75191, -112970, -106038, -55702, 9408, 64760, 101037, 105733, 66663, -2276, -68867, -104366, -99107, -59421, 387, 57754, 92507, 95293, 66680, 13662, -49055, -96413, -104510, -68723, -8912, 49704, 88431, 95841, 70666, 21448, -36948, -86866, -105407, -78670, -19957, 42132, 85304, 97581, 75558, 27745, -30654, -82147, -104513, -83421, -25866, 38731, 82313, 94077, 75245, 30885, -26923, -76582, -96503]
313i6503J6418M6599O0466N0171J6321k1022m1284m8645m5711k6831R466M0881
325c9674N4089M9640K6675j0915m2963n0670m0592k4280j410K9108N3653N3823
337E6484L0434l640l4912n2942m9636k7388K040K7525M7727N3878L6387j9l4671
350E1267n1615m9119l0223l33K7873M4939M9366L6516O317k8682n1032n1408l0566
363g6700N98K6880L9986M2830L4248J1091j9989m4186n0716l5462m578K3295L8739
376a3964M1438L3451J4086j2945l7389n0276m1408j2494J9664L9930M3792L4502
388E8387J4560r454l2596m7993m4114j8749J3705L9518M8494L7551J2765j0914
400F1160k9846m4001m2773k0474J0343L4705M6705L9245J5497j0408k8756l9632
$$ y = [-96503, -80085, -33486, 26980, 77151, 93472, 72450, 31166, -17479, -63190, -90021, -80555, -39674, 14415, 64055, 90730, 79815, 36852, -13818, -54410, -78690, -80100, -50992, 2661, 56484, 86918, 83278, 48366, -4576, -54212, -81600, -79560, -52035, -4308, 49570, 85957, 85938, 51267, -348, -49467, -79690, -80023, -52150, -7211, 42155, 78671, 84988, 56306, 5274, -46134, -76700, -76102, -49222, -9236, 33594, 67842, 78933, 58944, 14758, -35958, -71420, -75998, -52703, -13964, 27474, 60925, 75011, 62066, 24677, -25599, -67007, -79501, -59837, -19907, 23885, 58387, 72947, 63493, 30897, -17096, -61210, -79959, -66254, -26736, 21758, 59309, 72074, 61160, 31314, -12687, -55460, -75934, -65591, -30886, 15819, 55064, 70561, 60153, 31397, -8235]
412h235l8468k1837L077K8381M4323M0555J9825n713k6716l9079l5534k1089k620
425f3130J8912L9579M3945K7114J97k5348m0429l6843k1698m938J5149L6094M3786
438C2390L1823O765k3518m3230m0252k2114l996J5583L2843M0172L3024J0800
450G0290k0641m1199l8900k4935o630J5453L2791L6390K9205J2623j4327l5399
462A4721l7733k7759r381J2905K8855L3974L0920J5323j0647k9486l5460l1744
474d5512j6088R847K8748L4578L0163J6586m653k3919l6187l7296j9009Q571K7063
487b7108L4576L2827J7409m710k1394l3026l6917k2517M118K6461L6928L2438
499C9085J3555l407j5609k9712l7623k3996K684K1912L4173L3040J5741j930j3538
$$ y = [-8235, -46703, -68540, -65463, -37082, 7241, 47796, 67621, 61908, 35192, -3887, -39421, -60510, -63130, -44218, -4639, 39306, 66420, 66617, 41269, 840, -36003, -57701, -62639, -47490, -11396, 32390, 64213, 70978, 47460, 4230, -36022, -58136, -62132, -46549, -13706, 26466, 59490, 70290, 49649, 8450, -30450, -55385, -62015, -46562, -13771, 22619, 51824, 64447, 50120, 14721, -23012, -50771, -60152, -47247, -18392, 15582, 46502, 61825, 51178, 21692, -13768, -45512, -61600, -51753, -23005, 11573, 41736, 58322, 53669, 29750, -6437, -43733, -62742, -54171, -27108, 7468, 40295, 57704, 52994, 31600, -1426, -38343, -60860, -56742, -30281, 6647, 39085, 52640, 49233, 33624, 3912, -33711, -57707, -55023, -33111, 1062, 34102, 49843, 47913, 34375]
512C4375k6690l2341k4528o948J5085L5519L6203J6314Jr655k4330l2514k5495
525d5004j0012J0996L1864L5490K2678O982j1454k9354l1239k1817j2111O836
537d6145L0232L5698K3604R354q456k7962l3463k4570j0062R635K6138K8623K3812
550C6438J5050n461k8044l1586k3001j1670N796K2600K7276K5082J6614m182k3440
563B1472k8174k4377j6082L598K0215K4234K6154K1876j86k3157k9475k5064j5500
576d4466J548J4387K3031L0678K4235j249k0249k6281k8019j9225K044J6324K0935
589f307K7201K3284L248j6049k6428k9981j8101J539J2712K0084K7652K0838L487
602D3179j0437k2123k9118k1183k339J0194K0618K6154J9956O362o014j9401k9286
$$ y = [34375, 7685, -24656, -49184, -56132, -41047, -5528, 30675, 46989, 46990, 37335, 13005, -19509, -45004, -55016, -44020, -12156, 23334, 46012, 52994, 41540, 12186, -19053, -40870, -52981, -46145, -15913, 19785, 43389, 52743, 44287, 16325, -17138, -41708, -51770, -42135, -15997, 12626, 36438, 51488, 46027, 17983, -13603, -36604, -48274, -42478, -19878, 7398, 32480, 49094, 44912, 21472, -6702, -31079, -47161, -43563, -23348, 886, 27040, 48916, 48730, 25573, -3902, -28966, -44466, -42918, -28531, -5500, 25178, 49413, 48164, 27915, 1634, -26385, -45610, -43566, -27242, -6307, 20894, 44178, 47426, 31377, 4949, -25032, -43133, -41594, -28882, -8798, 18854, 39692, 43179, 32742, 10619, -18499, -39682, -42021, -31827, -11209, 14945, 34901, 41263, 35249, 15848, -13438]
615a3438k2039o242O429J8842K7587K2704Q134n936j8772k6842k1639j0273K286
628c9199J9978K9157K2135R056l528j8362k7579k0900j0105J189J7056K7165K2522
641B8585J1505k744j7924k3552k0740j3388p5J7882K4009J9189J2768J674j4610
654B2579k2158k0498j6454k946J6293K3302K0176J3906K488j1668k0226k1651
666a6857j7712n063J2049K2232K3455J6539K612j1082j8437k2305j8931m348J0317
679b7531J8132K3072K0356M753j2274j8919k0372j7450n913Q443J7241K1245J8945
692B9728O667p736j7908k1433j7249n990N499J4874K1526J8988O938n316j3331
705A5257k1146j9456p839L455J3315K1090J9199Q776k362j2191k0905k0235j0178
$$ y = [-13438, -35477, -41719, -35290, -16448, 11139, 33843, 41977, 36041, 17269, -9573, -31212, -41485, -39199, -19221, 9936, 32071, 41127, 37599, 19237, -8342, -29242, -39347, -38158, -21102, 6063, 28585, 40090, 37346, 19422, -4130, -24870, -38258, -38333, -20451, 3558, 22747, 35515, 37189, 22579, 421, -20077, -36531, -39477, -23184, 118, 20294, 34200, 36688, 25020, 4794, -16857, -34569, -39632, -27583, -5351, 18104, 34643, 37255, 26173, 7736, -14569, -33500, -37848, -27531, -9399, 13673, 34029, 38782, 26508, 7589, -12783, -30233, -36146, -27703, -10462, 10783, 29728, 36395, 28659, 10751, -10682, -27931, -33921, -28422, -13548, 7978, 26966, 33904, 28588, 15257, -5889, -25345, -33184, -29729, -16414, 4676, 23875, 32651, 30289, 18098, -2807, -23042, -33220]
718c3220J672J3585K1067J8801R782n21j1567k0766j9706j1443Q5J2880K1048
731A697J8499J0160N37j0863j9456j8663j1496j390J0408J8347J8756J2417J736
744C0689j0117j7623j7482j1928l781Q176J7455J7880J2724M593p513j6938j8130
757a1995j3488m973O646J6086J8448J4372N565o436j4820j8277j5476o521N739
770b5130J5544J7836J5307P002n874j4169j7651j5559p130N263J4004J6553J4720
783B0716Q152l729j3092j7585j5228o965K878J2502J6422J4245Q233j232j0683
796A4634j6442j5878q800J350J0197J5256J5627J0146k32j0053j5412j5527j0272
809b5406j024R552J5269J6282J1104Q62r510j5308j5712j0808j597Q479J4833
$$ y = [-33220, -31548, -17963, 3104, 21905, 31687, 31166, 19599, -1167, -20873, -32316, -32231, -19351, 1697, 20196, 30356, 30893, 20030, 574, -18089, -29585, -30975, -20567, -2220, 16536, 28953, 30689, 20572, 2949, -14533, -26461, -30242, -22066, -4611, 13269, 25993, 30586, 23073, 6135, -11995, -25483, -30456, -23810, -7724, 10724, 25096, 30661, 24225, 9405, -8872, -24348, -30869, -25130, -9586, 8250, 23557, 30559, 24685, 10516, -7135, -22694, -29824, -24561, -10557, 5996, 20716, 28868, 25139, 12047, -5538, -20766, -27731, -24853, -12351, 4071, 18316, 26549, 25317, 14634, -1808, -17686, -26486, -25136, -14939, 317, 15944, 26090, 25858, 15805, 393, -15134, -25406, -26430, -16878, -1609, 14673, 25777, 26639, 17129, 1821, -13891, -24699, -26296, -17817, -2984]
822b984J6329J0391K160p807j4402j5950j1229k055P125J3712J5198J1650K920
835B5058o693j2966j4508j1881l860N916J2790J4273J1861M563m760j2375j5032
848g614j1566m714L596J0954J4996J3270N749l884j1080j5033j3187n793L384
861b0922J0235J4427J3462O952k498j1024j4225j3246o471K297R713J3757J3559
874A6016P117j946r805j3702j2566p166J329Q389J2956J2912Q284l96q066j3126
888B30j3132q113J70P267J1548J3090R184J160o611j1889j3649r165j322O060
902a5172J1610J3284R399J841n070j1391j3696j0159k348N643J1488J3747R293
915A8469K365m263j1301j3394r496l393M329J0659J3641R321K954l685r477j2640
$$ y = [-2984, 13345, 23736, 25896, 18089, 3687, -12263, -23492, -25547, -18422, -4710, 10488, 22138, 25058, 18365, 5399, -9109, -20990, -24850, -18934, -6144, 8129, 19990, 24553, 19793, 7418, -7614, -19180, -23894, -20298, -9344, 5652, 18922, 24671, 20787, 9707, -5326, -18513, -24306, -20922, -10687, 3740, 17202, 24154, 21656, 10632, -3593, -16839, -23310, -21013, -11300, 2457, 16016, 23133, 21187, 11382, -2320, -14886, -22052, -20723, -12334, 622, 13534, 21818, 21422, 13356, 230, -12902, -21015, -20845, -13578, -2030, 11060, 20244, 21404, 14793, 2904, -10745, -19910, -21232, -15172, -3562, 9722, 19121, 20962, 15892, 4501, -9195, -19354, -21702, -16059, -4571, 9176, 18469, 20834, 16571, 5270, -8124, -17620, -21013, -16684, -6025, 7616, 16937, 19891, 16206, 6729, -5911]
929e911j0184m081L281J0122J2400R182M134k209q613j1917j0366n514J573R313
943h790J2644J0125M693j240q331j1112j0147p364L41Q984J2214J0383O590n35
957A8455q029j1266j0178p097o42P486J1732J0943P056k40p697r846j0432q147
971a7902k97O576J0431J0869P675L60o253r679j0104q334n56N289P777J0878R843
986A6573J787o093q304j0425q985j863M316Q062J0322R233K796k897q274j2227
1000e979r165j705L043P318J1236R961K595l079p830j1084r045k457J661O626
1014g904J1662R501L371j590p443j1820q271k419J019N734R817Q696N531J75p227
1029H832j1856q376k981l50N964R767Q069M700K310n385j0968r500n833j25O664
$$ y = [-5911, -16095, -20176, -16895, -6773, 5627, 14809, 18943, 16734, 8121, -3796, -14162, -19676, -18103, -8790, 3854, 13979, 18672, 17432, 9101, -2011, -12158, -19522, -19181, -10197, 2017, 12400, 18990, 18455, 10426, -840, -11018, -18115, -18757, -11271, 461, 11404, 18460, 18220, 10523, 677, -9755, -17902, -18199, -11623, -1192, 9677, 17352, 17712, 11459, 1780, -8324, -16658, -17214, -11925, -4148, 6730, 16573, 18360, 12267, 3963, -6462, -15447, -17310, -12994, -4932, 5390, 14623, 17419, 14522, 6248, -5979, -15144, -16849, -13806, -6488, 4748, 14709, 17304, 14225, 6395, -4689, -13734, -16191, -14530, -7904, 3758, 13259, 16630, 15040, 7597, -4223, -12494, -14913, -13894, -8160, 1657, 10353, 15884, 16059, 8832, -3024, -11400, -14381, -14731, -8767, 1000, 9069, 13769, 16079, 10694, -274, -9774, -15607, -15732, -9068]
1044i068R672P340N871K082n241r760q275p180k528O148J0648Q075N618J769m936
1059A0235q166p721p551l038N485Q576Q471P325K068n965p366o924p116l888M168
1074a1407P395Q053Q758K564m653o615p169q209l571L771N512P591R098L965l413
1089A1670n987p979r056k840K569N059Q481Q994L222k140m657q396r815l641K359
1104a2157M981Q783Q718L037j738l717q022r238l496L81L681Q975R038L200n62
1119A1864l712q044p709l691o24K546Q216Q567M291J211l055q986q385l436j093
1134a2040K486P688P418N114K894k616q645q369n070k407L681Q084O736M520L043
1149A2517j797p345p447n903l509K686Q258O676N249K993k597o144n993o466m286
$$ y = [-9068, 604, 7944, 13815, 15897, 10656, 896, -7379, -14559, -17087, -10939, -291, 7784, 13402, 15171, 10235, 2069, -5652, -13203, -16241, -10756, -2180, 6291, 13616, 15684, 9719, 2353, -4571, -11687, -15575, -11407, -4012, 4041, 12799, 15363, 10710, 4095, -3074, -11283, -14854, -11083, -5571, 2020, 11118, 15083, 11670, 5683, -2296, -11352, -14192, -11623, -6564, 1917, 10911, 14133, 11993, 7336, -1060, -10875, -14516, -12157, -7176, 1607, 10325, 13362, 11624, 7907, -115, -9353, -12849, -12468, -8787, 188, 9226, 12426, 11864, 8152, 108, -7601, -11292, -11916, -9370, -1154, 7413, 11704, 12915, 9860, 874, -7511, -10947, -12040, -9554, -1866, 5552, 10666, 13560, 10944, 2299, -6070, -11140, -13547, -9866, -1782, 4954, 9474, 12517, 10720, 3375, -4072, -9975, -13484, -10798, -2540, 4136, 9385, 12378, 9781, 3637, -2356, -8822, -13108]
1164a3108K346O471P045O551L340k695n908n597o373m009J198N192O011P597M611
1179A2672j984n397n774p011m149J102M038O456P250M746j038m337o387p418m328
1194a1559J150L667N832P637M475n71l338o505p286m611O89L238N686P088M771
1209A0363J64k484n722p458m477o99K318N546P429M193J179j830o252o604l999
1224h333j645Q85N555P220N017J751j275n738p247m609j862J266N534N997N136
1239G652K773o94n758o792m677l006J301N573N833M698K701j59m480o713n037
1254f785l386P27M850O174M772L333p87l777n389n848l540J57L962N841M965M520
1270I789k96m145m785n487l928q18L512N319N715M149L48l233n012n684m135q26
$$ y = [-13108, -10762, -4291, 2754, 9305, 12645, 9950, 4042, -1555, -7928, -11937, -10739, -5547, 464, 8061, 12672, 10688, 5291, -483, -7494, -11643, -10541, -6503, -47, 7203, 11949, 10911, 6574, 187, -7231, -11559, -10409, -6742, -910, 6727, 11202, 10631, 7293, 788, -6498, -11109, -10420, -7182, -1496, 5592, 10363, 10527, 8043, 2321, -5137, -9614, -10313, -7995, -2449, 4980, 9173, 10352, 8522, 2270, -4334, -8333, -9978, -9093, -3538, 3682, 8699, 10450, 9175, 3437, -3810, -8419, -10281, -9015, -3481, 2516, 7652, 10425, 9731, 3973, -2819, -7496, -10502, -9201, -3628, 2205, 6903, 9604, 9445, 4965, -1748, -6785, -10171, -9444, -4594, 1580, 6352, 9685, 8898, 5121, -268, -6116, -9656, -9499, -5537, 304, 5269, 9789, 9493, 5348, 563, -4924, -8852, -9670, -6158, -839, 4876, 9025, 9373, 6140, 1128, -4556, -8691, -9517]
1286i517K972M886O185M409M07l111m664n368m205j375K550M805N714M578J056
1301I322k712m418n448m255j194J834M153N354M487J658j622m144n180m803j698
1316h666J365L792N473N047J613j138l599n353n028k507J431L617N096N057K498
1331H698p56l968m983m880k178K53L678N026M681K580m59l020n275n105k646P19
1347g635L110M952M318K855P8k680m498n186l216J46K605M612M469L511K28k319
1363E350m058m821l629p42K275M324M954L385P79k214l769n276l438j044J982
1378e942M289M597L797J003k050l452n060l752j237J599M176M574L814J147j410
1393F093l685m273m002j606J006L583M741M041J387j248l151m009m021j827O71
$$ y = [-9517, -6545, -1659, 4526, 8935, 9342, 6231, 1567, -3801, -8006, -9381, -6831, -2026, 3688, 8266, 9322, 6610, 2192, -3256, -7511, -8705, -6871, -2718, 2636, 7123, 8781, 7159, 3015, -2165, -6968, -8666, -7301, -3509, 1964, 7011, 8624, 7486, 3887, -1466, -6494, -9001, -7570, -3953, 1143, 6200, 8698, 7942, 3974, -1009, -5889, -8067, -7814, -4136, 890, 5571, 8151, 7692, 4672, -603, -5708, -8354, -7635, -4525, 427, 4745, 7600, 7678, 4998, 500, -4686, -7902, -7756, -5151, -539, 3930, 7441, 7669, 5350, 1292, -3529, -7158, -7900, -5625, -1301, 3653, 7038, 7817, 5603, 1834, -3442, -6880, -7924, -5942, -1653, 2944, 6741, 7744, 5694, 2242, -2818, -6570, -7807, -6208, -2032, 2542, 6356, 7503, 6093, 2408, -1865, -5867, -7473, -6467, -2884, 1857, 5898, 7285, 6037, 2886, -1123, -5144, -6971, -6300]
1408f300K719M688M100J738m43k749m688m055j846L02K457M513M124K344q7k785
1424D032m268m324k191j27K300M407M262K396J74k071m272m078k605k88K233L779
1440f41M024K562O08j959l945l888k577r59J981L826L607K992J140j574l952m045
1456b800k718j105J607L214L861L218J866j780l739l479l278j369J255L035L716
1471A504L509J668j257l458l644l337j614J716K805K946L917J765j261k303l578
1486f22l910k223J087K702L676L442J520n66j776l112m210k067M24K040L519M355
1502D279J464o22j650l367l404k250q9J494L626M266J982j56j392l864l788j528
1518d999m1Q81K990M045J997Q50r06l934l757j938p61J036L701L530J377J234
$$ y = [-6300, -3581, 1107, 5207, 6945, 6502, 3753, -935, -4990, -6836, -6534, -4077, 436, 4560, 6904, 6817, 4032, -236, -4560, -6751, -6878, -4578, -171, 4091, 6487, 6661, 4590, 318, -3760, -6365, -6653, -4420, -641, 3383, 5945, 6553, 4594, 649, -3239, -5816, -6775, -4794, -968, 2639, 5631, 6771, 5197, 1245, -2800, -5518, -6623, -5016, -1802, 2059, 5277, 7143, 5363, 1624, -1855, -5133, -6502, -5247, -2212, 1504, 5013, 6681, 5424, 1966, -1678, -5015, -6629, -4913, -2108, 838, 4755, 6520, 5259, 2956, -622, -4532, -6755, -5668, -2966, 710, 4152, 5672, 5106, 3330, 218, -3992, -6059, -5635, -3595, -76, 4279, 5743, 5121, 3471, 104, -3300, -5550, -5639, -4145, -519, 3747, 5729, 5573, 4181, 317, -3471, -4999, -5040, -4159, -1169, 2876, 4873, 5723, 4817, 883, -2874, -4812, -5573, -4537, -836, 2694, 4071, 5305]
1534E305n16l468l825j774j452P36M116K919J646J638o81l115l017j987k424P65
1550e134L475L001K200K176r47l115k406k576k353N50K963K954K782K205q60l267
1566A648j959k979k282Q61K347K221L369K641o05l133k389l121k340J289K211
1581b221J716L173K633n84j591j998m032k497Q39J887K045L363J625l52q37j406
1597A763l988k688K92R99K556L826K207q40r81j720l181k330k64J52K290M357
1613B450K075l0n68k503l841j470L18l83J934L600J884J066k03k508l875j703
1629c757n54K98K307K812J874R73Q01k428l865j807r63l49K744K962J793J287
1645D128L97k092k846j984j956o90K563L224J749J393L45k354k040j866j894o88
$$ y = [5305, 4789, 1321, -2504, -4278, -5730, -4994, -878, 2041, 3687, 5325, 4644, 1529, -1488, -3475, -5899, -5134, -1659, 1342, 3542, 5718, 4771, 1656, -750, -3326, -5679, -5129, -2166, 788, 3570, 5775, 4915, 1648, -311, -3290, -5572, -4711, -2364, -143, 3226, 5867, 5262, 2129, -260, -3381, -5721, -4432, -2221, -505, 2668, 5301, 4717, 3126, 1128, -2904, -5401, -4562, -2675, -630, 2733, 4358, 4006, 3169, 1763, -2225, -4913, -4621, -3622, -1066, 2760, 4967, 4127, 3146, 1426, -1755, -4085, -4349, -4197, -1907, 2450, 4525, 4495, 3927, 1424, -2417, -3887, -3569, -3952, -2018, 1582, 3466, 4532, 4329, 1821, -2054, -3757, -4311, -4013, -1706, 1106, 2980, 3953, 4754, 2326, -1539, -3346, -4309, -4658, -1914, 1048, 2841, 4128, 4525, 2433, -413, -2397, -4353, -5043, -2480, 744, 2493, 3886, 4231, 1877, -163, -2029, -3923, -4611]
1661d611K393K275J875K567P5k460k233k052j923j05K050J756J859K513N57k171
1677B365j460k747k509L00J480J601K335K519M48j075k004k712k384j05J332J447
1693a169K470J989J60n48r70k760k915n77J096J660K868K110O1n53j316k200k331
1710b925p70L01J313L128K310L89p39j060k660j886o58k94J435K515K483O19n7
1727C444j639k485j588p97m39J293K352K199J145J09j350k369j955q24r95J524
1743b375K295J685J796L24j318k340j584j716m07J018K121J918J861N10j161k271
1759C56j706j822o85J395J473K274J534J189j382j606k294j632p73J008J834J573
1775G36J940R11q05j709j908j609r48R48J571J273J990J143r25j158j976k674
$$ y = [-4611, -2218, 57, 1932, 4499, 4574, 2114, -119, -2171, -4094, -4199, -2149, -393, 1466, 3979, 4536, 2365, 905, -1842, -4351, -4051, -2571, -970, 1365, 3884, 4332, 3257, 1253, -1459, -3843, -3948, -2616, -1169, 1301, 3290, 3450, 2902, 1932, -828, -3743, -4320, -3224, -1564, 1304, 3414, 3475, 2922, 1606, -594, -2925, -3695, -3394, -2081, 1047, 3357, 3746, 3007, 1947, -713, -2599, -3257, -3551, -2116, 399, 2882, 3501, 3444, 1805, -680, -2268, -3065, -3504, -2211, 141, 2340, 3485, 3594, 2244, -125, -2080, -2904, -3899, -2375, -80, 1605, 3401, 3725, 2407, 67, -1517, -3233, -3640, -2622, -501, 1417, 3278, 3788, 2627, 356, -1350, -3172, -3857, -2462, -989, 1285, 2819, 4008, 2626, 1020, -1274, -2906, -3679, -2671, -837, 736, 2676, 3587, 2782, 1073, -835, -2444, -3392, -2444, -873, 400, 2390, 3533, 2608, 1450, -526, -3200]
1791c200m33J274J068K040J675N73O5j304k003k244j069M30J426K527J578O71
1807C074l18r59j571k219r44j0R30K186K166P40n39p09j626j757j281k46P58K104
1825b21K064J152k16r01j414j840j135p76J119J777J905J379l3r12j379j570j274
1842b275n40L10J443K303J433L68p91j878j452j010n59K36J186K036J641J080
1858C531r99j803j830j259K19J34O58J591J631J324J10k407j740j160m65M67J163
1875h35Q39J543J012M15j335k459j243o39N55P62J648J141Q80L14n81k012k007
1892b002r02N09R22J389J320R31K69j89j674k187j350J27J369J586J037N86K66
1909B007n1j031j864j534m75R69K116J235Q73m39p8q07j426j321j026L54J861
$$ y = [-3200, -3633, -2359, -1291, 749, 2424, 2997, 3062, 1758, -245, -2489, -3558, -3128, -1702, 825, 2403, 3074, 2756, 1797, 226, -1993, -2937, -2947, -2017, 169, 2335, 3075, 2536, 1827, 201, -1556, -2837, -3083, -2325, -221, 1843, 2995, 2779, 1878, 464, -1376, -2511, -3287, -2168, -391, 1514, 2893, 2860, 1948, 569, -1001, -2275, -2815, -2505, -1062, 1241, 2674, 3042, 2251, 373, -1079, -2089, -2648, -2412, -1226, 810, 2451, 3531, 2532, 729, -1101, -2360, -2141, -2007, -1349, 242, 1873, 3197, 3307, 900, -840, -2000, -2465, -1998, -835, 4, 1547, 2559, 2974, 1639, -820, -2063, -2702, -2147, -1385, 263, 1404, 2284, 2598, 2017, 5, -2002, -2904, -2395, -1473, -84, 1236, 2167, 2436, 2247, 573, -1614, -2964, -2837, -1468, 118, 1155, 1741, 2007, 1956, 925, -939, -2473, -2948, -1979, 137, 1372, 2245, 1806, 1728, 921, -505, -1826, -2852, -2498, -637]
1926f37J961R96J61q87q50j083j331r25l1J565K184R44L92p25j313q36j025r50
1944b390l55J372K061J792L18r48j353j217k43o72p14J049J297J800J425q31j530
1961H61j392q64k22l38O26N39J663J939J22j893j522j134m37M40P03O15Q04J590
1979B100O39r49j760j726n20M56J173M94O03J364O47m78j335k240j113P50J001
1996h94N70Q94Q27N33J62o30k314j677N16Q34R17R16M99K31M59n47j785j489n57
2015b535N69J462J872K17n31N44k30j640j443o41j12J486K116K08j99O7q7q71
2033B52j059j193q20J406K405Q84l63j10j185n09n3r21j439Q55K324J521M1j97
2051A839j690q27K71o81j074J69J132J696J981m45k003j345L12k52n32J07K34
$$ y = [-637, 1324, 2320, 2481, 1594, 744, -339, -1670, -2595, -2626, -1061, 1123, 2067, 2459, 1734, 421, -415, -1440, -2390, -2745, -1373, 688, 2480, 2798, 1850, 497, -720, -963, -1635, -2349, -1300, -3, 1797, 3222, 2391, 861, -531, -1395, -1617, -1955, -1329, -790, 873, 2812, 2934, 1041, -481, -1615, -2052, -1612, -909, -294, 510, 2100, 2739, 1790, 30, -1696, -2216, -1760, -587, -93, 510, 1874, 2521, 2043, 708, -1532, -2645, -1895, -894, -324, 570, 1397, 1930, 2092, 1462, -852, -2529, -2013, -1179, -262, 654, 1153, 1384, 1843, 1296, -489, -1978, -2535, -1966, -504, 1368, 1585, 1054, 1598, 1368, -272, -1715, -2356, -2468, -982, 1134, 1342, 1143, 1210, 1123, 252, -807, -2000, -2820, -1414, 991, 1875, 1512, 1402, 217, -292, -345, -1266, -2705, -1850, 474, 1995, 2036, 1839, 149, -678, -407, -1088, -2162, -1993, -861, 835, 2816, 2371, 368, -977, -665, -917, -1449, -1342, -1108]
2068a108J270J719J101j826j891k95n31L45L30Q2Q76J786P50j304n89j943q85
2085b113L87P22N09K52J740M55n2q17j795j528P43P94P1O54R78N33J50l32k059
2104g08j379M76Q16L39K90J146J39K71M52k007j768j11P28O76J268J97m74J026
2122A377M66j390j654q01R9J158J862Pn09M17L87r21j105j135q52J022K533O46
2140A607n93R3m62k53j6j282j642K02K369J193K98l70n54r41O11k39j813k36J362
2159f66J250J441J74j486j501M81J18j016k67j4J324K022P71j378j805k87j15
2176i54j6J29l61L44K062J266j071j240o68p70r2R14j59j91J418J189j55j007
2194F38j043j310N35P71j32j42J244O96K81N4j551j689K96N10N03J28N67K63Q34
$$ y = [-1108, 162, 1881, 2982, 1156, -735, -1030, -1561, -1216, -886, -804, 72, 1858, 2608, 1304, 715, -1228, -2113, -1726, -1004, -495, -243, 1497, 1952, 1900, 1083, -712, -2240, -1497, -703, -632, 22, 1000, 1533, 1683, 1351, -708, -2087, -1611, -795, -456, -166, 980, 1119, 1390, 1842, -165, -1933, -2044, -1316, -640, 628, 825, 351, 1377, 1843, 453, -1201, -2002, -1903, -745, 1117, 1124, 615, 1032, 1419, 498, -607, -1742, -2594, -1572, 961, 1607, 1014, 1107, 645, 392, 376, -906, -2548, -2346, 23, 1216, 1514, 1144, 590, -351, 260, 21, -1792, -2028, -666, 584, 2025, 2199, 713, -788, -307, -189, -1205, -1472, -1486, -162, 1860, 2631, 1253, -552, -839, -954, -970, -841, -1202, -858, 1204, 2470, 1399, 159, -509, -1279, -1371, -457, -616, -807, 611, 1800, 1645, 638, -405, -1715, -1180, -409, -541, -683, 561, 1257, 1538, 1592, 41, -1648, -1352, -842, -339, -211, 356, 619, 1453]
2213A453K47j081k032l73N66P47O92J19k46R25O43p84j488j418J06J239J418L05
$$ y = [1453, 1700, 619, -1413, -1786, -1220, -473, 219, 338, 92, 1017, 1660, 876, -612, -2030, -1924, -685, 733, 1038]
$$ [...]
8191A62
##END NTUPLES=NMR FID
##END=
