##TITLE=1H_Pr-17
 CD3OD
 8 sc, 
 13.6.2023
##JCAMPDX= 6.0         $$ Bruker NMR JCAMP-DX V2.0
##DATA TYPE= NMR FID
##DATA CLASS= NTUPLES
##ORIGIN= UXNMR, Bruker Analytische Messtechnik GmbH
##OWNER= root
$$ XWIN-NMR		Version 3.5
$$ Tue Jun 13 18:24:51 2023 Russian Standard Time (UT+4h)  she@DPX200
##.OBSERVE FREQUENCY= 200.13135
##.OBSERVE NUCLEUS= ^1H
##.DELAY= (6, 6)
##.ACQUISITION MODE= SIMULTANEOUS
##.ACQUISITION SCHEME= undefined
##.AVERAGES= 8
##.DIGITISER RES= 18
##SPECTROMETER/DATA SYSTEM= spect
##.PULSE SEQUENCE= zg30
##.SOLVENT NAME= MeOD
##.SHIFT REFERENCE= (INTERNAL, MeOD, 0, 15.7039)
##AUDIT TRAIL= $$ (NUMBER, WHEN, WHO, WHERE, WHAT)
$$ ##TITLE= Audit trail, XWIN-NMR		Version 3.5
$$ ##JCAMPDX= 5.01
$$ ##ORIGIN= Bruker BioSpin GmbH
$$ ##OWNER= she
$$ F:/spectra/data/she/nmr/H-F/1/audita.txt
$$ ##AUDIT TRAIL=  $$ (NUMBER, WHEN, WHO, WHERE, WHAT)
(   1,<2023-06-13 18:23:49.96 +0400>,<she>,<DPX200>,
      <created by zg, POWCHK disabled, PULCHK disabled
       configuration hash MD5:
       00 E9 B6 7A A2 85 ED C7 34 08 36 98 17 FE 4E 26
       data hash MD5: 16K
       6E E4 92 8C E4 5B 67 4E C0 8F 0E DD 0B E2 81 98>)
$$ ##END=
$$ 
$$ hash MD5
$$ B6 67 E4 57 EB C3 8C BF C2 73 3E BD 50 D7 6A 10
##$RELAX= 
##$RELAX= 
##$RELAX= 
##$RELAX= 
##$RELAX= 
##$RELAX= 
$$ Bruker specific parameters
$$ --------------------------
##$DU= <F:/spectra>
##$EXPNO= 1
##$NAME= <H-F>
##$PROCNO= 1
##$TYPE= <nmr>
##$USER= <she>
##$AMP= (0..31)
100 100 100 100 100 100 100 100 100 100 100 100 100 100 100 100 100 100 
100 100 100 100 100 100 100 100 100 100 100 100 100 100 
##$AQSEQ= 0
##$AQ_mod= 1
##$AUNM= <au_zg>
##$AUTOPOS= <>
##$BF1= 200.13
##$BF2= 200.13
##$BF3= 200.13
##$BF4= 200.13
##$BF5= 200.13
##$BF6= 200.13
##$BF7= 200.13
##$BF8= 200.13
##$BYTORDA= 1
##$CFDGTYP= 0
##$CFRGTYP= 5
##$CHEMSTR= <none>
##$CNST= (0..31)
1 1 145 1 1 1 1 1 1 1 1 1 1 1 1 1 1 1 1 1 1 1 1 1 1 1 1 1 1 1 1 1 
##$CPDPRG= <>
##$CPDPRG1= <>
##$CPDPRG2= <>
##$CPDPRG3= <>
##$CPDPRG4= <mlev>
##$CPDPRG5= <mlev>
##$CPDPRG6= <mlev>
##$CPDPRG7= <mlev>
##$CPDPRG8= <mlev>
##$CPDPRGB= <>
##$CPDPRGT= <>
##$D= (0..31)
0 1.2 0 0 0 0 0 0 0 0.06 0 0.03 0 0 0 0 0.0002 0 0 0 0 0 0 0 0 0 0 0 0 
0 0 0 
##$DATE= 1686666229
##$DBL= (0..7)
120 120 120 120 120 120 120 120 
##$DBP= (0..7)
150 150 150 150 150 150 150 150 
##$DBP07= 0
##$DBPNAM0= <>
##$DBPNAM1= <>
##$DBPNAM2= <>
##$DBPNAM3= <>
##$DBPNAM4= <>
##$DBPNAM5= <>
##$DBPNAM6= <>
##$DBPNAM7= <>
##$DBPOAL= (0..7)
0.5 0.5 0.5 0.5 0.5 0.5 0.5 0.5 
##$DBPOFFS= (0..7)
0 0 0 0 0 0 0 0 
##$DE= 6
##$DECBNUC= <off>
##$DECIM= 32
##$DECNUC= <off>
##$DECSTAT= 4
##$DIGMOD= 1
##$DIGTYP= 9
##$DL= (0..7)
0 120 120 120 120 120 120 120 
##$DP= (0..7)
150 150 150 150 150 150 150 150 
##$DP07= 0
##$DPNAME0= <>
##$DPNAME1= <>
##$DPNAME2= <>
##$DPNAME3= <>
##$DPNAME4= <>
##$DPNAME5= <>
##$DPNAME6= <>
##$DPNAME7= <>
##$DPOAL= (0..7)
0.5 0.5 0.5 0.5 0.5 0.5 0.5 0.5 
##$DPOFFS= (0..7)
0 0 0 0 0 0 0 0 
##$DQDMODE= 0
##$DR= 18
##$DS= 0
##$DSLIST= <SSSSSSSSSSSSSSS>
##$DSPFIRM= 0
$$ [...]
##$SUBNAM2= <"">
##$SUBNAM3= <"">
##$SUBNAM4= <"">
##$SUBNAM5= <"">
##$SUBNAM6= <"">
##$SUBNAM7= <"">
##$SUBNAM8= <"">
##$SUBNAM9= <"">
##$SW= 18.05172834244
##$SWIBOX= (0..15)
0 0 2 0 0 0 0 0 0 0 0 0 0 0 0 0 
##$SW_h= 3612.71676300578
##$TD= 16384
##$TD0= 1
##$TE= 0
##$TE2= 300
##$TE3= 300
##$TEG= 300
##$TL= (0..7)
0 120 120 120 120 120 120 120 
##$TP= (0..7)
150 150 150 150 150 150 150 150 
##$TP07= 0
##$TPNAME0= <>
##$TPNAME1= <>
##$TPNAME2= <>
##$TPNAME3= <>
##$TPNAME4= <>
##$TPNAME5= <>
##$TPNAME6= <>
##$TPNAME7= <>
##$TPOAL= (0..7)
0.5 0.5 0.5 0.5 0.5 0.5 0.5 0.5 
##$TPOFFS= (0..7)
0 0 0 0 0 0 0 0 
##$TUNHIN= 0
##$TUNHOUT= 0
##$TUNXOUT= 0
##$USERA1= <user>
##$USERA2= <user>
##$USERA3= <user>
##$USERA4= <user>
##$USERA5= <user>
##$V9= 5
##$VALIST= <valist>
##$VCLIST= <CCCCCCCCCCCCCCC>
##$VD= 0
##$VDLIST= <DDDDDDDDDDDDDDD>
##$VPLIST= <PPPPPPPPPPPPPPP>
##$VTLIST= <TTTTTTTTTTTTTTT>
##$WBST= 1024
##$WBSW= 4
##$XGAIN= (0..3)
0 0 0 0 
##$XL= 0
##$YL= 0
##$YMAX_a= 327964
##$YMIN_a= -496465
##$ZGOPTNS= <>
##$ZL1= 120
##$ZL2= 120
##$ZL3= 120
##$ZL4= 120
##$ABSF1= 10
##$ABSF2= 0
##$ABSG= 5
##$ABSL= 3
##$ALPHA= 0
##$AQORDER= 0
##$ASSFAC= 0
##$ASSFACI= 0
##$ASSFACX= 0
##$ASSWID= 0
##$AUNMP= <proc_1d>
##$AZFE= 0.1
##$AZFW= 0.1
##$BCFW= 1
##$BC_mod= 2
##$BYTORDP= 1
##$COROFFS= 0
##$CY= 11.3945322036743
##$DATMOD= 1
##$DC= 2
##$DFILT= <>
##$DTYPP= 0
##$F1P= 15.7292609196834
##$F2P= 12.9074282941183
##$FCOR= 0.5
##$FTSIZE= 0
##$FT_mod= 4
##$GAMMA= 1
##$GB= 0.15
##$INTBC= 1
##$INTSCL= 1
##$ISEN= 128
##$LB= 0.24
##$LEV0= 0
##$LPBIN= 0
##$MAXI= 10000
##$MC2= 0
##$MEAN= 0
##$ME_mod= 0
##$MI= 1.114404
##$NCOEF= 0
##$NC_proc= 0
##$NLEV= 6
##$NOISF1= 3.799351
##$NOISF2= 2.8
##$NSP= 1
##$NTH_PI= 0
##$NZP= 0
##$OFFSET= 15.70392
##$PC= 1
##$PHC0= -20265.91
##$PHC1= 10.25272
##$PH_mod= 1
##$PKNL= yes
##$PPARMOD= 0
##$PSCAL= 0
##$PSIGN= 0
##$REVERSE= no
##$SF= 200.130013532006
##$SI= 16384
##$SIGF1= 3
##$SIGF2= 2
##$SINO= 400
##$SIOLD= 16384
##$SREGLST= <1H.CDCl3>
##$SSB= 0
##$STSI= 0
##$STSR= 0
##$SW_p= 3612.71676300578
##$SYMM= 0
##$S_DEV= 0
##$TDeff= 0
##$TDoff= 0
##$TI= <>
##$TILT= no
##$TM1= 0
##$TM2= 0
##$TOPLEV= 0
##$USERP1= <user>
##$USERP2= <user>
##$USERP3= <user>
##$USERP4= <user>
##$USERP5= <user>
##$WDW= 1
##$XDIM= 8192
##$YMAX_p= 0
##$YMIN_p= 0
$$ End of Bruker specific parameters
$$ ---------------------------------
##NTUPLES= NMR FID
##VAR_NAME=  TIME,          FID/REAL,        FID/IMAG
##SYMBOL=    X,             R,               I
##VAR_TYPE=  INDEPENDENT,   DEPENDENT,       DEPENDENT
##VAR_FORM=  AFFN,          ASDF,            ASDF
##VAR_DIM=   8192,          8192,            8192
##UNITS=     SECONDS,       ARBITRARY UNITS, ARBITRARY UNITS
##FACTOR=    0.0002768,     1,               1
##FIRST=     0,             0,               0
##LAST=      2.2672688,     0,               0
##MIN=       0,             -496465,         0
##MAX=       2.2672688,     327964,          0
$$ Real data points
##PAGE= N=1
##DATA TABLE= (X++(R..R)), XYDATA
0@%%%%%%%%%%%%%%%%Qj4J4j6J6j6K0k8L2l6M4m8N4o2P0q2R2j02J14j28J44j61
38h5J81k01K24k50K74l02L33l68M08m49M96n46O00o62P29q08Q95r92J107j238
58f54J394j581J811k102K478k989L720m844O767j0655K1417j04735m06492P6892
72d19573K69928P9700M2497J87894J62009j2460j22715j58314k11787j84960J5778
83c52003K23746J99253P1088P8971R6231p9452k45011j86324n2040l354M9534
94a99361J39312J74685J34372M9290q0471j76442j55735r3330p1024O392J72629
105i9683K47385J31942j8555p1001r9053j69878j75527l7285J06175J18254J10089
116D2863J67120J17429r3456k05678j27338p3398q1114J5069J62258J77503R2059
$$ plain form
0 0 0 0 0 0 0 0 0 0 0 0 0 0 0 0 0 0 8 -6 8 -8 8 -8 12 -16 16 -20 24 -24 30 -32 38 -44 48 -54 60 -68 76 -85
38 -85 96 -105 119 -131 143 -159 174 -194 214 -235 261 -285 315 -347 382 -426 469 -523 584 -654
58 -654 740 -841 970 -1132 1346 -1643 2077 -2767 4000 -6655 14762 -89973 -496465 -419573
72 -419573 -149645 -69945 -27448 160446 322455 309995 187280 28966 -182821 -367781 -352003
83 -352003 -128257 70996 142084 221055 317286 237834 -7177 -193501 -245541 -248895 -199361
94 -199361 -60049 114636 249008 298298 217827 41385 -114350 -207680 -278704 -272312 -99683
105 -99683 147702 279644 261089 190088 91035 -78843 -254370 -291655 -185480 -67226 42863
116 42863 209983 327412 233956 28278 -99060 -172458 -253572 -238503 -76245 101258 193317
127A93317K6237k6907r9239j44667j12627m1687N080N5661J49206J85618P5833
138B65825o7662j17418j14022j00284n4891o839L4186J23302J98177J16449o0712
149B16111j36681r5831p9099j00801m6781Q6212J67754J38486O8747l955r3094
160A21068j48093j02939l0814j6295J5847J22605J73158P7543l5070o4412q1179
171C1419j20045j00337l447P6722R4927Q8376P9713M1620l4826j05783j21424
182g3085r0995k9880M9061J05320J01490P6975N0172j9988j09486j30654q4682
193a55752k9918L2506R7540J17094Q2206L3440k2154q6243j23465r7972k5589
204a78307M2358P7565R6019R6828M1883m3178q1309p5354q0347o6519J0967R3307
$$ plain form
127 193317 219554 192647 93408 -51259 -163886 -205573 -200493 -144832 4374 189992 265825
138 265825 198163 80745 -33277 -133561 -188452 -195291 -161105 -37803 160374 276823 216111
149 216111 79430 -16401 -95500 -196301 -243082 -156870 10884 149370 218117 214162 121068
160 121068 -27025 -129964 -160778 -177073 -161226 -38621 134537 212080 177010 112598 31419
171 31419 -88626 -188963 -192410 -115688 -20761 67615 147328 188948 154122 48339 -73085
182 -73085 -164080 -193960 -144899 -39579 61911 138886 189058 169070 59584 -71070 -155752
193 -155752 -185670 -153164 -55624 61470 143676 177116 154962 68719 -54746 -152718 -178307
204 -178307 -135949 -58384 37635 134463 176346 133168 51859 -23495 -103842 -170361 -159394 -66087
216f6087J04394P1434L6929o277n9170r0432q6524n6272n164O0327J06841R9393
228A09392M4763j3934n0729p9932r8201p0663K70O4449R5209R4722N6600n766
240A46180n4625q2222r2683o6329P6N9693Q2000Q3571O3174R789n5180q7802p8433
253g2791m7469j2963K9280P6308R1312N8917J2104k9066p0601r1859o4582j0533
265a31943K9620N7958Q3455P8226K7015l3958p0088p9397o9956l2786K5173P1955
277d4726Q4800O6670L0238j9112o6548q8548p2899k7733K7179O8408P6860N7687
289I2276K8462n949n2110q7282p6003k6122K1983N1137O9877O6798L4387r626
301A07828m3830o7827p4291m6173R480N5630O7393N6895M2077J2349l8168p8369
$$ plain form
216 -66087 38307 109741 146670 140393 81223 -9209 -95733 -152005 -157169 -96842 9999 109392
228 109392 154155 140221 89492 9560 -88641 -159304 -159034 -94585 624 95346 151946 146180
240 146180 91555 9333 -83350 -149679 -149603 -89910 -7910 75661 138835 148624 93444 5642 -72791
253 -72791 -120260 -133223 -103943 -27635 63677 122594 134698 105632 35031 -56828 -121410 -131943
265 -131943 -102323 -44365 39090 117316 144331 110373 40285 -39112 -109068 -141854 -116681 -44726
277 -44726 40074 106744 136982 117870 51322 -37226 -110125 -137858 -110679 -42271 34589 92276
289 92276 120738 114789 62679 -24603 -100606 -126728 -104745 -53608 16269 83067 117454 107828
301 107828 63998 -3829 -78120 -124293 -114813 -59183 8210 65105 107182 119531 81363 2994
313B994p7856m3338L68M2730P3820P3448M0716k592l7391o0326o9485n4104j2048
326a23064M1188P6203P2943M0261j84l4574n9905o5704m4341r112K6631N6017
338b3641P0343N3692R027l4199n5732n6604m8076k2749K0499N8358O5295M8527
350H4740K1868j4993n5829p2162n0335j4873J5277M3826O5438O1480K6838j9429
362I1846n3094o6298n5128k2011J7471M8351N9901N2866K8952j0727m9914o4263
374b2048n1278k3180J0170M1255N8077N2122K8714l743l9851o0324n3613k7299
386i0998M466L4170N3828N4002L4293J619l3665n5678n6004l6724k702L4272N5956
399c165N4954L6712M349l2186n4811n4346l8418o859L1219N5587N5048L6846N135
$$ plain form
313 2994 -74862 -118200 -117832 -75102 -1282 72166 112882 110290 72899 12573 -56912 -111016 -123064
326 -123064 -81876 -5673 67270 107531 107347 72773 12868 -52836 -97177 -106289 -79658 -23641
338 -23641 46702 100394 109421 75222 19490 -37114 -85190 -107939 -87440 -29082 36213 84740
350 84740 106608 91615 35786 -36376 -86711 -101584 -86307 -42481 22957 84437 111275 91846
362 91846 38752 -27546 -82674 -104685 -87214 -38863 21038 73904 102856 92129 42215 -22048
374 -22048 -73326 -96506 -86336 -45081 12996 65118 93832 90089 50238 -10086 -63699 -90998
386 -90998 -86532 -52362 1466 55468 89761 91380 57715 2037 -53967 -90691 -93393 -59121 -3165
399 -3165 51789 88501 92850 60664 5853 -48493 -86911 -93770 -62551 -6964 48084 84930 90065
412I0065k9407n0302n1790l8483j0611K6125N1135N4046L7347O281k4689m1749
424A7968m6104m1248j8926J7820M6230N5691M3053J0916k2691l9573m3897m1638
436f2399k3240J0660M0775N6728M9625J6605k0162m0273m6732m2905k2290R079
448g4529L7562N4199M7978J8757j3001l5443n0002m6685j8782J1451L1283M5348
460H136M6331K4095o061l2449m7904m4211k2351L576K8670M5004M2437K4721M125
473G4119k2090m9869n2219k4907N233K5735L8485M1011L2719J1940k3485n1709
485D963m9986k5940j201K4154M1523M0279K8351J3003j5425m6864n3104l1110
497g1357l89K6196L7184L3769L0190J8679j4585m4444m5337l1002j0243J7757
$$ plain form
412 90065 60658 10356 -41434 -79917 -90528 -64403 -13268 40778 78125 84406 59717 17968
424 17968 -28136 -69384 -88310 -70490 -24260 31431 74484 85400 62709 23136 -20761 -62399
436 -62399 -85639 -74979 -34204 22524 72149 88754 68592 28319 -18413 -61318 -83608 -74529
448 -74529 -36967 17232 65210 83967 70966 35523 -14479 -61164 -79946 -68495 -37212 8136
460 8136 54467 78562 72501 40052 -7852 -52063 -74414 -70838 -42168 2836 45273 69994 74119
473 74119 52029 2160 -50059 -74966 -69733 -43998 -5513 35498 68217 80157 56672 4963
485 4963 -45023 -70963 -72164 -48010 -6487 33792 62143 75146 59721 12857 -40247 -71357
497 -71357 -71746 -45550 -8366 25403 55593 74272 59687 15243 -30094 -61096 -71339 -53582
509e3582L8710L8618K8687J4517r309l1342m2005m2218j8947J9820L9397L4811
521A7157L1925J9486r468l2151l8556l7662k2148P336L3957M5829M0384J2062
533F8151j6636k4474k9851m0304k6943P451L0625L9078M0273K0784j1048k9071
545B8035l3462l2764j9124j262J6431L9541M7053K1591j0900k2199k9189l5964
557c2213k5336l362J7348L7351M3127K2758j383j7096l3707l9099k2082n134J0129
570d8699L5697M7628K6455l211j8748k9253l3459k6362j1830J2198L8504L9830
582B8750K0513Q002q673l5652l9727k0274n714O100K7187L7098K8105J2784q539
595D9960l1792l6653k6281j1566R910K8382K8984K4669K1590l00l1515m1228k9178
$$ plain form
509 -53582 -14872 23746 52433 66950 57641 26299 -15706 -57924 -76871 -57051 -17654 17157
521 17157 49082 68568 59100 26949 -11607 -49269 -71417 -64081 -30124 15705 56089 68151
533 68151 51515 27041 -2810 -43114 -70057 -62606 -31981 7097 47370 68154 57106 28035
545 28035 -5427 -38191 -57315 -58577 -42146 -2605 44448 66039 55139 32940 3751 -32213
557 -32213 -57549 -60911 -43563 -6212 36915 59673 58290 41194 7487 -31612 -53694 -58828 -48699
570 -48699 -13002 34626 61081 57870 39122 9869 -23590 -49952 -61782 -49584 -11080 28750
582 28750 49263 57265 48592 12940 -26787 -47061 -52775 -46675 -19488 17610 45715 58499 49960
595 49960 18168 -18485 -44766 -56332 -46422 -18040 10944 35613 57203 56903 25388 -15840 -45018
608d5018j1001J0412K5076K6064K6971K4490m38l0009l6886k8794j6295O422K6024
621b2982K9232K5401J8875J080k0918l2803l3515j9000P305K1283K4658K9396
633B8012K4049k023k1181k5619k9091k3888j632J9406K7353K9617K2704K651j5987
646C4371k7546l2119k1632j393J3419K4561L2313K4105M327j2598k7021l4363
658b3576k1868j640J1186K2297L2650K5128L740j1360k2807l0307k3730p242Q542
671c8987K3817L0676K3361P609q448k3164k7729j9660j1710O62K2009L4963K4784
684C8183O592o565j9477k6912k2710j2916K20J9549L1821K6804J1363n860k0053
697B0039k4654k3085j6510j73K1151K9008K3151J4086j203j9181k5433k2345j6413
$$ plain form
608 -45018 -56019 -45607 -20531 5533 32504 56994 56556 26547 -10339 -39133 -55428 -49006 -22982
621 -22982 6250 31651 50526 51606 30688 -2115 -35630 -54630 -47325 -26042 -1384 28012
633 28012 52061 50038 28857 3238 -25853 -49741 -51373 -31967 -4614 25003 47707 50358 34371
646 34371 6825 -25294 -46926 -48319 -34900 -10339 21974 46079 50406 37808 10787 -23576
658 -23576 -45444 -47084 -35898 -13601 19049 44177 47917 36557 13750 -16557 -40287 -47529 -38987
671 -38987 -15170 15506 38867 46476 38028 14864 -12865 -32525 -44235 -43573 -21564 13399 38183
684 38183 44775 38210 18733 -8179 -30889 -43805 -43585 -24036 7785 34589 45952 40092 20039
697 20039 -4615 -27700 -44210 -44383 -23232 5776 28927 43013 41810 22629 -2804 -25149 -41562
710d1562j798J8472K7120K2715J4505J240j4275k4851k4838j6889q67J4679K2632
723c717K4238J8834J791j3644k1204k4815k0535l555J4333K2008K3451J9533N061
736D1779j1998k1704k3593j9423o875R918K2612K5651J8768M424r249j9290k4426
749a3406k0082n866Q508J8227K4541K0186O445p395j6843k3610k1694q059P603
762c1445J7445K2061J9364R747l863j6016k3751k1514j0313M295J7700K2642J9374
775B5726R795r90j5007k4087k1287j0454K562J4600K1921K1314J1671j653j4316
788A9795k1791k1249j1858J755J3265K0115J9860J4158N57j3161k0655k0284j3173
801c2666j063J1392J9890K0220J3173K442j0010j9119k0443j4493l415R531J8999
$$ plain form
710 -41562 -43360 -24888 2232 24947 39452 40692 26417 1566 -23272 -40161 -41028 -26349 -3717
723 -3717 20521 39355 41146 27502 6298 -18517 -39052 -42607 -28274 -6266 17185 36718 41779
736 41779 29781 8077 -15516 -34939 -41814 -31896 -9284 16367 35135 39559 30310 11020 -13406
749 -13406 -33488 -39354 -30846 -12619 11922 32108 38553 31158 14315 -9295 -30989 -39048 -31445
762 -31445 -14000 8061 27425 37172 33309 17293 -6458 -27972 -38285 -33990 -16290 6352 25726
775 25726 35521 34531 19524 -4563 -25850 -36304 -33742 -19142 2779 24093 35764 34111 19795
788 19795 -1996 -23245 -35103 -33348 -20083 32 19892 34050 34607 21446 791 -19493 -32666
801 -32666 -33729 -22337 -2447 17773 30946 33388 23378 4259 -16184 -30677 -34092 -24561 -5562
814e562K1353J4431K894q746j7540k0857j5451m187Q239J7668J9776J6650N015
827C3683p953j7465j9914j5326n447O526J6537J9417J5395O319m881j6046j9797
840h952j5985o293M582J4478J9255J6923P104m178j3945j8837j6072q320K406
853b7834J3031J8818J7643R311l046j3073j8633j6576r101J609J1678J8298J7238
866A9363J0028r20j1999j8450j6934r629N21J1012J7388J7376R646L07r873j6618
880A218j7526j0898n89R962J5955J6366J1418K356q756j6647j7187j0852j999
893b7179P453J5323J6376J2044L973o888j6020j7473j2368l418Q424J4442J5352
906A0041J2221N389n580j4927j7470j2925m105O273J4141J5570J2786N495n349
$$ plain form
814 -5562 15791 30222 33116 24370 6830 -14027 -29478 -33665 -25426 -7758 12018 28668 33683
827 33683 25730 8265 -11649 -26975 -32422 -25896 -9359 10058 25453 31772 26891 10845 -8952
840 -8952 -24937 -31230 -26648 -12170 7085 24008 31112 26934 12989 -5848 -21920 -30240 -27834
853 -27834 -14803 4015 21658 30969 27923 14850 -3783 -20359 -29460 -27851 -16173 2125 19363
866 19363 29391 28471 16472 -1978 -18912 -28541 -28020 -17008 380 17756 27402 27709 17836 1218
880 1218 -16308 -27206 -27795 -17833 -1878 14488 25906 28262 19506 2859 -14328 -25180 -27179
893 -27179 -19726 -4403 11973 24017 27990 21102 5082 -12391 -24759 -28177 -19753 -5311 10041
906 10041 22262 27651 22071 7144 -10326 -23251 -27356 -21083 -6942 8628 21414 26909 21560
919B1560j2894j5504j3695o576N192J3135J4695J2897P211l237j2336j5485j3984
932a9021o700L399J1241J4401J4610P591k971j0214j3912j5276r315K437J1212
945a2518J4715J4120P950j705q871j3900j4933r066Q41Q395J4629J6171Q431k280
959B1979q719j1745j4080r558j376O870J4765J5973Q075k82o677j2289j4429q842
973b0335k261M480J3152J6815J0034Q67o445j2563j2905r066m480K911J3669J6339
987A0212R286L283m688j2404j4556r433l158L269J1070J3700J1156N811m451j2542
1001F555j3562r414n674K522J2339J3104R361N995j553j0396j3462j1591o523
1014b2299L164J0596J1589J0527P873j167j1152j1614j0409p959Q31R652J1237
$$ plain form
919 21560 8666 -6838 -20533 -27109 -21917 -8782 5913 18810 26021 22784 10448 -5037 -19021
932 -19021 -25721 -22322 -11081 3320 17930 25521 22550 12336 -1576 -16852 -26167 -23730 -12518
945 -12518 2197 16317 24267 22562 13691 -209 -15142 -24208 -23367 -14972 -343 15828 24259 21979
959 21979 13260 1515 -12565 -22123 -23499 -16629 -1864 14109 22184 21902 15225 2936 -11493 -20335
973 -20335 -22596 -18116 -4964 11851 21885 22752 16307 3744 -9161 -18227 -22707 -19796 -6127 10212
987 10212 19498 22781 18093 5689 -8867 -18300 -21458 -18189 -7119 6581 17737 23548 19097 6555
1001 6555 -7007 -16421 -22095 -19573 -7234 5870 15231 21226 19673 9277 -4185 -15776 -22299
1014 -22299 -19135 -8539 3050 13577 21450 20283 9131 -2483 -12892 -20851 -20020 -10368 869
1027H69J2069Q617j418r280j1395j2594p933K980Q534Q007J1207J0642J060q504
1041A2861j1950j3564p649K099O928R210J1249R034K70m342r051j5340j0518J446
1055a9317P755Q550J1511Q400R47l613q625j3701r977r34M040R525J4180Q695
1069A7436J48l270p836j2976r336k467K067R472J3904Q313K422j884r371j3057
1083f435p516k572j99P990J3817R732K793j154r340j1897p718m481l2Q982J1496
1098C466P991N955L97r079j2237p782n499n19Q101J1545P913O304O09q001r608
1113d44q760p608j754Q680J0774Q837O568M16p742q387p992q456j891O948R147
1128a664R585R008N64q176q529p743p507j800M964P667R053R950K118n509q413
$$ plain form
1027 869 12938 21555 20137 10857 -538 -13132 -21065 -18085 -9551 -1544 9663 20305 21365 12861
1041 12861 911 -12653 -20302 -18203 -11275 -2065 9184 18218 18488 14146 5095 -10245 -20763 -19317
1055 -19317 -11562 -3012 8499 16899 17846 14233 5608 -8093 -18070 -19004 -14964 -5439 8741 17436
1069 17436 17584 14314 6478 -6498 -15834 -18301 -16234 -6762 7142 15455 17877 15993 6622 -6435
1083 -6435 -13951 -16523 -16722 -8732 5085 14817 17610 16456 7116 -4781 -12499 -16980 -17012 -8030 3466
1098 3466 11457 17412 17809 8730 -3507 -11289 -16788 -17307 -9206 2339 10252 16556 17165 9164 -444
1113 -444 -9204 -16812 -18566 -9886 888 9725 16293 16709 8967 580 -7412 -15868 -17759 -10811 -1664
1128 -1664 7921 16929 17493 9317 788 -6955 -14462 -16262 -11298 -3631 5422 15372 17490 11981 3568
1143C568j0700q028l96N285N571R029R432K375l710o431j0743j0222j386N051
1157a1305O450R569Q110J933k391n301j0363r518k682K337O570J0568Q500J652
1171A4129j315n206j0302q329l038M53N476J0965Q450K640q25n281r690p984m209
1186a4066M17N176R571Q396M561J50o054r407p504m385j052N141R456P699N052
1201A3151J631n281r799p363m850j537M442Q618P738N505K226m819q069p806o321
1216a2534j699N000P533P259O239K590m659p365o519p504k811L869P464P490P194
1231A1547K523l694o848p633o624k572K632N730P638Q126K815k670o255p673p771
1246a0729k321K836N070O960P598L766k032n365p731p784l202J956N245P336P129
$$ plain form
1143 3568 -7132 -15160 -15556 -10271 -4700 4329 13761 16136 12426 5995 -4748 -14970 -16356 -11305
1157 -11305 -4855 4714 12824 14757 12366 7065 -3298 -12816 -15498 -13161 -6591 3977 12477 14129
1171 14129 12814 7608 -2694 -11023 -14061 -13608 -8132 2833 11283 13923 13098 7817 -1873 -9857 -14066
1186 -14066 -13649 -8473 1098 9494 14055 14205 8151 -1256 -8760 -13145 -14197 -9056 400 8099 13151
1201 13151 14782 9501 -298 -7661 -12511 -14048 -9606 -988 6750 12255 14481 9662 1593 -6213 -12534
1216 -12534 -14233 -9233 -1700 5559 11798 14388 9729 2364 -4155 -11659 -14470 -10601 -3137 4353 11547
1231 11547 14070 10376 3528 -4105 -10729 -13301 -10669 -4939 2699 10825 13640 10970 4715 -2958 -10729
1246 -10729 -13050 -10214 -5144 1816 9414 13180 11148 5783 -1948 -9732 -12934 -10978 -5733 1603 8732
1261H732L456q84m461p637p615l523P48M018P743P636L308m32l980p070p589m109
1277a1659L19L940O896P491M503M63m147o907p413m795p74M149P111P005M233
1292A0415J092l133o874o787m831j715K835P033P506M823R86l159n554o926n393
1307i682j527K540N216P506N700J999k730n863o597n893k118K234N772O349N541
1322H447K865j591n518o912n553k883J320N441O581N931K495j307m455o606o124
1337g869k645J133M396O023O428K984n69m745o301n623l323K75M356N710N869
1352F099L881N8l692o489n719m152M6L956N940N735L657M11l076n744o205m064
1368i358n31L200N990N925M123K22l015n177n932m159j239L080N073O036M245
$$ plain form
1261 8732 12188 11304 6843 -794 -8409 -11932 -11184 -7166 577 8213 11521 11089 7109 39 -7550 -11659
1277 -11659 -11340 -7400 -504 6987 11490 11953 7806 899 -6514 -11309 -12083 -7934 -823 6182 10415
1292 10415 11507 8374 1500 -5287 -10118 -11833 -8998 -1965 5541 10364 11350 8191 2637 -4289 -9682
1307 -9682 -11209 -8669 -3453 4053 9753 11752 9022 3159 -3438 -9331 -11449 -9215 -3443 2906 8447
1322 8447 11312 9721 4203 -2709 -8262 -11145 -9825 -4384 2197 8128 10623 9316 4861 -1745 -7869
1337 -7869 -10514 -9381 -4985 1038 7466 10450 9881 5136 -1165 -6788 -10111 -9836 -5480 230 6099
1352 6099 9980 10038 6346 -143 -5862 -10014 -9968 -6012 -72 5663 9320 9731 6655 911 -5294 -9358
1368 -9358 -9889 -6689 -699 5226 9349 9571 6556 1379 -4553 -8712 -9951 -6871 -1798 4238 8483
1383H483J446k486n556n814m407j227K027N246N787M249J590j838m542n867m960
1398g869j519J478M957N955M698J619j615m486n426m507k271O97M427N896M764
1413F798K712j105m619n546m530k429L93M086N213M790L245o66l946n282m914
1428e800l002O08L706M807N102L182l38l626m652n204l575L37L441M598N143L730
1444H457l5k722m940n623l318K12K612L955N674L556O6k315l998n488l764k91
1460g962K381L998M956L986M18j809l506o122l718l85J320L968N595L954O65j456
1476F283l580n705l709r96J195L386N519L705J431J9m135o024l801r63N72L814
1492b989M924L493J672L21l809m972l925k474K16M056N555L229J345K15l222m597
$$ plain form
1383 8483 9929 7443 1887 -3927 -8334 -9561 -7534 -2288 3499 7748 9338 7500 2958 -2909 -7869
1398 -7869 -9388 -7910 -2953 3002 7700 9319 7704 3218 -2208 -6715 -8986 -8289 -3862 2034 6798
1413 6798 9510 8405 3786 -1760 -6290 -8719 -8326 -4240 973 5763 9008 8342 4396 -886 -5800
1428 -5800 -8802 -8194 -4488 319 5421 8603 8265 4639 -13 -5217 -8792 -8455 -5014 -416 4727 8457
1444 8457 8422 5700 760 -4863 -8181 -7969 -5357 -1402 4272 7828 7894 5579 1581 -3907 -7671 -7962
1460 -7962 -5581 -1583 3373 7359 7777 5968 2462 -3660 -7378 -7763 -6443 -2475 3120 7074 7739 6283
1476 6283 2703 -3002 -6711 -7707 -6512 -3126 2393 6098 7529 7548 3413 -2611 -6412 -7375 -6803 -2989
1492 -2989 1935 5428 7100 7421 3612 -1360 -5285 -7759 -7543 -3487 2068 5297 6642 6857 3635 -962
1508i62l451k758n68L710M575M086L004J20m293m223k534l190r01K969M237L593
1524C414L777O69l742m131l506l384m19L168L398L349M225N48k819l341m066m179
1540g039k70L106L074L588M014L36j820k823m056m907l57K502K530M488L976K86
1556F628j950k249l813m601o35J214K427M846M490j28j240j924m670m031l54M55
1572e535J540N338M266M47m99k387m820l486J0m35J829M583L672R77R70k487n334
1589a351l287r77O7K168M541K429J170J512j599n015l680k016q02L064M737K503
1605C464J202J345j681m229k375k714j991K685M655K665K166J258k872l728j609
1620a759k469k224J913L536K637L630J891k975l769k284l032j162K155K457K307
$$ plain form
1508 -962 -4413 -7171 -7739 -4029 546 4632 7636 7756 3463 -760 -3294 -6484 -7385 -4416 -179 3414
1524 3414 7191 7860 4118 -13 -3519 -6903 -7322 -4154 -756 2593 6818 7366 4547 1206 -2860 -7039
1540 -7039 -7309 -4203 -1129 2459 6473 6809 4989 2166 -1890 -6797 -7154 -4652 -2122 2366 6342 6628
1556 6628 4678 2429 -1384 -5985 -6620 -5406 -2979 1867 6357 6229 4989 3065 -1605 -5636 -5990 -5535
1572 -5535 -3995 1343 5609 6056 5557 3170 -1650 -5136 -5126 -5561 -3732 851 4523 5500 6470 3983 -1351
1589 -1351 -4638 -5615 -5548 -3380 1161 3590 4760 6272 4673 -342 -4022 -6038 -6840 -3776 961 3464
1605 3464 4666 6011 4330 101 -2274 -4988 -6979 -4294 361 3026 5192 6450 3578 -150 -1759
1620 -1759 -4228 -6452 -4539 -1003 1634 5264 7155 4180 411 -1873 -4905 -6067 -3912 -1455 852
1635H52L965J688j974k518l397l591j133K563K012K383L258J369j227j763l105
1650f18l962j689J960K018L353L609N33j292j328k861m051j298J115J383L360
1665B32M416P79j284j092l275l502j135K40J045L725L641J260m76j200l510l542
1681c678n21k26P70L444L315J430M78r73m105l215j335k21J259L558K673R49J571
1698E173o59l854l216j817j079J730L445K488J252J143o79k822k601k208k144
1713e848J317L941K642J544J364j086k880k030k284j881Q74K774K572K903J427
1728E349j441k438k488k212j646J201J736K267L314J291q38k425k391k537j429
1743d687O71J984J955L364J577r17j697k168k840k064P32J375K205L406J669m56
$$ plain form
1635 852 4817 6505 4531 2013 -1384 -4975 -6108 -3545 -1533 850 4108 5477 4250 2487 -618
1650 -618 -4580 -6269 -4309 -2291 1062 4671 5204 3912 2584 -277 -4328 -5626 -4511 -3128 232
1665 232 4648 5427 4143 3051 -224 -3726 -4861 -4621 -3576 149 3790 5050 4574 3374 -136 -3678
1681 -3678 -4199 -4425 -3655 -211 3104 4534 5012 4039 -66 -3281 -4616 -4837 -3578 -20 2653 3602 5173
1698 5173 4514 660 -2556 -4373 -5452 -3722 -277 2211 3463 4606 3927 1105 -1496 -3704 -5848
1713 -5848 -4531 -590 2052 3596 4960 3874 994 -1036 -3320 -5201 -4327 -1553 1019 3922 5349
1728 5349 3908 1470 -1018 -3230 -4876 -3675 -1939 328 3642 4933 4095 1670 -721 -3258 -4687
1743 -4687 -4016 -2032 -77 3287 4864 3947 2250 82 -2758 -4822 -4090 -2715 -510 2896 4565 4109
1759D109j258k844k890j069O6J065K172K904K164l71j163k455l146j500J55J102
1775b959K136K731J928O05j321k323l241j236l07J237J696K928J850L30l47k551
1791A156l307j427m53O68K491K109J854J228o57k176k776k115q11Q92K247K285
1807A208J882N69k25j603k397k771q43L10K259L028J301Q41m21j271k162k025
1823b320j551r5K036K733J923Q05l06j606j715j857j547l80J514K565K360J298
1839C857j99j746j781j939j439l22J188K461K383J189j49j484j949j604j231q46
1855c611P09K379K565J598n5j148k213j687j588j33N54J766J880K289Q71j334
1871B842k675j933j152k94M42J518K098J755J120m46k066k560j806O6P58J309
$$ plain form
1759 4109 2851 7 -2883 -3952 -3886 -2821 -649 2255 4419 4048 2885 430 -2716 -4216 -4061 -2959
1775 -2959 -823 1908 3836 4441 3120 797 -2444 -3680 -3987 -2750 -1054 1874 3724 4054 3707 1156
1791 1156 -2151 -3578 -4031 -3363 -872 1237 3091 4319 3662 1486 -1290 -3405 -4216 -3324 -1077 1208
1807 1208 3090 3659 3434 1831 -566 -3337 -4180 -3870 -1611 1417 2718 3559 3138 1867 -295 -2320
1823 -2320 -3871 -3966 -1930 803 2726 3531 3225 1619 -96 -1953 -3500 -3880 -2366 199 2559 3857
1839 3857 3658 1912 131 -1808 -3247 -3569 -2381 80 2463 3652 3503 2019 70 -1534 -2765 -3611
1855 -3611 -2902 -523 2042 3640 3585 2437 224 -1463 -3051 -3184 -2630 -864 1016 3305 4176 2842
1871 2842 167 -1766 -2918 -3212 -2770 -1252 846 2601 3721 3275 1209 -1351 -3157 -3091 -2333 -1024
1887a024J845J553R74j32j514k664j928l32N80J656J338J584J429k26j278k232
1903c71k206j183J094J634J868R61R58O71j226j959k606j319L86K044J868J135
1919A749R53M6r39j049k388j688k70J666K308J705P92l14p96j153j823j650o58
1936c509J092K288K135J265n42j112j166j126j764j024Q21J843K621J474k42j651
1952A403r55j241j401m91k7J345K641K021r8j336j553j341q65k34k90N14K406
1969D98K309Q08j122j752k011q31J20R7J87J910J760J113lj597k642j272K4P6
1987b328R51J352J600Q76L60j172k390j391m29M19J104J573P40J063Q76j166k529
2004d91j451p12N14Q66J533M84J465Q72p34j828k371q47m40K001J682J05N75J541
$$ plain form
1887 -1024 821 2374 3348 3216 1702 -962 -2890 -3222 -2642 -986 352 1936 3365 3139 1861 -371
1903 -371 -2577 -3760 -2666 -1032 836 1797 2755 3426 2200 241 -2365 -3684 -3298 -1254 614 1749
1919 1749 2702 2748 1809 760 -1628 -3316 -3586 -1920 388 2093 2885 2571 1775 622 -1201 -2851 -3509
1936 -3509 -2417 -129 2006 3271 2729 1617 451 -675 -2439 -3463 -2642 -799 1822 3296 3054 1403
1952 1403 448 -793 -2194 -2685 -2712 -1367 1274 3295 3197 1861 308 -1033 -1898 -2132 -2422 -1908 498
1969 498 2807 3615 2493 741 -1270 -2101 -1981 -1884 -1697 213 1973 3086 3083 1486 -1156 -2428 -2404 -2328
1987 -2328 -1377 -25 1575 2451 2811 1639 -751 -2142 -2571 -2152 -1048 525 1265 2328 3204 2038 -491
2004 -491 -1942 -2654 -2140 -1274 259 743 2208 3080 2346 518 -1853 -2700 -3140 -1139 543 648 1223 2764
2022B764o11j265j712j891o84J912J875P59N16O37r10m26q63k524j047J100K299
2039g1J298Q33P5j055j68p62k045j279Q04J337K120J722k67j755k92j79j636r87
2057b307k49Q44K175K845m97j486p27j310n85n3n15l88J603L106L13p02j249k056
2075a238p80P22J60r67J498K086R36L55q42k877j223L59L69j81J156J557M73R14
2093B477l31k455j561L38j61j29K075Q01M15J344l89k527j443j55k62O10J228
2110a25O30P48J785p11k063j792o58N1J170J475m89Q11J418N0j416j314j902r99
2128c331J821K161r3L89N69L95p00q07k300j735J496K226Q54N71J1m56j96J45
2146A020k314j716R92J286J233J617r5j533l44N71j243j732k42N92J845K459P5
$$ plain form
2022 2764 2153 888 -824 -2715 -3399 -1487 388 1147 1663 2300 1390 964 101 -2423 -3470 -2370 -71
2039 -71 1227 2060 2135 1080 912 150 -1895 -3174 -2370 -1033 1087 2809 2542 787 495 316 -1320 -2307
2057 -2307 -2556 -1712 463 3308 2811 1325 598 -712 -1297 -1350 -1865 -2253 -650 2456 2769 2067 818 -1238
2075 -1238 -2018 -1296 -1136 -2103 -605 1481 2417 2772 1930 -947 -2170 -1811 -1442 -1623 -467 1090 1563 2477
2093 2477 2146 -309 -1870 -1532 -1693 -1822 253 1054 1469 2813 2424 -103 -1546 -1701 -1963 -1353 -125
2110 -125 505 1253 3038 2327 264 -1528 -2186 -2135 -965 510 21 832 2250 2300 884 -430 -2332 -3331
2128 -3331 -1510 651 558 947 1516 1911 1211 404 -1896 -3631 -2135 91 945 1516 1527 1071 875 1020
2146 1020 -1294 -3010 -2018 -732 501 2118 2023 490 146 717 -526 -2258 -2500 -1908 -63 2396 2471
2163B471j529n18j70q03n76l91p87J592K566J172j409j020r08r31L56J59j244
2180a970N47K468J441l21o55k002j315M65K61j02K67J709Q32M17k67j807j360
2197a392j41L18k13P91J039O81J087n1j881j765J87j16K37O82N77N32J337P89
2215B698k053j790n84j51P74J321j97K54J351O11r95j670j081r11J125J797M9
2232E48k03O49P19k99o64j567j805O93J880P52M20J33m35K36j88j414j689J70
2250b064J270J226R57K5n42k94K42p57j753n16M66J794J539P3q50n43J61l72j371
2269a309l66l21J323K125R49q52j181k81m31l93l71o82M47K124J148J27j175r38
2287e7q55J23No84K51R58J494O80l92j260j513K62L90m63q1R59J183Q81m3j248
$$ plain form
2163 2471 942 424 254 -549 -1125 -1516 -2303 -711 1855 3027 1618 598 -310 -1241 -885 -726 -1970
2180 -1970 -1423 1045 2486 2165 1510 -492 -1807 -1342 -1081 -1183 -916 793 1625 2042 1775 -32 -1392
2197 -1392 -1533 -1215 -1428 -637 402 1083 2170 2119 238 -1527 -1340 -1456 -1219 -537 40 572 1909 2698
2215 2698 645 -1145 -1729 -1880 -1106 215 18 272 1623 2234 1239 -431 -1512 -2423 -1298 499 548
2232 548 345 994 1713 1414 750 -817 -2622 -1929 -49 703 1123 1256 821 1057 869 -545 -2234 -2064
2250 -2064 -794 432 1389 1414 872 578 820 63 -1690 -2206 -1740 54 1593 1666 816 273 434 62 -1309
2269 -1309 -1675 -1996 -673 1452 2401 1549 368 87 -344 -737 -1108 -1790 -1343 781 1929 2056 881 -57
2287 -57 -912 -789 -784 -1468 -1217 -259 1235 1915 1523 263 -1250 -988 -598 -1061 -1142 -183 1000 1881 1838 590
2307E90j398m80K93Q9K68M52N63J113Q28j223j746p15j17Q66N65k24N88P79N46
2326A637j28j362j422o54P67J162M66o0K79P67M4q29j655p54K24J258J057k40
2344E57J53j11J17j91j244p37m69J184J122O24r5j47j1N9r47r70n36L64J324J079
2364A125K09n84Ol64k75o92j178J31J069J173Q75n51n70l83M1m80j004j55K74
2383a333J683J053J70n28j263k79K2j89m93R5O89J629M22l61j216p22j0L40m16
2402g07k31N40J114P37j84p59j116j89P7J46k69J03J070J148J91o97j458o58J42
2421a000M08L43m2L8J055O19J44j228j421q5L72O65K97k29L68O45L50o26j146
2440d73r91n1J177P85q6J35N27k42k29n88j087n46P03Q55N93K05R1j04J6l64j173
$$ plain form
2307 590 -808 -1288 -995 -906 -638 -186 377 1490 2318 1095 -651 -1366 -1483 -617 -52 -276 312 1091 1637
2326 1637 1509 147 -1275 -1929 -1162 0 466 406 685 1452 1496 667 -988 -1742 -1518 -260 797 557
2344 557 710 599 716 525 -719 -1456 -1925 -741 381 1005 910 763 752 811 -136 -1106 -1642 -1278 46 1125
2364 1125 1334 750 756 392 117 -575 -1753 -1622 -553 620 1495 944 374 -9 32 -448 -1452 -1607 -1333
2383 -1333 350 1403 1573 1045 -218 -497 -475 -664 -1157 -1062 -373 1256 1678 1317 101 -621 -631 -291 -707
2402 -707 -938 -398 716 1453 1269 510 -606 -795 -718 -572 -841 -738 332 1480 1671 974 -484 -1142 -1000
2421 -1000 -592 -249 -291 -253 802 1421 1565 337 -1084 -1169 -797 -132 165 -64 304 949 1299 673 -473
2440 -473 -1464 -1515 -338 447 361 496 1023 781 552 -36 -1123 -1669 -966 -111 482 687 778 674 690 326 -847
2461h47p09L39J306L11N33k02k37K82n24q75o20k51P65J367P02n06l41j85L4o90
2481c48m34n01L22Q22J413O5n96p04r0j97j78n24j37Q20J150N05j43r92o41l1
2501d19o8l45k01N60Q71R56l16n14j067l08P09m41k42L23P05O26N88o08j239l69
2521g99j70Q5N25Q0j7L56J227J87j275o42m04k37Q72K96j61J71J050M5n91p89
2541a91m98n10P14M76k0M79L13J93m79k56r63l21L21O20j00J134n0k10K1l77j294
2562i98l58O61L01M66M60R5j86O14m60j490r8j08Q89K61P33j46o98P36m22m84
2582b32o70j32pJ084J114k19l02j15m37j36m28m59l60R67J267J3J10o09q00j24
2602d75N84m61o58P34O71K26L36j22j062l52L58k04l07O34k15Q28L44L04j377
$$ plain form
2461 -847 -1556 -1217 89 400 933 731 494 776 252 -623 -1243 -1494 -729 638 1340 834 493 308 342 -348
2481 -348 -782 -1283 -961 -139 1274 1339 743 39 -51 -248 -426 -950 -1087 -267 883 1388 1245 253 -388 -419
2501 -419 -487 -832 -1033 -473 398 1354 1038 524 -543 -851 -142 -583 -825 -502 203 829 1417 809 -430 -799
2521 -799 -969 -884 -359 -279 -296 60 1287 1474 199 -443 -847 -1084 -212 84 -77 94 1144 1189 598 -191
2541 -191 -689 -1199 -485 -9 -29 450 763 956 477 221 -742 -1063 -742 -122 -222 912 862 652 673 296 -998
2562 -998 -1356 -695 -394 72 532 627 441 1055 595 -895 -993 -1101 -212 49 782 636 -62 674 252 -232
2582 -232 -902 -1034 -1041 43 1157 938 636 521 84 -52 -480 -939 -1299 -332 935 948 1058 449 -351 -475
2602 -475 109 -352 -1010 -276 395 621 957 835 -227 -579 -221 -425 -732 -98 -313 515 859 1163 -214
2621b14j35Ok66j06P06k24K23J023J17p50o56m33j99K69O58M5L06P26n12k93P6
2642C67p16p15M68N81j34M34L87M5m74J63q39m56O67K16j47N00N09j84q0l55q04
2663e67k81N49K25l15O29O65m46K49j68j204k28M39j64O67M84k4m76M38K36r22
2683b14n90J9J81M35J083l62o18N87mo25j79k37l58L81J296M5l45j61l31n82M49
2704a30j08p70O05O98K57L31q2q15k74Kr9k29J60M82K60L45L49r67m85J02k89
2725f57J57M55nN0R71j55o79k75J65p57K28N84l68M0R71o4k70m01j23n12L8O91
2747H4j51L88K96l62J06k05l63l13l66R87k95L88K73R2L6l75n13n51K70J99K25
2768a50k62Q27r4J12k91n16m18L56K12Q9O1N29j91J91mn92k02j74j68Q26J6M11
$$ plain form
2621 -214 -349 -343 -609 -715 -9 -233 -10 1013 1130 380 -276 -709 -908 -639 19 64 370 1096 584 291 367
2642 367 -349 -1064 -596 -15 -149 285 672 717 243 406 -433 -889 -222 -6 -153 347 856 672 592 237 -567
2663 -567 -848 -299 -74 -389 240 905 459 708 540 -664 -892 -453 -617 50 534 510 34 472 708 -214
2683 -214 -804 -785 -604 -169 914 552 -66 521 517 -108 -287 -524 -882 -501 795 840 495 334 3 -579 -130
2704 -130 -238 -1008 -403 295 552 883 801 -14 -288 -286 -385 -614 -454 28 288 633 982 15 -470 -368 -657
2725 -657 -500 -45 -50 0 971 816 137 -138 27 -730 -502 82 -286 -246 725 661 391 -10 -133 -645 -607 84
2747 84 -67 321 617 255 361 156 -207 -520 -886 101 -194 194 467 559 595 220 -293 -844 -574 -375 -150
2768 -150 -412 415 321 433 142 -374 -792 -436 -224 -135 -74 455 264 455 451 -141 -343 -517 -685 141 157 568
2790E68j71Rj9o58j19j26j02K25N65N48l75J9j24m74Qj10k42K1N58M69O2K09m46
2813B95j87l56j43j95K09L00N41J03p4j85j43j12l48l62M46L38j93M61K82l53
2833C24k99l72j9j55oL15K72M37M44p33l18k57r5K69J08K26l20N83P4j11q4n81
2855b98k00n9L15M37m7R6L78m01J77l91k62j61K61K38J28L2L32j09k92m16j30
2876c72L5K6J13J34N24l1n5l66j98j35k97K76J77J92L36R1l00K3l3o58M6m0K96
2899b16K82K53J8K04j63n62n0k43K90j68M25M7M17j94j49n5l67j71j56O3M67K04
2921A76J40J27O6m69j50l28j35O57k10N10J39jn32J83l22j21n2j08J31L75L16
2942C92pL02o94k00J8l43L15L4K01J67L58j00l65k30N6l49J71J41J59N27k92p4
$$ plain form
2790 568 397 406 387 -271 -390 -516 -618 -393 172 720 345 364 240 -234 -226 -336 -578 -557 1 470 532 741 295
2813 295 108 -248 -391 -586 -377 -77 464 567 493 308 165 53 -295 -657 -211 127 -66 395 677 324
2833 324 25 -347 -366 -521 -527 -212 60 497 941 208 -110 -367 -462 -193 -85 141 -179 404 478 367 283 -298
2855 -298 -498 -557 -242 195 148 244 622 221 398 7 -255 -416 -155 83 211 243 575 466 174 -242 -372
2876 -372 -337 -311 -198 -64 460 429 374 8 -190 -325 -622 -346 -169 23 359 450 150 173 140 -518 -472 -512 -216
2899 -216 66 319 337 541 378 -184 -234 -477 -187 -355 70 117 534 340 191 136 -231 -402 -558 -495 -28 176
2921 176 316 443 509 40 -110 -438 -573 84 -126 384 523 522 -10 173 -149 -270 -322 -430 -299 76 392
2942 392 385 687 -7 -207 -189 -532 -217 -183 18 185 543 443 78 -152 -96 -445 -274 -133 26 553 261 187
2964A87j09J16l44l40J61R0K16J38J83J87m20J23n40j09j1K21J37K56N08k94o6
2985B90k16l01l53J71J34K50L11qmll05k46P0n14P24j23N56k68K73k28l08J13
3007A5k40j65M0L37j1K9L10q9l94J28R6n64L0N27P1%K48p8j05j17p0m18j26K69
3031b77N61k32J93J47n83K35k00j13j74K67N4M42M70m34l15l03j57K56k13K09
3051a67K33j2J58R7j66m5m00n0K83J36q2K0K68j81K55j75m23k20J7J42N04K17
3073D09J1j79r6J30k42n70L97j25O8L84K09l01K16k96j05r4J22j29k96N53K05
3094B71j86P7o8n05L97J38l42J45j06L04R6K55k88n32L50k78j76N08L4k36K61
3115A19L33l96j07L5k22o0K13J17j02L10Q2k09o7l4n44J6M35K44J21M8j51n51
$$ plain form
2964 187 78 194 -150 -490 -329 -239 -23 115 298 485 65 188 -352 -461 -472 -251 -114 142 650 356 290
2985 290 74 -227 -580 -409 -275 -25 286 278 274 271 -34 -280 -210 -724 0 -123 433 165 438 210 -98 15
3007 15 -225 -390 -350 -13 -24 5 315 226 -168 -40 56 -508 -478 49 120 120 368 290 185 68 -2 -420 -546 -277
3031 -277 284 52 245 392 -191 44 -156 -269 -443 -176 -122 320 790 356 41 -262 -419 -163 -376 -167
3051 -167 66 54 212 309 143 98 -302 -352 -69 67 -15 5 273 92 347 172 -251 -471 -454 -312 192 409
3073 409 420 241 145 275 33 -537 -140 -265 -197 187 396 95 311 15 -90 -184 -62 -191 -487 66 271
3094 271 85 162 94 -411 -14 124 -218 -73 -179 125 221 476 188 -344 6 -272 -448 60 94 -142 119
3115 119 452 56 -51 -16 -238 -298 -85 32 -70 240 322 113 46 12 -532 -516 -81 163 284 332 181 -370
3137c70M10J89n37l42N65n4O0O62m73j27j6j89R8M1L49m53J58M26l19L19j20k33
3159D4n56M18R0j36L99m0j3j58L49l59o51N00j85J86L14J94l42N7m5k40q6J72
3181h8k0LM02Oj97L4J44m46q7L4j20K06J59M09m44L64N2m08j15J30o8j06J73j1
3205Fj80O69n8q11L10p2m8j5L17j02j14Q6J92k03j8j80k92N62L9r3J3N45k66o04
3229c17M02l47j65K18M45m9r0j41j64R5L38o31K62LL40j88L82j23m06J1K18j27
3251c4rRl53K36N25K57o32J46j98k56J67L6J51J6N2J28o9O0r6l92J83L18l30n4
3275a39M93j25k07j51K33k05J38j78n5L04R7J2l7r3m0m5m69M99k06R8M45n01L78
3298B46Q1l72j00Kk5K20J43n0J33j77n4j19j97M9j06K17L60l76N8L55n3r7J87
$$ plain form
3137 -370 40 229 -308 -650 -85 -139 -79 583 110 -17 -33 -222 -124 -83 266 -187 -29 397 78 397 277 44
3159 44 -512 -94 -4 -140 259 219 206 48 397 38 -613 -113 -298 -112 202 396 54 111 66 -174 -260 -88
3181 -88 -108 -105 297 303 106 140 284 -162 -249 -215 -335 -129 30 439 -5 359 411 3 -112 18 -50 -156 17 6
3205 6 -174 495 437 -374 -64 -136 -184 -199 118 16 -98 -12 180 -23 -41 -221 -513 49 88 -5 8 553 287 -317
3229 -317 85 -262 -427 -209 236 187 97 -44 -208 -113 225 -406 -144 -141 199 11 393 270 -136 -125 93 -34
3251 -34 -43 -34 -387 -151 374 631 -1 145 -53 -309 -142 -106 45 61 113 241 172 232 136 -256 -73 245 -85 -139
3275 -139 354 229 22 -129 104 -101 37 -141 -196 108 205 217 180 87 47 2 -467 32 -174 -76 369 -132 246
3298 246 327 -45 -145 -143 -168 52 195 145 278 101 47 -72 -269 -220 -326 -109 251 -125 -67 288 235 138 325
3321C25l05j22K9jM7K04K7l19O2k8J35k40L7n8M93j58J20l48K09M4l0n48J62L52
3345H9R3k6K0q1k17M9k15l8MO3L35L87m02K5m10K66q1J19J82k96K47J83j8j25
3369A53M4m59k9J01K5J12j87K44P6j91J09Q7j52jm2l57L84O9M8J78m34K31O7m12
3393c36K16r4L05J82o0q2r2J32o45K47K26K38k40N9p1M8m7r9J66L2m28J25j01
3416c19M80o5M91n65J85k09K2l86M4L72N1l7LL0qj19k23J94j60K38j36J62K86
3439C31m40J54l6j39q1O7J03J36q9n0L14k0l80K58k90j78K29K53N9j16N0j65J95
3462A65j21j01j47L80l13M85k69J09j27j58r7j9J88k40L8N79k06k8J66k42n1p7
3484h6K9L8j19O9K54j54n5L15l95j37N27j68j33J21j55M1K57l29k05n1R6J67O5
$$ plain form
3321 325 20 -102 -73 -74 -27 177 204 -115 -53 -81 54 -186 -149 -207 286 128 248 -100 109 153 123 -425 -263 89
3345 89 182 156 176 95 -122 -73 -288 -326 -322 -259 76 463 61 86 -324 -58 -139 -20 162 -134 113 296 278 153
3369 153 197 -262 -291 -190 -165 -53 -240 4 80 -111 -2 85 -67 -68 -110 -467 -83 -14 34 212 -222 9 76 -336
3393 -336 -120 -214 91 273 213 131 39 171 -474 -227 -1 237 -3 56 -15 33 -14 -113 53 85 -343 -218 -319
3416 -319 161 96 587 22 207 -2 20 -366 -322 50 101 64 67 97 89 -30 -253 -59 -219 19 -117 45 331
3439 331 -109 45 9 -130 -211 -144 -41 95 6 -44 270 250 -130 128 -162 -340 -111 142 201 85 135 -30 165
3462 165 44 -57 -204 176 -137 348 79 188 61 -97 -194 -213 -25 -265 -227 352 146 118 284 42 -9 -86
3484 -86 -57 -19 -138 -69 185 31 -24 291 -104 -241 286 118 -15 106 -49 -8 249 -80 -285 -336 -240 -73 -8
3507h%J40m07L52J35p2l03J05r5Q5O2j77K49J32j39k70J56kP7j57J07J18j04n8
3531g4K33k60l9Q1mK15JK3J18j02k13R1K5j36n7K40n7j36J59o2r7J58J7n67K84
3556a59L25j3k18N8J72j74K15k0l85J80k17JJ08N07j70j97J02l7J40k61J04Nn5
3579A1J59L9l19Q2m3MJ12m59L24J8J03L3k94L31k24P0J05P8j15jJ06j53L31j23
3603A75k97k66L29l3j08O20l20k34K93k04K2k29L70k35l2M68m0k58n2J71l76M02
3625A66k17k24J98J39P6J7j02j86K04p4J78k47J47Q0m62N87j65j12k27M13k73
3646h4J93j02J31j65J50q9J06L1l56l35K15N78j93K7j03j5k6L6kj30j67J81P1
3669d8K99k2r4k01K25o8k02nR3q9K33K63k98l01J08N3j07K47N6l69L77J42j49
$$ plain form
3507 -8 -8 132 -275 77 212 140 -163 -58 -153 -68 -6 -183 66 198 59 -211 -55 -57 20 -137 -30 88 -16 -74
3531 -74 159 -101 -140 -59 -63 152 153 176 294 192 -21 70 95 -41 -98 142 85 -51 108 46 -51 107 124 -443 -159
3556 -159 166 153 -65 -7 165 -9 206 186 -199 -19 -236 -235 -127 380 210 13 115 78 218 -43 61 66 11
3579 11 170 209 -110 -28 -71 -67 45 -414 -90 -72 31 64 -230 101 -123 -53 52 130 15 14 120 -33 298 175
3603 175 -122 -388 -59 -92 -200 420 100 -134 159 -45 -23 -252 118 -117 -149 319 279 21 -31 140 -236 166
3625 166 -51 -275 -77 62 138 155 53 -133 71 -3 175 -72 75 155 -307 280 115 3 -224 189 -84
3646 -84 109 7 138 -27 123 34 140 171 -185 -520 -305 273 80 107 4 -11 -37 -1 -3 -133 -300 -119 -48
3669 -48 251 229 135 -66 159 91 -111 -116 -23 -112 121 384 86 -215 -107 -54 -161 86 142 -227 150 292 143
3692A43j33J56k43O4K27o6j76K1j03nJ3J69k85j74L73K32l29Q9o1J03J10Q6k76
3715f5j78M6K37j4K81k22k67J73L3K1M9J30n41R6M58k25R3R4j76j10K49j44k00
3738a82q5O59o08M57j00k40PJ29q4rk1J43j28R1M6K9k3K2l72k4M10rL8j68r7J05
3764a4J12N0o08Q3K87j45L51L17l23j53mj37M21NQl29K87L0j76j08k18NJ23J20
3788a6M3o8R6k95J51J87J97r3l48K52nk00J60P5m06O23j47k51k99K05J66L3K5
3811H5Q9r9q4Ol4j00j4P1O8kJ48J60m08K8J01K3j04l7m4J20J02k36M42k75J9M9
3837G4P6k80K75j00k32L7L19k09j65j08m1M49jP2k44J58P0J06l03l04K13R5j58
3860b01J22J2J94j53K4J4M9Q1j14r1K20j46K20k27q1j71O2K99l1J51j36p7J41
$$ plain form
3692 143 10 166 -77 -13 214 148 -28 -7 -110 -115 -102 67 -218 -392 -19 213 -116 -27 -88 15 125 211 -65
3715 -65 -243 -197 40 26 307 85 -182 -9 24 45 94 224 -317 -221 237 12 105 199 23 -87 162 18 -182
3738 -182 -267 392 -216 241 141 -99 -92 37 -47 -56 -77 66 -62 29 75 104 81 103 -269 -293 117 108 146 -22 -119 -14
3764 -14 98 148 -460 -377 -90 -235 116 433 110 -43 -47 -184 237 242 250 -79 208 238 62 -46 -264 -259 -136 -16
3788 -16 27 -41 55 -240 -89 98 295 202 -146 106 101 -99 61 136 -270 353 206 -45 -344 -139 27 60 85
3811 85 174 75 -9 -3 -37 -137 -151 -80 -12 -14 134 294 -114 -86 15 38 -66 -103 -147 -27 75 -161 281 6 25 74
3837 74 150 -130 145 45 -187 -150 169 -40 -205 -313 -354 95 94 166 -78 80 150 256 -47 -351 -138 -43 -201
3860 -201 -79 -67 127 -26 -2 12 61 142 28 -63 157 11 231 4 -77 -248 -186 113 82 233 97 20 161
3883A61l35J32K47j73l9j61L12k37L02l72K33Q1l56L04j89j83K26k06L79M7l10
3904a37R0RJ5k9l5K32j0J59j57j27j02K96o8k19j20P6K94k9j52j68K05K97j39
3927A81l81O2N4L3j15L06k12J19Kj17l3J94j40p3J21J19j05P3j58R9j2on0oj3
3952e8k52N23n44L21r8J09n4j16M6M62m28J37K59k05K11j42j24l15L26j66J56
3973D8J1J73k95n7R8M3N8j76N2jK1j23K72j22j2J1j14O5R1p3M04n12R2M2q7l2
3999a23L09j7l09P7M34j36m50R5J75j02L22L0k12k39J28J23J4J37n22R7L03j58
4021b4q0j2KK37k0J01N8l76M8l6J86J64m19Q4N8J28j22j08J21J20k56K11J21l05
4045a19M18J38n80LM2j97K54K87l59K22k17p1M17j76Oj90K68J12k63jJ41l9m06
$$ plain form
3883 161 -174 -42 205 32 -7 -168 144 -93 209 -163 70 151 -205 99 -90 -273 -47 -253 126 173 -137
3904 -137 -47 -38 -23 -52 -87 145 135 294 137 10 -92 204 136 -83 -203 -127 167 138 -14 -182 23 320 181
3927 181 -200 -138 -84 -51 -166 140 -72 47 49 -68 -101 93 -47 -120 1 120 15 88 -70 29 17 11 -39 -45 -58
3952 -58 -310 213 -331 -10 -108 1 -53 -169 -123 339 -89 48 307 102 313 171 47 -268 58 -108 48
3973 48 59 232 -63 -120 -22 21 79 -97 -45 -46 -25 -148 124 2 -10 1 -113 -48 43 -30 374 -138 -46 -4 -91 -123
3999 -123 186 169 -140 -63 371 235 -215 -120 55 -47 275 305 93 -146 -18 105 119 256 -266 -169 134 -24
4021 -24 -104 -116 -114 123 103 204 262 -114 -66 -102 84 248 -171 -87 -29 99 -23 -131 -10 110 -146 65 186 -119
4045 -119 299 437 -143 -140 -98 -295 -41 246 -113 109 -108 -179 238 62 68 -122 146 258 -5 -6 135 96 -310
4068c10M47Q9k85N2j90J73Q3J09l63Q1K77j14m67L06K89m59M65j64N0j10j32L37
4090A64k03P1k19J16K55o2n6k6%m2J91k68M8J39p4l9N3J70j72k46K60o6m2J26
4114G8KK83m01K77k02j6o7O3J71l01o0K02J22k34K77l93M9p8L46j27J87l60M19
4137B37o8l2k93J35j65J53K95k68k81nL91j2oj24l0j31m6J37J60r6K07k84kK91
4161A63n37J28j2L57k6j08q0J00K15k48j51K23J26j09K2J99l64k32N66k4k88o9
4183a49Jj79K90j11L68k55J25J7p0J70k67Q9r6K24l18j89L22n2l7L73j31k11Q3
4206cJ35j62j04J63j91O2J55k72k07M34K18l0j69J3k5N3L21l10l15K41j13J51
4228D5j7K88n63K28m6M6J03l33L10j69K32l3k58jJ43j06J07pKp7J25K78n62L39
$$ plain form
4068 -310 137 226 -59 -7 -197 -24 59 168 -195 -114 163 49 -418 -112 177 -282 183 19 69 -41 -173 164
4090 164 -39 32 -187 -71 184 122 66 40 40 -2 189 -79 -31 108 34 -5 48 218 46 -200 60 -6 -48 78
4114 78 80 363 -38 239 37 21 -46 17 188 -113 -173 29 151 -83 194 -199 -150 -228 118 -9 178 -182 237
4137 237 169 137 -156 -21 -186 -33 262 -6 -287 -292 99 87 81 -43 -73 -204 -250 -113 47 -49 158 -126 -128 163
4161 163 -374 -246 -258 99 73 -35 -115 -15 200 -48 -199 24 150 41 63 262 -102 -334 232 208 -80 -149
4183 -149 -148 -327 -37 -148 220 -35 90 107 37 207 -60 29 -67 157 -161 -350 -28 -80 -117 256 125 -86 -3
4206 -3 132 -30 -134 29 -162 -100 55 -217 -424 10 228 198 29 42 17 70 391 81 -234 7 -106 45
4228 45 28 316 -247 -19 -65 -19 84 -249 61 -108 124 91 -167 -168 -25 -131 -24 -31 -29 -106 19 297 -265 74
4252G4k16o6J64M57m41j38M15m80M75l16q1k30L07J36O5k34J46K10l1j60j25j81
4274b50K52j78K44K8l14L63N7j8l8k22k4K5K06k21l06M45o0L16k57p9m6k42K9
4297b90M12j98j98K63J60Q0l50J31j9J5L9j62R1O0k79K79rj11j58oJ91J61K40
4320C42j45k07k56N18l13N2J64j93K54J68l28j35K33j58L60k00m39K31j67K27
4340HR3k02j95J79Q4N24k42l16j10J80J22k83J94n0K86j50j03Ok18Q5M8n2L3o6
4364a45J04K6J29k62L36k44j64J47j05K28Q1l07L40k82L7M9M6K42P6k82m08M35
4386G7l19M02j96J9l41L19K84k2k52k00K66%M8k43K26j88Q2L39l48j04p2K92j31
4409f2R8l8k3o5K6J7J0l7JK39j17J66j70r4K76k05J13j74N6L50Q8k80k09O4p8
$$ plain form
4252 74 -142 -208 -44 413 -28 -166 249 -231 244 -72 -153 -383 -76 60 125 -109 37 247 216 56 -69 -250
4274 -250 2 -176 68 96 -218 145 202 184 146 -76 -100 -75 131 -90 -396 49 -11 305 48 -31 -77 -319 -290
4297 -290 122 -76 -274 -11 149 229 -121 10 -9 6 45 -117 -26 34 -245 34 25 -86 -244 -250 -59 102 342
4320 342 197 -10 -266 252 -61 -9 155 -38 216 384 56 -79 154 -4 356 156 -283 -52 -219 8
4340 8 101 -101 -296 -117 -33 491 249 -67 -177 3 125 -158 36 -14 272 122 19 25 -193 -108 -60 -112 -79 -145
4364 -145 -41 -15 114 -148 188 -56 -220 -73 -178 50 131 -176 164 -118 -81 -32 14 256 332 50 -358 77
4386 77 -242 160 -36 -17 -358 -39 245 223 -29 -229 37 37 85 -158 68 -120 -38 301 -47 -151 -223 69 -62
4409 -62 36 -2 -25 -90 -64 -47 -37 -74 -73 166 49 215 45 -49 227 22 135 -39 17 367 455 175 -34 30 -48
4434d8J89n5j36p2K8N5J88k6J9J6j18J10K4k65K73k78o6K84j94q0J62j9L9L2j42
4459h0q2k4J61J59l64K98j70m9K77k04K0j55K04Q5K03k4j99j64j0J31J32m00o7
4482c22L88j04L7j77N0N6K8r1J26j89K59J06k98K33P0j96N2K52l76P3N5m0n0j88
4506b46M2N0N6N4J81k28K18l2J28Ql85L41l63M9L78l19N0j73J28J76p4Jl71L76
4530D5m9R1j2q7j45M2J96n01L18n8K59r9J72k14l44N55k66J19N2q8KlK32k44k10
4555b37K31j1J96l7j58k21M98j10l37K74l08J75K33P8l84L60j34L7k21J7k77K47
4577h9O7L3K74j64l63J05L63j88j15r5O9J18l1J60J67j42l46L47j64j19J23l45
4599c35M35K6j9p3j60R5J40Qk58q5L53J95J96p64R9j30K42m1M13l97R8j14J08
$$ plain form
4434 -48 141 86 -50 -122 -94 -39 149 123 142 158 40 150 174 -91 182 -96 -162 122 -72 -152 10 -9 30 62 -80
4459 -80 -162 -186 -25 134 -230 68 -102 -151 126 -78 -58 -213 -9 76 279 255 56 -108 -118 13 145 -255 -322
4482 -322 66 -38 -1 -178 -128 -72 -44 -135 -9 -198 61 167 -131 102 172 -24 28 280 -96 -23 32 -8 -58 -246
4506 -246 -204 -154 -98 -44 137 -91 127 95 223 231 -154 187 -176 -127 251 -68 -18 -191 -63 113 39 40 -331 45
4530 45 -4 87 75 -12 -157 -115 81 -420 -102 -160 99 0 172 -42 -386 169 -97 22 74 -14 -12 -15 217 -27 -237
4555 -237 -6 -17 179 142 -16 -237 261 151 -186 88 -220 -45 188 266 -118 242 108 145 -76 -59 -336 -89
4577 -89 -22 11 285 121 -242 -137 226 38 -77 -172 -103 15 -16 144 311 169 -177 170 6 -113 10 -335
4599 -335 100 126 107 34 -126 -31 109 117 -141 -226 127 322 518 -246 -147 -277 -35 -76 337 -60 38 -76 32
4622C2j25J75K77k22q3j37ll7j75L91O9j80N3j02J41j17mk29K23j03pK44J66l99
4646a52K95R5l94K53k32l37K11L79k40k3L68k37RO4k78J35J83J75n05J37J18n4
4668c0Kj8J19j86K19O7J75k29j60j71J28K76p6k59K52R7Jk8K0k99J13M30m60J07
4692I0k99J12J46J41q2j79m1q5J65L92J8j90k22N3j30Q2J33k53O7r3O8J07r1K24
4716A33k20J79l60L67j29J03J07j57j16k2j06L13j25p2R7L11k74O9n6R4R5l16
4738h5P1m0q9j05m2M11p6j02j24P0Q1L8J1J90k61J54R4k34J30k16J77k50pRN3
4763a42L31J0j17k0k38J65J71k71k3J94K42Q4k21j57j19J93M8m01J95j32Q6J31
4785Ik18L74m0k91K0mJ73K03j23J23k88K12O2l73m3K76j34n4J98n12N99j60R0
$$ plain form
4622 32 -93 82 359 137 54 -83 -86 -123 -298 93 162 -18 35 -67 74 -43 -47 -276 -53 -156 -163 81 247 -152
4646 -152 143 238 -156 97 -135 -472 -261 118 -122 -145 223 -14 -5 59 -219 -84 99 274 -231 -94 24 -30
4668 -30 -28 -46 73 -113 106 173 348 119 -41 -212 -84 192 116 -143 109 206 207 179 199 -100 13 443 -17 90
4692 90 -209 -97 49 190 108 -71 -112 -197 -32 360 378 188 -34 19 -111 -29 104 -149 -82 -175 -107 0 -91 133
4716 133 -87 92 -268 99 -30 73 180 23 -93 -115 -221 92 -33 -105 -8 303 29 98 42 136 231 -85
4738 -85 -14 -54 -143 -248 -290 121 45 -57 -181 -111 -30 8 19 209 -52 102 196 -38 92 -124 53 -197 -204 -195 -142
4763 -142 189 199 82 62 -176 -11 160 -111 -134 60 302 386 165 8 -111 82 130 -271 -76 -208 -122 9
4785 9 -209 165 125 -166 -146 -150 23 226 103 226 -62 150 212 -161 -204 72 -62 -116 82 -430 169 9 99
4808I9k81j82L31K12j65M1m3j51K39J1j91J16k65K64K60l23k6K30J4K6j88j30
4830a02J66J0l1J51k60J90k04l0J60J80M3m93J39K02jo1k79L91l39Q3R8J5J58
4853A86o5L0o6r0j49k7K32j31J41J3q5J59k63J32q4Q1p5n7K38j61j1K67k50Kl48
4878c81J61K39j80K81j03m4J45k01J00p9J41j7J73M3m53J78O9O2J38k50o7j74
4900b19K80k24K08k40L59j37l02O0K51j25J68J10k73J09P2k06K39m2j83K22p4
4921E3m7j9l9K45k76K35k84K23Q5k93J83k52K3L12l35O3m4J73Q7l1k74L52j98
4944e8j00J50LO9j18J41j27R9j8K9Q8k27L00j79Ppp1n2k7P9J35J30l22l8J76K4
4970H6q3k0j60K20J1R1J2j80L17l44M8p8J68j17J80q7r8R1l58qL44l9j7nJ0p6
$$ plain form
4808 99 -182 -364 -33 179 14 55 12 -139 100 111 -80 36 -229 35 295 -28 -54 176 190 216 28 -102
4830 -102 64 74 43 194 -66 124 -80 -110 50 230 273 -220 -81 121 120 59 -220 171 -168 -85 13 28 186
4853 186 121 151 85 -5 -154 -181 51 -80 61 74 -11 148 -115 17 -67 14 -61 -118 120 -41 -52 215 -35 -33 -381
4878 -381 -220 19 -161 120 17 -27 118 -83 17 -62 79 62 235 278 -175 3 72 134 272 22 -45 -219
4900 -219 61 -163 45 -195 164 27 -275 -215 36 -89 79 189 -84 25 97 -109 130 88 -95 127 53
4921 53 6 -13 -52 193 -83 152 -132 91 176 -117 66 -186 -163 149 -186 -123 -167 6 93 62 -212 140 -58
4944 -58 -158 -8 -5 64 -54 87 -40 59 41 70 158 -69 231 52 59 52 -19 -71 -98 -19 116 246 -76 -114 62 86
4970 86 3 -17 -177 43 54 145 157 -23 294 -50 -2 -80 88 -29 151 64 -34 57 -301 -309 35 -4 -21 -26 -16 -92
4996i2j3K10L3K15j98j85l0j25K79k46J77j34K00M4j0j27J0k0j14J26L55j49k32
5019b6L60n26K49N6k31K8Q4J12k77j74K84J89Q8j71P0L5j77J48j73N4J87l0j11
5042D8k54K12k20L45j38k08L83k1j40J47j44K22J03l75P4m20N95o1n2l66J30P
5064a33N1j51J68P7J55l52L23Nj22j48J33m9j41K68L1j94k00M61l02k2K58r7j80
5087a61q8K31j47j30J85Q5K0O5l86L13J70j24j64J18K24l35P4R6j07K6K06j07
5109F4j56J51j03r3L30k15j81J44Q6k0J98j41p4P8k32J4L81M0k26J10k14q1Q7
5132e3k69N09j33J42k46J50l4k25J27K22j73L7j82N5r8R1O0J12K8j63L61m83J9
5155a46J7J19p8J69M00m97j75K93q8r0K8p2J31J30j79J51k67L41k6j99p2J42j37
$$ plain form
4996 -92 -105 105 138 353 155 -30 -60 -185 94 -152 25 -109 91 135 125 -2 8 -12 -126 0 355 206 -26
5019 -26 334 -192 57 113 -118 -90 -6 106 -171 -345 -61 128 216 45 115 150 -27 121 -52 2 189 159 48
5042 48 -206 6 -214 131 -7 -215 168 147 7 154 10 232 335 -40 34 -386 209 148 96 -270 -140 -133
5064 -133 -82 -233 -65 12 167 -185 138 143 21 -127 6 -43 -184 84 115 -79 -279 182 -120 -142 116 19 -161
5087 -161 -249 -18 -165 -295 -110 -25 -5 60 -326 -13 157 33 -131 -13 211 -124 -50 46 -61 -35 171 64
5109 64 -92 59 -44 -137 193 -22 -203 -59 27 7 205 64 -10 68 -164 -150 231 271 45 155 -59 -140 -53
5132 -53 -322 187 54 196 -50 100 66 -159 -32 190 17 54 -128 -73 -171 -80 -20 92 120 -43 318 -165 -146
5155 -146 -129 -10 -88 81 481 -16 -191 102 14 -76 -48 -120 11 141 -38 113 -154 187 161 -38 -110 32 -105
5178a05L6l0lR7Q4pl55K23p0K63j28J39r8j35J19O2j95K15j1l47K54p4K51l59
5202a74l1J70j4p4mK37k23J66N3k8Q2k02L3J33j14j04K8k62K71N7J14l1N9n54
5226d12M21n8q9J47M5l8j57K76j48j9j05M13p7j43Oo4N4j12l0P8Jo6J70K0l11
5251a98q7M39O5r4J10l00K22j08J46k64J33l4J65l17Q5J37N9m84K49J20K4j80
5273a12M8R9M5rk69N10l76j12L17R2k37j18l5Q1n5J29J63k68J36j27K55m7p2p6
5297c8L15m02J04R6j67j3J08L4n4k9N4k01K82p5m5m8j65J39k27K05o5L12k0J28
5321B28j19j28K15l33L03k22K16l89J37p8J14O4J17r9oq9J59l1j89J39J17J08
5343B34j80q0R2J64l00j41J64l9K17p2j33o5L09j28j71J32J09R9n44L71k6k20
$$ plain form
5178 -105 -69 -99 -102 -5 79 72 -283 -60 -130 133 5 144 46 -89 30 92 -103 112 101 -246 8 -66 185 -174
5202 -174 -205 -35 -49 -123 -127 110 -113 53 106 78 160 -42 -9 124 10 -94 -66 -328 -57 0 114 83 142 -412
5226 -412 9 -49 -138 9 54 16 -141 135 -13 -32 -137 276 199 56 62 -2 52 -60 -90 -12 -11 -77 93 113 -198
5251 -198 -285 154 219 125 235 -65 157 49 195 -69 64 30 195 -122 -37 100 159 -325 -76 44 68 -112
5273 -112 -64 35 80 71 -198 312 -64 -176 141 233 -4 -122 -157 -76 -131 -2 161 -107 29 -98 157 110 38 -38
5297 -38 277 -125 -21 75 -92 -105 3 37 -17 -46 8 -193 89 14 -31 -79 -244 -105 -332 -127 -192 120 100 228
5321 228 109 -19 196 -137 166 -56 160 -229 -92 -170 -56 8 125 26 20 -69 90 59 -130 9 126 234
5343 234 54 -26 66 230 -70 -211 -47 -86 131 59 -74 -139 170 42 -129 3 112 211 -333 38 12 -208
5365b08J42K41j61n5N4j70K27L63n27M9J84l09K76J05k49Pj98K28N5j07K46J07
5387C00n08q0M85k75Q5k5k4M0J76l89L49k78P3K0j42L20n0R7l24J07J51j66kk6
5411h6K52q7j35j4o2QJ90m5j25K98l0j5k20J03J61j52j35J3o0J55l4j40j73K40
5435i3N21k74l90J96n0J82j08j1L51l51J8j49Q0J90k76J85j31J23K29n7k57K09
5457A37m18K97j23J40JK40l57J34M3k88K95j62J64j74L10j00l5l6k13K98j27k12
5479a86J85k28j27L18k11L10j04K54l26j0L47k54K74l01K9J43J9j52R9j44j66
5500b31J41J3M3J77k9j80O2M22l02j25J22k25L32k58p1L32k39J27m27L72j29j29
5522b02K83J7j39K6J46K2j83O5j71k5K3j62K92R6j75NlK27o9j4j50P8O5j59L3
$$ plain form
5365 -208 -66 175 14 -41 13 -157 70 433 -94 -45 139 -170 106 211 -38 -31 -229 -1 54 -53 193 300
5387 300 -208 -288 197 -78 7 -18 -42 -2 174 -215 134 -144 -71 -51 -193 127 77 174 -150 -43 108 -58 -60 -86
5411 -86 166 79 -56 -70 -132 -124 66 21 -104 194 164 149 -71 32 193 41 -94 -81 -141 14 -20 -160 -333 -93
5435 -93 428 154 -236 -40 -90 92 -16 -27 324 -27 -9 -158 -78 112 -164 21 -110 13 242 185 -72 137
5457 137 -281 16 -107 33 34 274 -83 51 94 -194 101 -61 103 -71 239 139 104 68 -145 153 26 -186
5479 -186 -1 -229 -356 -38 -249 61 -43 211 -115 -125 222 -32 242 -59 -30 113 132 -20 79 -65 -231
5500 -231 -90 -77 -34 143 114 -66 -4 418 116 -9 113 -112 220 -38 -109 223 -16 111 -316 56 -73 -202
5522 -202 81 98 -41 -15 131 153 -30 35 -136 -161 -138 -300 -8 88 -87 -82 -85 142 73 59 -91 -13 52 -107 -74
5547g4o2L5R8q7J79j64K93m16L44r1j69Q0j84M39m1p3p5PJ6k83O7p6Q7P5k3k37
5573c35M62j09O2J1qJ6j58nK05m55J58J69q2J84l65J78Q3j38J6mJ85j2k01J90
5597D7j16m0j61L25q2m6K7k95O8J48J70M2l0N4J44j90q2o6J14L33k62j94M1L8
5621a3l47L63o4K14J20n66K41Q2J07J96k75j75L7j76K35j64Q6K0J81j27R7k89
5643b17J16J85l26M28n2jn0lP3j07k79L48l04N2K46MM3k55K76j34n9J11rj51J42
5668G7M1j13J1J74j76J43m42J78J19R1K9l04K56k23K34j02j4k7K6kQ8O2l73L20
5692G3J07l90M25J2l97J89j09J79n7k5j3R2oj07nj04R8r4K4J31k15j75M98k67
5716a36Q3KN2J52P2j77K33l03j08O28m56L03l78N3j93k5rK12O4j76K37k91J53
$$ plain form
5547 -74 -136 -101 -3 -90 89 -75 218 -198 146 55 -114 -34 -218 221 180 107 32 39 55 -228 -161 -237 -150 -75 -98 -335
5573 -335 127 18 80 91 83 99 -59 -64 141 -314 -156 13 -69 115 -250 -72 11 -127 -111 -115 70 58 -143 47
5597 47 -69 -109 -270 55 -27 -73 -46 -341 -273 -125 45 87 57 111 255 65 -17 -83 31 364 102 -92 -51 -13
5621 -13 -360 3 -61 153 273 -293 -52 30 137 333 58 -117 -80 -256 -21 -185 -99 -79 102 -25 72 -217
5643 -217 -101 84 -242 186 134 133 83 80 153 46 -233 115 -189 -137 109 113 156 -99 177 43 -16 95 86 -65 77
5668 77 118 5 16 190 14 157 -285 -107 12 103 132 -172 84 -139 95 -7 -21 -48 -22 -24 64 126 -247 73
5692 73 180 -210 215 227 -170 19 -90 89 32 7 -6 86 80 -27 -32 -136 -38 -132 -108 23 -192 -367 131 -136
5716 -136 -53 -51 1 153 225 48 281 -22 -130 498 42 345 -33 20 -173 -198 -207 5 69 -107 130 -161 -8
5739hk04J38j2J76j62J57J11k19K0R2J66j30j48mM2j51L69k26nJ7r4J35N6o7o9
5764b0Pl43M65o2kJ24k9Q6j29O3K17l96j1K1j14L55n5r7j97j06J16O6J3l8j24
5789a90J20j82M28j67j9q5m2K31J07m41K59j04Q4J07k51LK77q1Q8q3k03N0r1J83
5813bk13L10l55M26m02P9M58n33K74k03L94n04J16J81j76J37P6j17o8M05m89K17
5835A1M4j38J03J01l03J74j96P3j58N21p6k07K2L2k42L0K76j4J66k59k4q4J63
5858A5j29J86j86J69P0j56P9j01j5K27k86L07k5j04k38QK38Q9k35nJ35%n9m2L03
5883B45k45J26l49K18J78j19k73J46J69j48n5J86j10J43q7j51L95m83L07m5m1
5904Gj50P1q9J70J06k42M3J03M5m1Q0K52l07J39k13K52l72Q2J81J0l80L32j34
$$ plain form
5739 -8 -212 -74 -86 90 -72 85 196 -23 -3 89 255 125 -23 -27 15 -136 233 7 2 19 -75 60 116 49 -20
5764 -20 -13 -356 109 47 45 169 140 226 97 160 377 -19 -30 -9 -123 232 177 80 -117 -223 -107 -41 -28 -66 -190
5789 -190 -70 -252 176 9 -10 -95 -137 94 201 -240 19 -85 -1 106 -145 -142 135 54 142 59 -144 -94 -185 -2
5813 -2 -215 95 -260 166 -236 -157 301 -232 42 -161 233 -271 -155 26 -150 -13 63 -54 -122 283 -206 11
5835 11 55 -83 20 121 -182 -8 -204 -131 -289 232 156 -51 -29 3 -239 -209 67 53 219 -40 -64 -148 15
5858 15 -114 72 -114 55 125 -31 48 -53 -68 159 -127 180 155 51 -187 -179 59 148 -87 -92 43 43 -16 -58 245
5883 245 0 126 -223 -5 173 54 -219 -73 96 -52 -107 79 -31 112 25 -126 269 -214 93 48 7
5904 7 -143 -72 -161 9 115 -127 -84 19 64 23 103 355 48 187 -26 226 -146 -64 117 127 -253 79 -55
5927e5m6R9l9O0j05K4M9L37k97J6j58Q8K60k28q5P6J3K7l1qJ57m23K03L40l78
5952a04mM5J60j10r7N3J43j62L09k03l04L49N4K5k16J02n7K7Mk90L50j37J67k41
5976a37K04O7m4j64qK48j45J28l41J43K69k96n6R2K47l48P1J6Q8o2K9P5o0k1m
6001ij06K4k42M11l7k3J7p1P1J11j33j06k63O54k67j40J81N1j86P6j80K0J21r6
6025a22J16j14K36On9k9k1M0r8j19K60l14K41J04k95k2K33J3R3j93r2J54R6k47
6049a33P5R1j27P7P3rk69K13K12o5j09L2j36O6p1L58k45k13R6J40Q3j22r9q6K31
6074F3m02K42J39R8r2R2n0K20o39M02L63m44N4L46m13J84k8p4l5l4k86L52Q9k27
6098h0O6n9Q7l66M04o5O3j34K17k83q8K63k37Q2J39l8L07l25J9R7k25J22J35j02
$$ plain form
5927 -55 -101 -2 -41 19 -86 -62 -13 324 27 43 -115 -27 233 5 -80 -4 9 36 5 -3 154 -269 -66 274 -104
5952 -104 -108 -63 97 -13 -110 -57 86 -76 233 30 -274 75 129 154 -62 40 -17 10 14 -276 74 -63 104 -137
5976 -137 67 134 90 -74 -82 166 21 149 -192 -49 220 -76 -132 -40 207 -141 -70 -54 34 -28 1 76 16 -5 -9
6001 -9 -115 -91 -333 78 41 18 35 -36 35 146 13 -93 -356 298 31 -109 72 123 -63 13 -167 -147 -26 -122
6025 -122 -6 -120 116 122 63 34 13 53 -45 -164 96 -218 23 127 -168 -190 43 56 149 -44 -136 18 114 -133
6049 -133 -58 33 -94 -17 56 47 -222 -9 203 138 29 61 -75 -9 -80 278 33 -180 -84 56 139 17 -82 -168 63
6074 63 -339 -97 42 140 48 140 90 310 -329 73 436 -8 46 392 -21 163 135 61 26 -8 -294 58 147 -80
6098 -80 -14 -73 14 -352 52 -13 50 -84 133 -150 -238 25 -212 -130 9 -29 278 -47 -28 69 -156 -34 101 -1
6122ak16M38k95M3qj6lK28k69j6N6J56j53k67K79j47K53k30L26n9j73M6N5j35
6146a08J42k66L39k57L42r2J7L36n31K73j49K39j51j78L7l16M34k25M7M3J32J13
6168B21j50l23K12J81oL7l13l30J10J95K41R1j99m4j2J02J30M2j35o5l57O23m02
6191a51J79J19j81K52Ol43n5L88r9L9k08R4p8K33j54k26M55j55J39l38P7J98l08
6214a17P9P9o7J52k19K16L9o4j45J59nk37K26j28J21r0L5k73N0K92l50J81R3j35
6238a08O2P5j49m6L31j9k01r7J75r1P3l83N44j26Q6j29L4K51l52o2J29qK5j1j00
6263i7J05l9l6J32r2n7o0K45k80K85j05j26K56j28n4R2k35K16R7k7k81J09K05
6286A25m22L52m4L4p3J7R6kj43J6nJ00M9l2J99k20o3J40l93K26J26k11l0MM03
$$ plain form
6122 -1 -217 221 -74 -31 -39 -55 -58 170 -99 -115 -59 97 -56 -323 -44 -191 62 -168 158 99 -74 -28 27 -108
6146 -108 34 -232 107 -150 192 100 117 453 -78 195 46 285 134 -44 -7 -323 111 -114 -67 -24 108 221
6168 221 71 -252 -40 141 135 172 -141 -471 -361 -166 75 166 -33 -77 -89 13 143 185 50 -15 -372 251 -151
6191 -151 28 147 -34 218 224 -119 -174 214 115 154 -54 40 -38 195 41 -185 270 115 254 -84 -7 191 -117
6214 -117 -38 41 -26 126 -93 123 162 98 -47 112 107 -130 96 -32 89 -1 34 -239 -189 103 -247 -66 27 -108
6238 -108 -46 29 -120 -166 165 146 -55 -152 23 -68 5 -378 166 40 126 -3 31 282 -70 -132 -3 -11 14 3 -97
6263 -97 8 -31 -67 65 -27 -84 -144 101 -179 106 1 -125 131 3 -51 41 -194 22 119 92 -189 -80 125
6286 125 -297 55 11 45 -28 -11 85 83 -60 -44 -49 51 100 68 267 47 -16 124 -269 -43 83 -128 -158 -154 249
6311B49k66N5QJ08l90L87j73j9n5K6K14J4m4k50K56m14L17j60K65k60r2L65j80
6334c9P1J38j90q2o9MQ8K71n3j16j17J67k54K00K10j39j55L40j53m4o8J32l36
6357a94L54J04k22j31J46k04j10M33j30p1NN2k71J33M08j50l00K24j23r7jK16
6379G1K9j21R8K68l78p4K14q7RK35l50K89j18L4Oj90O2O2q8J81n0L9K33l30n4
6404a0q3L65m28K12j88K58l2J39j56j95Q2J78k8n2R5j06k15J17l5l3j05K96k51
6427a75L23Kj13j09J85k8j77J93k96K03Q6m95M86k4J68k46l39N57k16m6K90o9
6449A60j7l43K10r5K03J5l22J18J4K7K01r1j54j17J01mJ02J47j36l37M22J52j14
6472A42j65R5k0Qk46K31p0R4p2j5k81M42k71J2J98j23j12Q3J74N1j19k3m3K1J10
$$ plain form
6311 249 -17 38 46 154 -236 151 -22 -41 -96 -70 144 158 114 -136 120 -294 23 -137 128 -132 -224 141 -39
6334 -39 32 170 -20 -102 -171 -167 -79 192 139 23 -94 73 -181 19 229 90 -65 275 122 78 10 142 -194
6357 -194 160 264 42 -89 57 -147 -257 176 46 -25 -20 32 -239 -106 302 152 -148 76 -47 -144 -145 71
6379 71 100 -21 77 345 -33 -107 107 20 29 264 -86 203 85 119 125 -65 -3 59 -29 152 102 141 374 44 -10
6404 -10 -93 272 -156 56 -132 126 94 233 77 -118 -36 142 114 62 157 51 -164 -47 -82 -115 -220 76 -175
6427 -175 148 150 37 -72 113 85 -92 101 -195 8 94 -401 85 61 229 -17 -356 201 -15 -61 229 160
6449 160 143 -200 10 -85 118 133 -189 -71 -57 -30 171 80 -74 -191 -90 -94 8 155 19 -318 104 256 142
6472 142 -23 72 52 60 -186 45 -25 69 -3 -18 -299 143 -128 -116 82 -41 -153 -70 104 155 36 13 -30 -9 101
6497A01j72N0k63L9J49L78k99n9O7J25k09K57m5l8K08k53J66k72q7J54Po4k77
6520c37N51l27O7J93j66m4l9K50p8L03l36j71M3k2J22p9L87l83j27K72o7J50n30
6543c68L93k5k85L03L2j7j78k05L52J66j99l0L64k08l11J34K00k49J62N7j84J97
6565A01l14L18k00K33o1k40J47l34L56po8J99k54k6j83N73j30k67J77k83J67N0
6587d6j58P8L6O2J20j70J06j76L8NJ4K45R4j92O1l85M9J46K80q4j11L2r8r4K83
6612A35j59L27k57j99K62k25J07J21o8k0j22R3j13K11k76J48R9j47j03k2K56K43
6634B91l21J98k48k2j24K98k3K28k17K47m65J99R7l04K10l9m8N2m3n3K42n7J18
6657B16j55K2l85L09OO8k41R7P0P4k59J69q9J58J17j69J73l21J91k2j14R5q0J9
$$ plain form
6497 101 -71 -21 -284 -245 -96 282 -17 -76 -9 116 -93 164 119 81 289 36 202 -70 -157 -3 4 -60 -337
6520 -337 214 -113 -46 147 -19 -63 -102 148 70 373 37 -134 -91 -113 9 -70 317 -66 -193 79 12 162 -368
6543 -368 25 0 -285 18 50 33 -145 -350 2 168 -31 -61 303 95 -216 -82 118 -131 31 88 -96 101
6565 101 -213 105 -95 138 77 -163 -16 -350 6 -1 -69 130 -124 -150 -333 240 110 -157 20 -263 -96 -46
6587 -46 -204 -126 -90 -28 92 -78 28 -148 -110 -105 -91 154 248 56 117 -268 -219 -73 207 123 12 44 -54 -148 135
6612 135 -24 303 46 -153 109 -116 -9 112 44 24 -98 -5 -118 93 -183 -35 64 -83 -186 -208 48 291
6634 291 -30 168 -80 -102 -226 72 49 277 60 307 -158 41 138 -166 44 5 -43 9 -34 -87 155 98 216
6657 216 61 83 -302 7 13 81 -160 -63 7 81 -178 -9 -98 60 177 8 181 -140 51 29 -85 10 -70 -51
6681e1k9j98J60O8M7j03J62J90k92J96j83o9J50K2Kj17N2r9M1M8j15K08m8m6L5
6706C1L9n5L7m7L6j6j17K39P5j83J95l05J6pJ77j31J73k16Q8O0k61K86l03J53
6730c6J23J6L81k46k46kj05J76P6j17K08j52k04L13n4K6j62Q3j82K7n3R7P6J39
6754A82l70J46k8J11k8J04k88K51j02q1Mq8K03q7K85l19O5p9L1L86m56M0K12k0
6778G4k38N5K51j11qJ83J44n38R7p5L02o5k39J07N9p4j48J50J47M5k78K49j46
6801e7P7N3p8J46k39J28j43J47r2J13n2Nk0k1J03N6j52O5k2K65j48l11J93q0n8
6826a22r7P0J95L1l42M85j95k36L82k63J03k9J60K4O8j19q7j72J14N9K66j33l23
6849a61J83o0K61l68J40j89L68r8j35O6r0p0K65j37J32j12J78j37J46k41J90k78
$$ plain form
6681 -51 -80 -278 -118 -50 -3 -106 56 246 -46 150 -33 -102 48 70 72 -45 7 -92 -51 -3 -118 90 42 -4 31
6706 31 70 15 52 5 41 25 -92 147 222 39 234 -71 -55 -62 115 -16 157 -59 29 89 -172 114 -189 -36
6730 -36 87 103 484 238 -8 -10 -115 61 137 20 228 76 -128 185 131 157 -5 78 -104 -77 -130 -33 43 182
6754 182 -188 -42 -70 41 13 117 -171 80 -22 -103 -99 -187 16 -71 214 -105 -40 -119 -88 298 -158 -118 94 74
6778 74 -164 -109 142 31 23 206 350 -188 -91 -166 136 71 -168 -61 -2 -76 -224 -74 73 118 -160 89 -57
6801 -57 20 73 -5 141 -98 30 -113 34 -58 55 3 8 -12 -33 70 126 -26 39 17 282 134 -177 16 -64 -122
6826 -122 -219 -149 46 77 -265 220 25 -211 171 -92 11 -18 142 166 234 115 28 -144 -30 29 295 162 -161
6849 -161 22 -38 223 -145 -5 -194 174 76 -59 7 -83 -153 112 -25 107 -5 173 36 182 -59 131 -147
6871a47R9J37j91K2p4J26k2L21n05L89k66O1o5L01j63j28j08L17n0j13o4J3K02
6894I2r7k51K86j30l40M01j6L29j58j91J86k56M37k10R3m07L76j14k83J25k30
6915c58J55K17O0m1j98K34q1N9p0J09j80J55q6J4m4j59L75k91n7K49m29K64NJ43
6939D5k20J91J74j15k35MM35j29q1k63K77l3k36K37q8J7n3j36L18k42j18K31J02
6962H2j39J34p7j41K26j3j95J7j5R8RR0J63p8k34Q0k3P9oK16M4m55K60j69p4j69
6988b90M05k10j49M34j99J27j33o3P1J14l64L29Kj31J14J38O1k34j1R6o9L8j31
7011e5J27L3l32K92k53L59k74K30l61J88J43l9m8l80N95j38o9j37m6r4J27M39
7033C07l33Q1j64M13k34j04J24Oj8o0q3m4K59n10K44lj39M09j83Q1j01J53l48
$$ plain form
6871 -147 -48 89 -102 -80 -154 -28 -50 271 -234 155 -111 -50 -115 186 23 -105 -213 104 54 -59 -123 -110 92
6894 92 -5 -256 30 -100 -440 -39 -55 274 116 -75 111 -145 292 82 175 -232 144 30 -253 -128 -358
6915 -358 -203 14 74 33 -165 69 -12 47 -23 86 -94 61 -25 -11 -55 -214 161 -130 -187 62 -367 -103 -98 45
6939 45 -175 16 190 75 -160 -156 279 150 69 -194 83 50 -186 51 -37 -20 -73 -209 109 -133 -251 -20 82
6962 82 -57 77 0 -141 85 72 -123 -106 -121 -23 -14 76 239 161 -73 7 -16 63 57 273 317 -138 122 -47 -121 -290
6988 -290 115 -95 -244 190 -9 118 -15 -78 -7 107 -257 72 74 -57 57 195 256 22 11 107 38 76 -55
7011 -55 72 105 -227 65 -188 171 -103 127 -234 -46 97 58 10 -370 225 87 18 -119 -165 -259 -132 307
7033 307 -26 55 -109 304 70 -34 90 96 78 18 -65 -109 150 -360 -116 -119 -258 151 -32 49 -52 101 -247
7056b47J11K20o4N9j07k9J96l08L4J78n9m4j1LK46k20J62k60L9l5K42q4nL0k05
7081a58R2J30j9J00p4r1L7l1K15k59N8M3o8n5K23k6J03j55J2j21P7M9k82J79P3
7106E2j37j49j2L6P2J45J41l70J55K0n6J66%J33k82k22K37J56l99L68po2O6K08
7130B59k08M2j87j64K97J37o7m6k07J83k9K18j84k19K3L1J50J56j94J25K12j66
7152A62r5j69M4j89L18k58K65J15k34j23J59J8m0NQm6j50L54p6OO7j42o4P5j67
7177a57J38k5j1PJ72j42j00J29j01j4J85j99J05R3j21n4K73J0l78K86j94Jl3J8
7201a12J94k57j1J71J28k08K19K5j02k9j19J45J78l75J24k8r7K82r0o2O7k05L09
7224A47m1K57l57K24l38K62J4k1j16p3N8o6j1L50l48j36J15k12j28N90j84O2n5
$$ plain form
7056 -247 -136 84 20 79 -28 -57 139 -169 -135 43 -16 -60 -71 -68 178 -42 120 -140 -101 -136 106 22 17 47 -158
7081 -158 -66 64 45 145 71 -20 17 -14 201 -58 0 43 -25 -80 143 117 220 65 77 -44 33 82 -200 -21 52
7106 52 -85 -234 -246 -210 -138 7 148 -222 -67 -47 -103 63 63 196 -86 -308 -71 85 -314 54 47 -15 51 259
7130 259 51 93 -94 -258 39 176 109 63 -144 39 10 228 44 -175 -152 -121 29 185 -9 116 328 162
7152 162 67 -102 -58 -247 71 -187 78 193 -41 -164 -5 13 -27 -22 -14 -60 -210 144 68 74 141 -1 -65 10 -157
7177 -157 -19 -44 -55 -48 124 -18 -118 11 -90 -104 81 -118 -13 80 -41 -95 178 188 -190 96 -98 -97 -130 -112
7201 -112 82 -175 -186 -15 113 -95 124 149 47 18 -101 44 222 -153 -29 -57 -154 128 38 -24 43 -162 147
7224 147 106 363 6 230 -108 154 168 147 31 -42 16 -50 -61 289 -59 -195 -80 -292 -420 170 -14 48 -7
7247gJ63j19l5J96k85j2J83r8j68J38J49k12K24j53J45n5j30j75K22j15M1qJ47
7270C6K41Q6l34j41L9K77o29L79k8M0k05K52K58l24p9K64m57K35J82j79J7l6K17
7293A11N6J06n52K53J57n7J0K8m8k78K28k06p1J39M2m0J15k49J50L49J14k68k33
7316a44R9q5K23k61K86j00P0K17o17L21J85k50J46P5q2n6O5L9j24k87K21K04j47
7339bJ54J99m93J34m3p9J74n3j4L7N6J30k00l5J85r3k16O3R3L21k64l37L52%O4
7364A33l31J58j25J43K75j29Q3j53j72l9j41L69l46K73j77M17l58J02J36k30J93
7385H1j55Q1o6J20j61K08j56J23j60J52k11K22j45O6j06N1L3J15q1j4J21j53J4
7408b1R1m3m2j18k23K55l9O5M8O8k19J89N0j96K15Pj36Qq4J62o1K64j17j60n7
$$ plain form
7247 -7 156 37 2 198 -87 -99 84 -14 -182 -44 105 -107 117 -36 109 54 -76 -251 -29 -144 -103 -111 36
7270 36 277 363 29 -112 -73 204 -425 -46 -74 -34 -239 13 271 -53 -132 132 -325 -90 92 -87 -70 -106 111
7293 111 167 273 -279 -26 131 74 84 112 64 -214 14 -192 -263 -124 -82 -122 -7 -256 -106 243 357 89 -144
7316 -144 -45 -130 93 -168 118 18 88 305 -312 9 194 -56 90 165 83 27 92 131 7 -280 -59 145 -2
7339 -2 152 351 -142 -8 -51 -130 44 -9 -23 14 70 200 0 -35 150 57 -159 -96 -3 318 54 -283 69 69 133
7364 133 -198 -40 -165 -22 253 124 207 54 -118 -157 -298 71 -275 -2 -179 238 -120 -18 118 -112 81
7385 81 -74 7 -59 61 -100 108 -48 75 -85 67 -144 78 -67 -1 -107 -56 -23 92 11 -3 118 -35 -21
7408 -21 70 27 -15 -133 -356 -101 -140 -75 -27 41 -178 11 61 -135 80 87 -49 -41 -125 37 -24 240 123 -37 -94
7433i4k2OJ61q5mK20j99J65l36J31L17j53j52J84J6q9K2p0k67L66k10J79j52J30
7457F4j76l7K20K91k37O3j26j39M0n8O2K03J23k56n0m7P6r4L10o24L90nR0j0k73
7482b00j72L47J12l66K47J6Q9K1j76K25l57K38J23j26K91m69j12M25R6m40J99
7503A1j15n4q6K60o7o6p2K07J24j60K44j68J80r5q1Mm74K06mJ60M8j0J17n6j25
7528g2j9K74k87p0K25P1l7m7j3K04m52L89pj35Q5%l3l5Pq1J14j09M5j17L8j4P4
7555bk42M48j6J00n41N4J79O2k13j80O72l98l6O9j32L80k80J56j55J46r1j9J25
7578H6k45K47j21K64q7k75J66J42j12m2l23Q1J94o2j9N8K28r6l7R7q2k61L89J51
7602C41j60j48n7K15j80p6O4M6j62J5L4L5O4q7o8J93k29K48j17pj7K09l74L03
$$ plain form
7433 -94 -116 -110 51 -34 -38 182 -17 148 -188 -57 260 107 -45 139 155 66 88 18 -249 117 -93 86 -66 64
7457 64 -112 -149 71 362 125 188 62 -77 -37 -95 -33 170 293 37 -13 -60 16 -78 232 -392 -2 -7 83 73 -200
7482 -200 -372 -25 87 -279 -32 -16 73 94 -82 143 -214 24 147 21 312 -157 -269 156 252 -188 11
7503 11 -104 -158 -244 16 -51 -117 -189 18 142 -18 226 58 238 143 62 66 -408 -202 -206 -46 2 -8 109 53 -72
7528 -72 -91 183 -104 -174 51 122 85 38 25 229 -223 166 159 24 109 109 76 41 48 -33 81 -28 17 -100 -62 -76 -2
7555 -2 -244 204 188 288 -253 -199 -20 42 -171 -351 321 -77 -113 -44 -176 204 -76 80 -75 71 -20 -39 86
7578 86 -159 88 -33 231 144 -131 35 177 65 23 -300 -219 -25 -87 -106 -48 180 84 47 144 62 -199 190 341
7602 341 181 33 -24 191 11 -65 -1 45 -117 -102 -68 -33 31 -56 -124 69 -160 88 -29 -36 -53 156 -218 85
7626H5r1O6kQ4l2j57Q5R7j37J95R7l46J09o3j01L32j07j37j16R2J40j11R3j36
7650f1J93p0J70l01J51j02J98j33L8j27m1j02J51k09J06J99L6P3k31J54l5Nk02
7673a40K02j02P5k88M40n1n9j53O7J57j74k23N2P0M2rk24L31Q7l5o3p1J17j69
7697a21L9J76j06J46o2n9j1o6r2j02K26ln9q3R6j55J48J72q1J26l77J17K21mP0
7722A56j42R3k16K09k5P3l17J86k93O43j26n04M86j3r6n4j28k42O8L23J8K32k15
7745A16k99M13k45j17R1M0J84r2j13J64l11K57j54J29k27l9K14k5L46m32J05j55
7767a50Q6N3k1j99L64O5l93N01m82L07k21P6J15l54L67p5l3J14l60K57m3j48K07
7790C3j04K22l16L83j69o6M5R5k98p5N17m15k3J64R8j64J39R8j55r5lL52k27k10
$$ plain form
7626 85 -6 60 58 142 110 -47 38 135 -2 193 290 -56 53 -10 -111 221 114 -23 -139 -47 93 -18 75 -61
7650 -61 132 62 232 -69 82 -20 178 45 83 -44 -85 -187 -36 -245 -139 60 96 169 -62 92 57 62 -140
7673 -140 62 -40 35 -253 187 136 77 -76 -9 148 -26 -249 -197 -127 -85 -94 -318 13 100 65 2 -69 48 -121
7697 -121 -82 94 -12 134 72 13 2 -64 -156 -258 -32 -35 -94 -177 -81 -236 -88 84 3 129 -248 -131 90 86 156
7722 156 14 107 -109 100 75 148 -169 17 -276 367 241 -263 223 210 114 60 -68 -310 -242 81 99 331 116
7745 116 -183 230 -15 -132 -41 -1 183 91 -22 142 -169 88 -66 63 -164 -203 11 -14 332 -100 5 -150
7767 -150 -64 -11 -32 -231 133 198 -195 306 -176 131 -90 -14 101 -253 114 39 6 120 -240 17 -26 -174 33
7790 33 -71 151 -165 218 49 -17 28 123 -175 -250 267 -148 -171 -7 91 -73 66 164 9 -86 -89 263 36 -174
7814a74K62L7j15o0q0j16K07Qm6p7K23k9j32K35k06R1m4p2L04j61O6J06l33O7
7838c9R8N3k7j29K55k06k22J80O4P3k57o1J40J47j89n7J10j10K30R1k57R7j4j19
7862a49R8J41k78Q4L19k69R1N4p3k87K24n9K44Lk9o6j44R0r7PL69j60j64L49j36
7887A62j26j77K42j8L50k27k55M05j67k52K05j54J59j25J0p5q9J00j71J59J28
7908H4j10k18K26K9j5P1j43k21K83P1J75k72l5P2k22mmL80k98K28k73K9L07J6
7932A56k00K88j75m0p3K3K55k38N9k03M8l03L82R6p6qj56L83l09J46k0k09K93
7955A19K67l37j7J26j06L3q9R1j62L0j10K08k85J41j6M6O1K44l81q0K15k19M59
7978B38l78K68k43J01N5j13J72O0k37K42J04m35J46m9Q0L6l02K15OK8k4K33l79
$$ plain form
7814 -174 88 125 10 -50 -130 -246 -39 -31 -77 -154 69 40 -92 143 -63 28 -16 -88 216 55 121 227 -106 -39
7838 -39 59 112 85 -44 211 5 -217 -37 27 100 -157 -218 -78 69 -120 -177 -67 -177 53 144 -113 -16 -30 -149
7862 -149 -51 90 -188 -104 215 -54 37 91 18 -269 -45 -104 140 143 114 48 -96 -6 -103 -96 273 113 -51 298 162
7887 162 36 -141 101 83 433 206 -49 356 189 -63 142 -12 147 22 32 -43 -132 -32 -203 -44 84
7908 84 -26 -244 -18 11 -4 67 -76 -297 -14 57 232 -40 -75 -3 -225 -229 -233 147 -151 77 -196 -167 140 156
7932 156 -44 244 69 29 -44 -21 234 -4 55 -148 -100 -403 -21 75 -1 -9 -165 218 -91 55 35 -174 119
7955 119 386 49 32 158 52 85 -4 87 -75 -45 -155 53 -232 -91 -107 -61 0 244 -137 -217 -2 -221 238
7978 238 -140 128 -115 -14 41 -72 100 160 -77 165 269 -166 -20 -69 11 47 -255 -40 -34 -6 -30 203 -176
8001a76Q7K17p1j33P2J47k30K50l28oJ68K7%k19J76l1m3K96j59k42J71p5K9J35
8025F2r2l00J92j74M93k70J26j11j00K88k29J78l26P7J01n7K99n4N7j27k06K06
8047C3L8o4n8K13r8k74J46J13k82M08k02M9n2R9j52K2L77k42k78K88k99j1N85
8070C59j71n8j90K53l90K06q8J77j18r8J67j10P6j85J03R9J9j76K99j29j49L34
8092B30l21K31j65j27L12Q5k50m3m2J82l90K78J2J57k78q7J53n3N0J0O3L6J4j59
8116a02N3J28k6Q1r8l8R1j05J84j9r0j64K08j28R9P8j93L1r6J93j33J11J5M4k14
8141i0J97p7n8l6j51L1q8K97k7M3m3K37n3q5j06K51j84O6K4l5o8q6J44l83Q4K57
8167F1k42J85j22p8J92J17j30m0j6ol0R0p1K27j23j77Q7j3k5J26j70q1K46j6
$$ plain form
8001 -176 -89 128 57 -76 -4 143 -87 163 -165 -171 -3 24 24 -195 -19 -50 -93 203 44 -198 -27 -102 -73 62
8025 62 -30 -330 -138 -312 181 -89 37 -74 -174 114 -115 63 -263 -186 -85 -142 157 103 160 33 -173 33
8047 33 71 7 -51 162 64 -210 -64 49 -233 175 -27 22 -30 69 -83 -61 316 74 -204 84 -215 -226 359
8070 359 188 130 -60 193 -197 9 -79 98 -20 -118 49 -61 15 -170 -67 32 51 -125 174 45 -104 230
8092 230 -91 140 -25 -152 160 245 -5 -48 -90 92 -298 -20 -8 149 -129 -216 -63 -116 -66 -56 7 43 57 -102
8116 -102 -49 79 53 134 36 -2 89 -16 168 149 59 -105 103 -25 74 152 -41 -10 -106 87 -46 65 80 124 -90
8141 -90 107 30 -28 -64 -215 -184 -272 25 -2 41 -2 235 182 97 -9 242 58 124 148 113 45 -41 103 -280 -196 61
8167 61 -181 4 -118 -196 -4 113 -17 -57 -73 -79 -109 -19 -90 137 14 -163 -76 -89 -114 12 -158 -239 7 -9
8191i
$$ Imaginary data points
##PAGE= N=2
##DATA TABLE= (X++(I..I)), XYDATA
0@%%%%%%%%%qJ6j6J6k4L2m0N6o5P4r2J13j35J61j93K26k60L03l54M09m70N38o15
32c28O99p93Q98j011J137j277J429j593J773j974K192k428K688k971L281l619
48a897L988m394M839n332N877o482P158p915Q778r766J0904j2239J3830j5766
62h417J8178k1281K5448l1374M0535n6729R3910l39632q3418N45911L7049j3979
74B06201L4199N2538j88760k07005j60999n8327L418J95486K79776J69160n8524
85B67163p8450n8221j50926k40845p6774J08439J49398J21986J42609R3121j1616
96B65884j14628j75422j83453p7537M3926R1884J22637J93792J60881k2589j80175
107A25200j73990j12289q9223l3771J10602K07183J44907M5345K6119l7890j98720
$$ plain form
0 0 0 0 0 0 0 0 0 0 0 -8 8 -8 8 -16 16 -24 32 -33 41 -51 62 -73 88 -105 121 -139 164 -190 219 -251 287 -328
32 -328 371 -422 476 -535 602 -675 754 -839 934 -1040 1152 -1276 1412 -1559 1722 -1897
48 -1897 2091 -2303 2536 -2796 3081 -3401 3757 -4158 4620 -5146 5758 -6481 7349 -8417
62 -8417 9761 -11520 13928 -17446 23089 -33640 60270 -279362 -362780 183131 220180 206201
74 206201 240400 292938 104178 -102827 -263826 -322153 -318735 -123249 156527 325687 267163
85 267163 188713 130492 -20434 -261279 -338053 -229614 -80216 41770 184379 277500 265884
96 265884 151256 -24166 -207619 -285156 -241230 -149346 -26709 167083 327964 305375 125200
107 125200 -48790 -161079 -250302 -284073 -173471 33712 178619 223964 250083 212193 13473
118A3473k29531n5834O6412O0763J06910J86205J20816l4228j10883j16245j19673
129a11815r7680j5211P6825J11911J08467J15530P7611o0783j79821j56747o6819
140a98532l439N2032R3503J00291J11434J02433k0887j79944j87736o3769J3279
151a81335J5949O0153J50385J57057M6472o8460j19266j37389j15249k1180P3283
162a39580Q4413P6240J13717R7536l4503j42381j21714o7358m9039J527R5381
173h5761J35488R0148K7716j2235n4164j03878j18703o8568J1054P6005J15339
184A2441J12662N3889j5628n5386r4079j24760q3292J1436P8674J04422J10429
195A10808O9630q814o7827r5345j04418q0008p166P5537J13401R4463N2900J1831
$$ plain form
118 13473 -216058 -271892 -205480 -144717 -37807 148398 269214 234986 124103 7858 -111815
129 -111815 -209495 -224706 -147881 -35970 72497 188027 265638 204855 25034 -131713 -198532
140 -198532 -201971 -149939 -56436 43855 155289 257722 236835 56891 -130845 -194614 -181335
151 -181335 -165386 -105233 45152 202209 248681 180221 60955 -76434 -191683 -212863 -139580
162 -139580 -55167 21073 134790 232326 197823 55442 -66272 -133630 -182669 -181142 -85761
173 -85761 49727 139875 167591 155356 101192 -2686 -121389 -189957 -178903 -102898 12441
184 12441 125103 178992 163364 107978 13899 -110861 -194153 -182717 -104043 379 110808
195 110808 180438 171624 103797 8452 -95966 -175974 -183140 -107603 5798 100261 153161 164992
207A64992m9506j09602j03340m4094l030K4771Q2294J20239P6197l953n2477p5123
219B7368q7343p0800k2844L0572P4342J00155Q8836L0074m6089r0534q7402o5295
231a18960l7149J6665Q3221J09228Q0140K7598l1218q2310r5763p1287l1959J9365
243a32429P7343J00685P3511K6244j8474o6771r7380q0112k5246K8244N8240P4088
255A7943P6517M7519j3864o4444p8633p3056m9636N087O3648Q2043O7051M6112
267A26287Q685m9098q9500q2390m4693P9M5173Q0892Q5382N1345p41m6696p6723
280H002q2891n6785l806M9719Q2347Q0728M6696l082m2760o1476p1734o2977j6228
293a34247M5933P8579P0633M6304J1909l1217o5060o9762n2570k2680K2736O8386
$$ plain form
207 164992 115486 5884 -97456 -141550 -144580 -119809 -37515 82724 158921 154968 102491 27368
219 27368 -59975 -130775 -153619 -123047 -48705 51450 140286 170360 124271 33737 -53665 -118960
231 -118960 -156109 -139444 -56223 53005 133145 160743 129525 47215 -48548 -119835 -151794 -132429
243 -132429 -55086 45599 119110 145354 126880 60109 -37271 -117383 -142629 -114385 -56145 17943
255 17943 94460 141979 128115 63671 -14962 -88018 -137654 -132567 -68919 13124 80175 126287
267 126287 134972 85874 -3626 -86016 -130709 -130630 -85457 -4565 80817 132162 131421 84725 8002
280 8002 -74889 -131674 -135480 -85761 -3414 77314 124010 120928 78168 16692 -55042 -118019 -134247
293 -134247 -88314 -9735 60898 107202 119111 87894 22834 -46928 -99498 -122178 -99442 -31056
305c1056Q1856N2289R460k2101m7509p1557p0814l0064K7006O4139P4155O2730
317I8534K6441k5521o3197o9421n3952k7024R736N1616P8612P0532K7814k6197
329I7973n8852o6171n5030k7585J3349M9170O3134N7443L4764m734m9535p1066
341a7140n8121k5193O635L4719N9694O6136L8265n063l8415n8384o5124m4300
353a06291K290M3849N8553N5733M2365J0347l4571o5447o6040m1660k902L6117
365f7657O1938O1508L7746M639k8448n5408o4736m5155m135L4117N3397N6413
377D4219M1510J0075k5291n0167n8859m6370j2197K5912M9332N5284M4249J6533
389I4230j8366m6293n7524m8468j9435J5963M6555O0302M9620J8494j6085m3968
$$ plain form
305 -31056 50800 103089 112549 90448 42939 -28618 -99432 -129496 -102490 -38351 35804 98534
317 98534 124975 99454 36257 -33164 -87116 -114140 -104404 -52788 25824 96356 124170 97973
329 97973 39121 -27050 -82080 -109665 -96316 -47146 15988 73431 108195 103461 53926 -17140
341 -17140 -75261 -100454 -93819 -59100 594 66730 104995 99932 61517 3133 -61991 -106291
353 -106291 -104001 -60152 -1599 54134 96499 106846 72275 6828 -59212 -100872 -103774 -67657
365 -67657 -5719 55789 93535 98174 69726 14318 -50418 -95573 -99708 -65591 -12194 44219
377 44219 85729 95804 70513 20346 -38513 -84883 -97080 -71168 -21836 33448 77697 94230
389 94230 75864 29571 -27953 -76421 -95856 -79893 -33338 26964 76584 95078 78993 35025
401C5025n8490n0246k0521J4204M2439N8733N1352K1239j4332m2480n6489m8159
413f7725k0931J0205L7158N4763N1216K4846j0677m0010n2296m3726k1616J590
425g7203K7313N1081N3457L1265k600l6234n3661m5641k3477j601K3361M6584
437g356N2637L6817O057l1766n5996m9816k7305k271K3468M5216N0701L7168Q489
450H6043k8612n0502m7682l2817q200K4957M7785M5382L1539J1073j9497m3957
462A5512m8031l5805j0753K0837M1475M4886L5606J2212j6967l5033m2827m3267
474f2155k1988J8831M4799M4279L3042J4947p227k9847m7822m9186k0919J7448
486f5798L9371M4327L8404J6242j0763k7564m0549m6861k7703J0548M0267M7815
$$ plain form
401 35025 -23465 -73711 -94232 -80028 -37589 21144 72496 93735 79403 36923 -19566 -67725
413 -67725 -88656 -78451 -41293 13470 64686 89532 78855 38845 -13451 -57177 -78793 -77203
425 -77203 -49890 1191 54648 85913 83313 47079 -6582 -52223 -75700 -77301 -53940 -7356
437 -7356 45281 82098 88155 56389 393 -49423 -76728 -78999 -55531 -10315 40386 77554 86043
450 86043 57431 6929 -40753 -73570 -81770 -56813 -9028 36354 67893 78966 59469 15512
462 15512 -32519 -68324 -79077 -58240 -16765 28121 63727 75939 58972 23939 -18888 -62155
474 -62155 -84143 -65312 -20513 23766 56808 71755 64528 34681 -13141 -62327 -83246 -65798
486 -65798 -26427 17900 56304 72546 61783 34219 -6330 -53191 -80894 -70346 -30079 17736
498A7736L5133J2127n945j9462m0108m8647k5168Q593K9368M1885M1388J9887
510F6787n898k2450l6054l9599k7119n686K1252M7768M6461J8770k588j7496l7050
523G098m2676k6073m470J6090L8737M6285L1525M789k5530m4348l5046j8721j0432
536f2772Q900L9036M5716K8075Q549j6533m0250m1936k3326n065J3529K8839L4125
549A6887L2908K0183j3816m2966l8034k1748j1965N915K8699L7508L4222J8869
561F6662j1449l4712l5444k9743j7735Q698K9174L1963L4338K6121p485l7509
573B2879l7674k7205j4607L830K1530L3897L9451K1643j0111k6469k9534l5926
585c8296k2830Q596K6485K6825L0632K3714L94k0752l2034l6484k3080K526K0952
$$ plain form
498 17736 52869 64996 59051 39589 -519 -49166 -74334 -65741 -36373 5512 46900 66787
510 66787 60889 38439 2385 -37214 -64333 -70019 -48767 -999 45462 64232 61644 44148 7098
523 7098 -35578 -61651 -66121 -50031 -11294 34991 66516 71305 45775 1427 -33619 -52340 -62772
536 -62772 -53872 -14836 30880 58955 67504 50971 10721 -31215 -54541 -59606 -46077 -17238 16887
549 16887 49795 69978 56162 13196 -24838 -46586 -58551 -52636 -23937 13571 47793 66662
561 66662 55213 20501 -14943 -44686 -62421 -53723 -24549 7414 41752 67873 60388 22879
573 22879 -14795 -42000 -56607 -52777 -31247 2650 42101 63744 53633 27164 -2370 -38296
585 -38296 -61126 -52530 -26045 780 31412 55126 55520 34768 2734 -33750 -56830 -54304 -33352
598c3352L1410L3534J8941q07j0718k5522m1474l0659Q6K2448L3111L1728J7593
611D6319K902o779k6204m1827k8642j801J6547L0321L5064K1664K244j0635k3911
624A5262l3579k7027j0385J1636L1918L4160J9289P539m298k6481l5920k2729
636d0615q352M391K3964L4608K5455J0634n085k3636l2347k6395j4074N941K4871
649b0640L0136K4310J5802k240k3554l1016k6710j7338L864K5123K9384K3784
661C0905J7025k18k2553k9836k5374j6053j72J9281K8281K7239J8027m66j8545
674B7541k7319k7085j7115J751J4204K0532K8624K5578K385k0380k6476k4782
686b2542j8284k757J2193K2061K7986K4321N766j6117k6381k7345j8156l467Q857
$$ plain form
598 -33352 -1942 31592 50533 49726 39008 13486 -27988 -58647 -58561 -36113 -3002 28726 46319
611 46319 49221 42442 16238 -25589 -54231 -56032 -39485 -9164 25900 47564 49808 39173 15262
624 15262 -18317 -45344 -55729 -44093 -12175 21985 41274 48813 44515 18034 -17886 -40615
636 -40615 -48967 -44576 -20612 13996 39451 50085 45000 21364 -10983 -37378 -51452 -45511 -20640
649 -20640 9496 33806 49608 47368 23814 -7202 -33912 -51250 -47386 -22263 7121 30905
661 30905 47930 47712 25159 -4677 -30051 -46104 -46276 -26995 1286 28525 46552 46086 27541
674 27541 222 -26863 -43978 -42227 -28023 -7491 21133 46711 49096 28716 2240 -22542
686 -22542 -40826 -43583 -31390 -9329 18657 42978 48744 32627 6246 -21099 -39255 -42722 -33865
699c3865K1424L0637K2985L492j1800k1672k8143k1028m170Q470J9115K8636K3480
712C7561N872r801j9960k5539k1833q876O346K0705K6851K0771R039m547j9210
725A7379k6222k1068j0703K229J8387K8332K1917R699k787j6405k6537k2946j0867
738c9592K498J5271K4778K3986J3619k480j7361k3928k1337j3401J6J5722K3673
751A464K1537J3947J374j4886k3624k1142j4285k903J3698K3702K1924J3410K203
764C6419j1249k0033k2739j6835l942J1460K1900K3188J6133K328j0733j8560
776G337k1881j8465n808J1294K0626K1475J6711N827q699j9811k2508j6754o000
789c6656P916J9199K1867J6623N914n622j7429k1971j8699o447O139J6740K1179
$$ plain form
699 -33865 -12441 18196 41181 44673 32873 11201 -16942 -37970 -42140 -33670 -14555 14081 37561
712 37561 43433 33632 13672 -11867 -33700 -42576 -36230 -15525 11326 32097 41136 36589 17379
725 17379 -8843 -29911 -40614 -38385 -19998 8334 30251 39950 37163 20758 -5779 -28725 -39592
738 -39592 -37094 -21823 2955 26941 40560 38080 20719 -3209 -24546 -37947 -37931 -22209 1464
751 1464 23001 36948 38322 23436 -188 -21330 -35615 -38518 -24820 -1118 20806 34216 36419
764 36419 25170 5137 -17602 -34437 -38379 -26919 -5019 18169 34302 36630 25897 7337
776 7337 -14544 -33009 -38817 -27523 -6897 14578 31289 37116 28417 8606 -13902 -30656 -36656
789 -36656 -28740 -9541 12326 28949 34863 29241 11812 -10159 -28858 -35305 -29166 -12426 8753
802H753J7950P808n611j5570k0186j8180q993L814J4619K1095J8751J0184l683
815C0751j5417k0041j8217j0258J919J4300K0133J8803J0696j585j3111j9893
827a920j9618j0563J382J2482J9121J8790J1186m41j1469j8306j8925j2295j01
840c0677J1273J7873J7665J2909J909r904j8422j8577j2241k017R010J6305J8429
853A3535J3754L993q305j7447j9222j3542k973P984J5517J8179J4619M227p096
866B3223j5410j8840j4600m522P161J4915J7751J4531N336n987j4657j7312j4656
879b3067o297N258J4203J7738J4259O151l971j2741j7226j5746o889L878J3017
892a1433J6109J4858P874k447j1359j6237j6769r037K936J2031J6910J5572O982
$$ plain form
802 8753 26703 34511 28900 13330 -6856 -25036 -34029 -30215 -15596 5499 24250 34434 30751
815 30751 15334 -4707 -22924 -33182 -31263 -16963 3170 21973 32669 31084 17973 -1920
827 -1920 -21538 -32101 -30719 -18237 884 19674 30860 30419 18950 644 -18281 -30576 -30677
840 -30677 -19404 -1531 16134 29043 30952 21048 2626 -15951 -28192 -30209 -21199 -4894 13535
853 13535 27289 31282 22977 5530 -13692 -27234 -30207 -22223 -6706 11473 26092 30319 23223
866 23223 7813 -11027 -25627 -30149 -22988 -8073 9678 24209 29545 23558 8901 -8411 -23067
879 -23067 -29364 -24106 -9903 7835 22094 28245 24274 11533 -5693 -21439 -28328 -24450 -11433
892 -11433 4676 19534 27408 24961 13602 -2635 -19404 -28441 -25505 -13474 3436 19008 25990
905B5990j350r732j6046j6616r403J281J0807J6371J5859Q465r32r097j5429j5376
919a5208r606p24Q597J5852J6450Q766M31p241j4481j5850j0546j748P651J4324
933c333J5908R660K819o381j4460j5410j0644l309N173J4238J6800J0793L173
946B5027n990j3408j4656j1351m642M492J3811J4758J1903N752n119j4239j4572
959h234r936m792K549J1299J4390J3194O707m121j3263j3311j1136o847L150J0750
973i601J2283J2924R224k633j2306j4179j1802o266K514Q415J1435J4610R876
986B4494k345j1050j2556j3162q069J733R363J1523J2897Q788q6p684j2744j5044
1000a3942q289J835P191J1203J4391Q984j241o782j0168j3584r714j120N982J1904
$$ plain form
905 25990 24640 14908 -1138 -17754 -27157 -25876 -15069 1302 17161 25626 24694 15597 168 -15208
919 -15208 -24814 -25538 -16941 -1089 15361 24127 24558 17317 2836 -13014 -23560 -25308 -17657 -3333
933 -3333 12575 22235 25054 18673 4213 -11197 -21841 -25150 -19977 -5739 11061 21854 25027
946 25027 19037 5629 -9027 -20378 -25020 -20528 -6717 8041 19944 25696 20577 6338 -8234
959 -8234 -18170 -22962 -20413 -9114 5276 18470 25177 21056 7793 -5518 -16654 -23501 -20351 -9601
973 -9601 2682 15606 24830 22197 9891 -4288 -16090 -22356 -19842 -11427 8 14618 24494
986 24494 22149 11099 -1457 -14619 -22688 -20955 -11592 -69 12828 21616 21530 13846 1102 -13942
1000 -13942 -22231 -20396 -13205 -2002 12389 21373 20132 13350 3182 -10402 -20116 -21236 -15254 -3350
1014c350J4378Q408L31l897j1343j4918q414r89L985J0315J4044R598K353l339
1028A7162j1466j4414q857l198L437J2288J3874O583K641M6r295j4839j1198m153
1042b1389L828J1921J2569P333M411j362r481j1321r149q019K35J2414J4062P926
1056A3978M222r42q953j0632r206p692j34R798J1822R855P807j165j0096j0569
1070a907q479p684n57Q205J0095J0804R040p50q613j0083j0171q333Q19P820P906
1085a888R972J0324Q33p763r871j0699q405N71N913P393J1320R473j22m881p531
1100D639j2192r793k61N386P303J1588R924N60m501p397j1482q995j240K558O849
1115g054J2893R859J349l512p838j1635p864j464J189O104J1952R400L197j188
$$ plain form
1014 -3350 11028 19436 19767 15870 4527 -10391 -18805 -19794 -15809 -5494 8550 18148 20501 17162
1028 17162 5696 -8718 -17575 -20773 -17336 -5048 8826 15409 18050 18096 8801 -6038 -17236 -21389
1042 -21389 -17561 -5640 6929 14262 18673 17311 7830 -3491 -12640 -20659 -20424 -8010 6052 13978
1056 13978 18200 17258 8305 -2327 -11533 -19225 -19359 -9561 2261 12116 19923 18758 8662 -1907
1070 -1907 -10386 -18070 -18627 -10422 -327 10477 19517 18767 10154 71 -10100 -18433 -17614 -9794 -1888
1085 -1888 8084 18408 19241 11478 1607 -9092 -17497 -16926 -11013 -3620 7700 17173 17051 12170 4639
1100 4639 -7553 -17346 -17607 -12221 -4918 6670 16594 17154 12653 5256 -6226 -15221 -16461 -13903 -7054
1115 -7054 5839 15698 17047 13535 5697 -5938 -13802 -15266 -14077 -7973 3979 13379 16576 15388
1129A5388p654j3068q070j599J013O043J0729Q229M075O08o251j1849r014m407
1143a5827K93P704J0742O874L984J652n697j0700q074n878j903P068J1607P789
1157I634M641Q37o123r003p017p084k430O318R560Q763O555J381o639q531p140
1172f278p328j841N206Q176P664Q137K377o046p598q159o993k584M615P314Q082
1187D744P980K219l830p321q535q089j882L802O072Q683Q236K416k950o050q887
1202c392q936k412L714N655Q270Q069K913k383n496q374q497k811J518N194R283
1217B315Q128K731q43n388q756p831l128N79M161R084Q257L825l68m558q987q004
1233h783l890L41M261P977P347M470J525m489q571p593m685j013M694Q064P334
$$ plain form
1129 15388 7734 -5334 -13404 -15003 -13990 -7947 2782 11011 15086 15694 9443 -2406 -11420 -15827
1143 -15827 -15534 -7830 2912 9786 13770 15422 9725 -975 -9049 -14927 -16830 -9762 1845 9634
1157 9634 14275 15112 8989 -14 -7031 -14115 -16545 -10227 -667 8096 14651 16032 9393 862 -6278
1172 -6278 -13606 -15447 -10241 -2065 5599 13736 16113 10067 2469 -5690 -12683 -15267 -10652 -3338 4744
1187 4744 12724 14943 11113 3792 -4743 -12832 -14714 -10912 -4840 3843 12079 14495 11545 5495 -3392
1202 -3392 -12328 -14740 -11026 -5371 2899 10968 13881 11498 6002 -2372 -10869 -13680 -12162 -6968 2315
1217 2315 10443 13174 12331 6943 -1813 -9644 -12772 -12193 -8032 1052 9309 13134 12766 8208 -779 -8783
1233 -8783 -12673 -12332 -8071 -94 7253 11723 13248 8759 188 -7405 -12090 -13103 -8409 -345 6989
1248F989M110J396l373p422p868n240j756M073P583P584M944J574l453o942o718
1263d519o137j952L098O857O877O272K392l456o523p070n577k884K432O683P313
1278C806N616K825k229n975p427n968k685J851N455P530O587K636k272n098o616
1293a964o532l102J477M736O763P025L639j620n300o384o452l383N60M597O516
1308E76O328M056q4m129p178o476m000K5M284O726O436L993l2l755n761p128m395
1325a0514l24L892N897O721M654L29l640o200n761m856q18L162N777O652M444
1340I415J122k444n876o625m947j117K720N413O125M811J422j746n013o435n412
1355h587k026K195N192O420N100J832j912m849n610n424k655J609M866O208N132
$$ plain form
1248 6989 11099 12495 9122 1700 -6168 -11408 -13164 -9091 -1508 6076 11020 12594 9141 2199 -4519
1263 -4519 -10656 -12608 -9510 -2653 4224 10496 12888 9432 2909 -4161 -9738 -12622 -10190 -3507 3806
1278 3806 9422 12247 10018 4043 -3384 -9352 -12037 -10186 -4731 2799 9386 12022 9750 4652 -1964
1293 -1964 -8496 -11598 -10121 -5385 1378 8403 12042 10422 5122 -1262 -7714 -11097 -10537 -5940 576
1308 576 6904 10960 10876 6747 -431 -6907 -10907 -10882 -6598 128 6564 10557 10525 6770 1009 -6119 -10514
1325 -10514 -10838 -6946 -1049 5672 10326 10655 7015 815 -4946 -9802 -10620 -7458 -1681 4971 9415
1340 9415 10537 8093 2217 -4408 -9355 -10472 -7752 -2339 3786 8597 10019 8273 3260 -3175 -8587
1355 -8587 -10613 -8418 -3226 3194 8294 10126 8214 3365 -2245 -7669 -10324 -8715 -3849 2359 7491
1370G491K926j675m945n839m970k721J123M134N981N366K925o46m405o186n295
1385f736k618M42L975N653N437L435o31l613n590n459l537K27L203N484N631L729
1401I032J69l519n374n556l317k24K833M711N883L967M69k714n263o065l510r9
1417h577K282M679N823L593P41j795m476o254m139m37J835M726N428L899J223
1432H551j379m470n919l816j727J620M249N763M126J548j286m008n616m084k267
1447h715J045M424N513L839K159m90m194n235m252k266K42M347N238M050K484
1462H189o95l470m953m130l322M27M126M632M087K740K93l967m553m120l157j71
1478h044L711M253M221L730k96k930l822m496m173l29L638L859M329L723m9k640
$$ plain form
1370 7491 10417 8742 3797 -2042 -7012 -9733 -8610 -4476 1505 6871 9796 9150 4745 -1441 -6736
1385 -6736 -9354 -8912 -4937 716 6153 9588 8957 5344 -246 -5705 -9242 -9015 -5812 -328 5303 9032
1401 9032 9201 5682 308 -5248 -8565 -8789 -5956 -1245 4638 8605 9074 6360 1097 -4968 -8478 -8577
1417 -8577 -6295 -1616 4207 7800 8541 6746 2270 -3984 -8123 -8560 -6725 -1999 3429 7328 8551
1432 8551 7172 2702 -3217 -7033 -8760 -7140 -2891 2872 6998 8546 7260 3252 -2364 -6448 -8715
1447 -8715 -7670 -3246 2267 6106 8265 7775 3581 -1654 -5906 -8172 -7930 -3583 1655 5705 8189
1462 8189 7494 4024 -929 -5059 -8381 -7954 -3828 804 4891 7631 7924 3957 -596 -4716 -7873 -8044
1478 -8044 -4333 -80 4141 7871 7575 4645 823 -3673 -7846 -8175 -4537 -678 3651 7374 7325 4685
1494D685l277m516m006n04K224L681N127L956J15k855l023m509l546q54J717K654
1510b931N332M423R09j578l701n868l201J25P22K801M978L693J051m04l031n684
1526b364m009p87R11L221M955L197J108L21k751n495l677j059n25L303N372L501
1542E222J256J16l360m294l017k046j342L200N395K960K039Q02l092m833k296
1557c290k496j248K932M157L266L244J043l728m238k767k705j138L097L767K411
1572B307L399J776l080l823l116l498o57L088L072K230L253J832k483k611l359
1587a670m532r82L260K807L228L364N58k140j449l427m580j249K036K655L779
1602A658M237L53k248j668l182l851q21O98J490L908M993O77j580j753m408l981
$$ plain form
1494 4685 1408 -3108 -7114 -7618 -5394 -1713 3414 7370 7485 4630 1607 -2902 -6448 -7302 -5585 -2931
1510 -2931 2401 6824 7733 6155 2454 -3414 -6615 -6490 -5768 -2967 2011 5704 6755 6351 3320 -2364
1526 -2364 -6373 -7160 -6249 -3028 1927 5124 6232 6553 3802 -1693 -5370 -6429 -6954 -3651 1721 5222
1542 5222 6478 6594 3234 -1060 -4077 -6123 -7465 -4265 1130 4090 6129 6931 3839 -994 -3290
1557 -3290 -5786 -7034 -4102 55 3321 6565 7608 3880 -358 -3125 -5830 -6968 -3871 -104 2307
1572 2307 5706 7482 4402 579 -2537 -6035 -6692 -3604 -532 1698 4951 6783 4300 1689 -1670
1587 -1670 -6202 -7184 -3924 -1117 2111 5475 6033 3893 2444 -983 -5563 -6812 -4776 -2121 1658
1602 1658 5895 6248 4000 2332 -850 -4701 -5522 -4824 -3334 574 5567 6244 4664 2911 -1497 -5478
1618e478M49O13J037L418M376J094L3j554n079l900n15N28J883L826K975R15Q38
1635E459q05m650m003r33p74J640M721K981J077L17j018m004k942j686j066J311
1651d375M353L203J411J027j396m178k745j590j254J368L560K740K387J635k213
1666C933l473k354k162j737J636L127K651K324K050j706k895k956k763j624K131
1681c818K582K112L122J566j362k477k659l400j797K256K334K455K828J162j059
1696C845j455k358l819k034J401K136K879L373J196j370j700j895l400j329K63
1711d267J172K847L929J682j071j696k930k922j045L12P17K639L333K103m0j243
1727C520l473l234r33k17R05K992L065J192O19o40k905l319j697k24P55K974K888
$$ plain form
1618 -5478 -5029 -4416 -3379 39 4415 5509 5542 3988 -1091 -4991 -5506 -4978 -3095 731 3706 4621 5459
1635 5459 4654 4 -3999 -4932 -5706 -4066 655 3636 4713 5030 4012 8 -2934 -4620 -5686 -4375
1651 -4375 -22 3181 4592 5619 4223 45 -2700 -4290 -5544 -4176 -616 2124 4511 6146 3933
1666 3933 460 -1894 -4056 -5793 -4157 -1030 1621 3945 5995 4289 1394 -1562 -4325 -5949 -3818
1681 -3818 -1236 876 3998 5564 4202 1725 -934 -4334 -6131 -3875 -1541 914 3742 4904 3845
1696 3845 2390 32 -3787 -5821 -4420 -2284 595 3968 5164 3794 2094 199 -3201 -4530 -4267
1711 -4267 -3095 -248 3681 5363 4292 2596 -334 -3256 -4301 -3989 -3272 -633 2700 4803 4763 3520
1727 3520 47 -3187 -4120 -4337 -3432 -440 2625 3817 4436 3796 891 -2428 -4125 -4349 -3594 -620 2268
1744B268J486P35q85k954k676j611q11J033K460K706J776R19k96k944k769j888
1760c451j143R53K622J985K094J626n78k494k974j976j276R64K168K562J569J509
1776D160n20j859k154k492j754O61K269K259K219J261m35j563k061k681j930P83
1792c837J875K254K415J322k10j428j935k834j537j11J722K608K380J019k71j229
1808B203j773k289j913n9R42K552K843J647o79r63k284k005j115r74P81K173K649
1825A736K059L48j390k146k325j110o78K64J876K826J739O42o27k341k064j705
1841b896n71L16J477K466K271J244r64k210k219j891n65R24J086K044K283J144
1857C939k77j839k829j959m94O99J484J558J830J082M54j350k670k509q05P12
$$ plain form
1744 2268 3754 4489 3604 650 -2026 -3637 -4448 -3415 -955 1751 3527 4446 4150 1206 -1563 -3451
1760 -3451 -4594 -3641 -1019 966 3060 4686 4108 1614 -1360 -3336 -4612 -3648 -1480 1082 2651 4160
1776 4160 3640 1781 -373 -2865 -4619 -3958 -1689 570 2789 4050 3615 2052 -9 -2690 -4620 -3837
1792 -3837 -1962 292 2707 4029 3819 2391 456 -2378 -3915 -4026 -2304 304 2684 3703 3432 2203
1808 2203 430 -1859 -3772 -3831 -2889 -337 2506 4153 3474 2511 227 -1778 -2893 -3867 -3086 -913 1736
1825 1736 3795 4143 2753 607 -1718 -2828 -3506 -3242 -1366 1460 3199 3841 3214 873 -1191 -2896
1841 -2896 -3467 -3151 -1674 792 3063 4307 3343 1133 -1086 -2977 -3542 -2618 -1532 512 2795 3939
1857 3939 3662 1823 -1006 -2965 -3459 -2760 -1276 282 2112 3194 3648 2298 -372 -2881 -3686 -2974
1873b974J552J909J724Q74K24p40k327k416j648M61J695J842J690J029K17r68
1889B144j284k343j855m15J582K214J820R53K31p62j301k204j921n58R13K575
1905b11K281Q64j40p72p51j971k303q54J230J819K512J382l10q31j366j213j357
1922a991j034j68J720K709J890J92j035j544j865j037p20J47J048K080K247Q96
1938C535o53j935j969r40n96o7Q79J769K112J184Lk080k135j324p9l19P67J758
1956i0J496J895J83j678k609j482k92M20P62J088J096J667R78j081k443j975p21
1973b786J34J309J407O96J333J139r83j624k061j792J98J573J487Q90R02P31n21
1990B032q94j836k572k92J795J468J574R10J56k86q26j357k512r46J256J633J805
$$ plain form
1873 -2974 -1422 487 2211 3085 3309 2569 242 -2174 -3822 -3361 -1666 176 1866 2895 3112 2144
1889 2144 860 -1483 -3338 -3753 -2171 43 1863 2816 3047 2285 984 -1220 -3141 -3699 -2786 -211
1905 -211 2070 2934 2794 2022 1271 -700 -3003 -3857 -2627 -808 1704 3086 2776 1945 579 -634 -1991
1922 -1991 -3025 -3193 -1473 1236 3126 3318 2283 739 -1126 -2163 -2883 -2736 -1688 392 2639 3535
1938 3535 2882 947 -1022 -1962 -2558 -2625 -1746 23 2135 3319 3322 1242 -893 -2217 -2296 -2615 -1848 -90
1956 -90 1406 3301 3484 1806 -803 -2285 -2577 -2157 -1395 -307 789 2456 3434 2353 -90 -2065 -2786
1973 -2786 -2652 -1343 64 760 2093 3232 2249 625 -1436 -3228 -3030 -1457 30 920 1822 2553 2032
1990 2032 1138 -698 -3270 -3562 -1767 -299 1275 2185 2341 2055 1229 -128 -2640 -3586 -2330 -697 1108
2007A108J104j4o30q0j293k633p36O03J218K536J279l72n66l31j235j676r19k16
2025b853J180K494J975n58m05p53j373r81n88q17M76K363K298J87m44j238j404
2042d41p71K1j264k27K166K051J360j93j249k517n50L18n35j35J075J413K019
2059B541Q03j246l155n90k50M9M98J035M1J830J864q27k515j670n91r0J397R72
2077I6n7J047J645l25j637j221k119l89J828J262K59O90J214m70q44r99k263p77
2095c060J687J123N57J487N82q11m09p75k361r33J291O33J369J153L27n63K94
$$ plain form
2007 1108 2212 2198 1568 1488 195 -2438 -3174 -2571 -1353 1183 2462 2090 1524 1193 -42 -1718 -2637 -2853
2025 -2853 -1673 821 2796 2238 1833 1080 -293 -1274 -1862 -2679 -2203 160 2458 2645 2201 963 -441
2042 -441 -1212 -1191 -2455 -2682 -516 1535 2895 2702 1453 -1064 -1614 -1296 -1831 -1966 -891 522 2541
2059 2541 3344 2098 -1057 -1647 -1897 -1848 -1350 -315 -274 1556 3420 2593 78 -1592 -2183 -2273 -876 96
2077 96 39 1086 2731 2406 769 -452 -2571 -2960 -1132 130 389 1079 2293 1823 979 -20 -2283 -3060
2095 -3060 -1373 -250 307 1794 2376 1565 1156 381 -1980 -2913 -1622 -989 380 1533 1860 1297 1591
$$ [...]
8191i1
##END NTUPLES=NMR FID
##END=
