##TITLE=1H_Pr-14
 CDCl3
 8 sc, 
 14.04.2022
##JCAMPDX= 6.0         $$ Bruker NMR JCAMP-DX V2.0
##DATA TYPE= NMR FID
##DATA CLASS= NTUPLES
##ORIGIN= UXNMR, Bruker Analytische Messtechnik GmbH
##OWNER= root
$$ XWIN-NMR		Version 3.5
$$ Thu Apr 14 14:02:23 2022 Russian Standard Time (UT+4h)  she@DPX200
##.OBSERVE FREQUENCY= 200.13135
##.OBSERVE NUCLEUS= ^1H
##.DELAY= (6, 6)
##.ACQUISITION MODE= SIMULTANEOUS
##.ACQUISITION SCHEME= undefined
##.AVERAGES= 8
##.DIGITISER RES= 18
##SPECTROMETER/DATA SYSTEM= spect
##.PULSE SEQUENCE= zg30
##.SOLVENT NAME= CDCl3
##.SHIFT REFERENCE= (INTERNAL, CDCl3, 0, 15.7039)
##AUDIT TRAIL= $$ (NUMBER, WHEN, WHO, WHERE, WHAT)
$$ ##TITLE= Audit trail, XWIN-NMR		Version 3.5
$$ ##JCAMPDX= 5.01
$$ ##ORIGIN= Bruker BioSpin GmbH
$$ ##OWNER= she
$$ F:/spectra/data/she/nmr/H-F/1/audita.txt
$$ ##AUDIT TRAIL=  $$ (NUMBER, WHEN, WHO, WHERE, WHAT)
(   1,<2022-04-14 14:01:04.90 +0400>,<she>,<DPX200>,
      <created by zg, POWCHK disabled, PULCHK disabled
       configuration hash MD5:
       00 E9 B6 7A A2 85 ED C7 34 08 36 98 17 FE 4E 26
       data hash MD5: 16K
       E4 86 60 45 9A BF A6 F1 6D 86 EC 3C 75 0D E0 21>)
$$ ##END=
$$ 
$$ hash MD5
$$ 8A 6D 0B 8D 45 4E 8B A9 5D BE DB 55 19 B8 21 F0
##$RELAX= 
##$RELAX= 
##$RELAX= 
##$RELAX= 
##$RELAX= 
##$RELAX= 
$$ Bruker specific parameters
$$ --------------------------
##$DU= <F:/spectra>
##$EXPNO= 1
##$NAME= <H-F>
##$PROCNO= 1
##$TYPE= <nmr>
##$USER= <she>
##$AMP= (0..31)
100 100 100 100 100 100 100 100 100 100 100 100 100 100 100 100 100 100 
100 100 100 100 100 100 100 100 100 100 100 100 100 100 
##$AQSEQ= 0
##$AQ_mod= 1
##$AUNM= <au_zg>
##$AUTOPOS= <>
##$BF1= 200.13
##$BF2= 200.13
##$BF3= 200.13
##$BF4= 200.13
##$BF5= 200.13
##$BF6= 200.13
##$BF7= 200.13
##$BF8= 200.13
##$BYTORDA= 1
##$CFDGTYP= 0
##$CFRGTYP= 5
##$CHEMSTR= <none>
##$CNST= (0..31)
1 1 145 1 1 1 1 1 1 1 1 1 1 1 1 1 1 1 1 1 1 1 1 1 1 1 1 1 1 1 1 1 
##$CPDPRG= <>
##$CPDPRG1= <>
##$CPDPRG2= <>
##$CPDPRG3= <>
##$CPDPRG4= <mlev>
##$CPDPRG5= <mlev>
##$CPDPRG6= <mlev>
##$CPDPRG7= <mlev>
##$CPDPRG8= <mlev>
##$CPDPRGB= <>
##$CPDPRGT= <>
##$D= (0..31)
0 1.2 0 0 0 0 0 0 0 0.06 0 0.03 0 0 0 0 0.0002 0 0 0 0 0 0 0 0 0 0 0 0 
0 0 0 
##$DATE= 1649930464
##$DBL= (0..7)
120 120 120 120 120 120 120 120 
##$DBP= (0..7)
150 150 150 150 150 150 150 150 
##$DBP07= 0
##$DBPNAM0= <>
##$DBPNAM1= <>
##$DBPNAM2= <>
##$DBPNAM3= <>
##$DBPNAM4= <>
##$DBPNAM5= <>
##$DBPNAM6= <>
##$DBPNAM7= <>
##$DBPOAL= (0..7)
0.5 0.5 0.5 0.5 0.5 0.5 0.5 0.5 
##$DBPOFFS= (0..7)
0 0 0 0 0 0 0 0 
##$DE= 6
##$DECBNUC= <off>
##$DECIM= 32
##$DECNUC= <off>
##$DECSTAT= 4
##$DIGMOD= 1
##$DIGTYP= 9
##$DL= (0..7)
0 120 120 120 120 120 120 120 
##$DP= (0..7)
150 150 150 150 150 150 150 150 
##$DP07= 0
##$DPNAME0= <>
##$DPNAME1= <>
##$DPNAME2= <>
##$DPNAME3= <>
##$DPNAME4= <>
##$DPNAME5= <>
##$DPNAME6= <>
##$DPNAME7= <>
##$DPOAL= (0..7)
0.5 0.5 0.5 0.5 0.5 0.5 0.5 0.5 
##$DPOFFS= (0..7)
0 0 0 0 0 0 0 0 
##$DQDMODE= 0
##$DR= 18
##$DS= 0
##$DSLIST= <SSSSSSSSSSSSSSS>
$$ [...]
##$SUBNAM1= <"">
##$SUBNAM2= <"">
##$SUBNAM3= <"">
##$SUBNAM4= <"">
##$SUBNAM5= <"">
##$SUBNAM6= <"">
##$SUBNAM7= <"">
##$SUBNAM8= <"">
##$SUBNAM9= <"">
##$SW= 18.05172834244
##$SWIBOX= (0..15)
0 0 2 0 0 0 0 0 0 0 0 0 0 0 0 0 
##$SW_h= 3612.71676300578
##$TD= 16384
##$TD0= 1
##$TE= 0
##$TE2= 300
##$TE3= 300
##$TEG= 300
##$TL= (0..7)
0 120 120 120 120 120 120 120 
##$TP= (0..7)
150 150 150 150 150 150 150 150 
##$TP07= 0
##$TPNAME0= <>
##$TPNAME1= <>
##$TPNAME2= <>
##$TPNAME3= <>
##$TPNAME4= <>
##$TPNAME5= <>
##$TPNAME6= <>
##$TPNAME7= <>
##$TPOAL= (0..7)
0.5 0.5 0.5 0.5 0.5 0.5 0.5 0.5 
##$TPOFFS= (0..7)
0 0 0 0 0 0 0 0 
##$TUNHIN= 0
##$TUNHOUT= 0
##$TUNXOUT= 0
##$USERA1= <user>
##$USERA2= <user>
##$USERA3= <user>
##$USERA4= <user>
##$USERA5= <user>
##$V9= 5
##$VALIST= <valist>
##$VCLIST= <CCCCCCCCCCCCCCC>
##$VD= 0
##$VDLIST= <DDDDDDDDDDDDDDD>
##$VPLIST= <PPPPPPPPPPPPPPP>
##$VTLIST= <TTTTTTTTTTTTTTT>
##$WBST= 1024
##$WBSW= 4
##$XGAIN= (0..3)
0 0 0 0 
##$XL= 0
##$YL= 0
##$YMAX_a= 10878
##$YMIN_a= -9526
##$ZGOPTNS= <>
##$ZL1= 120
##$ZL2= 120
##$ZL3= 120
##$ZL4= 120
##$ABSF1= 10
##$ABSF2= 0
##$ABSG= 5
##$ABSL= 3
##$ALPHA= 0
##$AQORDER= 0
##$ASSFAC= 0
##$ASSFACI= 0
##$ASSFACX= 0
##$ASSWID= 0
##$AUNMP= <proc_1d>
##$AZFE= 0.1
##$AZFW= 0.1
##$BCFW= 1
##$BC_mod= 2
##$BYTORDP= 1
##$COROFFS= 0
##$CY= 11.3945322036743
##$DATMOD= 1
##$DC= 2
##$DFILT= <>
##$DTYPP= 0
##$F1P= 2.36226072786647
##$F2P= -0.459571619588291
##$FCOR= 0.5
##$FTSIZE= 0
##$FT_mod= 4
##$GAMMA= 1
##$GB= 0.15
##$INTBC= 1
##$INTSCL= 1
##$ISEN= 128
##$LB= 0.24
##$LEV0= 0
##$LPBIN= 0
##$MAXI= 10000
##$MC2= 0
##$MEAN= 0
##$ME_mod= 0
##$MI= 1.114404
##$NCOEF= 0
##$NC_proc= 0
##$NLEV= 6
##$NOISF1= 3.799351
##$NOISF2= 2.8
##$NSP= 1
##$NTH_PI= 0
##$NZP= 0
##$OFFSET= 15.70392
##$PC= 1
##$PHC0= -18667
##$PHC1= 23.00075
##$PH_mod= 1
##$PKNL= yes
##$PPARMOD= 0
##$PSCAL= 0
##$PSIGN= 0
##$REVERSE= no
##$SF= 200.130013532006
##$SI= 16384
##$SIGF1= 3
##$SIGF2= 2
##$SINO= 400
##$SIOLD= 16384
##$SREGLST= <1H.CDCl3>
##$SSB= 0
##$STSI= 0
##$STSR= 0
##$SW_p= 3612.71676300578
##$SYMM= 0
##$S_DEV= 0
##$TDeff= 0
##$TDoff= 0
##$TI= <>
##$TILT= no
##$TM1= 0
##$TM2= 0
##$TOPLEV= 0
##$USERP1= <user>
##$USERP2= <user>
##$USERP3= <user>
##$USERP4= <user>
##$USERP5= <user>
##$WDW= 1
##$XDIM= 8192
##$YMAX_p= 0
##$YMIN_p= 0
$$ End of Bruker specific parameters
$$ ---------------------------------
##NTUPLES= NMR FID
##VAR_NAME=  TIME,          FID/REAL,        FID/IMAG
##SYMBOL=    X,             R,               I
##VAR_TYPE=  INDEPENDENT,   DEPENDENT,       DEPENDENT
##VAR_FORM=  AFFN,          ASDF,            ASDF
##VAR_DIM=   8192,          8192,            8192
##UNITS=     SECONDS,       ARBITRARY UNITS, ARBITRARY UNITS
##FACTOR=    0.0002768,     1,               1
##FIRST=     0,             0,               0
##LAST=      2.2672688,     0,               0
##MIN=       0,             -9526,           0
##MAX=       2.2672688,     10878,           0
$$ Real data points
##PAGE= N=1
##DATA TABLE= (X++(R..R)), XYDATA
0@%%%%%%%%%%%%%%%%%%%%%%%%%%%%%%%%kPj3J6j6J6j6J6j6J6j9K4k8L1l2L4l9
49b1M3m6N1n6O2p0P7q5R5j06J20j36J56j81K15k62L28m39O46j149M388P248j3213
72b335p191P742M595p552l808N019L422j887K89K342L26p25K078K427j700l083
88d1K005L217k772n358J67L903k99m258q84L277K330j865k534J973L987q33k830
105h15J985L109k495l258K629J628m676j964M434J038n013j335M795J441m305
120b802l28N018J188l452K97L741p94l721J358L130k633l430K101K446k850l112
136c843J860K757j146k168R23K776M44k213l56K478O00k145n01J870J4k385l96
153a431J792j89j997J0K420P52k391m86L293R44l259n81L670L36l902l33L220
$$ y = [0, 0, 0, 0, 0, 0, 0, 0, 0, 0, 0, 0, 0, 0, 0, 0, 0, 0, 0, 0, 0, 0, 0, 0, 0, 0, 0, 0, 0, 0, 0, 0, 0, -2, 5, -8, 8, -8, 8, -8, 8, -8, 8, -11, 13, -15, 16, -16, 18, -21, 22, -24, 27, -29, 33, -37, 40, -45, 50, -56, 64, -72, 84, -97, 118, -144, 184, -255, 391, -758, 3630, 10878, -2335, -9526, -1784, 2811, -4741, -8549, -3530, -108, -1995, -1706, 636, 962, 237, 2315, 4742, 3042, -41, 1964, 5181, 2409, -2949, -2782, 1121, 822, -3436, -4320, -1043, 1287, -578, -3112, -1139, 2848, 2015, -815, 1170, 4279, 1784, -1474, 1155, 2783, -1893, -3857, 577, 1615, -3398, -4733, 62, 1503, -2802, -3130, 1888, 3076, -376, -79, 3662, 2868, -853, 505, 3635, 1002, -2428, -327, 2119, -731, -3843, -1983, 774, -372, -2540, -1617, 1159, 1603, -610, -966, 1512, 2112, -33, -534, 1336, 1350, -1035, -1431, 361, 172, -1825, -1815, 605, 1357, -1034, -1520, 1773, 2717, -542, -1123, 2547, 2883, -1019, -1352, 1868]
170A868j000l523P79K663j128k474J184K609p87k120J094K715j24k329M20K663
186B510m55k731J91J963o49k150J93J508o25j431M38J382Oj130K89J942J50j775
204c74J76K010k89k247J56J932p09k291M21J621o94j725O62J983m48j713J049
221d80K339o90k070J099K400j133k449J106J840j424k105Q16J447j014j592Q28
237a082J453o19j237Q98J725o45j516J249J741j317j611J240J367j478j603J108
253c27J312j141j412Q05J607n29j617Q53K048o76j807R39J875j126j873J106J456
270A493j481j558J024J129j090j331J002J490r00j258J183J718r09j475J378J560
286A975j447j299J408R05j514j118J193P83j354r17J093J019j033j088J196J452
$$ y = [1868, 868, -2655, -1876, 787, -341, -2815, -1631, 978, 191, -1929, -835, 1880, 1756, -573, -153, 2510, 2055, -676, -485, 1478, 829, -1321, -1128, 380, -245, -1676, -1238, 144, 150, -980, -691, 1251, 1401, -374, -198, 1812, 1523, -724, -568, 1364, 655, -1636, -1215, 406, -288, -2013, -1351, 632, 184, -1529, -480, 1859, 1169, -901, 198, 2598, 1465, -984, 122, 1962, 538, -1567, -751, 696, -318, -1910, -1082, 371, -248, -1485, -587, 1138, 493, -1023, 226, 1967, 650, -961, 279, 1646, 168, -1435, -327, 985, -156, -1568, -763, 844, 315, -1302, -449, 1599, 923, -884, 55, 1930, 804, -1069, 37, 1493, 12, -1546, -522, 607, -483, -1814, -812, 678, -222, -1480, -297, 1421, 512, -963, 415, 1975, 528, -771, 637, 1542, 28, -1090, 103, 886, -468, -1385, -292, 727, -306, -1394, -198, 1254]
302A254j223j194J465J225j421j165J297R62j433r98J128P84j070q65R98J127
318H71r87r41J331J157j211r65J543R28j711q41J541N08j744p70J315N41j461
335h96p28J394Q20j232p40J547J063j343p49J708P40j591n70J439L54j557n60
352i01J229L25j302n59J158P31j185o96J570P72j411n37J613N49j594m59J449
369G52J32j513l22J120K02j263m08J393M61j324k71J634O15j515l10J798K71j691
387b39k01J421K4j497l23J158M8j286j93J163K75j185j88J605K79j510L6J656
405A043L2j557l7J468j12j560n4J207j7j272j23J280J55j261J26J537k6j392K88
424b75J623k64j676K91J394l41j538p4J269Lj505j68J334K15j223k7J461O7j185
$$ y = [1254, 31, -1163, 302, 1527, 106, -1059, 238, 1200, -233, -1231, -103, 681, -389, -1254, -256, 871, -116, -1057, 274, 1431, 220, -745, 798, 1726, 15, -826, 715, 1223, -521, -1291, 24, 565, -896, -1624, -230, 590, -642, -1382, 165, 1228, -115, -864, 844, 1584, -7, -577, 862, 1216, -341, -901, 328, 653, -649, -1208, -50, 681, -504, -1200, 370, 1142, -269, -806, 807, 1356, -238, -697, 752, 884, -629, -951, 169, 371, -892, -1300, 93, 554, -770, -1041, 593, 1208, -307, -617, 1181, 1452, -239, -440, 981, 1005, -492, -815, 343, 391, -895, -1088, 75, 350, -835, -1023, 582, 861, -649, -613, 1043, 1075, -482, -519, 949, 837, -723, -777, 430, 413, -859, -982, 298, 453, -808, -682, 855, 829, -563, -275, 1348, 1084, -592, -301, 1093, 752, -786, -860, 409, 412, -1093, -1261, 73, 288, -935, -962, 499, 566, -619]
443f19M75J359m73j171N63J119o36j314L44J178m33j459O7J511j8j582J72J723
461H06j32j417M11J433m66j237N70J045p22j164M44J001m55j316K90J440k45j375
479a089M01J587k41j325N57J390n72j079O70Q20q22j001O61Q34q92j100P15J171
497F85p09j397P48J547o40j382P85J419n74j192N84J088o36r55N77Q73o59r45
515g83P05J014q89j044J001J149r44j073R41J032r28j094Q14R08p85r99O19R24
533E68q12j000R62J031j015r11J325J091j242q80J327R37j122q89R41Q09q68r54
551g02N54P92o91q83O24Q32q11p12J078O30j163l59J292M79j242m47J199L97j124
570b57n97Q96P06q81q81R35R12r56q02J065Q49j020n79J195M68j205l30J046J92
$$ y = [-619, -144, 1215, 742, -429, 134, 1253, 617, -697, -353, 825, 392, -1067, -1000, 511, 493, -1089, -917, 806, 674, -743, -332, 1101, 635, -602, -32, 1013, 291, -873, -429, 572, 117, -1199, -909, 531, 286, -1089, -688, 899, 658, -667, -110, 1280, 708, -371, 299, 1119, 297, -704, -43, 791, -101, -1201, -486, 685, -24, -1421, -673, 874, 234, -1148, -363, 1056, 482, -710, -126, 962, 326, -629, -52, 821, 162, -783, -78, 936, 47, -997, 4, 1153, 209, -864, 77, 1109, 181, -913, -99, 809, 24, -975, -356, 568, -244, -1244, -282, 749, -266, -1177, 148, 1239, -3, -883, 444, 1381, 259, -630, 311, 1120, 252, -702, -148, 644, -47, -930, -306, 526, -285, -997, 81, 711, -452, -811, 481, 960, -282, -729, 470, 867, -257, -854, 42, 748, -133, -1014, -79, 833, -123, -925, 140, 989, -31, -610, 585, 1053, -152, -482, 564, 756]
589G56j078l74R14L07j091m33R66M11j013l85J222M28j067j93J160K67j031j55
607c89J095J84j057k48R62J68j072l62J023L28j142k95J100K49j042k14J034K85
625F07r63j94R02K51r23l13R15L28j057k69J148J73j167r1J208N1j149J23J111
644F91p0r85L9Q84P1r74j98R41J64r92l00J030K13j128j10J142j1r91J12R14q2
665C60q26J04P85n9p31pP62R6r21j03J047O9j049K3J110r1j087K07R99k28r45
686d85J81Q25k16q66Q8Q40j32r63J40R62r8r65K22J062k74q68L32R13k55p97K18
707a36Q12k29q35J27Q44k62q94J60R22k74r45L47R02l43q08L38Q55l08q16L26
727b17P58k80q36K28Q86k75r92L76R07l51q84M29R45m55p97N44P38m20o77L60
$$ y = [756, -322, -696, 218, 525, -566, -999, -33, 378, -635, -1020, 202, 630, -437, -630, 530, 797, -234, -389, 706, 890, -167, -415, 547, 715, -357, -719, 304, 632, -510, -805, 295, 544, -498, -712, 322, 607, -356, -550, 352, 603, -320, -633, 282, 610, -447, -716, 432, 605, -562, -653, 555, 606, -543, -420, 691, 621, -364, -325, 559, 630, -344, -542, 399, 563, -429, -729, 301, 514, -614, -724, 418, 407, -584, -472, 442, 360, -466, -362, 423, 364, -367, -374, 388, 484, -437, -540, 507, 576, -473, -450, 660, 569, -518, -311, 688, 460, -485, -304, 521, 305, -561, -473, 367, 235, -728, -588, 374, 276, -689, -467, 595, 321, -547, -215, 698, 443, -354, -136, 676, 447, -388, -261, 583, 321, -573, -413, 509, 235, -710, -363, 539, 196, -612, -274, 581, 273, -543, -217, 541, 261, -575, -347, 539, 264, -728, -352, 555, 204, -680, -251, 694, 239, -558, -14, 724, 304, -373, -13]
747a3O76l48p85K67P48m07q13L25Q17m59q24N30P50n41n80N53O43m57n70M85O41
768F38m05o59L94P46m54q31N17P93o19p39N77O43n69o78N78N75n23n62M69N68
788D59m69o01M76O43n36o01O23N69o17n66P41N34p59m22O92M41o44m67O03N29
808F28o22n51N92N85o27o23O51N91p31n42P36M29o86m22O45L90o31l65N92L97
828D36n68m31O44M95o94m27P73L89p59l26P60L52p73l09P19K29o21l60N99L64
848D92o65m03O58L84p17l74P47L48p96k37Q33K18p91j44O63K58o26k44O45K70
868E19o47k69O64K96p45k69Q06J14p68j12P50P2p85l1O94M5o77j20O37K28p00
889b98k61P99J72p35j21P32J68p70r1P67N6p47J1O64O8o74p8P28O2p16r6P40O8
$$ y = [-13, 663, 315, -470, -203, 545, 138, -675, -350, 467, 8, -816, -286, 464, -77, -657, -104, 539, 82, -488, -3, 638, 233, -426, -32, 714, 260, -571, -54, 739, 120, -619, -42, 601, 32, -646, -68, 507, -16, -578, -109, 459, -10, -611, -135, 508, -28, -629, -6, 563, -54, -620, 121, 655, -104, -526, 166, 607, -37, -504, 99, 628, 6, -545, 47, 632, 5, -618, 33, 624, -107, -649, 87, 516, -170, -592, 53, 443, -188, -553, 39, 436, -132, -563, 81, 576, -118, -545, 228, 617, -142, -468, 292, 644, -129, -438, 281, 510, -111, -471, 128, 492, -173, -576, 82, 466, -251, -625, 122, 470, -326, -563, 270, 488, -303, -447, 216, 474, -152, -396, 249, 519, -128, -397, 267, 563, -182, -451, 355, 469, -299, -411, 339, 411, -374, -405, 289, 334, -343, -463, 174, 402, -298, -559, 240, 412, -323, -444, 288, 456, -314, -405, 362, 418, -329, -318, 346, 414, -260, -338, 390, 452, -264, -360, 380, 448]
912D48p81p0Q34q2q00R7P13j43o95J05O39p8o60J16O89l1p00O4Q16j8p95Q7P91
935E46j29p08P2O95j43o66P8N83j10n78mO45j8p58J30P40j60p40K39P50k39p65
957e40L22O80l19n86K46O16k25o42K36O60j70o73K37P08k31p25L31O77l98o85
977d81L87N51l93n76K91N16l00n14K30N72k19n62K88O45k94n75L94N96l54o14
997d12M63N46m59n75M03N46l96n87L58O07m42n83M03O00m00n89M35N86n14m79
1017d89M61M23m17m73M23M60m43m21M71M31m31m49N11N12n40l81N45L49n07l35
1037c00M35L27m89l81M08L56m39m37L93M87m77n14O01M79n52l79N77L78n57l07
1057c91N79K30m55k88M41K87m31l43M54L50n19l20N38L35n82k93O17K19o13j84
$$ y = [448, -333, -403, 431, 349, -451, -354, 359, 216, -479, -374, 265, 187, -473, -357, 332, 301, -399, -335, 481, 463, -332, -245, 546, 417, -291, -219, 476, 333, -333, -255, 328, 218, -360, -364, 281, 263, -495, -365, 375, 215, -525, -286, 464, 225, -540, -218, 462, 143, -443, -197, 419, 194, -448, -212, 448, 278, -395, -158, 550, 319, -406, -75, 602, 204, -481, -94, 457, 64, -512, -221, 295, -5, -519, -289, 283, 64, -498, -210, 435, 141, -434, -40, 556, 202, -412, 51, 597, 138, -437, -34, 512, 116, -471, -113, 494, 52, -531, -128, 472, 72, -517, -82, 504, -10, -489, -28, 395, -22, -495, -72, 388, -55, -476, -5, 426, -5, -454, 57, 569, 29, -352, 193, 542, 35, -300, 135, 462, -27, -408, 0, 356, -83, -520, -127, 360, -117, -631, -30, 449, -103, -482, 95, 473, -84, -391, 188, 418, -37, -325, 116, 403, -28, -371, 83, 433, -86, -406, 132, 467, -115, -408, 209, 428, -185, -369]
1077c69N29J62n48k13N23J93m84k40M70K87m41k82N25K97n27j84N47K04n12k13
1097b76N46J59n38k04M91J73m96k36N18J87n93j50N75J85n71j52O17R4n86p4N28
1118A97Q4m96j29N13J60n76j33N86J73n97j00O31R2o15J2N67j7m97m4M22N8m98
1140b07q3M32N7n17j18N54J21o10j6O44K2o18R5N97k6n17M1N14n9m62m7M72M0
1163C09n67n1N78oo08J8O49m2o37J43O07j90n15J46N00j55m89N3M83j01m87P8
1185b84M73p6n21J71N83j40m82J76N53j69m93J72M99j82m99J00M54j67n27O9N21
1206B31j66n11J39N55j86m86K38N33k03m71K63M48j79m57J61M65k02n17K27M83
1226C65k69n01L10M94l06m30L43L97l11l71K59L87l00m18K39L89k51m83K60M51
$$ y = [-369, 160, 322, -226, -439, 84, 277, -207, -447, 23, 310, -131, -413, 112, 409, -118, -302, 245, 449, -63, -276, 270, 429, -109, -313, 178, 351, -145, -381, 137, 324, -269, -419, 156, 341, -230, -382, 235, 329, -257, -331, 197, 281, -215, -344, 169, 329, -247, -380, 206, 379, -218, -318, 313, 405, -210, -198, 369, 352, -145, -189, 233, 291, -207, -290, 142, 199, -318, -436, 118, 239, -371, -387, 257, 279, -339, -244, 353, 327, -190, -149, 365, 306, -156, -203, 269, 309, -258, -309, 269, 263, -345, -327, 322, 280, -357, -214, 393, 203, -312, -166, 334, 179, -310, -257, 226, 125, -362, -284, 189, 113, -408, -237, 346, 206, -276, -100, 453, 284, -209, -37, 462, 280, -219, -119, 335, 168, -359, -290, 231, 65, -446, -307, 248, 62, -424, -186, 347, 144, -327, -64, 384, 205, -252, -91, 374, 172, -345, -118, 365, 96, -405, -95, 399, 93, -337, 6, 403, 92, -279, -20, 367, 67, -351, -112, 277, 26, -457, -197, 254]
1246B54k65m57L82M19k99l47L22L94k90l14K46L94l20l42K35L67l33m30L04L91
1266C11l44m08L76M09m05l61M78L05l70l16L86L10l68l66L56L13l53l71L82L75
1286C39m27l16M53L18l90k36M42K15l63k31L38K48l92k48K71K40l86l16L85K77
1306B21m51k28M60K66m32j91M80K24m13j53L92K37m19k52M05K32m58k63M30K18
1326C05m71k10M72J98m55j11M48J42m00j25M07J12m13k13M35J21m46j71M39J68
1346B32n06j13N44Q1m13n3M48J06l88p4M05R2m14j56L94J46n13j50M64P9m87q2
1368c58M86N8m61j2M82K2m00k5M05L4l92q1M58L2m77l4M75mm68L2M99m4m56N7
1392a72M63l2m29N6L95k9m43j5L96j7m72j3M82o2m52N3M53m0m07J07M26o7l80
$$ y = [254, -11, -468, -86, 333, 34, -313, 9, 403, 113, -201, 45, 439, 119, -223, 12, 379, 46, -384, -80, 311, -33, -441, -65, 344, -61, -422, 56, 361, -9, -325, 61, 371, 3, -363, -7, 306, -47, -418, -36, 339, -88, -404, 49, 367, -23, -259, 183, 398, 35, -196, 142, 390, -2, -250, 21, 261, -125, -441, -56, 221, -230, -458, 2, 268, -164, -355, 125, 349, -64, -217, 175, 412, -7, -259, 146, 378, -80, -343, 87, 305, -166, -376, 96, 294, -161, -272, 176, 318, -82, -207, 200, 312, -101, -314, 121, 242, -204, -375, 64, 232, -274, -387, 157, 238, -175, -228, 220, 326, -62, -136, 269, 361, -53, -209, 185, 331, -182, -332, 132, 211, -276, -358, 128, 186, -275, -287, 195, 217, -183, -208, 197, 231, -161, -242, 216, 248, -229, -263, 212, 208, -260, -228, 271, 227, -229, -172, 291, 259, -170, -114, 281, 252, -191, -206, 190, 173, -299, -312, 170, 108, -344, -291, 162, 122, -285, -178, 248, 181, -199]
1415a99J39L38l3m25N0M38p5m92R4M56j39m79J61M32j80l96J65M11j58l44J15
1436a21M08j49l86Q1M16j34m32J14M56k09l98K23M13k22l00K02L54j60l40J70
1456a4L50j64l87J37L70j86m46K02M06k96l61K50L66k52l48K70L66k16k87K09
1476c1L07j34l64J86L58k32l67K24L55k72l21K76L18k88k94K84K76k29l07K72
1496A7K71k55l08K25K96k93k96K89K75l17k47L06K74k76k29L13K62k69k42K75
1516G1K86l01k62L03K36l27k78K78K46l32k21L08K14l17k01L23J72k61k15L08
1536C0K17l02k32L11K73l38k47L65J84l78j47L81J30l35q9L07J56l00j57L21J52
1557C02l32k14L45J66l80k03L83J36l92j16L70J22l89n1L56J05k95j13L27J17
$$ y = [-199, -60, 278, 245, -180, -130, 308, 233, -259, -165, 291, 152, -327, -166, 266, 86, -310, -145, 266, 108, -236, -121, 287, 138, -248, -167, 249, 115, -317, -203, 253, 44, -354, -131, 282, 60, -240, -38, 316, 156, -184, -14, 336, 172, -215, -78, 292, 106, -340, -138, 268, -28, -389, -139, 227, -25, -373, -103, 263, 47, -240, -31, 276, 142, -222, -36, 322, 90, -277, -53, 302, 30, -291, -15, 303, 15, -279, 5, 281, 52, -255, 17, 288, 33, -275, -50, 246, -47, -343, -54, 221, -96, -343, -37, 237, -39, -268, 45, 307, 38, -204, 71, 357, 56, -206, 97, 333, 6, -272, 6, 252, -80, -301, 7, 221, -96, -297, 26, 198, -63, -278, 30, 247, -55, -287, 24, 297, -41, -288, 77, 261, -117, -264, 117, 247, -88, -177, 130, 286, -14, -171, 150, 302, -30, -244, 101, 267, -113, -316, 67, 203, -189, -305, 65, 187, -202, -253, 103, 208, -87, -200, 127, 244]
1577B44l07j16L40J25l58j39L44J08l75q3L63P8l69n1L29R4l36j13L60O9l65n9
1599b17L60Q0l98q9L93M7l93k7L90M2l50j9L85O5l84j9L49M1l78o2M36k6m34K9
1623a79L65n4l65J4L75m3l62K1L74nl15l1L76K7l85L5L71k2l97M7L98j03l21Q4
1647i5L02n1l31L8L60n1l34M5L29j2m23N3L67p3l92R4L45q3l60J20L49j34k96
1670b33J03L38q6k81Q2L46q7l34Q0L68j52l44J53L26j75l50J61K62j61k61J47
1691i8K94j46l07J67L07j69k76J43L18j59l36J87L09j77k83J65K75j54k73J64
1711d9L11j74k64J66L07k12k77J59L07k63k35K00K57k45k94K45K46k10k39K02
1731f2K36j78k79K36K72j85k73K36L06k52k62K40K49k92k00K48K09k41k08J98
$$ y = [244, -63, -179, 161, 286, -72, -211, 133, 241, -134, -217, 146, 224, -145, -196, 133, 227, -109, -222, 138, 207, -158, -217, 143, 223, -175, -264, 129, 176, -217, -244, 146, 188, -162, -181, 204, 269, -115, -134, 215, 256, -122, -184, 252, 226, -208, -179, 186, 132, -233, -219, 156, 113, -249, -228, 146, 141, -174, -205, 171, 198, -187, -152, 219, 197, -200, -153, 245, 142, -179, -95, 207, 156, -175, -137, 223, 172, -162, -117, 212, 200, -223, -170, 197, 124, -268, -174, 171, 88, -272, -152, 197, 63, -233, -130, 208, 122, -159, -77, 269, 182, -152, -72, 296, 144, -200, -47, 279, 104, -246, -85, 177, 16, -245, -98, 196, 50, -257, -90, 217, 48, -228, -85, 233, 74, -262, -75, 234, 57, -226, -61, 214, 60, -213, -49, 262, 88, -176, -10, 297, 85, -192, -33, 274, 11, -224, -24, 233, -12, -306, -61, 185, -25, -264, -62, 174, -4, -283, -47, 225, 40, -233, 3, 309, 57, -205, 35, 284, -8, -208, 40, 249, 8, -200, -2]
1751bK36k13k58K37K28k29k54K43K54k99k31K85K07l10j32K34K17k57j77K60K13
1772B52k69j87K54K18k71j86K78J85l39j36K91J23k71j76K86J05k63j28K62J40
1792A68k46j61K64J76k87j66L17J86l17j25L11J14l19q8K72J13k94r5L01R9k72
1813d9j26K74J28l02j26L08J01l60q1L27O8l18n2K92O7l08m2K86Q1k59r8L43N3
1836B07l11n8L52K4l26l8L18qk89k8L14jk73o2K83N4l20n0L44M7l56k5L27K1l34
1861a88J2L14j8k77pL20l3k49J9K71Ol22K4L41j2l36L1L25o4l27O9K75r3k77O4
1886a32K76o0k67L5K53qk74K3L32n5k94P3L13q8k82O9L07j20k14L3K77p2l03Q6
1910i2L00q4k86P8K77j25k88J25K99j59k88J80K19j39k32J04K57r9k41R7K77q9
$$ y = [-2, 234, 21, -237, 0, 228, -1, -255, -12, 242, -57, -288, -3, 204, -106, -238, -4, 213, -44, -221, 39, 252, -17, -204, 50, 268, -3, -189, 89, 274, -65, -201, 90, 213, -58, -234, 52, 157, -106, -234, 28, 168, -78, -239, 25, 201, -86, -252, 65, 251, -66, -191, 120, 234, -85, -173, 99, 212, -82, -177, 124, 223, -49, -175, 99, 227, -75, -201, 107, 208, -152, -233, 94, 162, -156, -208, 84, 151, -157, -199, 87, 168, -91, -189, 154, 207, -104, -162, 190, 214, -112, -150, 168, 160, -129, -157, 157, 156, -117, -179, 104, 158, -162, -212, 132, 179, -177, -202, 125, 146, -188, -176, 138, 120, -157, -164, 156, 123, -126, -107, 164, 170, -152, -128, 213, 201, -135, -104, 221, 157, -170, -101, 174, 81, -196, -132, 144, 84, -183, -148, 105, 97, -177, -154, 178, 123, -171, -98, 215, 127, -155, -86, 221, 101, -113, -80, 197, 125, -178, -92, 208, 124, -162, -84, 193, 68, -220, -95, 204, 45, -243, -63, 156, 17, -215, -111, 146, 47, -194, -97, 180, 91]
1932I1k84J54K69j30k92K08K20j36k77J55K42j93k21J63J97j35k51J33K51j29
1952C5k73J54K64j78k18J90K31k16k00J83K02j87j75J86J94j55k10J42K27j33
1972F3k39J57K84k36k33K06K02k00k05J85J84k14j67J80J62j61j84J49K28j78
1992a7k01K28J57j55k19K52J95k57j62K53J30k14j52J83J61j96j83K22J64k07
2012a8j99K30J90k45j72K45J38k52r9J97J26k17q9J69J61k11j49K47J34k37j23
2033a74K77J12k88p1K44R3k54q9K26J12k44j06K19R1k26j33K50J34k86j33K89
2054D3J12k65o1K42R4k62o0K70K8k43m2K75Q1k94p0K63J03k77r7K70M7k70l9K58
2078A06K0k61k6K57K9k81k0K55J5k42l2K53O1k55m8K97K5k64PK57kk48%K81l3
$$ y = [91, -193, -39, 230, 100, -192, 16, 236, 100, -177, -22, 220, 27, -194, -31, 166, 31, -220, -87, 164, 35, -238, -84, 180, 2, -216, -26, 205, -11, -211, -28, 174, -13, -188, -2, 192, 37, -173, -31, 196, 63, -176, -19, 265, 29, -204, 2, 204, 4, -201, -16, 168, -46, -213, -33, 129, -32, -216, -67, 161, -17, -218, 10, 167, 12, -207, 45, 240, -17, -179, 74, 204, -10, -162, 21, 182, -14, -197, 25, 189, -18, -217, 13, 203, -42, -214, 31, 169, -83, -182, 15, 141, -76, -165, 4, 165, -46, -195, 52, 186, -51, -174, 103, 215, -73, -144, 100, 193, -61, -150, 76, 188, -56, -162, 57, 148, -78, -211, 39, 173, -113, -246, 43, 155, -110, -171, 71, 165, -97, -157, 113, 141, -102, -144, 131, 212, -82, -152, 111, 214, -63, -160, 110, 157, -113, -152, 106, 126, -135, -161, 96, 125, -156, -176, 79, 94, -148, -180, 73, 134, -121, -169, 128, 153, -111, -104, 153, 151, -97, -97, 184, 151]
2103A51k65J6K32L3k95j0K54Ok83oK87l8k38KK79p1k08K6K53qk54N0J98J9k74
2128a44L6K67l6k45N4K33o4k37N4K41p7k30M2K51o0k33L0K46o4k52N9K72n8k40
2152a55L9K67q1k57R1K88j25k06J03J93o6k20O2K53q5k60J02K46j20k41J26K04
2174A58j19k45J58J98j55j86J17K12r4k30J37J96j08k20J32K21j18k32J79J84
2194A85j50j70J16K15j25k27J47J87j41j69J00K03j40k34J83K08k02j95J70J68
2214A29j66j53J71J99k02j75J89J65j31j71J52K03j97j60J80J66j75j61J77J68
2234B08k33j34J88J39j93r4J31J27j66j61J89J40j75j67K06J57k39j12K05J41
2254A57j91j25K11J41j96j31J97J14j86j17J84J49k12j71K37J08k29j01K13R2
$$ y = [151, -114, -98, 134, 167, -128, -138, 116, 122, -161, -167, 120, 82, -156, -154, 125, 54, -154, -128, 125, 117, -137, -87, 111, 130, -144, -108, 159, 123, -122, -68, 165, 101, -136, -82, 159, 82, -148, -106, 145, 85, -148, -118, 128, 64, -188, -129, 143, 85, -155, -116, 151, 70, -187, -96, 192, 67, -139, -36, 157, 91, -129, -67, 186, 101, -159, -57, 189, 69, -172, -46, 158, 39, -206, -48, 150, -5, -191, -74, 138, 44, -186, -49, 147, 39, -181, -49, 172, 54, -178, 1, 185, 35, -135, -19, 196, 71, -156, -9, 178, 37, -132, -32, 171, 31, -203, -20, 188, -14, -209, -39, 129, -37, -190, -19, 180, -22, -197, -8, 157, 26, -145, 7, 210, 13, -147, 33, 199, 24, -137, 40, 208, -25, -159, 29, 168, -25, -119, 12, 139, -27, -188, 1, 141, -34, -201, 5, 162, -77, -189, 16, 157, -34, -159, 52, 193, -3, -134, 63, 177, -9, -126, 58, 207, -5, -176, 61, 169, -60, -161, 52, 144]
2274A44k26r9K29R7k18j04K00J22k00j15K10J11k16r6K34R2k44o4K48P2k27n4
2296a04J99P5k16j08K09R9k16p0J86Q3k25p7K29R2k35r0K47M0j94q3K62M3k27
2319h1l5J99O4j88o8K33M7k70j4K36J6k40j9K31J1k31mK20Qk24l8K13K2k14j9
2344a45K21K0k05j2K16K3k62M4K27k5k04%K25k6k08M2J91J7k12KJ93%k30jK47
2369A38m5k26J2K26o8j86L7K22l7k12L5K17l4k05M1K10l7k03O1K04n4k07P5K08
2393A72r9k17Q6J92p4k01O0J85n4j95O3K09q2k02P4K21q0k07R7J77p4j92Q9J68
2417A16p2j66P0K07p6k22J24K42j63k10J57J57j26j61Q8J67j06j60Q8J57j13j73
2439a75J14J72r6j84J46J45p8k03J34J89j45j98J81J57j27j71J09J71j03j55J24
$$ y = [144, -82, -181, 48, 145, -73, -177, 23, 145, -55, -170, 40, 151, -65, -161, 73, 165, -79, -143, 105, 177, -50, -104, 95, 170, -46, -154, 55, 154, -62, -132, 54, 137, -88, -165, 64, 156, -79, -169, 78, 118, -76, -159, 103, 146, -81, -116, 83, 147, -41, -109, 124, 171, -99, -113, 123, 139, -101, -120, 111, 122, -109, -113, 107, 115, -109, -147, 66, 88, -126, -145, 76, 96, -109, -121, 95, 118, -144, -100, 127, 102, -102, -102, 123, 97, -111, -69, 122, 139, -73, -71, 122, 122, -108, -109, 138, 93, -133, -121, 105, 37, -149, -112, 110, 73, -139, -104, 113, 79, -126, -85, 125, 88, -115, -54, 150, 96, -111, -36, 172, 73, -144, -58, 134, 60, -141, -81, 104, 50, -145, -82, 127, 45, -157, -83, 138, 58, -149, -52, 125, 51, -141, -52, 116, 44, -122, -52, 155, 79, -143, -19, 223, 60, -150, 7, 164, 38, -123, -35, 132, 26, -134, -46, 111, -2, -175, -61, 111, 15, -169, -23, 122, 44, -159, -25, 164, 19, -179, 2, 159, 32, -139, -30, 141, 38, -117, 7]
2460GJ51j29j64J00J93j32j91J76J34j76j48J62J45j50j42J50J42j42j42J42J68
2481A54j52j58J80J50j88j00J87J18k02j31K14J00j83j36J73J25j65j33J46J29
2501A28j67j06J58J08j86q2J86J03j95p6J73Q9j54j00J92Q2j77r3J62J20j74j18
2523a27K03Q4j85q1J54P5j78r4J96N6j58p0J63O9j49j16K00Q1k02o3K15N0j76
2546e3q2K39J9j81m6J75M0j78j1J88K9k10m7J83O4k10n1J99N9k22l2K04L6k51
2570a39OJ98K5k18J2K09J0j96j9J80M7j96RJ84Qj95k0K23j8j93jJ87k0j95J9J90
2596I7k1k03J4K20l3j76J8J62rk01L6K02Lk24L1J92lj98L5J68J6k47N9J99m4j89
2622i6K2K19o3k17P1J78n3k12O6K02o9j68K2J89l4j83M5K05n6j90M1K23p6j84
$$ y = [7, 158, 29, -135, -35, 158, 26, -165, 11, 145, -31, -179, -17, 128, -22, -164, -14, 128, -14, -156, -14, 154, 2, -156, 24, 174, -14, -114, 73, 191, -11, -142, 72, 172, -11, -147, 26, 151, -14, -147, -1, 128, -39, -145, 13, 121, -65, -147, 39, 142, -53, -129, 44, 133, -21, -121, 71, 153, -24, -117, 45, 165, -9, -127, 76, 160, -25, -106, 48, 123, -55, -149, 47, 103, -55, -125, 38, 107, -42, -158, 42, 123, -79, -142, 73, 123, -53, -135, 104, 123, -58, -104, 71, 111, -67, -78, 110, 139, -71, -118, 65, 129, -81, -132, 67, 126, -96, -128, 76, 112, -139, -133, 65, 90, -128, -116, 93, 103, -93, -112, 68, 115, -81, -72, 112, 120, -75, -95, 128, 110, -83, -84, 103, 83, -112, -93, 97, 76, -127, -113, 107, 74, -102, -84, 78, 69, -132, -96, 106, 109, -115, -84, 108, 105, -93, -58, 110, 126, -121, -62, 137, 93, -96, -74, 145, 82, -135, -64, 114, 61, -151, -85, 117, 48, -120, -98, 91, 57, -126, -81, 124, 68, -122, -81, 142, 66, -118]
2646a18O8K13q9j84Q3J67n7j95R0J62q7j89Q1K01r3j83P9J63q7j99J34J59r9j57
2670a37J13J42j07j46Q9J79j04j61J19J68r3j80J12J41q5j79J26J46j27j03Q5
2691bJ20j00j51J18J37j33j34J20J35j30j44J48J59j54j33J24J44j09j28J35J36
2712A58j37j49J19J39j23j52J47J43j56j29J88Q3j64j16J77M7j01j26J57J00j50
2733d5j16J44J11j28p8J17J29j85q1J51J34j56j02J59P5j63r0J51J26j48j52J44
2755cJ30j55j05J50R0j69j11K02Q4j74o5J59P8j65o3J51P0j17q6J45Q0j76o2J99
2779H7K3j42q4J96M4j59n2J56M3j68l4J48L8j56q4J46P5j46m0J63N4j92j8J63
2803F1M7j97jJ90Nj62j9J45L0j44l7J62Qj60k3J87nj94NJ88jk07K9J55Mj56k7
$$ y = [-118, -50, 163, 74, -110, -27, 140, 83, -112, -22, 140, 53, -136, -55, 146, 53, -130, -51, 112, 25, -174, -40, 119, 20, -137, -24, 118, 11, -135, -46, 133, 29, -132, -13, 155, 62, -118, -6, 135, 50, -129, -3, 143, 16, -87, -2, 118, 18, -133, -15, 122, -11, -145, -25, 110, -20, -164, -16, 143, -11, -144, -20, 124, 15, -113, 22, 158, 21, -128, -9, 130, 7, -145, 2, 145, -11, -140, 48, 131, -33, -149, 28, 75, -26, -152, 5, 105, -45, -161, -17, 94, -34, -112, 5, 134, -51, -132, 19, 153, -3, -105, 54, 129, -34, -124, 27, 153, 5, -147, -3, 127, -28, -133, 17, 107, -62, -173, 29, 113, -61, -126, 33, 111, -54, -117, 34, 104, -13, -99, 46, 126, -50, -112, 87, 110, -32, -116, 80, 124, -35, -87, 69, 112, -56, -90, 58, 96, -60, -144, 2, 77, -69, -109, 54, 108, -84, -102, 61, 108, -89, -90, 100, 105, -57, -76, 69, 99, -45, -82, 80, 88, -72, -95, 92, 87, -107, -102, 86, 85, -122, -93, 62, 66, -90, -117]
2830a17J66K9j53l0J59M1j91j9J80K9j85L5J66j5j58J2J42k5j78N0J63k1j52k
2854g4J53oj77KJ82m1j43K5J75n5j64N1J56j7j74M8J53j3j73L9J72n6j43K4J81
2879A25o0j61O4J30m5j68Q6J35n3j69N9J21n3j42O6J45n3j92J39J19o4j39P3J59
2903A22o9j39O3J45r5j01N4J49r8j08N1J23m7j69O4J48q0j41J08J31j22j14Q6
2926c9J22p4j22Q8J22p8j45J19J18j03j22R5J49j06j35J00J39j23j05Q8J33j24
2948cq8J02O3o2j40J19J09j27q4O6J76j73q4J20J24j47q2R1J21r9j00J12R1p8
2972B7j15J15R7j12q7J09J02j64p1J17Q1j10q2J24N7j12q2J23O0r7q7J12Q9j31
2996c7o0J18Q4j30o9J41Q1j59n2J26M6r1o7R9P7j40p2J39P3j23p0J55J1j58k3
$$ y = [-117, 49, 78, -75, -105, 54, 95, -96, -115, 65, 94, -91, -56, 110, 95, -63, -51, 91, 66, -112, -62, 101, 80, -72, -74, 79, 73, -104, -102, 80, 39, -104, -79, 96, 41, -123, -72, 84, 67, -107, -59, 94, 81, -92, -53, 119, 63, -80, -56, 125, 65, -96, -32, 98, 53, -115, -29, 106, 53, -116, -57, 64, 11, -131, -65, 80, 27, -165, -26, 93, 29, -110, -37, 122, 53, -86, -23, 122, 27, -74, -20, 129, 31, -77, -26, 97, 50, -119, -55, 93, 13, -128, -20, 111, -11, -125, -39, 83, 9, -113, -25, 97, 19, -126, -7, 111, 8, -114, -19, 130, 24, -111, -11, 128, 5, -100, -12, 121, -3, -91, 11, 74, 12, -128, -9, 100, -27, -111, -45, 131, -42, -126, -6, 118, -29, -111, -20, 101, 2, -98, 14, 105, 27, -88, 27, 124, 12, -75, 34, 136, -28, -99, 18, 99, -11, -93, 31, 88, -24, -106, 17, 77, -20, -107, 5, 94, -37, -97, 21, 105, -25, -94, 47, 128, -31, -83, 43, 89, -2, -69, 30, 107, -33, -105, 34, 107, -16, -86, 69, 80, -78, -101]
3021a01J38L6j19o6J66L3j48j4J33O2j29q9J80M3j66l8J63J4j48j2J19L3j36k3
3045f9J42K1j61KJ18Kj18m0J36M7j70oJ65j1q6m4J46oj50J8J51j6j13k6J49Nj31
3072d5rJ43J4j60kJ40Jj60JJ42oj25k2J40Jj32kJ19Rj33j2K01k8j75K0J96m6j21
3100e1J3J24l0j29M9J05l4j23L7J44o7j15J3J56n3j47K4J40l3j27L1J53o4j15
3124i9M6J34k2j57N4J24k6j44O7J32p3j09O7J50j03j33R2O7k1j18N0J07l7j27
3148g9KJ43l5j39O3J38q2j24R1J22p2j26P5J47j03j24Q7J21o6r3L0J28p9j04Q5
3173FJ02j09r2O6J15q7r3O9J07n7j43O1J35q5j10J24N4p9p9Q5Q7n9j05J01J01
3198A15j06r6R8R9o8j19R8J03j15j08J05R4j06q7Q4Q9r9r2J14O7j18n2R3Q2j09
$$ y = [-101, 37, 73, -46, -112, 54, 87, -61, -75, 58, 120, -9, -98, 82, 125, -41, -79, 84, 98, -50, -62, 57, 90, -46, -69, 73, 94, -67, -65, 53, 55, -63, -103, 33, 80, -90, -96, 69, 58, -28, -72, 74, 68, -82, -64, 87, 71, -42, -68, 81, 86, -45, -54, 89, 103, -57, -59, 81, 82, -78, -77, 65, 59, -66, -88, 52, 53, -79, -81, 38, 47, -86, -98, 103, 75, -100, -80, 116, 70, -51, -38, 86, 56, -73, -24, 81, 47, -76, -39, 105, 38, -77, -64, 92, 39, -108, -84, 56, 23, -104, -73, 80, 16, -99, -53, 81, 59, -98, -44, 80, 54, -90, -23, 109, 36, -73, -6, 144, 41, -92, 0, 67, 46, -72, -22, 85, 48, -79, -77, 66, 31, -108, -45, 93, 11, -113, -22, 100, 28, -98, -23, 124, 21, -103, -16, 105, 39, -54, -24, 104, 25, -79, 6, 108, -1, -93, -27, 88, 1, -92, -23, 84, 27, -116, -55, 80, -5, -115, 9, 63, -16, -95, -10, 77, 18, -87, 14, 115, 9, -87, 11, 110, 42, -77, 21, 124, 9, -99, 6, 100, -6, -93, -9, 80, -19, -111, 3, 70, -48, -100, -7, 75, -34]
3223c4o3J25N6p9j03J35O2r8o3R4O9j11o6J15P0j36m1J29K4j42m4J26M4j08o5
3248a04Q5J04j51k6J11O3j25o3J41L4j31qR5O2j41k0J21K6r6m5J17N7j65lJ12
3273E0K6j19k7J36lj33k8J42J6j22n0J66pj08k2J34L2j26l9J73kj48j4J44k3j01
3299e3j4J31Qj16lJ13jj19l7J47J8j41k0J32K8j57KJ45j3j36PJ34jj02k5J59j8
3326F8j42L1J25j9j35K2J35l2r7K2P5Qj55M8J02l1r6lJ37l6j33L4J21k1j22N0
3352d4R1%j29M9J05j6j08L6R8m2j12J4J29k3j06K4J00qj26J1J09l6j28M6J39m5
3378B8j32P0J08n6r8L6J27n5j04M4J18n0j13O4J06o4r3O9J00j05p9P3M4K8j39
3403g3M4P7n1q2M6J12n2j12O8R4n1j10N9J08r4p5N9J09o5j17Q7J10n1j23Q4O6
$$ y = [-34, -97, 28, 84, 5, -98, 37, 99, 1, -62, 32, 101, -10, -76, 39, 109, -27, -68, 61, 85, -57, -101, 25, 69, -39, -104, -19, 85, -66, -92, 19, 82, -43, -106, 35, 69, -62, -70, 25, 87, -54, -74, 47, 73, -23, -68, 49, 106, -59, -62, 50, 76, -43, -70, 66, 63, -70, -98, 44, 60, -62, -112, 54, 47, -61, -83, 51, 83, -43, -82, 91, 89, -59, -73, 71, 48, -53, -67, 64, 72, -44, -47, 66, 65, -54, -91, 56, 74, -67, -87, 45, 73, -84, -82, 63, 50, -86, -79, 55, 54, -48, -73, 86, 68, -74, -43, 82, 63, -72, -50, 85, 53, -44, -22, 53, 61, -94, -46, 56, 25, -71, -74, 63, 27, -106, -72, 49, 28, -94, -44, 47, 47, -82, -33, 72, 56, -52, -16, 82, 40, -72, -58, 71, 48, -58, -34, 66, 58, -68, -57, 52, 16, -112, -66, 73, 28, -104, -34, 74, 18, -80, -44, 83, 28, -76, -32, 86, 36, -77, -13, 93, 29, -64, 5, 105, 0, -79, -6, 38, 66, -73, -29, 48, -3, -85, -39, 73, 21, -91, -23, 71, 20, -90, -31, 77, -17, -92, -33, 76, 11, -106, -19, 91, 40, -83, 1, 67]
3429F7m0r5N8J01q0j00P6Q7m8j11O2Q3o0r0P9Q7q2j01J03O3q4o5Q9Q9q8m9M4R4
3457H9q5r6J28N5p7p8N8O4n7p0R0M9r7q3J27N8r1l8M4J03j27n0Q8Q1j08o7R3R7
3485A00j16n2J18L4q7q5J26M9j16l9R9L8r4o0J24L8r9n9J03L2r2m1J01O8j23m9
3511h2R4J1o0l6J30Pq7m7R9L9r5n4J32L8j24l4J20L3j22l3J21J6j33rJ11J0r7
3538e2j7R0K3j05rQ2N2j32J3J14J5j13k5R8K9j34M0P0N1j29MR6J4j16k0J16qr8
3566e1j1J29k5j15J4J21j5j12OJ04l3p8L6J40n7j20L3J14Jj51L1J35l8r1j5J00
3592E2j5p8L0N5j6r7J9J24n2p6L8P3m0r5L4R6j8j10K1J22l2q6L7R7l9r6J6J02
3620F6k7j01M2J08o3j29R0Q0l5r9L0Q4j9r1oJ36o3p9J2J15k3j02M8J08n3j09O2
$$ y = [67, 27, -68, -10, 91, 11, -89, -13, 74, 26, -85, -23, 60, 0, -90, -11, 76, -6, -107, -4, 59, -25, -90, -1, 88, 0, -49, -5, 89, 4, -92, 36, 91, 14, -64, -6, 58, 1, -69, 21, 70, -27, -110, 17, 75, -16, -54, -10, 93, -34, -84, 4, 85, -23, -90, 3, 100, -16, -68, 50, 84, -3, -88, 38, 87, -29, -68, 31, 69, -25, -85, 39, 77, -22, -81, 22, 54, -38, -79, 22, 90, -33, -82, 12, 23, -37, -73, 57, 64, -23, -70, 29, 68, -27, -81, 51, 89, -35, -69, 51, 84, -38, -71, 50, 66, -67, -76, 35, 45, -52, -69, 21, 44, -61, -70, 12, 64, -68, -55, 59, 74, -39, -64, 34, 63, -71, -31, 39, 90, -39, -35, 61, 75, -41, -61, 55, 47, -51, -62, 67, 42, -73, -59, 62, 47, -65, -59, 45, 12, -66, -30, 110, 53, -67, -34, 80, 81, -70, -39, 96, 58, -33, -48, 52, 37, -41, -11, 44, 28, -69, -50, 74, 22, -54, -16, 57, 17, -78, -44, 52, 34, -76, -55, 67, 35, -51, -14, 83, 44, -52, -36, 66, 39, -62, -20, 88, 25, -104, -14, 66, 31, -68, -38, 46, 27, -64, -70, 66, 3, -76, -64, 51, 28, -74, -26, 82, 29, -80, -18]
3647a8R3n7p3M9R2p6p0O9O5m0q9M8J01p3p6L1O9k8j04O3Q9p5r9J21K7n8o9P9P8
3676F9n4q5N7Q3n7q4Q2O8r5p2J00Q0p5q7R1N4q6o3R0M3q1n2O3P4p4p6J13M8q6
3705a2o8J10L6q7n7R5P3j03l9Q7P1r7n5N5O5p9n3Q7N5q4m8O8L3q2l1Q3K2p1k7
3734e3N8N4r4k9Q8M9q9o5J15K0p7m5J16L0j09m1J25%o5n0R9J5q5j2P1K4r9%Q5
3763C6J7j03n0J11L1j17KR2L0j01qJ38j9q8oQ2M8j09l3J00L8j43K0Q9J2q1k4R3
3791E7%q6j2J00lj00PQ6j6r6%R3Nq3KQ4Kq0k2J02j0q3J4R7Lj10K5O7Nj15M9Q7
3823F9l1j21M2R8l2r2K0O5Kn9nR1Lj08L2O7nj01L2J06k9j04M4Q7m6q1M9R1m3j08
3853f7N5P3j9j12L6O0Jr8M4Q3m8m0kJ02n7q8O8N8m1o2M1R4m9q4O0K9Mq7L3P1n3
$$ y = [-18, 75, 18, -55, -6, 86, 10, -60, 9, 74, 34, -55, -7, 94, 21, -55, -24, 45, 17, -87, -24, 65, -10, -109, 12, 39, -19, -88, -9, 69, 15, -70, -13, 70, 13, -71, 11, 79, -16, -88, 12, 92, 17, -70, 21, 75, -11, -74, 16, 59, -22, -74, -11, 63, -11, -87, 26, 74, -12, -80, 30, 66, -21, -78, 17, 90, -13, -52, 35, 106, 9, -46, 9, 74, -5, -58, 29, 84, 0, -48, 20, 53, -29, -60, 23, 45, -26, -53, 5, 59, -35, -64, 24, 73, -16, -81, 34, 54, -23, -68, 48, 78, -31, -72, 53, 53, -12, -62, 37, 52, -33, -45, 26, 50, -49, -49, 36, 53, -50, -100, 11, 42, -75, -73, 19, 49, -52, -60, 78, 59, -29, -35, 47, 95, -14, -47, 53, 91, -52, -32, 57, 69, -12, -36, 57, 57, -29, -41, 59, 56, -44, -37, 49, 33, -63, -63, 30, 35, -48, -46, 38, 40, -40, -62, 40, 30, -53, -39, 58, 61, -49, -24, 43, 48, -67, -18, 69, 38, -83, -41, 57, 25, -67, -47, 18, 20, -39, -44, 47, 50, -58, -26, 41, 36, -65, -33, 73, 44, -60, -16, 71, 25, -56, -7, 84, 41, -67, -12, 61, 42, -70, -34, 26, 27, -71, -27, 56, 8, -32, -34, 68, 11, -77, -9, 49, 8, -54, -13, 81, 32, -52, 8, 37, 41, -46, -13, 58, 5]
3884Eo1M3P9n4q1M3O9k7q6N0R5q4m2L7Q2m3p2L7O8p4k6L7N0l4p4P0P6p1p9M7P6
3915E6n3o2M9Q8m5j12Q3L9m4o5M5O1n7p4O4O6n6m7P7Q2j08n0N5P3m7q8R9L6o4
3944Aq2R3N6p9m0O3N5r6l6Q9K8p4n8P6N4n9p0P3M3p0j1L7N9q1j3N1O1j04LO0L
3975C2m1m7J23jq3m7P7L4r0n6J35nq2l9J06N4q7l6O7J6n3o1Q3O5q5m0J00j2o6
4004c9j4P3N4p8m5P7K8p2k3M9N1r0n3J21l1n5j2Q5Lq4k2R1K6q8QN2K4j07N1N7
4034C7K3j08QR2Oo2m6R8J7j14PQ7pq4jP7K6r0PO0j7q2J1O7pp6K5O3%n1pQ0j6p4
4068e1RP5J8q7J1Q2Lr2JO8No1JP9m1n6OP8o0m6J1J09m6n8PP1m0m0K7N0qm7kN8
4102C4mo7K4O7l1p3N4N2l0q0L8O0m1n1L5P3m5r3O2M4l3p5P6N0o5l9M4O7n1o5O0
$$ y = [5, -56, -13, 66, 12, -69, -26, 43, 16, -70, -20, 75, -9, -51, -14, 68, 25, -47, -10, 58, -16, -42, -5, 45, 11, -63, 7, 83, 12, -67, -20, 56, 3, -59, -10, 78, 33, -79, 4, 43, -1, -66, -21, 40, -17, -91, -27, 39, -17, -64, 13, 95, -13, -63, -8, 65, 18, -70, 29, 65, 1, -81, 12, 68, -11, -51, 12, 67, -29, -65, 24, 52, -22, -80, -4, 50, -9, -79, -6, 37, -33, -44, -7, 52, -29, -42, 9, 70, -34, -31, 29, 32, -9, -56, 67, 66, -17, -64, 13, 47, -43, -99, 36, 31, -51, -90, 16, 70, -17, -53, 14, 30, -23, -84, -1, 64, -21, -61, 39, 27, -39, -53, 20, 74, -4, -49, 28, 56, -16, -39, 10, 61, -29, -82, 39, 8, -47, -59, 26, 29, -55, -77, 14, 40, -48, -40, 12, 36, -71, -20, 37, 60, -48, -40, 52, 58, -4, -50, 48, 65, -49, -42, 45, 38, -46, -47, 30, 56, -34, -27, 33, 16, -66, -55, 12, 5, -71, -46, 17, 17, -34, -41, 39, 23, -51, -42, 33, 51, -36, -25, 57, 60, -32, -31, 37, 42, -19, -18, 61, 20, -36, -30, 48, -12, -58, -47, 62, 16, -42, -35, 36, -4, -44, -17, 33, 25, -22, -24, 34, 30, -37, -13, 54, 23, -50, 4, 56, 26, -54, -16, 44, 3, -48, -13, 60, 15, -78, -16, 28, -5, -80, -4, 46, -19, -58, -14, 53, 2, -63, -3]
4133cO6m9q0O8N5n1n2N9L9n2m9M0L3k9p5P8N1l6o6K4O6jr1M5N3o2l9O9L2l1n5
4164d3K7P8o9m9Q0J9m0o1O5O4p5p3J09L8o6p3Q0Om7qK9L7n9l3O1N2o4l3N7L1n1
4195a1k9N3N6q5m0R1J0l5k3J5K2m3l3R9J0r1k2R8J7n5n0N9J7m0l1M0P2r0m1N7
4225cJ5n1j6Q4K1n4m3Q8J8q3nP9J7o9k9P8j9n3j7N3K6m9k2L7J1l0m7Q4Om6j7P0
4257C4Lp7J0M4K2p6K4M7Kl5jM5L0j02QP7np5l1N5M3q3K8M7no7jP7pp3nR9m4q9
4291h1M5Q9k6o7K1P2j9o7RP5l7n3K9M2j4p2L2L2jn9%O6j7m6NQ5j9p0J0N6rm1j4
4324d4Q9k9m0ON9j2r6M7P7j6p6L9K0J4p3j1J10l0q6L9K8k4m5L5N1%o4nP8o1k4
4355d4K2O3k3q6N0O3k8l3K2N0l9o1M1M4Oq3L0N9n6k5L6L4m1n6J9N4m1m3K7P6n5
$$ y = [-3, 63, 14, -66, 2, 57, 6, -46, 13, 52, 0, -49, -9, 24, -5, -80, -2, 49, 13, -53, -29, 37, 36, -55, -10, 43, -19, -58, 11, 43, 12, -43, -16, 62, -7, -56, 24, 43, 3, -58, 7, 71, -4, -77, 32, 70, 4, -69, 11, 17, -30, -38, -9, 28, -31, -64, -3, 49, -15, -48, 9, 40, -11, -40, 13, 69, -16, -56, 35, 45, 10, -13, 2, 24, -19, -52, 47, 57, -34, -56, 42, 59, 4, -46, 13, 30, -10, -41, -1, 71, -19, -60, -3, 12, -39, -55, 29, 50, -4, -47, 41, 59, -24, -29, 50, 67, -2, -31, 47, 28, -25, -42, 11, 37, -12, -34, 3, 14, -16, -63, 21, 27, -19, -36, 34, 37, -40, -30, 14, 36, -40, -16, 31, 33, -2, -3, 42, 72, -30, -22, 55, 50, -25, -56, -1, 42, -41, -13, 34, 29, -38, -39, 38, 31, -42, -47, 52, 8, -81, -36, 53, 27, -40, -19, 53, 34, -33, -24, 51, 14, -39, -10, 32, 18, -54, -22, 10, 9, -50, -50, 16, -1, -47, -42, 43, 24, -46, -36, 20, 11, -30, -44, 45, 16, -24, -18, 41, 29, -67, -20, 57, 41, -35, 4, 24, 38, -35, -46, 64, 34, -52, -13, 15, -9, -54, -19, 32, 32, -32, -37, 41, -20, -44, -22, 41, 18, -68, -18, 45, 17, -16, 6, 56, 17, -44, -3, 41, 47, -36, -6, 53, -3, -28, 8, 42, 1, -55, -36, 18, -23, -66, -39, 37, -18]
4386a8m2M7M5j4m9K8L2rn7L4O4o3k4J9K9j3k6L2M2l8p7N6M5m5k9L6M4o5j7L1L7
4417C5n6m3N6M0l8m1Q0j4No1N6L0m1m7N0L2m6o8P7M0p9kM4K5l3n9P5Lk8m3M9M5
4449D3m4k1N8J3n9l9N1L5l8k0O4K5q1LL9k4jk1L7K5q9J3L8M4o6j8L4J1l8j2L7
4480aK0m5%L3M3o5m0P7K0m7k2P1Qo7l0P5Qn2l0N4J2m3j1O2Rp4lN6Lm6j7N8j4l7
4514c5k4O3L9p5QK2K3n3PM5J4n2j0O3j7o0oQ6mq2L5N1j3n7j1O2J9q5j3Q3J2q9
4546e4K4P2rn6jO2k2l0j6O1j6n9K6O6K3r0j0P3j2n7j6Q3m3j3J7JQm9K0M1pn0L0
4579cL7k0m1PM2Ko0L9M3pq0J8P1l4m6L6L7j7n6K1L9J1q1J8O1n1k6K0N5l9n4M0
4611a8N8n3%JN2j1p8M5N1k1m9K8L1l4m9M1K4nn3N7J0m2k1L8L4k7n6M5J5k9k2J1
$$ y = [-18, -60, -13, 32, 18, -31, -3, 29, 20, -37, -3, 61, -2, -26, -7, 22, 9, -17, 15, 57, 19, -58, -2, 43, -2, -31, 5, 49, -16, -33, -2, 35, -21, -64, -8, 32, -6, -47, 33, 19, 24, -37, 19, 49, 8, -39, 11, 43, -3, -71, 6, 46, -33, -35, 9, 34, 1, -58, 17, 20, -8, -51, -2, 43, -1, -22, 36, 49, -10, -49, 2, 37, -1, -21, 43, 68, -13, -10, 29, 5, 4, -17, 20, 45, -44, -31, 7, 51, -15, -33, 1, 12, -26, -38, -1, 19, -26, -26, 7, 50, -15, -55, 22, 42, -5, -27, 44, 52, -15, -45, 30, 38, -14, -44, 10, 22, -21, -32, 30, 39, -35, -38, 18, 21, -25, -42, 16, 2, -35, -59, 4, 43, -32, -24, -2, 21, -32, -25, 20, 34, -18, -28, 35, 18, -42, -48, 38, 34, -48, -13, 38, 25, -32, -43, 19, 38, -47, -60, 23, 35, -54, -30, 42, 33, -23, -24, 38, 16, -14, -30, 31, 15, -44, -18, 48, 71, -19, -29, 44, 32, -25, -41, 42, -1, -14, 3, 4, 12, -37, -17, 24, 17, -33, -3, 34, 14, -27, -20, 22, 24, -36, 3, 46, 39, -41, -23, 48, 14, -32, 4, 41, 24, -32, -11, 28, 39, -42, -24, 37, -14, -40, -20, 35, -4, -58, -18, 40, -13, -13, -12, 40, 29, -49, -4, 47, 26, -23, 5, 36, 2, -47, -6, 18, 13, -40, 17, 27, -15, -36, 2, 36, 9, -47, -2, 13, -16, -38, -27]
4643b7O5m0n2L6P5p1k4M9K1oo2L6L2m2k2N6J5l6l6M1L7q8lN6Ml9j3N0K2l0n9N0
4675eK1k7l8N2M4o3l2N2M1o0oM7J9o3m1P1K1o5J8K3L3m9m3O0Lk7l8M5M3p0MK7
4707cL0k0n5N6L6r6J5P5Ql2l2L4J7n0l3O0K4m8k9N1kl9J8M0nm8j2O8Om4m0P4j
4740B3o8lO3K7n8KM1L7j12L6M4J7m7k9O4j3p1K7L4L5o8mO1k3l1j1N3J1m4j0N5
4771C8qo2qM0J2k4j9O6k2m0QM4J3n3j1P6k5m8jO0j0m0mQ0l6o5J0N4Pn2ON4m5o1
4805f6L2O7j2o8L6K1J4k0k3O4l1k6j2P4k8o7L7M6k6l9pO7m2l4L1M0j7o5N6K3k1
4836Dn3QO7lm5nN9m4j4J6M9k3k0RL4k0o1M2J4J3o2N0J1j4k4%M3j8n4K3M4l2mj5
4870b5M2k3j7M7Nm2k3J8N9n0qK1J0qm3K1O5l7n1K8L4k8o5Q3Ok1l8L3N1o8l4M9
$$ y = [-27, 38, -2, -54, -18, 57, -14, -38, 11, 32, 26, -36, 0, 32, -10, -32, 24, 39, 3, -33, 8, 45, -43, -46, 10, 14, -25, -38, 12, 34, 4, -55, -5, 16, -11, -49, 3, 47, -16, -48, 4, 45, -15, -21, 26, 45, -18, -59, 12, 33, -32, -14, 9, 42, -7, -50, 10, 13, -14, -52, -7, 36, -34, -30, -3, 27, 7, -48, 8, 44, -52, -37, 38, 46, 14, -18, 16, 33, -17, -50, 10, 34, -14, -43, 8, 6, -33, -15, 25, 20, -28, -40, 28, 34, -10, -50, 24, 23, -45, -48, 15, 42, -16, -14, 27, 64, -48, -12, 32, 49, 2, -27, 37, 24, -47, -20, 14, 49, -19, -23, 38, 15, -16, -27, 26, 37, -7, -17, 38, 30, -32, -40, 0, 12, -12, -31, 35, 13, -27, -19, 25, 38, -15, -26, 50, 25, -23, -24, 36, 26, -14, -18, 62, 26, -39, -29, 25, 32, -20, -14, 40, -5, -66, -34, 33, 21, -47, -11, 10, 24, 4, -19, 45, 14, -12, -24, 50, 22, -45, -8, 38, 12, -27, -34, 33, -9, -43, -12, 28, 11, -54, 2, 25, 4, -49, -41, 26, 23, -22, -27, 32, -12, -26, -10, 39, 16, -4, 5, 39, 19, -42, 0, 14, 27, -35, 15, 26, 12, -12, -12, 31, 13, -41, -18, 26, -6, -10, -25, 17, -6, -23, 24, 29, -13, -36, -18, 41, -9, -17, 4, 14, 6, -37, -16, 49, 12, -39, -11, 23, -5, -70, 13, 19, -2, -40, -7, 44, -24, -58, -9]
4902iL7k3l8K0M3m2l3O7Non3L5K4n2kL0L4m8pL3K6m3l5N8j1k5k2L7K9n2oL0K9
4935C0m4JK5J3j5n6O5Rm4LM6nj9oL5mm2qM3Lo6J2K0L5m4JK9nk5lK5j2roN1ql2
4972gj9J9L9j7k2L0J3l5JLL1n1j4L3L5n8j7M2J9m9j4M9J1m7MM4j2j9k3O3Rn1Q
5005bL3j4m0K5L3Lm3NJ5rm4J8M7%n0kM0K0o3K2J7%k9JM9l4j6QM5k7kj3N8m3l6
5040b8J5M8on5O5Ol5m3MQ4k4o7ON9j2l0QJ5jm7M4OK3r7L2O3l9m1M4L2qo0K3M4
5074B8No0N2L7p3l2K2M8j4m2J4K7k2j2LO4n3J2oM4l5k3k6P5k9m1K4K0rl1M4K0
5106C1m9l2L4L7j9l8M8J5k5l2K3K9j7m1M4%k2j9M1Oj9m6O1jPo4N2lJ5l9L9K7n9
5139a6J7J7L3n4k0L5Qn4jL1N0o9L0mJ8m3j0L4J9l5l7N2L5n4nN6l3Pn7N8L8m4m1
$$ y = [-9, 28, 5, -33, -13, 30, -12, -45, 22, 27, 21, -32, 3, 27, -25, -27, 3, 37, -11, -18, 15, 41, -2, -37, 21, 10, -15, -37, 0, 29, -23, -29, 1, 30, -14, -13, 12, 25, 10, -46, 19, 28, -16, -13, 33, 28, 9, 3, 38, 34, -8, -16, 27, 30, -36, -24, -4, 31, -13, -12, 17, 12, -13, -16, 9, -3, -12, -18, 33, 25, -7, -26, -7, 32, 15, -7, 23, 36, 1, 2, 5, 36, -15, -29, 4, 39, -19, -36, 6, 25, -24, -38, 11, 22, -25, -21, 23, 11, -8, -31, 32, 41, -10, -2, 31, 17, -23, 2, 35, 38, -5, 0, 15, 6, -38, -20, 27, 27, -23, -25, 15, 35, -28, -6, 11, 11, -18, -17, 32, -2, -18, -10, 35, 8, 6, -7, 51, 8, -28, -13, 35, 29, -26, 39, 45, 10, -33, -29, 55, 31, -36, -30, 29, 17, -13, -5, 10, 9, -38, 6, 12, 35, -62, -30, 33, -6, -47, -3, 29, 21, -39, -16, 28, 33, -27, 25, 62, -11, -43, -21, 27, 13, -29, -15, 12, -10, -22, -19, 45, -8, 4, -2, 42, 7, -16, -42, 33, 4, -37, -13, 7, -2, -33, 11, 31, -18, -50, -16, 21, 2, -36, 12, 27, 2, -30, -7, 22, 5, -36, 8, 8, -14, -33, 8, 14, -5, -51, 10, 9, 16, -48, 4, 1, 16, -23, 16, 43, -16, 1, 18, 51, -3, -23, 12, 20, -34, -35, -4, 46, -23, 7, 3, 21, -22, -32, 2, 21, -14, -51, 1, 36, -18, -23, 33, 0, 7, -50, 8, 46, 2, -39]
5172c9N7Oj7k6M6K2p0j5M4J3k6k4L7L2m2l2N6kn0m4P3J8l9LQoj6M0KK6o4K0M1
5205C2j2l2JK4J1k5j9L0K5l3l2P2Ln5mN7m8k2J2Qjj1k6P4J1o8j5N7K1n5J4K7K
5238B3m5J5K1Ol0KL3%m7NL7K4q7K8M7k8oMK2J3l6k1K6ok4%P0m9J%J3k2k2L5J3
5273A5K3o9J4K8Pm0K6L0j8m9K8L8k9m0J3L5Jk0ML6k1l6J7J1rlK0J9k8k7J9K0n
5306A0njM1l0l0J5K3k6k7L7J0j7j5J4L2k8l1J5K3kj0J5OPm2K0L1k4k8J6J5Ol7
5339a7L9J0Jn1K8J6ql9KJ6J1m7M3J0j7k3J4M6l9k3J1L7l6K6KK2k9l0L5J8m9mL4
5372IJ7k6k5L4L4l2m1L6K0k7k3L8J8l7lJ0Mk9J0L0L0n7pK8mJ1l5OK8l0j7Q0k3
5405B7o8jO5Rl4k4L1L0m7lK0J7j8l5J2K9m0J4N3n0qJ7L5J0m3nL1J8l4oK1pj9j3
$$ y = [-39, 18, 24, 7, -19, 27, 49, -21, -36, 8, 21, -5, -29, 8, 40, -2, -34, 22, 20, -30, -74, -1, 17, -22, -19, -11, -17, -33, 7, 9, 35, -29, -9, 32, 20, -12, -11, 13, 24, -1, -20, 10, 35, 2, -30, 42, 45, -10, -14, 43, -5, -27, -15, -7, -8, -19, -45, 29, 40, -28, -43, 14, 35, -20, -6, 21, 23, -22, -7, 14, 20, -10, -8, 25, 25, -22, -17, 20, 44, -43, -15, 32, 4, -2, 2, 24, 37, 1, -20, 6, 0, -24, -24, 46, -3, -2, -2, 11, -11, -33, 2, 15, 38, -31, -17, 11, 18, -22, 4, 34, 16, -33, -5, 33, 4, -36, -23, 12, 13, -7, -3, 33, 12, -24, -7, 4, -5, -8, 12, 31, 3, -24, -5, 15, 10, 5, 4, 45, 15, -15, 0, 23, -3, -30, 7, 17, 0, -15, -1, 31, 3, -28, -13, 10, 8, -2, 13, 19, 26, -16, 4, 35, 11, -17, -1, 14, 20, -17, 22, 32, 33, -18, 10, 26, 18, -21, -19, -3, 8, -39, 4, 14, -3, -26, -12, 34, -5, -28, -17, 20, -16, 10, 12, 34, 5, -25, 10, 28, -21, -25, 9, 26, 0, -25, 9, 43, 11, -30, 6, 26, -1, -24, 14, 32, -5, -8, 2, 6, -23, -13, 17, 47, -10, -17, 11, 7, 18, -17, -11, 17, -13, -30, 50, 27, -41, -42, 23, 32, -2, -26, 5, 35, -12, -15, 5, 22, 4, -31, -19, 10, -30, -16, 37, -13, -21, -4, 31, 41, -2, -7, 24, 42, 8, 2, 23, 16, -3, -16]
5439a6L9j7k4mMK4l3J9J6K4m2j4O1j3l6jM5jn5j0O1Mn5J7L8J1m4ooM8l3j4J4j3
5473a2Jl4N7Ml5J0L2rj4j2J8J1m7j7M6J4k7J6K9J2p7J4M6pp2J6N6k0%lK9k0jj2
5507hL7kn3J3N7k4m2j2M6jl3J6JK8l7%J7oj6J7L1J0l3l8K6J8o2J9O3j8ql4M7m
5541A5m1K1J0nk0K4J8l9j0L5K3k2l7L9J5Km6%K3qkkL8j9m6K0K7k3rJ2L5m3k1M3
5575GJ6k3j4J0K1Jn1L9Mjj8J7L9n3j4N0rj2k4L7K8m1k1L0K5k0l7QL2jn6LP2m9
5609ek3K6pJ6m8M2J5n2J8RL3l5k9N2pJj9K3J8m2j4L4J1k7J9j4K6m0lJ2PJ0m2L9
5643DJ3l3RJ4oj7QL7k3j1k9M7nkmK0K3n9j9M8Rnk3KRpj0M2j6k7j9O6l0k6K4rN5
5680E0o0k2L3K2l5ML3j5k1qL2K8l3kJ4j0j1j2L4J7p8PM4Kl3J1L0k7Rj8K3qkpJ6
$$ y = [-16, 23, 6, -18, -22, -18, 6, -27, -8, 8, 32, -10, -24, 37, 24, -12, -13, 32, 31, -24, -34, 27, 31, -24, -7, 31, 42, -2, -8, -14, 34, 1, -13, 1, -12, -11, -45, 12, 16, -19, -9, 23, 14, 0, -12, 6, 17, -30, -47, -1, 13, -14, 2, 31, 43, -34, -20, 26, 19, -53, -37, 19, -1, -1, -4, 25, 5, 4, -8, 29, 27, -26, -13, 44, 20, -22, -34, 12, 11, -22, -6, -5, 23, -14, -14, 3, -3, -19, -2, 29, 39, 6, -32, -6, 12, -50, -31, 32, 14, 6, -28, 19, 15, -26, -5, 5, 0, -20, 4, 22, -17, -27, 8, 31, 9, -28, 11, 26, 28, -18, -18, 5, -3, -5, -7, 31, 12, -34, -14, 13, -10, -19, -7, 28, -15, -36, 7, 23, 0, -14, -4, 17, 18, -33, 6, 10, 9, -9, 8, 47, -6, -20, 30, 21, 9, -15, 22, 50, 9, -12, 18, 43, 23, -14, -6, 26, 25, -31, -28, 44, -5, -28, -2, -9, 7, -41, 1, 16, -36, -18, -9, 24, -11, -40, 12, 5, 6, -13, 10, 28, -14, -28, 6, 17, -10, 9, -5, 21, -19, -22, -10, -3, 7, -35, 4, 17, -16, -7, 7, 1, -16, -8, 29, 6, -5, -34, 13, 8, 6, 2, 22, 45, -14, -33, 15, 24, 19, -4, -2, 7, 0, -10, 32, 16, -11, -30, 36, 6, -20, 4, -5, 50, -10, -32, 1, 23, -12, -8, 25, 10, -11, -19, 13, 41, 8, 6, 20, 10, -1, -13, 21, 38, -40, -33, 11, 13, -20, -9, 21, -6, 3, -15, 8, 0, -2, -9, 7]
5715GJ4k6J3MOk5j3K9Jk3kK4K8m8PK6k2j3nK2rk4%N9j7l1j3M4Jl4K0K7j3k7J1
5750bJjkkJ9Mm1K4J5j8k1J1L0J4o0L4MJ5j7pK9l1J4j1RlKk5L3Jk8J8Jk4j8L2K5
5787B4j9l4N7Lj9n8M1M5m9rJ1K6j2j5NM3m7j6K4K8k8k7L0Pk1k4L2K7ml4K7Rnk2
5821dj8M0m3oJ5K0Kl0K5J2k6J5PK3n1nM0L%j1kJ7Jm8K4N7p2k9O0J6k7k7M3J2k2
5856A1k7N0j3k2l8L7K3k4j4L9Nm7J7oL9m6LK1Pl2j6M2ll4J7OJ2qj2O3j2o8RL8
5890A7K0m1kK4Lk5qK3L0o6J5K5kqk5L0J5k3j3L7j7k5j0M0Rn9J8J4L6k6l4K2L4
5923B8l6K0J4qj8J2K1k6k2OQK6j6m1M6K2l3j9K5Ok0l8N6rOl1M3j2j5j7L6Lkk6
5957a1J0J0l3J6J2Jl3MM1rm0J9K0pj8KK9j3m1J0L2J5j4J6J5k1k0oK6K2m8K1K4
$$ y = [7, 21, -5, 8, 12, 18, -7, -20, 9, 10, -13, -15, 9, 37, -11, -4, 22, 0, -13, -18, 4, -5, -29, -29, 30, 13, -18, -31, 13, 14, -20, 0, 27, 14, -13, -2, -1, -2, -4, -6, 13, 17, -24, 0, 15, -3, -24, -13, 17, 31, -29, 5, 9, 24, 7, 0, 29, -2, 12, 1, 10, 7, 9, -16, 17, 18, -10, 8, 9, -15, -33, -1, 24, 5, -29, 28, 31, 12, -46, -5, 40, -9, -18, -7, 19, 7, -8, -3, 40, -7, -23, 1, 29, 1, -26, 4, 11, -10, -34, -2, 25, 21, -13, 14, 23, 18, -4, -22, 18, -25, -31, -16, 4, 6, -24, 1, 13, -13, 2, 9, 32, -19, -24, 16, 19, 19, 8, 6, 23, 24, -24, 0, 57, -15, -44, 16, 32, 5, -22, 21, 33, 11, -16, 34, 21, -1, -39, -2, 21, -3, -17, 22, 27, -20, -3, -9, 30, -16, -13, 8, 15, -17, -33, 9, 6, -28, -11, -5, 7, -1, -13, 50, 38, -30, -21, 17, 37, -4, -6, 18, 21, -4, -12, 11, 41, -25, -10, 15, 13, 5, -20, 10, 25, 2, -11, 26, 9, -16, -26, 14, 23, -36, -18, -4, 32, 6, -28, -6, 28, -8, 12, 26, 18, 0, 12, 33, 7, -15, -9, -1, 25, 9, -32, 14, 36, 3, -16, 9, 15, -5, -43, 13, 4, 10, -21, 22, 10, -5, -22, 14, 17, 15, -11, -1, 9, -24, -8, 4, 5, -28, -24, 17, 8, -32, -13, 7, 0, -18, -16, 13, 0, -41, -31, 1, 16, 2, 18, 33, 12, -8, -14, 12, 34, -14, 7, 31]
5990C1n6J4%M7jn1J9K1%o6K9M2k2k7L9kll3K1J4J0m4L3jK0m9RL3m1jOK4Lm3K3
6025bJ8k6j4mN0m4J5lN7p6K9RNrj4J4K0k3qrL7Jk6Rj0J2m9N0Qm5NK8K2om6L6K0
6062C1k3k%J9j0m1K3K8m4J5lK7k1k1L4J4k3l3K6O3k4m2j0N4n0pJ4M4n4J7qK3k1
6095ek2J5K3ql8L9L0mn7K8J8k1k2J1K5j5j2JL5jm8M8k3K0l3RK2j9k6PM5k8l9N7
6129A2J7n0jK6m%nK1j0j8J4J8k4JlJ7jOk7M6j6m7J9K6jm0N0k6mRk7K3j2qPL4j5
6166GJ0j2j3M3m9MK9Pk1l3L0K4m2L0K3k3k1%L4l2NjJ7pj0rK6j2k3nK6MlnK8J5
6202D1q3K8M3j4k3k2M4k0qK2K8j4j1j8J8j0k4kJ7K9m2L5j4Jk2kL0mQLJ0J6m2m
6236fK4k5k1K2J8j2j4oM5k4kJ0J2j7l8K8J5j4j7K1kkk7JM4k9j7K2K9k8rJN3j9
$$ y = [31, -25, -11, -11, 36, 35, -16, 3, 24, 24, -42, -13, 29, 7, -20, 19, 17, 14, -19, 2, 16, 26, -18, 15, 14, 34, -15, -6, 27, -14, -15, -9, 15, 18, -25, -2, 16, -10, -24, -28, 22, -22, -7, -10, 47, -29, 0, 9, 14, 5, -9, 5, 25, 2, -6, -15, 22, 23, -3, 6, -4, 8, -41, 9, 17, -28, -23, 5, 27, 21, -25, 11, 31, 8, 6, 6, 25, 15, -26, -3, 25, -19, -4, -7, 20, -1, -22, 12, 26, 3, -30, -4, 59, 35, -7, -17, 37, -13, -20, -6, 38, -16, 1, -7, 16, -5, -27, -12, 11, 3, -35, 4, 34, 30, -27, 1, 19, -2, -24, -13, 12, -3, -15, -14, 21, 20, -28, 20, -3, 17, -16, -7, 15, -4, -30, -23, 22, -6, -45, 12, 29, -21, -22, 4, 0, 0, -5, 16, 6, -12, 2, 20, -4, -3, -6, 11, 10, 16, -11, 35, 19, -28, -9, 17, 16, -24, 26, 0, -4, 5, -22, 1, -11, -19, -12, 22, 7, 17, 5, -8, 35, -14, -10, 19, 26, 5, -28, 2, 26, -16, 14, 37, 14, -7, -7, 27, -5, 0, -1, 16, 9, -1, -10, 16, 4, -19, -24, 2, 6, 3, -2, 26, 41, -42, -14, 29, 15, -8, -30, 14, -6, -14, 8, 36, 22, 11, -7, 11, 1, -23, -25, -8, 21, -21, 14, 0, 1, -21, -23, 7, 3, 11, 14, 24, 40, -2, -6, 18, -7, -28, -6, 12, 0, -14, -20, 25, 1, -1, 9, 21, 4, -34, -6, 9, -5, -22, -1, -3, -5, -32, -31, 13, -16, -33, -11, 18, -10, -19, -18, 35, 16]
6270A6l7K6oK0k5kL3k9j3K0J9j5k0MK4ql5J2Jk0K2j2N4m2jL4qk2lL4k1K4m1RL8
6305C0k1%rK6ql3K4J7l0o%L5l8jQJ7l5RJ8%Lk3JN5j9n6M5Mm2KK9Rl0K4J2O%k9
6343fJ1J9Ol0j2K7j9rJ4J7rk4K4J1m4j5K0L2r%Jpj5rK2LprM1l8K4k8K0jj5OK3
6380A5mk1j6M2Rl0j6PK0J0k2J3L0m7K1k5L3kp%Pk7KJ3Ok1J5jOk1jL1rl1J1J2Q
6417A0k3pM6k6J7j6jPk5RJ9J0%k3L1nl5JL1l5L8m4L6j9j0L8lnm0K7J3mm2J2J9
6452AL0m8lM0j0m6K6PJ4Ql6K1Rrj2J8pmNJ6k3KlL7l8KrK5qj0J0%l%PJk8mK4J5
6492A7j6j7j0M9l7PJ5oOl3J9Rlj9MM0k8k0K9K4k2j0nJ2j2lPK2j3qknL4o5M9%j2
6529cRk0L3k2pJ8J5m2Oj4K2j8J1nN4k5n7P2k3J0m3N5l2OlJ1Ql2J0K3K3k6l0%L5
$$ y = [16, -21, 5, -1, 19, -6, -8, 25, -4, -17, 3, 22, 7, -13, -9, 15, 7, -28, -16, -15, -35, -13, -25, 29, -13, -14, 20, 12, -10, -13, 21, 0, 24, -17, -8, 30, 9, 9, 0, 26, 18, -15, 9, 26, -4, -10, -10, 25, -13, -14, -6, 11, -24, -15, 3, 3, 6, -17, -16, 39, 20, -36, 9, 13, -29, -27, 2, 11, -19, 5, 17, 23, 23, -6, 5, 24, 30, 0, -12, 15, -4, -13, 1, 18, 9, -15, 9, 20, -24, -39, -19, 13, 4, 4, 5, -2, -17, -26, -4, -1, -8, -17, 24, -14, 10, -18, 2, 1, -14, -8, 15, 11, -10, -26, 16, 25, -5, -21, -14, 6, 16, -6, 7, 37, -10, 11, -14, 19, 17, 10, 10, 17, -10, -8, 5, 11, -10, 5, 4, 10, -11, -12, 19, 10, -21, -10, 2, 10, -13, -20, 26, 0, 17, 1, 0, 7, -18, -9, 10, 20, 20, -3, 28, 23, -12, -11, 20, -15, 23, -21, 15, -4, -14, 24, 21, 16, -24, 3, 16, 12, -30, -18, 1, 31, -17, -20, 20, 10, -36, -10, -3, 11, 19, -17, 4, 13, 4, -8, 10, 3, -1, 4, 20, -3, -1, -4, 33, -5, -3, -12, 13, 5, -5, 5, 5, 2, 2, 9, 10, -18, -22, 2, 17, 1, -16, -26, 23, -14, -7, 8, 2, 8, -25, -6, 3, 0, -19, -15, 25, -3, -23, 6, 30, 8, -2, -7, 5, -7, -10, -3, 19, 6, -2, -4, -9, 25, -40, 9, 9, -3, 6, -14, 19, -3, -10, 8, 23, -19, -13, -27, -5, -23, -12, -17, 37, 12, -45, 27, 4, 14, -29, 26, -6, 0, -3, 8, 16, -16, -6, 17, 40, 14, -16, -16, 19]
6564A9j7%NK0k3j7L9qnj0K3l0koJ1J7jk2mJ7l7K1j2O5m6l5N8Pl2K1nK0pm5J2N
6600dJ1j1L1Ql5j1L3lm0L2jmj3k7M6%k1pK7Qj9l1RL1qOk6K1j7K8rk5RPQJ1k7J2
6638aJ2J0k0KpJ2j8jJ8QLj3J0L3k9j3pJj5j5M7m6NKK0J1k0J1J3Ll0j1K2M2o4R
6674a6M4j9j7OJ4%k8J0J9jJ7k0Mqk5K3Qj4OK3j1j0NrLJ8n4L8K3k4pk0J9%J0k9
6710b2L2J3m6oK2J2l4J5K4Nj2mL1l2%JK8j9OmMl0nLM1k4KK3k1J1l0J6l6N8j2k8
6746a8J5Rj4j0NK0rRJ6rl9J5jJ4%KJ2j4Pj3L3k4k4L2nJ8o8O2kk6j8K8Qk8J3PO
6783Iln%K6l7rK2Pk7QK2%k6JJ9K1k9nNL3m5MlK7%qOMj1Nj7K4k6j9M8J6l9j5J0
6822gL9k5lj1Rj7L7j9Rok0K8K1l6Nj6LNnK8k5J2kJNl2J0K2j3J4j0J7Rml8K4J2
$$ y = [19, 2, 2, 7, 27, 4, -13, 26, 18, 13, 3, 26, -4, -6, -12, -1, 16, 15, -7, -11, 6, -31, -10, -22, 43, -3, -38, 20, 27, -5, 16, 11, 31, 24, -21, -9, -4, 7, -4, 27, 35, 0, -11, 22, 19, -21, 11, 10, 6, -7, -34, 12, 12, -9, -16, 11, 19, 0, -31, -22, 9, 1, 7, -19, 2, -15, 13, 4, -21, -12, -5, 3, 14, -13, -1, 11, 21, 1, 3, -4, 8, -10, -11, 7, 15, 18, 5, 15, 48, 19, 6, -1, 0, -15, -30, 17, -29, -24, -22, -2, 9, -11, 0, 13, 16, -14, -25, -3, 39, -25, -16, 28, 9, -8, -2, 12, 12, -16, -6, 13, 12, 29, 9, 13, 5, -20, 3, 11, -3, 3, 26, 15, 5, 10, 1, 4, 22, -32, 6, 29, 5, -2, -22, -3, -3, 7, -22, 10, 23, -23, -29, -7, 5, -29, -14, 10, 15, 3, -1, 30, -2, -2, -1, 27, 8, 14, 10, 14, -16, -21, -18, 23, -1, 1, 24, 3, 14, -16, 0, -36, 22, 10, -18, -3, 6, -8, -18, -13, 7, -2, 7, 23, 14, -25, -10, -11, 3, 3, 5, 17, 3, 10, -3, 30, 6, -18, 14, 9, 27, -41, 21, 19, -7, -25, 3, 11, -17, -4, 3, 9, 6, 1, 1, 27, -10, -19, 3, 10, -17, -9, 13, 13, -13, -12, 7, 28, -1, -6, -1, 32, -13, -9, -12, 15, 15, 7, 13, 17, 6, 11, -6, 18, -8, -27, 21, 37, -2, -17, -7, 32, 7, 4, -7, 2, -15, 22, 3, 12, 6, -14, 14, 35, -1, 4, -12, -9, -4, -9, 19, -6, 6, 4, 5, 10, -22, -12, 10, -3, 11, 1, 18, 27, 23, -15, 9, 21]
6859B1k1RJJ8k8jJ1Jj0J4kRk6jLK5j0k4NK2k5K7MLl1L2oj9%LpK4m2LN1k0k0Rp
6898eJ5j1oJ1MJ0qj0J6l4mNLj4RK3J6l3j0L6j0nJ2J0J3l0nK9kk6qM0m5J4JRJ8
6935B8l4J9%ooojL2j7j2M9n0Lj1K5k0mK3J1J0l3rJ4K6m9M5ql0L6j8K1k9k2K6R
6970A2Rk9J3kL0k7LN0n6Lk3N1m0KJ7J6j2j4J8Qj4qJ3l0L5j1j2J9k7K4K%j3j1%
7005dNJ7q%Lj3oK3qj7RK6%nqJ4k8K8j3pJ0k4K2m4L6k6K0MK8m1J0nK6n0LM6k8K7
7043B2k4qL1k1kk3M6l1KJ3j8L9m9M4j0k5J7OJ3n9K8J1J3rKK1Qmk6ojPk6L5rk2
7079a5OL3j7j6rM7Mo4K2K6j3j1j9L1j8J2J0JJ4k2j8K7Ok0j9K5J7l5j1N7m1K0J2
7112B2Pj4m2K6J1Rk5k9O3k4Rj6M3l6rk5L5Lk4NK0k0LJ8MJ0l3rK0Pk6J6J5j0lp
$$ y = [21, 0, 9, 10, 28, 0, -1, 10, 11, 1, 15, 13, 22, -4, -5, -2, 23, 13, -11, -6, 16, -9, 18, 22, 25, -6, 26, 20, 1, 1, 4, -3, 21, -21, -18, 33, 13, -7, 2, -5, 10, -1, -7, 4, 8, 18, 10, 0, 16, -18, -22, -17, -14, -28, -19, 4, 20, -13, -23, 13, 3, -2, 10, 20, 33, 3, -2, 27, 25, -1, -9, 31, -14, 0, 1, 10, 28, -6, 13, 13, 7, 1, -5, -6, 26, 9, -3, 46, -4, -1, -12, 13, -7, -11, 12, 23, 33, 0, -9, 5, 31, -18, 27, 19, -11, 25, 7, 28, -1, -23, 3, 12, 21, -8, 5, 3, 33, 6, 9, 59, 3, 6, -17, 34, -6, -4, 13, 29, 17, 3, 21, 29, 15, 7, 20, -10, 25, 14, 2, 21, -6, 18, 20, 20, 7, -4, -4, 1, 18, 10, 10, 13, 0, -6, 17, 9, -8, 1, 27, 27, 22, 14, 28, 0, 28, 15, 8, 18, -6, 16, -28, 8, -18, 2, 6, 34, -7, 3, -2, 24, -26, -23, 23, -5, 22, -2, -10, 21, 0, -2, -25, 21, -10, -8, 5, -13, 26, -23, 21, 11, -14, 3, 9, 22, -37, -9, 2, 15, 6, 8, 29, 37, 33, 7, 1, 0, 7, -19, 16, 7, -15, -9, 24, 7, -9, -18, 29, 33, -31, -9, 17, 4, -7, -26, 5, -13, -1, 9, 10, 24, 2, -16, 11, 17, -3, -22, 3, 20, -15, -26, 31, -10, 10, 22, 29, 15, -27, -1, 10, 19, -6, -35, 28, 4, 13, -3, 40, 4, -5, -30, 5, 8, -16, -11, 9, -11, -8, 10, 14, 24, -9, -18, 2, 9, -17, -1, 14, 4, 1, -6]
7148fK1nrj4M9k4m4L8l7M2LqJ2ql7J4K7k3rkML0qJ6k2JJj9J8ll1L0K1kk2kL0k7
7186em9L3K1L0k8j8M2Rm2J2Qom2J4M6k9KJ1J3k2J6J7k5pl7K4J3j9lJ6L9n5J3J0
7220BLKj9L5k9j6PkK0k5JK0K9m4J4J1lPj3jpK6l3K3j0J0oj4L5l0nK9l6J0m9N3
7256eL6k5k1j0pK5j3N4j5k1kJ2Mk2K6pJ3k1Mj5ROl6M0J9k6J5k4J5j0k1N1o3M6
7290A1l2J5Pj6ONJ7l6RJ8oj8K5Qj8PmK4k8j3J1J8PJl9M1rqML4j3l6K0J4k3k4L1
7327A0j0J0mmnMNmJ1Om7M2j0klk3J5Pj8nL6j3oj4K1Qj3LJ9j0nj9PJ7Moj0lj8J8
7367iJ4K1k4PqK1l4PL5j2Nj4J0Ll6J0Mmj9j0L6j6LRK7j8rLJKk2PM3k9Kj4K2j4
7405@OmlPl5L2qOnj7J9J6m1K7j1O%j0J7j6KjJ3J2pj4J3j1K3k0K0j%LJ1k2%k1K6
$$ y = [-6, 15, 10, 1, -13, 36, 12, -32, 6, -31, 11, 14, 6, 18, 10, -27, -13, 14, -9, -18, -20, -16, 14, 6, 22, 0, 1, 2, -17, 1, -2, -33, -3, 18, 16, -6, -8, 22, -5, -54, -21, 0, 30, 2, -16, 26, 35, -7, 5, 13, 7, -35, -21, 25, -4, -2, 9, 22, 0, 16, 33, 8, 1, -36, -12, 1, -18, -21, -5, 34, -21, -8, 2, 5, 7, -12, 23, -6, -22, -15, -17, 3, -22, -21, -1, 28, -16, -2, 9, 6, 13, 0, -1, -8, 18, -15, 8, -2, 8, 2, -12, 23, -7, -12, 17, -19, -9, -58, -5, 31, 6, -15, -25, -32, -7, -20, 34, 19, -2, -4, 8, 12, -10, 16, 9, 22, 1, 5, -10, -1, 5, -31, 9, 28, 2, 17, -7, 8, -2, -23, 28, -35, 11, -21, -6, 1, -15, -9, -4, 13, -23, -14, 4, -2, -20, 5, 13, -5, 2, -2, 22, -6, -19, -8, 10, 17, 18, -21, 20, 11, 3, 7, 41, 28, -8, 12, 26, 3, -21, 10, 0, 10, 6, 2, -3, 1, 6, 2, 13, 19, -28, 14, 4, 2, -1, -24, -9, -2, -20, -25, 11, -2, -8, -22, -1, 7, -6, -3, 16, 6, 1, -18, -11, 6, 10, 4, -6, -9, -27, -9, 5, 26, 2, 9, 1, 22, -12, -5, 30, 18, 23, 9, 19, 22, -14, -4, 0, -4, -23, -33, 3, -13, -10, -1, 26, 8, -1, 2, 3, 5, -17, -10, 33, 4, 6, -8, 14, 0, 6, 2, -1, 6, -29, 3, -5, 1, -4, -21, -2, 14, -27, 0, -11, -5, -5, -15, 2, -14, -12, -13, 0, 12, 5, -9, 4, -7, 16, -4, 16, 15, 15, 18, 29, 7, 7, -14, 12]
7444A2J9n2MK9mj4RQn7M7mORj7PJ0nqrQJ5m6M0Mj0l5J6J5l0J7K0J5J6l4LJ3j6
7481Aj3OK4qm0K1J0L2m4Nj6J9%k0J3Nk6J2K1j3kML2m4L6k0K4k2j3ORj2Oj5M4n1
7517b9PJ1N1n4MJK2j2%M8k4j8kNRJ0l7j1M4qNrj5J6j7j0J1pkjJ1Qj1j5L3l9j5
7554d0N3l0K6j3K0k2LjJ1Lj4k1L3K2m2K1nJKk9K6J6j3j2K2Qk2j9K1oOk1MRj4P
7590a0pO2o6K0j0kK0pj6K0Kk1L4pk6JK1K3j6m1K6J6Oj6j8OnML1j4lj7K3k1pjM
7627a2J8m4K8M7l0k2J6Rj0j6K1K%j2j6M0Jl3%K3j2k4L0J0nj0pJ3k9K4kJ6L1p7
7661c2M1OLl6K7k0j8J7J2qJ5j7K0JRl2kJ7%j7j1M1pK0n1L8k7RrK1nJj7Mj9L3K
7698IK9k2l8J3Ojj1K4ql4K1jK3Jk4K2k8j0J0QOk7J6J4Njj6K4kKj9K9omj3mK3j9
$$ y = [12, 31, -21, -17, 12, 8, -6, 3, 11, -46, 1, -3, 3, 12, -5, 2, 12, 7, -1, -10, -2, 13, -33, 7, 11, 1, -34, -18, -3, -33, -16, 4, 19, 35, 1, 4, 17, 1, -12, -6, 18, 10, -30, -9, 1, 33, -11, -6, -22, -3, -3, -23, -10, -5, -31, -19, 2, -11, -13, -9, 23, -21, 15, -5, 19, -3, -16, -10, -1, -13, -7, -22, 22, -29, -22, -11, 40, -14, -10, -9, 13, 1, 1, 49, 25, 7, 5, 10, 19, 29, -8, -19, 25, 17, 22, 13, -2, 14, -3, -13, -2, -9, -11, -12, -1, 7, -4, -19, 14, -25, -40, 13, -17, 9, -4, 16, -6, -3, -4, 7, 10, -4, -25, 8, 30, -12, 9, 4, 5, 7, -22, 4, 20, 7, -5, 17, 25, 3, -16, 5, -1, 5, -16, -12, -3, -17, -10, -17, 45, -21, -1, -11, -13, 7, 0, -16, 4, 6, -15, 19, 12, -14, -13, 8, 31, 15, -26, 0, 16, 22, 6, -12, -6, -11, -7, 24, 10, 7, -10, 13, -8, -15, -16, -12, 6, -38, -10, 37, 7, -15, 1, 10, 0, -16, 5, 7, 7, -5, -21, 19, 20, -13, -13, 10, -2, -26, 4, 14, 9, -1, -8, 5, -24, 0, -2, 14, 45, -32, 9, 15, 18, -18, 9, -11, -29, -12, 0, -8, 7, -10, 10, 11, 20, -12, -14, 3, 3, -14, -25, 16, 9, 29, -22, 16, -11, -2, -11, 10, 5, 6, -11, -7, -26, 7, 9, 38, 16, -22, -9, -3, -4, -15, 9, 1, -33, -12, -13, 10, 11, -13, 9, -19, -29, -19, -11, -5, -32, -16, -2, 3, 2, -14, 10, 8, 10, -9, 20, 14, 10, -3, -7, 16, -3]
7736cjML8k0l0L5j3Qm0K5J7rj5J2Rk4lK2qk1J3j5J4lNK1j8Rk7J0R%j6Q%j3pMK1
7775boj3LK1jqK4J2m4%J1K1j3k0J1J7j3k3J6L1k0lmQj4roJ2Oj4L1j7J4kNJ3l6
7812a2k6M9k2K9j0qmQj5QQj1oK4J5k8J2nJ7k0k7L5j7J0k1J2kRloJ6j7KQk4L3n2
7849d1K9NJ3k6J4ORj1JJ%Oj9L1k0K6j3J0k3J3J0l1lK5j6KrJ9MNm1J9LOj5Pj7q
7887b9J4kpJ0J8mllj3J2K1J4k5j3QL4q0L7QRqKJ3lRJqOk9KJ9k7oK9j1%NK0l4J9
7927Ek7M1k1K1l3kJ9J6k8K3jlk0j3L9Koj5j9L4k4J0J6J4n0N0kK5l3LK4j8n1J7
7961gM0j8j8k5L4Pk6J9oJk5J7kRrMJ4rK3n0M5j0j3K0rl3K4rL1prPJ3J5j9kJk8
7999a0PKk1J1PnLjk3L6J8m6JK9j2j0K0J6Oo4K7JLk0J7L2k4MJ3l4M2Pm5L2k7K5
$$ y = [-3, -4, 0, 38, 18, -12, 23, 10, 18, -22, 3, 20, 11, -4, 8, 17, -7, -10, 12, 4, -17, -4, -19, -5, -8, -3, 18, 0, 9, -18, -8, 1, 1, -15, -7, -7, -20, -27, -23, -2, -8, -21, -18, 3, 2, -6, 18, 30, -14, -14, -3, 18, 5, -15, -4, 13, 0, -23, -7, 24, 4, 1, -3, 5, -9, -18, -24, -12, -6, -20, 11, -6, 8, 6, 11, 24, -12, -38, 11, -11, 18, 8, 0, -4, 4, -11, -3, 5, -6, -12, 12, 27, -1, 11, 6, 23, 3, -24, 11, -6, 4, -17, -5, -7, 2, -1, -7, 9, -8, -6, 2, -22, 11, -41, -12, -7, 6, -20, -6, 0, 9, -2, -1, 0, 0, 6, -13, 18, -2, 24, 11, 21, -2, 11, 21, -10, -13, 12, -4, -2, -11, 8, 12, 17, -24, -5, -2, 4, -11, -4, -21, -29, -15, -17, -24, -14, 4, 0, -3, -6, -19, -7, 14, 28, 3, -10, -2, 32, -48, -11, -3, 6, -2, 0, 13, 10, 19, 20, 12, 18, -11, -9, 10, -17, -23, 6, -5, -5, 0, 20, -14, 5, -22, 19, -2, 19, -14, -16, 3, 19, -9, 14, 13, 10, -10, -23, 16, 18, 12, -3, -22, 12, -12, -2, 14, 28, -22, 28, 26, 51, 18, 21, 45, 27, -24, -7, 33, 15, -3, -28, 6, 13, -13, 6, 0, 1, -24, -7, -9, 0, -9, -5, 9, 0, 23, -27, 18, 8, -5, 15, 6, -27, -3, -12, 19, 12, 3, 10, 23, 38, 19, 17, 18, -10, -3, -1, -22, -11, -4, -9, -6, -7, -30, 6, 24, -22, -21, 8, -4, -14, 6, 22, 28, -36, -9, -8, -5, -25, -8, 24, 0, 4, 17, -17, 25, 32, -13, 19, -8, 17]
8035A7j8K1j9qJ5%Pk1Nj3L3k2onK7J5j1j8J0Pl6K4j6J8NJ3mn0L5Rj2j3kK5K0m7
8071a5j0K2NJ3l1M1j4Jk5K0K4k1j8L3Ql0%QJ8m2L1mo%l5K2J7j5rM5l7j8lJ5Qq
8107a0PQJ3k3j6M8nj6j1K2rRk4RK1l2J1J8lk3OkJ0J0jj3J7pl5M0j6j5K8j3%j1
8143hJ7%k5KM0k6K0lj0L4rl7J2RrQJ0k6J4l0L0Rk4K6k7kPjNK0l5nK0OJ6m0J3N
8181Fk2K2Kk2K1k0J1M0j2l2
$$ y = [17, -1, 20, 1, -7, 8, 8, 15, -6, -1, -14, 19, -3, -9, -14, 13, 28, 17, -1, 9, 16, -20, 4, -12, 6, 11, 24, 20, -30, 5, 14, 2, -11, -13, 12, 32, -15, -25, -3, 2, 15, -16, 25, 11, 12, -13, 7, 31, 10, -8, 25, 33, 3, 3, 11, 29, -13, 18, 14, 8, 8, -27, -5, 12, -3, -12, 33, -4, -22, -25, -10, -2, -10, -3, 5, 18, -5, -21, 27, 22, 6, -5, 17, 8, 17, -7, 2, 23, -9, 2, 20, 17, -6, 0, -2, 8, 18, 17, 4, 21, 14, -21, 19, 3, -12, 16, 3, 3, -8, 9, 9, -16, -14, 26, 0, 20, 17, 7, 41, 32, -5, 7, 16, 7, 15, 25, -1, 13, -17, 13, 22, -2, 24, -3, -5, 2, 1, 6, 26, -9, -14, 6, 12, 28, -12, 1, 6, -16, 6, 8, -14, 7, -13, -2, 38, 26, -6]
8191f
$$ Imaginary data points
##PAGE= N=2
##DATA TABLE= (X++(I..I)), XYDATA
0@%%%%%%%%%%%%%%%%%%%%%%%%%JrJ6j6J6j6J6j6J7k5L2l2L2l9M7m8N4o2O5p3Q1
46D1q9R9j08J21j34J47j60J77j98K17k40K67k99L36l78M31m97N81o93Q53j096
67f22J519k470Q958k200j0056J0892L492q204o257N485J832m234k917J680n34
82c636q05J449K833q56j400K879M153k018l923J566M688o68m650j192K997O41
98B058l319l029J659L315j029l013J934L591j515k598L148K891l354j724M370
113C385R64n385j933M260P05n111j253M455P58m056j45M046R2l059J759M041j546
130A977l055K500K738k728l199J902K523k074k880O43K202l37k477k45K673Q94
146A057j885j10K257M65k024k30J964j52k181k12J845%k613p62K845R09l007m17
$$ y = [0, 0, 0, 0, 0, 0, 0, 0, 0, 0, 0, 0, 0, 0, 0, 0, 0, 0, 0, 0, 0, 0, 0, 0, 0, 0, 1, -8, 8, -8, 8, -8, 8, -8, 9, -16, 16, -16, 16, -23, 24, -24, 30, -32, 33, -40, 41, -48, 51, -57, 64, -70, 77, -83, 94, -104, 113, -127, 140, -159, 177, -201, 230, -267, 314, -379, 474, -622, 897, -1573, 7385, 5185, -4871, 6021, 9513, 1309, -4948, 537, 2369, -1865, -4782, -3102, -3636, -4441, -2992, -159, -1015, -2415, 464, 4617, 2599, -1324, 242, 4930, 4262, -388, -1580, 1417, 2058, -1261, -4290, -2631, 684, -345, -3358, -1424, 2167, 652, -1946, 1202, 4093, 739, -985, 3385, 4349, -1036, -2969, 1291, 1996, -3115, -4368, 87, 845, -3211, -3356, 690, 782, -2277, -518, 3523, 1977, -1078, 1422, 4160, 1432, -1767, 135, 2658, 584, -2296, -1653, 549, 212, -2265, -2510, 163, 1057, -828, -938, 1319, 1784, -240, -470, 1494, 1342, -839, -1051, 794, 794, -1819, -2581, 264, 1173, -1834, -2251]
164b251L838R34l452o0L759k58l430P54K817j332k990P24K145j376k566Q09K412
181D77m58k273O03K851l3k367O45K633k94k009L73J607o83j786J94J059m83j425
199a369N0J487J8j711K68K156J23j795M37K298l12k135M75J723q53j936L32J567
217H23q08k106O32J959p78k004J144K536p58k113J399K387j119j848J105J642
233B093j080j792O41J212r98j530N54J366p42j551J069J855j116j440J515J647
249A703j224j464J294J377j267j513P92J294q25j760O08J863p11j830R74K022
265A333q07j682J304J837j245j495J217J215j223j464P98J188j163j539R29J420
281F23j017j532J319J711j276j180J662J257j342r35J401R04j390r52J084P68
$$ y = [-2251, 1587, 2521, -931, -991, 2768, 2510, -920, -166, 2651, 1319, -1671, -947, 1198, -178, -2744, -1935, 477, 19, -2254, -1651, 1200, 1167, -1200, -555, 2078, 1784, -225, 148, 1755, 1072, -714, -520, 539, 56, -1369, -1319, 168, 186, -1525, -1257, 899, 1022, -773, -336, 1962, 1650, -485, -10, 1713, 860, -1076, -744, 823, 15, -2091, -1459, 500, -278, -2282, -1138, 1398, 640, -1473, -74, 2313, 1194, -654, 451, 2093, 1013, -779, -138, 1074, 76, -1454, -900, 466, -276, -1827, -758, 1097, -19, -1459, 56, 1703, 479, -985, 309, 1686, 419, -1094, -302, 992, 167, -1593, -985, 878, 167, -1663, -689, 1333, 526, -1156, 148, 1985, 740, -755, 462, 1677, 454, -1010, -212, 976, -187, -1726, -797, 623, -394, -1926, -607, 1104, -172, -1352, 310, 1567, 225, -710, 691, 1595, 205, -747, 337, 1105]
297A105j189j185R86J265j279j264J411J313j304j092J463J198j352r82J278P83
313A155j178r83Q96Q53j079j143J131J100j226r59J509J150j415p49J800Q14j599
330G7n57J422N33j528q18J180O18j492r37J261Q77j465q75J686Q90j465m52J647
348F02O17j353m22J411L66j338n44J083N09j331q58J325O85j463o16J633O89j463
366d68l57J664L78j445j45J256J73j324m40J115K57j485n15J385M34j513m09J792
384C53M93j602l4J732K37j364q6J259J20j307k74J061Q1j324l37J300K05j599
402a086o1J698J05j485J54J603L5j435O5J329m3j298j86J087O2j402j16J357j01
421B82j427K30J663j48j497M61J645k18j392K04J375k6j498k63J233N3j475k47
$$ y = [1105, -84, -1269, -283, 982, -297, -1561, -150, 1163, -141, -1233, 230, 1428, 76, -906, 372, 1155, -23, -1006, -110, 743, -336, -1479, -348, 752, -474, -1433, 76, 1226, -189, -938, 862, 1676, 77, -480, 942, 1475, -53, -871, 309, 927, -565, -1502, -241, 636, -829, -1704, -18, 872, -593, -1045, 602, 1219, -134, -556, 855, 1221, -117, -661, 422, 931, -400, -1258, 67, 752, -711, -1327, 306, 995, -468, -825, 839, 1217, -228, -373, 883, 1056, -268, -708, 407, 664, -821, -1336, 49, 483, -1030, -1439, 353, 846, -756, -790, 942, 1179, -185, -271, 988, 1108, -199, -473, 588, 669, -655, -992, 308, 513, -1086, -1147, 551, 656, -829, -675, 928, 963, -472, -407, 922, 879, -419, -605, 482, 544, -858, -974, 383, 282, -1145, -915, 748, 600, -897, -436, 1209, 991, -401, -197, 1178, 1152, -346, -609, 624, 677, -798, -1045]
439a045J235l3j335K61J351l67j105P19J279m28j098N21J315m25j365J28J340
456I48j55j699oJ523j78j567L30J452l11j212O51J281n59j074O13J058n12j263
474f80K58J253m13j540J66J416l08j448M44J475m21j052P63J072o47p80P83R37
492A278p82j034P07J017q58j374N98J404p93j519P25J404o40j261O54J185n41
509A70r21O12R62o61r01O78R34q33j067R69J073r50j093R81J116q65j017R13J029
528A129p41r64O15R46p97j097P96R57j083j030J092R44j263r56J357J015j143
545b23p47J109R48p82q51P14Q85o29r14N59Q11p94r04Q65O19j129n39J265M79
564G42j254l80J282M61j108m79J040O40r29q78Q51Q30r82r37J010Q10j047o47
$$ y = [-1045, 190, 157, -1178, -917, 434, 67, -1038, -319, 960, 532, -566, -45, 1270, 845, -520, -392, 948, 793, -906, -912, 611, 433, -1134, -804, 648, 337, -875, -224, 1057, 498, -576, 37, 1095, 583, -680, -422, 831, 418, -1122, -956, 460, 152, -1296, -852, 623, 202, -850, -87, 985, 338, -442, 341, 1278, 496, -538, 169, 1186, 328, -1046, -448, 956, 163, -1356, -631, 773, 133, -1128, -474, 711, 170, -751, -139, 823, 162, -739, -61, 873, 40, -1027, -58, 1015, 65, -1028, -47, 1069, 204, -813, 100, 1129, 388, -576, 39, 985, 188, -909, -113, 844, -239, -1269, -177, 767, -496, -1452, -95, 920, -223, -970, 139, 1087, 305, -546, 168, 1053, 424, -490, 69, 880, 86, -818, 47, 666, -463, -1002, 263, 742, -512, -892, 390, 851, -257, -736, 304, 944, 15, -863, -12, 818, -164, -1101, -91, 719, -328, -975]
582i75J163N91j119k96J195L29r90k43R83L34j036m53R23L28j069n39J044L51
600E21j225l28J156K28j039j04J129K80r94j26J061K41j003k53J025L37j149l43
618e86J040K15j108k49J021K61j023j79R50K25q96k41R21K96r84l13J071K04j186
637e61j79J142Q2j180M1J135n8j012J35R48O0q84r7R64K18r81k90J028K00j116
657d05k23J143M5j126M6R40o9q94J45P92r9p31K6P58P0q31j56R70J10j103N7J054
679E19o1j042J34J056j40r78K82R06j95q24J13Q47j26r68R2Q94j56r95R5R91k26
700B18j003K74R33k37p96K98Q72k33p54K51P98j50q78J92Q71k57r64K69R13l91
720B26q83L37Q68l26q29L46Q16k61q11K62Q32k33r67L05R30m22r25L83R02m72
$$ y = [-975, 188, 779, -340, -636, 559, 888, -102, -345, 638, 972, -64, -517, 406, 734, -335, -874, 170, 521, -704, -1032, 124, 352, -687, -791, 338, 618, -376, -502, 559, 800, -203, -456, 569, 906, -243, -586, 454, 669, -439, -688, 333, 594, -429, -608, 342, 567, -329, -570, 351, 647, -337, -650, 421, 625, -561, -740, 402, 484, -696, -655, 480, 422, -590, -455, 493, 553, -331, -428, 536, 754, -227, -517, 511, 711, -405, -628, 515, 560, -566, -520, 420, 351, -543, -398, 394, 295, -436, -410, 348, 418, -413, -569, 401, 511, -592, -535, 519, 458, -584, -450, 606, 466, -512, -230, 676, 481, -343, -230, 617, 491, -477, -385, 509, 353, -642, -547, 444, 218, -785, -511, 422, 185, -611, -313, 559, 326, -428, -177, 621, 471, -407, -215, 656, 399, -565, -296, 617, 226, -657, -320, 548, 222, -607, -261, 555, 294, -517, -255, 577, 344, -623, -318, 612, 190, -735, -352, 550, 78]
740G8q61N12P89m11o80M58P17k84p07L33P88l44p97L46P88m55q78M76P12n93p00
761g13N32N72n19o00N23O33m35n93M35P31m04p61N12Q39n66p34N52P40o04o52
781e12N51O09n85n40M93N16m54n97M66N97n14o53N83O00o53n99P03N43p45m45
801f36P37M16o27m22N82N11n73n50O39N45o02n98O64O10p09n74P38M73p03m15
821d94O36M19o73l78N70L69o03m08N64M71o49m75P04M61p64l68P70L88p13l65
841e38P76L14o74k72O17L75o32m17O66L93p36l89P30L32q46k79P60K49p95j80
861e46P09K41o71k53O93K48o30k50O42L13o83k82Q01K04q18j15P78J12p63p5P32
882C87N7p28r6O63J52p13k18P08K16p88j56P83J24p68j24Q26K8p46J1O77M3o63
$$ y = [78, -783, -271, 518, 107, -573, -115, 602, 318, -389, -56, 732, 388, -409, -63, 725, 270, -608, -132, 580, -13, -713, -181, 391, -128, -728, -205, 428, -7, -600, -165, 566, 162, -599, -87, 752, 186, -548, 4, 744, 140, -512, 39, 648, 63, -477, 16, 532, 78, -519, -53, 544, 30, -623, -40, 560, -93, -692, 11, 554, -191, -636, 101, 517, -110, -532, 50, 561, -12, -562, 77, 622, 20, -578, 86, 696, -13, -587, 151, 624, -79, -494, 142, 561, -112, -490, 80, 449, -154, -562, 2, 473, -176, -651, 53, 514, -250, -618, 152, 540, -173, -538, 238, 552, -122, -394, 223, 598, -34, -451, 215, 608, -128, -517, 213, 545, -301, -580, 180, 429, -366, -546, 163, 404, -267, -520, 173, 421, -209, -459, 183, 496, -187, -469, 332, 536, -282, -397, 381, 493, -270, -345, 387, 444, -284, -380, 283, 435, -278, -496, 212, 428, -360, -516, 267, 391, -377, -501, 325, 353, -393, -382, 295, 338, -325]
904c25o1P17R2p34p2P49R0p40p7Q10K2q16P9P81j55o96P1O49j25o84O5O56p6p45
928e25M7P40nq12J18Q12r1p07J65P31j06o49J18O16j19n43QN84j8o90L2P04j37
951B73p35J65P69k45p72L22P14l50o44L12N82k08o52K15O25k26o34K21P03k14
971B21o71K63P61l53o67M18O14l31o00L21N33l17n39K18M67k34o00K28N82k86
991B8o24L48O24l12o00M33O05m21n27M50N45l91n83L99N97m15n94L50N90l97o07
1012e02M52N71m69m87M34M65m44m62M48M02m19m63M14M25m56m69M87M90n19m19
1032e21N80M06n25l15N17L74m68l44M39L91m21m30L86M19m64n18M86M79n90m53
1052e72N73L95n68l40N89K71n02k52M77K79l91l31M57L43m92l36N31L16n75k96
$$ y = [-325, -386, 331, 423, -311, -383, 366, 456, -284, -361, 449, 471, -345, -266, 515, 360, -336, -265, 384, 259, -425, -360, 296, 220, -525, -478, 262, 257, -555, -437, 375, 284, -423, -258, 473, 367, -282, -164, 452, 333, -210, -202, 382, 364, -326, -294, 410, 273, -462, -297, 472, 227, -545, -223, 491, 141, -503, -191, 391, 183, -469, -254, 371, 145, -489, -268, 435, 221, -450, -187, 574, 221, -446, -28, 586, 255, -345, -24, 509, 192, -347, -129, 338, 104, -496, -268, 314, 28, -596, -248, 376, 64, -536, -103, 502, 81, -446, 4, 549, 158, -425, -26, 571, 156, -438, -88, 502, 105, -502, -50, 521, 52, -435, -1, 464, 20, -442, 6, 408, -11, -474, -60, 365, -91, -560, -73, 417, -102, -521, 59, 465, -60, -375, 142, 516, 48, -296, 143, 534, 113, -317, 69, 488, 24, -494, -8, 471, -119, -572, 1, 396, -172, -512, 77, 348, -154, -406, 71, 350, -41, -372, 85, 428, -64, -400, 131, 447, -128, -424]
1072d24O24L02o51j71N69J72n47j48N09J58m78k73M38K26m44l40N03K61n24k11
1092d49N36K02m57k17N72J95n23j08M65K09n13j91N23J79n95j91N66J68n73j63
1112c65N51J57o04q3N49J18n43j01N46J42n97j50N54R8n49j22O03Q8o30J5O08
1133B85J6m97mN02O1m39p7M46Q0m87j68M97J19o24r8O05k7o30M4N92l5n49J14
1156b74N56o9m54K6N41K0n01p1N51J5o38K2N95no67Q5O03j27n43J58N14j02m82
1179b47J23M84j21m97P7M75j20n59Q4N45j99n28J85N52j45m69K20N04j52m44J96
1200c6M60j21m79J26N02j62n96J30N09k24n05J61N10k25m85K60M41j61m17J75
1220a37M83j75m91K21M54k36m87K43M95l31m61L53M17l29l26K97L98k52l76K38
$$ y = [-424, 200, 502, -149, -320, 249, 421, -126, -274, 235, 393, -85, -358, 80, 306, -138, -478, 25, 286, -238, -449, 87, 289, -168, -385, 187, 382, -141, -249, 216, 425, -88, -279, 244, 423, -172, -363, 203, 371, -202, -365, 186, 343, -261, -344, 205, 323, -220, -321, 225, 367, -230, -380, 174, 272, -277, -399, 204, 292, -338, -323, 285, 301, -196, -200, 302, 363, -76, -153, 293, 373, -114, -282, 215, 334, -290, -388, 217, 190, -440, -396, 196, 161, -388, -274, 282, 213, -241, -215, 326, 346, -155, -226, 325, 340, -298, -276, 319, 314, -353, -268, 335, 208, -335, -177, 337, 235, -247, -124, 360, 239, -258, -181, 294, 174, -385, -301, 244, 45, -483, -298, 254, 109, -360, -140, 364, 212, -232, -36, 424, 303, -176, -50, 452, 290, -306, -176, 333, 109, -396, -235, 275, 50, -435, -175, 266, 105, -312, -137, 346, 171, -320, -99, 355, 119, -368, -125, 370, 39, -422, -69, 348, 19, -307, -10, 388, 136, -240, -2]
1240bM26k59m54K43M20k86n15L10M20l63m18L30M14l22l23L44L38k70k95K78L79
1261C95k35m09K59M27l60m43L52L75l98l86M20L30m28k61L55L49l57k99L49L64
1281C99l74l79L68L30l81m04L90L41m38k81M31K60l55k27M13K86l39k36L85K50
1301D39l53l15L76K28m29k82L74K19m72k11M10K20m36j76M48K02l11j99L84K74
1321C90m09k72M61K28m39k73M45K06n25j32M56J14l80j36M22J61l81j32L99J74
1341C77m56j64M37J43n25j77M93N3m90l2M26Q5m00q1M46J31m07p0M62J09m06j70
1363b16M85R0m92p6M26M6n03l3M80l8m33J3M10L3l92j8M20Q3m77k5M54K7n15J0
1387b41M78q5m57L1N13q7m03M3M40Lm12K4M56J5m77KM49o8n02O0M35j20m26R1
$$ y = [-2, 424, 165, -289, -46, 374, 88, -427, -117, 303, -60, -478, -148, 266, -56, -379, -35, 303, 33, -262, 16, 395, 160, -249, 10, 437, 77, -366, -14, 361, -37, -423, -3, 327, -101, -362, -7, 342, -15, -314, 35, 399, 25, -354, 14, 344, -37, -441, -51, 290, -148, -429, 2, 262, -93, -320, 93, 379, 40, -196, 189, 439, 86, -229, 147, 375, -54, -336, 38, 257, -215, -426, -16, 204, -232, -408, 40, 242, -69, -268, 116, 390, -19, -291, 170, 398, -41, -314, 131, 337, -188, -320, 136, 250, -130, -266, 156, 317, -64, -196, 203, 377, -79, -243, 194, 337, -188, -365, 128, 181, -309, -341, 85, 170, -230, -311, 135, 266, -141, -211, 251, 360, -46, -216, 269, 359, -133, -209, 217, 263, -240, -273, 207, 169, -264, -251, 159, 192, -200, -218, 202, 285, -192, -217, 237, 264, -251, -241, 237, 152, -305, -274, 239, 152, -251, -208, 232, 235, -177, -153, 303, 318, -159, -157, 292, 224, -278, -218, 217, 97, -329, -238]
1411b38L80p1l98J27L74k3m02Q8M61o8m41J11M42j45m11J12M31j86m42J60M01
1432B62j53l55J23L74j06l64P8M29j07m40J20M31j78m50J95L84k23l55J98L47
1452B10j57l39J98L58j26l37J49M11j61m06J97M14k84l80K31L26k95l58K83K96
1472B30k58l21K39L07j85l32K33L55j84l95K54L63k53l54K80L62l55k94L02K80
1492B74k86k51K89K82k42k52K16L15k53l56L06K93l28l02L09K15l11k60K75K71
1512B04k89k30K65K95k47k68L02K81k94k78L80J98l35k19L47J71l35k02L23J61
1532B30l02j81K63K39l07k12L12K37l49j93L13K38l64j89L61J00l26j40L16J67
1552B13k93j71L55J61l19j48L21K30l65j98L67J69m41j13L61Q7l89r5L26P3l29
$$ y = [-238, 142, 71, -327, -200, 174, 151, -251, -163, 298, 230, -211, -100, 342, 197, -214, -102, 329, 143, -299, -139, 262, 109, -246, -123, 251, 145, -219, -141, 288, 181, -259, -139, 292, 114, -336, -141, 243, 20, -335, -137, 210, 53, -286, -88, 270, 144, -193, -44, 367, 206, -200, -3, 411, 127, -253, -22, 304, 9, -349, -66, 230, -28, -349, -110, 197, 12, -320, -87, 268, 84, -311, -57, 306, 53, -301, -21, 341, -14, -308, -6, 274, -12, -263, 26, 308, 66, -186, 30, 345, 92, -264, 42, 335, 7, -295, 14, 229, -82, -342, -67, 204, -85, -315, -50, 245, -2, -270, 32, 313, 19, -259, 121, 319, -16, -235, 112, 283, -52, -254, 69, 230, -72, -253, 10, 249, -58, -270, 42, 279, -70, -263, 50, 288, -76, -265, 96, 196, -130, -270, 46, 213, -80, -251, 104, 265, -54, -202, 119, 349, -16, -214, 153, 322, -119, -232, 129, 216, -173, -268, 58, 131, -198]
1573a98r4L43J04k91j23L56J43l51j20L94J36m09r5L63J10l86n8L40P5l52r1L58
1595A54P6l57q0L59Q4l79o3L47O0l54q7L73J5l60m1L37R3l87k6L98Rl27qM10K9
1620B75m18L1L65J1m19M5L58p6l37kL17j2l02l1L36K8l87J1L75j5l77M6L62p2
1644A12l30O5L30m8l17N8K85Jl40M1L33Ml31M2L83n5l96Q9L47j35l64J00L62j53
1668H3l39J15K96j05l10Q0L65r8l23J13L43p9l38J49L18j43l46J70L19j67l24
1689b21J65K73j25l01J22L13j73k85J33L17j48l18J66L32j96l06K12K56j67k98
1709b49J87K84j82k75J78K94j45l13K01L03j99k85K07K83k48k35K10K16k22k24
1729b14J85J99k07k61K08K97k07l12K40L03k54k40K46K58k55j93K38K25k31k13
$$ y = [-198, -292, 51, 155, -136, -259, 97, 240, -111, -231, 163, 299, -110, -205, 158, 268, -118, -176, 164, 239, -113, -204, 154, 230, -127, -207, 152, 236, -143, -206, 141, 201, -153, -240, 133, 148, -212, -253, 84, 177, -210, -236, 162, 171, -156, -164, 246, 275, -143, -112, 253, 264, -155, -110, 248, 172, -165, -167, 150, 138, -164, -195, 141, 169, -218, -207, 168, 153, -224, -178, 184, 112, -218, -153, 177, 129, -188, -130, 155, 156, -184, -143, 190, 194, -137, -95, 288, 233, -163, -74, 273, 138, -226, -126, 236, 83, -256, -141, 155, 50, -260, -180, 185, 87, -236, -123, 220, 141, -197, -48, 270, 127, -219, -49, 270, 103, -221, -56, 217, 92, -209, -87, 226, 53, -232, -99, 218, 70, -248, -82, 250, 54, -252, -40, 216, 49, -249, -62, 222, 40, -235, -57, 237, 92, -221, -20, 283, 84, -201, 6, 289, 41, -194, 16, 232, 10, -214, -29, 170, -37, -298, -90, 207, 0, -312, -72, 231, -23, -263, -17, 241, -14, -207, 31, 256, 25, -188]
1749a88K09K37k13k45K07K55k19k54J99K83k54k69L03K02k93j95K70J45k50j97
1769b67K57J88k45j68K19K37k84j82L25J67l08j26L01J36l12j13K89J26k64j18
1789a42K08J60k83j65K79J69k92j86L30J19l18p7K93R2k83j06K87R6k88q9K80
1810H4J07k72j21L37R5l22j03L31J14l39n9L08M1k94o5K77N2k88o7K60Q5k83j09
1833b31K78J13l13m3L16P6l43m5L63K0l03nK90K3k77m9K94K7l25j9L16J3l09k9
1857a62L21j7l21J7L01k6k96K9K96l3k99NL16Jl17L3L10rl14K3L39j5l39R3K84
1882B20m7l00O2K72n4k81L9K54l3l13K6L17q0l03N3L11o4l16J01L03r3k52R9K37
1906A58o2k60P4K73n5l01P4L16o7l34J22L30j39k76J24K26j30k57J35K17j00k86
$$ y = [-188, 21, 258, 45, -200, 7, 262, 43, -211, -12, 271, 17, -252, 51, 253, -40, -235, 35, 180, -70, -267, -10, 178, -67, -235, -16, 221, -63, -245, 80, 247, -61, -187, 114, 250, -62, -175, 114, 240, -24, -142, 66, 226, -57, -222, 57, 226, -66, -252, 78, 197, -121, -198, 95, 187, -96, -202, 85, 181, -107, -196, 84, 191, -81, -202, 135, 230, -92, -195, 136, 250, -89, -148, 160, 201, -93, -158, 119, 171, -117, -184, 76, 161, -122, -231, 47, 160, -153, -196, 120, 196, -147, -192, 171, 191, -112, -117, 173, 196, -81, -130, 164, 191, -134, -153, 163, 176, -133, -162, 159, 142, -179, -162, 139, 113, -183, -154, 142, 109, -190, -185, 131, 132, -185, -152, 158, 149, -165, -142, 197, 182, -157, -64, 220, 173, -127, -65, 207, 153, -128, -89, 165, 132, -181, -155, 162, 82, -221, -168, 143, 79, -237, -136, 167, 74, -178, -79, 158, 96, -164, -90, 183, 128, -173, -99, 217, 150, -184, -62, 268, 129, -147, -23, 203, 73, -184, -49, 168, 68, -218]
1928b18J06K59j12k59Q3K91q0l08J53K72j19k58J50K47j54k10J43K24j39k24J22
1949c1K28j36k51J52K12j42k24J33K44j58k51J98K19j83j86J48K04j59j97J47
1969c3K04j12k77K07K09j33k53K07K17k06k04K10J91k13j93J96J73j89j99J94
1989dJ79k03j94J75K14k28j84K53J54j88j83K37J44j94j36K21J54j88j98K20K01
2010B52k32k08K64J62k55j40K23J41k52j04J87J02j71j87K19J68k48j47K34J50
2030A58k16j66K71J44k65j06K52J13k57o6K30J21k34j09K19J07k27j10K33J43
2050B35k87j29K74O5k25j29K68P6l09m0K78N6k72k7K43O0k29r2K68O4k32o8K87
2073A35O9l09m1L11J7k73k9K23O7k70j5K45J3k62l2K23Q4k70n0K60K2k49m2K91
$$ y = [-218, -112, 147, 35, -224, -141, 150, 70, -238, -85, 187, 68, -190, -40, 207, 53, -157, -14, 210, 71, -153, -31, 197, 61, -190, -38, 174, 32, -192, -59, 185, 27, -224, -26, 193, 10, -176, -28, 176, 17, -180, -33, 171, 59, -218, -11, 198, 65, -188, 19, 236, 30, -174, 36, 227, 14, -179, 17, 190, 1, -198, -4, 175, -28, -222, -47, 167, -61, -245, 8, 162, -26, -209, 28, 172, -22, -158, 63, 217, 29, -169, 51, 252, 20, -188, 76, 238, -17, -157, 66, 207, -45, -149, 38, 140, -31, -218, 1, 169, -79, -226, 8, 158, -58, -224, 47, 191, -74, -180, 72, 185, -72, -138, 92, 213, -21, -130, 89, 196, -31, -141, 92, 235, -52, -181, 93, 158, -67, -196, 72, 148, -161, -201, 77, 133, -139, -166, 77, 137, -92, -184, 84, 148, -84, -152, 135, 204, -105, -146, 165, 182, -91, -120, 103, 170, -100, -115, 130, 143, -119, -151, 72, 156, -114, -164, 96, 118, -131, -173, 118]
2097A18nk57J7K69k1k41J3K29L5k59qK75j5k73K3K76m6k42J5K44n0k39M1K34n1
2122H2j97j8K72m0k64L8K60l1k81P9K70l9k92Q2K63n5k39L9K47n3k34O1K20k7
2146A43k64J9K66n8k95R5K28q9k51R6K51j10k41J24K20r1k34R2K78j10k30J11
2168e0K35p5k55J02K64j12k65J59K27j74j92R9K42j51k46J45K14j40k16J53J58
2189A22j02k25J48K13j29k06J25K20j43j94J61J85j21k15J39K27j34k05J42K01
2209B09j70k13J90J85j99j80J82K03j93j95J76J43j42j85J68J83j52k22J99K09
2229A96k09j71K00J64j68j96K35J34j88j20J71J18j56j70J90J42j85j68J70J77
2249A66k22j47K00J57k06j51K09J37k04j18J98J48j71j26J65J46j96j47K41R8
$$ y = [118, 113, -144, -127, 142, 121, -120, -107, 122, 157, -102, -110, 165, 150, -123, -100, 176, 130, -112, -97, 147, 97, -142, -101, 133, 82, -115, -133, 139, 99, -165, -127, 133, 102, -179, -100, 170, 131, -161, -79, 184, 129, -110, -71, 176, 123, -111, -50, 170, 143, -121, -102, 164, 106, -189, -94, 134, 45, -206, -110, 141, 31, -210, -86, 134, 43, -191, -99, 179, 69, -161, -50, 185, 110, -145, -43, 221, 109, -156, 3, 230, 56, -136, -37, 205, 54, -192, -47, 167, 27, -189, -36, 122, 20, -205, -57, 156, 27, -179, -54, 166, 23, -171, -10, 175, 54, -161, -22, 205, 71, -134, 8, 209, 39, -174, 16, 201, 2, -178, 4, 207, 14, -181, -5, 138, -4, -189, -21, 162, 10, -212, -13, 196, -13, -184, 16, 180, 12, -184, 51, 185, -3, -123, 48, 166, 10, -160, 30, 172, -13, -181, -11, 166, -56, -203, -3, 154, -52, -203, 6, 143, -61, -179, 19, 167, -4, -130, 35, 181, -15, -162, 79, 177]
2269A77j92j14J71J54k35j13K50R7k69o6J85P6j88j11K18Q9k15j02K03J37k28
2290g6j27K78R0k70j0K13Q0k48n0K14R6k62l3K06R5k39p4K07Q2k56l9K26K8k55
2314a24l4K18M1j95n7K03O1k38l2K51L6k53qK52J4k17kK20L8k50pK10J4k19k1
2339i9K14J2j86l5J87kj79m0K34J9k85L4K35k0k42M3K12k9k12KK45mk20J6K03
2364A03J5k15J7K52n4k45M7K35l4k38L0K12m6k27M2K08j6k15K1K19l3k36L6K37
2388A15l1k17N6K06m5k02P2K22r4j82M6K32j14j84O3K19q7k19N8K51j03k03R1
2411e0J80r3k14J01K08j03j76Q9J81q6j68N5K26p8k24J16K34j23k14J47J81j31
2433E8j67J13J72j19j97J19J69j15j85J05J64j08k00J21K03j47j76J56J52j24
$$ y = [177, -15, -129, 42, 196, -39, -152, 98, 195, -74, -140, 45, 121, -67, -178, 40, 129, -86, -188, 15, 152, -76, -203, 75, 165, -105, -115, 98, 178, -70, -120, 94, 190, -72, -105, 101, 196, -43, -117, 90, 172, -84, -123, 103, 131, -124, -158, 60, 101, -94, -151, 52, 113, -125, -157, 94, 130, -123, -131, 121, 135, -82, -84, 136, 174, -76, -83, 127, 141, -78, -99, 115, 127, -59, -94, 93, 91, -88, -128, 106, 125, -160, -126, 109, 89, -153, -110, 102, 73, -139, -137, 108, 104, -116, -100, 103, 118, -97, -80, 172, 118, -127, -80, 155, 121, -117, -87, 125, 79, -148, -106, 102, 86, -129, -108, 111, 78, -158, -122, 115, 84, -133, -77, 129, 84, -118, -46, 176, 82, -100, -54, 178, 64, -120, -57, 162, 75, -144, -86, 165, 62, -141, -50, 130, 37, -177, -76, 132, 29, -147, -58, 123, 37, -131, -76, 150, 72, -152, -36, 198, 75, -139, 8, 189, 58, -109, 4, 176, 57, -140, -21, 148, 33, -152, -47, 117, 9, -191, -70, 133, -14, -190, -34, 118, -6]
2453fj53J50J33r6j67J34J53j19j65J12J95j23j83J58J60j51j57J44J22j34j36
2474a29J27J27j43j47J41J76j96j17J66J15j54j33J75J43j70j50K06J26j69j28
2494a34J65J15j69j23J86J27k06j26K17Q8j61j34K12P3k01o0J56R1j72q5J81P3
2516A13j76r4J64J29j67j31K14Q4j95o0J87P7j75q0J73M7j54p6J76O3j76p4J77
2539D6P0j84j02J87J01k18o2K14Q7k30k5K07L3k03l9K03N7k03k3J77O5k02o4K26
2563A18L8k26o6K37J8k23kK09j2j82m7J79L1j95j0K10%j77rJ64N1k05NJ83J9j75
2589f7pK15k3k11K5J90J2k32L8J89j1k12nJ95j9k18L5J85J6k18J3K07l4j87J9
2614a05K00l5k03O7J71nj96K0K03l0k11R8J78p2j49J6J86l1k12N5J66o3j56N8
$$ y = [-6, -159, -9, 124, 28, -139, -5, 148, 29, -136, -24, 171, 48, -135, 23, 183, 32, -125, 19, 141, 7, -129, -2, 125, -18, -165, -24, 152, -44, -161, 5, 120, -34, -167, 8, 151, -19, -169, 37, 163, -6, -134, 31, 146, -23, -146, 40, 167, -39, -165, 52, 140, -21, -155, 57, 130, -71, -131, 25, 116, -56, -141, 40, 113, -63, -157, 7, 136, -31, -162, 52, 136, -59, -119, 68, 145, -30, -110, 63, 110, -44, -120, 56, 119, -57, -131, 46, 116, -68, -170, 17, 118, -100, -162, 52, 139, -91, -116, 91, 124, -79, -118, 85, 142, -61, -84, 93, 158, -44, -108, 118, 156, -70, -136, 101, 119, -104, -106, 103, 91, -91, -138, 41, 72, -123, -133, 77, 77, -100, -109, 55, 106, -99, -94, 89, 108, -67, -74, 141, 118, -93, -68, 122, 134, -98, -60, 129, 118, -94, -99, 96, 77, -141, -106, 79, 95, -123, -110, 97, 63, -124, -105, 95, 60, -143, -76, 95, 90, -106, -86, 117, 87, -124, -26, 152, 80, -69, -53, 133, 102, -110, -55, 111, 48, -108, -50]
2638e0J49o0j64P3J47n5j77M0K09m3j89Q7J83r1j64P9J59n9j85O0J82o9j68O5
2662d1J84r1k00J01J82j12j52J01J45r2j51J27R4r0j34R1J75j19j59J32J73j58
2684Fr6P4J75j40j33J11J54j11j18R5J15j16j35J16J19j19j73J30J76j41j28J34
2706eJ12j38j42J50J27j18j31J56J33j54j06R3J59j27j28J61J10j56j04J47J27
2727A66j63j26J48R4j19j30J36R4j57q7J49R2j57j04J99Q4j73q2J66N8j33o3J38
2750C0R0j40q5J36J21j51r8J49R0j64p4J49J00k02m8J16Q3j57o6J47J03j90p9
2773a40J74Q1j81n6J49Q6j77n2J84N5j94m0J67M3j49l8J63K5j46n0J49N4j44p0
2797a07J70L5j57o4J78K8j49n2J97j8j27m9J69M8j66j9J70K8j74k8J71J1j75j1
$$ y = [-50, 99, 39, -125, -52, 95, 40, -137, -97, 112, 69, -120, -33, 150, 59, -105, -26, 133, 74, -111, -51, 131, 62, -106, -41, 143, 52, -148, -47, 135, 23, -129, -28, 117, 25, -126, 1, 95, 5, -129, -38, 137, 18, -141, -9, 164, 6, -90, -16, 159, 19, -114, -3, 151, 40, -78, 17, 132, 16, -119, -3, 116, -3, -176, -46, 130, -11, -139, -5, 107, -31, -173, -23, 104, -14, -145, 11, 144, -10, -116, -23, 136, 9, -119, 42, 152, -4, -108, 39, 166, 3, -123, 25, 119, 0, -130, 6, 100, -57, -144, 5, 97, -60, -164, 35, 119, -54, -136, 30, 88, -45, -108, 30, 120, -20, -105, 31, 152, 1, -97, 52, 142, -22, -96, 53, 153, -49, -97, 19, 102, -55, -121, 26, 129, -61, -140, 34, 115, -66, -122, 27, 113, -64, -116, 68, 123, -71, -111, 56, 99, -50, -88, 75, 100, -46, -96, 53, 107, -37, -107, 63, 98, -59, -123, 55, 83, -66, -118, 79, 61, -66, -115, 54, 102, -64, -83, 87, 115, -59, -87, 84, 95, -80, -91]
2821i1K02j9j54l8J77oj48j7J63K1k11J7J43L5j68RJ48j3j55J3K04j5j75J6J57
2846I5lj52K5J50k2j60NJ71j7j84L0J92n9j56L1J36l2j74N7J45l5j64N8J37l1
2871D3j45QJ87m8j45J7J94m7j63O6J70r0j32M7J52m4j52N1J36n2j76O8J79j05
2895A9j45Q3J44n9j77O4J60o7j41N3J44p3r4M0J30m9j50R6J50q2j41O8J44n7j80
2920a20J22J12r2j14P5J40j18j09O1J42j06j05P8J10m1j85J41J13j20r7J06J07
2942A00j08p5Q8J18j14j20J04J11j24q1R6J23j21j24J32J27j15j47J31J05j31
2963b5j14J51P3q3r7Q2Q4o8j15J33J06j13j12J10J14r9j29J38O1j25n0J07Q7j30
2987a4r1J56O2j45n2P7Q8j18p8J23P2j53n7J57M6j24o1J54M7j16l7Q9R1j13p4
$$ y = [-91, 111, 92, -62, -100, 77, 71, -77, -94, 69, 90, -121, -104, 39, 74, -94, -85, 63, 50, -105, -92, 112, 97, -78, -62, 95, 92, -60, -35, 115, 93, -67, -62, 109, 92, -92, -62, 130, 71, -85, -54, 82, 50, -124, -67, 78, 43, -121, -63, 74, 43, -102, -94, 93, 45, -100, -83, 111, 64, -99, -33, 137, 47, -85, -38, 114, 70, -82, -31, 105, 53, -123, -55, 124, 19, -126, -43, 101, 42, -135, -71, 89, 22, -119, -66, 78, 5, -89, -49, 81, 32, -118, -22, 128, 46, -95, -27, 117, 60, -120, 2, 114, 22, -92, -17, 123, 5, -104, -43, 99, -7, -112, -34, 76, 35, -150, -9, 104, -16, -113, -7, 100, -8, -83, 5, 123, 9, -111, -7, 104, -20, -101, -5, 118, -3, -127, 5, 132, 17, -130, 1, 106, -25, -139, 12, 85, 2, -95, -13, 71, 3, -112, 21, 127, 14, -98, 12, 126, 27, -102, 36, 97, -28, -78, 29, 116, -14, -105, 51, 113, -32, -84, -7, 81, -37, -115, 8, 80, -73, -130, 27, 73, -51, -112, 42, 89, -27, -64, 25, 116, 3, -71]
3012g1J46M4j30o5J39O7j37q5J61L2j58m4J34M9j37p4J75J9j07o0J52K7j45m6
3036a14J73K0j32l5J54L9j61k0J37Oj04k6J10N6j48l0J53J8j34n5J47J0j45jJ38
3061E6Qj51rJ31L3j36l7J79Qj36j7J46mj47KJ36J1j63J6J51rj39nJ34Qj66L5J42
3089G7l1j10k3J73j0j77L4J32l5j19J7J33Nj51K4J54mj69M4R7jj39K3J74o3j35
3115h0M1J21n8j02PJ44n7j30N2J20n3j06M4J55o2j35N7J17j9j45M9J45p2j34J20
3140A9R6n3r7K5J24m8j38L5J26m2j36N0J25n9j42Q3J28j00j04P2J26r2j29J16
3164a5J07r2j16R3J04n5j21P6J45q9j23R5J09r6j06P5J10j03q4P5R5p7j22R4J11
3189I0p3j30J04J18j36q3J16P6j20p0J15Q3r6j19J25J04q6q7R0P9q8j35J24Q4
$$ y = [-71, 75, 119, -11, -76, 63, 130, -7, -92, 69, 101, -57, -101, 33, 82, -55, -129, 46, 65, -42, -102, 50, 77, -68, -114, 59, 79, -53, -88, 66, 105, -56, -76, 61, 67, -37, -63, 47, 103, -45, -75, 78, 96, -38, -93, 54, 64, -81, -82, 56, 64, -87, -96, 35, 68, -68, -105, 74, 82, -54, -71, 75, 71, -76, -74, 62, 73, -90, -74, 77, 68, -71, -76, 58, 66, -100, -65, 77, 46, -64, -87, 86, 76, -101, -67, 65, 30, -89, -72, 61, 66, -85, -61, 93, 89, -80, -36, 61, 60, -79, -56, 118, 55, -80, -39, 82, 24, -78, -71, 73, 16, -114, -62, 58, 5, -101, -57, 98, 36, -99, -42, 75, 56, -89, -40, 105, 33, -101, 19, 115, 62, -35, -10, 114, 66, -72, -37, 89, 47, -89, -39, 86, 27, -115, -32, 96, -4, -108, -36, 90, -2, -131, -15, 92, 0, -116, -23, 81, 26, -95, -19, 126, 37, -86, 9, 118, 22, -84, -9, 101, -2, -86, -11, 84, 7, -115, -21, 90, 17, -113, -9, 109, -27, -110, 6, 82, -38, -108, 7, 90, -6, -125, 0, 104, 18, -69, 21, 100, 12, -123, 1, 85]
3213H5j00n4O0J00j25r2J61N5q7r9R9P3j26n3J12Q0j07p8J15Q8j01q8J16J03j50
3238a3n4J05P0j26o4J06Q0j36m6P9O4r1r6J44L6r4m4Q2O9j27m7J36L7j19m5J10
3264A6O6j13m0J17N0j15o6J55M3j53k7J19L4j43nJ11pp6n3J15L7j34n4J60J7j40
3290h6l0J54J3j34MR6L4j16lJ21J3j03j3J31J8j43k7J31K7j53KJ57j9j45K3J02
3316E4oj38K1J08Qj14KJ11K1j53J6J51j1j46J0J19qj15J2J37l5j05K5J00jj10
3342d7OJ14kj43L4J21l6j23jJ60l9j24M3Q1qj18L4J13j2j19K5J21m4j31O6J19
3368I0m2j37M9J32o1j02M7J08o2q4M3Q5m9j19Q0J04p9q8M3J26o9r9O3J15q1j07
3394i4P1J23o2q2M6J08o9j11N9J30j00j24J02Q8p9j10R7P2o4o8M7Q4o8j06J03
$$ y = [85, -15, -69, -9, 91, -34, -126, 35, 90, 3, -96, 3, 76, -50, -103, 9, 89, -18, -96, 19, 107, 6, -82, 34, 137, -13, -67, 38, 108, -18, -82, 24, 104, -32, -78, 1, 65, -26, -122, 22, 58, -36, -80, 2, 71, -56, -103, 33, 70, -49, -94, 16, 82, -31, -71, 46, 96, -19, -85, 70, 113, -40, -67, 52, 86, -57, -62, 49, 42, -34, -87, 28, 65, -69, -123, 37, 54, -86, -116, 38, 51, -83, -79, 17, 51, -65, -68, 53, 66, -37, -50, 81, 99, -44, -71, 60, 87, -66, -64, 93, 74, -71, -48, 54, 48, -90, -69, 39, 47, -67, -65, 46, 67, -86, -70, 81, 70, -76, -66, 53, 45, -70, -58, 79, 44, -61, -36, 64, 63, -47, -41, 73, 71, -72, -38, 83, 47, -76, -77, 83, 44, -80, -37, 44, 36, -82, -48, 65, 53, -66, -41, 80, 36, -95, -29, 90, 48, -89, -40, 92, 31, -71, -24, 84, 22, -62, -19, 66, 17, -102, -22, 82, 3, -85, -42, 84, 15, -84, -21, 94, 13, -94, -23, 100, 38, -44, 2, 110, 41, -70, -11, 119, 19, -105, -3, 85, 6, -104, -7, 65, 1, -67, -20, 64, -4, -110, -7]
3419gR7p3j06Q4R8r5q0R3O1p4o9N4R4n0q4Q6Q6j25n5P1Q7q5q7P0Q6r3p8Q7R8q3
3449Hj12R5N4o8o7J08N6r8q1J28Q0r3r8R3J07j19q6J28M9j30j9J07L6q0p0R7R3
3476A18j17p8J14K7p0o2R8L7r1o6J11O0j13n3J16N1j14n3R2P7r1l5O7M1q5o6J13
3503B8L3j03o0J17O1j12q9J61L6j27j2J13J0j13l5J15N2j18l1J35j4p9n1J71j0
3528G8j07j8J10K3j02m4J22J1j12PJ03k0j19J3R7J8j30pR8J4q6l8J38K1j26rR5
3555C0Qq6K1R1jj06qJ17%j14lJ36J4j22j4J14k8j11lJ42n1j00J4J14k5j21K1J22
3583E1k8j15K6J26j6j11L3Q0%j05L8R8n4o6J8R3l6r8J7J34m2j03L3P8Lj17M4R7
3611G8l3j12J8J13l5j07M3J05l2j11M3J22l0j54L3J43p7p7M5J21p4r5N2P2k1q3
$$ y = [-7, 90, 17, -89, -5, 93, -2, -82, 11, 72, -2, -71, -17, 77, 27, -57, 29, 115, -10, -65, 6, 93, 8, -79, -9, 77, -16, -94, -7, 91, 8, -104, -9, 45, -23, -90, 18, 74, -24, -105, 23, 103, 10, -88, 5, 112, -7, -93, 35, 84, -46, -65, 42, 78, -2, -72, 25, 118, 1, -77, 37, 64, -6, -68, 30, 67, -24, -90, 21, 81, -32, -85, 31, 82, -32, -85, 7, 84, -7, -42, 25, 66, -19, -85, 28, 61, -42, -102, 15, 76, -36, -125, 36, 72, -55, -67, 46, 56, -57, -92, 23, 75, -43, -74, 61, 47, -32, -83, 88, 78, -29, -47, 63, 86, -16, -60, 62, 73, -39, -32, 71, 51, -68, -55, 42, 60, -70, -77, 21, 35, -51, -89, 49, 70, -56, -65, 30, 38, -48, -27, 64, 63, -43, -51, 66, 66, -48, -51, 85, 99, -23, -37, 77, 49, -62, -65, 77, 26, -74, -60, 54, 29, -92, -71, 51, 23, -92, -66, 60, 44, -67, -34, 46, 46, -59, -21, 77, 23, -43, -25, 68, 32, -66, -49, 85, 43, -60, -27, 51, 54, -63, -19, 78, 45, -67, -49, 64, 29, -78, -35, 70, 38, -73, -30, 92, 62, -92, -59, 84, 7, -70, -25, 96, 22, -73, -21, 51, 30, -53]
3637e3OJ16m7r8L2J28p2r4P6R2o6j17N5J28p3q5O4Q8o2r4P2N8k4j02M9J28p7q6
3665e8N6P0p5n9M6L8k4r3P7P5o8q5J07L8l2q6O1R1p9q7J05M2o1n4P6Q1j01q1J20
3694D0L7o4n5O2Q3r8q3R4N1o7r0J12J6p4p1J17M0r0k3N5N7p2q4J04P0q1n2Q4M7
3723F5o0n1J07J7q7n6J00L4o7n9J24nr1k4N1J00j17m0Q9K4j14mO9M2q8l8Q2N9
3751F2j20NP0L3q2k4J01J8q9m3J21K1r0m2J14Rj21J3Q4K1j13lR2J4p4l4Q0L0r6
3780d3j3J12K0r7qQ1J2r2rR1Qj09mP6M1r1m0J17J0j07m7J20Kr5QJ04j6p0mQ9q
3811C8r2J8P4J0r0lQ9jr4K2J04k1j00K3J19m7p4qR8l6q8QP3j3p3K3P7mj15L6Q6
3842C9m4o4L5Q1m8q9O4R4j7r8N2O4l9o9K6J15o6p6K6O5mj08L0P8m1p6N0O3k4j00
$$ y = [-53, -47, 69, 22, -76, -44, 84, 12, -82, -6, 86, 20, -97, -42, 86, 13, -72, -8, 80, 18, -76, -4, 54, 30, -72, -23, 105, 28, -58, -2, 68, -7, -66, -20, 18, -6, -99, -22, 53, -15, -100, 7, 45, 13, -73, -12, 79, 0, -87, 18, 60, -1, -55, 21, 102, 1, -80, 40, 77, 13, -42, 20, 103, 5, -78, 16, 67, 0, -90, 22, 38, -36, -107, 10, 50, -40, -63, -8, 49, -23, -107, -3, 67, -14, -66, 18, 65, 5, -46, 61, 78, -9, -65, 35, 69, 2, -57, 67, 62, -29, -53, -2, 98, -19, -59, 30, 54, -60, -64, 5, 47, -41, -79, 3, 62, -58, -53, 17, 50, -32, -56, 45, 63, -26, -69, 52, 73, -17, -59, 55, 64, -57, -44, 40, 61, -52, -55, 37, 51, -23, -57, 23, 53, -43, -56, 56, 76, -21, -29, 52, 64, -28, -37, 54, 62, -47, -51, 25, 66, -25, -65, 52, 62, -45, -92, 28, 30, -65, -57, 47, 31, -39, -43, 46, 38, -54, -36, 38, 48, -42, -45, 44, 43, -51, -29, 75, 54, -46, -23, 96, 49, -25, -33, 65, 29, -59, -51, 22, 9, -64, -41, 36, 32, -83, -47, 39, -5, -69, -34, 47, -1, -90, -26, 68, 51, -47, 5, 69, 30, -39, -13, 102, 36, -40, -14, 51, 47, -61, -31, 47, 6, -70, -20, 43, 19, -81]
3872h1M3R6m4r9L7R0m6o0L2J01p0n3L6Q1l2p8N0L8k5p6O6N2m2q4N2Q3k7r9O2P3
3902G6o9n0M0Q8r1k7L8K9m1p3N6Q7m5p2P1M0q2l3O6P7p7o8P6L3m4l9N0J8m3p7
3932h6Q8O3o4o8N8O5n3n7N4P7p6k3J2O8m4o5N6Q1q7n4P4L2m3p4J16K2q4m0O9N1
3962F8q9m4O8P0j08m3Q5M5p0n6O8N1m8n3Q8L6p6k2Q3K1j02rR9mn7m3P4N1q0l1
3992b8M8K4p3k7Q6J2p2n3J09K6j02l9R9L4q4k9R5J3p0NM5N1q3jO8j7n5k5J15k4
4022D8p8jQ3nq1KO3L1r0l1J09qp4j8P8Rq2KP0L7j19K2Q8k7q4K6R2j9j05OJ05j0
4054C9j02L9Q5l2r0J9Q6rq7K0N8J7r5K5P0Kq5J0R7k7p7%J03l5q0L1O7k5o9J5O8
4085C8j7o4L3N7j8q6J0Q3qq8J4J07n2n9K6Q8m4p5M1P6l2r1M2R3n7l5J9J01p0p0
$$ y = [-81, -38, 58, 14, -85, -48, 42, -4, -64, -32, 69, -1, -54, -18, 63, 31, -47, 3, 41, 16, -60, 6, 58, 16, -68, -16, 67, 40, -59, 3, 76, 7, -43, -3, 85, -6, -33, 5, 34, -7, -80, -24, 63, 18, -54, 17, 57, -25, -58, 8, 85, 8, -60, 16, 49, 5, -34, 16, 34, -9, -86, 2, 65, 1, -67, -9, 56, 3, -54, 0, 77, 1, -22, -10, 58, 14, -51, 5, 86, -1, -55, 19, 51, 8, -66, 50, 72, -12, -52, 17, 68, -21, -65, 3, 73, -35, -78, 7, 52, -18, -74, -6, 45, -3, -56, 32, 68, -8, -30, 53, 74, -28, -37, 62, 58, 1, -42, 32, 83, 3, -28, 20, 44, -29, -56, 30, 42, -30, -83, 26, 52, -50, -89, 10, 44, -40, -69, 26, 39, -31, -26, 19, 70, -13, -14, 54, 37, -18, -43, 72, 48, -30, -31, 52, 47, -34, -32, 31, 62, -28, -59, 50, 42, -32, -50, 28, 37, -45, -43, 27, 64, -55, -33, 55, 28, -56, -30, 62, 43, -62, -56, 49, 39, -63, -24, 61, 29, -61, -42, 44, 35, -52, -32, 26, 43, -52, -27, 43, 45, -40, -30, 67, 40, -37, -37, 66, 31, -49, -18, 49, 24, -45, -30, 38, 21, -43, -10, 47, 29, -57, -47, 36, 28, -60, -46, 61, 9, -50, -24, 64, 20, -55, -14, 62, 30, -61, -19, 74, 17, -18, 1, 102, 32, -38]
4115c8M1Q1l7q0L7L4rj04N4P2m7o2K6Q4n1p2J2R6m2n4K0Q1l3n5M8L7q6K1L0M8
4145E2m1m7L1L4k1m8L2N3j9q0M2P2m3n9P9L7m3q8N0N4p3j9K7Q0p5n4N3P0m0n7
4175d1P9J5j00j5O6N6o2m3O4L1o6k2M9K7l5p1Q4N0p7m8N7N2o7k3N2M4o8k9O1M1
4205F1n3l4J9O0m8l1J8N7p4k2N1M1o0k2M4K5o0m9J00K3p4l7R5J3q8J0L7K1k3l7
4235c7N7L6m9n1O9L4q5nO0Ll7l5Q5Ln6n1O5K8n7n4O5L5q2pO5L2o3j3K9K4n1J0
4267c3P9jn2k5M8J6k7m9J11qq1%N6jq7M4O2k3m5k8P0Rq7J7L6L1q7J0Q6rq1L0N5
4300C6j6n3KO7Qr9K1Q1op9LP1ko5kO9mm7lO3rp4LQ7k7o6K8M9l0q1N7O7k7m8QM8
4336C0Lq2L5N4j8o4L2M9j8p2L6N7pq6J9J03o6m5RP5l5o3L2N5k1n7M7M2k6m7L2
$$ y = [-38, 3, 84, 47, -33, 4, 38, 29, -75, -21, 51, 4, -58, -32, 52, 1, -71, -59, 37, -5, -59, -39, 42, 9, -46, 2, 39, -47, -26, 4, 52, 11, -36, -5, 29, 8, -40, -8, 45, 26, -54, -12, 60, 17, -42, 37, 74, 31, -57, -7, 47, -26, -45, -18, 62, -13, -67, -14, 56, 16, -41, 38, 53, -47, -62, 4, 60, -2, -45, 19, 50, -16, -38, 11, 38, 3, -68, 16, 66, -11, -59, -2, 50, -17, -40, 12, 56, -12, -41, 20, 61, 8, -26, -7, 53, 5, -26, -8, 49, -25, -47, 4, 45, -15, -37, 7, 32, -28, -77, 23, 46, -28, -65, 30, 43, -45, -35, 2, 23, 0, -37, 20, 56, 7, -44, 25, 59, -26, -31, 29, 32, -5, -40, 45, 48, -8, -59, 6, 34, -23, -77, -12, 23, -59, -66, -1, 31, -32, -45, -16, 8, -43, -33, 46, 45, -7, -32, 16, 32, 5, -44, 67, 59, -22, -22, 34, 33, -54, -10, 52, 29, -16, -44, 26, 35, -52, -35, 1, 32, -55, -45, 41, 32, -49, -19, 36, 20, -33, -31, 36, 44, -55, -34, 47, 41, -38, -35, 36, 34, -31, -33, 36, 32, -15, -18, 45, 36, -38, -35, 52, 25, -41, -13, 36, 6, -75, -18, 49, 22, -26, -18, 30, 33, -49, -14, 40, 22, -42, -10, 39, 21, -51, -15, 42, 35, -51, -32, 71, 5, -40, -31, 44, 9, -54, -22, 33, 12, -45, 2, 44, 18, -29, 3]
4367CL3j7l8K4O4n2o9N5M2n1o7N8P0n8n1K2L6Oo4K3N2np1O5M4n5n1L2O0n4l0M9
4399EL1l1l3N3J7k2m2L0M7m9m6K6P4o6l7L9N7n9l4L5M5o8j5L7J3j2k7K3M3m0l9
4430d5K4M9k5n2Q0Pm4l0N8M5p2j6M4M2n7m1O3Pn5j5N0oj7j9M4M0o4l2M9J3n9n
4462c9P2j4k9l1Q2K3p0LL1mm2kL1L4l0n4M8M1p6k5N6J6n9j7O8K7o5nL9K5m4l0
4494d0M7N8q6J6M8K2j01J5N0M2j06pQ0mp5j9R1j2o0j4P8ro2L2K1K6o4oO5J6j7
4525B5m8N8l0pl1O2J3n0j5O5Pn8j1O8j7m2jL2%n3NO7pr0M1N1on5pN1Rp5J4N9%
4560B4l3nO3k2m0j5N6K1q6K1N3pm7J2M9Mq3J8N8j7m3rO5no9J9N5k2n4K4L7k9m0
4593d7OO3rk7J0L8l2k5J3M9l1m2PO0k4l2j3R1k6r3M5N0j7l4RQ3n1n4N9K7n0k9
$$ y = [3, 36, 19, -19, 5, 69, 17, -52, 3, 45, -6, -73, -15, 55, -3, -54, -32, 4, 10, -54, -31, 21, 16, -55, 10, 54, -1, -52, -20, 40, -14, -44, 5, 36, 5, -28, 25, 42, 20, -22, 8, 55, 6, -40, -14, 60, -6, -43, -4, 53, -6, -40, -5, 40, -28, -43, -6, 7, -5, -32, -9, 34, -6, -45, -21, 28, 3, -49, 31, 38, -6, -36, 22, 67, -5, -21, 23, 65, 8, -33, 30, 37, -18, -33, 17, 11, -6, -25, 19, 59, -5, -37, 12, 25, -34, -39, 33, 19, -10, -41, 41, 64, -6, -3, 28, 24, -18, -20, 11, 45, 15, -39, 9, 50, -26, -51, 5, 21, -38, -55, 13, 40, -25, -30, 9, 34, -10, -40, 7, 65, -21, -5, 43, 65, -36, -21, 29, 71, -35, -42, 38, 34, -41, -60, 31, 19, -41, -55, 23, 14, -48, -16, 5, 31, -33, -39, 26, 42, 25, -23, 35, 5, -2, -33, 29, 42, -8, -23, 42, 49, -9, -20, 48, 31, -11, -12, 20, 20, -33, -28, 39, 32, -58, -17, 34, 28, -27, -34, 17, 26, -49, -35, 24, 24, -9, -14, 49, 27, -13, -28, 28, 49, -37, -16, 37, 30, -17, -5, 44, 48, -35, -17, 41, 24, -19, -28, 37, 32, -37, -18, 37, 15, -39, -15, 22, -7, -47, -41, 22, 13, -14, -4, 34, 2, -23, -10, 39, 8, -34, -27, 33, 9, -23, -36, 55, 29, -64, -19, 31, 14, -20, -11, 72, 21, -33, 26, 53, 3, -26]
4625b6J9N2rn7L1M5n8l7L8K9k2k3K1L4m5k9L4L4j1n1K0O0l1n7L2J9j9k6L3O1n7
4656Dm2K6L4kn6N9L0l9n4M7N7p1l5M7L2l8n3O3Rm2l4Q4J0o5mJ1L2m7pO1k2K0o6
4689e1M8N9n4l0M9N0p5k7L6L7m2k0M6Jn2lL5M5p4kL8Kl1k7N2J2n5RN5jl7j6M3
4722B0rm8%N1M4r0J5M9l3lnJ6M4n3j3M9J1p1J2L0L0q7K2N7j2l4nM1jn5NO7qm2
4756fj6L5Lol9N5Om4J4M8l9k8JP6m1l6rO5k7o2PO1j0n7M3M1J3o5j3O8K3p3KL8
4790B8mn5L4M9j4q0K2M5rj5k0N1j2o6J1P0No2%L2Pn1J2M6Pn6J2M0j6m9K4O8l6
4823A8j1J7K8k8m2NO4k1m5J0L3j7l5L5K9l5m9M4K2j1o2OP0j9n9N8L0k7m7J7N7
4854C5l3k5M0N6p8POL8l1k8O2mk0o4L6M3k6m8L2L7m2m1M3K7k7m8M1N0o9JL7L7
$$ y = [-26, -7, 45, 36, -21, 10, 55, -3, -40, -2, 27, 5, -18, 3, 37, -8, -37, -3, 31, 20, -31, -11, 49, 18, -39, -7, 12, -7, -33, 0, 61, 4, -38, -12, 22, 20, -36, 23, 53, 14, -40, 7, 64, -7, -42, 5, 37, -1, -54, 9, 18, -24, -58, 26, 36, -29, -33, -22, 10, -37, -44, 17, -5, 15, -51, -3, 56, 2, -28, 21, 71, -4, -31, 5, 42, 0, -20, 26, 27, -25, -28, 7, 52, -22, -24, 14, 16, -15, -42, 10, 22, -33, -24, 31, 30, -7, -23, 20, 11, -37, -37, 14, 58, -32, -17, 32, -1, -4, -9, 7, 51, -2, -15, 34, 45, -26, -14, 16, 46, -41, -19, 38, 26, -8, -13, 28, 27, -28, -23, 44, 36, -6, -22, 13, 16, 10, -29, 26, 32, -12, 2, 50, 11, -17, -16, 60, 19, -17, -26, 39, 12, -50, -43, 18, 8, -49, -6, 35, 48, -17, -30, 38, 61, -12, -10, 28, 24, -31, 3, 52, 38, -42, -20, 25, 16, 1, -19, 32, 20, -46, -35, 35, 40, -22, -22, 10, 17, -34, -22, 24, 31, -25, -13, 27, 11, -38, -14, 54, 18, 7, 24, 52, 24, -18, -13, 51, 30, -15, -5, 28, 11, -24, 11, 40, 5, -44, 0, 22, 11, -51, -45, 25, 6, -53, 5, 35, 8, -39, -22, 35, 2, -23, 17, 73, -5, 2, 8, 46, 15, -13, 49, 45, 25, -39, -3, 40, 14, -34, -2, 35, -7, -48, -5, 22, -5, -53, -12, 38, -31, -30, 7, 44]
4886D4o9j7N7Kk7k3M1L8l1m8N4K0k6o5P1J0l4l6L1N0j4n9N4Kn9L1L7km5j9O1L1
4918F0n3m1N7l3j4rM3K3m9m8P5kj1n9O8jm4NM4J8m9RJ9J2n8oN5J2l6J9nL9m0j8
4952a8N3K2n0j4L5ml0mK7L3o9nL3J7l6m4O8Ml8nL8J8p2NM2J7m5k6P7ll8j6L9r
4986Bl0K3K5J0o1K7N3j1n0nO1l7j9NO1l0m6lM1K6p4J6L6Rn3J4K6Po0M3J7J1o9
5019c5ON7Nl9J1J4Ml6J7K0J8p9M2K2j4l2J2L4Pm3kK0Om8K0M3k3j4jM6l4l2N1o
5053A7Pk1j1K4%o5K5L5k1m0L8K6l4m0O0J5Kn0K9K8k2k4L5L0l3k1L2J0j0m4K0L2
5085B9j8k2qN0j7m1J6N6m3n4N2L0n4j2K2J8km6N8J7m0k0J2O4o4j7MM8j7k0K3J5
5117A9j5k5L0M9n0j0L4K6l7o0O4J4l9njK1j7l9K0L6k3j2QJ6Mm5L8J3k4%RM7o8
$$ y = [44, -25, -42, 15, 17, -10, -33, 8, 46, 15, -33, 21, 41, 15, -50, 21, 31, -3, -39, -8, 42, 28, -31, 23, 25, -34, -3, 34, 32, -13, -32, 29, 60, 7, -34, 23, -10, -24, -33, 10, 33, -16, -64, 11, 9, -2, -61, 7, 6, -38, -33, 11, 29, -20, -11, 8, 20, -38, -44, 11, 23, -13, 6, 1, 40, 0, -18, 35, 57, 7, -7, 28, 24, -6, -10, 17, 50, -19, -24, 9, 26, -10, -54, 14, 18, -20, -25, 13, 31, -41, -36, 6, 23, -22, -48, 29, 26, -12, -28, 11, 2, -28, -5, 20, 30, -31, -4, 49, 38, -12, -17, 44, 7, -12, -7, 54, 24, -22, -25, 16, 42, -32, -16, 20, 29, -24, -10, 16, 23, -37, 6, 23, 34, -35, -29, 28, 33, -6, 5, 19, 23, -13, 4, 24, 42, -37, 5, 27, 13, -19, -7, 27, 34, -9, -11, 9, 15, -33, -13, 30, 7, -7, -8, 38, 4, -28, 23, 17, 24, 3, -8, 16, 16, -49, -24, 11, -10, -50, -12, 14, -20, -60, 0, 15, 17, -33, -4, 24, 2, -22, 13, 43, 10, -11, 21, 31, 21, -23, -3, 29, 11, -11, -19, 31, 14, -27, -11, 45, 2, -52, 0, 30, -24, -36, -14, 4, 2, -44, 14, 31, -9, -29, -17, 47, -17, -34, -30, 18, 1, -19, 4, 19, 4, -21, 9, 58, 8, -2, 32, 58, 21, -39, 25, 39, 0, -5, -6, 15, -2, -41, -21, 15, -8, -20, -12, 4, 8, -37, 1, 14, -10, -10, -1, 46, -22]
5150b2nL0K5l6j1M9L1m0j2K7j9n7M5RM4p7jJ9O3n5l8K8K0k3k9M5L0n8j4L9K7n7
5182b3K4RJ7n6KK8L3m9mL7pj3l5P5j5l7j3O9km1k9M6Ol5ORM6n3nN4J3p3LO1j5
5217C3k6k9M5j1n6N6lRqk0PRk9mN9k7n3K0N2lk1mL8rm7J2K7oj0mM5l1l0jM2Rk6
5254EpOK6n1K5RJ2m9ML0oj9m4N7Om4QP5n3j7K9K7j5k9J5J8K8l9PL5k6j9k2O0j5
5289B7n6L5M4k0n3J6N9k8n8N2K0n8%MJ1nj9J9K7rl5L7J0J0p6N4KKk9J3K5k7qJ6
5323BL6l1l5OM2Rk5nL4j6m1J5N6m2l3jQ1l4l6QL3l2J8j0J0ll5jL9pm1M8lqk4J9
5359gK1l2j0N7qj1k1LN9n8k9N7J5l9m0N5O%n3M7J6m1rK8L0m2k6L5J3k3m9N7K0
5392B1l7J6%L4k2l3L3j2k1k9Q3k1kn3O1Lm4kK0K7l4j8N4Rk5pL1j2j8k9J2J9l7
$$ y = [-22, -27, 3, 28, -8, -19, 30, 61, 21, 9, 36, 17, -40, 5, 14, 58, -19, -20, -1, 62, 7, -31, -3, 17, -6, -35, 10, 40, -18, -32, 7, 34, -23, 1, 10, 27, -29, -27, 1, 34, -15, -19, 18, 11, -2, -37, 38, 23, -14, -27, 42, 40, -1, -30, 16, 22, -13, -7, 2, 48, -5, -10, 44, 57, -16, -13, 48, 33, 7, -22, 23, 12, -44, 12, 9, 18, 10, -10, -3, 6, -23, -27, 32, 5, -48, -28, 24, 21, 0, -4, 34, 25, -22, -10, 17, 11, 1, -3, 42, 11, -19, -20, 22, 31, 5, -2, 4, 30, -21, 4, 13, 25, -24, -20, 10, 4, -15, -59, -2, 4, -40, -32, 43, -10, -27, 2, 29, 14, -15, 0, 18, 46, 7, 14, 49, 23, 4, -18, 42, 27, -29, 6, 50, 30, -23, -7, 52, 24, -34, 18, 38, -20, -20, -16, -5, -10, -29, -10, 17, 8, -27, 10, 20, 30, -46, 8, 10, 12, -17, -4, 21, -6, -14, 2, 38, 7, -28, -22, 20, 29, 4, -1, 33, 17, -24, -9, 47, 5, -28, -29, 52, 18, -18, -10, 23, -9, 9, -1, 9, 6, -29, -30, 9, 2, -39, 9, 6, -2, -26, -7, 14, -18, -28, 29, 21, 10, -11, -8, 51, -7, -36, 21, 36, -3, -43, 12, 18, 18, -35, 12, 28, -13, -22, 6, 36, -6, -32, 3, 16, -7, -56, 1, 21, -16, 0, 0, 34, 12, -21, 12, 0, -21, -50, 33, 12, 10, -43, 18, 21, -23, -25, -5, 22, -12, -30, 24, 33, 8, 1, 32, 20, 2, -27, -15, 4, -33]
5425c3ML3J9n3j5L4K5j1j3K1Lk1k3N6kl9nN6j3j2k7J5L0n7OL1J7l0pL7J0m8J2
5458@K4Ll8PL6J4p0K0QRj3mLL9m5m4N8K7n0j0L0Pn9J4M3ol0K3M3j7l2oK5k0jJ2
5494@L7lp2L2J4J3n1J8M0mm7J0M7J5q6M0K6nn2K7L4k8l6J3J2j6k3M6L1m1k7RN3
5527B6k7k3J6L6k2j6PM2k4o1K4N2j4j9nL5Jn4JN4j2rJ2J5m3koK3Ll1K2K0k0k4
5561b3K3J2nn0J5M2J5l7K4Mj4k0K2K6m9J6nK4K0q1M1K7k1j2PJ7Oj7oK9k4l4OM7
5595B5m1j4JN1k7pK3J5m1kJ2L7l1k2RK6j2Jj2K5j7l1L1J8k8j2N2jk5j0NK8l0k1
5629b5N0Kk8JL0Jk8l0K1K3j5j6%M8o2j2M9L4n6l0M8Mj9j6J5LKj2M2j5%k9M9J6
5663D5m9l0L5L5m8K3K4ok0k8K8J7l6k4M9rKj7L2K0p4J1N2j1n5K4K4Nn0J7L4ok4
$$ y = [-33, -29, 4, 23, -30, -45, -11, 14, 3, -10, 11, 14, -7, -30, 26, 24, -15, -20, 36, 23, 11, -16, -1, 29, -28, -22, 9, 26, -4, -11, 26, 36, -12, 0, 24, 27, -11, -4, 32, 46, -24, -4, 4, 13, 0, -4, -1, 38, -7, -51, 7, 34, -16, -26, 4, 11, -48, -34, 9, 3, -27, -4, 39, 22, -10, -16, 9, -11, -12, 0, 37, 34, -38, -6, 8, 21, -30, -12, 28, 24, -23, -13, 34, 49, -37, 3, 29, 24, -28, -1, 33, 5, -31, -18, -6, -22, -45, 1, 32, -9, -36, -27, 26, -1, -24, -8, 28, 6, -10, -3, 39, 15, -46, -22, 30, 16, -3, -8, 27, 28, -26, -25, 29, 17, 8, 20, 35, -8, -10, -16, 7, 10, -21, 1, 21, 1, -23, 0, 12, 7, -43, -28, 14, 29, -8, 16, 20, 6, -14, 8, 34, -15, 1, -4, 20, 40, -41, 0, 27, 6, -6, 1, 18, 24, 7, 1, 30, 6, -28, -22, 25, -16, -30, -29, 22, -5, -12, 11, 26, -15, -17, -5, 32, 1, -21, -12, 14, 2, 3, -9, 16, -1, -32, -1, 17, -11, -23, 29, 28, 3, -7, -2, 26, -4, -25, 25, 27, -1, 0, 30, 31, 3, -27, -6, 17, 2, -14, -14, 34, -28, -40, 9, 43, -13, -43, 5, 9, -10, -26, -11, -8, -6, -18, 24, 9, 9, -20, 29, 45, -4, -34, 1, 36, -12, 11, 35, 29, 9, -19, 9, 26, -10, -34, 15, 6, 8, -9, 23, 43, -31, -20, 32, 21, -34, -10, 14, 19, -31, -14, 20, 14, -10]
5696a0OJ1j5j3KK6L0km8J2M2l9k7N5kj7OJ6j2k3pL7j1l5NL2ol5mM9j2rj7K9j7
5731cmjJ9qj5JJ3K4m7jK9Kj0J7j9J5k8OL0%m1oN2KrKOk5l3M7kk0kj2K7ql2LN2
5770B1nm5J3J7nj8K2Ork3K3K7l8lK0L0j4m6ML6J2k5rJ3jj5QJ9Om5J1L7n8L0qL6
5806B4k7j2J2Rl2%J5J7j3j5KL2k1LmkK2l0J8M2m5j1K2L5n0PJ5L1l6l4M7Lopj7
5841fL5l3k4J9K5Nk2N4k9Km4jM2k5k3J7L7l8KJ2K2k3j5L0J2n1qK2Oj9kN8jm2k8
5876c4O7J1k0l9K7J4k6j6J6K5m5kK2K3k3%J5Kl2%M0Pk4j0QKmk2K1kk9KL0L5l5
5911Dj7K5Pl1K0k0L5l6mM4j2J1l9L7Nj8j9M4Nm5k0J8J7n0J0M9k6k1rK4L3m3k1
5944d3N7Jk6OJ0j3j5K6J3J4n8K2M0m7J0j6N0Nj5k8JN0m1J1J8qm6J5K7j3l8KO2
$$ y = [-10, -4, 7, -8, -21, -19, 7, 37, 35, -13, -1, 41, 2, -25, 30, 28, 11, 17, 33, 21, -2, -9, 28, 17, -18, -13, 19, 13, -22, -26, 23, 11, 2, -15, 14, -3, -7, -8, 11, 3, -12, -11, 2, 26, -21, -22, 7, 9, -1, 16, -3, 12, -16, -10, 20, 20, -21, -27, 25, 27, 18, 20, 26, 1, -32, 15, 13, -7, -9, -21, 6, -2, -34, -31, 21, 16, -29, -16, 1, -4, -22, 0, 6, -3, -26, -3, 24, -14, -17, 3, 33, 19, -27, -23, 13, 25, 0, -9, 4, 3, -12, -4, 15, 21, -24, -13, 24, -34, -4, -12, 24, -3, -15, -3, 6, -26, -26, -11, 6, -7, -22, -20, 12, -9, -6, -10, -12, 10, -20, -2, 40, -5, -16, 6, 41, -9, -2, 13, 44, 8, -26, 21, 24, 18, 11, -6, 29, -4, -28, -9, 16, 21, -1, 53, 24, 26, -18, -19, 23, -2, -25, -8, 29, -9, -7, 5, 27, 4, -11, 19, 31, -20, -28, -6, 0, -19, -21, 37, 36, -6, -34, 33, 44, 24, -15, 12, 26, 0, -16, 0, 25, -20, -22, 0, 23, 0, 0, 15, 17, -15, -15, 25, 32, 8, -2, 6, 8, 4, -18, 3, 1, -28, -26, 4, 39, 4, -13, 12, 19, -12, 8, -12, 23, -13, -17, 27, 15, 26, -13, 24, 29, 11, -8, 36, 41, -4, -24, -6, 11, -39, -29, 20, -6, -27, -36, -12, 21, -22, -43, 14, 15, -11, -5, 5, -8, -23, 3, 16, 30, -28, -6, 34, -13, -3, -19, 31, 36, 21, -7, -6, 44, 3, 14, 32, 24, -22, -7, 20, 7, -31, -29, 33]
5977C3on5j8N9ok7k4N2mk2JK3j0k2RN2j7j7j4K9J2n0J3J1Lk%J9j9j6J1L0Kl5%
6012eN2pn2RL7l4j4J5qM0o9M4Pll0RR%j6kL5k1MQlRl0L4J2k5m6M7J6rj5KK4j8
6050Fj3KL0k2j5K1OKk8rN2n4k5M4Mpk6K3Rj0j9K7J8Qm6M9Pp2L3LK4j5j8J0J5k
6086A2j3L5k6Pk4K4OKj8kK2n8RJ8J1kj4J0L4l9rlO6o0j0J9K5l4j2L4Oj7Pj3L7
6121C0k1j2J3L3n4qM0J0pn0L9JmnR%j2Jj0M3o0LM1jk7rM6k8k2lL5j5LknK3l6O
$$ y = [33, 27, -28, -46, 13, 7, -20, -44, 8, 4, -18, -17, 6, -4, -26, -17, 35, 18, 1, -13, 16, 28, -22, -9, 2, 5, 3, 3, 22, 3, -13, -2, 28, 30, -5, -5, 47, 40, -12, -3, 34, 0, -14, 1, -7, 33, -36, 8, 15, 12, -18, -9, 0, 0, -16, -18, 17, -4, 0, 8, 5, 14, -16, 18, 30, 5, -41, 6, 22, 13, -2, 0, 24, 6, -7, -5, 25, 3, -12, 9, 15, 17, -11, -20, 32, -22, -47, -3, 1, -6, -32, -9, 0, -10, -29, -2, 16, 24, -22, 27, 34, -38, -5, -2, 22, 7, -11, -1, 14, 12, -1, 34, 8, 15, -9, 15, 21, 23, 5, 3, 25, -33, -24, -6, 5, 3, -11, -1, 33, -6, -15, -18, 48, -12, -22, -3, 22, -12, -24, 10, 16, -1, 6, -7, 30, 9, -3, 10, 43, -11, -19, 21, 31, 24, -26, 13, 14, 10, 5, 14, 14, 2, 3, -7, 36, -24, -21, 20, 19, -8, -17, 29, 1, -21, -24, 11, -4, -1, -3, -8, 15, -21, -15]
$$ [...]
8191b
##END NTUPLES=NMR FID
##END=
