##TITLE=1H_Pr urea-D
 DMSO, 8 sc, 
 29.07.2021
##JCAMPDX= 6.0         $$ Bruker NMR JCAMP-DX V2.0
##DATA TYPE= NMR FID
##DATA CLASS= NTUPLES
##ORIGIN= UXNMR, Bruker Analytische Messtechnik GmbH
##OWNER= root
$$ XWIN-NMR		Version 3.5
$$ Thu Jul 29 11:56:57 2021 Russian Standard Time (UT+4h)  she@DPX200
##.OBSERVE FREQUENCY= 200.131506
##.OBSERVE NUCLEUS= ^1H
##.DELAY= (6, 6)
##.ACQUISITION MODE= SIMULTANEOUS
##.ACQUISITION SCHEME= undefined
##.AVERAGES= 8
##.DIGITISER RES= 18
##SPECTROMETER/DATA SYSTEM= spect
##.PULSE SEQUENCE= zg30
##.SOLVENT NAME= DMSO
##.SHIFT REFERENCE= (INTERNAL, DMSO, 0, 15.7039)
##AUDIT TRAIL= $$ (NUMBER, WHEN, WHO, WHERE, WHAT)
$$ ##TITLE= Audit trail, XWIN-NMR		Version 3.5
$$ ##JCAMPDX= 5.01
$$ ##ORIGIN= Bruker BioSpin GmbH
$$ ##OWNER= she
$$ F:/spectra/data/she/nmr/H-F/1/audita.txt
$$ ##AUDIT TRAIL=  $$ (NUMBER, WHEN, WHO, WHERE, WHAT)
(   1,<2021-07-29 11:55:22.50 +0400>,<she>,<DPX200>,
      <created by zg, POWCHK disabled, PULCHK disabled
       configuration hash MD5:
       00 E9 B6 7A A2 85 ED C7 34 08 36 98 17 FE 4E 26
       data hash MD5: 16K
       51 C7 E0 F0 59 9A 67 8E 3C 9A 33 F7 31 50 A2 47>)
$$ ##END=
$$ 
$$ hash MD5
$$ 45 54 D5 1C 7E 89 7E BB 9C 37 EA F5 9D 5A 36 20
##$RELAX= 
##$RELAX= 
##$RELAX= 
##$RELAX= 
##$RELAX= 
##$RELAX= 
$$ Bruker specific parameters
$$ --------------------------
##$DU= <F:/spectra>
##$EXPNO= 1
##$NAME= <H-F>
##$PROCNO= 1
##$TYPE= <nmr>
##$USER= <she>
##$AMP= (0..31)
100 100 100 100 100 100 100 100 100 100 100 100 100 100 100 100 100 100 
100 100 100 100 100 100 100 100 100 100 100 100 100 100 
##$AQSEQ= 0
##$AQ_mod= 1
##$AUNM= <au_zg>
##$AUTOPOS= <>
##$BF1= 200.13
##$BF2= 200.13
##$BF3= 200.13
##$BF4= 200.13
##$BF5= 200.13
##$BF6= 200.13
##$BF7= 200.13
##$BF8= 200.13
##$BYTORDA= 1
##$CFDGTYP= 0
##$CFRGTYP= 5
##$CHEMSTR= <none>
##$CNST= (0..31)
1 1 145 1 1 1 1 1 1 1 1 1 1 1 1 1 1 1 1 1 1 1 1 1 1 1 1 1 1 1 1 1 
##$CPDPRG= <>
##$CPDPRG1= <>
##$CPDPRG2= <>
##$CPDPRG3= <>
##$CPDPRG4= <mlev>
##$CPDPRG5= <mlev>
##$CPDPRG6= <mlev>
##$CPDPRG7= <mlev>
##$CPDPRG8= <mlev>
##$CPDPRGB= <>
##$CPDPRGT= <>
##$D= (0..31)
0 1.2 0 0 0 0 0 0 0 0.06 0 0.03 0 0 0 0 0.0002 0 0 0 0 0 0 0 0 0 0 0 0 
0 0 0 
##$DATE= 1627545321
##$DBL= (0..7)
120 120 120 120 120 120 120 120 
##$DBP= (0..7)
150 150 150 150 150 150 150 150 
##$DBP07= 0
##$DBPNAM0= <>
##$DBPNAM1= <>
##$DBPNAM2= <>
##$DBPNAM3= <>
##$DBPNAM4= <>
##$DBPNAM5= <>
##$DBPNAM6= <>
##$DBPNAM7= <>
##$DBPOAL= (0..7)
0.5 0.5 0.5 0.5 0.5 0.5 0.5 0.5 
##$DBPOFFS= (0..7)
0 0 0 0 0 0 0 0 
##$DE= 6
##$DECBNUC= <off>
##$DECIM= 32
##$DECNUC= <off>
##$DECSTAT= 4
##$DIGMOD= 1
##$DIGTYP= 9
##$DL= (0..7)
0 120 120 120 120 120 120 120 
##$DP= (0..7)
150 150 150 150 150 150 150 150 
##$DP07= 0
##$DPNAME0= <>
##$DPNAME1= <>
##$DPNAME2= <>
##$DPNAME3= <>
##$DPNAME4= <>
##$DPNAME5= <>
##$DPNAME6= <>
##$DPNAME7= <>
##$DPOAL= (0..7)
0.5 0.5 0.5 0.5 0.5 0.5 0.5 0.5 
##$DPOFFS= (0..7)
0 0 0 0 0 0 0 0 
##$DQDMODE= 0
##$DR= 18
##$DS= 0
##$DSLIST= <SSSSSSSSSSSSSSS>
$$ [...]
##$SUBNAM2= <"">
##$SUBNAM3= <"">
##$SUBNAM4= <"">
##$SUBNAM5= <"">
##$SUBNAM6= <"">
##$SUBNAM7= <"">
##$SUBNAM8= <"">
##$SUBNAM9= <"">
##$SW= 20.0188882624521
##$SWIBOX= (0..15)
0 0 2 0 0 0 0 0 0 0 0 0 0 0 0 0 
##$SW_h= 4006.41025641026
##$TD= 16384
##$TD0= 1
##$TE= 0
##$TE2= 300
##$TE3= 300
##$TEG= 300
##$TL= (0..7)
0 120 120 120 120 120 120 120 
##$TP= (0..7)
150 150 150 150 150 150 150 150 
##$TP07= 0
##$TPNAME0= <>
##$TPNAME1= <>
##$TPNAME2= <>
##$TPNAME3= <>
##$TPNAME4= <>
##$TPNAME5= <>
##$TPNAME6= <>
##$TPNAME7= <>
##$TPOAL= (0..7)
0.5 0.5 0.5 0.5 0.5 0.5 0.5 0.5 
##$TPOFFS= (0..7)
0 0 0 0 0 0 0 0 
##$TUNHIN= 0
##$TUNHOUT= 0
##$TUNXOUT= 0
##$USERA1= <user>
##$USERA2= <user>
##$USERA3= <user>
##$USERA4= <user>
##$USERA5= <user>
##$V9= 5
##$VALIST= <valist>
##$VCLIST= <CCCCCCCCCCCCCCC>
##$VD= 0
##$VDLIST= <DDDDDDDDDDDDDDD>
##$VPLIST= <PPPPPPPPPPPPPPP>
##$VTLIST= <TTTTTTTTTTTTTTT>
##$WBST= 1024
##$WBSW= 4
##$XGAIN= (0..3)
0 0 0 0 
##$XL= 0
##$YL= 0
##$YMAX_a= 80159
##$YMIN_a= -121330
##$ZGOPTNS= <>
##$ZL1= 120
##$ZL2= 120
##$ZL3= 120
##$ZL4= 120
##$ABSF1= 10
##$ABSF2= 0
##$ABSG= 5
##$ABSL= 3
##$ALPHA= 0
##$AQORDER= 0
##$ASSFAC= 0
##$ASSFACI= 0
##$ASSFACX= 0
##$ASSWID= 0
##$AUNMP= <proc_1d>
##$AZFE= 0.1
##$AZFW= 0.1
##$BCFW= 1
##$BC_mod= 2
##$BYTORDP= 1
##$COROFFS= 0
##$CY= 11.3945322036743
##$DATMOD= 1
##$DC= 2
##$DFILT= <>
##$DTYPP= 0
##$F1P= 2.36226072786647
##$F2P= -0.459571619588291
##$FCOR= 0.5
##$FTSIZE= 0
##$FT_mod= 4
##$GAMMA= 1
##$GB= 0.15
##$INTBC= 1
##$INTSCL= 1
##$ISEN= 128
##$LB= 0.24
##$LEV0= 0
##$LPBIN= 0
##$MAXI= 10000
##$MC2= 0
##$MEAN= 0
##$ME_mod= 0
##$MI= 1.114404
##$NCOEF= 0
##$NC_proc= 0
##$NLEV= 6
##$NOISF1= 3.799351
##$NOISF2= 2.8
##$NSP= 1
##$NTH_PI= 0
##$NZP= 0
##$OFFSET= 15.70392
##$PC= 1
##$PHC0= -12991.81
##$PHC1= 7.600991
##$PH_mod= 1
##$PKNL= yes
##$PPARMOD= 0
##$PSCAL= 0
##$PSIGN= 0
##$REVERSE= no
##$SF= 200.130013532006
##$SI= 16384
##$SIGF1= 3
##$SIGF2= 2
##$SINO= 400
##$SIOLD= 16384
##$SREGLST= <1H.CDCl3>
##$SSB= 0
##$STSI= 0
##$STSR= 0
##$SW_p= 3612.71676300578
##$SYMM= 0
##$S_DEV= 0
##$TDeff= 0
##$TDoff= 0
##$TI= <>
##$TILT= no
##$TM1= 0
##$TM2= 0
##$TOPLEV= 0
##$USERP1= <user>
##$USERP2= <user>
##$USERP3= <user>
##$USERP4= <user>
##$USERP5= <user>
##$WDW= 1
##$XDIM= 8192
##$YMAX_p= 0
##$YMIN_p= 0
$$ End of Bruker specific parameters
$$ ---------------------------------
##NTUPLES= NMR FID
##VAR_NAME=  TIME,          FID/REAL,        FID/IMAG
##SYMBOL=    X,             R,               I
##VAR_TYPE=  INDEPENDENT,   DEPENDENT,       DEPENDENT
##VAR_FORM=  AFFN,          ASDF,            ASDF
##VAR_DIM=   8192,          8192,            8192
##UNITS=     SECONDS,       ARBITRARY UNITS, ARBITRARY UNITS
##FACTOR=    0.0002496,     1,               1
##FIRST=     0,             0,               0
##LAST=      2.0444736,     0,               0
##MIN=       0,             -121330,         0
##MAX=       2.0444736,     80159,           0
$$ Real data points
##PAGE= N=1
##DATA TABLE= (X++(R..R)), XYDATA
0 0 0 0 0 0 0 0 0 0 0 0 0 0 0 8 -8 8 -8 8 -16 16 -16 24 -24 32 -38 41 -48 56 -65 74 -87 97 -112 127 -144
35 -144 160 -182 202 -226 253 -282 313 -348 384 -425 470 -518 573 -630 695 -765 843 -930 1025
54 1025 -1134 1254 -1391 1549 -1732 1949 -2206 2524 -2920 3437 -4140 5155 -6765 9720 -16992
69 -16992 80159 62064 -17227 68506 69227 59405 28531 -521 -4999 43146 43885 8916 30552
82 30552 66851 13816 10172 51609 42139 35175 26884 -19171 138 52400 38884 -11454 -7821
95 -7821 19925 14982 26224 34652 -14903 -8161 30249 -1056 -3590 30883 1099 -30186 -4457
108 -4457 22464 9312 183 -4590 -31207 -5910 41130 -1279 -31791 -3798 -10011 -8040 16233
121 16233 -1203 -25726 -13597 3549 -7794 -4372 13478 -16947 -30753 3164 2275 2681 11206
134 11206 -27801 -32377 16557 24361 -9245 -19653 -3689 -4127 1716 21765 -5033 -19446 11591
147 11591 -283 -8567 24424 14895 -16697 -9591 13245 18303 12719 9411 -9814 -9174 31138 27089
161 27089 -1351 6686 2491 4463 29013 20805 2817 8556 13709 7884 13952 33976 17138 -9162
175 -9162 11563 22852 19686 30993 9083 -10872 17516 34055 20352 9351 11126 9703 8561
188 8561 28240 25878 2298 10815 12010 5097 26340 25768 3420 948 7525 16397 21784 17496
202 17496 1210 -8944 14083 25088 6821 7167 3242 -5679 12333 17000 5656 4102 -525
215 -525 -3669 2826 16632 12389 -11858 -8297 5480 2292 10387 5408 -14863 -8950 3408 6085
229 6085 3856 -5538 -10370 -10770 575 9062 -4866 -9314 -7641 -13408 255 7295 -6225 -12076
243 -12076 -14417 -7920 3268 2349 -7177 -18415 -12615 2187 -2334 -2941 -4949 -18453 -10550 2361
257 2361 -371 -3360 -11070 -13600 -7175 -484 4641 -6144 -15088 -7900 -5794 2402 5254 -10696 -13510
272 -13510 -6041 -184 5424 -2043 -8533 -8534 -6514 4034 4246 -2459 -5235 -11888 -2638 10219 2567
287 2567 -4112 -7734 -6448 4148 6241 3549 -2625 -9790 -853 5800 5910 5364 -6598 -7815 3754
302 3754 6541 7105 345 -6976 -2092 1620 8143 7847 -3701 -5473 -1927 4040 10460 1602 -5062
317 -5062 -3375 -2123 6769 7969 -467 -4134 -6380 1220 9088 2767 -1274 -6071 -5398 5472 5195
332 5195 1651 -2344 -8520 -2184 4357 4731 2105 -8277 -7499 1753 2809 4138 -2346 -9464 -3782
347 -3782 -1099 3916 3314 -7268 -7875 -4623 793 5765 -2338 -7668 -6287 -4585 3692 3001 -4643 -6001
363 -6001 -8029 -1847 5631 250 -4469 -8653 -6087 2995 2345 -478 -4384 -9492 -2352 3056 1950
378 1950 418 -7659 -7168 1031 2919 3389 -2913 -7738 -2600 -251 4852 3739 -6252 -5294 -1392 1939
394 1939 7054 45 -5959 -3330 -578 5175 4021 -1261 -2836 -5456 2259 8453 1621 -984 -3847
409 -3847 -3440 6153 6248 1497 -2374 -4140 1315 4712 4893 2846 -5956 -3092 4555 3026 4979 605
425 605 -5965 -1381 3265 5032 3580 -2921 -4002 -2343 4526 7549 -2151 -4811 -675 -1841 4130
440 4130 4779 -3329 -4477 -2752 715 3406 1775 -1245 -7529 -3724 5144 1115 -896 -2246 -8798
455 -8798 -1998 5410 805 -3520 -6246 -4228 -685 1079 1848 -6207 -7087 -738 -3317 39 3330 -7043
471 -7043 -8673 -2230 766 1097 -2451 -6659 -8183 -2110 5457 -2298 -7614 -2596 -5723 -2452 4121
486 4121 -2776 -6092 -3938 -3688 -1906 1244 1406 -6470 -8949 645 975 -499 952 -8860 -7449 4670
502 4670 2736 -3789 -3287 -3210 -2830 -264 3839 -1727 -5321 -9 -3314 -2399 7699 163 -8608 -2269
518 -2269 1049 2528 3449 -1453 -7067 -2975 7334 2796 -4748 813 -1622 -3929 5598 2173 -2912
533 -2912 1066 -1368 -3908 2785 7442 -463 -7974 -252 3014 1221 5257 -3477 -8867 3931 5792
548 5792 -2059 -754 -356 -3146 -1307 3484 889 -3103 1520 -2958 -6825 6228 5665 -7054 -4901
563 -4901 -1152 -475 4153 1170 -7855 -6974 3618 2615 -6066 -1020 -764 -7608 -56 1169 -4571 292
579 292 -2111 -9228 -3244 5529 399 -9446 -5771 -1125 -2444 2552 -2317 -12197 -2785 3235 -4872
594 -4872 -3851 -613 -5244 -5812 -1344 -1050 -3836 -551 -4037 -11207 -69 6437 -6000 -7609 -3507
609 -3507 -4074 1172 2152 -6262 -8358 114 1821 -4978 -1799 1713 -7058 -3940 2055 -3062 475 1615
625 1615 -7809 -5250 4832 4244 -4499 -4887 -664 -1734 3560 4510 -7113 -3539 5601 -1103 -1367 4098
641 4098 -394 -3044 682 2359 871 3283 2489 -6463 -789 10295 2000 -2357 1110 -1745 2650
656 2650 7692 1503 -3259 1788 5088 498 1823 6357 -518 -1881 4548 1460 3159 6831 -1403
671 -1403 -4288 4748 7488 2076 -578 836 248 3617 7616 -846 -2809 5094 1130 -566 5462
686 5462 2650 -1433 -55 1548 1612 3334 3583 -3824 -4030 6065 3695 -1649 324 -2456 -1370 4717
702 4717 1772 -2880 -1248 989 -1150 -1297 3363 114 -4569 -355 -933 -691 4149 -1306 -6578 -1077
718 -1077 2623 751 -1974 -2376 -2943 -1861 2719 -55 -4829 -307 -1732 -4099 1798 1198 -3230 -2648
734 -2648 -2195 -1297 705 1395 -2833 -6080 273 2384 -1711 -182 -2162 -4120 1205 1603 -1452 -1161
750 -1161 -967 -1683 -911 2423 1675 -2859 -1086 43 -869 3752 1494 -3612 -982 1725 1901 1507 -49
767 -49 -951 -1095 2400 3559 -236 841 528 -1471 2782 3620 393 344 -210 738 2926 3364 1548 -1783
785 -1783 231 3542 1977 2568 1637 -1540 1506 3111 2009 2328 780 -118 1056 2423 3820 617
801 617 -516 855 179 3298 3409 -470 -435 757 1424 2811 1498 -30 -589 -204 2687 1754 249
818 249 611 -1654 522 2882 1043 782 -986 -975 1382 1655 1187 -826 -2048 375 831 1003 1356 -2015
836 -2015 -1573 476 451 1365 -56 -2071 -1107 -477 1451 684 -1722 -1087 -1321 -40 1959 -484 -1870
853 -1870 -1474 -1438 1082 724 -851 -1213 -2121 -286 973 128 -158 -1977 -1463 1145 599 140 -745 -2130
871 -2130 -43 706 765 297 -1997 -1082 402 787 1722 -450 -1958 -224 11 1515 997 -1258 -934 -372
889 -372 880 1899 -419 -834 -528 -879 1789 1189 -487 -580 -1153 627 1823 544 135 -1427 -641 1630
907 1630 914 826 -226 -1443 619 1367 1103 1136 -1231 -421 940 823 1482 -444 -1189 142 293 2185
925 2185 1206 -1203 -274 -27 691 1939 169 -520 -313 -72 1756 857 -97 -124 -837 982 1932 53
943 53 407 -789 -782 1621 1253 424 -433 -943 702 764 1303 767 -1455 76 952 421 1701 -205 -1134
962 -1134 194 689 1422 804 -580 -477 -282 1135 2092 -525 -410 -8 144 1891 1136 -485 -265 18
980 18 602 1133 752 558 -1046 172 2086 403 861 128 -1372 1228 1892 730 141 -592 109 684
998 684 1074 1111 -923 -400 1122 19 1263 1365 -1084 -512 524 892 1159 273 -399 -859 453 2124
1016 2124 -208 -702 156 -978 990 1787 -726 -213 54 -28 235 646 716 -1010 -1160 1122 45 652
1034 652 873 -2273 -1163 1203 177 -466 -654 -880 -367 357 832 -1404 -1375 691 -1081 -479 1499 -676
1052 -676 -1529 -227 -376 324 814 -547 -1836 -856 1658 0 -1315 400 -1409 -677 1520 -402 -1098
1069 -1098 446 -537 -1052 409 1003 -602 -1792 -407 -270 175 1756 -1760 -2573 1186 691 -303 -35
1086 -35 -436 -696 252 915 -394 -736 964 -792 -1287 2024 914 -1280 88 -187 225 1800 672
1103 672 -1508 -1044 1917 934 -700 712 -165 -972 1549 565 -817 1432 416 -991 316 1660
1119 1660 981 -828 -35 -151 148 2525 -38 -2056 998 1426 -51 743 606 -471 243 1249 218
1136 218 -483 1386 298 -1787 1554 1846 -540 346 -395 -853 1707 1758 -1020 -1094 870 1206 -655 656
1154 656 351 -1285 641 505 -1201 1102 1044 -1522 -549 1202 737 -783 -444 -523 -714 1869 1004 -2551
1172 -2551 -538 1198 -343 11 285 -1079 -532 472 -147 -791 908 698 -2063 -408 1837 -491
1188 -491 -259 -228 -1411 392 1790 -697 -1319 60 672 -656 8 829 -1261 -210 548 -1065 308
1205 308 1218 -1567 -1115 473 865 130 -719 -261 -699 984 1981 -1295 -701 997 -308 74 797 -350
1223 -350 -131 382 282 -260 884 1129 -1308 -664 1918 303 -27 514 -1030 76 1724 230 -954
1240 -954 117 573 147 37 1452 -240 -296 1247 -791 302 1987 -307 -902 345 1007 684 198
1257 198 26 -475 278 1894 -145 -762 838 -40 -155 1436 114 -107 401 -33 109 524 929 -468
1275 -468 -1231 1217 752 -8 493 -650 -661 1022 604 -32 -153 83 -199 -156 684 403 -690 213 -214
1294 -214 -459 1468 359 -962 -3 143 520 175 -278 -657 -444 850 359 -883 58 -118 -763 309
1312 309 183 -380 -125 -435 -550 49 410 -142 -1259 -182 478 -326 274 -464 -1243 197 209 -293 114
1331 114 -408 -353 -730 117 235 -545 -116 -71 -698 429 471 -838 -398 -302 38 238 33 -136 -559 -16 627
1352 627 -390 -237 -260 -757 167 375 -79 261 -377 -239 272 162 527 -627 -590 463 -347 265 248 -727
1372 -727 125 340 156 285 -177 -164 184 -251 488 -375 -401 164 -470 185 565 -239 36 -169 -101 447 28
1393 28 -109 -322 -767 544 529 156 179 -828 -42 473 146 319 -3 -538 417 81 335 50 -238 221
1413 221 -142 270 441 -475 -270 68 -6 440 317 -382 -43 -290 339 566 -341 122 -218 1 606 -144
1433 -144 -69 -203 -297 386 292 5 -40 -556 244 166 186 217 -358 -381 225 273 241 8 -485 44 244 277 237 -313
1457 -313 -123 -7 -51 558 -203 -463 4 -178 533 419 -471 139 -141 -154 231 -87 186 -122 -197 336 375
1478 375 -101 54 -525 9 291 -104 80 -327 -366 404 172 332 -253 -627 263 71 -59 323 -327 -222
1498 -222 303 -206 447 -180 -244 80 -147 472 49 -733 31 -178 35 405 -159 -457 -298 -212 108 -60 -207
1519 -207 -124 -623 255 299 -100 374 -227 -530 173 300 216 -186 -382 248 51 439 319 -417 265 101 -18
1540 -18 401 -11 -383 -140 310 126 324 285 148 -475 39 698 -102 86 12 -131 703 397 -148 153 -6
1561 -6 211 204 111 462 -622 17 639 -187 285 386 -647 442 723 192 201 -509 -49 154 148 515 -449 16
1583 16 413 -156 258 509 -343 35 19 -136 395 98 -59 -641 135 693 132 -191 227 -496 398 704 -593
1604 -593 -18 179 165 157 149 289 -288 -207 154 -306 416 431 -782 -367 609 201 126 -77 -313 -52 343 -12
1626 -12 -417 -170 457 -487 -149 780 -75 -109 178 -245 100 598 44 -866 -17 648 -181 -419 192 -622 -134
1647 -134 574 -381 -525 301 -290 -374 -143 220 -174 -178 185 -637 -150 654 -503 -715 393 -110 -316 212
1667 212 -259 -436 299 270 -368 -300 649 -124 -548 471 -107 -409 340 -530 -344 463 100 -747 -500 174
1687 174 -153 -510 110 -578 -761 737 -360 -764 289 12 -435 -331 -102 -144 -262 36 -242 -175 824 -253
1707 -253 -1067 -9 -21 -328 309 -324 -195 17 41 -248 -298 527 -65 -680 420 97 -306 265 -558 -816
1727 -816 494 504 -571 -326 363 -31 -215 115 -35 -551 283 103 -694 463 66 -342 -46 196 145 -237
1747 -237 112 -294 -374 566 178 -829 5 181 -105 138 146 -445 14 322 -187 -23 466 275 -724 302
1767 302 423 -132 -51 278 -669 171 591 -300 -342 -124 156 -220 130 49 -300 207 164 -275 202 535 -456
1788 -456 -58 -46 -1 72 -35 -393 -316 204 683 -483 -418 248 -481 126 26 -386 -216 -206 1 -386 192 152
1810 152 -480 -495 10 -230 -84 87 -648 -301 254 -321 -369 -23 -155 -158 -193 254 -484 -71 219 -496 -259 447
1832 447 -310 -536 134 8 -200 -28 -91 -182 -247 157 -93 -285 118 -503 -141 378 -142 -305 -42 -180 -54
1853 -54 58 393 -59 -297 -5 -32 -111 286 -214 -184 323 -54 -55 43 298 -232 39 406 -134 -34 487 -142
1875 -142 -4 540 -94 -76 128 -33 304 83 110 -187 -37 521 72 -60 345 131 -42 382 180 29 12
1896 12 -126 64 282 198 79 -138 141 194 -26 151 -51 -260 232 91 182 1 -306 34 -81 350 452
1917 452 -205 137 64 -259 97 205 -155 64 -63 -126 251 -74 191 160 -228 152 81 93 -120 -139 112 174
1939 174 -26 -28 -152 -116 -27 -147 99 -278 -221 72 -112 24 60 -467 -395 -160 -22 296 -434 -190 -83 -439
1961 -439 64 -70 -87 183 -375 -113 365 -318 120 -178 -47 102 -234 -187 -189 -132 -26 -372 184 -155 -210 -13
1983 -13 195 -175 48 -160 -146 45 -239 128 48 -24 -77 -123 100 388 15 -297 141 -50 238 -296 -322 133
2005 133 -241 65 -22 -322 37 -201 23 111 -40 -23 35 -290 65 -4 -114 17 -62 -146 251 135 158 -23 -458
2028 -458 153 -38 -18 130 -231 -108 389 63 444 -176 -36 358 -205 156 -190 -180 123 -223 -51 194 -260
2049 -260 277 71 51 142 -206 -90 -303 -168 -39 -176 -75 119 -195 -44 -96 93 85 -148 26 -185 24 -17
2071 -17 -254 -323 57 189 -244 365 -48 -34 -21 40 91 177 -155 -161 -99 196 -51 -267 155 -285 91 400 -119
2094 -119 -185 93 26 -107 55 75 -4 -144 369 102 -219 309 -134 -25 227 167 -101 207 -149 144 102 297
2116 297 106 -388 151 -61 -79 128 156 -80 129 -62 -145 78 187 195 175 156 481 -163 303 45 -67 299
2138 299 183 -33 379 344 279 544 42 115 -23 479 113 -205 427 473 -402 -22 -60 284 159 170 9 111
2160 111 280 25 -325 295 459 333 365 34 21 298 -72 -282 177 191 51 -327 181 362 -28 459 62
2181 62 -162 329 570 -124 54 233 -154 31 -119 38 -4 -27 -68 -434 350 390 -35 -136 47 -246 181 -66
2203 -66 -103 -16 70 165 -61 -75 110 -136 141 -20 144 277 40 -277 -101 255 -160 -64 -256 132 -70 -71 -202
2226 -202 -12 186 284 -132 0 206 -226 36 111 295 195 107 102 -213 125 94 -61 -145 244 123 46 264 39
2249 39 8 124 181 117 134 113 31 -188 271 -38 -39 388 -127 91 337 84 -32 112 151 86 -233 117 -83 -57
2273 -57 431 33 -248 471 -120 -36 15 316 129 106 73 -113 -10 396 -102 -126 335 -114 -30 413 -10 -228
2295 -228 330 -36 -180 -78 280 157 -66 245 44 -21 117 -101 -153 95 65 38 -402 92 76 18 112 -148
2317 -148 -437 151 57 -453 210 113 -61 36 61 -288 25 137 -1 9 159 258 -17 98 -30 -138 308 -101
2339 -101 -170 41 78 -357 -76 161 -14 -329 -215 -47 -191 7 257 -305 112 132 -32 -21 128 -12 184
2360 184 123 -42 -347 -51 -85 -327 -23 223 -221 260 -32 -36 174 188 -192 -168 34 254 -199 -77 143 93
2382 93 234 9 -25 -22 75 95 152 76 10 -97 10 111 -225 -177 219 -455 221 528 -81 -114 -239 -178 -24 -314
2406 -314 97 157 -124 191 -71 -5 622 -279 6 205 -143 520 -90 66 80 60 -11 -109 -180 150 -60 -116 131
2429 131 -46 19 181 -92 324 128 -1 196 -196 9 -100 -216 234 -138 -78 -50 -146 -182 412 -72 -133 -76
2451 -76 -109 -256 -102 60 -177 -288 133 54 -33 116 -4 -142 200 -42 -72 92 -99 -170 -73 -108 3 -20 388
2474 388 187 61 6 -167 -230 72 211 235 -205 -357 59 129 214 192 96 211 -116 85 263 -303 62 62 201
2497 201 -36 116 173 181 -51 71 -167 -96 393 -103 170 -84 -284 -15 -171 62 153 154 -30 119 -72 -138 49
2520 49 83 537 -169 13 -107 -41 145 -53 78 4 -148 149 -177 -92 324 -138 -120 286 -155 -2 51 -403
2542 -403 204 -189 -3 121 -216 -46 262 -238 31 -15 119 85 163 20 -6 -443 108 -9 109 112 -86 -46
2564 -46 132 -381 96 44 74 40 -9 180 -9 -80 274 -221 -153 -20 -367 17 98 -39 -233 -219 -141 21 -364
2587 -364 55 -205 -153 -161 -164 7 120 198 -158 207 -174 16 250 21 16 -112 28 28 -75 202 108 -77 -126 103
2611 103 359 100 -244 -190 -67 -113 -90 -37 -81 -290 -311 190 -136 -371 195 -240 -301 176 -63 -101 -31 -73 9 -178
2635 -178 -142 16 84 118 79 122 131 -69 150 -311 16 217 -52 42 134 -115 78 -129 -128 183 46 26 -129 -61
2659 -61 -292 23 -78 -126 150 79 -143 -112 8 21 369 115 -58 -59 -77 -177 -194 -128 -23 -53 -248 70 -108 -45
2683 -45 126 -191 213 322 0 132 159 165 129 236 -54 -27 -52 31 -382 -21 87 197 -23 364 -168 -343 325
2706 325 -102 379 161 -288 -111 -100 169 101 117 235 112 -203 1 129 -115 0 126 133 -17 -232 -4 -285
2728 -285 -122 -202 -179 -7 -264 -203 -344 158 16 107 41 -39 -80 -94 -262 -158 476 -52 -89 6 64 -103 45 88
2752 88 -98 256 126 -137 -179 -17 15 39 260 104 -40 337 58 -101 103 -350 24 52 86 301 66 187
2774 187 -193 -147 -72 125 -287 3 -17 -175 43 23 139 115 83 132 -206 -168 216 -79 -237 3 -383 27 173
2797 173 153 137 166 72 -108 -65 -99 -6 -30 118 249 165 80 2 120 269 0 -111 -152 -198 70 167 -9 -200 125
2822 125 89 -310 181 -29 -75 281 154 75 -33 60 -1 -203 33 255 -15 285 35 96 -131 284 -293 39
2844 39 32 -74 94 -86 -88 -144 85 180 -94 -118 142 -276 -51 346 12 -60 155 -51 -56 208 -42 -176 -180 243
2868 243 16 -170 341 -268 181 92 89 85 233 -358 -97 -219 -117 178 115 -45 -249 -1 115 -52 -154 136
2890 136 253 18 241 59 8 -58 137 -240 -244 197 -197 -31 169 56 22 -75 17 -53 -83 31 38 -77 -44 -60
2914 -60 -87 -55 61 -4 187 -92 -18 67 -4 139 15 238 -212 -109 5 -126 -179 -124 -199 -238 56 239 -172 58
2938 58 -94 86 251 118 -246 -133 -117 -76 -18 -13 191 86 -131 -21 114 8 -84 -144 -268 128 -341 202 93
2961 93 18 53 -68 -58 137 -9 -215 -177 62 -180 -60 356 143 73 -93 -135 12 202 -37 191 52 -80
2983 -80 58 -137 306 -51 -60 42 -90 -131 -313 -23 47 157 5 -210 49 94 -49 174 271 -96 17 -62 83
3006 83 -32 55 -16 17 156 76 -92 13 92 36 116 -281 -15 -268 222 261 218 35 -204 -34 -49 56 128 202
3030 202 78 -31 209 85 -164 -92 -19 136 -285 -3 14 49 24 12 -20 300 -69 100 22 -194 188 101 -289
3053 -289 -177 -11 64 74 41 36 69 -23 -69 -128 -332 -31 -152 -66 -70 -88 -374 -34 422 55 -36 -176 226 -73 5
3078 5 210 11 86 156 188 -190 -87 -5 317 -31 -16 -95 -12 -79 -55 53 176 -107 -104 158 -11 -32 78 -101 34
3103 34 244 -9 -51 121 -128 -73 70 41 105 181 -21 12 119 89 265 -76 -88 221 42 -76 261 119 -103
3126 -103 -193 202 -138 -164 38 2 -177 -29 136 3 -54 121 183 -139 -75 -107 196 147 -105 193 157 16 87
3149 87 10 3 256 -81 1 -57 -16 -72 -90 113 48 215 -209 -149 -14 12 -118 -140 213 -179 -79 -108 -110 -322 83
3174 83 -190 -180 -58 -99 -45 -40 -21 60 -91 -117 -64 -210 156 -223 -92 -153 130 -410 109 31 22 -86 -110 119 65
3199 65 -173 123 123 216 93 73 -319 273 -44 -3 228 -51 -224 85 -57 -200 119 192 167 78 -146 97 428
3222 428 96 78 -157 -34 -42 -31 129 82 71 73 230 116 -182 30 90 172 -75 -212 -112 22 -232 27 114 8
3246 8 3 73 103 -164 -55 8 -184 -44 -171 -131 279 -117 57 76 -110 -87 46 -53 -125 -189 -89 -199 -122 -3 -146
3271 -146 -33 -81 213 -48 -424 197 83 34 -278 86 -74 65 4 -250 -154 -194 -157 86 174 9 -93 -2 -63
3294 -63 -240 -284 31 -88 -327 14 -213 -24 113 -101 8 25 163 -49 -150 -94 265 -46 130 -152 -3
3315 -3 157 -204 72 310 -37 -61 126 -15 -28 -66 166 60 33 177 -115 -38 121 -9 -92 110 -62 55 72
3338 72 158 16 -34 -25 3 25 -38 59 -99 273 203 -134 366 311 -74 -345 -53 -65 -15 38 38 -7 -130 120 -115 193
3364 193 -205 -285 87 261 16 -38 -11 104 -180 298 185 -255 236 -9 -75 66 34 29 -64 -277 -105 -24 -108
3387 -108 -64 -155 154 206 -27 144 -48 -201 -57 95 -217 103 102 -15 -26 -141 38 -112 85 169 184 155 32
3410 32 -102 7 41 -8 49 -235 -18 -264 146 -49 -155 52 53 -10 135 -59 -299 -105 57 6 -142 142 273
3433 273 -273 263 -39 97 83 -308 62 251 -29 -116 253 -14 216 144 57 113 90 225 64 -44 199 -61
3455 -61 -127 -81 -40 281 -28 -77 114 -110 105 99 167 -83 -61 69 244 -20 -251 71 82 -51 44 132 -38 -39 124
3480 124 100 -55 -240 269 -49 -54 37 -62 34 -188 136 130 76 209 -65 -174 100 109 193 -36 -79 -30 -187 278 -183
3505 -183 72 -259 -82 -331 -51 197 -205 238 -72 13 362 103 25 164 -180 100 -245 19 22 -266 206
3526 206 24 -19 277 321 24 -124 175 233 45 120 -29 58 330 -109 -54 -38 102 -210 157 -40 42 3 231
3549 231 -164 -129 306 -316 243 -166 -115 70 -146 -80 150 50 -209 122 -71 174 -270 79 -53 58 -182
3570 -182 171 101 20 -106 -87 225 32 101 220 -47 70 -127 100 -41 38 -200 158 -17 -56 22 157 139 303
3593 303 19 56 -54 158 -80 -73 218 257 -217 -162 251 -21 23 109 37 -103 -133 -46 10 -181 -62 -99 -62 -1 -197
3618 -197 129 -80 17 -121 -64 134 119 -135 -199 72 -229 117 -228 -61 -38 -89 141 -239 111 68 -188 -194 221
3641 221 54 -281 124 204 -84 -183 93 209 -238 -144 -310 -66 -61 -66 63 53 -74 -119 14 28 -205 -72 -127 16
3665 16 231 -60 30 117 -192 -174 98 -76 -50 -302 -13 102 211 -26 -202 142 242 -1 -196 101 148 119
3687 119 -102 -125 -11 278 39 175 -159 -207 -60 246 213 -158 -68 -282 -94 -65 -73 53 7 104 -112 228 -236
3710 -236 -110 286 -97 29 156 141 -50 -279 76 100 -116 192 125 119 -135 196 31 -142 11 40 81 -72
3732 -72 -12 55 14 272 -103 -157 -34 -93 58 -109 192 15 -216 107 -77 150 81 157 -74 -156 -145 309 -71
3755 -71 182 -217 -29 207 173 -167 -97 30 -51 -35 94 13 168 -60 174 -58 -94 88 -139 12 33 -132 -122
3778 -122 -199 58 153 124 157 173 153 323 -111 15 -84 -227 -2 -49 418 164 -63 -106 -293 -114 113 23 -84
3801 -84 165 304 -219 -42 129 -63 135 55 -1 41 -193 110 -238 191 208 -5 -51 14 121 -121 88 -169
3823 -169 12 -80 7 213 190 -124 -221 -156 -27 -76 50 -166 85 269 -248 -206 -31 -9 113 53 64 26 -252 98
3847 98 217 17 79 33 -33 -94 274 -228 -199 163 66 178 -2 106 -94 -80 34 5 151 42 -53 -143 -70 30
3871 30 30 -183 -141 -49 -79 -84 -54 -16 67 487 131 76 -183 -284 313 -193 56 44 82 53 -50 -36 247 13 65 -136
3897 -136 -1 -186 178 -74 -77 -151 20 -105 26 -70 200 -47 106 -32 95 -181 -147 -67 343 -219 -14 113
3919 113 70 109 -21 -34 -81 -76 -177 87 -255 -153 -110 -84 -260 -39 -36 30 63 -179 215 54 108 -43 6 20 -210
3944 -210 137 -71 -4 136 207 -51 -24 134 -106 31 -250 162 -71 162 74 133 -173 -152 34 157 231 -159
3966 -159 97 -85 -143 -164 59 -126 12 30 -79 -28 -63 -107 -76 164 -45 215 50 78 -153 12 112 -115 47
3989 47 -322 57 -328 19 42 -39 3 183 222 -133 -75 20 -156 65 -159 140 -189 160 33 51 120 -203 -30
4012 -30 74 214 -6 40 149 -130 -23 59 -87 153 -45 -159 -31 118 -19 -348 -33 27 39 264 -9 -68
4034 -68 -48 160 -25 -233 -136 402 -193 203 253 205 -70 -108 -135 36 51 -32 131 -154 81 121 -217 17 -115
4057 -115 -126 26 14 -6 247 -6 -186 -33 -213 -94 -89 48 -92 -34 -126 -126 169 -297 -114 -33 -97 5 187 19
4081 19 -61 -340 11 -42 76 279 -52 -110 -122 -108 301 106 29 -324 16 -23 118 -121 161 -81 -160 -28 -14
4104 -14 -38 -195 34 33 149 -191 263 -45 164 -72 -245 -37 89 244 223 -151 76 -250 -40 211 83 50
4126 50 -85 -167 108 -25 -59 -145 209 -37 225 204 -243 138 -71 -75 51 300 -107 -15 -65 31 -45 159 -279 4
4150 4 -22 -256 93 -34 -43 -76 52 -28 -23 221 200 -88 279 -95 -117 -91 129 65 -117 129 11 176 51 335
4174 335 386 -21 82 -6 -11 153 40 109 125 -129 -119 -179 126 53 -15 284 34 178 -137 4 64 -15 -128 -168
4198 -168 218 -144 -142 -168 69 18 -3 -26 158 -144 -81 -179 -154 -57 60 100 117 -32 -17 -270 11 131 245 9
4222 9 43 76 184 71 21 -238 -84 -119 168 0 -300 159 149 -149 331 173 93 88 -17 15 3 -56 61 -161
4246 -161 -206 339 -179 -101 62 -110 63 144 -105 -18 225 31 33 -164 94 92 179 15 -45 169 -146 -109 -53 -172
4270 -172 -68 174 109 -28 61 -5 228 242 -25 -153 -249 -55 -108 85 306 -38 143 311 200 -99 -222 -82
4292 -82 -10 276 128 -21 5 -298 278 -323 -20 75 -48 -207 1 34 -59 -120 127 -10 -131 -70 -288 54 36
4315 36 19 -24 -45 -98 -64 -49 93 -138 14 -46 384 79 -117 -13 162 3 -16 -353 -215 -29 -105 37 92 181
4339 181 -156 -92 -107 -288 41 -54 24 248 10 82 -118 -44 -232 100 95 -189 34 100 -18 -90 -75 143 -117 245
4363 245 -133 -90 18 -154 49 159 -227 56 -175 17 29 114 33 189 -30 -84 15 226 -2 180 125 -316
4385 -316 250 -152 -398 -238 175 37 183 -38 149 153 -167 47 53 -177 97 67 158 161 71 -86 -48 -31 64 9
4409 9 105 -16 70 -151 -245 119 -265 127 81 42 -16 -208 157 105 145 -252 231 -34 -107 173 -104 -91 345 -41
4433 -41 61 332 70 -56 65 -192 16 36 103 85 -52 156 41 -48 227 245 36 24 -86 60 -296 110
4455 110 -38 97 -28 302 -44 -41 14 204 22 -4 -20 127 199 -71 -123 27 72 106 83 141 -107 171 174 10
4479 10 -19 117 6 -162 -285 103 -58 88 114 335 -55 3 158 -313 -10 -148 -47 172 -231 182 -64
4500 -64 153 101 159 230 -92 -47 296 -167 139 59 -70 -168 -246 215 -63 -84 -24 256 65 21 -229 -44 -140 137
4524 137 112 -175 -114 77 78 18 -106 -90 40 6 250 160 120 249 -75 -163 169 -47 136 -9 -231 309 -41
4547 -41 -37 124 -84 105 133 65 160 15 16 -22 -67 242 -119 -198 -264 69 -171 -154 -130 -10 229 55 157 35 -8
4572 -8 -145 47 -102 -248 -118 -132 -78 25 68 59 -74 -394 188 -54 -85 110 -13 139 -28 187 -94 -63 301
4595 301 189 15 206 -63 -43 230 -11 86 -18 101 261 227 -20 -76 234 71 -6 -118 135 77 -171 -26
4617 -26 28 61 17 -33 410 -8 165 66 -184 85 63 60 -97 106 -164 -11 14 -27 47 -75 184 -43 38 -76
4641 -76 201 78 -199 192 0 -35 -14 -184 118 -26 -327 109 137 -160 -2 -54 -123 163 20 28 138 -257 146
4664 146 -32 156 -218 63 97 -82 -163 8 -159 3 146 -153 66 121 184 -66 -30 -1 170 102 -345 52
4686 52 -185 -88 47 89 160 -209 131 -237 68 -78 37 -19 146 34 118 65 84 -16 -114 -153 108 -111 -177 115
4710 115 -247 -42 -2 181 -6 0 98 229 156 167 -68 -36 -32 -78 -62 117 -52 96 130 110 -9 94 99 -62 -70 -81
4736 -81 168 5 139 202 -51 -146 67 -69 -56 -252 -69 -276 54 5 41 -27 75 96 303 -5 248 -23 -219
4759 -219 48 -177 84 105 70 39 -215 58 34 -31 42 7 -225 -35 37 179 156 -158 -74 50 160 59 -179
4782 -179 202 -276 -130 -213 237 38 80 66 8 325 43 -297 74 126 15 -172 51 158 123 -343 -198 -121
4804 -121 113 19 73 -38 -88 -73 54 -208 42 -203 -70 219 315 -24 80 -164 19 53 39 -182 72 -126
4826 -126 -165 -268 129 44 0 23 -19 298 183 21 -99 -151 97 -79 -27 218 50 -43 15 -16 87 -149 -31
4849 -31 -4 37 53 -128 -87 -31 -149 -137 -8 9 -66 -54 210 202 -117 237 33 88 -163 -79 16 53 145 -64 7 202
4875 202 110 36 131 8 62 243 -46 81 22 71 -79 64 -21 -2 50 -323 169 -114 -107 153 -225 73 179 242
4899 242 -231 -82 -85 115 176 92 286 -291 156 64 -42 109 144 38 203 72 100 74 116 -85 27 58 -87
4922 -87 -106 -7 -227 86 23 77 97 157 -22 -71 85 -102 6 -43 61 -123 143 67 220 -91 47 -216 -159 -12
4946 -12 -85 35 -93 108 -75 -49 -5 -95 -49 92 -146 -119 134 345 -294 -4 119 -298 254 -221 32 58 -51
4969 -51 31 40 -247 15 -185 39 72 -59 72 47 0 -156 -60 -68 -21 14 31 107 -226 298 137 47 112 -81 -57 73
4995 73 56 114 3 -22 100 26 143 215 25 22 29 202 70 -101 -9 146 49 -295 12 -5 -5 -9 3 32 -35 22 93
5022 93 -58 167 -274 -19 136 49 254 -43 -6 -22 -144 -107 -364 -9 218 -6 21 78 -171 97 -55 0 137
5045 137 1 103 138 22 170 -44 125 71 -189 136 -100 -18 145 -259 -114 -58 123 246 59 -15 170 -15
5067 -15 -58 168 -261 -152 102 -78 55 43 -84 -162 -136 -83 -8 48 -131 -309 -168 61 212 -137 -61 154 -87
5090 -87 -114 -115 -85 -237 -167 -14 -133 200 82 -79 18 166 -42 -175 -131 -450 -10 -63 -24 -2 90 152 -24 217
5114 217 -104 210 -125 -230 -137 -26 -24 -87 -34 110 103 23 34 -457 24 263 106 43 168 37 46 -230 60 -83
5138 -83 9 27 -177 -101 -136 -93 -37 266 -181 -69 -216 -101 -204 59 10 -164 -174 -59 -189 66 -22 58 34 51
5162 51 23 93 -197 -44 48 -73 79 -111 323 25 0 -187 -70 123 104 -65 -209 91 -108 -229 54 -123
5184 -123 -228 135 -283 66 14 124 63 -26 25 43 -204 91 -11 -135 32 8 179 189 -98 103 -135 162
5206 162 80 -41 238 231 -100 8 69 -188 88 -1 -28 15 -152 245 -57 -172 26 -18 61 -131 -124 -239 -69 84
5230 84 -13 -56 -34 90 85 -68 259 103 46 -170 30 -169 -54 -14 143 -14 -136 -43 98 202 102 45 -99
5253 -99 -168 -39 163 160 167 49 -80 122 52 16 -88 46 -38 171 98 174 -159 -41 -148 -121 220 -206 -143 -59 -369
5278 -369 -35 -221 -104 -189 74 109 -48 -101 -50 167 15 -45 -167 8 -95 -61 298 122 -65 153 -126 80
5300 80 31 -52 148 -57 -83 102 26 -2 48 -16 -132 167 -1 58 -256 171 45 -251 -34 61 35 -93 0 -177
5324 -177 216 -127 -206 46 -102 302 -165 -11 -277 6 11 -34 136 301 -114 -87 -50 -209 -358 -31 24 93 -170
5347 -170 -55 81 -17 117 16 63 -7 77 110 46 108 -256 -8 295 159 -53 -134 74 -93 55 -201 0 206
5370 206 -182 -123 113 -121 215 -226 169 15 6 -7 -6 41 -121 33 17 188 74 159 119 -198 70 94 225 -30
5394 -30 -175 -148 6 138 140 -115 -18 257 -185 204 15 7 126 66 -188 99 -119 105 40 46 364 -309 -97 -16
5418 -16 56 83 213 -453 -59 -13 -100 206 -135 23 250 -65 157 -145 -309 -61 -108 19 93 22 293 71 117
5441 117 15 164 16 -128 257 180 143 15 73 111 167 -77 181 -197 -85 250 -245 -139 -87 -154 27 -141
5463 -141 -132 -59 -146 107 -282 111 45 -116 14 -396 133 -11 49 118 -34 140 70 -251 23 -104 96 -240 13
5486 13 -246 -36 164 -35 112 23 147 -195 19 -177 -82 7 -17 34 182 310 325 42 35 -38 -58 -23 91 152
5510 152 -197 -209 34 111 -144 134 149 -145 100 -274 -34 68 -34 45 22 3 92 121 171 136 37 -105 -187 268
5534 268 108 -47 -59 -197 186 134 -43 108 37 286 78 204 -443 169 -105 -264 45 170 -18 -126 276
5555 276 -8 90 -173 -159 0 49 282 -287 -48 155 91 47 49 -162 146 97 25 41 3 42 -37 195 -67 -241
5579 -241 -62 266 -85 -25 315 77 11 -157 24 -186 -126 -29 85 19 94 -133 34 -329 -110 150 -121 -96
5601 -96 -27 -125 136 -7 -43 200 30 -92 -89 150 181 231 127 -190 10 102 150 117 -98 151 -15 -116 -6 83
5625 83 67 -49 177 -78 125 -97 -261 -35 169 -21 180 -29 -114 174 147 -41 -100 -171 83 60 -104 100
5647 100 118 301 -107 25 159 266 -114 131 24 184 16 -65 40 -114 -125 -59 -101 -84 -34 36 119 19 -19
5670 -19 -11 36 -35 335 -103 -74 153 39 22 -101 -62 -345 36 13 -367 80 29 -82 -64 90 -2 140 193 59
5694 59 138 125 61 -211 166 6 162 163 209 113 50 -7 126 49 134 200 -73 55 192 135 -139 97 306 119 80
5719 80 63 34 74 -65 180 243 -489 171 -18 -119 -153 138 357 -50 5 63 85 133 142 155 76 -50 104 -105 37
5744 37 93 112 108 -164 -111 -6 198 119 -52 238 -86 16 -192 -134 -42 134 204 -20 106 -72 -192 -83 61
5767 61 -194 -76 46 38 35 14 195 116 -178 -50 48 65 -58 -22 118 140 -74 60 38 22 88 45 -320 247 118
5792 118 81 90 -63 99 92 77 133 -19 20 216 -194 -3 2 -64 284 -128 265 78 -252 19 -105 -232 200 100
5816 100 -134 35 -25 88 19 74 32 105 -40 166 90 -127 47 -374 -25 249 89 -58 -120 -16 198 -144
5838 -144 -10 -157 -1 -116 -154 1 -35 -60 -41 -89 -157 250 44 206 -68 50 196 60 161 -30 182 71
5860 71 -17 29 149 56 -87 147 -246 55 -127 -118 12 -1 54 137 -32 -3 -54 -30 309 -161 -184 258 -185 -164 -28
5885 -28 -109 116 -87 56 55 -6 59 -70 103 63 -96 -45 104 30 -174 344 -157 33 84 -223 179 -55 145
5908 145 -173 -50 215 30 -30 69 -109 -124 -11 -36 34 -172 -131 98 -154 120 38 55 -63 -211 -76 -140 10
5931 10 70 -290 94 -26 54 223 131 -150 1 132 29 253 30 -51 384 -147 -229 -124 68 288 -39 -21
5953 -21 3 1 -179 -113 -17 29 -139 104 108 32 -123 -26 -261 33 0 24 -235 -134 277 28 -28 159 -99 114 -13
5978 -13 62 79 -94 8 -167 199 -124 84 -242 -53 273 42 12 -88 -175 -58 -110 15 87 -27 44 255 22
6001 22 33 64 107 -126 -85 183 -256 149 -22 -259 -33 -132 -124 140 98 67 -65 -102 -245 -79 80 -14 85 -89
6025 -89 -147 101 -65 255 112 -151 79 -59 51 215 155 132 129 -196 -180 143 42 -216 -61 -57 -146 111 178 291
6049 291 98 -73 -214 89 -10 52 273 132 285 -52 -280 -69 201 194 214 -91 135 -54 -70 -90 179 183 199
6072 199 -129 -129 -93 350 -73 218 147 27 167 -140 169 75 -32 -108 -73 -106 222 -2 44 -128 -166 -173 -64 35
6096 35 20 136 -86 -222 135 -182 204 -161 7 21 -150 -140 132 53 110 -20 -119 8 151 28 -155 55
6118 55 122 202 187 148 39 133 47 136 -91 50 -59 -181 171 25 111 183 108 -97 70 -15 121 -48 -103 142
6142 142 1 16 58 4 -57 27 183 188 223 -246 18 -209 193 -14 42 -24 -101 29 218 16 -226 -47 -200 -34
6166 -34 157 -170 6 90 -29 158 -96 -140 39 63 139 75 -184 -54 -171 -195 -33 -48 20 -76 183 -129 -112 93
6190 93 40 33 112 -58 -118 85 165 -78 -248 -75 242 138 71 168 -224 -105 -136 167 41 -392 -239 38 237
6213 237 1 -122 -219 -245 -184 107 -123 -62 20 153 -55 169 122 -70 -168 -31 129 62 118 289 77 -67 98
6236 98 -198 72 8 -135 -139 168 131 158 -214 -6 107 -31 -199 145 -130 209 302 12 -143 -103 246 -59 -103
6259 -103 -3 -9 -199 248 -180 88 138 -79 6 19 -11 -6 40 38 12 -172 -153 -226 -89 175 112 -71 -281 203 215
6284 215 -380 -52 70 173 -44 -70 129 58 77 71 -181 -21 79 -44 42 28 -152 225 58 282 207 -40 13
6307 13 -153 -309 -116 43 -153 143 -83 171 76 -32 -6 239 195 21 -164 -29 253 -121 135 65 75 -26
6329 -26 51 8 183 201 -146 -132 153 -17 29 -15 31 -121 -14 -138 157 -44 193 -189 -112 99 74 -378 -121
6352 -121 82 -43 -5 -47 -56 150 -63 -12 59 -57 319 -7 -161 -10 -154 47 -174 102 -134 -300 152 65
6374 65 -36 92 29 -14 -334 44 -166 -154 10 211 3 -81 125 186 101 47 -37 -553 -124 43 -62 142 192
6397 192 71 66 238 412 -49 47 -242 232 69 2 -20 127 120 -205 55 -131 -265 -172 -57 57 195 200 9
6420 9 -243 61 -37 110 52 40 -159 188 -15 220 29 -83 -27 -237 44 110 -118 0 232 78 175 -79 226
6443 226 273 271 -22 102 -85 97 144 -202 -29 281 202 -128 -131 -260 -102 -12 66 237 -164 -40 214 80 -84
6466 -84 -57 -137 -134 -139 -79 85 -61 -190 -210 11 40 -140 -86 -11 -15 -351 77 -51 -233 157 59 -304 31 37 -88 -165
6492 -165 -216 -268 8 29 -53 -235 -232 -112 8 -53 -64 147 -213 -143 -56 -37 -98 -144 -114 -107 105 -97 -256 -46 -29 80
6518 80 -31 86 46 243 92 72 160 39 -63 124 223 -42 136 226 229 80 -320 -225 238 -190 74 80 60 17
6542 17 33 -63 -27 -50 -12 53 -27 100 14 -173 -31 -120 39 193 -112 120 136 7 116 -150 -110 77 73 121 -153
6567 -153 227 76 82 114 149 -13 223 -209 142 -207 -115 203 163 -122 -112 4 -124 -148 67 -42 250 -239 80
6590 80 -52 -141 -70 -121 -209 -255 35 -94 57 -31 -213 86 82 27 23 -305 114 -150 108 -83 18 148 -142 -82
6614 -82 -294 -4 -56 -44 -36 158 -153 93 -158 -25 322 48 20 -32 -112 -46 -190 -42 159 64 -103 59 50 -89
6638 -89 112 -224 -36 189 237 -191 -244 -76 -69 122 209 -43 136 -53 -63 30 -84 15 -83 -28 22 -226 179 43
6662 43 -141 -97 172 -264 8 152 5 -20 -143 48 8 -20 150 125 20 44 236 -61 18 7 166 319 -167
6685 -167 -22 -36 15 53 24 75 223 189 50 32 -53 -159 -36 108 25 74 103 307 54 -50 -270 -81 -215 39
6709 39 120 92 -154 -150 -2 79 237 168 -135 -114 -16 265 273 45 25 -162 27 166 -109 110 169 150 175 -221 219
6734 219 -101 139 -28 16 -128 -63 -86 -224 -178 -226 -200 -74 58 19 -139 -68 70 -83 -13 -42 150 256 -114
6757 -114 -100 -220 -130 218 -375 -219 162 -74 69 -216 -63 82 32 -87 8 -19 37 0 -129 -143 168 23 241
6780 241 -100 -206 -393 -219 -13 111 114 9 -30 -273 -24 -62 120 2 168 4 -37 -28 191 112 -4 -134 209
6803 209 -16 -6 87 151 27 224 198 -7 51 125 28 93 -35 133 50 247 -176 -122 -17 -87 -60 169 -2 -43
6827 -43 253 -213 76 104 -76 18 80 17 -18 73 132 -134 -185 -342 111 42 46 -262 136 -217 -124 129 9 279
6851 279 61 283 -1 251 -126 -65 -90 -45 128 -32 -134 160 60 185 206 -114 30 -134 131 250 -300
6872 -300 272 -129 416 -129 35 -172 -394 219 -87 -18 -16 119 -270 -37 -178 -104 56 -83 88 58 -89 343
6894 343 -85 71 -38 67 19 178 154 -41 -122 -120 195 151 -110 32 123 -21 64 207 91 -82 -106 35 -125
6917 -125 73 -107 26 42 -117 90 42 -3 -1 -99 -34 -10 122 -109 -95 6 36 106 8 -114 -44 317 193 -174
6941 -174 306 62 49 72 224 203 49 175 49 69 75 135 98 105 -196 87 -165 165 141 -2 162 -223 10 -11
6965 -11 -78 -11 -134 -82 32 102 78 386 -2 -10 28 82 6 -150 -145 -181 355 -3 -65 -40 -72 289 128 -251 108 2
6991 2 -171 -104 216 86 -73 -22 258 15 14 228 224 -72 94 25 315 -26 -31 171 38 -283 29 86 -181 -270
7015 -270 102 45 122 -47 -17 33 145 -52 -85 88 24 109 -122 9 250 -198 127 -203 172 -119 -38 -214 -57
7038 -57 -14 -147 224 -142 214 121 -14 37 -107 -81 258 295 -63 -41 -178 4 46 -226 -187 335 -292 46 181
7061 181 254 345 60 227 -68 -9 105 -79 -71 -229 29 -151 -192 220 -53 220 -8 6 -21 141 36 1 34
7084 34 -418 -385 -294 -193 -30 74 20 -91 -43 -121 187 116 -97 -112 179 20 -20 -58 -34 76 68 -237 29 128 109
7109 109 22 59 139 -117 70 182 -199 69 121 25 -156 282 202 90 -109 -408 31 -262 44 329 -134 255
7131 255 -191 -8 116 47 -31 39 -37 135 55 284 187 -175 127 97 -77 -83 -83 -44 -48 -46 -94 -26 152 -149 16 177
7157 177 49 -174 129 38 129 -213 -229 -175 108 -48 -190 -113 -208 -109 -156 81 -59 -30 -18 -50 6 -22 -232 -40
7181 -40 246 -68 -113 141 -56 68 306 -27 42 -183 -6 -92 -2 -128 -276 -46 -131 -86 169 101 -69 25 -226
7204 -226 140 145 49 113 31 96 11 -111 -315 -336 147 -199 82 -192 91 218 67 150 284 92 165 65 86 131
7228 131 -63 -20 -27 150 -48 -128 386 -119 -192 -49 127 7 170 -89 -26 -262 75 -187 -178 96 36 -23 -44 -132
7252 -132 -11 45 -176 0 -62 127 -19 -210 86 -157 -172 56 9 -251 -128 -307 211 -140 34 176 -155
7273 -155 135 -213 -35 80 157 -69 -61 -85 -5 -179 -153 -133 -190 -46 281 -75 -97 -254 62 54 -1 39 -116 -61 127
7298 127 197 -193 -140 -213 -7 -163 -54 -42 -21 -249 -100 -90 -107 -180 53 52 149 -161 -319 -10 170 -243 -145 99
7322 99 -41 -56 -347 -146 81 -255 -28 5 -2 139 -107 -171 -92 -137 -45 -41 22 -84 -157 -153 -207 -84 16 -85 -82 8
7348 8 147 -79 28 -84 -183 195 333 205 -170 23 -321 -81 -57 116 -30 329 -12 -10 152 33 -83 -201
7370 -201 -18 -286 8 -92 36 103 -30 -179 154 -48 -100 -30 -11 -84 13 -174 -157 50 -120 61 84 280 -106
7393 -106 117 -174 -82 -75 -186 -210 -58 -365 -73 38 146 -193 29 133 -264 68 73 -150 -131 143 55 43 79
7416 79 91 7 127 52 -56 164 -18 80 -77 -77 14 -208 -155 168 254 114 -11 -44 151 110 79 -277 312 93
7440 93 -22 -76 -103 11 -33 -99 -65 -245 35 64 45 -61 -119 34 81 -93 -180 -70 -25 292 65 48 6 147 25
7465 25 -126 76 -26 -61 -11 176 -11 -43 152 -308 -202 108 -19 153 -123 111 57 -10 -84 -31 244 -1 138
7488 138 100 -166 119 278 66 -182 40 229 264 -44 8 -53 93 129 -122 72 -8 -180 -166 -56 -68 -94 -28
7511 -28 199 -42 -100 -35 73 -155 -23 134 23 443 43 61 225 -227 -100 -127 57 -65 228 183 -53 51
7533 51 -16 101 137 213 269 -18 -33 52 -45 -158 -98 -20 -69 -24 -44 -2 -154 159 89 -164 192 -59 46 1 23 296
7559 296 74 -136 -34 56 -25 -104 66 -29 -198 97 -5 -8 -83 -12 -171 -3 254 59 -157 -152 -77 21 -144 44
7583 44 209 336 -107 166 -73 -48 -125 -384 -302 -98 174 -126 -11 -156 41 -189 -40 59 -99 -91 -48 39 -276
7606 -276 112 21 -52 69 26 -60 -141 192 63 36 82 71 -40 -92 136 -284 -144 -277 -69 -199 34 -85 -106
7629 -106 2 -94 153 -64 -229 -166 91 -43 103 -89 29 82 -69 -173 259 31 -18 -167 10 51 -110 196
7651 196 -30 -171 -220 139 -112 88 -40 -60 -104 -66 63 130 -49 51 242 -254 -42 -136 22 -214 -93 98
7673 98 1 -182 194 -44 55 -284 36 127 43 170 93 -186 -63 29 -62 -26 -17 -70 36 -153 60 3 -33 147 104
7698 104 -41 -144 26 132 117 -64 -92 57 -105 -76 110 37 289 100 70 -164 39 236 -33 209 -51 0
7720 0 -82 -75 82 -14 140 166 54 164 -7 -130 -50 303 304 3 -32 153 134 -202 -108 -199 96 -80 -208 -71 -67
7745 -67 -129 105 95 -69 24 67 178 267 -126 170 4 216 -90 -69 -183 4 -174 -339 -57 -27 2 55 -56
7768 -56 171 223 -184 53 -54 73 116 143 79 132 9 365 103 20 155 112 -150 -7 -6 -40 27 -207 -212 97 31
7793 31 97 195 7 -153 -173 -22 -106 179 78 -10 287 116 -197 -152 -206 -191 225 -13 -63 6 -3 130 -131 -16
7817 -16 76 -210 93 -21 -97 72 17 -16 -103 -23 -42 -44 196 -146 130 -52 -179 317 -25 188 107 38 128 -55
7841 -55 -39 111 -167 -131 -28 3 -65 -145 -1 344 156 1 -51 -66 -20 -66 187 -123 -77 -17 76 -15 97 -7 -37
7866 -37 179 2 242 83 92 46 85 -160 -153 -13 144 -23 142 -66 -175 -28 147 -285 -31 154 127 -134 -70
7889 -70 -184 -234 20 97 70 168 88 -152 -93 -20 161 -22 -215 -11 69 53 -101 -251 71 -94 17 10 18 70 143
7914 143 93 101 34 -130 149 228 26 -149 -67 -84 -68 119 -93 -246 55 41 19 -29 147 -61 92 59 249 55
7938 55 -116 -30 -33 307 87 210 66 -21 118 221 240 272 77 -226 -42 -209 153 57 197 -265 149 -43 -125
7961 -125 -64 -53 -48 -47 -270 -61 -180 -32 -238 -43 -89 143 40 -147 -119 -29 208 8 167 -114 60 -16 -94 93
7985 93 264 -151 -23 -286 -4 258 202 -89 237 181 -98 -102 44 18 -219 -34 128 182 150 -50 -157 128 -294
8008 -294 -102 -196 -102 56 133 -37 158 36 -190 -52 -154 -66 -122 191 1 25 168 -4 0 -46 -14 -51 74 100
8032 100 -108 -183 231 -12 -211 -191 123 131 132 17 163 36 257 -203 -97 115 154 121 68 55 -116 -171 -11 2
8056 2 218 -26 221 -83 284 -286 56 185 19 -60 -132 12 48 -6 33 101 93 -77 -100 57 220 -119 -330 32
8080 32 51 17 68 227 42 113 152 180 -7 -42 97 -76 64 56 20 -109 41 17 172 -110 11 27 40 -119 24
8105 24 -121 215 -57 -60 -23 -65 -10 -77 104 -37 4 45 36 86 27 -149 -220 53 -137 -16 303 -83 53 12 -160
8130 -160 -166 70 94 -129 -65 -164 -65 -131 94 35 -79 -321 -70 144 -237 110 -97 -127 -105 -36 -45 -406 201 -61
8154 -61 107 77 117 94 98 -181 -142 38 175 -104 -47 -90 -127 -111 67 -202 -64 75 188 -36 -103 93 -139 153
8178 153 -105 58 428 -88 -120 250 234 -42 46 -63 229 183 -211
8191b11
$$ Imaginary data points
##PAGE= N=2
##DATA TABLE= (X++(I..I)), XYDATA
0 0 0 0 0 0 0 0 0 0 0 0 0 0 0 0 0 0 8 -8 8 -8 8 -9 16 -16 16 -24 24 -32 32 -40 46 -49 56 -64 73 -81 91 -104
38 -104 114 -129 144 -159 176 -194 215 -237 262 -288 317 -349 385 -424 465 -516 570 -632 702 -783
58 -783 880 -992 1129 -1301 1520 -1808 2209 -2812 3807 -5739 10868 -53643 -121330 9796
72 9796 43384 9992 -15682 -33361 -35412 -2731 -9750 -55255 -52440 -11800 -48638 -62928 -5645
85 -5645 -5976 -30801 -24856 -48194 -33294 15973 -5799 -62385 -56116 -15669 -16941 -25036 -13841 -45307
99 -45307 -45582 5661 -14354 -36174 -857 -18237 -50778 -19301 10756 -8050 -27708 -21822 -28669
112 -28669 -13188 29820 -5069 -46826 -6422 6315 -5851 12461 316 -24453 -7599 15731
124 15731 7578 13 15464 -1412 -18231 19680 26980 7336 15174 -5487 -11513 37335 43086
137 43086 682 -8959 16803 24551 19487 32153 15562 -5277 27328 30197 8687 34044 31245
150 31245 -2743 9101 37117 36900 21165 15735 9568 10587 43571 42139 3378 10472 23369
163 23369 18760 35988 29420 5418 13057 24124 20109 20541 31542 19576 -6440 13642 35177
176 35177 19695 20448 9926 -8635 19418 37427 14583 -324 5728 11248 9747 20747 20023
189 20023 -5218 189 14107 4087 15629 18086 -6811 -6375 7567 13399 13070 4208 -7183 -10758
203 -10758 9214 22540 -1120 -7705 185 -6411 6404 13765 -2924 -5837 -3703 -4135 3167 10539
217 10539 5303 -15278 -12314 9628 5524 2623 2064 -14954 -7665 10320 7867 968 -6474 -7998
231 -7998 -1687 6001 12063 -1902 -9879 -289 -1267 5912 13829 -2203 -8664 -2240 4010 12803 8158
246 8158 -3279 -7807 -233 14903 10019 615 2622 -4883 1349 16536 9932 2104 -694 -984 8144
261 8144 13054 11899 2866 -5417 5342 11490 11698 13073 -1273 -4364 9168 13180 13429 5723 -1691
276 -1691 3117 7551 13381 12628 2043 936 1119 7087 18335 8067 -2645 205 2982 12319 12327
291 12327 3722 -44 -2852 5551 13094 7156 3903 -3282 -4019 9292 10762 5206 139 -5663 889
306 889 7169 7470 5861 -5182 -5921 3133 5995 8363 -4 -8136 -1747 1711 5802 5878 -4790 -6596
322 -6596 -3621 2065 8394 -239 -6526 -5776 -3933 5371 4716 -3595 -4994 -7444 -1593 6196 2048 -2423
338 -2423 -8590 -7141 4770 4255 405 -3473 -9176 -1852 3764 3232 1915 -7410 -7466 1114 4075 5420
354 5420 -2114 -8579 -2057 1233 5345 4445 -4885 -5086 -1824 2503 8380 1531 -5100 -3546 -620 7581
370 7581 5753 -1137 -2043 -3896 2384 8984 3564 369 -3396 -2471 7115 7499 3421 -542 -4460 2274
386 2274 6784 6395 4847 -3839 -2609 5376 6238 7593 1599 -4891 901 5257 7049 5740 -1627 -1428
402 -1428 -381 4858 10542 1625 -3264 -532 220 7531 7291 -806 -2740 -1773 3288 7001 3255 580
418 580 -4326 -2311 7486 4353 1524 125 -5331 74 6053 4025 969 -3961 -3426 1346 4835 5966
434 5966 -3247 -6794 1397 1728 3196 3770 -4500 -4636 559 2548 3508 406 -2461 -4888 -1779 7132
450 7132 3110 -3650 -1827 -4425 305 8353 1431 -4384 -3446 -334 3705 3349 2265 -3353 -4592 4177
466 4177 3091 1070 4495 -3203 -5446 3882 6265 3156 -544 -3611 -1484 3542 8761 1902 -5647
481 -5647 1394 2469 1356 7709 1567 -4071 1294 2926 3196 4929 3688 -1608 -3702 5982 8025
496 8025 1480 2450 -2216 -2550 10433 8011 -2087 -739 1682 2387 3953 5782 1589 -3272 2585
511 2585 3473 556 8345 2985 -7442 582 6694 4213 2855 -1253 -4185 636 8439 4239 -5910
526 -5910 -442 2265 -2026 4850 4209 -4560 -415 1213 -2483 2431 5416 -1966 -8525 -207 5665
541 5665 228 509 -3245 -8952 3103 6953 -4693 -4428 -990 -3158 -2043 1829 -444 -5785 -2294
556 -2294 -1420 -6451 2683 4550 -9621 -7758 980 -514 675 -1876 -8846 -6784 3233 2724 -7783
571 -7783 -4749 112 -6420 -2021 2664 -5182 -3138 -1183 -7791 -2803 5353 -719 -10306 -5676 2724
586 2724 -256 16 -1646 -10314 -2528 6755 -2935 -5298 463 -2955 -3913 437 1602 -2520 -1593 -1085
602 -1085 -6652 1068 8837 -4137 -8244 976 1429 2003 3131 -4296 -5502 3022 5656 -2412 -1833 3922
618 3922 -2734 -2780 5761 526 -444 3243 -3968 -2567 7859 5536 -4126 -4024 2611 2520 3064 4246 -5085
635 -5085 -3520 7738 2097 -2573 3715 478 -2998 1434 3677 1137 990 1100 -4673 -1158 9329
650 9329 1898 -6320 -130 460 583 4948 -799 -5781 -103 3675 -775 -2138 2792 -1792 -5665 1960
666 1960 1018 -2523 1714 -4033 -7340 2303 4583 -3063 -6219 -2317 -1089 -523 1866 -4030 -8126 1111
682 1111 -22 -4907 516 -893 -6168 -3618 -844 -1348 -984 -1645 -6460 -6835 2993 1753 -7068 -4111
698 -4111 -3258 -3818 1392 -849 -6589 -4055 -699 -2129 -3287 187 -1565 -6598 -2035 79 -2652 766
714 766 -2456 -7359 -1040 3071 -625 -3682 -3189 -1724 -922 2044 280 -4839 -1246 947 -2772 1420
730 1420 2217 -3300 -2118 -6 934 1674 915 -1555 -3836 1531 5095 -706 -944 145 -1976 3028
746 3028 4101 -689 -761 798 522 879 2738 2632 -1423 -527 2826 1269 3231 2452 -3118 -54 4115
763 4115 2736 1535 140 -116 538 2670 3559 -495 -328 1732 -555 1964 3730 -347 -1146 109
779 109 788 2699 1887 -106 -2122 -771 3360 1205 -355 120 -2464 10 2796 109 -463 -850 -1621
796 -1621 7 845 1437 -1199 -2875 -236 160 665 1160 -2806 -2720 401 50 718 -749 -2561 -1756 -942
814 -942 1040 122 -2332 -1201 -2362 -1115 1763 -841 -2465 -1921 -1909 394 605 -1199 -2027 -3082 -110
831 -110 1003 -499 -468 -2627 -2370 527 22 -2 -1301 -2793 -1103 300 753 298 -2339 -1782 -383 129
849 129 1262 -785 -2610 -682 -225 1076 624 -1442 -1238 -1272 586 1775 -387 -901 -1164 -1347 1868
866 1868 1210 -942 -369 -1817 587 1669 510 265 -1466 -946 1656 990 840 -123 -2130 325 1416
883 1416 1114 1130 -1330 -715 958 832 1752 -208 -1294 -50 348 1647 1357 -1053 -523 -314 745 2061
901 2061 -54 -712 -673 -419 1960 928 -599 -415 -1320 876 1753 243 150 -1124 -818 1597 966 675
919 675 -631 -1395 635 664 762 286 -1811 -320 735 486 1395 -248 -1679 -46 288 1155 636 -1040
937 -1040 -553 -294 751 1595 -424 -532 -432 -533 1792 1186 -648 -741 -796 935 1136 330 -68 -1351 -71
956 -71 1690 242 458 -51 -1414 544 961 899 262 -1073 -354 369 870 1508 -1145 -1088 776 41 1269
975 1269 978 -1193 -459 390 638 785 5 -427 -710 -305 1834 163 -542 74 -1195 346 1915 -101
993 -101 -865 -889 -88 940 549 11 -1035 -1224 1061 99 -185 675 -1593 -992 772 316 284 -506 -1302
1012 -1302 -627 221 1706 -568 -1745 7 -538 323 1364 -1243 -1633 61 -37 81 51 -54 -1316 -1219
1030 -1219 632 740 -747 358 -1924 -1245 1780 459 -753 -519 -670 132 437 551 -522 -1480 620
1047 620 -111 -575 1582 -376 -1962 212 443 490 605 -461 -1614 -33 1986 874 -1549 463 338
1064 338 -406 1920 346 -1318 770 575 -355 661 1378 16 -1106 917 1502 404 1559 -596
1080 -596 -1715 2207 2092 -355 11 -55 119 972 1249 6 -625 1086 710 -919 2083 1481 -1665 220
1098 220 726 507 1634 609 -1343 -416 2043 1616 -1122 -6 576 -658 1752 1422 -1451 967 602
1115 602 -1092 84 1539 554 -1554 -607 781 267 1408 238 -2574 451 1947 -893 -447 25
1131 25 -917 -326 683 85 -1158 399 240 -2100 564 1778 -1429 -1104 -109 -583 731 905 -1754
1148 -1754 -1697 802 1104 -1314 -603 424 -954 -9 1050 -1474 -277 704 -1515 -1061 1116 660 -1208
1165 -1208 -1316 -147 -364 658 835 -2128 -1175 1551 -361 -839 397 -924 -803 306 257 -643 324
1182 324 463 -1700 -707 2005 -322 -1105 45 -727 264 1651 -661 -1498 458 1451 -181 -339 688
1199 688 -784 -254 1390 -536 -363 1312 -866 -1107 1224 1097 -306 -700 -27 -130 832 1583 -718
1216 -718 -1072 1590 375 -200 1155 -246 -120 612 290 -26 624 936 -685 -877 1913 908 -696
1233 -696 427 -351 77 1842 481 -940 343 890 499 228 761 89 -792 934 292 -36 1458 -125
1251 -125 -1393 731 1203 355 -347 -366 -295 315 1294 41 -1391 852 510 -584 683 159 -857 107
1269 107 -392 232 611 413 -384 -923 575 854 -428 -117 -733 -755 916 537 -918 -289 -161 -203 -211 217
1289 217 363 -797 -348 402 -666 706 312 -1242 -186 590 251 -34 -507 -131 -78 644 358 -1149
1307 -1149 76 413 -546 388 620 -521 11 -332 -37 542 477 143 -854 26 1056 -160 65 86 -933
1326 -933 716 816 -100 71 -133 -185 478 476 622 -322 -471 593 -83 558 807 -635 -124 855 296 288 325
1347 325 -113 184 323 871 -243 -322 419 -348 409 522 -276 -32 112 -203 763 151 397 -210 -303 571
1367 571 507 333 383 -488 58 682 -92 241 101 -236 66 191 355 130 -263 78 67 262 653 -378 -157
1388 -157 340 337 473 -14 -478 -105 -301 505 549 -196 141 -289 -154 441 11 10 -5 -700 299 421 -246 -128
1410 -128 -762 193 451 51 276 -93 -364 547 221 -25 57 -476 -112 113 387 360 -504 -341 -76 -125 481
1431 481 -326 -465 -59 -277 -84 443 -331 -131 -292 -101 458 -198 -191 -421 -466 362 285 -116 123 -548 -96
1452 -96 298 220 220 -456 -477 68 -193 238 -78 -819 -59 -152 73 145 -562 -230 -153 -77 113 -64 -535 -305 -380
1475 -380 116 421 -381 -156 -130 -269 518 -63 -325 -39 -182 233 84 -123 -31 -727 250 321 -154 215 -250
1496 -250 -263 456 -128 3 84 -661 17 148 350 230 -449 -69 64 -82 590 -135 -507 348 101 432 -47
1517 -47 -48 -3 -274 304 621 -125 48 409 -527 433 288 -84 55 -116 211 378 376 168 -585 -52 717 -104
1539 -104 169 249 -358 168 483 166 500 -49 -297 -77 565 605 -265 -101 180 12 871 486 -369 17 193
1560 193 50 172 -86 159 29 62 856 -40 223 505 -725 134 726 -146 89 -350 127 398 391 116 -192
1581 -192 39 566 -36 102 473 -249 -322 253 40 405 146 -417 -122 229 598 89 -147 200 -280 -4
1601 -4 756 -505 -200 647 -81 71 407 278 59 -419 534 32 140 723 -687 -180 931 295 -221 88
1621 88 -481 129 325 177 -298 -249 571 -76 18 678 -107 -686 265 -46 128 395 32 -707 -64 438 132
1642 132 -462 358 102 -43 1178 -127 -471 189 -99 -171 -78 675 260 -363 147 40 192 822 -134 -753
1662 -753 400 342 -77 178 -20 -56 285 291 -87 -407 501 -105 -541 687 495 -694 217 -81 -81 457 191
1683 191 -418 -407 425 472 -283 128 34 -426 635 265 -622 561 526 -324 300 511 219 31 81 6 -207
1704 -207 903 234 -1005 356 701 -46 194 -51 -333 289 690 6 24 469 169 -765 489 603 -87
1723 -87 73 -57 -159 461 576 -268 -518 306 574 -336 -91 277 -368 240 530 -698 175 564 -357 -316
1743 -316 351 362 -245 106 -320 -365 522 162 -1134 -223 501 -336 -84 -50 -422 194 442 -180 -106 -30 229
1764 229 -518 -111 615 -354 -402 -30 -765 102 499 -326 -562 179 141 -41 -49 234 -403 -223 557 -241 -94
1785 -94 58 -667 -315 363 -211 -223 36 -92 -259 60 350 -497 -331 415 -226 -69 382 -328 -96 233 -63
1806 -63 -117 45 62 -315 -253 477 73 -290 41 -315 -112 765 19 -370 -56 64 -64 -48 217 -211 -32 318
1828 318 -65 -47 646 -282 -371 311 164 56 478 -160 -38 90 382 -206 -125 275 -47 -34 475 -338 -18
1849 -18 304 -3 169 173 196 -251 -85 452 488 -357 531 -33 -270 293 344 32 278 -107 -123 152 170 236 -267
1872 -267 136 84 -436 227 86 -246 106 48 20 276 -267 51 61 153 105 -72 -29 -169 -279 153 90 -254 243
1895 243 -200 -95 122 135 -53 -203 -433 0 -99 -90 -84 -446 235 208 -153 38 -19 -143 3 -208 70 -181 -313
1918 -313 165 -207 53 166 -459 -244 -57 61 328 -240 -357 -341 -151 126 50 23 194 -352 94 -73 -323
1939 -323 138 -281 -173 187 4 10 31 -134 -38 -4 -77 52 -510 -10 284 -20 144 -129 -312 228 67 273
1961 273 48 -565 221 -210 -66 242 -234 -230 4 167 -16 22 -71 221 -41 -51 -112 -166 39 -96 -247 284
1983 284 -103 -56 -11 -208 -117 31 74 62 -150 -45 -206 6 370 44 -69 109 -261 -140 107 -104 123 -65
2005 -65 21 69 -366 -353 54 19 52 25 -366 -20 103 -89 142 -421 -162 13 -171 228 -12 159 -113 -308
2027 -308 138 197 -159 -23 -58 -117 194 -58 53 -173 -208 -232 -76 -141 -282 -363 -61 -340 -22 -1 -386 -180 -86
2050 -86 201 25 -114 31 -127 -108 -118 24 -370 36 -221 -243 117 -42 -485 -85 -18 46 16 -160 19 -484
2072 -484 125 -129 -220 204 -271 -80 113 -197 -178 -218 -33 -105 -193 137 202 -213 128 53 -332 78 112 -366 45
2095 45 33 31 123 0 242 19 113 36 -135 88 233 -479 55 272 -133 -48 6 44 31 46 141 -240 -117 246
2119 246 -142 -113 -81 -234 324 266 -128 -11 101 -65 -68 -21 130 -67 46 -61 -58 164 100 -396 -38 7 -181
2142 -181 -102 -142 178 -164 -27 359 -83 -106 -30 -549 85 162 -246 -188 -267 -351 132 -85 -130 -448 -142 274 -242
2165 -242 -289 376 -271 -131 -50 -285 -196 12 -191 -260 67 192 -145 -150 237 -314 162 424 -204 -378 -95 -322
2187 -322 -25 -219 -178 -22 -213 266 -190 -156 318 -81 -506 547 152 -31 165 62 -37 338 207 -74 -145
2208 -145 95 44 -372 231 -75 -170 -100 -142 0 272 -223 -291 -64 458 204 -162 259 -134 -108 379 -272 -293
2230 -293 271 299 -68 281 120 -87 357 120 -9 -73 428 101 -196 469 438 1 169 -203 -34 160 242
2251 242 159 86 505 396 -216 324 164 110 306 -243 -332 468 234 -98 95 258 59 -66 182 101 44 269
2273 269 -190 -234 406 55 21 -105 129 57 -133 200 128 -25 346 235 -67 -65 33 -452 160 62 -409 82 28
2296 28 -194 47 276 170 -332 -6 335 -324 136 -105 -413 183 157 -111 -33 25 -141 -38 -31 -245 -274 333
2318 333 259 -349 140 16 -113 65 282 142 -53 142 145 49 78 297 -417 -52 115 -96 156 235 -64 217
2340 217 60 -172 -48 -15 158 -212 126 515 -164 -81 -28 -155 194 205 134 -96 129 99 138 80 93 130 122 230
2364 230 -119 27 206 -11 -127 -14 110 5 174 -67 60 -223 236 -121 -246 131 3 35 70 -177 32
2385 32 135 160 127 83 339 245 -13 141 -15 237 258 -307 -169 268 -165 -215 235 -13 -114 -199 16 2 -101
2408 -101 -79 -14 75 55 -92 43 108 -21 125 100 -141 7 -110 -155 -14 -8 32 -218 -279 63 -122 -289 -61 41
2432 41 -43 109 -222 97 -91 -25 58 -68 392 51 -378 260 135 -245 -150 -213 68 -77 -74 212 -70 -72 193
2455 193 -75 138 48 -12 213 -167 205 79 21 374 -98 273 105 -69 280 6 -226 125 6 -88 116
2476 116 -50 25 77 63 113 -101 -256 173 -172 153 270 -35 62 91 -197 109 -145 79 41 4 109 -90 68
2499 68 212 35 42 212 -182 66 40 29 7 4 -76 -49 165 257 262 149 168 -251 103 2 149 205 22 -130 165
2524 165 -96 -29 288 -202 259 -37 17 154 52 142 150 -31 -41 74 -144 156 75 -177 20 -70 173 -179 -59
2547 -59 72 -232 -139 -6 -187 269 -43 -112 1 -261 -16 193 159 -34 96 18 99 142 -228 175 39 189
2569 189 182 -192 -127 -76 215 -58 15 256 -228 54 158 8 118 114 -1 43 -35 146 305 -15 -13 286 -37 20
2593 20 15 201 122 -7 36 160 26 366 -164 -5 285 -60 218 39 256 124 -16 -210 -116 70 -346 131
2615 131 -156 46 -93 49 107 36 270 77 -135 119 -97 141 168 -130 52 -75 -170 184 -67 53 19 -59
2637 -59 23 -22 -134 361 -73 -148 201 -386 202 170 -41 -72 -108 105 205 -142 -30 -96 -122 144 -31 113 -16
2660 -16 -336 -80 -113 222 114 -152 4 152 79 60 -140 -37 169 -80 -298 -281 296 -105 -82 103 98 -98 62
2683 62 -124 -202 45 12 -53 147 -118 -255 -224 20 -185 238 56 -6 -9 -37 188 48 -21 59 -198 27 31 -208
2707 -208 263 65 66 -163 75 44 -213 24 200 -175 -5 -88 -97 210 105 52 -74 -278 -356 123 53 3 -129
2730 -129 158 192 31 44 -153 -12 0 145 -159 187 116 -62 67 84 132 -77 93 -61 102 72 75 -131 76
2753 76 161 338 -207 174 49 -64 -208 135 -397 -41 100 69 74 119 -78 -182 -294 43 115 104 77 170 13
2776 13 82 -18 -38 166 -116 122 -145 -141 228 -172 -121 237 132 37 -224 -99 -211 -126 -23 250 -4 60 -40
2799 -40 -79 -8 -278 33 18 275 129 -149 -214 130 128 -55 -23 196 -104 145 136 162 -104 -316 -88 33 115 -130
2823 -130 -206 58 -229 -16 -196 -118 -178 89 -87 -131 -95 67 135 -95 75 122 -108 90 148 -344 -141 52 203
2846 203 -44 154 72 82 234 -131 -126 360 77 -187 319 210 53 -59 -228 -194 -262 94 -221 -85 -40 -3 29
2869 29 -85 78 -81 118 -28 -147 93 79 -122 42 -285 174 192 -181 -46 -90 99 41 -271 163 159 125 -112
2892 -112 -36 -118 -11 287 -12 -3 78 -89 -258 -18 24 -21 98 21 -71 141 204 -359 -266 -73 95 -110 -273 -183
2916 -183 35 14 -105 -237 -15 -73 -81 172 -74 49 -15 23 110 -87 201 320 97 141 27 -102 188 195 -206
2939 -206 186 -111 -112 -59 -131 272 6 113 -43 -107 -19 84 151 -18 135 -192 114 -4 118 -124 75 185
2961 185 -116 -218 28 -13 -4 51 -111 -27 -229 -89 -8 -126 56 -9 149 214 -79 79 -38 -106 -18 -11 96 -215
2985 -215 96 239 87 51 33 134 53 151 113 205 -112 30 47 95 -74 -29 213 155 -152 -52 -27 -152 69 220
3009 220 24 89 139 -221 -219 -132 -4 102 -249 82 -195 74 89 -19 -47 47 -96 28 4 -30 156 -63 60
3032 60 226 -88 76 -116 99 29 182 -220 -65 -74 2 -116 -178 -101 -221 116 -111 37 -6 25 13 206 78
3055 78 0 45 -89 -67 -96 -300 -102 -181 63 -161 -21 127 143 -234 -142 175 109 -202 -218 51 20 36 47 12 62
3080 62 -55 49 27 145 -107 251 -66 -110 -68 145 -71 -10 -107 -108 44 379 -134 6 -51 -161 -351 197 -181
3103 -181 18 124 -161 170 111 -133 157 178 153 -58 10 -168 0 35 14 19 40 -129 62 -19 40 60 -215 55
3127 55 -226 66 -138 -114 11 79 84 50 67 -94 -115 -204 -54 -78 89 -182 35 -119 -40 -63 185 211 209 31 51
3152 51 42 100 -239 112 151 -7 257 -24 -126 -50 143 -103 -90 -282 -82 -31 152 -71 259 250 -125 199 -68
3175 -68 -118 -14 109 158 -118 -47 317 53 -148 -131 346 -211 -42 70 0 32 -49 148 238 129 -155 -225 64
3198 64 93 -61 85 22 -2 -18 57 93 -41 -59 -33 -64 -97 2 174 157 72 -107 -369 -47 -5 18 197 -197 -104 -59
3224 -59 6 -264 -93 -18 -92 -14 68 77 -57 -243 -69 -144 -167 41 -37 179 229 91 8 -12 60 -77 -2 38 -259 -164
3250 -164 377 -137 -305 -46 -111 23 -55 -194 -250 -186 -111 -88 -100 -40 -36 -155 -6 139 26 128 197 -151 128 -19
3274 -19 12 -77 -16 -18 68 -307 -34 -9 -83 325 -248 10 2 -82 -72 -172 53 84 -1 -54 -134 22 -89 -293 156 108
3300 108 -7 65 113 138 219 162 -97 29 40 -24 -93 88 182 -286 -142 -140 -301 7 118 -123 73 26 -195 -109
3324 -109 101 -39 5 20 264 -76 104 -293 -87 165 -81 1 -355 173 191 -65 63 94 16 -158 -260 22
3346 22 90 -53 -37 232 4 2 16 -13 193 -236 -20 35 -214 62 -136 -155 33 317 -96 -150 213 -221 167
3369 167 -220 55 -71 208 163 -126 140 -149 -78 -36 112 -109 191 -327 -248 -38 95 -40 -151 -46 -15 37
3391 37 21 -44 231 155 -225 -54 60 -23 -19 148 159 174 113 -258 -92 41 237 -298 102 -29 168 105 162 39
3415 39 -194 -343 23 51 77 67 184 -87 -312 -170 97 65 -138 22 -143 100 237 -140 30 110 223 -23
3437 -23 181 40 65 -182 173 -5 101 173 14 -46 245 -30 -207 -10 -149 56 -181 137 142 138 -188 -84 -174
3460 -174 236 -302 -183 156 -155 -220 -86 -235 61 123 151 76 -185 -143 152 66 -9 -322 -238 340 -170 -27 -171
3483 -171 -27 -77 -416 -66 -12 -171 -15 208 125 -203 63 -378 -4 48 -84 -49 -153 -67 220 57 -73 72
3505 72 -7 132 -75 -228 -19 35 158 118 221 -94 -98 104 -292 114 13 -100 3 221 -215 9 -122 -179
3527 -179 211 149 16 -87 1 213 -49 -158 120 -5 -7 -281 32 71 172 -161 281 3 91 94 157 109 147 132
3551 132 214 82 172 54 -190 -57 -54 147 -11 39 73 -129 -39 -171 101 -47 -62 63 -201 96 -215 63 13
3574 13 -108 14 -78 -117 62 -82 -280 278 -62 142 13 -143 220 -229 -47 71 -185 11 -28 -36 -60 94
3596 94 93 -70 -30 223 -47 64 198 -154 -150 -137 -23 8 35 -291 42 30 -178 -94 -140 36 -42 -55 -211 -142 -216
3621 -216 -210 220 -176 -90 -127 122 -87 -38 -148 -284 -40 42 126 -26 -109 -127 -166 -217 -44 150 -94 -52 -57 -52 -17 1
3647 1 -188 56 73 9 38 151 141 36 21 112 -120 155 -241 -19 -43 224 -67 76 94 -23 127 144 -31 -222
3671 -222 -34 -85 -36 187 -203 44 -336 -43 189 73 -85 -386 -84 11 120 89 58 -259 -57 45 -41 -22
3693 -22 16 138 -163 -24 -136 -200 -32 164 -143 174 103 -11 78 128 -115 111 208 -126 -184 -300 55 -188 -47
3716 -47 -106 54 -83 -138 -149 -85 22 -263 207 -77 -143 -130 -39 30 17 -167 208 -157 -4 158 119 -21 10 222
3740 222 45 140 45 -121 58 134 -243 45 -18 -222 -72 -209 80 -266 -1 204 -128 -36 -154 280 -92 -38
3762 -38 -49 68 53 121 -101 66 -81 -142 60 -126 107 -383 26 14 208 129 137 -24 5 109 -235 68 -228
3785 -228 -105 44 -163 -27 -33 40 46 228 118 65 81 106 -75 14 -109 -106 -92 91 -110 -53 52 -134 247 180 377
3810 377 86 7 44 -83 272 -96 -193 -121 -102 -94 10 -202 -142 -96 -47 271 -94 166 -33 18 361 158 -84 -30
3834 -30 -49 64 -206 37 -133 -417 97 199 174 104 -31 359 -145 -68 -103 196 -19 -81 -23 -52 357 -274 218
3857 218 -3 -37 -7 -359 -138 -49 -148 280 264 -1 181 -70 109 -23 -18 23 105 -47 -177 -213 -3 193 39
3880 39 -126 92 29 -447 -20 -54 -111 17 37 -15 -182 126 -192 -84 122 463 -54 109 -153 33 126 -108
3902 -108 -211 -88 -173 105 168 4 340 -173 82 -65 -211 -319 226 227 -173 -198 146 -164 104 -178 -5 -54
3924 -54 -27 -66 21 28 -24 89 -276 98 -229 40 3 272 -132 126 -176 -101 -151 -148 -75 -92 -97 137 -38 133 -42
3949 -42 -46 -28 -239 -189 -14 -99 91 -4 94 -69 159 20 71 -29 -102 -106 -152 63 78 89 -181 173 -38 -18 -139
3974 -139 55 10 28 -114 -89 -189 159 88 146 -143 155 121 106 -62 37 29 -142 275 139 -20 63 52 64 303
3998 303 71 -207 255 55 288 99 -16 -183 15 172 -8 221 -171 136 -116 41 186 57 -329 -39
4018 -39 79 57 171 145 157 -31 201 114 -195 -31 -83 124 158 -73 -60 -11 -9 163 -62 -245 136 298 220 272
4042 272 109 -119 -140 -218 179 -62 38 140 25 -142 -140 62 15 -9 163 -130 148 37 49 -212 142 -191
4064 -191 -191 -142 -258 -21 -11 -84 -16 16 279 234 -159 -179 23 -36 -233 20 -287 -2 -153 -9 -45 250 36 53
4088 53 249 262 -20 42 -60 -19 -65 -75 97 -60 293 -219 -192 144 -246 78 86 241 139 312 -190 120 121 -8
4112 -8 -54 -150 -84 58 -93 78 73 37 51 41 296 -36 164 107 -206 -23 149 -267 160 -20 137 64 78 40 -27
4137 -27 -79 43 83 -11 -100 2 15 -184 35 2 -5 -339 -120 -5 233 -154 -39 -51 -71 192 -283 -18 -94 0
4161 0 -19 -58 175 -6 12 30 125 63 160 9 -219 -200 -85 120 16 211 240 -145 -112 -248 -173 -47 -69 -1 243
4186 243 -252 46 67 -173 80 -7 -50 -110 -119 263 139 141 63 -135 101 65 30 61 -150 -79 -121 54 168 91 -79
4211 -79 -154 47 -50 -56 -57 -183 120 35 -35 363 -260 16 198 -288 159 19 353 -129 8 -15 -89 -157 -17 -76
4235 -76 -120 -12 112 311 284 -136 106 -17 -7 -46 80 40 248 253 -132 -37 97 68 -203 115 16 168 -54 -64
4259 -64 -29 -145 200 -44 74 -22 -126 144 199 41 -56 -49 1 -80 -40 -87 -32 72 57 -47 -15 -154 -169 -71 10 78
4285 78 -282 -147 -39 -134 -74 -276 -63 101 -205 71 214 14 29 78 152 -63 -11 -44 -273 317 45 -23 -11
4308 -11 199 -121 -246 35 22 4 -193 136 271 -197 151 -75 37 -77 -83 28 190 112 -72 -32 165 -230
4330 -230 -3 133 11 -142 30 160 -103 -102 -41 -244 -115 -255 -194 59 -10 -219 -332 -89 194 -366 115 49
4352 49 32 247 89 -79 42 -173 132 -67 -237 -135 -275 188 93 81 -142 -202 -277 -189 -70 -142 194 -244 74
4375 74 99 -241 85 22 -89 43 -13 -227 -53 -76 -92 27 -99 198 81 -32 89 78 -2 191 -243 -111 175
4398 175 5 -256 -75 144 -18 -64 -120 -98 32 -38 89 148 -136 -205 -186 -26 -125 18 181 158 55 244 189
4421 189 82 -204 -126 186 -277 55 129 -209 -150 -113 -127 163 -64 -41 22 247 83 88 -18 7 -142 -10 -317
4444 -317 -45 12 -92 129 -102 63 -75 79 -81 -151 -114 -137 31 48 -75 80 -91 44 97 -17 -90 212
4466 212 141 -173 -109 122 58 35 139 47 49 66 -72 119 191 56 -185 -141 137 -251 68 -200 -129 -154 -12 -143
4490 -143 -106 232 -33 145 1 215 -269 -69 55 138 -288 -400 91 -20 -62 -155 98 -151 -215 -215 16 -20 -43
4513 -43 62 -127 -320 -204 -27 51 -182 -133 227 51 -12 91 -458 -173 94 -257 -44 54 197 36 -32 128
4535 128 -57 -73 -155 -268 -50 -12 172 10 85 86 -159 194 -182 -66 -33 62 -100 -241 -44 57 -183 142 -390
4558 -390 -69 284 133 -279 -161 65 -18 267 187 139 -42 71 240 -62 -196 178 113 198 -1 -67 80 19
4580 19 151 129 291 -210 -221 151 -115 191 -371 -92 139 28 108 -4 -4 -85 -381 135 85 21 235 141 -228
4603 -228 215 118 -374 -193 -103 -86 71 -35 5 88 -46 -153 -98 -172 -213 149 -183 52 -105 113 137 -55 -67
4626 -67 -63 -26 97 27 -112 208 106 -151 31 31 -59 -67 40 -97 -4 -97 -218 -12 10 293 -10 -102 -17 -30 2 -41
4652 -41 -32 161 -105 -299 135 -189 128 -16 -285 -119 120 -129 111 -93 -47 108 292 126 336 -164 -52
4673 -52 277 10 228 102 -160 96 -179 -207 5 45 264 -28 -40 337 -78 396 261 -139 -159 -113 93 -9
4695 -9 -77 21 45 42 80 -217 144 287 26 -5 86 -87 -41 -92 -174 56 -3 -220 97 -123 130 86 18 -68 26 -119
4721 -119 72 -76 146 -104 145 220 -54 -294 -168 -32 344 -38 -68 47 -259 -41 -36 -126 120 45 -191 -279
4743 -279 -133 161 110 -23 -58 -297 -258 196 -175 220 28 321 113 -83 38 -149 22 79 147 -40 52 -124
4765 -124 -187 124 -36 -115 77 -69 1 -23 109 -25 -2 -13 -179 9 59 -59 -138 153 -312 81 -17 -153 69
4788 69 251 114 -49 132 -257 92 -167 76 -126 70 105 93 -303 147 -130 -168 -29 14 -76 24 -93 -89 -7
4811 -7 141 -289 -273 -66 61 -194 205 -132 -109 87 20 -52 114 221 -65 -206 166 -107 66 212 107 111 106
4834 106 -175 -78 123 -96 -3 55 174 322 10 81 -103 -189 395 -153 -88 9 102 -119 77 67 183 -106 76
4857 76 -184 216 213 205 -25 279 -71 -102 15 157 -134 95 225 -206 -26 10 29 165 -181 12 6 -210 71
4880 71 57 103 88 40 111 26 98 -38 220 59 177 178 70 -199 49 -68 -416 9 -109 280 -1 -101 -51 99
4904 99 281 111 90 23 95 173 -188 109 376 -94 -59 -100 160 114 129 -110 -224 72 -148 -1 3 -76 -98 -164 184
4929 184 -171 -156 90 36 -91 -37 117 15 73 -164 -4 38 145 147 55 -33 -31 35 -1 -68 161 116 -247 -68 -8
4954 -8 -187 -202 22 -91 133 -163 -80 3 -13 190 163 179 -30 223 -38 111 -16 -167 107 86 414 26 233
4977 233 13 -193 -104 68 -122 192 -22 -75 -65 -106 82 60 -15 -21 25 262 -214 -247 80 11 -85 -31 130 66 -175
5002 -175 -71 1 35 -264 -114 85 13 282 -213 180 43 -93 115 21 283 -53 -4 -221 102 9 57 60 -110
5025 -110 122 -36 188 170 186 244 380 110 101 86 112 56 220 254 94 -2 143 -234 -5 -122 85 292 -72
5048 -72 35 -13 -47 -234 -177 92 -132 -191 281 16 -193 296 84 -225 104 -262 -257 -74 -263 123 -3 -192
5070 -192 -204 49 -38 -153 89 -49 -15 16 -358 -210 272 -48 120 46 256 123 -267 41 -47 28 -49 -157 220
5093 220 -228 243 -136 -210 -72 -132 98 -64 160 -95 5 -67 132 -57 -306 -49 -146 167 23 205 108 87
5115 87 162 -239 78 -167 -87 38 -115 202 324 149 318 180 190 80 137 153 -82 26 88 44 -11 -271 -216
5138 -216 -108 102 -239 -2 -71 -229 -54 -345 -128 -133 53 182 141 234 -181 -34 -104 309 140 20 169 131
5160 131 -39 127 -53 63 -421 -208 127 -156 36 -122 31 108 166 -3 39 -100 26 -7 -95 139 -319 87
5182 87 100 -66 66 180 -76 136 145 -51 -139 -134 115 54 47 131 322 7 49 145 -152 359 43 42 113 -60 -57 -36
5208 -36 -46 -10 216 168 -55 13 15 -216 135 182 13 -254 -229 -60 -1 40 -219 -117 176 -124 72 -87 223 -71
5232 -71 54 49 318 150 -79 90 -136 -158 -52 144 -207 200 108 13 -30 142 -113 -159 -91 78 4 129 323
5255 323 -219 26 2 -121 -214 -25 103 -124 -133 23 -12 21 144 27 158 -181 -23 -164 -265 -194 -115 4 68
5278 68 -125 194 -54 -230 -22 158 159 -66 -15 -99 10 -128 -150 173 -310 -249 252 92 10 79 -47 78 55
5301 55 112 -31 128 -37 -132 -141 -127 107 -63 -34 -95 62 10 153 -47 -90 117 -210 -72 59 -16 21 -89 10
5325 10 68 81 -139 58 -5 76 113 -28 -104 -202 -59 -87 247 -31 139 -283 74 243 -29 151 20 272 103
5348 103 206 33 -191 -65 201 99 -113 216 -142 40 -22 -140 111 42 20 177 125 28 262 -37 -156 135
5370 135 -106 -194 -64 -113 -48 -144 40 -270 61 13 -124 131 375 -201 -84 -2 -317 145 82 229 67 -163
5392 -163 104 -123 -193 -187 85 -22 116 -91 -294 -29 -24 184 168 138 40 54 174 -114 -40 257 -136 -78 233 106
5416 106 98 58 257 54 81 244 10 -133 -205 -81 -120 292 -100 -11 -60 129 68 52 13 57 -235 292 -51 -13
5440 -13 258 -225 102 129 -21 -83 -41 -235 218 -33 128 115 -45 184 72 -59 378 -311 77 23 -135 205
5462 205 48 76 -68 0 70 182 -170 -111 -74 269 -10 -8 171 63 128 39 19 145 12 194 -155 -65 125 -48
5486 -48 -187 330 259 94 151 -109 -9 202 156 317 475 2 -30 278 -109 63 204 -220 -117 -4 189 18
5508 18 -49 -206 135 35 -58 -77 48 2 264 -15 15 190 -73 -123 83 -17 -108 47 20 323 -215 -72 253
5531 253 -28 -36 -165 -44 39 38 -262 362 336 109 154 -95 -177 -66 -285 -105 138 -103 -135 24 -199 314 -175
5554 -175 27 -68 -37 52 -253 -96 -137 -104 137 56 -144 -39 127 -75 86 -205 -74 58 188 67 -113 -217
5576 -217 252 20 95 -9 -93 -85 152 33 -36 -144 -136 -78 -144 265 -156 101 203 -147 -47 -144 -91 -65 -151 -50
5600 -50 -14 -95 -57 83 137 307 21 -38 54 -135 -119 -96 113 171 -61 108 88 -35 -224 -51 -154 79 154 31
5624 31 -14 -27 173 155 43 23 220 168 22 -176 182 113 91 -123 -204 19 -86 -213 211 -22 -313 -260 87
5647 87 200 -177 134 -78 -75 -192 188 219 44 161 261 -340 258 256 -71 -124 -255 115 4 86 -254 -136 107
5670 107 -43 -39 -3 -36 33 308 106 -98 16 -273 82 -173 34 -99 -189 -43 121 52 195 176 -120 63 -96
5693 -96 111 -5 -2 -102 -191 -194 22 -211 -66 68 -108 -32 11 -26 105 -135 -170 -50 59 228 -44 -138 68 -14
5717 -14 -185 253 38 80 -143 -61 -108 108 322 53 -216 133 -52 99 -48 56 -60 14 128 153 104 -300
5739 -300 263 44 -83 -142 107 92 105 83 -199 221 -74 177 -106 -43 -73 -13 55 -70 49 -78 -200 92 130
5762 130 -219 -22 -78 -5 70 -173 94 77 25 14 -25 -120 46 270 116 -64 158 -230 26 -44 3 273 140
5785 140 -16 -7 -41 -614 193 -101 8 87 100 246 315 92 -6 37 -366 -169 28 -106 48 56 126 93 317 -113
5809 -113 67 145 129 -214 46 -106 144 103 204 189 -34 -238 204 -13 -3 60 56 69 -281 -159 135 275 148
5832 148 -189 -114 120 63 -310 69 207 -164 90 -199 28 -30 -153 -111 53 118 -94 -10 46 209 -20 114
5854 114 -306 -240 -63 -51 116 72 -77 121 -42 204 269 4 277 -320 66 -128 18 -95 -9 -74 52 -12
5876 -12 -12 -145 -58 13 -36 -34 -55 44 -17 -142 -149 8 173 34 -100 166 18 76 75 -148 4 30 88 51 -135 249
5902 249 112 45 13 -201 -14 137 75 -63 -250 -195 160 -254 305 214 -315 5 -65 -143 108 -8 295 81
5924 81 4 -64 -201 202 -217 -80 -17 -225 107 -23 -62 164 -85 55 -111 114 -62 210 -69 200 -122 150
5946 150 169 38 -282 28 73 -231 76 146 -108 -46 82 -81 -171 -70 233 -364 135 50 155 -133 40 -135
5968 -135 2 -354 28 -22 159 -72 -46 80 186 -66 -81 49 -143 233 -58 -76 -124 -67 178 -166 -112 75
5990 75 297 -30 -59 65 53 75 -214 58 -104 -119 107 -105 -209 1 161 62 75 133 -30 -87 -130 -166 -72 22
6014 22 -51 -99 52 -234 -143 58 -163 -52 -9 47 -8 18 -61 219 5 320 20 -209 58 -69 133 198 -69
6037 -69 -211 54 -70 114 -112 132 91 -187 -141 -26 -7 5 44 68 160 29 -107 -164 123 236 -152 -30 182
6060 182 178 115 -59 -150 -131 -165 -32 -213 -128 128 -57 47 -24 67 -145 161 -149 394 -163 -182 22 133 160 100
6084 100 69 222 295 -102 -118 -96 -55 -177 -223 116 -29 -56 -16 -221 35 -32 -190 193 7 152 -168 -55 -91
6107 -91 -170 -142 -35 38 -12 6 103 -139 267 10 -282 -15 -28 146 -180 202 -14 -2 -77 -101 -197 29 14 -129
6131 -129 -199 69 1 -63 177 65 -97 100 -62 29 168 -17 5 -289 -218 52 -101 35 26 -209 -32 -32 275
6154 275 -55 -133 94 -215 105 144 153 192 -241 -1 108 -94 -93 59 20 23 391 206 193 22 -7 31 56 101 40
6179 40 246 -19 -119 71 7 129 -1 -121 276 19 -13 -80 -143 -97 -151 66 -40 -49 -104 103 -17 4 157 352
6203 352 -284 11 -30 -248 42 40 -175 1 129 -40 132 -12 34 -23 44 -28 -74 37 432 -81 -30 106 -103
6226 -103 -24 129 -81 175 -31 18 53 -61 212 43 -251 14 50 -77 31 -274 205 -90 89 -227 -342
6247 -342 -86 204 195 -157 -88 -186 -107 88 72 11 -106 152 60 104 -97 -51 -169 171 204 193 123 -252 -57 286
6271 286 -150 323 105 219 116 -19 161 -151 -97 -184 85 195 -39 66 110 -67 -55 -18 250 -44 145 -181
6293 -181 248 -95 130 -104 -28 -73 -95 -216 113 247 -32 -33 -103 46 196 -245 -207 -21 -126 -44 11 -59 237
6316 237 -57 95 -43 -430 -72 139 -208 67 36 -98 -48 104 -79 116 161 40 -137 -5 75 -111 206
6337 206 -288 70 225 -84 158 -26 76 -45 117 85 -163 -13 -10 -8 22 105 -39 97 -41 8 169 8 -5
6360 -5 121 -162 2 87 -203 -44 -34 87 -287 0 47 116 -244 -117 10 -159 107 6 48 -22 -72 371 -97
6383 -97 78 -117 85 -32 15 -46 233 -36 -97 16 -116 112 -9 -62 71 52 -184 344 -57 54 -131 134
6405 134 -141 -77 -139 53 -118 -98 -29 73 211 123 135 107 -374 -5 -96 53 -21 -2 -49 152 121 153 -26 -55 158
6430 158 -116 127 -65 244 -149 2 196 128 -227 29 85 -42 38 59 -208 47 -157 279 -146 -108 224 -18
6452 -18 30 53 -58 11 -286 -337 187 -243 187 59 16 70 -160 238 -268 -185 224 -32 29 112 -139 -66 -114 140
6476 140 118 -21 -141 62 189 63 34 -118 46 -68 -15 -2 30 17 24 -101 53 26 -84 100 103 147 -149 -26
6500 -26 50 -44 63 84 -100 140 -231 -48 -91 -154 74 101 4 -108 -64 -37 25 170 23 155 -65 -225 -38 -17
6524 -17 181 41 -125 251 -203 -151 10 -154 105 93 -29 -138 58 5 30 -91 17 -63 -76 244 249 -48 -22
6547 -22 78 -39 -85 114 -194 55 -70 -261 51 -241 132 -13 -218 -208 -36 191 60 -7 17 -139 74 1
6569 1 62 83 18 -49 298 -355 70 116 85 35 57 -423 121 -247 -67 5 51 6 -243 -37 128 -164 296 33
6593 33 -83 62 25 -215 -146 86 -168 -273 -80 296 -169 -157 -326 45 -295 -215 -161 -52 -131 68 71 74 32 -158
6617 -158 -200 -75 -247 -150 4 110 54 157 126 168 -56 21 -108 -126 98 187 -329 -35 -79 138 -154 -173 185
6640 185 5 121 8 11 103 158 110 69 216 -40 -87 39 138 -116 57 -92 -218 96 194 231 -115 55 -135
6663 -135 5 -32 -278 18 -84 -14 -23 157 14 -35 124 117 115 117 -109 -168 -106 194 2 1 -87 -42 179 35 -102 145
6689 145 -203 -86 -148 -96 -137 -244 121 70 -324 -246 39 49 143 -165 447 -53 230 63 -486 -68 -43 207 61
6712 61 298 212 167 -26 -127 66 -21 91 297 -71 -79 -117 -66 230 209 62 60 57 363 67 178 -69 187 -87
6736 -87 198 97 -131 -145 -357 -147 179 -258 -258 -131 -42 226 12 -156 -315 139 61 82 -19 60 -20 21 26 237
6760 237 0 108 -137 -15 -53 -111 -88 77 103 65 53 -168 365 2 0 -189 -71 -113 93 -112 -28 86 174 124
6784 124 -88 -62 -89 30 -1 -1 39 -137 -24 206 251 -125 -33 84 39 186 -79 113 128 214 -83 39 -18 -153
6808 -153 -146 112 -14 -135 -263 24 123 -192 -206 78 -44 79 180 18 -112 117 120 4 -17 -303 -27 -92 -148
6831 -148 97 337 -19 9 126 167 126 -36 25 -429 -30 30 17 -13 153 108 -100 -13 -321 38 -73 -206 341
6854 341 -9 -119 16 6 -301 91 -165 -177 179 146 -4 218 -4 96 -199 21 127 91 -115 -245 242
6875 242 -188 109 78 -163 184 94 -87 178 -41 -404 165 49 238 -72 -199 37 -16 54 -113 -179 125 -38
6897 -38 -98 81 -87 49 12 -50 -40 -21 63 -8 -186 40 267 53 144 87 225 20 196 -63 34 31 -191 -18
6921 -18 -31 -264 101 -39 7 -176 106 282 0 -64 -165 191 -126 130 236 47 -39 -229 4 249 -180 -72
6943 -72 99 153 101 -179 -45 11 -88 -36 -94 213 -26 -133 -20 70 -226 -171 -101 168 108 -288 -52 101 -316 58
6967 58 106 -250 -99 -27 -98 -161 206 111 119 75 -61 -53 97 266 -65 -15 -102 108 160 -71 -115 -207 59 -137 -11
6992 -11 54 -66 177 -33 26 -243 -129 -161 13 -52 -1 -42 144 226 -242 -179 -44 -21 -70 321 -83 -81 136 -55
7016 -55 -147 -38 -251 72 -125 339 102 85 73 -48 -169 164 159 56 3 236 3 -418 39 -129 -18 -2 70
7039 70 85 -178 -100 -10 181 70 215 82 6 57 -106 -245 25 -358 -174 -56 -93 -29 187 -52 -300 -33 118
7062 118 -78 -164 221 140 151 194 -123 14 44 122 -36 124 262 -87 -198 129 -152 128 -78 -176 383 111
7084 111 133 106 -195 82 -9 78 -75 -16 -166 277 -284 -50 261 -478 -46 -179 12 -155 -141 -80 48 -22 -152
7107 -152 -99 80 -193 -248 -228 275 -113 -56 -53 72 4 -32 354 -75 87 0 191 59 22 -57 79 154 243 -65
7131 -65 145 -20 -169 -19 186 -19 121 -29 -129 -332 76 15 86 -136 172 -146 -85 -59 0 78 -509 127
7153 127 -175 160 -286 -15 -94 -96 -61 -133 -81 38 -4 19 219 -16 190 -298 -231 -170 9 184 -188 -36 285
7176 285 -7 -84 22 -86 234 -311 -330 108 -72 -247 146 -89 46 42 -109 -30 -109 224 -178 -74 -20 -52 22
7199 22 -200 47 106 105 -15 62 175 15 226 -17 200 51 13 -120 -64 -63 113 -251 -192 -26 103 -40 124
7222 124 44 121 109 -146 -295 55 -61 238 -145 57 -189 159 -21 -193 -12 -109 -30 -76 -9 -13 176 -64 77
7245 77 161 191 -75 -121 -107 18 -114 154 170 -200 92 -21 73 163 204 38 -125 435 129 -74 142 106 -60
7268 -60 78 -103 -159 -373 -62 -175 8 -74 110 -91 31 -110 31 -65 -27 -18 -78 385 35 171 -37 100 -9
7291 -9 -106 30 -195 80 48 63 -39 -100 32 -296 -191 97 52 -269 -114 31 50 -100 -171 294 36 -274 -53
7314 -53 338 -170 170 -112 17 234 -235 -74 278 -88 85 69 -253 27 -164 196 40 280 -305 12 -48
7335 -48 78 -366 189 10 -31 146 128 -190 -67 -39 91 350 6 50 -111 4 66 -2 -81 413 113 67 -16
7358 -16 136 126 -94 232 -70 -57 -2 17 34 43 89 223 -279 88 246 -145 117 -93 303 -172 113 -8 -60
7381 -60 -54 -119 256 143 -229 -64 38 -28 -56 0 -119 108 217 36 -121 -145 -117 57 190 160 8 91 -39 -208
7405 -208 73 -84 -207 -75 -75 65 -79 67 36 111 -243 -78 42 80 67 -189 -187 -68 -48 -273 -147 125 110
7428 110 -15 130 7 25 41 -7 -282 69 -85 67 71 -126 10 -87 -219 32 184 -16 69 181 -145 -264
7450 -264 125 14 50 112 -151 34 -12 149 129 213 53 -89 -145 10 -85 -67 159 -7 118 -14 86 -45 -256
7473 -256 -152 -75 171 115 -136 101 52 -407 145 -1 16 -115 -209 0 -240 -47 -138 -26 88 315 256 123
7495 123 76 -123 75 111 -99 213 76 18 268 -134 59 15 27 -24 -200 28 -182 48 149 -57 16 -136
7517 -136 62 -161 -147 -91 -123 4 -127 247 23 68 194 -207 -83 272 -120 68 -96 95 -18 -209 -107
7538 -107 -120 -114 54 -311 59 -23 15 -83 92 218 42 -24 -94 -91 -171 34 45 88 137 55 9 -67 -178 -19 -113 -155
7564 -155 -51 9 -253 -171 -58 70 -53 35 -108 134 -271 -74 -20 -28 181 -250 118 100 176 68 93 -109 77
7587 77 -137 38 -163 -138 227 168 376 -101 -278 348 77 293 200 158 12 -116 -248 106 -264 184 147 -293
7609 -293 141 5 -93 1 240 -123 210 -233 264 -56 -99 46 -150 171 -25 53 -44 14 139 282 223 -2
7631 -2 -107 103 -28 -62 -277 201 130 201 -77 203 137 -1 -52 -195 3 -288 170 -44 128 -209 86 70 24
7654 24 -94 -170 121 -64 -63 115 20 -200 12 102 -108 -229 54 -90 210 -216 -27 323 69 3 37 4 69
7677 69 22 142 -154 152 -225 95 -192 -247 106 -70 -197 -85 10 46 94 243 238 -170 -240 -144 -104 83 -189 218
7701 218 -146 -79 56 63 -83 -91 77 -236 -58 15 55 -163 12 164 217 258 142 311 -13 89 186 -103 -153 -105
7725 -105 -246 -52 -98 -30 74 107 145 221 198 146 196 154 352 -357 -240 89 41 66 -11 50 48 -174 -95 68 27 -20
7751 -20 31 -64 82 -56 336 -20 -315 118 -73 41 -344 -154 -29 216 -63 -58 10 4 111 126 -170 -124 -105 11
7775 11 195 -123 -7 -131 -229 101 -59 77 29 -172 -15 -107 -153 -29 -185 72 -14 196 80 162 113 -134 -55
7798 -55 -21 -148 55 9 118 225 41 -21 -81 -85 15 -314 92 29 -159 32 76 -75 -254 -104 273 53 25
7821 25 -28 60 13 -32 249 -318 -24 -4 69 83 61 53 88 -218 -81 -32 148 240 22 -81 -209 8 52 -21 275
7846 275 -38 -214 11 13 24 235 24 64 6 -259 132 141 35 51 -79 -21 -10 -176 0 63 194 -74 17 231
7870 231 94 -186 -50 -97 -14 -6 70 -68 77 -67 -56 -56 -75 -210 214 -27 176 71 -100 -122 -128 -154 238 98
7894 98 118 -26 13 100 -11 48 52 169 148 -341 -8 88 254 -239 21 3 -35 -42 -316 -81 352 -95 -133 175 98
7919 98 11 137 -81 126 303 298 -261 33 125 -347 -94 125 249 -76 50 -32 -127 40 -21 -29 -107 -3 -13 200
7943 200 -267 -36 -164 79 43 -12 -150 46 -78 97 -48 -194 0 -58 -89 -105 -64 -110 -137 -214 59 -201 -142
7966 -142 -71 -36 73 132 -105 -60 385 -247 -70 113 274 156 -90 220 -269 -288 -52 156 -63 28 -59 61
7988 61 76 111 138 -147 -102 -185 -107 97 -186 119 126 251 96 39 54 -68 106 103 -260 -109 29 -113 -114 -32 -23 37
8014 37 -94 230 265 145 -183 -77 -183 -15 -141 -133 -77 -226 78 -69 87 122 42 146 -74 -71 -70 -84 61 11
8038 11 -235 -72 133 -73 163 -86 211 -86 -145 120 -163 -52 85 -54 -53 69 26 -132 -148 228 259 -34
8060 -34 58 -105 233 108 249 -19 -160 -198 -187 44 -62 44 182 3 128 31 -74 -117 -92 -8 85 -36 -369
8083 -369 244 27 119 193 -115 -101 64 -27 -55 110 94 131 6 174 10 -143 21 -63 -193 13 -138 153 79
8106 79 -3 -115 -57 165 -85 84 -126 -130 115 57 -28 -262 -57 100 25 99 -40 131 -244 -24 201 -15 122
8129 122 -252 -52 -248 4 140 -153 -164 -50 67 359 -58 69 -175 35 -186 37 23 -40 116 103 81 -53
8151 -53 -108 -138 -16 117 121 -53 -81 63 325 -258 -87 136 227 -14 -76 -59 -244 113 -243 314 28 -46 -128 -28
8175 -28 -134 34 67 -8 194 -44 179 107 42 -315 -98 173 -264 -88 35 81
8191H1
##END NTUPLES=NMR FID
##END=
