##TITLE=1H_Pr urea-C
 CDCl3, 8 sc, 
 29.07.2021
##JCAMPDX= 6.0         $$ Bruker NMR JCAMP-DX V2.0
##DATA TYPE= NMR FID
##DATA CLASS= NTUPLES
##ORIGIN= UXNMR, Bruker Analytische Messtechnik GmbH
##OWNER= root
$$ XWIN-NMR		Version 3.5
$$ Thu Jul 29 11:49:03 2021 Russian Standard Time (UT+4h)  she@DPX200
##.OBSERVE FREQUENCY= 200.131506
##.OBSERVE NUCLEUS= ^1H
##.DELAY= (6, 6)
##.ACQUISITION MODE= SIMULTANEOUS
##.ACQUISITION SCHEME= undefined
##.AVERAGES= 8
##.DIGITISER RES= 18
##SPECTROMETER/DATA SYSTEM= spect
##.PULSE SEQUENCE= zg30
##.SOLVENT NAME= CDCl3
##.SHIFT REFERENCE= (INTERNAL, CDCl3, 0, 15.7039)
##AUDIT TRAIL= $$ (NUMBER, WHEN, WHO, WHERE, WHAT)
$$ ##TITLE= Audit trail, XWIN-NMR		Version 3.5
$$ ##JCAMPDX= 5.01
$$ ##ORIGIN= Bruker BioSpin GmbH
$$ ##OWNER= she
$$ F:/spectra/data/she/nmr/H-F/1/audita.txt
$$ ##AUDIT TRAIL=  $$ (NUMBER, WHEN, WHO, WHERE, WHAT)
(   1,<2021-07-29 11:47:43.62 +0400>,<she>,<DPX200>,
      <created by zg, POWCHK disabled, PULCHK disabled
       configuration hash MD5:
       00 E9 B6 7A A2 85 ED C7 34 08 36 98 17 FE 4E 26
       data hash MD5: 16K
       A3 2E C7 4B 09 62 E5 28 83 F2 0F 1D 1E 71 28 7B>)
$$ ##END=
$$ 
$$ hash MD5
$$ B2 39 BB F0 62 83 58 00 00 E0 7A 79 C5 5E F8 47
##$RELAX= 
##$RELAX= 
##$RELAX= 
##$RELAX= 
##$RELAX= 
##$RELAX= 
$$ Bruker specific parameters
$$ --------------------------
##$DU= <F:/spectra>
##$EXPNO= 1
##$NAME= <H-F>
##$PROCNO= 1
##$TYPE= <nmr>
##$USER= <she>
##$AMP= (0..31)
100 100 100 100 100 100 100 100 100 100 100 100 100 100 100 100 100 100 
100 100 100 100 100 100 100 100 100 100 100 100 100 100 
##$AQSEQ= 0
##$AQ_mod= 1
##$AUNM= <au_zg>
##$AUTOPOS= <>
##$BF1= 200.13
##$BF2= 200.13
##$BF3= 200.13
##$BF4= 200.13
##$BF5= 200.13
##$BF6= 200.13
##$BF7= 200.13
##$BF8= 200.13
##$BYTORDA= 1
##$CFDGTYP= 0
##$CFRGTYP= 5
##$CHEMSTR= <none>
##$CNST= (0..31)
1 1 145 1 1 1 1 1 1 1 1 1 1 1 1 1 1 1 1 1 1 1 1 1 1 1 1 1 1 1 1 1 
##$CPDPRG= <>
##$CPDPRG1= <>
##$CPDPRG2= <>
##$CPDPRG3= <>
##$CPDPRG4= <mlev>
##$CPDPRG5= <mlev>
##$CPDPRG6= <mlev>
##$CPDPRG7= <mlev>
##$CPDPRG8= <mlev>
##$CPDPRGB= <>
##$CPDPRGT= <>
##$D= (0..31)
0 1.2 0 0 0 0 0 0 0 0.06 0 0.03 0 0 0 0 0.0002 0 0 0 0 0 0 0 0 0 0 0 0 
0 0 0 
##$DATE= 1627544863
##$DBL= (0..7)
120 120 120 120 120 120 120 120 
##$DBP= (0..7)
150 150 150 150 150 150 150 150 
##$DBP07= 0
##$DBPNAM0= <>
##$DBPNAM1= <>
##$DBPNAM2= <>
##$DBPNAM3= <>
##$DBPNAM4= <>
##$DBPNAM5= <>
##$DBPNAM6= <>
##$DBPNAM7= <>
##$DBPOAL= (0..7)
0.5 0.5 0.5 0.5 0.5 0.5 0.5 0.5 
##$DBPOFFS= (0..7)
0 0 0 0 0 0 0 0 
##$DE= 6
##$DECBNUC= <off>
##$DECIM= 32
##$DECNUC= <off>
##$DECSTAT= 4
##$DIGMOD= 1
##$DIGTYP= 9
##$DL= (0..7)
0 120 120 120 120 120 120 120 
##$DP= (0..7)
150 150 150 150 150 150 150 150 
##$DP07= 0
##$DPNAME0= <>
##$DPNAME1= <>
##$DPNAME2= <>
##$DPNAME3= <>
##$DPNAME4= <>
##$DPNAME5= <>
##$DPNAME6= <>
##$DPNAME7= <>
##$DPOAL= (0..7)
0.5 0.5 0.5 0.5 0.5 0.5 0.5 0.5 
##$DPOFFS= (0..7)
0 0 0 0 0 0 0 0 
##$DQDMODE= 0
##$DR= 18
##$DS= 0
##$DSLIST= <SSSSSSSSSSSSSSS>
$$ [...]
##$SUBNAM2= <"">
##$SUBNAM3= <"">
##$SUBNAM4= <"">
##$SUBNAM5= <"">
##$SUBNAM6= <"">
##$SUBNAM7= <"">
##$SUBNAM8= <"">
##$SUBNAM9= <"">
##$SW= 20.0188882624521
##$SWIBOX= (0..15)
0 0 2 0 0 0 0 0 0 0 0 0 0 0 0 0 
##$SW_h= 4006.41025641026
##$TD= 16384
##$TD0= 1
##$TE= 0
##$TE2= 300
##$TE3= 300
##$TEG= 300
##$TL= (0..7)
0 120 120 120 120 120 120 120 
##$TP= (0..7)
150 150 150 150 150 150 150 150 
##$TP07= 0
##$TPNAME0= <>
##$TPNAME1= <>
##$TPNAME2= <>
##$TPNAME3= <>
##$TPNAME4= <>
##$TPNAME5= <>
##$TPNAME6= <>
##$TPNAME7= <>
##$TPOAL= (0..7)
0.5 0.5 0.5 0.5 0.5 0.5 0.5 0.5 
##$TPOFFS= (0..7)
0 0 0 0 0 0 0 0 
##$TUNHIN= 0
##$TUNHOUT= 0
##$TUNXOUT= 0
##$USERA1= <user>
##$USERA2= <user>
##$USERA3= <user>
##$USERA4= <user>
##$USERA5= <user>
##$V9= 5
##$VALIST= <valist>
##$VCLIST= <CCCCCCCCCCCCCCC>
##$VD= 0
##$VDLIST= <DDDDDDDDDDDDDDD>
##$VPLIST= <PPPPPPPPPPPPPPP>
##$VTLIST= <TTTTTTTTTTTTTTT>
##$WBST= 1024
##$WBSW= 4
##$XGAIN= (0..3)
0 0 0 0 
##$XL= 0
##$YL= 0
##$YMAX_a= 133759
##$YMIN_a= -158538
##$ZGOPTNS= <>
##$ZL1= 120
##$ZL2= 120
##$ZL3= 120
##$ZL4= 120
##$ABSF1= 10
##$ABSF2= 0
##$ABSG= 5
##$ABSL= 3
##$ALPHA= 0
##$AQORDER= 0
##$ASSFAC= 0
##$ASSFACI= 0
##$ASSFACX= 0
##$ASSWID= 0
##$AUNMP= <proc_1d>
##$AZFE= 0.1
##$AZFW= 0.1
##$BCFW= 1
##$BC_mod= 2
##$BYTORDP= 1
##$COROFFS= 0
##$CY= 11.3945322036743
##$DATMOD= 1
##$DC= 2
##$DFILT= <>
##$DTYPP= 0
##$F1P= 2.36226072786647
##$F2P= -0.459571619588291
##$FCOR= 0.5
##$FTSIZE= 0
##$FT_mod= 4
##$GAMMA= 1
##$GB= 0.15
##$INTBC= 1
##$INTSCL= 1
##$ISEN= 128
##$LB= 0.24
##$LEV0= 0
##$LPBIN= 0
##$MAXI= 10000
##$MC2= 0
##$MEAN= 0
##$ME_mod= 0
##$MI= 1.114404
##$NCOEF= 0
##$NC_proc= 0
##$NLEV= 6
##$NOISF1= 3.799351
##$NOISF2= 2.8
##$NSP= 1
##$NTH_PI= 0
##$NZP= 0
##$OFFSET= 15.70392
##$PC= 1
##$PHC0= -12982.9
##$PHC1= -4.199007
##$PH_mod= 1
##$PKNL= yes
##$PPARMOD= 0
##$PSCAL= 0
##$PSIGN= 0
##$REVERSE= no
##$SF= 200.130013532006
##$SI= 16384
##$SIGF1= 3
##$SIGF2= 2
##$SINO= 400
##$SIOLD= 16384
##$SREGLST= <1H.CDCl3>
##$SSB= 0
##$STSI= 0
##$STSR= 0
##$SW_p= 3612.71676300578
##$SYMM= 0
##$S_DEV= 0
##$TDeff= 0
##$TDoff= 0
##$TI= <>
##$TILT= no
##$TM1= 0
##$TM2= 0
##$TOPLEV= 0
##$USERP1= <user>
##$USERP2= <user>
##$USERP3= <user>
##$USERP4= <user>
##$USERP5= <user>
##$WDW= 1
##$XDIM= 8192
##$YMAX_p= 0
##$YMIN_p= 0
$$ End of Bruker specific parameters
$$ ---------------------------------
##NTUPLES= NMR FID
##VAR_NAME=  TIME,          FID/REAL,        FID/IMAG
##SYMBOL=    X,             R,               I
##VAR_TYPE=  INDEPENDENT,   DEPENDENT,       DEPENDENT
##VAR_FORM=  AFFN,          ASDF,            ASDF
##VAR_DIM=   8192,          8192,            8192
##UNITS=     SECONDS,       ARBITRARY UNITS, ARBITRARY UNITS
##FACTOR=    0.0002496,     1,               1
##FIRST=     0,             0,               0
##LAST=      2.0444736,     0,               0
##MIN=       0,             -158538,         0
##MAX=       2.0444736,     133759,          0
$$ Real data points
##PAGE= N=1
##DATA TABLE= (X++(R..R)), XYDATA
$$ [...]
1849b099J790L105l384j496L225m7k323J589N26j672J325J183k497n4K577j187
$$ -2099 -309 2796 -588 -2084 1141 1094 -1229 360 886 -786 539 1722 -775 -829 1748 561
1865E61j395J260P9j061J691m80k012J778J429k241o57K457m82j797J444J06j383
$$ 561 -834 426 505 -556 1135 655 -1357 421 1850 -391 -1048 1409 927 -870 574 680 -703
1882g03R43Q44j877Q1K099j116j256J181R8o04M12mj039J246N36j605K18J446
$$ -703 240 1084 -793 -712 1387 271 -985 196 294 -310 102 98 -941 305 841 -764 -546 900
1900I00j015p97J041j6j051P44O48j209N8J208n87q86J013L38p31J77J99m48L75
$$ 900 -115 -912 129 113 -938 -194 454 -755 -697 511 -76 -962 51 389 -342 -165 34 -414 -39
1919c9Q5n07J64O68o57k61J131n05m90P81J45j226N23O89m79o51J059Np35L3N01
$$ -39 46 -461 -297 371 -286 -547 584 79 -411 370 515 -711 -188 501 22 -629 430 435 -300 -267 234
1940B34j19k20K15J66k0rl2P8L8k28PM00j61n56N72K81n02j94N98j55n44J88M59
$$ 234 115 -105 110 276 256 247 215 293 331 103 110 510 349 -207 365 646 144 -50 548 393 -151 37 496
1963D96j2m13K54Q3m69j9L65m3R0l87K56P2m03l64O02J72m54L4N65k87n97N29
$$ 496 484 71 325 408 -61 -80 285 242 332 -55 201 273 -130 -494 108 280 -174 -140 425 138 -459 70
1985G0j4m37J47M79k73m28M02J43l00l56M01k5J2O5j33J05J61l13j23O25o55n2
$$ 70 56 -381 -234 245 -28 -456 -54 89 -211 -567 -166 -191 -179 -114 -247 -142 19 -294 -417 208 -447 -499
2007d99P24j52o62M49K20m54j1N15J28n28J57J75j73K60J00l53k1J47k95M07J23
$$ -499 225 73 -589 -140 80 -374 -385 130 258 -270 -113 62 -111 149 249 -104 -125 22 -273 134 257
2028B57m15J49N58o50n19R22K85j055L39P71n56k05Q30o38o35Q66L44p18J76K94
$$ 257 -158 -9 549 -101 -620 302 587 -468 -129 642 86 -119 711 73 -562 304 648 -70 106 400
2048D00l94L61p5l81J31O75p32m88J088j30j223Q85O86r86n6Q24q70k31J259j30
$$ 400 6 367 292 -89 42 717 -15 -503 585 455 -768 117 803 -183 -239 585 -285 -516 743 613
2068F13j462M05R67o61l6K21m09K93O85r77o95J691k58j362O81Q18j215L90R16
$$ 613 -849 -444 523 -138 -174 47 -362 -69 616 -361 -1056 635 377 -985 -304 514 -701 -311 605
2087F05j376j81J873p30j552J240J033j557l2R22o90J18R17j208m09J860j98j968
$$ 605 -771 -952 921 191 -1361 -121 912 -645 -677 245 -445 -327 590 -618 -1027 833 635 -1333
2105a333J227R79j426J61J008j424MK422j410j985K216J217k565J30J801j130
$$ -1333 -106 873 -553 -392 616 -808 -804 1618 208 -1777 439 1656 -909 -779 1022 -108
2121a08P5J116j637n90K543k49k398J053J627j669L2J000j588O80K173k017k166
$$ -108 -33 1083 -554 -1144 1399 1150 -1248 -195 1432 -237 -205 795 -793 -113 2060 43 -2123
2138b123L094R04l126N34K097j464l26J473j486p78L053p34l192K019J780k110
$$ -2123 971 1875 -1251 -717 1380 -84 -410 1063 -423 -1201 1852 1118 -2074 -55 1725 -385
2154c85j02J058r84M14J684k310j585L716L01l823J050K283j578k08J438j941
$$ -385 -487 571 -413 1 1685 -625 -2210 1506 1807 -2016 -966 1317 -261 -469 969 -972
2170i72k69L079j090l484K560K312l099l11J746j034M83J439k841m02L805n77
$$ -972 -1241 1838 748 -2736 -176 2136 -963 -1274 472 -562 -79 1360 -1481 -1883 1922 1345
2186A345l658J422K323j855k35J454k068L59L374k401l266L843J968l857j54K547
$$ 1345 -2313 -891 1432 -423 -658 796 -1272 -913 2461 60 -3206 637 2605 -1252 -1406 1141
2202A141j197qJ431k633l73L667q34l871K294K656k429m67J525j736N27K951k807
$$ 1141 -56 -64 1367 -1266 -1639 2028 1194 -2677 -383 2273 -156 -623 902 -834 -307 2644 -163
2219a63k828M476J051m173M07K962j497n30J484k308P9L494j705l543K872K322
$$ -163 -2991 1485 2536 -1637 -1230 1732 235 -295 1189 -1119 -1040 2454 749 -2794 78 2400
2235B400k696p53K009j585N26K589l238j917M732N05n190J494L111j758j118J880
$$ 2400 -296 -1049 960 -625 -99 2490 -748 -2665 2067 2572 -2618 -1124 1987 229 -889 991
2251I91k122L9L328j739l394L267J999l360k19J885j243L29J640k736p46M413
$$ 991 -1131 -1092 2236 497 -2897 370 2369 -991 -1210 675 -568 -239 1401 -1335 -2081 2332
2267B332o56m480J959K826k278p46J869j657j96K993j901l155L649J805l649j09
$$ 2332 1676 -2804 -845 1981 -297 -1043 826 -831 -1027 1966 65 -3090 559 2364 -1285 -1394
2283a394K399j034l17J402k275j85L535j031l654K180K454k458o97J870j263j55
$$ -1394 1005 -29 -346 1056 -1219 -1404 2131 1100 -2554 -374 2080 -378 -1075 795 -468 -623
2299f23K724k458k133L716J058l740K44K682j088n98J022j635k9K862j267l028
$$ -623 2101 -357 -2490 1226 2284 -1456 -1212 1470 382 -216 806 -829 -858 2004 737 -2291
2315b291K802J944l159o5J592j263K95J732k070j452L377L55l317O39K515j517
$$ -2291 511 2455 -704 -769 823 -440 -145 1587 -483 -1935 1442 1797 -1520 -881 1634 117
2331A17o66J304j124m46K506j245k543K707J268k668j08J605j026j42J434j634
$$ 117 -549 755 -369 -815 1691 446 -2097 610 1878 -790 -898 707 -319 -461 973 -661
2347f61p88K824l13l049J288K085j726o15J429p83k29J594j214j470J838Q95k016
$$ -661 -1449 1375 1062 -1987 -699 1386 -340 -955 474 -309 -538 1056 -158 -1628 210 1105 -911
2364i11J77J469r29l3Q41r13p66K266n27k434J465J517j911m10J664p26m34J283
$$ -911 -734 735 -194 -227 614 -299 -1065 1201 674 -1760 -295 1222 -689 -1099 565 -161 -595 688
2382F88o82j018J434N22j713J27J298m77l64L81l35k26J416o23j369J120R30j704
$$ 688 6 -1012 422 944 -769 -642 656 179 -185 196 -139 -365 1051 428 -941 179 1109 -595
2400e95L31J148p77m34J144o52q84J270K50j381L00Q70l12m10M27k15l34P82l81
$$ -595 -264 884 107 -327 817 165 -719 551 801 -580 -280 590 278 -132 295 80 -254 528 147
2419A47n89Q85L73j322J08R97p12k08J012q19n10J190j15j313P29P49o35m83O39
$$ 147 -442 443 816 -506 -398 599 -113 -321 691 -128 -638 552 437 -876 -147 602 -33 -516 123
2438A23m6l03K62o1m27N95l9m27n4N70m41m4O33o84l1Q15l45p72L28O73m59l50
$$ 123 77 -226 36 -25 -452 143 104 -323 -377 193 -248 -292 341 -343 -374 441 96 -676 -348 325 -134 -484
2460d84N69j00j36M7K16m71M74m1j34P8j80J78p0J83k97K6L44k15m65O55J01m83
$$ -484 85 -15 -151 -104 112 -359 115 74 -60 18 -162 16 -54 129 -168 -142 202 -13 -478 177 278 -205
2482b05p5P76j91l57P9L12j78j00K0k2J10j3j5l2N8k14K83J56m95P9K53J70l10
$$ -205 -280 496 305 -52 27 339 161 61 81 59 169 156 141 109 167 -47 236 392 -103 -24 229 399 89
2505H9j44M99l24j01J35P4l41J30L29k28l96M55k5l21N7R8m2R7j56k8J71m9k51
$$ 89 -55 444 120 19 154 228 -113 17 346 118 -278 177 152 -169 -112 -14 -56 41 -115 -143 28 -21 -272
2528b72K84N3k02q5M15j67m60N66P7k18k72L26q2k38K40J91j42k25J52r5rJ3k8
$$ -272 12 65 -137 -222 193 26 -434 132 209 -9 -281 45 -37 -275 -35 156 14 -211 -59 -154 -163 -150 -178
2551a78K43k10j88M33K15m91oK04J34l64m0L40l12L9M65k49k49J2M59l82J28J93
$$ -178 65 -145 -333 100 315 -176 -182 22 156 -208 -248 92 -220 -181 284 35 -214 -202 257 -125 3 196
2573A96k07J72n2k99M29L14l55m17M90kl59L47N3o09N09J18m57j91N99Q6n10J70
$$ 196 -11 161 109 -190 239 553 198 -219 271 269 -90 257 310 -299 210 328 -129 -320 279 365 -145 25
2595B5K62o7o2K3k72Q0L46m07j50M67l8m63K29J28l63O14R1p33j41J033m63p23
$$ 25 287 220 158 181 -91 -11 335 -72 -222 245 207 -256 -27 101 -262 352 443 -290 -431 602 139 -584
2617e84N16L16m37P4J83k11K00L32q24o8O32j07l64L81l2n59O54J43j157O65R72
$$ -584 -68 248 -189 -115 68 -143 57 389 -435 -503 129 22 -342 39 7 -552 102 245 -912 -247 725
2638G25p05o06N97L32p86J77N13o20K71N27q40p3J013j95q09M64K66m90M89m3
$$ 725 20 -586 11 343 -443 -266 247 -373 -102 425 -415 -488 525 330 -479 -15 251 -239 250 207
2658B07q48O39Q95j040o62J223K08j058M68M34r31P88M63j278j13J471m10j028
$$ 207 -641 -2 893 -147 -809 414 622 -436 32 466 -465 323 786 -492 -605 866 456 -572
2676e72O99M60q72N04l1r42Q94R66j612m25J640n5j124O73N0q00P26O30j426Q6
$$ -572 127 587 -285 219 188 -754 140 1106 -506 -931 709 654 -470 203 253 -547 179 809 -617 -531
2696e31J615r10r96P05N39p78M16m4o61Q48P99j586m08J679l02j115N15N18j109
$$ -531 1084 174 -822 -117 422 -356 60 16 -645 203 1002 -584 -992 687 385 -730 -215 303 -806
2715h06R39L47j727P11J932j342j258J578K50j061K34L07m78N26P61j820J22J533
$$ -806 133 480 -1247 -536 1396 54 -1204 374 624 -437 -203 104 -374 152 913 -907 -785 748
2733G48m02j310R38L09n68M40P0j354Q30J913j599j313J855K64j508Q01L42q70
$$ 748 346 -964 -26 283 -285 155 225 -1129 -299 1614 15 -1298 557 821 -687 114 456 -414
2751d14P89N50j725L43J687o30j711J200N30j045O72J77j157R74J359j932q20
$$ -414 375 925 -800 -457 1230 600 -1111 89 619 -426 246 423 -734 240 1599 -333 -1153
2768a153J905J59j569P52N25q69O49K94j602M39J631r24j571J583N18j246P23
$$ -1153 752 911 -658 94 619 -250 399 693 -909 -470 1161 237 -1334 249 767 -479 244
2785B44o4j017J128J072k067k71K098n76j771J102N74r72Q64K54j628O33J704
$$ 244 180 -837 291 1363 -704 -975 1123 547 -1224 -122 452 -520 344 598 -1030 -397 1307
2802A307j574j046J391P27j360K46M00q25R85L94j522q8K065o46j762J375N20
$$ 1307 -267 -1313 78 805 -555 -309 91 -734 251 645 -877 -965 1100 454 -1308 67 587
2819E87r71N28J68j292P45J651j734q51J599L35j298K99M64m74N47K82j433K41
$$ 587 -384 144 312 -980 -235 1416 -318 -1169 430 765 -533 -234 230 -244 303 585 -848 -607
2837f07J691p86j567J416M61r47N38K18j086Q26J053j595q88J919L3j403O09M80
$$ -607 1084 298 -1269 147 608 -339 199 417 -669 157 1210 -385 -1273 646 679 -724 -115 365
2855C65o06M14K38r59M16J334j313r83J380K52q67L53N3o82Q76O07j501n5J747
$$ 365 -241 173 411 -548 -132 1202 -111 -1094 286 538 -329 24 77 -605 271 878 -623 -678 1069
2874A069n39j457R52O23j082L02L47o17K01R41q75p92J286Oo66K72N8m54Q04K57
$$ 1069 530 -927 25 648 -434 -132 215 -402 -201 740 -135 -927 359 365 -301 -29 29 -425 379 636
2894F36j201n8J450n70j277J002M46p79K17K63n52J19Q70p15n63J014J99q10K27
$$ 636 -565 -623 827 257 -1020 -18 428 -351 -134 129 -423 -304 566 -149 -712 302 501 -309 -82
2913h2R8k34J41M34q67R2J130o83p00R21J35p06J10M13m16K22N95p94j55R42k67
$$ -82 16 -218 -77 357 -510 -418 712 29 -671 250 385 -321 -211 202 -214 8 603 -191 -346 596 329
2934C29p68M79K13j3j39P9n33K35O58m81k57L49J86o74L38L89m79M9O06p24k24
$$ 329 -439 40 253 240 101 180 -353 -118 540 59 -198 151 337 -337 1 390 -89 -40 566 -158 -382
2955c82Q81l15l99J30M40m48K5L91l50J18K45n60p2N15j26l57L95J24n90J93M22
$$ -382 499 184 -215 -85 355 -93 -68 323 -27 91 336 -224 -296 219 93 -264 131 255 -335 -142 280
2976B80m85j90P41k9p56L44K57n42K05L03j81k49K25J21k88J86J52l02j8mJ5J61
$$ 280 -205 -395 346 317 -439 -95 162 -380 -175 128 -53 -302 -77 44 -244 -58 94 -208 -226 -230 -215 -54
2998e4K11m16K62L04m44k50L45Pk30M7L60j32j42M9K07j74n3J01k01K10n1J48
$$ -54 157 -259 3 307 -137 -387 -42 -35 -265 -218 142 10 -132 -83 124 -50 -103 -2 -203 7 -44 104
3020A04p8L1k32PJ81L66o43L19J22j78l3L19k96J41nk07R3J06J06j48q9K27j95
$$ 104 26 57 -175 -168 13 379 -264 55 177 -1 -34 285 -11 130 125 -82 11 117 223 75 -14 213 18
3043A8l5l8J13K02k08p2J66M6m7k32K43k51O4L5L59l40l32M44j40N6j39K00k72
$$ 18 -17 -55 58 260 52 -20 146 192 145 -87 156 -95 -31 4 363 23 -309 135 -5 51 -88 112 -160
3066a60J56j9j02K25k40K20j05Jp7Rk5OL8mM4n3j04J10J8k05K82k35K12k14j9
$$ -160 -4 -23 -125 100 -140 80 -25 -24 -101 -92 -117 -111 -73 -77 -33 -86 -190 -80 -62 -267 15 -220 -8 -222 -241
3091b41M40m78K18J16rk33N2J36P7j21JR1o4j09J22J83j7j45L4J95m09J06K17
$$ -241 199 -279 -61 55 46 -187 -135 1 78 -43 -42 49 -15 -124 -2 181 164 19 53 248 -161 -55 162
3114A62J4l38J57K67j78K9N7k9P9j47l12L07Q3j45p2K51k63Q6J26o1k91K20L38
$$ 162 176 -162 -5 262 84 113 170 141 220 73 -239 68 151 6 -66 185 -78 8 134 73 -218 2 340
3137C40l15j1K30k17m05L20Q9j41J16n2m5J64mK4m4L8j70K5J44l3k55K36q2l47
$$ 340 25 14 244 27 -378 -58 31 -110 6 -46 -91 73 69 93 49 87 -83 -58 86 53 -202 34 -48 -395
3161c95L88L91l57l68L44O0k5l2j70r0K20K52k70j81M23m11K2K35p0j16K47m2
$$ -395 -7 384 27 -341 3 63 38 6 -164 -254 -34 218 -52 -233 190 -221 -199 36 -34 -150 97 55
3183E5k77K90L53n11k63N75j03k00K05l30P4J94N4nm2K40j72j63K74j93l60P26
$$ 55 -222 68 421 -90 -353 222 119 -81 124 -206 -132 62 116 111 69 309 137 -26 248 55 -305 421
3205D21m24k59L98M8k56k47Q19o20k4N09k89l94O77j13n50R8N43k11k74K58k93
$$ 421 -3 -262 136 184 -72 -319 500 -120 -144 365 76 -318 359 246 -304 -206 337 126 -148 110 -183
3226a83L5M61j36m48L95J50n00j45P77n30k52O17k06l51N39J34r97L69R39o15
$$ -183 -148 313 177 -271 124 274 -226 -371 406 -124 -376 241 35 -316 223 357 -640 -271 668 53
3246E3n13N26J45n33K98Km65P50L8p64J73O19l79QK52l91J8N73l27p91N12P50
$$ 53 -460 66 211 -322 -24 -22 -487 263 301 -463 -290 329 -50 -42 210 -181 -163 410 83 -708 -196 554
3268E54n58l59M53j36j02M05l34k44M17J27n63R3O50m95j49K35kj48O03o29k10
$$ 554 -4 -363 90 -46 -148 257 -77 -321 96 223 -340 -247 403 -92 -241 -6 -8 -156 447 -182 -392
3289c92O82L97q16k1M64k99j27J58j05l55O98J83r06M20O39n76n16M36J47k3M05
$$ -392 290 687 -129 -150 314 15 -112 46 -59 -414 284 467 -439 -19 620 44 -472 -36 111 88 493
3310D93o31m06R23K82j153K76N15q2m51N26l70j76O95k39p42M14R67q69l46M84
$$ 493 -138 -544 379 661 -492 -216 299 217 -234 292 -78 -254 441 202 -540 -126 841 -28 -374 110
3330A10p1J16K83m50k70N08O2q30J95R17o28l89P37k39l74Q09k86r83P18N39p83
$$ 110 39 155 438 -12 -282 226 288 -542 -347 570 -58 -447 290 51 -323 486 200 -783 -65 474 -309
3351c09p7N36Mm43N96o80j15O98J17r24K01P90n48k04N43m03j59N95j68o44N84
$$ -309 -386 150 154 -289 307 -373 -488 210 327 -597 -396 394 -154 -358 185 -218 -377 218 50 -594 -10
3372a0O71r98PP98l64k60L62j53k16M59j46o89L67O59m34l67M08j73o8M33m29
$$ -10 661 -337 -330 468 104 -156 206 53 -163 296 150 -539 -172 487 53 -314 94 -79 -147 286 -143
3393a43j63N26L52p72j05O69j66o19M52O1k11L43J66n95L41K31l30j69J99P6k84
$$ -143 -306 220 572 -200 -305 364 198 -421 31 92 -119 224 390 -205 136 367 37 -132 67 143 -141
3414a41L11k37j99O87M3q59K54M02l58j76M05o1k66N17l84m19K97N17n11j48O11
$$ -141 170 -67 -266 421 464 -395 -141 261 -97 -273 132 71 -195 322 -62 -481 -184 333 -178 -326 285
3435B85k07l80L57N5l78L67J22p16L47N50m80k41L83r8r7K05k6l12L99J76n66
$$ 285 78 -302 55 110 -268 99 221 -495 -148 402 -78 -319 64 -34 -131 74 48 -264 135 311 -255
3456b55L9M02O2n68K53P1j87M03k14j96J76M69m68j89L52j2k30K88j13k73M93
$$ -255 -216 186 248 -320 -67 4 -183 220 6 -190 -14 455 -13 -202 150 138 -92 196 83 -190 303
3477C03n6o51J59L86j60k03M72n4j2q8J73l54J46K48k50r3K46k70QL04j87j43
$$ 303 247 -404 -245 141 -19 -222 250 196 184 96 269 -85 61 309 59 -34 212 -58 -50 254 67 -76
3499g6J73n5j46K17l8n3k58K95J39j67J10k25N2kP9k16p2K79J71l25J54j47l1
$$ -76 97 42 -104 113 75 22 -236 59 198 31 141 -84 -32 -34 45 -171 -243 36 207 -118 36 -111 -142
3522a42M43m50n7J30L85m19L4J12j66Mo6L61m21J25K95l5r5N8q7j92K37k2r8J19
$$ -142 301 -149 -206 -76 309 -110 -76 36 -130 -126 -192 169 -252 -127 168 133 38 96 9 -183 54 32 -66 53
3546E3j46l8N9K65j85m2M4J13j26K18j62j62J72J20k75k10M10j4k21p5K69j04
$$ 53 -93 -131 -72 193 8 -34 10 123 -3 215 53 -109 63 183 -92 -302 108 94 -127 -202 67 -37
3568c7Rk43K38j40J99o3O8K50k51l2l0J10q9K87k18j59J58K22l40q3K94j11k0
$$ -37 -28 -271 -33 -173 26 -37 31 281 30 -2 -32 78 -11 276 58 -101 57 279 -61 -144 150 39 19
3591A9j23J34p9N1j39K65n0j14n8K3R0O5k51K58o4k61J53K25k0k20j17J20N6k97
$$ 19 -104 30 -49 2 -137 128 78 -36 -94 -71 19 84 -167 91 27 -234 -81 144 124 -96 -213 -93 -37 -334
3615c34L41R0j47n8J10j69o1L60k46K60q6j22L48m43NJ44K1R7j42j57P3qJ45n9
$$ -334 7 97 -50 -108 2 -167 -228 132 -114 146 60 -62 286 -157 -152 -8 13 110 -32 -189 -116 -124 21 -38
3639c8J07pn8J99j49j12J64k72L08n3k00K1Q9J6j5m9K19r5J10j27J02J15l3l70
$$ -38 69 62 4 203 54 -58 106 -166 142 89 -111 -90 -1 15 0 -49 170 75 185 58 160 275 242 -128
3663a28Q1J69l0j17L18j99r6L33j67j35P3k29J54O8L3j17k0l7p8j51L28j23j19
$$ -128 -47 122 92 -25 293 94 -2 331 164 29 102 -127 27 95 128 11 -9 -46 -124 -275 53 -70 -189
3686a89K56J40n3k60J48r8k6J46J66m72P8K05o8K19q0l26L40j13j63J26J20l18
$$ -189 67 207 154 -106 42 -56 -82 64 230 -242 -164 41 -27 192 112 -214 126 13 -150 -24 96 -222
3708b22N3R6J82j82p7L05j26k04K22k06N2Q3m3j07K4J16O6K4k25J18K6Q8N5l46
$$ -222 -169 -73 109 -73 -150 155 29 -175 47 -159 -107 -24 -67 -174 -150 -34 32 56 -169 -51 -25 63 118 -228
3732b28L27Ok07J61J71m86J14K78j65r6M33k04k71K61L3k32p8L87l20J27J40k60
$$ -228 99 105 -102 59 230 -256 -142 136 -29 -125 308 104 -167 94 127 -105 -183 204 -116 11 151 -109
3754a09r9L01J10k83L8K47j10pJ21k8k95M56j89k87k7L63k00l64M94k01RK47k43
$$ -109 -208 93 203 -80 -42 205 95 88 209 181 -114 342 153 -134 -161 202 2 -362 132 -69 -60 187 -56
3777e6j69L75j40l11L01J37k01k4K30k88p0N12l17k29K07L38m48K5L08l09J54
$$ -56 -225 150 10 -301 0 137 -64 -88 142 -146 -216 296 -21 -250 -43 295 -153 -128 180 -129 25
3798B5Q3j12j89L04j8l00J29K11q8j08J80k48m2M40l01q4J16O5p7j95N24l11J29
$$ 25 108 -4 -193 111 93 -207 -78 133 45 -63 117 -131 -173 267 -34 -118 -2 63 -14 -209 315 4 133
3821A33J24j91k92N79k03m69N1L77j64J7m8l1J18J90j34n33M58L38n35J97J87
$$ 133 257 66 -226 353 150 -319 -268 109 -55 -38 -86 -117 1 191 57 -476 -18 320 -215 -18 169
3842A69j09l12M11k01l0M14k11l56J32M24l72J43J17q7k93L43l60k96N12J61m32
$$ 169 60 -252 159 -42 -72 342 131 -225 -93 331 -41 102 219 132 -161 182 -178 -474 38 199 -233
3863b33K61J9K2l0J96m86J31K88j15l29L55K13o13P7L22k55J99M4k32O4L88k7
$$ -233 28 47 69 39 235 -251 -120 168 53 -276 79 292 -321 -244 78 -177 22 66 -166 -102 286 259
3885B59o01K70K43k83K70o9l32K5N65k03n18M03K93n18R5J07j45J84J78k40m4
$$ 259 -342 -72 171 -112 158 89 -243 -218 347 144 -374 29 322 -196 -101 6 -139 45 223 -17 -61
3906f1M20l27k88J64M14l44J75j24N0p5K34k66j63M55kl14J58J06k14j74J89q6
$$ -61 359 32 -256 -92 322 -22 153 29 79 4 238 -28 -191 264 262 -52 106 212 -2 -176 13 -73
3928g3rM26k99l14L24K80k09k34J58j03L9j31M4o7K86K84o22K63J60m04J72J62
$$ -73 -82 344 45 -269 55 335 126 -108 50 -53 -14 -145 -101 -168 118 402 -220 43 203 -201 -29 133
3950A33j64L6J53P8o12P02j49k62r7J82n4K36k11j26R4J55J5l66K32K15k59K8
$$ 133 -31 5 158 236 -376 326 177 -85 -182 0 -54 182 -29 -155 -61 94 109 -257 -25 190 -69 -41
3972d1p2O6J26M11m42l39O07k83k83K32O2J14k62K88k7k54J55p4r4J67J08o0k46
$$ -41 -113 -47 79 490 48 -291 316 33 -250 -18 44 158 -104 184 157 -97 58 -16 -110 57 165 105 -141
3995a41K43m05L96J71l63j2L12Q6n01l6K40J68k50K44k9m3m4Lj18M0K35l09J67
$$ -141 102 -303 93 264 -99 -111 201 287 -214 -250 -10 158 -92 152 123 80 36 39 -79 -39 196 -113 54
4018E4J84m19J83O3Q7l38N91q9l45o2L29k35q6L16l2k53J71J0r6O8n0j31n1J70
$$ 54 238 -181 2 65 152 -186 405 316 -29 -91 238 3 -83 233 201 -52 119 129 33 101 51 -80 -131 39
4042C9j0K05k64N9m2J02K5k81J46J06l36N33k76j76K0Q4J32k45L0K06p7q7K14
$$ 39 29 234 -30 29 -13 89 114 -167 -21 85 -251 282 6 -170 -150 -66 66 -179 -149 57 -20 -107 107
4065A07j0L2J09l26O9J27n4J5K0J65l37J90L2l27J88J60o5k2o0J25j42j69J87
$$ 107 97 129 238 -88 -19 108 54 69 89 254 -83 107 139 -188 0 160 95 73 13 138 -4 -173 14
4088A4j0j09O5K7O1j20l9K58k57m1J18P1Pm1J34m7k80L3J69j41J04o8J52j90K60
$$ 14 4 -105 -40 -13 48 -72 -111 147 -110 -151 -33 38 45 4 138 91 -189 -156 13 -128 -24 -92 60 -130 130
4113A30j11%r3lO5M3q0K75j74q5K62k31j89K16j33K10j13K20l52K7J38k07K50
$$ 130 19 19 -74 -77 -12 31 -49 226 52 -33 229 -2 -191 25 -108 102 -11 209 -143 -116 22 -185 65
4136F5R5Qk5m7j60Q7m0J59j81L2j39K60j47k22J67J76k9k6q5o7K54k96k5J65k3
$$ 65 160 168 143 96 -64 23 -17 142 -39 -7 -146 114 -33 -255 -88 88 59 33 -52 -119 135 -161 -186 -21 -44
4161d4r4l0J55j47J44k7N9o5J83p0k9q3J46Jj16L5j16J37j33k8K74k56J00ro9
$$ -44 -138 -168 -13 -160 -16 -43 16 -49 134 64 35 -48 98 99 -17 18 -98 39 -94 -122 152 -104 -4 -13 -82
4186h2J99j24l6J98j60M0k48L33k36M3J27Q5j40K7OJ50j85n6K55k12P8M1J7n7
$$ -82 117 -7 -43 155 -5 35 -213 120 -116 -73 54 139 -1 26 32 182 -3 -59 196 -16 62 103 120 63
4210F3l1r5J73k11m6K47jNK2r4j19j1J11j16O0m9N9J35k03n9nL60k51n9J41p4
$$ 63 32 -63 110 -101 -147 100 99 104 126 32 -87 -98 13 -103 -43 -92 -33 102 -101 -160 -165 195 -56 -115 26 -48
4236d8j42R4J32j87J30N5n4o8M0K93m03J56j05J59r7k52J97J58L3k62J76J16k13
$$ -48 -190 -96 36 -151 -21 34 -20 -88 -48 245 -158 -2 -107 52 -45 -297 -100 58 91 -171 5 121 -92
4259i2l1R5j1j87N3J60r1j63L55K5l52K88R9k02N5O8k00J13L21k76l24N92m16
$$ -92 -123 -28 -39 -226 -173 -13 -104 -267 88 113 -239 49 148 -54 1 69 -131 -18 303 27 -297 295 -121
4282a21K8K72k83p0K62M8j18K3K78j11k75K76k7l75J50Q8j36k2L93k42j36P7L6
$$ -121 -93 179 -104 -174 88 136 18 41 319 208 -67 209 182 -193 -43 45 -91 -113 280 38 -98 -21 15
4305A5j73P6K23k18pP7po1M5K61k64P0J0o9Q4ro7j2k43K68j62K30M5k60j11J65
$$ 15 -158 -82 141 -77 -84 -7 -14 -75 -30 231 -33 37 47 -22 62 53 -14 -26 -269 -1 -163 67 112 -148 -259 -94
4331i4L8J67l83J54K4K85j51k28L24j25j71K42O5l23J80J01r2j61K13k67k9J91
$$ -94 -56 111 -272 -118 -94 191 40 -188 136 11 -160 82 147 -176 4 105 13 -148 65 -202 -231 -40
4353d0K67j09j06L1n3Q1q8J0j83L17l22O5K21j76j74K15K34l67L31L22j65m44
$$ -40 227 118 12 43 -10 71 -17 -7 -190 127 -195 -130 91 -85 -259 -44 190 -177 154 476 311 -133
4375a33K09mk66K46j0k12J17K30j86mL01k52k19K78j04q3L89k45j95P6K01k77
$$ -133 76 72 -194 52 42 -170 -53 177 -9 -13 288 36 -183 95 -9 -92 297 52 -143 -67 134 -143
4397a43j32N67k27j48J47l5j50L05Oq2l3k54RQ9n7l0J17J05l7o7mL70m18q4J57
$$ -143 -275 292 65 -83 64 29 -121 184 190 108 75 -179 -170 -81 -138 -168 -51 54 17 -50 -54 316 -102 -186 -29
4422b9J3j71K10j64J4J30J00l21J16J61n6j86K41m0r7L00k75l8K18k8l09K04p0
$$ -29 -16 -187 23 -141 -127 3 103 -218 -102 59 3 -183 58 18 -79 221 -54 -92 126 98 -211 -7 -77
4445g7L3k68N51l24K6J21pj95M7M27m31m9n0J79rK37Ok72K13k82j1K3K15P0Pq8
$$ -77 -44 -312 239 -85 -59 62 55 -140 -93 334 -97 -146 -196 -17 -26 211 217 -55 158 -124 -135 -112 103 173 180 92
4471I2rl48L04qj03Q5L13J8m33J31k1K21k61k9j95K52J22l09K0L89r4j29j57K08
$$ 92 83 -265 39 31 -72 13 326 344 -89 42 21 242 -19 -48 -243 9 131 -178 -158 231 137 8 -149 59
4495E9m6P8J14l94K12O5k27M0K25J2r7j25K96m13MM85l44pK19k54r5J10L5K0j69
$$ 59 13 91 205 -189 23 88 -139 -99 126 138 41 -84 212 -201 -197 288 -56 -63 156 -98 -193 -83 -48 -28 -197
4520a97K16k74J91K47k73o0L68j14j72Q5k49J05J65M3j51J0J52k65Q9K65j67j71
$$ -197 19 -255 -64 183 -90 -150 218 104 -68 17 -232 -127 38 81 -70 -60 92 -173 -84 181 14 -157
4542a57K57j88J8P3J19k11j5L53k35p8n0J18j00Q3J32j85J8R1L8q0O3J24r9j03
$$ -157 100 -88 -70 3 122 -89 -104 249 14 -64 -114 4 -96 -13 119 -66 -48 43 81 1 64 188 89 -14
4566a4K26k95K29j92j73K59J23k80M0pJ16k4N0O3P7k45nkm1J67j16n5K99l1q8
$$ -14 212 -83 146 -46 -219 40 163 -117 -77 -84 32 8 58 121 198 -47 -52 -54 -95 72 -44 -99 200 169 81
4591H1o3o1q6P3K49j74j44L2l0j44L71J2q3K5k4n2J0J14q1j33J01m7J18j00O2
$$ 81 18 -43 -129 -56 193 19 -125 -93 -123 -267 104 116 33 58 34 -18 -8 106 25 -108 -7 -54 64 -36 26
4616B6j5r0j6q3L21k96J99kn6kl0l1J8j43L30l5j27k5N9J48j24j85K17j9mr5K4
$$ 26 11 -79 -95 -178 143 -153 46 44 -12 -14 -44 -75 -57 -200 130 95 -32 -57 2 150 26 -159 58 39 35 -60 -36
4643c6k57K20Q6L33m65N0OJ60j04jk3J8J79k56P1K58k30q6J63k09J29j45J19j28
$$ -36 -293 -73 13 346 -119 -69 -63 97 -7 -8 -31 -13 166 -90 -19 239 9 -77 86 -123 6 -139 -20 -148
4667a48k1K92k78J01L04l56P3J50m0n7j29J60j43J26J25l15n1K76L9k25K53R7
$$ -148 -169 123 -155 -54 250 -106 -33 117 77 20 -109 51 -92 34 159 -156 -207 69 108 -117 136 233
4689B33k16p3J9Q2k61LK25p1J71Lj85J24l99L28J78p6n6jJ41l76K27O5m5j16J43
$$ 233 17 -56 -37 45 -216 -213 12 -59 112 115 -70 54 -345 -17 161 85 29 28 169 -207 20 85 40 -76 67
4714F7j91j6J16M7k01J52o9N2jM0Q4k78J43q8K64q9nj09K33N9j20n2J04J78n74
$$ 67 -124 -140 -24 23 -178 -26 -95 -43 -44 -4 80 -198 -55 -143 121 32 27 -82 151 210 90 38 142 320 -254
4739b54K89l0j92K16N4km6q2M5J82k18K6Q1l1L2j45K84k97j39K95m5J8p3P0O8
$$ -254 35 5 -187 29 83 81 35 -47 -2 180 -38 -12 69 38 70 -75 209 -88 -227 68 23 41 -32 38 106
4764A06n8j6L6k21J51lr0J33n5ll3J6Q8R4k82P2K16j24l5j85M5J09K1k8j17K61
$$ 106 48 32 68 -153 -2 -5 -95 38 -17 -20 -53 -37 51 145 -137 -65 151 27 -8 -193 -148 -39 -18 -46 -163 98
4790I8l22Q4J30K99l32J00m7o6j28J90L7N4j79J11l9J3k09M5K42K8m6j26K19n3
$$ 98 -224 -140 -10 289 -43 57 10 -56 -184 6 43 97 -82 29 -10 3 -206 -161 81 109 63 -63 156 103
4814A03m5J16j59p7P8J99j54k1J35K8l73K50N4N4k69J79J7j37K1j45K58l34J17
$$ 103 58 174 15 -62 16 215 61 40 175 203 -170 80 134 188 -81 98 115 -22 -1 -146 112 -222 -105
4837a05J54j69K99K2o3j71%J69j35j03L9K77j22k5j0j79J69m5J50k72L87m07j52
$$ -105 49 -120 179 201 138 -33 -33 136 1 -102 -63 214 92 67 57 -122 47 2 152 -120 267 -140 -292
4860b92R6K49j79j9L85k97j11K20O9l62K78j6m51K29M40l32J45j06j40K33n6q1
$$ -292 -196 53 -126 -145 240 -57 -168 52 121 -241 37 21 -430 -201 239 -93 52 -54 -194 39 -17 -98
4882i8j87K54r3k38M40j51k5j7K46Q2m65K83K17k46l2J06k7j70j39J27j1J2J87
$$ -98 -285 -31 -124 -362 78 -73 -98 -115 131 213 -252 31 248 2 -30 76 49 -121 -260 -133 -144 -132 55
4905E5Rl1J61j91j06K17j14j39K66j04j08L68j24k29K04m1j57P6L9j65P7j15K7
$$ 55 64 33 194 3 -103 114 0 -139 127 23 -85 283 159 -70 134 93 -64 12 51 -114 -37 -152 -125
4928a25J00L7rj60M7L26j69O4L2j75k5L0k64P6J19K65j91j86K86j78Q8K71k79
$$ -125 -25 12 3 -157 -110 216 47 111 143 -32 -57 -27 -291 -215 -96 169 -22 -208 78 -100 -12 259 -20
4951b0j82M20j48l25K41K19P7j96P9o3k04J91o6j51K15J13n23K03J80k8j36K80
$$ -20 -202 218 70 -255 -14 205 282 86 165 102 -102 89 23 -128 87 200 -323 -120 60 32 -104 176
4973A76k38j88K71K23m94J33K05k3l53L48q9J48J08j52k98K96P5j97k1M8J43l05
$$ 176 -62 -250 21 244 -250 -117 88 65 -288 60 -29 119 227 75 -223 73 148 -49 -70 -22 121 -184
4995a84K24p3M9o2K5j3K9J84R2j54o5M0j38J95r2k15J14J01k98J67J96j54N4p
$$ -184 40 -33 16 -46 -21 -34 -5 179 271 117 52 92 -46 149 57 -158 -44 57 -241 -74 122 -32 22 15
5019A5k4n9J97o9j04P8J28j54R6k72J35r0K29j89P8J05j31R7J12k45m1J79P9J
$$ 15 -9 -68 129 60 -44 34 162 8 104 -168 -33 -123 106 -83 -5 100 -31 66 178 -67 -108 71 150 151
5043A51k60pK04l42M11j24k94J68R8p4L9P2j26jL0K78j91L4Ok17L3m6K03j59O8
$$ 151 -109 -116 88 -254 157 33 -261 -93 5 -69 -30 42 -84 -85 -55 223 32 66 72 -145 -112 -158 45 -114 -46
5068d6P9k33K56M2j71l7N4K43k52Q2M4lP3r9l05J76J60J5j63N7J32j69MJ81j60
$$ -46 33 -200 56 98 -73 -110 -56 187 -65 17 61 58 131 32 -273 -97 63 78 -85 -28 104 -65 -61 120 -40
5093d0L0R4j04K3j15J95j43j22J82k36M55k2k35j0J86k30rK93k78J98j64l1J35
$$ -40 -10 84 -20 3 -112 83 -60 -182 0 -236 219 197 -38 -48 138 -92 -101 192 -86 112 -52 -83 52
5116E2L6j1R3j08J28l11J49O3k63K08m3r8Jp9L71k94nJ59j94r3K54J2j09K14L0
$$ 52 88 77 170 62 190 -121 28 91 -172 36 -7 -105 -104 -183 188 -106 -111 48 -146 -239 15 27 -82 132 162
5141A62k1k89K23J03j73m5K26j65k1j66N0O9lj17K21j73J18j06L2J02j3o8J42
$$ 162 141 -148 75 178 5 -40 186 21 0 -166 -116 -47 -50 -167 54 -119 -1 -107 -75 27 14 -54 88
5164H8J0k18J29K07k79K81j15l34K08R8l8J85j22L7N9j40J97l68L00k30j06J80
$$ 88 98 -120 9 216 -63 218 103 -231 -23 75 37 222 100 137 196 56 253 -115 185 -45 -151 29
5186B9P9m4l2R6j12K9m2J31j33K12k85M2j2k8K78j58j92K4J64j80K89j61K1J78
$$ 29 108 64 32 128 16 45 3 134 1 213 -72 -30 -42 -70 208 50 -142 -118 46 -134 155 -6 15 193
5210A93j56OM4k4k37L9J57J41k21O4J41K9k65L4k69M42k9k62R6K2j27K95J36l25
$$ 193 37 43 87 63 -174 -135 22 163 -58 6 147 176 -89 -55 -324 118 89 -173 -77 -55 -182 113 249 -76
5234g6J35p2N2j26J80j98K50q8q0R0q2PO9j87j17K39j5n2J25k6J63k06k7K4R6
$$ -76 59 -13 39 -87 93 -105 145 57 -23 67 -15 -8 61 -126 -243 -4 -19 -71 54 28 191 -15 -42 -18 78
5259G8j90j07J88j47L11k1n3L6j19j1mk06K38J21k32K52k53O6J91J65k21J23j61
$$ 78 -112 -219 -31 -178 133 112 59 95 -24 -35 -39 -245 -7 114 -118 134 -119 -53 138 303 82 205 44
5282D4M6k2j93K25k56L08P1k15K60l20m5P5J32j71J87n6l6l61K23r0P4kJ04k2
$$ 44 90 68 -125 100 -156 152 223 8 268 -52 -97 -22 110 -61 126 70 34 -327 -104 -194 -120 -122 -18 -40
5306d0k72L60j21J25K4o4m7j26J83Q2j92J15k2k0Q1r0n0O5Kj06J10R2k32K0K07
$$ -40 -312 48 -73 52 76 12 -35 -161 22 104 -88 27 5 -15 66 -24 -74 -9 -7 -113 -3 89 -143 -123 84
5331H4j15kK46l05j51J82J76ljj03o8R7q5J07k42J94N8q3M7M4n4J0q9nL9J23p6
$$ 84 -31 -33 213 -92 -243 -61 115 112 111 8 -60 37 -48 59 -183 11 69 -14 33 77 23 33 -56 -61 -22 101 25
5358B5o1O9j94r3J25J60j7Q5J25j48k39J46rK00k63J20J6l03K65l03J92L14r5
$$ 25 -36 33 -161 -254 -129 31 14 99 224 76 -163 -17 -26 174 -89 31 47 -256 9 -294 -102 212 117
5381A17j16pK5l7j3J45k25P4l2j9j60L76n2j21J22K7j31o8J65j74m3K23l8K07
$$ 117 1 -6 19 -18 -31 114 -111 -37 -69 -88 -248 128 76 -45 77 104 -27 -95 70 -104 -147 76 38 245
5405B45l02M2K0J1k52J06K24j91J41j34L21j35k48K56Lj39P3q3O5K9J82l87P3
$$ 245 -57 -15 5 16 -236 -130 94 -97 44 -90 231 96 -152 104 107 -32 41 -42 23 52 234 -153 -80
5428h0O8J44r4J49l8k22K0J42j2m9K91n07o3K39P4k11K79l4p9L2j3J91j20k10
$$ -80 -12 132 38 187 149 -73 -53 89 77 28 319 -188 -251 -12 62 -149 130 96 17 49 36 227 107 -103
5452a03K48p4k26K71k60J81n6R8j51K28k7l18K38j19K22n4l9r7J14J84l24M5K7
$$ -103 145 71 -155 116 -144 37 -19 79 -72 156 129 -189 49 -70 152 98 59 -38 76 260 -64 -19 8
5475HQ8j94Q0l1N3k5R0p3J08k04nj19L95L1l18O9J85j12k32K34k62J04M9K5j16
$$ 8 96 -98 -18 -49 4 -21 69 -4 104 -100 -105 -224 171 202 -116 -47 138 26 -206 28 -234 -130 -81 -56 -172
5500a72K4J95j45J29q5j7j41J93L7M6J35l53RJ82p0%K32j14j14j29L07n9k98L48
$$ -172 -148 47 -98 31 -54 -71 -212 -19 18 64 199 -154 -145 37 -33 -33 199 85 -29 -158 149 90 -208 140
5524A40Pl60J68Nm4R7K6j27J3J89j42J13j16K05l53K17j50%J5J4P4r8K57l55L6
$$ 140 147 -213 -45 -40 -84 13 39 -88 -75 114 -28 85 -31 174 -179 38 -112 -112 -97 -83 -9 -107 150 -205 -169
5549a69P8K77k97R7M7J92k38J05j33k12L21P0j43Q9J19l19L1K4j79K93q9J34k83
$$ -169 -91 186 -111 -14 33 225 -13 92 -41 -253 68 138 -5 84 203 -116 -85 -61 -240 53 -36 98 -185
5572a85L50j45o1R5r6N3k26M35l52pj15K76j30J27L31l26j20P0q0k09M70p2j61
$$ -185 165 20 -41 54 -42 11 -215 220 -132 -139 -254 22 -108 19 350 24 -96 -26 -106 -315 155 83 -78
5595g8Q5M2m0q2p1J89k25N1J88o1r7K51n5j79j11J10q9K49j57K39j91P9l06K82
$$ -78 7 49 9 -73 -144 45 -180 -129 59 -2 -99 152 97 -82 -193 -83 -172 77 -80 159 -32 47 -259 23
5619B3J6K4j12L4j76L1L57l98M4P4K26k66J27N1m2nN2K4rj16Q7O9j19n8k12K88
$$ 23 39 63 -49 -15 -191 -160 197 -201 -157 -83 143 -123 4 55 13 8 60 84 75 -41 46 115 -4 -62 -274 14
5645A4K14j73J05r5l26K65J66L5l27K07r7r1J64J7J31k82J06l0j54K5K32M2m85
$$ 14 228 55 160 65 -261 4 170 205 -122 85 -12 -103 61 78 209 -73 33 3 -151 -126 106 148 -337
5668c37N05l29O2J84j42J52o1M8L4J86j31l91J53o0Q4k8Q1k6N6K3j28RK09rn6
$$ -337 168 -161 -99 85 -57 95 34 82 116 302 171 -220 -67 -127 -43 -71 10 -16 40 63 -65 -56 153 144 88
5693H8RR7k36J23l5k16J07M4J00k80K67M1j14K5O2J9j01n6j01m4K85P1j16P6k10
$$ 88 97 194 -42 81 46 -170 -63 -19 81 -199 68 109 -5 20 82 101 0 -56 -157 -201 84 155 39 115 -95
5718i5R9Q5J56k81Q1M1m1rj08J45j00j78P3J0r6M05k43M6J37j40q3n4J32nm9o6
$$ -95 4 89 245 -36 45 86 45 36 -72 73 -27 -205 -132 -122 -218 187 -56 -10 127 -13 -96 -150 -18 -23 -72 -138
5744a38J00j33K74J42k40L7n1p3L8J01K9j86K30p5m3RJ35j13m7j16J54J63j74
$$ -138 -38 -171 103 245 5 42 -9 -82 -44 57 86 -100 130 55 12 21 156 43 -4 -120 34 197 23
5767B3J%k3K0O2k9j28J77r2J24q5j53J49Jp6R0j85K36p6n0j47Q9J4OK56k90p6
$$ 23 24 24 1 21 83 54 -74 103 11 135 50 -103 46 47 -29 61 -124 112 36 -14 -161 -72 -58 -52 204 -86 -162
5794a62j4J47K9j47Q4j61R1Q6L24j93j29L2K7p0R5p3j28J85r9j06K96j26K75k75
$$ -162 -176 -29 0 -147 -63 -224 -133 -47 277 84 -45 -13 14 -56 39 -34 -162 23 -76 -182 114 -12 263 -12
5818a2L8n5M6o2j25K87q3KNl2k28L42l22J17l2j22K23k38N04k26J29k22r8K33
$$ -12 26 -29 17 -45 -170 117 34 36 41 9 -219 123 -199 -82 -114 -236 -13 -251 253 27 156 -66 -164 69
5842F9o8j66J86p3J58j66R0N1j58J49K6k10R9J06j39K9j43J95j50J16q4j34L37
$$ 69 1 -165 21 -52 106 -60 30 81 -77 72 98 -112 -13 93 -46 -17 -160 35 -115 1 -83 -217 120
5865A20j34j45J10O9n3m3l0j13L00p2j52O8l6K6R1k6J18l6j93K5K19l0k27K06
$$ 120 -14 -159 -49 20 -33 -76 -106 -219 81 9 -143 -75 -111 -85 6 -20 98 62 -131 -106 113 83 -144 62
5889F2j3j2L6j64K2m0o4P1R3L5R8j5j46%j26J10J29j34J1Q9jj2j88OJ45j55K86
$$ 62 49 37 73 -91 -69 -109 -173 -102 -9 26 124 109 -37 -37 -163 -53 76 -58 -47 42 41 29 -159 -153 -8 -163 123
5916A23j71J86j22k08L9J20l6J70j38M5J14l5k13K39n9q5O4r5K84j29N2l6j23
$$ 123 -48 138 16 -192 -153 -33 -69 101 -37 8 122 87 -126 113 54 -31 33 -62 222 93 145 109 -14
5939a4k03M13j52n2qR4p4n6J34j98j4J76l0L3L2J05p9k83J42Mk21L69k40J21J17
$$ -14 -217 196 44 -8 -16 78 4 -52 82 -116 -130 46 16 49 81 186 107 -176 -34 -30 -251 118 -122 -1 116
5964A16k78m8L14j19n3M7P9j86K52l57L20j46J35Q6k74K94j54O2k27J12k00K59
$$ 116 -162 -210 104 -15 -68 -21 58 -128 124 -233 87 -59 76 162 -112 182 28 90 -137 -25 -225 34
5986C4L3j34J14n1J17j80Q4O0j62N2n2M9J9n2K04n0l20L54k22J80j33p3R4J31
$$ 34 67 -67 47 -4 113 -67 17 77 -85 -33 -85 -36 -17 -69 135 85 -235 119 -103 77 -56 -129 -35 96
6010I6p3k25M67m19J26N6J90l19O0l3R8j23L25q0q4LN2J54l82l2R6L07k13q3R7
$$ 96 23 -202 265 -154 -28 28 218 -101 -41 -74 24 -99 226 146 62 65 117 271 -111 -143 -47 260 47 -36 61
6035F1O8r4j93K39p4j30K0L02m35J40J97L3j15r2R6R8k17L9l0j61M61k73l0M7
$$ 61 129 35 -158 81 7 -123 -103 199 -236 -96 101 134 19 -73 23 121 -96 -57 -87 -248 213 -60 -90 -43
6059d3O7j85J90k05rK31k27J30J69n6p4N2j9J90k17o6J49k00J72jj06k5o3J95
$$ -43 24 -161 29 -176 -185 46 -181 -51 118 62 -12 40 21 211 -6 -72 77 -123 49 48 -58 -83 -146 49
6083D9j48J31L3l47K87mK23k97J01k05J10K37l7k00J96p2j94k9L10l9j14N8J17
$$ 49 -99 32 65 -282 5 1 224 -73 28 -177 -67 170 133 -67 129 57 -137 -166 144 105 -9 49 166
6106A66k52M8M6j92J30K39k09KJ26M2k02M1J33l81J80Q0o8J19J18o6q7R3l52K49
$$ 166 -86 -38 8 -184 -54 185 -24 -22 104 146 -56 -15 118 -263 -83 -3 -71 48 166 100 13 106 -246 3
6130CJ17j65j48L12p6j59K35j72jJ93m3j07q0K7J26j15m2K29k46J26J95k49o2
$$ 3 120 -45 -193 119 43 -116 119 -53 -54 139 96 -11 -91 -64 62 -53 -95 134 -112 14 209 -40 -102
6153a02L05j01q6Q2p9k9q8J33NP9j04j61P6Q8j66J04J42n3J4j44K35j01p2J28
$$ -102 203 102 16 98 19 -10 -98 35 40 119 15 -146 -70 18 -148 -44 98 45 59 -85 150 49 -23 105
6177A05N4k47L6O1Oj50J3R6o2J60o9j25O6k9j3O2k73L45n8P0l7p9k5J39J01Pn8
$$ 105 159 -88 -52 9 15 -135 -122 -26 -88 72 3 -122 -56 -85 -98 -36 -309 36 -22 48 11 -68 -93 46 147 154 96
6204I6j42N6N1p1k4K79k54o2J46j8m3L4j62J02j4l8o9l1K23j37L0K66k24Q4k06
$$ 96 -46 10 61 -10 -34 245 -9 -71 75 57 14 48 -114 -12 -26 -64 -133 -164 59 -78 -48 218 -6 78 -128
6229a28J49J0k6J38j57j40J01P8r8R0q6J18lj19OK23k02L5Q9J0j79L5J34N5j45
$$ -128 21 31 5 143 -14 -154 -53 25 -73 17 -69 49 46 -73 -67 156 -46 -11 78 88 -91 -56 78 133 -12
6254a2r7J54o6L5k52L49k00l4K8j04O1J88j2J24l0k72J23k4l3J00k10L12k57Q2
$$ -12 -109 45 -21 14 -238 111 -89 -123 -95 -199 -138 50 38 162 132 -140 -17 -41 -74 26 -184 128 -129 -47
6278d7j25J44lK5L6k06K03r9%J16K0R6j41Np9J87R8m18J60J52j42j4k22L52j87
$$ -47 -172 -28 -31 -6 30 -176 27 -72 -72 44 64 160 19 24 -55 132 230 -188 -28 124 -18 -32 -254 98 -89
6303h9o2N1R3p1K07j64J08q7j2K0m3J23n4l3o2J05Q0j94j64J76J67m8r8n7J27
$$ -89 -151 -100 -7 -78 129 -35 73 -14 -26 -6 -49 74 20 -13 -75 30 110 -84 -248 -72 95 47 -51 -108 19
6328A9j35J98j73lP0q8Q3L6K18k18Lm0L4j46J49j26J31P9Lp3J6j7m1k4J83j80
$$ 19 -116 82 -91 -94 -24 -112 -29 7 225 7 10 -30 4 -142 7 -119 12 91 94 21 37 20 -21 -45 138 -42
6354d2L9m06L68l7j6K23q4k26p5J77K39k69k2K44j26J13j06o6R8J03P1k13l1J16
$$ -42 -3 -409 -41 -78 -94 129 45 -181 -256 -79 160 -109 -131 113 -13 100 -6 -72 26 129 200 -13 -44 72
6378G2r0r9J57P2j77M0L2j53L02j64p9R2n5P2n4k9K53j01r4k40K82O1k4K14l38
$$ 72 -18 -117 40 112 -65 -25 7 -146 156 -8 -87 5 -50 22 -32 -61 192 91 -3 -243 39 100 76 290 -48
6403d8M2m0o8J80j41J71J12k30j8J9j01K06J01k3k88K30l00P6K49j32R7j03J73
$$ -48 -6 -46 -114 66 -75 96 208 -22 -40 -21 -122 84 185 162 -126 104 -196 -120 129 -3 94 -9 164
6426A64l63J81K36k87L29m13K09k9j49K86j52R3o1L6p0k8jJ66o0m3n5M3m1P1n4
$$ 164 -199 -18 218 -69 260 -153 56 27 -122 164 12 105 44 80 10 -18 -19 147 87 44 -11 32 -9 62 8
6451HNJ30k67L8J77mo5J92j54K2j72j70L06nP3J10k71Q5K98m49K40k13J9M07n86
$$ 8 13 143 -124 -86 91 87 22 214 60 82 -90 -260 46 41 114 224 -47 38 336 -113 127 -86 -67 340 -246
6476b46L52k67J66qk16J58p9j4J59J33k41J37P2l4k22K69k34o2J1J44rL5q1m1
$$ -246 106 -161 5 -3 -219 -61 -140 -154 5 138 -103 34 106 72 -150 119 -115 -177 -166 -22 -31 4 -77 -118
6500a18J07P2o4J27p6r1p3J92j9p8Q0j0k02J84j8J23k79QJ27K7p4Q8Q4k86J03
$$ -118 -11 61 -3 124 48 -43 -116 76 57 -21 59 49 -153 31 13 136 -143 -135 -8 19 -55 33 117 -169 -66
6525f6J93J24l02l9J27n8l25L33J69j1k73K89k00m7K93j64Pq2j10K79j71j5J24
$$ -66 127 251 -51 -90 37 -21 -346 -13 156 145 -128 161 -39 -86 207 43 50 -32 -142 137 -34 -49 75
6548G5O8m2j59J06rO4k73L38j80q8P1j05K60j14Mp6J44J38l04J11j9m6K15j83
$$ 75 143 101 -58 48 39 103 -170 168 -12 -100 -29 -134 126 12 16 -60 84 222 -82 29 10 -36 179 -4
6572dk06K28K4P0j04n9R9j48P2Q4j29J7Q6q2J39k5j98K29j05j07J58J14k90L3
$$ -4 -210 18 42 112 8 -51 48 -100 -28 56 -73 -56 30 -52 87 62 -136 93 -12 -119 39 153 -137 -104
6596a04K43j29M1n2R7k60K67L0J08l03rK4j4j89K19J62p6K8j92RJ90j6o3N0Oj59
$$ -104 139 10 51 -1 96 -164 103 133 241 -62 -71 -47 -61 -250 -31 131 55 83 -109 -100 90 74 11 61 67 -92
6622i2R4o5o8K50n2o4L2j46L24j04mk9j03j58K23j62K17q1kn1J19k32P6R1J85
$$ -92 2 -63 -131 119 67 3 35 -111 213 109 105 76 -27 -185 38 -124 93 12 10 -41 78 -154 -78 13 198
6647A98k08J0M4k59Q9N6J78j65J10J48j31j37q9L12j80j50L70j17R9k07m0J2O8
$$ 198 -10 0 44 -215 -126 -70 108 -57 53 201 70 -67 -156 156 -24 -174 196 79 178 -29 -69 -57 11
6670A1l7K7k25J09K3K8J1k6J90j01K1j24k5O0P0J72k21M2N2k5r8K37p8j77J11
$$ 11 -26 1 -224 -115 -92 -64 -53 -79 111 10 31 -93 -118 -58 12 184 -37 5 57 32 -66 171 93 -84 27
6695B7J88l81K63Pj5j22J78k11L5Jn9P8K7K18k30N4m1p7P3Q1j04K8K3j5P2j32
$$ 27 215 -166 97 104 89 -33 145 -66 -31 -30 -89 -11 16 234 4 58 17 -60 13 94 -10 18 41 26 98 -34
6721c4J42j0q4q2N4J58k1J54j56l16L14j54O2O3q9K9J03R2j67K01l07p7N2K95
$$ -34 108 98 14 -68 -14 144 123 277 121 -195 119 -35 27 90 1 30 133 225 58 259 -48 -125 -73 222
6745B22l86K35P4k25K7K91k18P1j04o8O4M7J72k66J22j73L74k40J12k08j42K93
$$ 222 -164 71 145 -80 -53 238 20 91 -13 -81 -17 30 202 -64 58 -115 259 19 131 -77 -219 74
6767G4p0j47N4J68k45J62K0k07J82j60J78k93K47J13k9k4j28K31k0k23O3q5K9
$$ 74 4 -143 -89 79 -166 -4 16 -191 -9 -169 9 -284 -37 76 47 23 -105 126 106 -117 -54 -139 -110
6790a10N0no4J64j55P0J13q3O0J33P3k89J10J03k54nN4K38J7k93M0J10j90J32
$$ -110 -60 -65 -129 35 -120 -50 63 -20 40 173 246 -43 67 170 -84 -89 -35 203 220 -73 -33 77 -113 19
6814A9k00K26j29P3j64K26m0j06L36q7j48j45J35j02p9K26J28j61m5J3R5j91J19
$$ 19 -181 45 -84 -11 -175 51 11 -95 241 154 6 -139 -4 -106 -185 41 169 8 -37 -24 71 -120 -1
6837aj9q7Q7k5O6L7m2N3p2K35j20j00J6nJ33l49J37q9N9J03j68K9J30KJ7o4n4
$$ -1 -20 -107 -20 -45 21 58 16 69 -3 232 112 12 28 23 156 -193 -56 -145 -86 17 -151 -122 8 10 27 -37 -91
6864i1J81o4lP9k8p1k0J81J2j59j50K40J3m01L20j55P7J8j1O6QK78m74kjJ11j23
$$ -91 90 26 23 102 74 3 -17 164 176 17 -133 107 120 -281 39 -116 -39 -21 -32 34 42 320 -154 -156 -157 -46 -169
6891a69j16K75k52J92J19J1L8Rj47J17J65l81j2K60j24j4j18n8J62j26K58O0k48
$$ -169 -285 -10 -262 -70 49 60 98 107 -40 77 242 -139 -151 109 -15 -29 -147 -205 -43 -169 89 149 -99
6914i9J15n1K36q6j29P7k47K47L4j40J98K8l07J85o0J39p0j43p9J89k64L74L7
$$ -99 16 -35 201 115 -14 63 -184 63 97 -43 155 183 -124 61 1 140 70 -73 -152 37 -227 147 184
6937A84j26J25k35K19l02K77j15j62K54j0j50L5pP0Kl8k0N7m8n7j26J93p1p1K91
$$ 184 58 183 -52 167 -135 142 27 -135 119 109 -41 -6 -13 57 59 21 1 58 10 -47 -173 20 -51 -122 169
6962A69l11J95J3j52n9Q0L9jJ85m22J94Q9R1j2j40j26K94m8r1K02J0j60J00j56
$$ 169 -142 53 66 -86 -145 -65 -26 -27 158 -264 -70 19 110 98 -42 -168 126 78 -13 189 199 39 139 -17
6986a7J02j56K17j48q4R4K2k36K20j8J49k76K10l12K45Q0k5k41K17l9j18J82Q4
$$ -17 85 -71 146 -2 -86 8 30 -206 14 -4 145 -131 79 -233 12 92 67 -174 43 4 -114 68 152
7009A52j65k5J21rK07k56J0j4J80r5j67q9J02j16N33l78K27j76j05O4N5M7k46
$$ 152 -13 -38 83 74 281 25 35 21 201 106 -61 -150 -48 -164 369 -9 218 42 -63 1 56 103 -143
7032a43J69j65J49m3n1Q1Q3j88J13m7j27K70lQ9r9j72K04j56J94n3K6j23k7O0
$$ -143 26 -139 10 -33 -84 -3 80 -108 5 -42 -169 101 98 187 88 -84 120 -36 158 105 131 8 -19 41
7056D1j98P9J91l72K05J4J7k4M9l0J30n5J42j86J45k76J01m1J36O3j11L7qKJ5
$$ 41 -157 -78 113 -259 -54 -40 -23 -47 2 -28 102 47 189 3 148 -128 -27 -68 68 131 20 57 49 51 66
7081F6j06M9J0Q5j52pJ28l8o0J1P8k8o6R0J04j64P8j46Q0N4o2j0kJ87j03k12J64
$$ 66 -40 9 19 104 -48 -55 73 35 -25 -14 64 36 -30 60 164 0 78 -68 12 66 4 -6 -8 179 76 -136 28
7108B8p2R8m3J05K49m55K42L14m08Mq3O7K6j77M21k36k28J51R7j64K21k10j07
$$ 28 -44 54 11 116 365 -90 152 466 58 62 -21 46 72 -105 316 80 -148 3 100 -64 157 -53 -160
7131a60R1j67J04J52j06J75k71K51k69j5K31j72L76l65N5P9k4J45M1r3l5m3l5
$$ -160 -69 -236 -132 20 -86 89 -182 69 -200 -215 16 -156 220 -145 -90 -11 -35 110 151 58 23 -20 -55
7154e5J7Q0J63o0j99m3K7J08jJ33m2l9K28l54n3O1n7N1jo5J04j29K75p2p8l4Q2
$$ -55 -38 42 205 145 -54 -97 -70 38 37 170 128 89 317 -37 -90 -29 -86 -35 -36 -101 3 -126 149 77 -1 -35 47
7181D7QL0l02J65J19J79j98n1L5J17K6m2j30j6L7j45O4j81K49j32J95j96K4j22
$$ 47 55 85 -217 -52 67 246 48 -3 32 149 175 133 3 -13 24 -121 -57 -238 11 -121 74 -122 -98 -220
7205b20Q0M9L65j14k28R2m1j08k8J49J40j17k0P2R0L2r6p8J13o6j59K15j57N2
$$ -220 -140 -91 274 160 -68 24 -17 -125 -153 -4 136 19 -1 71 161 193 97 19 132 66 -93 122 -35 17
7229A7j3J1J78l10J69k7k82M38j54lm0j44K51o9o9n2m5K89k15K43j87J6o8m5k
$$ 17 4 15 193 -117 52 25 -257 181 27 24 -16 -160 91 22 -47 -99 -144 145 -70 173 -14 2 -66 -111 -113
7254a13P9R5k6l0J58m28M71j88j04m0J08K07j80m0j82J47MP9j25j87L08P8p5J2
$$ -113 -34 61 35 5 163 -265 206 18 -86 -126 -18 189 9 -31 -213 -66 -62 17 -108 -295 13 91 16 28
7278B8L0K64l50rM2N6q8O5l3q6M7L3k34J37j11J64J7J81k74K26L8j81L07l89L62
$$ 28 58 322 -28 -37 5 61 -27 38 5 -81 -34 -1 -235 -98 -209 -45 -28 153 -121 105 143 -38 269 -120 242
7303B42k40q3Q5J14J4j11Mp8p3J01N3j85jK62j75J6n8OJ73P8l46K74j68K63k46
$$ 242 2 -81 4 118 132 21 25 -53 -126 -25 28 -157 -158 104 -71 -55 -113 -107 66 144 -202 72 -96 167 -79
7328g9K71j73j57M8j36K06J4k05K64M9m04K36J73k75K95j21j1j82K50N1k5j38
$$ -79 192 19 -138 -90 -226 -20 -6 -211 53 102 -302 -66 107 -168 127 6 -5 -187 63 114 89 -49
7350d9q5J99M1p3q0r1q3J86k0J63l2L7Kj43k30K00n9J36q9J15k0q8q5R3K36j54
$$ -49 -134 65 106 33 -47 -138 -221 -35 -55 108 76 113 115 -28 -258 -58 -117 19 -70 45 25 -63 -148 -55 181 27
7376B7K2k0l9K0M1r0p5k7K01r3Mo0N6N6N9j76R0l6O5m4J73q8J85j59n9O8l4J70
$$ 27 49 29 -10 10 51 -39 -114 -141 60 -33 -29 -89 -33 23 82 -94 -4 -40 25 -19 154 66 251 92 33 101 67 237
7404B37k53J27l14P6J24RN9j44j31J75l1k5J76j38K11k3q9K10o6j77N0k8r5j7
$$ 237 -16 111 -203 -127 -3 6 65 -79 -210 -35 -66 -91 85 -53 158 135 46 256 190 13 63 35 -60 -77
7428g7L7J09N1j15j97K28m3o3l4L17j96J9k2j44J29K71m44M7J70qo9J90j99J39
$$ -77 -40 69 120 5 -192 36 -7 -70 -104 213 17 36 14 -130 -1 270 -174 -127 43 35 -34 156 -43 96
7452I6j27J72l02O7J7N7J75j69l1J40JJ21k40j4R1k65J84L8J11K2N5j1k22o4K09
$$ 96 -31 141 -161 -94 -77 -20 155 -14 -45 95 96 217 -23 -37 54 -211 -27 11 122 144 199 188 -34 -98 111
7477A11j69l4J53j09r9J24J90l83L91J6k96pQ1K85l58J78k02J37qQ3r5N9k53J74
$$ 111 -58 -92 61 -48 -147 -23 167 -216 175 191 -105 -112 -31 254 -104 74 -128 9 1 84 -11 48 -205 -31
7501c1J06m5m7J80p0N7q4P7r5j3k3L1j45j3J74j68J03R5O8j59k46K09K34j53p4
$$ -31 75 30 -17 163 93 150 66 143 48 35 12 43 -102 -115 59 -109 -6 89 157 -2 -248 -39 195 42 -32
7526c2l4J58mp3K4L0m8L1r4P0j12M7o3Q6N6l4J05j14N4p8O2On9L16m47J61p3j14
$$ -32 -66 92 88 15 39 69 21 52 -42 28 -84 -37 -100 -14 42 8 113 -1 53 -25 37 43 -16 300 -147 14 -59 -173
7554a73J89j72OK43j16p5J66p8M7j10JN1L0M6%L2l4n7oJ87j91R1M4n8k9J3Nq4
$$ -173 16 -156 -150 93 -23 -98 68 -10 37 -73 -72 -21 9 55 55 87 53 -4 -10 177 -14 77 121 63 34 47 52 -32
7582c2n5J65j18Qj2O1R7l19J48O9J18k12L6M4J5k48K46J9nK4j30J04p5J10P9l07
$$ -32 -87 78 -40 -32 -44 17 114 -205 -57 12 130 -82 -46 -2 13 -235 11 30 25 49 -81 23 -52 58 137 -170
7608a70J66J13l45K83l81J26L93j2j78J3k32K15o4K2j20O0L6J09Q4j08k5l8J2
$$ -170 -4 109 -236 47 -334 -208 185 173 -5 8 -224 -9 -73 -51 -171 -111 -75 34 118 10 -15 -53 -41
7631d1j57K64j56O6J11k93N4p0n0M54k15j5K16k64M3J02k81J66J87J01p1k11J89
$$ -41 -198 66 -90 -24 87 -206 -152 -222 -272 182 -33 -48 168 -96 -53 49 -232 -66 121 222 151 -60 129
7654A29N3l25L8N5P3j4J09j88k2K08Mo0j32K51m05J93J96j20q2m6K7J80j81P6
$$ 129 182 -143 -105 -50 23 9 118 -70 -92 116 120 60 -72 179 -226 -33 163 43 -39 -85 -58 122 -59 17
7678A7j82R0O3o1K36l30J79r1M0l7J7P5j6q8k7o0P6N3m0l6N2J18n7n1K49j80J91
$$ 17 -165 -75 -12 -73 163 -167 12 -79 -39 -76 -59 16 0 -88 -115 -175 -99 -46 -86 -122 -70 48 -9 -60 189 9 200
7705B00j53k40L59k32J57J16j97J53j30j98J54P1k5j12J48j41l4KK71k1NRl62
$$ 200 47 -193 166 -66 91 207 10 163 33 -165 -11 60 35 -77 71 -70 -104 -102 169 148 153 162 -200
7728b00J47p5J16j9Q2l3j15N5m1m3M5m9P2K3K17l01K95l23L00k40Q5k2k9N5K37
$$ -200 -53 -128 -12 -31 51 18 -97 -42 -83 -126 -81 -130 -58 -35 182 -119 176 -147 153 -87 -2 -24 -53 2 239
7753B39m41J69j6O4L4k55K66Q7O7m9q3om9J2Pk25N9J89j19o1J00M2K5q7o4K38
$$ 239 -202 -33 -49 15 49 -206 60 147 214 165 82 76 27 39 46 -179 -120 69 -50 -111 -11 31 56 -31 -95 143
7779A43p2j38L7j47J84Lj90L12M2j62j86J02l9k6L07l65J90K9m5l5L6K14Nl06
$$ 143 71 -67 -30 -177 7 10 -180 132 174 12 -174 -72 -111 -137 170 -195 -5 24 -21 -56 -20 194 199 -107
7803a07J19l2O9k15K06k12J59r9K20k68O3J74N1J32l12O8Q9p6M8k02J34M3j51
$$ -107 12 -20 49 -166 40 -172 -13 -112 108 -160 -97 77 128 260 -52 16 105 29 77 -125 9 52 -99
7826i9K81o0j2k66P1J67q4j35N2O5J96j63O1P4j86L6r0PJ84j16p9K14r8R2o7j54
$$ -99 182 122 110 -156 -85 82 -2 -137 -85 -20 176 13 74 148 -38 -2 -92 -85 99 -17 -96 118 20 112 45 -109
7852a09K15N7l4m0R8l12p2J03m1km4J92J16K8l02J23K5j44Q2l1J90Rj54J70K4
$$ -109 106 163 129 89 187 -125 -197 -94 -135 -137 -181 11 127 155 -147 -24 1 -143 -61 -92 98 107 -47 123 147
7877A47j31j0n0K65k82J79r4j12J48N3j48j30L54l17K25j74N0K43Ko9p3j40O7
$$ 147 16 6 -44 221 -61 118 24 -88 60 113 -35 -165 189 -128 97 -77 -27 216 218 149 76 -64 3
7900CL5k61K66P7j32rJ77%k16l2J43j53J07N9j33M1P0j58l1K44k18R7o9J3OK21
$$ 3 38 -223 43 120 -12 -21 156 156 -60 -92 51 -102 5 64 -69 -28 42 -116 -147 97 -121 -24 -93 -80 -74 147
7926A47j00o8k3j27K37l03K88N5r5k7J04O2OQ1j81k0m6J68j78r4J81j21R7q2Q0
$$ 147 47 -21 -44 -171 66 -237 51 106 11 -16 88 150 156 237 56 36 -10 158 -20 -114 67 -54 43 -39 41
7951D1P3p1o8J19j98j83K42J45m3k28J05K30j99o8M4P3M6k24J84j65K40l56K36
$$ 41 114 43 -25 94 -104 -287 -45 100 57 -171 -66 164 -35 -103 -59 14 60 -164 20 -145 95 -261 -25
7974b5O4Nk3j91N7j0L4K9nQ5J31k14J78l78K13j12M2J7J70J49k18K67J4j69j9
$$ -25 39 44 21 -170 -113 -123 -89 -60 -65 20 151 -63 115 -263 -50 -162 -120 -103 67 216 -2 265 279 110 91
7999I1M6j15k29J09J40l4K8j16J34j78K18k61K53n4pj05J90p4q3R1j41J21k06
$$ 91 137 22 -207 -98 42 8 36 -80 54 -124 94 -167 86 32 25 -80 110 36 -47 44 -97 24 -182
8022a82L30j4n3pK2n8r9J4K18k16j14M26k75j65K9J61M6q7Lj71J07J00NK6j01
$$ -182 148 134 81 74 96 38 -61 -47 171 -45 -159 267 -8 -173 -144 17 63 -24 -21 -192 -85 15 20 46 -55
8047e5RK37j74l2Kp0qJ63N3k30K43k18J92ok93K41j84k9K94m5j42J12J46k07k64
$$ -55 -46 191 17 -15 -13 -83 -91 72 125 -105 138 -80 112 106 -187 54 -130 -159 135 90 -52 60 206 -1 -265
8072b65K13MJ46j57m7j10K52Q7j68J26p4j22KJ49J45qk05j16J86j30J76j09J28
$$ -265 -52 -48 98 -59 -106 -216 36 123 -45 81 7 -115 -113 36 181 173 -32 -148 38 -92 84 -25 103
8095A03J45n9l62K97K4p3r8J74k38M0K22j52l3p9J45p5o0L08k23P1k63J65p2J73
$$ 103 248 189 -173 124 148 75 -23 151 -87 -47 175 23 -10 -89 56 -19 -79 229 6 77 -186 -21 -93 80
8119H0j27j63K38n7j90J38M7J41o8q5K86l01K1J19j36OJ54L2j37K9o2m3m3n0K03
$$ 80 -47 -210 28 -29 -219 -81 -34 107 39 -46 240 -61 -40 79 -57 -51 103 135 -2 27 -35 -78 -121 -171 32
8144C2K5n0q2O2q1J49L5j41j41K2K0K77m9j47J18r6l6Q6M0j14m2m6Q4J53J03J02
$$ 32 57 7 -75 -13 -94 55 90 -51 -192 -170 -150 127 78 -69 49 -47 -83 3 43 -71 -113 -159 -75 78 181 283
8170B83j06k71l5L91j67j90k4L7J50j29J52m00M78j58Q8o4J25M4l21M2N7
$$ 283 177 -94 -129 262 95 -95 -119 -82 68 -61 91 -309 169 11 99 35 160 204 -117 -75 -18
8191a8
$$ Imaginary data points
##PAGE= N=2
##DATA TABLE= (X++(I..I)), XYDATA
0@%%%%%%%%%%%%%%%pJ5j6J6j6J7k5L2l2M0m8N6o6P4q5R6j10J26j42J60j79K01
$$ 0 0 0 0 0 0 0 0 0 0 0 0 0 0 0 0 -7 8 -8 8 -8 9 -16 16 -16 24 -24 32 -34 40 -45 51 -59 67 -75 85 -94 107
37A07k27K53k80L09l46L85m24M69n17N70o28O92p64Q43r30J024j130J251j385
$$ 107 -120 133 -147 162 -184 201 -223 246 -271 299 -329 363 -401 442 -488 536 -594 657 -728
56g28J538j714J921k165K461k828L290l900M741n974P962j1662K0708p9638r2550
$$ -728 810 -904 1017 -1148 1313 -1515 1775 -2125 2616 -3358 4604 -7058 13650 -65988 -158538
71a58538K38751n584j50141N4855L8775o6401R1818J5545j69178N3996J86992
$$ -158538 80213 74629 -75512 -20657 18118 -48283 43535 59080 -110098 -56102 130890
82A30890j18472j32677J28253M5594q1486L8665j3274p7816J13441O8871j82071
$$ 130890 12418 -120259 7994 53588 -27898 10767 -2507 -80323 33118 101989 -80082
93h0082j9594J87976l6937j31816P1348L4624n6657O3892J605j26031P0736J32626
$$ -80082 -99676 88300 51363 -80453 -9105 25519 -31138 32754 34359 -91672 -20936 111690
105A11690j23310q9600J32583K3421q6546L4386K186n7142Q9862L7584j49217
$$ 111690 -11620 -101220 31363 54784 -31762 2624 4810 -52332 37530 75114 -74103
116g4103J1367J56253n9914j09211Q0593L1269o1070M8653O535r8249O2942J02603
$$ -74103 -62736 93517 33603 -75608 4985 36254 -24816 23837 30372 -67877 -4935 97668
128I7668j14884o7628J25100J5401q8221K7541J8855m1130N5601K0724j06874
$$ 97668 -17216 -84844 40256 55657 -32564 -5023 13832 -27298 28303 49027 -57847
139e7847K0279J15934n9427q1555P2534K1687n1124L4303Q85o6874N7495O5358
$$ -57847 -37568 78366 18939 -62616 9918 31605 -19519 14784 15669 -51205 6290 71648
151G1648j00433l5670J08711n946p8517L4509K0552l6505L9356J2125p9877K5499
$$ 71648 -28785 -64455 44256 38310 -40207 -5698 14854 -21651 17705 29830 -50047 -24548
163b4548Q6380n9269o1405P1141J6383n1897K6079P460m8774M3637M3355q1425
$$ -24548 61832 2563 -58842 12299 28682 -23215 2864 10324 -38450 5187 48542 -32883
175c2883j7074R0938j4258o9186L5156K5483l5052K1975J2479n3408K1638N8943
$$ -32883 -49957 40981 26723 -42463 -7307 18176 -16876 5099 17578 -35830 -14192 44751
187D4751m9289l9249N6991Q590m1247J9592P034l0907L2918K1747o0413J310O6270
$$ 44751 -4538 -43787 13204 21794 -19453 139 7173 -23734 9184 30931 -29482 -28172 38098
200C8098k5409m7176L8139J4923l2079J7924J0958l8499J7305M0359l9653k4191
$$ 38098 12689 -34487 3652 18575 -13504 4420 15378 -23121 -5816 34543 -5110 -29301
212b9301M6952Q15l3768J6880P883k1554K0264J2200l9526O033M3354k3507l1396
$$ -29301 17651 18466 -15302 1578 9461 -12093 8171 20371 -19155 -13122 30232 6725 -24671
225b4671L1835R067k6037J2092R792k4728J0643K3969k6411j4071L1513N5k4248
$$ -24671 7164 16231 -9806 2286 12078 -12650 -2007 21962 -4449 -18520 12993 13048 -11200
238a1200R913Q026j1809R404L402k1067Q781K2020j9176j4028K2422P40j8094
$$ -11200 -1287 6739 -5070 4334 7736 -13331 -4550 17470 -1706 -15734 6688 7428 -10666
251a0666J1644N497j7620R040J4562j9601o285K2449l771j7934R910Q435j0065
$$ -10666 978 6475 -11145 -2105 12457 -7144 -13429 9020 5249 -12685 -2775 5660 -4405
264d405J887M970r385K910J0627j0275n529J2788j601r651P657L245r849M091
$$ -4405 -2518 2452 -6933 -4023 6604 -3671 -9200 3588 1987 -7664 -7 3238 -6611 -2520
278b520Q416j0156l112J2934k970j0561P008N635o502j004M664j815j055L220
$$ -2520 5896 -4260 -7372 5562 2592 -7969 -961 4674 -1828 -2832 1832 17 -1038 2182
292B182k087j438L514j746j487M179j193m341M706K298o322R15O420l423n411
$$ 2182 95 -1343 2171 425 -1062 3117 1924 -2417 2289 4587 -1735 -820 5600 2177 -3234
307c234O085K637o523O20N005k759k588K898J066k341p36J644J84p17p09K54J465
$$ -3234 2851 5488 -1035 -415 4590 1831 -757 2141 3207 866 130 1774 1958 1241 532 786 2251
324B251q54j973K048J517l636m31L018k79l040R76K442k180j690K139R86k374
$$ 2251 1397 -576 1472 2989 -647 -1078 1940 1661 -1379 -403 2039 -141 -1831 308 1294 -1080
340a080q76J599J314k277j000K612l25k697J024K389j202l017K248K302l096j389
$$ -1080 -1956 -357 957 -1320 -2320 292 -33 -2730 -1706 683 -519 -3536 -1288 1014 -2082 -3471
356c471L517k4l343R25L030j229k627J860J707k143j57J385O0p74m44J443Q04
$$ -3471 46 22 -3321 -2396 634 -595 -3222 -1362 345 -1798 -1955 -570 -510 -1284 -1728 -285 519
373E19j677q75K400J013k992l02M363j383m136L268L520m362j051M364j366k919
$$ 519 -1158 -2033 367 1380 -1612 -1914 2449 1066 -3070 198 3718 -644 -1695 2669 1303 -1616
389a616L197J470m208Q63L752k876o46K390j657L44K274l577p87O074j934p042
$$ -1616 1581 3051 -1157 -294 3458 582 -64 2326 669 1013 3287 -290 -1077 4997 3063 -3979
405c979N298N209q011p27P996n031m214Q557j178r410O323O259r188j656Q378
$$ -3979 1319 6528 -1483 -2210 5786 755 -3459 5098 3920 -5490 833 7092 -2096 -3752 4626
420D626l238l937N465l461l539R012k313j0867Q324P331j1740m88J0142p409m070
$$ 4626 1388 -2549 2916 -545 -4084 4928 2615 -8252 72 7403 -4337 -4825 5317 -2092 -6162
435f162J2911o015j2937J5019O816j8769J549J5520q415o660J0069m351n858J3420
$$ -6162 6749 734 -12203 2816 9632 -9137 -7588 7932 -483 -7143 2926 -1425 -7283 6137
449F137l563j5807J2864J1245j7749r99J4004q568l583J4010j0123j2030K2081
$$ 6137 2574 -13233 -369 10876 -6873 -7872 6132 -2436 -6019 7991 -2132 -14162 7919
462G919M194k7090P176K2339j5169r434J5434n296p037J6830o170j9675J8456
$$ 7919 12113 -14977 -7801 14538 -631 -10065 5369 73 -6964 9866 3696 -15979 2477
475B477J4221k4160k653K0086r003n754J4235j2143j0121K6950r98l2323J4202
$$ 2477 16698 -7462 -10115 9971 968 -4786 9449 -2694 -12815 14135 13137 -19186 -4984
488d984K6405k2414j1485K1034o539r047K0151r613k2981K6407J4992l3429j851
$$ -4984 21421 -993 -12478 8556 2017 -7030 13121 3508 -19473 6934 21926 -11503 -13354
501a3354K7959j0625j0844J4637j1268q335K9536p018l6136K2626K9116l1413
$$ -13354 14605 3980 -6864 7773 -3495 -11830 17706 10688 -25448 -2822 26294 -5119
513e119j1998K6819p330j0334K0295j2734k2537L3502J2931m3251K514L6759j4960
$$ -5119 -17117 9702 2372 -7962 12333 -401 -22938 10564 23495 -19756 -17242 19517 4557
526D557j6867J6414p957o342K7487j1757l5294L0110K8272l9121j0724L2944q296
$$ 4557 -12310 4104 -3853 -10195 17292 5535 -29759 351 28623 -10498 -21222 11722 3426
539C426j2683J9780j4727j8820L8753O395m9266J0474M2945k2511k1850K2619
$$ 3426 -9257 10523 -4204 -23024 15729 22124 -27142 -16668 26277 3766 -18084 4535
551D535m618q132K5247j4896l2005L6656K4239m6416o955L9338j0419j6267J9358
$$ 4535 -83 -8215 17032 2136 -29869 6787 31026 -15390 -22345 16993 6574 -9693 9665
564I665j4360j4074M0436k165n1638K1159M4789l2485k3551K9582k115j1437K1809
$$ 9665 -4695 -18769 21667 19502 -32136 -10977 33812 1327 -22224 7358 5243 -6194 15615
577A5615j5534k7111L9802J8141n0578j182M2952j3694j9449J8076j0705q799
$$ 15615 81 -27030 12772 30913 -19665 -20847 22105 8411 -11038 7038 -3667 -12466
589a2466L5287r464m6842K9732L9878m0856j9985L5746l323j5034J8880j3364
$$ -12466 22821 13357 -33485 -3753 36125 -4731 -24716 11030 7707 -7327 11553 -1811
601a811k1675L8367J1687n0635M591M4162j7524k2682J9254o170o860K8862j4255
$$ -1811 -23486 14881 26568 -24067 -19476 24686 7162 -15520 3734 -2436 -9296 19566 5311
614E311l8397L4947L1769m5468j4038L9644n932j8249J8352j1392j7356L7231
$$ 5311 -33086 1861 33630 -11838 -25876 13768 7836 -10413 7939 -3453 -20809 16422
626A6422M709m9503J1966M3965k3609k3804K2845j639q172K2084j4903k9124L6366
$$ 16422 21131 -28372 -16406 27559 3950 -19854 2991 1352 -6820 15264 361 -28763 7603
639G603K2164m6454n993M0292r994j9201J7762q582j2794L2689j415m3768J8337
$$ 7603 29767 -16687 -22680 17612 7618 -11583 6179 -2403 -15197 17492 16077 -27691 -9354
652i354L9057k8667k1687K6527K17j1168J6092j1692k0380L2311J3292m2267R60
$$ -9354 29703 1036 -20651 5876 6093 -5075 11017 -675 -21055 11256 24548 -17719 -16759
665a6759L7322j3748j8525J7440n914r482K5945n899l5400K2839L1187l2654j6222
$$ -16759 20563 6815 -11710 5730 -184 -9666 16279 10380 -25020 -2181 29006 -3648 -19870
678a9870K9557j641j3918J3104p686j4726K7159O076l6179O241L2091j6295j6779
$$ -19870 9687 8046 -5872 7232 -454 -15180 11979 18055 -18124 -11883 20208 3913 -12866
691a2866J7272l560p859J9849q631k6314K4428K0991l2465q694K9206m810j5572
$$ -12866 4406 846 -7013 12836 4205 -22109 2319 23310 -9155 -17849 11357 6547 -9025
704i025J2711l763j1503K0523K253k8662R210K5218j6835j3190J6020j465p069
$$ -9025 3686 -77 -11580 8943 11196 -17466 -8256 16962 127 -13063 2957 1492 -5577
717e577J3059p208j6634K0782J1519k7360j650K4672p920j3271J2249j820r029
$$ -5577 7482 274 -16360 4422 15941 -11419 -13069 11603 3683 -9588 2661 841 -8188
730h188J4737O07k0971R479J8973j5951r968J5552j267p155Q930m653j0051J5533
$$ -8188 6549 7156 -13815 -4336 14637 -1314 -11282 4270 3003 -4152 4778 125 -9926 5607
744E607N307k0608K558J9124r850r803J1919j784q014J1514K1j5613Q591J3301
$$ 5607 10914 -9694 -7136 11988 2138 -7665 4254 2470 -5544 5970 5991 -9622 -1031 12270
758A2270j3708o375J3388j467p197O055j799o086R441K508j3499L668J1747q404
$$ 12270 -1438 -7813 5575 4108 -3089 2966 1167 -4919 4522 7030 -6469 -2801 8946 542
772E42n846R190j886o090Q292n50j0434P069Q219j1067l228J0251j581o436M490
$$ 542 -5304 3886 2000 -4090 4202 3652 -6782 287 8506 -2561 -5789 4462 2881 -3555 935
787I35K79m529N030J290p867L020O755n967l130O488k047l671N276r29o238N183
$$ 935 1214 -3315 1715 3005 -4862 -1842 4913 -1054 -4184 2304 257 -3414 1862 933 -5305 -122
803a22M724q132j226P974k544m740M100Q10l363K150J595l965J134L755l435j204
$$ -122 4602 -3530 -4756 3218 674 -4066 34 844 -2519 -369 1226 -2739 -1605 2150 -1285 -2489
819b489L505j402j497L069j429k880M003J293m712P34M508k392k836L421P52l275
$$ -2489 1016 -386 -1883 1186 -243 -3123 880 2173 -2539 -1805 2703 311 -2525 896 1648 -1627
835a627J620J799k314L7J771o68r01R84Q0l45M70m95n36J684k31k332J481J633
$$ -1627 -7 1792 -522 -485 1286 618 -283 701 781 436 906 411 -125 1559 1328 -1004 477 2110
853B110k192l55K163j90k378J432J370j718m47J436p0j311K83Q52j91p74k29P90
$$ 2110 -82 -437 1726 1536 -842 590 1960 242 -205 1231 1161 -150 133 985 794 20 -209 581
871E81j61o70M5J032o17j265O75J308j322o05J312N3j460K25J340o75j350J087
$$ 581 420 -250 -205 827 210 -1055 -380 928 -394 -999 313 366 -1094 -869 471 -204 -1554 -467
889d67O45q30n84J022K36r96k84J060n9r58J71Q94L07j361k48J858p85j189J247
$$ -467 178 -652 -1236 -214 22 -974 -1258 -198 -257 -1215 -1044 -150 157 -1204 -1452 406 -379 -1568 -321
908c21Q85j439k10J333j60j345Q91J018j057l45R61j54k76J31k15Q57R8j355M55
$$ -321 564 -875 -1085 248 88 -1257 -366 652 -405 -750 211 57 -219 -88 -303 554 652 -703 -248
927b48J736j113j234J661N54k480J057K162k091j025K852m76k630J849J491k025
$$ -248 1488 375 -859 802 1356 -1124 -67 2095 4 -1021 1831 1355 -1275 574 2065 40
943D0k31J351q55J72J076j776k06K460j119k063K289N01k848J606J596l206O3
$$ 40 -191 1160 305 477 1553 -223 -429 2031 912 -1151 1138 1639 -1209 397 1993 -1213 -1150
960a150M342k708l685M428J624m595N05K942k212l52K194k231j279M188j451l738
$$ -1150 3192 484 -3201 1227 2851 -1744 -1239 1703 -509 -861 1333 -898 -2177 2011 560 -3178
976c178L166J492l552J637J896m095J006N338n105l847P151R98p225K630M629
$$ -3178 -12 1480 -2072 -435 1461 -2634 -1628 3710 -1395 -5242 1909 2907 -4318 -1688 2941
991B941m646J1L709m196j453O818k247o029N107L252n497Q95L097m502J988N408
$$ 2941 -1705 -1694 2015 -2181 -3634 3184 937 -5092 15 3267 -2230 -1335 1762 -2740 -752 4656
1007D656p120l044J0071n44r698M508N989o402R0N078n731p93Q901m292q410Q083
$$ 4656 -2464 -5508 4563 4019 -5679 -1171 4818 -1584 -1494 3584 -2147 -2940 5961 1669 -6741 1342
1023A342M881q564J84N318m582J630N000q026k587J2612k434j2147P177O855q271
$$ 1342 6223 -2341 -2157 3161 -1421 209 5209 -2817 -5404 7208 4774 -7373 -196 6659 -1612
1038a612Q1N865o990L86J0049p013r467J2061M955j2712Q06P874m724n1N188q742
$$ -1612 -1531 4334 -2656 -2270 7779 766 -8701 3360 8315 -4397 -3591 4283 -441 -492 4696 -4046
1054d046j102J3440m632j3272R341P799j0382K04O244p537J918J0382j0663q595
$$ -4046 -5148 8292 3660 -9612 -271 7528 -2854 -2650 3594 -3943 -2025 8357 -2306 -10901
1068a0901J6280L117j6250K774J0653o696p23N283q425nJ4021p350j3562J2579
$$ -10901 5379 8496 -7754 -4980 5673 -1023 -1746 3537 -4888 -4893 9128 1778 -11784 795
1082G95P689j2775M2P403o420J943R196j2555o007J8804p0j8552N940J2636q996
$$ 795 8484 -4291 -4249 3154 -3266 -1323 7873 -4682 -10689 8115 8045 -10507 -4567 8069 -927
1097i27k012O119p482Q28J3410r186j2937J5046P506j5266K04R024n835J792O824
$$ -927 -2939 3180 -4302 -3474 9936 750 -12187 2859 10365 -4901 -4697 4327 -1508 284 7108
1112G108j2303l128J9456m141j8992R732J2876j1753k293P384p114J199J2356
$$ 7108 -5195 -8323 11133 6992 -12000 -2268 10608 -1145 -3438 3946 -3168 -1969 10387
1125A0387j1117j1766J7905N988j8074J344J1158n988K9N611j1210k12J8022p424
$$ 10387 -730 -12496 5409 11397 -6677 -5333 5825 -163 -134 5477 -5733 -5945 12077 4653
1139D653j8260J3266J1858j4416k003Q920o698J187J0577j1910r147J9094L212
$$ 4653 -13607 -341 11517 -2899 -4902 4018 -2680 -1493 9084 -2826 -11973 7121 10333
1152A0333j9501L184J3084o935k278N267q632J197J4939r327j4949J5123R322
$$ 10333 -9168 -5984 7100 165 -2113 3154 -5478 -4281 10658 1331 -13618 1505 10827
1165A0827j5831o49R527o275J130Q619j1917o103J9384o20j9538O807J3217q918
$$ 10827 -5004 -5653 3874 -2401 -1271 7348 -4569 -10672 8712 8092 -11446 -4639 8578 -340
1179c40l359O084o389J401J2029j0167j1588J6073O485j6309R02R960n883J51
$$ -340 -3699 2385 -4004 -2603 9426 -741 -12329 3744 10229 -6080 -5178 4782 -1101 -950
1193i50O805j0616k549J7375m188j7684R807J2262j1350l343P710n075O26R197
$$ -950 5855 -4761 -7310 10065 5877 -11807 -2000 10262 -1088 -4431 3279 -1796 -1170 8027
1207H027r115q518J5093L441j5513K356J0181n856j023N088q024n26J3658n811
$$ 8027 -1088 -9606 5487 8928 -6585 -4229 5952 96 -927 4161 -3863 -4389 9269 3458
1221C458j4121J1274R296j2336k008Q108m392m90P116p560o137J3335J797j4379
$$ 3458 -10663 611 9907 -2429 -4437 3671 -721 -1211 5905 -1655 -7792 5543 7340 -7039
1235g039L571R358o333j427M462o042O23J0353o867j0422J1649N855j2130J27
$$ -7039 -3468 5890 -443 -1870 2592 -3450 -2827 7526 659 -9763 1886 7741 -4389 -4262
1249d262Q137m932o44N893o576m004J1507n95j2155M982Q129o322k050M421m014
$$ -4262 3875 -1057 -1701 4192 -2384 -6388 5119 4524 -7631 -2649 5480 -842 -2892 1529 -2485
1264b485P44O707n923o415J0165K949j0596J784O849n080n35N127n216k235Q733
$$ -2485 -1741 4966 -957 -7372 2793 5742 -4854 -3070 3779 -1301 -1836 3291 -1925 -4160 4573
1279D573j547r082N034O506o294j932M700k426n09M676m618l509P698P50p749
$$ 4573 3026 -6056 -1022 5484 -810 -2742 1958 -468 -977 3699 -919 -4428 3270 4020 -3729
1294c729K293N192m246n48M102l980j564O923k477o703N193M495o096j096M548
$$ -3729 -1436 3756 -490 -1038 3064 -916 -2480 4443 1966 -4737 456 4951 -1145 -2241 2307
1309B307j810j456L260k418k573N135j5n263K398L400l647m02K867k720m62M261
$$ 2307 497 -959 2301 -117 -2690 2445 2430 -2833 -435 2965 -682 -1084 1783 -937 -1399 2862
1325B862k258m365M691K378n283J22L946k042j610K544j265j624K977O5l447J317
$$ 2862 604 -3761 930 3308 -1975 -1853 2093 51 -1559 985 -280 -1904 1073 1138 -2309 -992
1341i92K350k152m55J719j689J00K408j855k103L329O99l670J036K782j970j090
$$ -992 1358 -794 -1249 470 -1219 -1119 1289 -566 -2669 660 1359 -2311 -1275 1507 -463 -1553
1357a553K317j056j168K055J0k130J050J360j214k62P78n42J23Q58j064m99J853
$$ -1553 764 -292 -1460 595 605 -1525 -475 885 -329 -591 187 -355 -232 626 -438 -937 916
1374I16l05j726R19J395j675k01J764p52j401J721K48j517O16J002o27o09N85
$$ 916 611 -1115 -196 1199 -476 -677 1087 335 -1066 655 903 -614 2 1004 377 -232 353
1391C53N67o04J63j54j17N03l87n04O96J80r75K53R88o46o91J223l01j077M12
$$ 353 920 316 479 325 208 711 324 -180 516 696 -279 -26 962 316 -375 848 547 -530 -118
1410a18R46n95p94Q18K56o61M1L43Kl67k75N96j11k84l72M28M45o86p0P12m25
$$ -118 828 233 -561 257 513 -148 -107 236 238 -129 -404 192 81 -203 -575 -147 298 -388 -458 254 -171
1431a71o74M38O27r63o9Q43j24q26O18L96k53l93K78K11k59m02N22M0j99r0K35
$$ -171 -845 -407 220 -743 -812 31 -93 -919 -301 95 -158 -551 -273 -62 -321 -723 -201 -161 -360 -450 -215
1452b15N27n82l12R66l57r16R36P45j141j98J159l35q09N31Q40p58k02L88j50
$$ -215 312 -270 -582 384 27 -889 47 792 -349 -547 612 277 -532 -1 839 81 -121 267 117
1471A17J29J37m06J85L77o14J41P74n01o55R83L07j310K74J608j110j216J492
$$ 117 246 383 -23 162 539 -75 66 840 339 -316 667 974 -336 -62 1546 436 -780 712
1489G12M03j288O8Q75o19R6P10r72k51J149q85l52R18m55n30R96k9j632R73J853
$$ 712 1115 -173 -105 770 151 247 957 -15 -266 883 -2 -354 564 109 -421 575 546 -1086 -113 1740
1509A740k562r32K817j71k207J172R88k032P61J420k057o7K200j039j535J620
$$ 1740 -822 -1754 1063 892 -1315 -143 845 -1187 -426 994 -1063 -1130 1070 31 -1504 116
1525A16j00j088J375k68j885J904J542k806q22L543r20k514K087O69k464J578
$$ 116 16 -1072 303 35 -1850 54 1596 -1210 -2032 1511 591 -1923 164 833 -1631 -53
1541e3J708l518N59L498j830k568K671O09j908J200Q1k087K334J868m453J6M718
$$ -53 1655 -1863 -1304 2194 364 -2204 467 1076 -832 368 449 -1638 696 2564 -1889 -1873 2845
1558B845k022k876K893M50k892K607J027m189J355M645l527l422M725N17l127
$$ 2845 823 -2053 840 1290 -1602 1005 2032 -2157 -802 3843 316 -3106 1619 2136 -991
1573i91J407M24k116K398J714m955J38N566k500l616L448N83l022L006R5m891
$$ -991 416 840 -1276 1122 2836 -2119 -1981 3585 1085 -2531 917 1500 -1522 1484 1579 -3312
1589c312L064M890n713k967O241M43m987K095J278k818K782J261n497J163N989
$$ -3312 -248 4642 -1071 -4038 2203 2646 -2341 -246 1032 -1786 996 2257 -3240 -2077 3912
1604C912l529m046M109J031l213K562j34m405M079M335p355k139Q138j033o128
$$ 3912 383 -3663 446 1477 -1736 826 692 -3713 366 4701 -2654 -4793 3345 2312 -3816
1619c816L166J800l301L010J383o379K122P023m954m950N882J360m251K454l4
$$ -3816 -650 1150 -2151 859 2242 -4137 -2015 5008 54 -4896 986 2346 -1905 549 515
1634E15m008M971L125q267o78R339k695o902M774K190m000K983O99o149L121O990
$$ 515 -3493 1478 4603 -3664 -4342 4997 2302 -4600 174 2364 -1636 1347 2046 -4103 -982 6008
1650F008o398m899P509J209n323J817J093l329M547J821q145J172R011m161o735
$$ 6008 -390 -5289 2220 3429 -1894 -77 1016 -2313 2234 4055 -4090 -2918 6093 1932 -4803
1665d803N623K305m513K506O09n686M004O416q190l897Q891N86o957K542J761
$$ -4803 820 3125 -1388 1118 1727 -3959 45 6461 -1729 -5626 3265 3851 -3106 -564 1197
1680A197k902L692J016p786K737Q358o002n681O597J835m894K293N52n076M974
$$ 1197 -1705 1987 3003 -4783 -2046 6312 310 -5371 1226 3061 -1833 460 1012 -4064 910
1695I10M584q838k117R798j265p533L597K743l403K635M77o229L221P348o644
$$ 910 5494 -3344 -5461 4337 3072 -4461 -864 1879 -1524 1111 1588 -4641 -1420 5928 -716
1710g16n116P700J081n212K173N33l781M688K963q487n49J0091k938p494M611
$$ -716 -5832 1868 2949 -2263 -90 443 -3338 1350 4313 -4174 -4723 5368 2430 -5064 -453
1725d53K890l727J892Q48n346L379N982o499m012P617R33o039K390J251l316M015
$$ -453 2437 -1290 602 1450 -3896 -517 5465 -1034 -5046 2571 3504 -2535 -145 1106 -2210 1805
1741A805J625p545J377Q425m132o707N993K470m684J905J087m653L517M676o911
$$ 1805 3430 -4115 -2738 5687 1555 -5152 841 3311 -1373 532 1619 -3034 483 5159 -1752
1756a752k638P728m9n771K201J650k633K965L56n555K082O719n276m602O076J305
$$ -1752 -4390 3338 3289 -2482 -281 1369 -1264 1701 2057 -3498 -1416 5303 27 -4575 1501 2806
1772B806m586J918J232l829K932L404o324j389P385j210n692K645K004k366J668
$$ 2806 -1780 138 1370 -2459 473 3877 -2447 -3836 3549 2339 -3353 -708 1296 -1070 598
1787E98M52m307K422M892m777l430N542P05m429K039J077k797K344K327n390o0
$$ 598 1050 -3257 -835 4057 -720 -4150 1392 2097 -2332 -293 784 -2013 331 2658 -2732 -2792
1803b792N974j719m788L188K029l071R29J113k963J804L110m123j691M931l66
$$ -2792 3182 1463 -3325 -137 1892 -1179 -250 863 -2100 -296 2814 -1309 -3000 1931 1565
1818A565l690J932J074k352J946J450m329R71N006k962l400L358J761l156P32
$$ 1565 -2125 -193 881 -1471 475 1925 -2404 -1433 3573 611 -2789 569 2330 -826 -94
1833i4J350k294J411J973l256q53L736n82k966J876R42j898J443N75k990J032
$$ -94 1256 -1038 373 2346 -910 -1763 1973 1391 -1575 301 1243 -655 788 1363 -1627 -595
1849e95L463k727k455L539L80k563Q77J207j835N91J558k207o74K774m41k307
$$ -595 2868 141 -2314 1225 1605 -958 -81 1126 -709 -118 1440 -767 -1441 1333 892 -1415
1865a415J345Q69j389R16L60j790Q84J967k250j321K819k22k242J057J284j734
$$ -1415 -70 799 -590 326 686 -1104 -220 1747 -503 -1824 995 773 -1469 -412 872 -862
1881h62N62J000j481l92J951m29j527P95Q87j084K73M41r76M71R23q91n76J614
$$ -862 -300 700 -781 -1173 778 349 -1178 -383 504 -580 -307 134 -842 -371 552 -339 -915 699
1899F99n31j382J261M90j469O30Q23j080j79J453n56j026J005N72r87n1L47j97
$$ 699 168 -1214 47 537 -932 -302 521 -559 -738 715 159 -867 138 710 -277 -328 19 -178
1917a78K63K96n83K11P00m18p13Q68J28q55L45O56r55M4Q31L2q56N13M56r11l9
$$ -178 85 381 -202 9 709 291 -422 446 574 -281 64 720 -235 -191 640 672 -184 329 785 -126 -165
1938a65P11l32j43K30j36L0J98n15J82J44k0k81K30L11q24O81k9m60k46O42L91
$$ -165 546 214 71 301 165 195 393 -122 60 204 184 -97 133 444 -380 301 272 -188 -434 208 599
1959E99r32K60N31n61l59O57l34q4j7L11k79L0j11K9L24l96K25j48N4Pk32L75
$$ 599 -333 -73 458 -103 -462 195 -139 -223 -240 71 -208 -178 -289 -260 64 -332 -107 -255 -201 -194 -426 -51
1981e1mn35N97J14n54R0M39J65o79K53K25j18k49L62L4n1j27q3L09j13k36J56
$$ -51 -55 -590 7 121 -433 -343 96 261 -418 -165 60 -58 -307 55 89 38 -89 -172 137 24 -212 -56
2003e6M41m31j58L98K66r19L05M07m03j89Q88q1l48O0J92k82%J85l37J53M3j8
$$ -56 385 -46 -204 194 460 -459 -154 253 -150 -339 549 468 120 180 372 90 90 275 -62 91 134 116
2025A16K05J59o51J47N93j51r04O06L49q19p2J203n22o62M81L39p38L24L53m97
$$ 116 321 480 -171 -24 569 418 -486 120 469 -350 -422 781 259 -403 78 417 -321 3 356 -141
2045a41j08M58k02l39N84n53P3O70m82p68R40M07j317L54J142q35n55J054l13
$$ -141 -249 209 7 -332 252 -301 -228 442 -40 -808 132 539 -778 -424 718 -117 -672 382 69
2064F9j130J081M94j302J20J289q54l57O01p0k64R11q41r22J357M64j706M52J336
$$ 69 -1061 20 514 -788 -668 621 -233 -590 11 -59 -323 588 -253 -1175 182 646 -1060 -608 728
2083G28q88o60J383o37r41K039n83j538O60J853j713o54J527j19q21R83m60j045
$$ 728 -160 -820 563 -74 -1015 1024 441 -1097 -437 1416 -297 -951 576 457 -364 619 159 -886
2101h86J749K41k378J130J419j245m22J152q99l45J878q98k032J919J443k323
$$ -886 863 1104 -1274 -144 1275 30 -392 760 -139 -484 1394 496 -1536 383 1826 -497
2117d97p01K260o84r87J300o95j064K119K03k664P33K319j788o51J317q03l09
$$ -497 -1198 1062 378 -609 691 -4 -1068 1051 1254 -1410 -677 1642 -146 -797 520 -283 -592
2134e92K000j334k286K638J588l291r7K577r23r87J249p41j345K568K8l270J281
$$ -592 1408 74 -2212 426 2014 -1277 -1374 1203 280 -707 542 -199 -1544 1024 1052 -2218 -937
2151i37K623j844j166J665m59l37J371j454j704L200Q26l668K10L082j311j233
$$ -937 1686 -158 -1324 341 -118 -455 916 -538 -2242 958 1784 -1884 -1674 1408 97 -1136
2167a136J828q42j279K975n09l637K315K779k841j429K476l47o16J489j829j325
$$ -1136 692 -150 -1429 1546 1037 -2600 -285 2494 -347 -1776 700 353 -263 1226 -603 -1928
2183a928L697L10m479J275L330j929j532K077r55q30K801j003l601L081K742l768
$$ -1928 1769 2079 -2400 -1125 2205 276 -1256 821 -134 -964 1837 834 -2767 314 3056 -712
2199g12j066L149m14j597J720j636q60L486l62m274J921L339k661j460K218q35
$$ -712 -1778 1371 957 -640 1080 -556 -1416 2070 1708 -2566 -645 2694 33 -1427 791 -44
2215d4o06K411j475k905L729J944m660o07M085r39j799J356r36r45L263p19l869
$$ -44 -650 1761 286 -2619 1110 3054 -1606 -2213 1872 933 -866 490 -446 -1391 1872 1153 -2716
2232b716K073L288l084j413K574o51p94K042j673k534M250J335n179M06M260j748
$$ -2716 -643 2645 -439 -1852 722 71 -723 1319 -354 -2888 1362 2697 -2482 -2076 2184 436
2248D36j945K028p24r63K858j115l401K506K775l165j244K760p14n64J515j670
$$ 436 -1509 519 -205 -1168 1690 575 -2826 -320 2455 -710 -1954 806 92 -472 1043 -627
2264f27j364L798R8m448J238L889k494j516K044l18j055K281q88l101K827K428
$$ -627 -1991 1807 1905 -2543 -1305 2584 90 -1426 618 300 -755 1526 638 -2463 364 2792
2280B792l682r79L150o10j195J263r98j198L410n23l822J844L284k599j602K357
$$ 2792 -890 -1869 1281 671 -524 739 -259 -1457 1953 1430 -2392 -548 2736 137 -1465 892
2296H92o48q46J904q76k454K794J885l749n32L275q01j560J074o02o26K388q11
$$ 892 244 -602 1302 426 -2028 766 2651 -1098 -1630 1645 844 -716 358 -244 -870 1518 707
2313G07k957K149K511k895j262K516m48j104J736j286j684K905R64l549J82L280
$$ 707 -2250 -101 2410 -485 -1747 769 321 -783 953 -333 -2017 888 1852 -1697 -1515 1765
2329A765j302j748J283pp14J695o15k408K222J724k730q04K334n34q60J380r34
$$ 1765 463 -1285 -2 -9 -723 972 357 -2051 171 1895 -835 -1639 695 161 -699 681 -253
2346b53j204K432K22k916Q36K785j563j665J746n6j155J259l97j528J992Q46k188
$$ -253 -1457 975 1197 -1719 -883 1902 339 -1326 420 364 -791 468 71 -1457 535 1381 -807
2363h07j55J786n26o72J139j044m55J764j87k371J175J981j575j245J779j78q43
$$ -807 -962 824 298 -374 765 -279 -734 1030 843 -1528 -353 1628 53 -1192 587 409 -434
2380d34J018j74j184J208P79j771k16J735m69j033J027m62l44J170o10j396J347
$$ -434 584 410 -774 434 1213 -558 -774 961 492 -541 486 24 -320 850 240 -1156 191
2397A91R20j392m74J365m32p65Q88O7j268J034P99j607K29J162n67p42P96j27
$$ 191 1111 -281 -755 610 178 -587 301 368 -900 134 933 -674 -445 717 150 -592 204 77
2415G7l70O12j91q70O55P47j212L2Q82l65m43N86k70n65Q21N85j645M16J057m87
$$ 77 -293 319 128 -742 -87 660 -552 -520 362 -3 -446 140 -130 -695 126 711 -934 -518 539 52
2435E2p17N48J80m66M29J12n21N64J00n46j7O50l98l48O75m36j40N84J34r49L70
$$ 52 -665 -117 63 -403 26 138 -383 181 281 -265 -282 368 -30 -378 297 -139 -279 305 439 -510 -140
2456a40P11o65l80O22J84m63N0N19n18j0K71k30j29O61l05k24K36o0j22K92p9
$$ -140 571 -94 -474 148 332 -131 -81 438 -80 -90 181 -49 -178 483 178 -46 190 130 8 300 221
2477B21l26L03K30l85j79M99p8m18J76L10m80o4K66p4k63L39J00k91K86k45j9
$$ 221 -105 198 428 43 -136 363 285 -133 43 353 -127 -191 75 1 -262 77 177 -114 172 -73 -92
2498i2L28l23k51J99L42n86J52L59l49j99L86J85l82J60K14k04k93N08j80k32
$$ -92 236 -87 -338 -139 203 -383 -231 128 -221 -420 -34 151 -231 -71 143 -61 -354 154 -26 -258
2518b58J17K19j00j35j99J0P7L12k60K6L21l70mL70J38n47J02N35m03k23O34j51
$$ -258 -141 78 -22 -157 -356 -346 -269 43 -217 -191 130 -240 -244 126 264 -283 -181 354 -49 -272 362 211
2540B11m30R4M31m10q7K09m0M0K04k16R3J90l86P4K64o9m83O41j23m10K6N10j30
$$ 211 -219 -125 306 -104 -191 18 -22 18 222 6 99 289 -97 -23 241 172 -311 330 207 -203 -177 333 203
2563B03l15L55k53o0K21J70k49k06K14K65k59M1p6K47J05m21m1K12k17j98J62
$$ 203 -112 243 -10 -70 151 321 72 -134 80 345 86 127 51 298 403 -18 -59 153 -64 -262 -100
2584a00L03m47J53N92m67n04M26K72n02J23L75j53L0K4l95J10J91K0n59M76L41
$$ -100 203 -244 -91 501 34 -470 -44 228 -274 -151 224 71 101 125 -270 -160 31 51 -508 -32 309
2605C09n92J17L93m91J25M80n96k92Q28l20o04L82O13o65J53M40l99p2L05k39
$$ 309 -283 -166 227 -264 -139 341 -255 -547 281 -39 -643 -261 352 -313 -160 280 -119 -191 114 -125
2625a25l36J010k78q07P05k17j15J36M93p88l5J165p55j033Q55P43r17p7P47n65
$$ -125 -461 549 271 -536 169 -48 -163 -27 466 -322 -357 808 53 -980 -125 618 -299 -376 371 -194
2645a94K50N14o08k91Q43Ko64K69M65p49M99Q8r64L13J191p15r09R69N17j268
$$ -194 56 570 -38 -329 514 516 -148 121 586 -163 336 424 -540 -227 964 249 -660 309 826 -442
2665d42P1J102j073K21P90j188j7J192n5j504P39N82o11K95L96j166N90R53j141
$$ -442 -371 731 -342 -121 669 -519 -536 656 601 -903 -164 418 -193 102 498 -668 -78 875 -266
2684b66l70J233J94j509L88Q38j050K46Q80j105l89J716l86j620J182P55r91k91
$$ -266 -636 597 791 -718 -330 508 -542 -296 584 -521 -910 806 420 -1200 -18 737 -254 -545
2702e45P02p93L90Q65j187n83J938m56j102N00Q01p66Q5N32q23k96J770p17j610
$$ -545 157 -636 -246 619 -568 -1151 787 331 -771 -271 530 -236 -151 381 -442 -738 1032 315 -1295
2721a295J322J016j290j61Q08o26K33P70j181n13J825l14j550Q90J031j163K37
$$ -1295 27 1043 -247 -408 400 -226 7 777 -404 -917 908 594 -956 -66 965 -198 39
2738C9O50j391O55J406j497j252J932N93j692N9R72o73L87N64j309k37J876n61
$$ 39 689 -702 -47 1359 -138 -1390 542 1135 -557 -498 474 -199 188 752 -557 -794 1082 521
2756E21j674J056J037j195K90M05j100N11J396j630r60J896N00k034L94J105p89
$$ 521 -1153 -97 940 -255 35 440 -660 -149 1247 -383 -1343 553 1053 -981 -587 518 -271
2773b71J75O07j300R7J842o41j908J299J181j444J94K73m24M17N92j560m22K214
$$ -271 -96 511 -789 -692 1150 509 -1399 -100 1081 -363 -169 104 -320 97 689 -871 -1293 921
2791I21r4j856N57J177r01r5O38j042K5J697q05j544J193J214j559j0Q31n18L13
$$ 921 827 -1029 -472 705 -196 -291 347 -695 -670 1027 222 -1322 -129 1085 -474 -484 347 -171 142
2810A42M72j285l17K205o35j724Q34J176j230L38O64j160L17J340r75j513J740
$$ 142 614 -671 -988 1217 582 -1142 -308 868 -362 -24 640 -520 -203 1137 162 -1351 389
2827C89P55j706kJ049n01P5N31j097m3J841p48j536J018R28j289R3P75j099M09
$$ 389 1144 -562 -564 485 -16 59 590 -507 -550 1291 543 -993 25 953 -336 -243 532 -567 -158
2846a58J275j155j118J869K5j675M83J084m61j90M46q02P4J332q27j039Q80O53
$$ -158 1117 -38 -1156 713 738 -937 -454 630 169 -21 425 -377 -303 1029 202 -837 43 696
2864F96r46L6M96o15J93Q02j190m35J724m2j580O66P44o84j19P17q27M2R73o78
$$ 696 -250 -214 282 -333 -140 662 -528 -963 761 719 -861 -195 549 -135 -254 463 -364 -322 651 -27
2884b7j092J322M08j121Q4N08l77K86L65o11l01J351n18j109O21Q37p52k38P66
$$ -27 -1119 203 611 -510 -426 82 -295 -9 356 -255 -556 795 277 -832 -211 626 -126 -364 402
2903D02m79m5O16l50r97J259K73r20l6N10q3r3K57o24K22Q50m61r64Q27M91o50
$$ 402 -77 -122 494 144 -853 406 679 -241 -277 233 150 57 314 -310 -88 762 301 -663 164 655 5
2924Ej38L97l05n0O29n54k86P41M16j284K37M16j66j0O8k84J56M40m65m17R21
$$ 5 -133 264 -41 -91 538 -16 -302 439 855 -429 -192 224 58 48 116 -168 -12 428 -37 -454 467
2945D67N2r26L34K86m64K79K43m41k02O58O9j015L14O37n79k7L50n8j07L68k23
$$ 467 519 -407 -73 213 -251 28 271 -170 -372 286 355 -660 -346 291 -288 -315 35 -23 -130 238 15
2966A5k93J23J51k66J15K61k93R9K01m20l4N13Q0p92N07L56m50j21M36k63k02
$$ 15 -278 -155 -4 -270 -155 106 -187 -88 113 -307 -341 172 252 -540 -33 323 -127 -248 188 -75 -277
2987b77J99O6j17Q3J80r7N1J66m43K40R0j12j53L91n8l93J56L04l78J26J62Q7
$$ -277 -78 -12 -129 -46 134 37 88 254 -189 51 141 29 -124 267 209 -184 -28 276 -102 24 186 273
3009B73k96J73p3n9j41K12j44P8M2J04j94J97n4j44L17l00r3K55M8l63j6M01j03
$$ 273 -23 150 77 18 -123 89 -55 23 65 169 -25 172 118 -26 291 -9 -102 153 201 -162 -178 223 120
3032A20l08J85J72k89P1K73m44J51K01j17j60oK46o7m2j01q6L11j7m9j1J6j23
$$ 120 -188 -3 169 -120 -49 224 -220 -69 132 15 -145 -151 95 28 -14 -115 -201 110 93 44 33 49 -74
3055g4n4L23m70J29J42J14l75J73r2K96l40K87j7j16J00J0j8r2P7o7K61k7l55
$$ -74 -128 195 -275 -146 -4 110 -265 -92 -184 112 -228 59 42 -74 26 36 18 -74 3 -64 197 170 -185
3078a85J79J36j68p7J54lJ01Q0o9l34K49k11J92M5k56L51l00K10K03k71o9O4o6
$$ -185 -6 130 -38 -115 39 36 137 217 148 -186 63 -148 44 89 -167 184 -116 94 297 26 -43 21 -45
3101d5J17J40k91P3j77K85k92J32L38l80J10R2j99j14M21R5j27k67l0J19kr2R4
$$ -45 72 212 -79 -6 -183 102 -190 -58 280 -100 10 102 -97 -211 210 305 178 -89 -119 0 -2 -94 0
3124@o7K61l27Q7Q2k16Q4J52l2l09J23L00j25l17N20k76k54J41K27p8k4L5j22
$$ 0 -67 194 -133 -46 36 -180 -96 56 24 -285 -162 138 13 -304 216 -60 -314 -173 54 -24 -48 -13 -135
3147a35J40J32j73j25K1K53k97K31j72k5M80j83o22K39O36n06j51K95Q9k96M01
$$ -135 5 137 -36 -161 -140 113 -184 47 -125 -150 330 147 -475 -236 400 -106 -257 38 127 -169 232
3168B32j12j88Q8J52k73O6K21M8l15L78k03k73L96n0m47K69K02j62l85M59N7k33
$$ 232 120 -68 20 172 -101 -35 186 234 -81 297 94 -179 217 167 -280 -11 191 29 -356 103 160 -73
3190g3N09l42l19J8N96n11k72P43m6n90L02l4m4J48L1k23J39R2j56k52O01k12
$$ -73 436 94 -225 -207 389 -122 -394 349 303 -287 15 -19 -63 85 116 -107 32 124 -32 -284 317 105
3212A05k00J91K6l19L12rl66M5N66j60o67N04P1l23K38J39n26K41L99n67k6P01
$$ 105 -95 96 122 -197 115 106 -260 -215 351 191 -476 28 99 -224 14 153 -373 -132 267 -300 -326 375
3234C75k66m02L30Q9o37O51J3n94K42P80p21l25N25M6l55L21N4l27K22L73n81
$$ 375 109 -293 37 126 -511 140 153 -441 -199 581 -140 -465 60 106 -249 72 126 -201 21 394 -187
3255a87j63N05J35m73L19j04k42N15j88n76L87P58o67m62P13j9n60L10L8k38K74
$$ -187 -350 155 290 -183 136 32 -210 305 117 -459 -72 686 19 -443 270 251 -309 1 39 -199 75
3276G5L93p01j98R42k00o68M50j14k64N68M7q35P13L87p54l66Q80Kp08M17O3k03
$$ 75 468 -233 -431 511 311 -357 93 -21 -285 283 330 -505 208 595 -159 -525 355 357 -351 66 129 -74
3298g4J35K66n44l6P73m10n33N93p8k97M07p0o25O43M13r60J48O59l48m65N78
$$ -74 61 327 -217 -253 520 110 -423 170 92 -205 202 132 -493 150 563 -397 -249 410 62 -403 175
3319A75l08k97P86J2r09J71J086o49p68Q27J86m96J36N0k15L99K56o34j73J023
$$ 175 -133 -430 356 368 -541 -370 716 67 -701 126 312 -184 -48 2 -213 186 442 -192 -365 658
3339F58m82o57N01O7l04O04j87o66L64P40n78p19Q35R9m57J52l3k40N00J48p40
$$ 658 176 -481 20 87 -217 387 200 -466 -102 638 60 -659 176 275 -182 -30 -63 -303 197 345 -395
3360c95J42P08k71n36P70k50l95M70j17n68O35O25j026l70J168p8n37J2K52n45
$$ -395 -253 455 184 -352 418 168 -227 243 126 -442 193 818 -208 -578 590 512 -25 -13 239 -306
3380c06M24N7n53K67P05o17k96K44K23j98L22k26l24M73M15q21j46Q42m24m69
$$ -306 118 175 -378 -111 594 -23 -319 -75 148 -50 272 46 -278 195 610 -211 -357 485 61 -408
3400d08L04M67o98M09M2n30J75P94m12o61O80j18l07J69l2j92L84K85p67J24N50
$$ -408 -104 363 -335 74 116 -414 -239 555 143 -518 162 44 -263 -94 -126 -318 66 351 -416 -292 258
3421B58k34n11M75J96m77J33K85m80K70M47m60p4K60M4k40K02J9k06L08j00m48
$$ 258 24 -487 -12 184 -293 -160 125 -355 -85 362 -98 -172 88 132 -108 94 113 -93 215 115 -333
3442c33L88L97m74j83J97L10m32N17k29m22K78M83p69K03L78l9m00N2L95n03L98
$$ -333 55 452 -22 -205 -8 302 -130 387 158 -264 14 497 -272 -69 309 270 -130 -78 317 -186 212
3463B12j27k55K30K65l68j34M80m1k13M8k15k24M87P8l55l38O96l1o73M23K98
$$ 212 85 -170 60 325 -43 -177 303 262 49 97 -118 -342 145 223 -132 -470 226 195 -478 -55 243
3484B43k63J8J33k72R7K51m06j6K94O6k97l7J30K47r3j94l8j81N45m20K43O8J9
$$ 243 -20 -2 131 -141 -44 207 -199 -215 79 145 -152 -189 -59 188 95 -99 -137 -318 227 -193 50 118 137
3507A37k64O7K50k82j03M35l64J37m7N2j19J71O9j82L8R0k45J4M57k71k27K87
$$ 137 -127 -60 190 -92 -195 240 -124 13 -34 18 -101 70 139 -43 -5 85 -160 -146 311 40 -187 100
3529A00K5k56J2Q5J9K8J50k57m3J33P3M4k54K25k13K97j2j85j8QM2j29K10j12
$$ 100 125 -131 -119 -34 -15 13 163 -94 -137 -4 69 113 -141 84 -129 168 156 -29 -47 -39 3 -126 84 -28
3553b8K08k89K31j16J27Q4l27l9J85oo9k2P2M3l9K6J87k82J15n5j10K8L19k98
$$ -28 180 -109 122 6 133 217 -110 -149 36 30 -39 -61 11 54 15 41 228 -54 61 6 -104 -76 243 -55
3577e5J87J7k14J52M1k87qL67l36J95p5J15k56M5n9M0O3k0P9J22l7q9p8R0j34
$$ -55 132 149 -65 87 128 -159 -167 200 -136 59 -16 99 -157 -112 -171 -131 -68 -88 -9 113 76 -13 -91 -1 -135
3602a35J46P4m6k03K5M06l45j71J60J67j45l6m0K02lj68lJ03K9O4M8N5l12K8K34
$$ -135 11 85 39 -164 -139 267 -78 -249 -89 78 -67 -103 -143 59 56 -112 -115 -12 17 81 129 184 -128 -100 134
3627A34L2j94Q0k19J98j61J58J4k34J88J89j55L9o4m4l2N3L8j24O8RO8j11J16
$$ 134 166 -28 52 -167 31 -130 28 42 -192 -4 185 30 69 5 -39 -71 -18 20 -104 -36 -27 41 -70 46
3651D6O6j74r6R5O2J20j09J6j22K05k33J56J24j17o4L7M7j21J62j70O0p4J34r
$$ 46 112 -62 -158 -63 -1 119 10 26 -96 109 -124 32 156 39 -25 12 59 -62 100 -70 -10 -84 50 41
3675D1K7k01l8q4J88Q7j34J67j4j74J31l4o8j04L39j96l0K3J92q4j40PPJ41K5
$$ 41 68 -133 -171 -255 -67 20 -114 53 39 -135 -4 -38 -106 -210 129 -67 -97 -74 118 34 -106 -99 -92 49 74
3700G4r0P4o4j50j27K87K04m15L24O1j38m7J38o3l25K51J02k37L30j32r6Q7J85
$$ 74 -16 58 -6 -156 -283 4 208 -207 117 178 40 -7 131 68 -257 -6 96 -141 189 57 -39 48 233
3723B33j55o8j41L10q9J71k17k39M01j63n1j60M59j98o2J42L9j91J36R5k85j64
$$ 233 78 10 -131 179 90 261 44 -195 206 43 -8 -168 291 93 31 173 212 21 157 252 -33 -197
3745a97L62j42M1J3k00k4L33k00Q7k36J30j48K91m1j35j2M17n17J08M12k22n64
$$ -197 165 23 64 77 -123 -147 186 -14 73 -163 -33 -181 110 69 -66 -78 339 -178 -70 342 120 -444
3767d44L55o4J30J72j38r2J36J15R5k65j22L10m76K28K35j39j06J45k56J61J38
$$ -444 -89 -153 -23 149 11 -81 55 170 265 0 -122 188 -288 -60 175 36 -70 75 -181 -20 118
3788A18j11l64L50J03k97l8K87j83J71Q8k39k70N48J23n06J34J32L3r5Q5k39J24
$$ 118 7 -357 -7 96 -201 -239 48 -135 36 124 -115 -385 163 286 -220 -86 46 79 -16 69 -170 -46
3810d6N4Nl14K90N57m21l40L39P8m88N31l06j07K43m9o2j2M41m14l3L87l91O9
$$ -46 8 13 -301 -11 546 125 -215 124 202 -286 245 -61 -168 75 26 -36 -48 393 -21 -54 333 -58 11
3833A1K34l13k27M26R1m17J53J95k22J18K08j70m00O70l32l05J23M17m47K6J03
$$ 11 245 -68 -295 131 222 -195 -42 153 -69 49 257 87 -313 357 25 -280 -157 260 -187 -161 -58
3854e8p0N8m5m9M4P8L04o98L31L67n66K87J41q9l18M00Rm00L37M45n71j60M23
$$ -58 -128 -70 -115 -164 -120 -42 262 -436 -105 262 -304 -17 124 35 -283 117 126 -274 63 508 -63 -223 200
3877B00l38R3K67l83j88M60N4j66M9L12l94J43J06j88j29L41k32l16M20M4j84
$$ 200 -138 -45 222 -161 -349 111 165 -1 48 360 -34 109 215 27 -102 239 7 -309 111 155 -29
3898b9k48N57j28k83Q7k2j86L27N0k61k9N00l84j15K15j54J47k9j49m7M13K02
$$ -29 -277 280 152 -131 -44 -66 -252 75 125 -136 -165 335 -49 -164 51 -103 44 15 -134 -181 232 434
3920D34o66Q8L27l2k13K44j52k08L68r8k11L53K42n30jJ18L8j40K95k53m40M95
$$ 434 -232 -144 183 151 -62 182 30 -178 190 92 -119 234 476 -54 -55 63 101 -39 256 3 -437 58
3942E8J10m86K20K94l05n9J04k6mK74M4l15N0K10j07k56L93j99Q7j7j28j50L01
$$ 58 168 -318 -98 196 -109 -168 -64 -90 -94 180 224 -91 -41 169 62 -194 199 0 87 70 -58 -208 93
3965I3J8l13L54p2k87K37J8k11n0M28k43j25J37K54l68oJ67Pk19L24j60N7L09
$$ 93 111 -202 152 80 -207 30 48 -163 -213 215 -28 -153 -16 238 -130 -136 31 38 -181 143 -17 40 349
3988C49j83j90k9L35k86j33K41j08J4K02k15j80L61K22m62j40K72k9j34L58j77
$$ 349 166 -24 -53 282 -4 -137 104 -4 10 212 -3 -183 178 400 -62 -202 70 41 -93 265 88
4009H8j27K11j50k35J5L30k18J61k9r3k32K11R4p6L13j44k76m2J89Q6j95J28J05
$$ 88 -39 172 22 -213 -198 132 -86 75 46 -47 -279 -68 26 -50 263 119 -157 -199 -10 76 -119 9 114
4032A14l34J75Mj77J47Q9o8l17M11k75K20j98R6j5J29r2K3K77j08k30L11J28l22
$$ 114 -220 -45 -41 -218 -71 18 -50 -367 44 -231 -11 -209 -113 -128 1 -91 -68 209 101 -129 182 310 -12
4055a2P9j1L2k64R0L26k59N3o2P6j93m2L10k10P0J92PL3k88k3m5L18k58r5p6M97
$$ -12 67 56 88 -176 -86 240 -19 34 -28 48 -145 -187 123 -87 -17 175 182 215 -73 -96 -141 177 -81 -176 -252 245
4081B45j94J57j53j79L1J09j09K68j09n3%k8l3K70l51P1j14N5J50J17j31K31l61
$$ 245 51 208 55 -124 -93 16 -93 175 66 13 13 -15 -48 222 -129 -58 -172 -117 33 150 19 250 -111
4104a11Q0L70l87r2J17K09j89r4k9O8k3O9N6lP7rj62O7J80k73O5J56l42J49L8
$$ -111 -31 339 -48 -140 -23 186 -3 -97 -126 -58 -81 -12 44 41 118 109 -53 14 194 -79 -14 142 -200 -51 -13
4129a3J5k24K19p7K04j48K88j16l19L3Q9J92l18P1mN7J90k19j5J09k51J98n6K32
$$ -13 2 -222 -3 -80 124 -24 264 148 -171 -138 -49 143 -175 -104 -108 -51 139 -80 -95 14 -237 -39 -95 137
4153A37j49p9L60l71K32R7k5k44J90J0j88q0K02j25j83L82L2q5no1j98J97r1K07
$$ 137 -12 -91 269 -102 130 227 202 -42 148 158 -30 -110 92 -33 -216 166 198 113 108 47 -151 46 -45 162
4177A62Qj29nJ6j6Lk08O6J96j40Q9N9j3Oj54K0J83k06L3j9rN9j25K90j86m3J08
$$ 162 170 41 36 52 36 39 -169 -103 93 -47 42 101 88 94 -60 -40 143 -63 -30 -49 -58 1 -124 166 -20 -63 45
4204D5j3R5j66J4L5r6K7J96o7r3n6m7K9o7J05K3p4o4J79jON6j65pJ00J9J24J08
$$ 45 32 127 -39 -25 10 -86 -59 137 70 -23 -79 -126 -97 -164 -59 -36 -110 -174 5 4 10 66 -99 -106 -6 13 137 245
4232B45m45J16Rj57K22PJ30k0j60j7N2L0L0J0r1J93l56K48J58p3n5N9L1n4M8k09
$$ 245 -200 -84 -75 -232 -10 -3 127 107 -53 -70 -18 12 42 52 -39 154 -202 46 204 131 76 135 166 112 160 -49
4258d9J3K28k19P3N1K34k86j03k7P7qL2K6J8j71J37P0Q3n5N9k16k6J31k67M4K01
$$ -49 -36 192 -27 46 97 331 45 -58 -85 -8 -16 16 42 60 -111 26 96 179 124 183 -33 -59 72 -195 -151 50
4284E0j60J53J46k34MR1K77k44l3j64L3J92l5j16K03m7j97Q3lO4k06K34j27l7
$$ 50 -110 43 189 -45 -41 50 327 83 50 -114 -81 111 76 -40 163 116 -81 2 -1 63 -143 91 -36 -73
4308g3L66k91l16k43O66l00q8J95J52k29O9J47k24J33J42j69j96L99j00j47J61
$$ -73 293 2 -314 -557 109 -191 -279 -84 68 -161 -92 55 -169 -36 106 -63 -259 140 40 -107 54
4329E4o7j28K15j70k20K83K11l02J47j4N4k53K16Q0j02r1J60j59J34rO5j12J85
$$ 54 -13 -141 74 -96 -316 -33 178 -124 23 9 63 -190 26 106 4 -87 73 -86 48 39 104 -8 177
4352A77k26n9j6J83o5j19L08N6l24K43k2l68J76J52k18Q6K78k50k63M93o6l98
$$ 177 -49 -108 -124 59 -6 -125 183 239 -85 158 136 -232 -56 96 -122 -36 242 -8 -271 222 156 -242
4374b42J68L01k21J29k86K41L1j10J62l47L07j80j2J03Q8o1K18j27k68J10O8r6
$$ -242 -74 227 6 135 -151 90 121 11 173 -174 133 -47 -59 44 132 71 289 162 -106 4 72 -24
4396b4j07L13Q6j88k56K90m03K97o8j5J12J09K45n57R3j62M65l37J19j97o6K48
$$ -24 -131 182 268 80 -176 114 -289 8 -60 -75 37 146 391 -166 -73 -235 230 -107 12 -185 -251 -3
4418cJ13k60p9N86m48k8K71l6j47M2j49p1L26k03N4K98k63k3P1K4k37KM26k25
$$ -3 110 -150 -229 357 -91 -119 152 116 -31 11 -138 -209 117 -86 -32 266 3 -20 51 75 -162 -160 266 41
4442D1k90L86k28j00R7J76J61k21J85k39J04J17o5k18p9J68Q1K1J06j94J1Qj34
$$ 41 -249 137 -91 -191 -94 82 243 22 207 -32 72 189 124 -94 -173 -5 76 97 203 9 20 28 -106
4465a06J03J73m7k72J85P2j22o5K81m78K92l2O5j76O4K75l51J20O7k36J61J34
$$ -106 -3 170 123 -149 36 108 -14 -79 202 -276 16 -16 49 -127 -63 212 -139 -19 48 -188 -27 107
4487A07j23O4K9l6l19K26Q2j70Q2J95l53J01K63k28j02L44k36m1Ol9J76k2Q7k89
$$ 107 -16 48 77 41 -278 -52 30 -140 -58 137 -216 -115 148 -80 -182 162 -74 -115 -109 -148 28 6 93 -196
4511a96J6L99k49k07J51K31j82J45%k47K4L39j84j1p4J81l29K9M5k0K28N9j38
$$ -196 -180 219 -30 -237 -86 145 -37 108 108 -139 -115 224 40 29 -45 136 -193 -164 -119 -139 89 148 10
4534A0p3K32j74l08N24l1J4k00p6RO1J17M9m70M15m0l87L69m1j00J58j48K15k35
$$ 10 -63 169 -5 -313 211 180 194 -6 -82 -73 -12 105 154 -316 99 59 -328 41 0 -100 58 -90 125 -110
4558a10J18J49n08K78J78K0j91j26J06J14K09j67j7onL5j6Kr0jJ19p1J5Q8j93
$$ -110 8 157 -351 -73 105 125 -66 -192 -86 28 237 70 53 47 42 77 61 63 -27 -28 91 20 35 123 -70
4583g0q6J02J53l03J09J00jJ58O1k03R3j56J8q5j41K53j62K39R0k85K24mj58j39
$$ -70 -156 -54 99 -204 -95 5 4 162 223 20 113 -43 -25 -110 -251 2 -160 79 169 -116 108 104 -54 -193
4607a93J32R1k42J52K29j63P0j15j21J64n9q5K22q1n6R3M2n3o4K24k1k77j19M93
$$ -193 -61 30 -212 -60 169 6 76 -39 -160 4 -55 -140 82 1 -55 38 80 27 -37 187 166 -111 -230 263
4631B63j0l44K5J81n8L9k03J71j8o0j3L2j6J5k4j91L13j63J81k14N5J54j5J17
$$ 263 253 -91 -66 115 57 96 -107 64 46 -14 -27 5 -11 4 -20 -211 102 -61 120 -94 -39 115 100 217
4655B17k97RJ47j17j94L59Pj21Kj4j47P9L3J63k34k6n1L35J4k79r7K61j01k68
$$ 217 -80 -71 76 -41 -235 124 131 10 12 -2 -149 -70 -37 126 -108 -134 -185 150 164 -115 -212 49 -52 -320
4679c20L38J30O7k61qK7J07q1n5k6L5o2L05k48M4n5J74k09R8R9n1j28j38K42n9
$$ -320 18 148 215 -46 -54 -27 80 -1 -56 -82 -47 -109 196 -52 -8 -63 111 -98 0 99 48 -80 -218 24 -35
4704c5J0M0J49m6J7K22l14k10J26L58j51l39L37j84q1J83l7J64j41j38j1pJ69
$$ -35 -25 15 164 118 135 357 43 -167 -41 317 166 -173 164 -20 -101 82 45 209 68 -70 -81 -88 81
4727H1j92P6pq2K39j68j45J80O6J14j82J49n9j14m8J22J56j30j81N7P2j07pJ12
$$ 81 -111 -35 -42 -124 115 -53 -198 -18 48 162 -20 129 70 -44 -92 30 186 56 -125 -68 4 -103 -110 2
4751Bk1J57j19Q5m8K2Kl29K97j75j83M22Lq4K4j56J42o3J6k8J64l1r0j89J19q3
$$ 2 -19 138 19 104 56 78 80 -249 48 -127 -310 112 115 31 55 -101 41 -22 -6 -34 130 99 9 -180 -61 -144
4777a44K3K58k06p1K83r4j36J49j17l4J16j08p8K17J28j36j62R4Q6k60K34K99
$$ -144 -121 137 -69 -140 143 49 -87 62 -55 -89 27 -81 -159 58 186 50 -112 -18 68 -192 42 341
4799C41l69N9j03K64l05n2J38k05L88l99J76K63k98L6R2j19J77j85o6L63k76K88
$$ 341 -28 31 -72 192 -113 -165 -27 -232 156 -243 -67 196 -102 -66 26 -93 84 -101 -167 196 -80 208
4821B08q1j38ko0J41K7l3k43K18j08m2K31j92j31K41l03O63m21O8J52k71O8k14
$$ 208 127 -11 -13 -73 68 95 62 -181 37 -71 -113 118 -74 -205 36 -267 396 -25 43 195 -76 -8 -222
4844b22J21n4K43j48O8L9p0K68l56L05k84Q4JJ51j52N4K30l82QqL24k97nK89k71
$$ -222 -101 -155 88 -60 8 47 -23 245 -111 194 -90 -6 -5 146 -6 48 278 -104 -96 -104 220 -77 -82 207 -64
4869f4R1m0K3k13P0rJ39J34l14L04k54J94k49L63Q8m10Q0K1P0k12M21j99k22L84
$$ -64 27 -13 10 -203 -133 -142 -3 131 -183 121 -133 61 -188 175 263 -147 -67 -46 24 -188 233 34 -188 196
4893A96q5k09Q6J1k9j2p4J19J01j25N8j37O8j0p7l0K51J57l38K22j3j29M3j56
$$ 196 111 -98 -12 -1 -30 -42 -116 3 104 -21 37 -100 -32 -42 -119 -149 102 259 -79 143 130 1 44 -112
4917a12l9P4K00p3r3J86j27m1j80J30J55Pm5j21J7O3k45J29K1m2P8L38k49j75
$$ -112 -151 -77 123 50 -43 143 16 -25 -205 -75 80 87 42 -79 -62 1 -244 -115 -94 -136 -58 280 31 -144
4941a44J77J5r3P7j84J31L6j92K71k3n1J82l56j2K20K1k53kJ28RK12j05k08L77
$$ -144 33 48 -45 32 -152 -21 15 -177 94 71 20 202 -154 -166 54 75 -178 -180 -52 -43 169 64 -144 233
4965B33j00k78j5K94r6j65J91L3j68L16p2j40k55K94n8kJ29j23K2M3n6k15K55
$$ 233 133 -145 -160 134 38 -127 64 97 -71 245 173 33 -222 72 14 12 141 18 40 83 27 -188 67
4988F7N7m7k83M67m15mL42m25J60K22k3j32Q7K09j61j29rq3r7K60K9o1j27J00
$$ 67 124 77 -206 261 -154 -158 184 -241 -81 141 118 -14 73 282 121 -8 -17 -100 -197 63 92 31 -96 4
5012Dk0k09L61J52n12N8j0L60P5o9m35J72K78l93L0K37j15j90J61J19j20J84j15
$$ 4 -16 -225 136 288 -224 -166 -176 184 259 190 -245 -73 205 -188 -158 79 -36 -226 -65 54 -66 118 3
5035Cj88J9J06P6k55J57j20K06J15o7j36J39K02l63K0J10K7j87J41J60m56N37
$$ 3 -185 -166 -60 16 -239 -82 -202 4 119 52 -84 55 257 -106 -86 24 51 -136 5 165 -291 246
5057B46r8k43NK5J56J42l60K0J81R4l60R8J39K40m04qK49j78k5O5L6m6j34J0K64
$$ 246 148 -95 -90 -65 91 233 -127 -107 74 168 -192 -94 45 285 -119 -127 122 -56 -81 -16 20 -26 -160 -150 114
5082A14j42K99l14l5K8J51m5j79J98q1L5J7p8k31O5K28J51j32p4P0K9N0m11L60
$$ 114 -28 271 -43 -78 -50 101 56 -123 75 -6 29 46 -32 -263 -198 30 181 49 -25 45 74 124 -287 73
5106G3po0r0rL3K2J65k20n0J97k1k33N30l91j8K0o3K94k01J11K3k72J20N0k1J03
$$ 73 66 6 -84 -93 -60 -38 127 -93 -143 54 33 -200 330 -61 -79 -59 -122 172 -29 82 105 -167 -47 3 -18 85
5132H5n6K09l39J92j39Q7R3q0q6Q4j70K48j47l0j17J48R7j78Q0J34Q2m22R3k5
$$ 85 29 238 -101 91 -48 39 132 52 -34 50 -120 128 -19 -49 -166 -18 79 -99 -19 115 197 -225 -132 -157
5156a57L09l36J22J15m3N3o4k31K75lj02o1J03J72j05j44P1j72K02Mk52J53J64
$$ -157 152 -184 -62 53 10 63 -1 -232 43 40 -62 -123 -20 152 47 -97 -26 -198 4 8 -244 -91 73
5179G3n9o9Q0Lk89O9J87K31k10p4J79k44q4K68J0j62L2P5R9rj16J10j78N4pKp4
$$ 73 14 -55 25 28 -261 -192 -5 226 16 -58 121 -123 -207 61 71 -91 -59 16 115 106 -10 100 -78 -24 -31 -29 -103
5206a03J06J72j90J20j75K20q1j64K92j4j87On1j01j5K42N1j01J53j69q4NJ92
$$ -103 3 175 -15 105 -70 150 69 -95 197 183 -4 2 -49 -150 -165 77 128 27 180 11 -73 -68 124
5229A24M8j42R8l23O6K64j0N1m23L01q4p6K17J09j29j54K00l15Nj3L04j56q9J84
$$ 124 172 30 128 -195 -129 135 125 176 -247 54 -30 -106 111 220 91 -63 137 -178 -173 -186 118 -38 -127 57
5253E7M4L2pj3j71LK74j77k31J93J94j10jjk04J76K14k09n2J69j50LK27j36M8
$$ 57 101 133 126 113 -58 -55 219 42 -189 4 198 88 87 86 -118 58 272 63 11 180 30 33 260 124 172
5278A72k72q6K06j1o8J25Nk5J24k47o0J21O0J26k29P3n9m5L3O3R2k52J61J93j00
$$ 172 -100 -186 20 9 -59 66 71 46 170 -77 -137 -16 44 170 -59 14 -45 -90 -57 6 98 -154 7 200 100
5303A00k6p6K58l63J59%J61k2m18K45N3P0K7k39J77J67j57k21J56j78R2O6J30
$$ 100 74 -2 256 -107 52 52 213 191 -227 18 71 141 168 -71 106 273 116 -105 51 -127 -35 31 161
5326A61kj59m6l7R8o9R4J39k20J35o1k77K05K87l70J17J22j16j4M3k3P8p5j65
$$ 161 159 0 -46 -83 15 -54 40 179 -41 94 33 -244 -39 248 -122 -5 117 1 -13 30 7 85 10 -155
5350a55Q4J7Q6j31K63k64J08n8J58j38j44J72j0O2j45n1K5J13KJ31k42J39L50
$$ -155 -71 -54 32 -99 164 -100 8 -50 108 -30 -174 -2 -12 50 -95 -146 -121 -8 -6 125 -117 22 372
5373C72m68N6L0l8k3N6j54M27j26k52K43r2j07K98l12K87j94J0K4M4k46J58o6
$$ 372 -96 -40 -10 -48 -71 -15 -169 258 132 -120 123 31 -76 222 -90 197 3 13 37 81 -165 -7 -73
5396g3J20j18J8N1L2j30L85j39j03lr4r9%K80r3J2j9O9j18Q6L6n9l1O2NK3j45
$$ -73 47 -71 -53 -2 30 -100 285 146 43 40 -54 -153 -153 127 34 46 27 96 -22 64 100 41 10 72 77 100 -45
$$ [...]
8191A9
##END NTUPLES=NMR FID
##END=
