##TITLE=1H_Pr t-U
 200.13MHz, CDCl3,
 8 sc
 
 20.1.2025
##JCAMPDX= 6.0         $$ Bruker NMR JCAMP-DX V2.0
##DATA TYPE= NMR FID
##DATA CLASS= NTUPLES
##ORIGIN= UXNMR, Bruker Analytische Messtechnik GmbH
##OWNER= pz
$$ XWIN-NMR		Version 3.5
$$ Mon Jan 20 15:47:04 2025 Russian Standard Time (UT+4h)  she@DPX200
##.OBSERVE FREQUENCY= 200.1313
##.OBSERVE NUCLEUS= ^1H
##.DELAY= (6, 6)
##.ACQUISITION MODE= SIMULTANEOUS
##.ACQUISITION SCHEME= undefined
##.AVERAGES= 8
##.DIGITISER RES= 18
##SPECTROMETER/DATA SYSTEM= spect
##.PULSE SEQUENCE= zg30
##.SOLVENT NAME= D2O
##.SHIFT REFERENCE= (INTERNAL, D2O, 0, 14.3821)
##AUDIT TRAIL= $$ (NUMBER, WHEN, WHO, WHERE, WHAT)
$$ ##TITLE= Audit trail, XWIN-NMR		Version 3.5
$$ ##JCAMPDX= 5.01
$$ ##ORIGIN= Bruker BioSpin GmbH
$$ ##OWNER= she
$$ F:/spectra/data/she/nmr/H-C/1/audita.txt
$$ ##AUDIT TRAIL=  $$ (NUMBER, WHEN, WHO, WHERE, WHAT)
(   1,<2025-01-20 15:45:35.14 +0400>,<she>,<DPX200>,
      <created by zg, POWCHK disabled, PULCHK disabled
       configuration hash MD5:
       00 E9 B6 7A A2 85 ED C7 34 08 36 98 17 FE 4E 26
       data hash MD5: 16K
       DB 31 F4 A1 8B CF D8 82 26 69 78 48 17 C2 D8 8A>)
$$ ##END=
$$ 
$$ hash MD5
$$ D1 13 0E C7 6F D7 55 9E 43 BD CE 19 AE BB 53 3E
##$RELAX= 
##$RELAX= 
##$RELAX= 
##$RELAX= 
##$RELAX= 
##$RELAX= 
$$ Bruker specific parameters
$$ --------------------------
##$DU= <F:/spectra>
##$EXPNO= 1
##$NAME= <H-C>
##$PROCNO= 1
##$TYPE= <nmr>
##$USER= <she>
##$AMP= (0..31)
100 100 100 100 100 100 100 100 100 100 100 100 100 100 100 100 100 100 
100 100 100 100 100 100 100 100 100 100 100 100 100 100 
##$AQSEQ= 0
##$AQ_mod= 1
##$AUNM= <au_zg>
##$AUTOPOS= <>
##$BF1= 200.13
##$BF2= 200.13
##$BF3= 200.13
##$BF4= 200.13
##$BF5= 200.13
##$BF6= 200.13
##$BF7= 200.13
##$BF8= 200.13
##$BYTORDA= 1
##$CFDGTYP= 0
##$CFRGTYP= 5
##$CHEMSTR= <none>
##$CNST= (0..31)
1 1 145 1 1 1 1 1 1 1 1 1 1 1 1 1 1 1 1 1 1 1 1 1 1 1 1 1 1 1 1 1 
##$CPDPRG= <>
##$CPDPRG1= <>
##$CPDPRG2= <>
##$CPDPRG3= <>
##$CPDPRG4= <mlev>
##$CPDPRG5= <mlev>
##$CPDPRG6= <mlev>
##$CPDPRG7= <mlev>
##$CPDPRG8= <mlev>
##$CPDPRGB= <>
##$CPDPRGT= <>
##$D= (0..31)
0 0.7 0 0 0 0 0 0 0 0 0 0.03 0 0 0 0 0 0 0 0 0 0 0 0 0 0 0 0 0 0 0 0 
##$DATE= 1737373534
##$DBL= (0..7)
120 120 120 120 120 120 120 120 
##$DBP= (0..7)
150 150 150 150 150 150 150 150 
##$DBP07= 0
##$DBPNAM0= <>
##$DBPNAM1= <>
##$DBPNAM2= <>
##$DBPNAM3= <>
##$DBPNAM4= <>
##$DBPNAM5= <>
##$DBPNAM6= <>
##$DBPNAM7= <>
##$DBPOAL= (0..7)
0.5 0.5 0.5 0.5 0.5 0.5 0.5 0.5 
##$DBPOFFS= (0..7)
0 0 0 0 0 0 0 0 
##$DE= 6
##$DECBNUC= <off>
##$DECIM= 32
##$DECNUC= <off>
##$DECSTAT= 4
##$DIGMOD= 1
##$DIGTYP= 9
##$DL= (0..7)
0 120 120 120 120 120 120 120 
##$DP= (0..7)
150 150 150 150 150 150 150 150 
##$DP07= 0
##$DPNAME0= <>
##$DPNAME1= <>
##$DPNAME2= <>
##$DPNAME3= <>
##$DPNAME4= <>
##$DPNAME5= <>
##$DPNAME6= <>
##$DPNAME7= <>
##$DPOAL= (0..7)
0.5 0.5 0.5 0.5 0.5 0.5 0.5 0.5 
##$DPOFFS= (0..7)
0 0 0 0 0 0 0 0 
##$DQDMODE= 0
##$DR= 18
##$DS= 0
##$DSLIST= <SSSSSSSSSSSSSSS>
##$DSPFIRM= 0
$$ [...]
##$SUBNAM0= <"">
##$SUBNAM1= <"">
##$SUBNAM2= <"">
##$SUBNAM3= <"">
##$SUBNAM4= <"">
##$SUBNAM5= <"">
##$SUBNAM6= <"">
##$SUBNAM7= <"">
##$SUBNAM8= <"">
##$SUBNAM9= <"">
##$SW= 18.0517328524113
##$SWIBOX= (0..15)
0 0 2 0 0 0 0 0 0 0 0 0 0 0 0 0 
##$SW_h= 3612.71676300578
##$TD= 16384
##$TD0= 1
##$TE= 0
##$TE2= 300
##$TE3= 300
##$TEG= 300
##$TL= (0..7)
0 120 120 120 120 120 120 120 
##$TP= (0..7)
150 150 150 150 150 150 150 150 
##$TP07= 0
##$TPNAME0= <>
##$TPNAME1= <>
##$TPNAME2= <>
##$TPNAME3= <>
##$TPNAME4= <>
##$TPNAME5= <>
##$TPNAME6= <>
##$TPNAME7= <>
##$TPOAL= (0..7)
0.5 0.5 0.5 0.5 0.5 0.5 0.5 0.5 
##$TPOFFS= (0..7)
0 0 0 0 0 0 0 0 
##$TUNHIN= 0
##$TUNHOUT= 0
##$TUNXOUT= 0
##$USERA1= <user>
##$USERA2= <user>
##$USERA3= <user>
##$USERA4= <user>
##$USERA5= <user>
##$V9= 5
##$VALIST= <valist>
##$VCLIST= <CCCCCCCCCCCCCCC>
##$VD= 0
##$VDLIST= <DDDDDDDDDDDDDDD>
##$VPLIST= <PPPPPPPPPPPPPPP>
##$VTLIST= <TTTTTTTTTTTTTTT>
##$WBST= 1024
##$WBSW= 4
##$XGAIN= (0..3)
0 0 0 0 
##$XL= 0
##$YL= 0
##$YMAX_a= 782874
##$YMIN_a= -913995
##$ZGOPTNS= <>
##$ZL1= 120
##$ZL2= 120
##$ZL3= 120
##$ZL4= 120
##$ABSF1= 10
##$ABSF2= 0
##$ABSG= 5
##$ABSL= 3
##$ALPHA= 0
##$AQORDER= 0
##$ASSFAC= 0
##$ASSFACI= 0
##$ASSFACX= 0
##$ASSWID= 0
##$AUNMP= <proc_1d>
##$AZFE= 0.1
##$AZFW= 0.1
##$BCFW= 1
##$BC_mod= 2
##$BYTORDP= 1
##$COROFFS= 0
##$CY= -3
##$DATMOD= 1
##$DC= 2
##$DFILT= <>
##$DTYPP= 0
##$F1P= 0
##$F2P= 0
##$FCOR= 0.5
##$FTSIZE= 0
##$FT_mod= 4
##$GAMMA= 1
##$GB= 0.15
##$INTBC= 1
##$INTSCL= 1
##$ISEN= 128
##$LB= 0.25
##$LEV0= 0
##$LPBIN= 0
##$MAXI= 10000
##$MC2= 0
##$MEAN= 0
##$ME_mod= 0
##$MI= 1.114404
##$NCOEF= 0
##$NC_proc= 0
##$NLEV= 6
##$NOISF1= 3.799351
##$NOISF2= 2.8
##$NSP= 1
##$NTH_PI= 0
##$NZP= 0
##$OFFSET= 14.38212
##$PC= 1
##$PHC0= 248.3156
##$PHC1= 17.1922
##$PH_mod= 1
##$PKNL= yes
##$PPARMOD= 0
##$PSCAL= 0
##$PSIGN= 0
##$REVERSE= no
##$SF= 200.129724274929
##$SI= 16384
##$SIGF1= 3
##$SIGF2= 2
##$SINO= 400
##$SIOLD= 16384
##$SREGLST= <1H.CDCl3>
##$SSB= 0
##$STSI= 0
##$STSR= 0
##$SW_p= 3205.1282051282
##$SYMM= 0
##$S_DEV= 0
##$TDeff= 0
##$TDoff= 0
##$TI= <>
##$TILT= no
##$TM1= 0
##$TM2= 0
##$TOPLEV= 0
##$USERP1= <user>
##$USERP2= <user>
##$USERP3= <user>
##$USERP4= <user>
##$USERP5= <user>
##$WDW= 1
##$XDIM= 8192
##$YMAX_p= 0
##$YMIN_p= 0
$$ End of Bruker specific parameters
$$ ---------------------------------
##NTUPLES= NMR FID
##VAR_NAME=  TIME,          FID/REAL,        FID/IMAG
##SYMBOL=    X,             R,               I
##VAR_TYPE=  INDEPENDENT,   DEPENDENT,       DEPENDENT
##VAR_FORM=  AFFN,          ASDF,            ASDF
##VAR_DIM=   8192,          8192,            8192
##UNITS=     SECONDS,       ARBITRARY UNITS, ARBITRARY UNITS
##FACTOR=    0.0002768,     1,               1
##FIRST=     0,             0,               0
##LAST=      2.2672688,     0,               0
##MIN=       0,             -913995,         0
##MAX=       2.2672688,     782874,          0
$$ Real data points
##PAGE= N=1
##DATA TABLE= (X++(R..R)), XYDATA
$$ [...]
1775A025j784N03J427p33q10J68r6N57P97j428j225J261J855j185j746N78Q71
1792C5L43K43l99j392J209J308j207j008J505N53j341J29k41J25Q42M71k383r93
1810b201K342J639j734r84N70J05O76K87p67o22J478J53j817R6J773l73j102J91
1828b90j19P2J559o06k435K85K416L03j418n52L03L37Q01k59j172M20J692j089
1846B48j574J394J153r62p83O3o92J202J274j040j738O28J808m07j164P23m02
1863b69L59J063j072j083J263P86j525p66J358R07q50k33p50k62J620J168j995
1880b81j703J985J067q13l64j09q7N63L44p83m43J456L70j970l23J464k21K71
1898D23k54j608K34K098Q8j777m77J740M19q59N2j02k33J031l12j364P72J507
$$ plain form
1775 1025 -759 -256 1171 438 -372 -204 -300 257 1054 -374 -1599 -338 1517 332 -1414 -836 35
1792 35 378 621 222 -1170 39 1347 140 -868 637 1190 -151 -22 -263 -138 704 1175 -1208 -2201
1810 -2201 141 1780 46 -938 -368 -263 413 700 -67 -689 789 942 -875 -779 994 621 -481 -290
1828 -290 -409 -337 1222 616 -1819 -1534 882 1185 -233 -785 -482 -145 656 397 -775 -355 1337 248
1846 248 -1326 68 1221 259 -524 -461 -1153 49 1323 283 -1455 -827 981 574 -590 133 -269
1863 -269 90 1153 81 -1002 261 1047 -478 -1244 114 1021 171 -62 -812 -1074 546 1714 -281
1880 -281 -1984 1 1068 255 -109 -218 -305 258 602 -181 -624 832 1202 -768 -1091 373 152 423
1898 423 169 -1439 -1205 893 981 -796 -1273 467 886 27 79 -23 -256 775 463 -901 -129 1378
1916A378r58j687O92Q46J9j59j87j185P37J848p70j660N61J008k42l70K23m33
1934c39Q61M08j033q51Q01J579j556j060Q98L35M6K97r17o31J800P83j545o83
1952h07O73O76m12k30K22l80O51M40j528j53J387K73j178n73M15P33N95l41j356
1971h93m19K204J29j408k58J131k38k93P8k56K42P03n30j139K54J572k25j190
1989e36k89L61L65Q65l12j490M45J373m09r36L98N48J9l68l31K06N50M69j352
2008d24j123J117J273m25m67q20J21R85M31m74p71N49M97k55o75P99Q9J2n52l07
2028d20P5J183j3j463m36R09P58k90n17p04O85Q43k1q80j39J010p9p79J21L73
2048B16L60k69o47l88O76Q11n50j016j29J142M45n08m86m25O80R63o60o19M44
$$ plain form
1916 1378 420 -1267 -575 271 290 131 -56 -1241 -504 1344 574 -1086 -525 483 241 -129 94 -339
1934 -339 522 930 -103 -954 -153 1426 -130 -1190 -292 43 89 386 -531 -1162 638 1421 -124 -807
1952 -807 -134 542 130 -100 122 -258 393 833 -695 -848 539 812 -366 -939 -524 209 804 463 -893
1971 -893 -1312 892 1021 -387 -645 486 248 -45 33 -223 19 722 192 -947 -693 879 654 -536
1989 -536 -825 -464 -99 766 454 -1036 -591 782 373 -563 -165 383 402 34 -297 -91 459 928 -424
2008 -424 -1547 -430 843 418 -49 -869 -748 237 668 194 -577 -28 469 214 -461 338 427 439 -113 -420
2028 -420 -345 838 825 -638 -1074 -165 593 303 -214 -918 -233 610 589 -291 -430 580 501 -278 -157 216
2048 216 576 307 -340 -728 -52 759 209 -807 -936 206 651 143 -343 -768 -88 875 215 -404 40
2067D0M46k58r33K48P15J91J45j122o86J495O76j022r02M69N04K97l75l56LP52
2087C27L04m71q98P92O01n59o05J50N56N12j76j305n4J112P02j044j062N28J103
2106E13p0m14l34j50Q76q8n29l1N09L28p19l04K27O09k22p9j112K19J179L23j094
2127c63m76M17R25j26l62l54L88N72n35l39J11Q63l26p17j4M38M37j45p81m08
2147g95K77Q26L21p52m45O49M31m66j78J50L28K27q39K0K43L91Jr18l45J055M86
2168F67n40l53n73O30O13j29m65j49O47K30m74l52O01j5J0m37o19O00P73m99j045
2189h79J36O45O05l99m41l03N57N60j09r61K64J014l77m14j21M65N02n00o60J15
2209c01M35O42o19r14K90Q34j54o4k62k61M66M04m26n06M79M27k52o73L92K77
$$ plain form
2067 40 486 228 -705 -457 258 449 594 -528 -1214 281 957 -65 -967 -498 6 303 -72 -428 -425 327
2087 327 631 160 -738 54 655 96 -509 -359 197 709 533 -772 -826 286 988 -56 -1118 -590 513
2106 513 443 29 -305 -455 421 333 -196 -227 282 610 -109 -413 -186 423 201 122 -990 -771 408 731 -363
2127 -363 -839 -422 503 377 15 -339 49 621 86 -253 -142 721 395 -322 -336 102 539 394 -387 -795
2147 -795 -518 308 629 -123 -568 81 512 46 -132 18 346 573 -266 -246 -3 388 389 -529 -874 181 667
2168 667 127 -226 -799 -169 444 315 -150 -299 348 578 104 -248 353 338 348 -89 -708 -108 665 166 -879
2189 -879 -743 -98 507 108 -333 -636 -79 481 372 -589 -325 689 312 -102 -223 242 744 244 -416 -301
2209 -301 134 776 157 -757 -467 367 213 149 -113 -374 92 496 70 -436 43 470 218 -455 -63 214
2229B14J51k14n89j83Q93L44q50o50N83N74J19l21l82R6L36L48p15j3O28P2p61
2250c20O5J91K60M67o41o91J18R49L05j066j33L01L92M8k17m76K74O62k92p32
2270e36K89Q52j93p29LK55L43N0k24j016O16R71m59p81L34M58mO3k10m10L99M98
2292E69l91q30Q50N53q37j77J86j74N80k0o31o88J107O23o81m37M94r4K36K20
2312D58l52m95N65L46n65m42Q09K14n75m42J86P7N20R7r48l76J373J17r39K11
2332a61L14p6M81k85m40q0R00m47l33j24O20l02j00o2k98L26N55K6j339K79Q92
2353C46N4m89j19L50J9J47k98j40L17N87j009o31O52N83j94m81R2k46M59N37n10
2374B6o82N64N87n94r8M61j70J29n3n15QR85J29j002o17N65R73m16k71l21k17
$$ plain form
2229 214 365 151 -438 -621 272 616 -234 -884 -301 273 392 71 -311 -215 121 469 -246 -259 369 441 -320
2250 -320 -255 -64 196 663 22 -669 -551 398 703 -363 -496 -195 197 245 28 -448 -174 488 196 -536
2270 -536 -247 605 412 -317 -314 -59 284 334 110 -906 -290 681 222 -559 -225 233 229 292 82 -328 71 569
2292 569 178 -652 198 751 -86 -263 -77 -251 329 309 -322 -1010 97 720 39 -398 96 2 238 458
2312 458 106 -389 176 522 -43 -485 324 538 -37 -479 -293 -216 304 401 -547 -923 450 567 -372 -161
2332 -161 153 77 558 273 -167 -247 653 206 -127 -251 369 67 -33 -95 -393 -67 488 514 -825 -546 346
2353 346 400 -89 -208 142 161 308 10 -130 187 774 -235 -866 -214 369 175 -306 -214 -460 -1 536 26
2374 26 -656 -92 495 -99 -197 264 94 223 170 -345 -337 648 777 -225 -842 -277 696 280 9 -312 -529
2395e29P54L98j059K06N79r4l75J40J79j33R1J19o37K51P29k99o74q1N22L0L0
2416A47l87r0J36P65l22p55L02O47n8l86p7L45k4K66p00m60M95O79m33n80L29
2437a61K94M9l6k47p44O85P32n91m33P23K08l69K0k33n3L06J06n62k65Q27L91
2458F47j153l90P50J7J99J62m77k65P17K4m27j28N30k06l2j12J74M6M63l09j098
2479h68L85P47j15m17j50M11k24N27j62l66J62O18n32n49N05M28j60k40j94l7
2499b31M02M60q12l97N18M84k86j82k86K71N3L45j82l72J70P18o08m80O50J02
2519C37k18l34r6O4L25K71n05n28O49M22m65k0L7p2M66k25l28p4N68K62p45R2
2541a17K15N6j05k54m9q7P79j54n15l12P12J17m76p3K19j34M86J40o88J14N00
$$ plain form
2395 -529 225 623 -436 -230 349 255 -120 20 199 66 157 276 -361 -110 619 320 -354 -435 87 117 147
2416 147 -240 -330 -194 571 249 -506 -204 443 385 -1 -78 267 243 509 -191 -651 -156 523 90 -490 -161
2437 -161 133 182 146 -101 -845 -160 572 -19 -452 271 479 110 130 -103 -156 150 256 -306 -571 256 647
2458 647 -506 -896 -146 -129 70 232 -245 -510 207 231 -196 -324 206 0 -32 -144 30 76 539 230 -868
2479 -868 -483 264 149 -268 -418 -7 -231 296 134 -232 -70 548 16 -533 -28 400 240 0 -194 -231
2499 -231 171 631 -181 -578 -60 424 138 -44 -330 -59 -6 339 157 -215 -45 673 65 -415 235 337
2519 337 119 -215 -311 -247 78 349 -156 -684 -35 387 -78 -98 -61 -133 333 108 -220 -294 274 536 -209 -117
2541 -117 98 154 49 -205 -254 -341 438 284 -231 -543 169 286 -190 -263 -44 -178 308 448 -240 -126 374
2562C74k82m25K46J99J59j55j48m75L71N77k16p32K91L60j67P3k04k44L97K15
2582B14m22Q5J94K77m53m75N47P3J15j87k93l32Q11M26o33j42J50J49j54K28j11
2603F7q2K27J63p24o8P29J02l63l64L33K57Q7n77j27k8O08M8o01k00N92J87j45
2625A21r2j48J18L72l58k69N7L48Q4m54R1P8q3L96j71k44m0N20j72m16O7K69J40
2648B14j71q9j37L60M1m5n78L56M42l85j34j04K05J68N9k94j25O9N41l57j83j09
2670b56L93O9j34j58J05L05J22n73n0J44K82o8l11k03L9N27j52j54j56J69J91
2691A31n3n3RP9J05k05j70M11J37k48k51k14L29J64l33Ok14M82Jj19l64J47K06
2714a7K18k28m5J97J58nm68Q7M97J44n15k67lL74R0j05l00l1M04J55k64j38J16
$$ plain form
2562 374 92 -333 -87 112 271 116 -32 -507 -136 441 225 -507 -216 144 -23 50 -154 -398 -1 214
2582 214 -208 -123 71 348 -105 -580 -33 40 155 -32 -325 -657 154 580 -53 -195 -45 104 -50 178 67
2603 67 -15 212 375 -349 -417 312 414 51 -313 20 277 364 -213 -340 -368 240 288 -313 -513 79 266 121
2625 121 29 -119 -1 371 13 -256 -199 149 233 -221 -130 -52 -135 261 90 -154 -194 326 154 -262 -195 74 214
2648 214 43 -46 -183 177 218 173 -405 -49 393 8 -126 -230 -25 143 202 -92 -217 -148 393 36 -147 -256
2670 -256 137 206 72 -86 19 324 446 -127 -177 -33 249 181 -130 -333 -294 233 81 -73 -229 -60 131
2691 131 78 25 34 113 218 13 -157 254 391 143 -108 -322 7 171 -162 -156 -370 112 113 -6 -370 -223 -17
2714 -17 201 -27 -72 125 283 278 -190 -103 394 538 23 -244 -247 127 217 112 -188 -219 185 340 76 -62 54
2737E4P4q9j65M1J76Q4rm16K03R4L08k15n32K64J09j9J81m40K67K27k23j37L13
2760A50j24K55k55j74N0L20R4l11n6j10J46J86k68j51J9N97n47j60K99K60M9m3
2782B26l14l4K52K36l78j23K36j00K78l26p2R4J40R1m03l86M68K09k11k8P9R6
2804C0J72n3j54q3K30K7m14n5M02pk11j22L6M19j01p0j73k2P4L74l63K0l6J27
2828D7L5k1k22J8N40l42n1o6K87R6l31q1j69J90L27k58l74K52M35l77o3K59n4
2851G7r6J11k21n3N5L94m12k25L83K48o0k11R1k05l3K89j47l74N02K63m07o7J30
2874C2M3M9J01m89J4M90J11n49n9K41L8p5P5j50k22N29j56o3j25K73k0l51J17
2897a46J07J31J54j99l18R6M01j1l25k20N13j18r9O8l24L5K41K47m18J47L48j70
$$ plain form
2737 54 128 39 -126 -85 91 175 166 -250 -47 47 355 140 -392 -128 -19 -38 143 -297 -30 197 -26 -163 150
2760 150 26 281 26 -148 -98 222 316 5 -51 -161 -15 171 -97 -248 -229 368 -179 -339 -40 220 269 226
2782 226 -88 -122 130 366 -12 -135 101 1 279 -47 -119 -25 115 206 -197 -583 -115 94 -117 -145 -66 30
2804 30 202 149 -5 -88 142 169 -245 -300 102 95 -116 -238 -202 217 116 46 -127 -149 -75 299 -64 -44 -80 47
2828 47 82 61 -161 -143 397 55 4 -62 225 321 -10 -91 -260 -70 257 -1 -375 -123 312 -65 -128 131 77
2851 77 -19 92 -129 -182 -127 267 -145 -370 13 261 201 -10 81 -124 -157 132 -15 -389 113 376 -31 -98 32
2874 32 75 124 225 -264 -250 240 351 -198 -257 -16 22 -53 22 -128 -350 179 23 -40 -165 108 88 -263 -146
2897 -146 -39 92 246 47 -271 -175 226 215 -110 -330 183 65 -34 34 -290 -255 -14 233 -185 -38 310 140
2919A40k29J29m2Q1J19j81l92M70J75l83j40K53P8jq5Nj95K68J81k02k84K20J34
2942A19j81j47K00j23J40J54k94M9J41J04j28l37J97J67p7pP1j39K45J32l68J00
2964A8J29p2k33J70qlJ92l9n32J49N67l39k15Q6K43j48R6K21l97J37J03O3k13
2987b5J16Q3J50l76N5O3j08J67m8k88O3N47n42q5L15k89K84N0r9l17L53J27k61
3010f5O0J34J06m68J46J87k88J99J31k99j51K55J40k82K16Nj70j2K28J56m55J54
3032g3J48k30o9J37J95j56P2r8J09k1j13o6J2L85l04j77L20j28n7J25Ok15K40
3055D2L2N2k72M7K99k52J86m8j23j67L06o6j73J1L29j40j55p1M20k80L49n24L3
3078a65J9M21l44j10R8O4J42j04L7k63J47J99k54K7J99j18j7n5o9JM85j79m22
$$ plain form
2919 140 -89 40 -2 79 198 17 -375 95 270 -113 -253 0 78 77 -8 -3 -198 70 251 49 -235 -15 119
2942 119 -62 -209 -9 -132 8 162 -132 -83 58 162 34 -303 -106 61 -16 -23 48 -91 154 286 -82 18
2964 18 147 75 -158 12 4 1 193 154 -378 -229 338 -1 -216 -130 113 -35 61 282 -115 22 125 188 -25
2987 -25 91 174 324 -52 3 66 -42 125 77 -211 -148 399 -143 -228 87 -202 82 132 33 -284 69 196 -65
3010 -65 -5 129 235 -233 -87 100 -188 11 142 -157 -308 -53 87 -195 21 26 -144 -156 72 228 -227 -73
3032 -73 75 -155 -224 -87 108 -48 24 -74 35 14 -99 -165 -153 232 -72 -249 71 -57 -114 11 17 -198 42
3055 42 74 126 -146 -99 200 -52 134 86 -37 -204 102 36 -137 -126 203 63 -92 -163 257 -23 326 -198 -165
3078 -165 -146 275 -69 -179 -81 -17 125 21 58 -205 -58 141 -113 -86 113 -5 -22 -77 -146 -145 340 161 -261
3101b61K41J16O6k06k51L96j34n0J14j40j75K58L7j92m1L48Qj25K9L5j87L96k23
3124E9k44J47l2J54j46M1m4J95k18j65J06K6K18r3k56K77J85k73P8J50k98J94
3146F1K07j71k38L44j69j56jJ32j43K45K69m04J12l2j53j01j4L89r6j69j2N6l8
3169h2J83l1ol08J64K52l07L5J16l0J24j52N0j03R9j27N3Q1K4P0r7mm5N1J75l3
3195A52k55k0J37j71M9J69l51M3J55J10M4J0M7l34J16K20nP0k72J01PM2q7j00
3219a23R3K73l38MJ40l8n7LK02l00J21K27l8r9M7j18J79K0k54K3j3L01j20k00
3243f5q4j9K74j07K2j2j07J12j75P7M6j79J44K26r9K3m0j0J34j60m8K42r1j72
3267f8kL2j29K25K0k03J36Q3j23k5K49j02K6j84Q2j74J68m9j04J73l8K22p0j78
$$ plain form
3101 -261 -20 96 162 -44 -295 101 -33 -83 31 -109 -284 -26 11 -181 -222 126 134 9 38 73 -114 282 59
3124 59 -185 -38 -70 84 -62 -21 -65 130 -88 -253 -147 -121 97 4 -252 25 210 -63 15 165 -133 61
3146 61 268 97 -141 203 34 -122 -123 9 -134 111 380 -24 88 56 -97 -198 -212 177 81 -88 -100 -44 -82
3169 -82 101 70 64 -244 -80 172 -135 -100 16 -14 110 -42 8 -95 4 -123 -70 11 35 105 8 4 -41 10 185 152
3195 152 -103 -123 14 -157 -108 61 -290 -247 -92 18 62 72 119 -215 -99 121 116 186 -86 15 22 64 -23 -123
3219 -123 -30 243 -95 -91 49 11 -46 -43 159 -141 -20 207 169 70 117 -1 178 198 -56 -33 -46 255 135 -65
3243 -65 -149 -168 106 -1 21 9 -98 14 -161 -84 -38 -217 -73 153 54 77 37 27 161 1 -47 195 104 -68
3267 -68 -70 -38 -167 58 78 -125 11 94 -29 -54 195 93 119 -65 17 -157 11 -38 -142 31 -7 215 145 -33
3291c3k41K86j10O5J2m7J46J6j88M9J15N3J34j40j5P2j15M3j46o1L5L41k69j9
3315a7q7J64k29K0K89j04L3j06J42k58J73j9k06K82J14j98J08J59k18M9P2j68
3337ek3n5j2K15m6j23J65k97K94j65P4q7K20P9k62k8K37j16l2q9r1L3K32k63J27
3362a8n0J96j3k85M44n84R3K23l6l9J13O6K6R6m66J37J43q8P2%J5lP8j02J51j47
3388B2j14R9k7m7j8Q3j7N7l7R0J4k80K32J57j93j58Q3K74j78J2Qk59N3J52L0J94
3414B32k25PJ3J90m3l03J41L2J6j73N1j0J73L0k60j29K13R8k38K20l1K19j58k6
3438C9o7K31k71J83k43J64K59l08j48L6O8N6pJ66k05J6j42K53q7R0J42k56R7k53
3462a87K17j14M1J29j09P1JR9l68R0J42on6O5k92J69M3j25K9J87J14j67R6j56
$$ plain form
3291 -33 -274 12 -98 -33 -21 -68 78 94 -94 -45 70 123 257 117 102 174 59 102 -44 -105 -70 271 2 -17
3315 -17 -104 60 -169 -149 140 36 69 -37 105 -153 20 1 -205 77 191 -7 101 260 42 91 163 -5
3337 -5 -28 -83 -95 120 74 -49 116 -181 113 -52 22 -65 155 234 -28 -56 181 65 33 -56 -147 -114 118 -145 -18
3362 -18 -68 128 115 -170 274 -310 -217 6 -30 -69 44 110 136 232 -234 -97 46 -42 30 30 45 42 120 18 169 22
3388 22 -92 7 -20 -67 -85 -2 -19 38 1 91 105 -175 57 214 21 -137 -54 220 42 54 62 -197 -144 8 38 232
3414 232 7 14 27 217 174 -129 12 44 60 -113 -62 -72 101 131 -129 -258 -45 53 -185 35 4 223 65 39
3438 39 -28 203 -68 115 -128 36 295 -13 -161 -125 -57 -1 -8 158 -47 -31 -173 80 -7 83 225 -31 66 -187
3462 -187 30 -84 -43 86 -23 48 49 148 -220 -130 12 6 -50 15 -277 -108 -65 -190 -161 26 140 -27 69 -87
3486h7J31J65p2j49o4Q1O8l47J12P2L48k81K40k14m4J10j65J27o6N6J91k06l7
3509c1J12r6N3l39q1N16%j20p0k1l4k3J85l6mo4J68j32j21R5J94l29L04p2k60
3534b06J41RK30k05L1j60J90j64J56j9N9Lj77K21k9J39l89k51L80Nk28J73J53
3557F2L6k86K45k38K45r7M4l2R2j17L0m6J35l20K21J53j76n3J32rK03k43q2N0
3581e1m3J05J26k06M1K62k84j61K90j53J43N7k11n3J99O4j76j67P5J85M9Qk73
3604a74N1j21L00j43o3L42k28J89p5j20L9J6q7LJ51p6J64l41K8K59k31J12r8Q0
3628b3k61K23J36j85m5L50M8m37O1J64J52J88k01j27j03K36k97Qm9K65j72J86
3650A17R9l65q3N04r7m78M23%o8j01P1K16k55j5O7k81L11j23p2j48J99k1Q6J6
$$ plain form
3486 -87 44 209 137 -12 -76 5 73 -274 -162 -90 258 -23 217 3 -41 69 -96 31 -35 21 212 6 -31
3509 -31 81 -15 38 -301 -382 134 134 14 -56 -77 -111 -134 51 15 11 -53 115 -17 -138 -43 151 -178 126 54 -206
3534 -206 -65 -56 174 -31 0 -160 30 -134 22 3 62 65 -112 109 80 219 -170 -421 -41 -36 -264 -91 62
3557 62 98 -188 57 -181 64 -33 11 -21 71 -46 -16 -62 73 -247 -26 127 -49 -102 30 21 224 -19 -101 -51
3581 -51 -94 11 137 -69 -28 234 -50 -211 79 -74 69 126 -85 -138 61 125 -51 -218 -143 42 91 99 -174
3604 -174 -123 -244 56 -87 -150 192 -36 153 78 -42 -3 13 -74 -71 80 4 168 -173 -145 114 -117 -5 -103 -23
3628 -23 -284 -61 75 -110 -155 195 243 -194 -133 31 183 371 170 43 -60 176 -121 -113 -162 103 -69 117
3650 117 216 -149 -232 272 175 -303 120 120 52 -49 22 238 -17 -32 35 -246 65 -58 -130 -278 -79 -100 -14 2
3674BJ13m1Jp3k9q8K99j87k83L21j80J93j06p1l9j0K46J36j74qML8j36J35k45
3699a82J44J21j79j5p7K05q3p3P2K05r6J84j63j69J40P4j1k49K06j17n8O3r5J07
3723d6L6j50J78k55M37l38J17L46j77l54J5N40n26J23K10p7r1j12K24l48J86k8
3745i0j51J03K07q7O1k52J58K41j80j77l5L35k5p0j41q5K83j33mJ97j63k23M3
3768a88K99j79m1K44n9j64p6K77j84K91j95k54K39J60N8l56J17L1J26r6j86K87
3790A51l33M41j51k9k18J17Q7L1k22L96k80J31j46Q5K8kj92j30K23P1q9j49M4
3813a36R8N7q6k14K68K04J79k23j59j14P1J78o4k49K63R3j02j25J7J42r9M2nj80
3837a44J29J40p8m9P2Kk28n0J85J5j24J69O6k86K22j9j7J3jj1j50R8m1o9J38K01
$$ plain form
3674 2 115 74 75 2 -27 -115 184 -3 -286 35 -145 48 -58 -129 -168 -178 68 204 30 22 26 64 -72 63 -182
3699 -182 -38 83 -96 -111 -188 17 -66 -139 -67 138 42 226 63 -106 34 108 97 -152 54 -63 -121 -58 -153 -46
3723 -46 -10 -160 18 -237 200 -138 -21 325 148 -206 -191 349 -177 -54 156 79 -12 -124 100 -248 -62 -90
3745 -90 -241 -138 69 -18 43 -209 -51 190 10 -167 -202 133 108 38 -103 -188 95 -38 -42 155 -8 -231 -188
3768 -188 111 -68 -109 135 76 -88 -164 113 -71 220 25 -229 10 170 228 -128 -11 20 146 50 -136 151
3790 151 -182 259 108 79 -139 -22 65 96 -126 270 -10 121 -25 60 88 86 -106 -236 -13 58 -31 -180 -136
3813 -136 -38 19 -67 -281 -13 191 370 147 -12 -126 -55 123 59 -190 73 166 64 -61 -44 98 -1 41 36 -144
3837 -144 -15 125 47 -2 70 72 -156 -206 -21 -6 -130 39 105 -181 41 22 5 18 17 6 -144 -46 -87 -156 -18 183
3863A83j45j34r0L44k61l8J13P8M5k5j15NK47p7j48p4K05n9J61o9j33Q4m09K81
3887c1L6r5K15L5j93k8J11J4O3k56K1J31k5M8k33L4n1J72P4j99L10j12P1N5j69
3912bp5K1K90l96L4O0P9M9r3M5K54k83N0J4nM0J13q2Rk81R5J07K3L4r9K4r3K23
3940A55k71N2J10j35J9j60K93J14Pj57J7K4o1J8J26j03LM8q3N3k7K29j97k59m
3965a89J59RJ0j03J32l4L6j46J27m5K26o3j48l01K49J62j24j99QK24o2K11p6l5
3989B8j14K24k07j39J16N5K68l04J28k5P3j94m4K10l01K31k4O5j71J98j08K1j87
4012b01L64k89N0L8r8J32J20k5j4j55LP4q6j18K62j10M4J85j98n8L51k25m5p7
4036g6M7j52J97J00q9j1L9j41J16r9P3J72j48k00J31pj04J04l5M6K55k23J11j46
$$ plain form
3863 183 38 -96 -186 158 -103 -141 -28 50 95 70 -45 -40 207 130 -18 -92 113 54 215 146 13 97 -312 -31
3887 -31 5 -90 125 160 -33 -61 50 64 127 -129 -108 23 -2 46 -187 -153 -204 -32 42 -157 153 41 112 167 -2
3912 -2 -77 -56 234 -162 -128 -68 11 60 -33 12 266 -17 33 47 42 82 195 113 122 -159 -64 43 66 100 1 25 -68 155
3940 155 -116 -64 46 -89 -70 -230 63 177 184 27 44 68 7 25 151 48 51 99 16 69 42 271 74 -185 -189
3965 -189 -30 -21 -11 -114 18 -16 20 -126 1 -44 182 119 -29 -330 -81 81 -43 -242 -234 -10 -72 139 63 28
3989 28 -86 138 -69 -208 -92 -37 231 -73 55 30 103 -91 -135 75 -226 5 -19 46 -125 73 -35 -14 -201
4012 -201 163 -126 -76 -38 -136 -4 116 91 77 -78 -75 -1 -87 -205 57 -53 -9 176 -22 -80 271 46 1 -76
4036 -76 -29 -181 16 116 27 16 55 -86 30 -69 4 176 28 -172 -41 -48 -152 -48 -83 -37 218 -5 106 -40
4060d0p0l0P2lQ9q8P7J63m33K58K44j80j60L8M4R7P2k34pJ48l7l5j41L12l27Q4
4086h7K43k15Q5O8J19q4j96K21Jk36J8P9P6O5j85kj66J28L0N3N0o4Q9J5j33J13
4112H5l8L7J40l03L0J03j35j61J84K60l06k0N3j91J16K27J34m57L24j14K0J56
4134A44p1L4j59K35k33J00r6J48r0Jj6N3p7J9p3J4J92p3r9j84M13k20l3K77p6
4159A30j77K13l3j20j06J23p4K16k14J9j76K26K40o35N33J2j65k1j42M1P8N0k1
4182cJ14j89P9N1m6Q3q8r9j25J45Mn4L14j83r4j1L05Q4l52P2o8K7K78k28j81J39
4208b6J77k08q9J66J7Oj86J26l7N1L23m07J33J69k93J1J01j88J32J29Q7j64k74
4231b44L51J35l40J29J8o5k3p9k32K89J12J61k98J6Ro3J61Q5k03q5R3L40m05K9
$$ plain form
4060 -40 -110 -140 -68 -71 18 -70 7 170 -263 -5 239 59 -101 -63 -19 78 150 -84 -91 57 20 -15 -156 156 -171 -87
4086 -87 156 -59 26 94 213 129 -67 154 155 -81 -63 16 92 157 -28 -30 -196 -68 -38 15 65 1 90 105 -28 85
4112 85 47 84 224 -79 -49 54 -81 -242 -58 202 -104 -124 -71 -262 -146 81 215 -242 82 -32 -12 144
4134 144 73 107 -52 183 -50 50 -46 102 12 13 -3 50 -27 -8 -81 -67 125 52 -47 -231 182 -38 -71 206 130
4159 130 -47 166 133 13 -93 30 -44 172 -42 -23 -199 27 267 -368 165 177 12 -9 -151 -110 -32 18 -3
4182 -3 111 -78 1 52 6 89 1 -98 -223 -78 -74 -128 186 3 -91 -102 203 287 -65 7 -61 -34 244 16 -165 -26
4208 -26 151 -57 -146 20 37 43 -143 -17 -54 -3 320 -87 46 215 -78 -67 34 -154 -22 107 194 30 -244
4231 -244 107 242 -98 31 49 -16 -39 -118 -350 -61 51 212 -86 -70 -61 -124 37 122 -81 -166 -73 267 -138 -109
4255a09K56j21j1N8m4k67K89m5o5j3J34j8l9O6L8k31M4J80O3l53K92r4p5J20k8
4280B7r4J21kp9O6j61K09n2j62K23p5Q4j0j09L87m71J24RJ08J21m03N0J03Nr4
4305g5j69K46r7J81q3j58J65j24K97k53J34r1P7q4n7O1M5J0k38J97j12J67M6K1
4329A06q7j8R3j45J25j5L9J70l74N5J25P6j24k38L59k6l5J77k21k14J39q1K29
4352A15j58q4K81k44K86j45l06K98MJ25mK3l95K47R7M1k56R1j58L05m28L50k5
4375F0Lj1j7J48p7k24M1K13O0l1N3l04P2l5l9J41k03O3L7m7k27K04O5J40k12K30
4401A03o5J40J05k75j59r1L37k6r9p1J19J40Mk31K94k98K38p7j7l7NP1j16J55
4425A49j17J7l55P0j40M05j45l2R8r2OR7j5j41J59J7m4k10L4K11J79r6n5J5j14
$$ plain form
4255 -109 147 26 15 73 29 -238 51 6 -59 -72 62 44 5 71 109 -122 -78 102 165 -188 104 10 -65 55 27
4280 27 -67 54 52 -27 39 -122 87 35 -127 96 21 105 95 -14 373 -98 26 35 143 264 -139 -89 14 19 -75
4305 -75 -244 2 -95 86 3 -155 10 -114 183 -70 64 -27 50 -34 -91 -30 15 25 -213 -16 -128 39 85 106
4329 106 19 1 94 -51 74 59 98 268 -106 -51 74 150 26 -212 147 121 86 263 42 -172 -33 -114 115
4352 115 -43 -127 154 -90 196 51 -255 43 47 172 168 191 -204 43 140 181 -75 16 -142 163 -265 85 60
4375 60 63 52 35 183 106 -118 -77 136 196 165 218 -86 -14 -49 -88 53 -150 -87 -50 -97 -324 -120 -55 85 -127 103
4401 103 38 178 283 8 -151 -242 95 69 -30 -101 18 158 162 -69 225 -73 165 88 71 34 39 110 -6 149
4425 149 32 49 -306 -236 -376 29 -116 -148 -50 -142 -136 -39 -54 -195 -36 -19 -63 -273 -239 -28 151 55 0 15 -99
4450i9K74j92j73P7J67J50l39K75k65J77k9m0j04kK85j27k00J97j5J54K8j18R1
4473A72k47J74j03J20l12K81o5M3j24n6J57k03K98k23J26j6o8L58l22J4R8k57
4495a55Q4j6L9L2j38j07J67M8J95k57k10L85J8j30l0J9jL31j02o0j48j52K64k04
4519a28J22Q3j41%J16p9L9lk22J05k87M79K1j65J60j2o7j26J65j4L5K6K9j00J09
4544A45k07J8J18j54j30K71K10k67j4o5L39k80K00k00kk5K42q5j68N7j6M1n1o4
4568h7Pj28L45j64oO2J85j82r1N9k22L27q4r6J11O4J26k67q5J39P2l7k7j62j09
4593b50oK34J5QJ46k99J39j1J94o7j63K44j90nk3K21n3n8J28l25lJ55K1q3j38
4618a69K40k25J39Q6j34J03J42k88J73J14Q1k69j34K25r2j14M15j36p2J21o3k23
$$ plain form
4450 -99 175 -17 -190 -113 54 204 -135 140 -125 52 23 -17 -121 -123 162 35 -165 32 17 171 199 81 172
4473 172 -75 99 -4 116 -196 85 20 63 -61 -117 40 -163 135 -88 38 22 -46 312 -10 4 102 -155
4495 -155 -71 -87 -48 -16 -154 -261 -94 -46 149 -108 -318 67 85 -45 -75 -56 -57 274 172 112 -36 -188 76 -128
4519 -128 -6 77 -64 -64 52 -27 12 9 -213 -108 -395 84 105 -60 100 88 21 -105 60 46 81 107 136 36 145
4544 145 -62 -44 74 -80 -210 61 271 4 -10 -75 264 -16 184 -16 -18 -43 199 114 -54 3 -13 28 -23 -87
4568 -87 -80 -208 137 -27 -33 29 214 32 -59 0 -222 105 21 -75 36 100 226 -41 -126 13 85 48 21 -141 -250
4593 -250 -256 -22 -7 1 147 -152 -13 -24 170 103 -60 184 -6 -11 -34 187 134 76 204 -121 -124 31 52 -31 -169
4618 -169 71 -154 -15 71 -63 40 182 -106 67 181 262 -7 -141 84 -8 -122 293 157 85 206 143 -80
4640h0P8J44l92K49j2K51k29M9k71L07j74j04L79r3n4j27O7j79M07l16j27K87
4662F0j39j15N8J08J51n2k6M1j17J40L6r0r9K36k85K76j33J03k67n5K15p9j31
4685a64J32K1Q6Q1k15P6M2J09j09j11K1j4K6M7j13K72j34j20o8R6J42O4r8K7k6
4710G0j24k2L37m71m0K78J78m30J64K3j74J89K59j66j87Q1l2K4J0J41j75J04o2
4733b5J6p5L8K14n8l2l7r3P9J69j2l03K04jm5K4J27j47j65m6L01k75J27J37j05
4758A7m3K23r8r7k07M23k20m1J32k32J14L60m64q7J00J57J19m23L22K7j41J92
4780A33j28J04j73J00j63ML64j18k79P3J33J36l16J11k6j58M1K56N1l02Q9J06
4802C8r7J00N7k27K85j36m3J71L2j18N5k24K76k57p5L41l78O0K95j22j43K1Q1
$$ plain form
4640 -80 -2 142 -250 -1 -13 238 9 58 -213 94 -80 -184 195 102 48 -79 -12 -191 216 -100 -227 60
4662 60 -79 -194 -136 -28 123 71 45 86 -31 109 145 55 -44 192 -93 183 50 153 -114 -169 46 -33 -164
4685 -164 -32 -11 75 156 -59 17 59 168 59 -52 -31 -45 -19 28 -85 187 53 -67 -135 -39 103 167 69 96 70
4710 70 -54 -76 261 -210 -250 28 206 -224 -60 -37 -211 -22 237 71 -116 -35 -67 -43 -33 108 -67 37 -25
4733 -25 -9 -84 -46 168 110 78 41 -52 27 196 184 -119 85 84 39 63 190 43 -122 -168 133 -142 -15 122 17
4758 17 -26 197 99 2 -205 218 -2 -43 89 -143 -29 331 -133 -220 -120 37 156 -267 55 82 -59 133
4780 133 5 109 -64 36 -127 -123 241 123 -156 -83 50 186 -130 -19 -45 -203 -162 94 145 -157 -68 38
4802 38 -59 41 98 -129 156 20 -23 148 180 62 117 -107 169 -88 -163 178 -200 -140 155 33 -110 -89 -8
4825hj67K21K29k47o4J16J14m72J31L18j85n1J05p5j70J41J70l13R7J80Rk57K25
4848D7J9j32N9m0L7O4J50L5l94K09j10K50j43k94J79O4J00k11p7K17l0l7K8J00
4872I0j22J42o4l2k79L34r3k15L11J0O6j81O5L5k73M82n9l26K2K90k46j35PJ51
4896b0P4M8R9n22K79K15k36J04q1m0j5K62k71J93j49J72L9k36P5K7L8N8P5l47
4920a59J4M6K87j83J1L29l26j11K21k7k00Nm6K5Q8P7k74J61K94l3l32K10J69l75
4944a29p5L16k36J12R6k28R5n1J25j34l8K63l21J19K81k56j50M6K40o5j7N4k47
4967b00J74J0K8m0K4J15j19k11n4M68k02j33K38q7o6K29O1m14M6K33p3J33j06
4990E4l9k1J17k35J28r9K61k02p2j4J99k09J65j87p6L86J5J0m68L49N2p0J84l25
$$ plain form
4825 -8 -175 46 275 28 -36 80 194 -278 -147 171 -14 -65 40 -35 -205 -64 106 -207 -110 70 79 -178 47
4848 47 66 -66 -7 -47 -10 54 204 239 -155 54 -56 194 51 -243 -64 0 100 -111 -188 29 -1 -38 -10 90
4872 90 -32 110 46 14 -265 69 -24 -239 72 82 148 -33 32 67 -206 276 217 -109 -87 203 -43 -178 -171 -20
4896 -20 54 102 201 -321 -42 173 -63 41 -40 -80 -95 167 -104 89 -60 112 151 -85 -10 17 55 113 188 -159
4920 -159 -145 -99 188 5 16 345 19 -92 129 102 -98 -93 -139 -114 -26 51 -223 -62 232 199 -133 77 246 -129
4944 -129 -204 112 -124 -12 84 -144 -49 -100 25 -109 -147 116 -205 -86 195 -61 -211 -165 75 10 -7 47 -200
4967 -200 -26 -16 12 -28 -4 111 -8 -219 -273 195 -7 -140 98 11 -55 174 235 -179 -133 100 27 160 54
4990 54 15 -6 111 -124 4 -95 166 -36 -108 -122 77 -132 33 -154 -230 156 171 181 -287 62 114 44 228 -97
5014i7k96O27k50j48J95o3n9l3NN6o1qK22L9k43L95j31l11K29j52o7J21K17k84
5038i7J11P5j3R5j27J5K4j82R1P7j12k1o9k0J4L69j3k68J57l49L59k8j0j3p4q
5064a7j89J01k8L2K48R1k83j54L38J49p2m89M08j2j60r8K63o4k0l7p8Q3J9O3j66
5089g2o0R5okJ6m4J96j67J18k66J64l6J79Jj26J26k58K26j41k22L84nl1k61J92
5114@l6KJ07k39O7P8L15j85%n6N5j64K50m21J86j08K25o0r4n8RJ65l14L36j68
5139a08K42k42J38k7P9p2L1o2m3P7l8Oj74L24j61L0j51K99l10K79r6k4j58N6N1
5164e4j2J97k52K61j4o7K0j59M2J17k27K05k05j05J24R7K8m5J00j19o9R0M64n08
5188i1J10j04N7J29q6j25L6J5p3Ml9N13m38m0j45K43K9N8l3j32L24l11J20J08
$$ plain form
5014 -97 -393 234 -16 -164 31 -32 -91 -124 -119 -63 -124 -132 90 129 -114 281 150 -161 68 -84 -151 -30 187 -97
5038 -97 14 89 76 171 44 59 83 -99 -8 69 -43 -64 -133 -153 -139 230 217 -51 106 -243 116 88 78 65 -9 -17
5064 -17 -206 -105 -133 -101 147 238 -45 -199 139 288 216 -273 135 123 -37 -135 128 64 44 7 -71 12 31 94 -72
5089 -72 -132 -37 -43 -45 -29 -73 123 -44 74 -192 -28 -64 115 116 -10 116 -142 84 -57 -279 105 100 69 -192 0
5114 0 -36 -34 73 -166 -99 -21 294 109 109 53 108 -56 194 -227 -41 -149 76 16 -78 -136 -127 38 -276 60 -108
5139 -108 134 -108 30 3 82 10 41 -21 -64 13 -25 -19 -193 131 -30 0 -151 148 -162 117 21 -3 -161 -105 -54
5164 -54 -66 131 -121 140 126 59 79 -80 -38 79 -148 57 -148 -253 -129 -32 -4 -49 51 -68 -137 -47 417 -91
5188 -91 19 -85 -28 101 15 -110 -74 -59 -132 -128 -167 346 -92 -132 -277 -34 -5 53 20 -112 212 -99 21 129
5212A29k25J25j24M1N6N2p3O8J56N5m22K53k6j11J49j63r0K00k2j39M2J40p6l28
5236c33N44k92j40M27k83N4k31L40j59L4O5j16K17j56m2j4qJ60j56R7j45M22k16
5259F9k80K63j28R9K5p4k61Q3J42R4k81L21j34Q8q6N1j68L43J50j07J6l21K62
5282A66k02j46J62PJ11j22j77P2N5K68k08P7J0P9m2j04k22L43r9J58j40oJ36j29
5306D7j52K40j8rm8J56l42j05L73kj70q5P7J38p7K02l74J97j72K52j49j47K44
5329G6q2J5q6l4j26J28n2J10q9L14k40o8L05j93p7J05J01k15K34J09n5n4j55J61
5353A32n2k67J4J41P1J21j88l5J04K15k61rQ8j8j81J99r6j55J46Q9O4n9J32O5
5377B60k40n0K7j27K70k0k58J43J70k93Q3K7J49j69j4J37N9l00M59k93K8o2N0
$$ plain form
5212 129 -96 29 -95 -54 2 54 -19 49 205 260 -162 91 65 -46 103 -60 -150 50 28 -111 -69 71 -5 -333
5236 -333 211 -81 -221 206 -77 -23 -254 86 -73 -39 26 -90 127 -29 -71 -85 -93 67 -89 8 -137 285 69
5259 69 -211 52 -76 23 48 -26 -287 -204 -62 32 -249 72 -62 26 -60 -9 -177 166 316 209 225 -96 166
5282 166 -36 -182 -20 -13 98 -24 -201 -129 -74 194 -14 63 73 152 110 6 -216 127 28 186 46 40 176 47
5306 47 -105 135 117 108 60 216 -126 -231 142 140 -30 -115 -38 100 23 225 -149 48 -124 128 -21 -168 76
5329 76 -6 9 -77 -111 -237 -109 -161 -51 -140 174 -66 -134 171 -22 -99 6 107 -108 126 235 180 126 -29 132
5353 132 80 -187 -173 -32 39 160 -28 -63 41 256 -5 -14 74 56 -125 74 -22 -177 -31 58 122 63 195 260
5377 260 20 -30 -3 -130 140 120 -138 5 175 -118 -35 -8 141 -28 -42 95 154 -146 313 20 48 -14 36
5400C6r6q3nJ74j18K5O5J49j74J14j44j32J44j77J28K27kk38K0K56k69n5K77q6
5424C6k00J75K4M9j27J61n4k49L87j71r0N9J00Q6k10l0J50j24K5j00P5j38l8l4
5448b38M93j87p4k20M27k07n7K6L5J03l68L81j34j09J62Q9l32J25J72j94q3K20
5470C0P3M6k55J40P3j38j0J34k72M15l1j84n9M0J24l9R1j85j50RL01m4j08r6K08
5495A13k77J33K29R0l27J71j37j67M67k38LOq4j47J85J4o6j02O2J31j51r0J76
5518fo4K36p8j64o2J90R0k47O5J83m1j79M5l1O6j27k9m7J89M7Jj38J74k3j44Q4
5544a0k7k51L6J36J68r1OP0Q0l11O3J55J25j56J2j94j2L72k87O1p5K30J10k22
5568a2l0PM6Q2pk79P4J42l3q1j30M1l4J33J13k22J15K46k78KP2J17J4j79K20k25
$$ plain form
5400 36 -60 -143 -148 26 -92 -67 -2 147 -27 87 -57 -189 -45 -222 -94 133 131 -107 -87 169 -100 -155 122 36
5424 36 -164 11 35 84 -43 118 64 -185 202 31 -59 0 100 186 -24 -54 96 -28 -3 -103 -28 -166 -204 -238
5448 -238 255 68 -6 -226 201 -6 -63 -37 -2 101 -267 114 -20 -129 33 122 -210 -85 87 -107 -190 30
5470 30 103 149 -106 34 107 -31 -41 93 -179 236 205 21 -38 2 126 87 178 -7 -157 -148 153 109 1 -95 113
5495 113 -164 -31 198 288 -39 132 -5 -172 295 57 60 66 -18 -165 20 34 -32 -134 -72 59 -92 -182 -6
5518 -6 -70 166 88 -76 -138 52 142 -105 -40 143 102 -77 -32 -63 3 -124 -153 -200 -11 36 37 -101 73 50 -94 -10
5544 -10 -37 -288 -252 -116 52 -39 -33 37 117 -194 -131 24 149 -7 5 -189 -201 171 -116 -55 -130 100 210 -12
5568 -12 -42 -35 11 93 86 -193 -119 23 -10 -91 -221 -180 -214 -81 32 -190 -75 171 -107 -105 -33 84 98 -81 139 -86
5594h6K08q7k5j29J55RM4j9M0r8L4o6L6q9N9o2L53j16j13J44r8j74j63L65k29
5619a07M7l6K38l03L23k17o3K0L2R3j63P2K0Jo8J92j40J77j06J85n9k77P5J43
5643G9Q4j47j32L3K01p1l05j6J82J66j44P0Q2j62J00k16K37J33l24J53Nkk00J61
5667c3J3k50K55Kj15p7K60p5J20j71K17R1k76K56j84J31j62OJ95j93J08o4l02
5690b48J87k08J45J89k41J40J39j45j54M20j25j69K07J0j10J47k03pJ21k77L60
5711A78k66j8R7q1J46n1j14K89k06J00P9j66J3K09j54n1K3K2r8Nj00J6K80j18
5735C4l5L0j4j30J90r7J65j10k1L8M0r2K71j53j87M3r0L69k02R9k70o4M08j87
5759C5q8m0RJ27j73M6J11J20j76J74j69j63L87k14M6j98M11j84j45k76L84LP3
$$ plain form
5594 -86 122 35 10 -119 36 45 89 70 110 12 46 -20 16 -73 -14 -76 277 161 48 192 94 -80 -243 122 -107
5619 -107 -60 -96 142 -161 162 -55 -118 -98 -66 27 -136 -64 -44 -43 -111 81 -59 118 12 197 138 -139 -64 79
5643 79 163 16 -116 -83 118 47 -258 -274 -92 74 -70 0 82 -80 20 -196 41 174 -150 3 8 6 -194 -33
5667 -33 -20 -270 -15 -13 -128 -205 55 -20 100 -71 146 237 -39 217 33 164 2 8 203 10 118 54 -248
5690 -248 -61 -269 -124 65 -176 -36 103 -42 -196 224 99 -70 137 147 37 184 -19 -26 95 -182 178
5711 178 -88 -106 -9 -90 56 5 -109 180 -26 74 153 -13 0 209 55 4 27 49 -49 -44 -144 -128 152 34
5735 34 -1 29 15 -115 75 -22 143 33 12 50 90 -2 269 116 -71 -28 -118 251 49 148 -122 -186 222 35
5759 35 -53 -93 -84 43 -130 -84 27 147 -29 145 -24 -187 200 -14 32 -166 245 61 -84 -360 24 27 100
5782A00l03L0K58L0k07J13JR6j68o7K44j66j28J54M6m73P19l86K07l24J24J22
5804B2P3O7l61k82N13l8k4QJ14O1l97K76j58K49j00L2J5l6Q3k48K16r5j16O5k90
5829c51K64nj6K24j27M8j36J06N7j57K51o0k05L01Lk84L0K02k95P4M4n2N8Q7j34
5854g3j48K94M5j64o2J30k00J79MJ50j78J01Q7o7m7j06q7K68J19k29r2J32O7j33
5878a0k85M96j53L9P5q0k02K01J01j56pj62M8m0P3J81Nk04K37j25n9L60k79j04
5902e0j0L57J7l09K23k51k6J77j59r0P0J84l33j0J88J8j35K20k20K50k13J45j53
5925a10j24M89k07n1J40P6k42J08k6J51m85J76J03n1k62L80j53J7M28k80m6N7
5947H8j82m5K7J55N4n9Q1j67j97J62P5j99J21M2m7r7J74K8o1J40J29k74o4j11
$$ plain form
5782 100 -203 -173 85 115 -92 21 22 118 -50 -117 127 -39 -167 -13 33 -440 279 -107 100 -224 -100 22
5804 22 95 162 -199 -481 32 -6 -30 -22 92 153 -244 32 -126 123 23 55 70 34 117 -131 85 -10 -126 -61 -351
5829 -351 -87 -92 -108 116 -11 37 -99 7 64 -93 158 98 -107 194 197 -87 -57 145 -150 -76 -32 -84 -26 61 -73
5854 -73 -221 73 118 -46 -108 22 -178 1 5 155 -23 78 165 98 51 -55 -142 126 245 16 -76 56 123 -10
5878 -10 -295 201 48 87 162 82 -120 81 182 26 19 -143 -95 -135 -62 119 124 -80 157 32 -27 333 54 -50
5902 -50 -60 297 314 5 228 -23 -49 128 -31 -121 -51 133 -200 -210 -22 -4 -139 81 -139 111 -102 43 -110
5925 -110 -234 255 48 -3 137 213 -29 79 53 204 -281 -105 -2 -53 -315 65 -88 -71 357 77 31 88
5947 88 -94 -139 -112 43 97 38 119 -48 -245 -83 -8 -207 -86 -44 -91 -188 -14 14 -47 93 222 -52 -116 -227
5971b27K18j39K20J12j17j10O0O2j63L51k86j82J86N1J15k60J20l5j89K84o4j52
5993a45K11oL5k51P8l9J01L8L7P3k24J13k7k79M82n6l45K02k2m2J54K20j45k93
6017a30Q2K29n8j51j03NO7P1o7j9J34j19NP5j7j84K18K8j08R7j35J23l02J61L47
6042B49j40k25K51p3r7J71o8o4J3R2j05k34p3Q3rL23j7r9N3O4N7k47O4l5L2MQ4
6069E4l6O9k14O4l6P5K18j73j46m2L78l16J05k13J89J51J03k35p6R1Q9j03k26
6092b30L73J1k37m6K78Lo9j24K5L9O7m4j04Q6k2Q5j78j8K10j46J43K5j71k9O5
6117hr7J90Nm1K0j77P1n2rK14q0M8k53K52o8K12k94M5J10k47J74Q7j17J05k11
6142a21oJ30j51J66n2j90K04jj33K85L5n4n7J2l1op5L0J12p4L3M6k6r1p6J85j92
$$ plain form
5971 -227 -9 -148 72 184 67 -43 17 79 -84 267 -19 -201 -15 36 151 -109 11 -24 -213 71 7 -145
5993 -145 66 60 95 -156 -78 -117 -16 22 59 132 -92 21 -6 -285 197 141 -204 -2 -24 -66 88 308 163 -130
6017 -130 -48 181 123 -28 -131 -126 -59 12 -55 -74 60 -59 -54 21 4 -180 38 66 -42 55 -80 43 -259 -98 249
6042 249 109 -116 135 62 -35 136 68 4 17 109 4 -230 -303 -220 -229 94 77 -22 31 95 152 -95 -31 -66 -34 -30 54
6069 54 18 87 -127 -63 -99 -24 194 21 -125 -167 211 -105 0 -213 -24 127 230 -5 -81 10 99 -4 -230
6092 -230 143 154 -83 -129 149 152 83 -41 -16 23 90 46 -58 28 6 91 -87 -105 105 -41 102 127 -44 -73 -8
6117 -8 -105 85 90 49 69 -108 -37 -89 -98 116 36 84 -169 83 15 227 -67 -22 88 -159 15 102 -15 90 -121
6142 -121 -127 3 -148 18 -34 -224 -20 -21 -154 131 166 112 55 67 36 30 -45 -15 97 23 56 102 76 -15 -91 94 -98
6169i8K10j34KJ04J09l0r0o8O1j79J04K20k12j08lN1J12j65N0J72j72m8Q1L1J40
6194A40j61M6M0Lk3nJ58l53J82j51K03j07q8J67k14J89k30O0m1K19k2J34j59j23
6218a36L5K14k13J4k4J58q8J44j9R4j90j23P6j81L82k73%L08R7j71k50J61M4j52
6242i3K98j64P0r6J64k7j98K25k34J70j90K2K2qm4kJ07J9o9r3J94k77K80j48P6
6267Dk14J34j24J25J45qM3kj05N9p4M8J03r6J10L8l6J2m3q1J42j36r6j62K07j5
6293b2J13j47p3K19j36L7L81l43M9n6O9j30J14q0J97m7j69%J86j09M6Q6k32J18
6317G1j1K1k5l5O3j38q5J91k1j69R8j8J81o8n3M8N7j22O4o6J27j86K25j25m6o
6343b8LJ31k10L25k58K94m36K15J11k46J04k06K33L7l4j16J34J11k47K3q9r4J55
$$ plain form
6169 -98 112 -22 -20 84 193 163 73 5 66 -113 -9 211 -1 -109 -112 -61 51 -114 -64 108 -64 -112 -31 0 140
6194 140 -21 25 65 68 45 40 198 -155 27 -124 79 -28 -116 51 -163 26 -204 -144 -185 34 12 146 -13 -136
6218 -136 -101 113 -100 -86 -110 48 -40 104 85 179 -11 -134 -58 -239 143 -130 -130 178 275 104 -146 15 59 -93
6242 -93 205 41 111 15 179 152 -46 179 -55 115 -75 -53 -31 -39 -83 -85 22 41 -28 -121 73 -204 76 -72 4
6267 4 -210 -76 -200 -75 70 62 105 103 -2 57 -17 31 134 38 148 186 150 162 119 38 180 44 -52 -214 -7 -22
6293 -22 91 -56 -129 90 -46 -9 372 29 78 22 91 -39 75 -5 192 145 -24 -24 162 53 99 185 -47 71
6317 71 60 81 56 21 84 -54 -139 52 31 -138 -40 -58 123 55 2 50 107 -15 49 -17 110 -76 149 24 -22 -28
6343 -28 -25 106 -104 221 -37 257 -179 36 147 -99 5 -201 32 69 35 -81 53 164 -83 -60 -149 -243 -88
6366h8K69k11j59J68L8L1L4j70J92J03m43K40K2l3k4o3p6J39K18j65k02K62oK31
6390C07l50LL9J35j09j71J56J61N6j90o7j5j26R2J83K5l07K36N9j97j20K19Nj04
6414h0o7K24P4J1kk86K10J76j27o7j42l8r2L46k57j84M92q9j69k50K87L9j75L2
6438a34K56O3q8j84j19l0L86k05R4j94j3P1J35o5l9L5j66K68k83K28J45K0k59
6461g8J13r8j36L41n3OmJ3k75O8J96No2J17R1k86q8M8J74p7jQ6o8j04Q4o7R1L27
6489C63m79J19o1o5K18L7l3k23J48j52o3P4L33r5k7j74rJ20k9J79j83m7n1K42
6513A42j44R2k06M14j39q7j74j6K01r0k8K08j74k9j03k4K60k0J01r0k29K9J98
6536I2Pk41K34k27J58q4Q4K7j47p3L28J6j52J13R0l56o2P3M1P7j1L0n6J55l14
$$ plain form
6366 -88 181 -30 -189 -21 17 48 82 -88 104 207 -236 4 26 -7 -31 -94 -170 -31 187 22 -180 82 76 307
6390 307 -43 -40 -1 134 25 -146 10 171 227 37 -30 -45 -171 -79 104 129 -178 58 117 -80 -200 19 24 -80
6414 -80 -147 77 151 162 160 -126 84 260 133 66 -76 -114 -206 140 -117 -301 191 102 -67 -317 -30 9 -166 -134
6438 -134 122 185 97 -87 -206 -236 150 -55 39 -155 -168 -97 38 -27 -66 -31 -197 71 -212 16 161 181 -78
6461 -78 35 -63 -199 142 89 95 91 104 -171 -103 93 98 36 153 244 -42 -130 -82 92 15 14 100 32 -72 12 -55 36 363
6489 363 -116 3 -58 -123 95 132 99 -124 24 -128 -191 -117 216 121 94 -80 -89 31 2 181 -2 -49 -100 142
6513 142 -2 90 -116 298 159 72 -102 -118 83 -7 -35 173 -1 -30 -133 -157 103 83 184 94 -135 -106 92
6536 92 99 -142 92 -135 23 -61 23 50 -97 -170 158 174 22 135 225 -131 -193 -120 -79 -2 -13 17 -39 116 -198
6561a98R8Q3J10l43L51Pm8j29K59o5j89N6m0K6k41M38n4j65L25m95J86J16P8p6
6585I0j45K25j64Q8J6o2k26L40j27j21Q7J1kl5N0J63l56M6J92nq6O3P5j92J27
6610E2J81k03r2J85n6m8J93k25k64M36k1Q6l06j6J1N7J43k81N5r7J92m0n6J8K21
6635A25j61j44K15j97K44j71L00k03j22K55j03J58j15j99K42k44jO7K04j91O6
6656B5N8N8j00j43K0M08m06K43l6Jj70O7j02K8K72k53r6N5K70l21L2Q2j05K1O9
6681b3j08j3J74q8J77l05K76n1j19K49j35j8N8J16l14J42j31M4mK58n5l04K41
6704F7qp4j19M41k06k15M32k35j03j33R5K87j05o1j40j45J60P6K1j83J20q5J2
6727a01J42jp7M7J0R7k00M2Q0k8j14L1J96l52K64q5j41R1J17j91K7K59m9m1r0
$$ plain form
6561 -198 -100 -17 93 -250 101 108 60 -69 190 125 -64 -8 -48 -22 -263 175 121 -44 281 -214 -28 88 166 90
6585 90 -55 170 6 94 110 48 -178 162 35 -86 1 12 10 -25 25 188 -168 -122 70 65 -21 42 117 -75 52
6610 52 233 30 -62 123 67 19 212 -13 -277 159 138 224 -82 -98 -87 -30 113 -168 -113 -210 -18 -58 -114 -96 125
6635 125 -36 -180 35 -162 82 -89 211 8 -114 141 38 196 81 -118 124 -120 -121 -54 150 -41 25
6656 25 83 141 41 -102 -82 326 -80 163 127 128 -42 25 -77 -49 223 -30 -126 -71 199 -122 -90 -8 -113 -92 -23
6681 -23 -131 -144 30 -58 119 -186 90 39 -80 169 34 16 74 190 -124 18 -113 -69 -73 185 130 -174 67
6704 67 59 -15 -134 307 101 -114 318 83 -20 -153 -58 229 124 63 -77 -222 -62 14 35 -148 -28 -113 -101
6727 -101 41 40 -37 10 20 117 -83 -41 39 11 -103 -72 124 -228 36 -49 -190 -99 18 -173 -146 113 64 23 -67
6752f7J18m2k8Q9k53J16Q2n6P6j24N7j3j0m2K85j31K57m13l0K9oK71j39K5P1j00
6778B2L2j05J39k1j81J29J2l9pj3J04Q4j34q3r0J99q9l17K15K49r0K5M4P4k60
6803a01K84j61J45J91m34K08j0j97K8k9o3J48p1P4m7J07k1q5J95j31P4j64N1j13
6827a22P8O5k1m7J93l2j51J4m0o4j07J06k5L2J84O6k90K15j20rJ52jN8n2p3k4
6853a5L6k00K45L5j38J75j14j28K55j57j45L31j07o3R8O9j86k08J86o7K31l25
6875a92L18m13L7O3J64Q1j25R3K3L8J17j56K9q4n6K00N0k01r5K18J30k13N9K0
6899A05j27N5q9j44K43l2J7O9ol20M40k55L12k78J03P1j96O0q4P4nk6P8n3j34
6924a22J99p6j70L46k16m4P9M6J1k5lJ0j70K52j7k91qJ84J37r6q6o7M5q5K21j17
$$ plain form
6752 -67 51 9 -19 70 -183 -67 15 -41 35 -89 -32 -45 -55 -97 188 57 314 -99 -129 -100 -106 165 26 51 122 22
6778 22 54 -51 88 67 -114 15 27 -12 -19 -32 72 156 22 -61 -151 48 -41 -358 -143 106 16 41 85 159 -101
6803 -101 183 22 167 358 -76 132 122 -75 -47 -76 -139 9 -62 12 -35 72 51 -34 161 30 104 -60 -9 -122
6827 -122 -44 21 0 -47 146 114 -37 -23 -63 -127 -234 -128 -153 -121 63 129 -161 54 -66 -75 77 76 134 82 9 -15
6853 -15 21 -179 66 101 -37 138 24 -104 151 -6 -151 180 73 10 108 177 -9 -217 -31 -98 133 -192
6875 -192 126 -287 -250 -187 -23 58 -67 26 49 87 204 48 77 -7 -63 137 187 -14 -109 109 239 26 85 105
6899 105 -22 33 -56 -200 43 11 28 97 91 -229 211 -44 268 -10 93 164 -32 28 -56 18 13 -13 65 12 -122
6924 -122 77 1 -169 177 -39 -83 -4 42 53 28 25 35 -135 117 100 -191 -199 -15 122 26 -60 -127 -82 -167 54 -63
6950f3j78n5K00J43J9M6k8l28K42J48j20k11M26k16j39J85m1l7k4k93K83oL4J37
6974A24k57r9K17K57k58N0l7J63l05K46j54J0K64j16j2M1k25N6N4j82K7l9J88
6997A3j23J96j3N3l43K16Q5l08L06p9M6P5%m0k24K13j84n6Ll1J81Q9j47j11J50
7022c3N7K25k59O9j20j05Q5J75M2j27j80M09k41j03m4R6O3N2R9j78P7O3j35j65
7046a78J64J4J61j36J0q2j9j59L53j12j28L32l02N8l1k8K25j38PL7l51L37n1k76
7070b93L15K0k7Q0o8k19L04Q4k11q2K07p3L4j41J90k30J7N9j12J69k79N17n40
7093b79K66J21%r6J57l7k1q9L8n1r5P9j4k09K72Jk18L33J0k11j6K01j09M5q1n9
7119f2J73k84J34n7J47O1j19j86k8K03J30k48k0n4K71jr5K12k63J21O4R4l14L10
$$ plain form
6950 -63 -241 -296 -96 47 66 112 84 -244 -2 146 26 -185 241 25 -114 71 30 -7 -31 -324 -41 -47 -13 124
6974 124 -133 -232 -15 242 -16 34 -3 160 -145 101 -53 -43 221 105 93 134 -91 -35 19 -163 -136 -175 13
6997 13 -110 86 73 126 -217 -1 84 -224 82 3 49 124 124 84 -140 73 -111 -167 -164 -195 -14 75 -72 -183 -33
7022 -33 24 249 -10 59 -61 -166 -81 94 136 9 -171 238 -3 -106 -150 -54 9 61 160 -18 59 122 -13 -178
7046 -178 -14 0 161 25 35 -47 -66 -225 128 16 -112 220 -82 -24 -55 -83 142 4 11 48 -303 34 -17 -293
7070 -293 22 42 15 95 27 -192 112 196 -15 -97 110 37 71 -70 120 -110 -93 -34 -146 23 -256 261 -279
7093 -279 -13 108 108 12 169 132 111 22 60 9 -86 -7 -21 -230 42 43 -175 158 168 -43 -59 142 33 78 -3 -62
7119 -62 111 -173 -39 -96 51 112 -7 -193 -221 -18 112 -136 -156 -210 61 60 -35 177 -86 35 99 193 -121 189
7143A89k19l9O5k23K29J79p1j24k7J08k4n0n0j13M13l3j03k39L02j18J46k43M4
7166an8n8J48p4k54L17M1K64j96j66P9m3k5o1J39KPk33K51J5j45L28j98r9k2J32
7192I0j41M0j09K05j69Lm1K34jk48p5K17J95k69l1J0Q1P7k12R3J59nj2j99R5j07
7218a20J14J46k02J66k20J75M0L1l9l37L99j08m9r6j48J34N0J73o6k28K78j19
7240b6MJ14j4j13P5J72Kk41K58j50K8p7P2k55J55j6N8j60q8J97k46L55r8J14j40
7265b0n5K03p1J18o4N9Oo4o7n8m0K09j76q5K46j67J28j42J94l88L75J6m0k57L59
7290B19l94M1K10j31qr8J41K0L6m3n4R6k24L19j59J60j1j58k05K36r9O8O9j6J0
7315B5j38L4M6p0J23J50j10j34J61j8k32J18K77j96m6l4J9L13j67K09j76j89j76
$$ plain form
7143 189 -30 -69 -4 -227 2 181 110 -14 -41 67 43 -7 -57 -170 243 210 107 -132 170 52 198 -45 -1
7166 -1 -59 -117 31 -43 -297 20 61 325 129 -37 42 -1 -26 -87 52 54 61 -172 79 94 -51 277 79 -20 -42 90
7192 90 -51 -11 -120 85 -84 -81 -122 112 111 -137 -212 5 200 -69 -100 -90 -9 68 -144 -51 108 103 91 -108 -13 -120
7218 -120 -6 140 -62 104 -116 59 99 130 91 -246 153 45 -4 -100 -248 -114 -64 109 43 -185 93 -26
7240 -26 -22 92 78 -35 40 212 214 -27 231 81 109 32 104 -151 4 -12 46 -114 -202 -5 -251 104 6 120 -20
7265 -20 -75 128 57 175 111 170 176 112 45 -13 -53 156 -20 -105 141 -26 102 -40 154 -234 141 157 117 -140 219
7290 219 -175 -134 76 -55 -63 -161 -20 0 36 -7 -61 35 -189 130 -29 131 120 -38 -243 -7 -106 -38 31 15 25
7315 25 -113 -79 -33 -103 20 170 60 -74 87 69 -163 -45 232 36 -10 -44 -25 288 121 330 154 -35 -211
7338b11Q5N6K07J19j68q8K65j72oj77J69j59K5M2KK39k3j64K27j61k08J27Q5J27
7362B38k98O5j13L53j22k33l6m1L66m8n0Nk46J2M9J95J70k53M5J02K3k91j29r1
7386c28K40J63j3j66O1J32k10K43j58j13L35l00J71J29k26k1P1j18p5K94n1j82
7408a22K56J91k47Q2j73rL7j30O1j37L62j31j14J31K6J83j57P8jk38J29n2m5J90
7432A70j7j23r8Q4J07l62J69RJR6j88J76O9n0j48K06n3Q9j60P8n5N2qj25Q8m9
7458d2J87k66K22j24K3jP9R8k05n7j7J6R6Q9j07K1J76o7p3q1k2j4J89j11j05Q4
7484a2j6j1J50j38l4OpP8k47K32J0J2p7l1l%L59l03j47oK20Q6j02Oj73K04q2j22
7512a48L47p7k01K30j09j94J15J33k11K17j39j9K44k35J3K65k09j68J68l14R6
$$ plain form
7338 -211 -126 -70 137 256 88 0 265 93 87 -90 79 -80 -55 -13 -11 228 205 41 268 107 -101 26 111 238
7362 238 -60 5 -108 245 123 -110 -146 -187 179 131 81 86 -160 -148 -99 96 266 13 58 160 183 -108 -237 -328
7386 -328 -88 75 62 -104 -43 89 -121 122 -36 -149 186 -114 57 186 -40 -61 10 -108 -183 111 60 -122
7408 -122 134 325 78 160 -13 -22 15 -115 -54 -191 171 40 -74 57 83 266 109 187 186 -52 77 25 -20 170
7432 170 153 30 -68 16 123 -239 -70 -61 -60 36 -152 24 93 43 -105 101 48 137 -23 55 0 52 44 -81 7 -42
7458 -42 145 -121 101 -23 0 -1 78 176 -29 -86 -103 -87 9 98 -9 12 188 121 48 -33 -55 -69 120 9 -96 -12
7484 -12 -28 -39 111 -27 -61 -55 -62 16 -231 1 11 23 -54 -85 -88 -88 271 -32 -179 -185 35 121 19 25 -148 56 -26 -148
7512 -148 199 122 -79 151 42 -152 -37 96 -115 102 -37 -56 188 -47 -34 231 22 -146 22 -292 -196
7533a96L52j72P5p0J21j30j2N6J41m33J45O7r0J71j91K82j81q2J79k0m8j39J19
7556e6K3j3K03j96j05K56j27L8K17r8j9N4k94m5J76J20k19%P3J40j52J05r0P6
7580F7O6n2o3k4O7P0j50j04J00M3p4J14ko3n6J45l67J33L33r5k28J81n7n4R1J42
7606A63j46K9J7J1q7J8r3J12K04m81L67k73K7J32p2Kj56K47JJ12o0j50J20M8r9
7631gL44j22l72J75j39K1K76j31J48k61K1K43J51k97J2J04k86J01LM4j10J43K4
7654H5k51J56K68k85j11K00M0j27N4J0o3j5j4p8J69p1m8k2J05J51j50j48J24O2
7678D1P3n8n8j19M6j60K33L0m8M5j18R7k05N5L0J03l2p6L10j82o3J08p4R0j0j98
7704a40J61j03%L10k75Q4k09J41R1j34M4p8K06m6p1j41J81j61J17M7j10J04M5
$$ plain form
7533 -196 156 -16 59 -11 110 -20 -32 24 165 -268 -123 -56 -146 25 -166 116 -65 -147 32 12 -36 -175 -56
7556 -56 -33 -46 157 -39 -144 112 -15 23 240 142 123 177 -117 -162 14 134 -85 -85 -12 128 -24 81 -9 67
7580 67 133 81 18 -6 61 131 -19 -123 -23 20 -54 60 58 -5 -61 84 -283 -150 183 88 -140 41 -16 -70 21 163
7606 163 17 46 63 74 -13 5 -88 24 228 -253 114 -159 -132 0 -72 -70 -226 21 22 134 74 -76 44 92 -7
7631 -7 337 215 -157 18 -121 -100 176 45 193 -68 -47 196 347 50 62 166 -120 -19 -16 28 -82 61 85
7654 85 -166 -10 258 -27 -138 62 102 -25 29 39 -24 -39 -53 -131 38 -33 -81 -103 2 153 3 -145 -21 41
7678 41 114 56 -2 -121 -75 -235 -2 28 -20 25 -93 4 -201 -146 -116 -13 -45 -121 189 7 -56 52 -22 68 58 -140
7704 -140 21 -82 -82 228 -47 37 -172 -31 60 -74 -30 -108 98 52 -19 -160 21 -140 -23 24 -86 18 63
7727F3j13N2k9O1r5N1J18j17K7j10M2j62R4L3J52j29k7L8LR0L8j24rJ45r2P4r0
7754a6J69L2k66J19J2j62J78o1j17K93j80qR4L2k35JK72k18N5j63K8J10r7K25
7778I7J66l47K01l10J6P6K0O1k3j60L00l2j9J84l29J44mm7Q1k37J83L25n16N4
7802a16K02k4j29O0j6J30k78J51L0mK7N2j71m5pO9K21k69Q0O3k93L18q6J41j76
7827g0J26J9n9J67j36J5K0j6o1J00j51K85m10J18R0P0j46J41k35J90R9k15m7P8
7851b8J7M2l4l5Q9o8K31j60k9n5Q7q1j14k01L49l23L27J35j63M9K0Q7L1p6k9j35
7877f7j90K37N9mo5j23R0N8Q9Q7j91J56k01M5O4k39J41O3l7j44J26O7j6l16K85
7902b6K23k54P5p4RJ23m1J54l73J77r2J90j26N2K22m7k14l4J10P4J82k48Mr3j22
$$ plain form
7727 63 -50 2 -27 34 -61 -10 108 -9 18 -92 -50 -212 -118 -85 67 -62 -89 -51 -48 42 80 -44 -53 92 0 74 -16
7754 -16 153 185 -81 38 50 -112 66 5 -112 181 1 -7 87 119 -116 -115 157 -61 -6 -169 -141 -31 -128 97
7778 97 263 -84 117 -193 -177 -101 -81 -20 -43 -203 97 65 46 230 -99 45 41 -6 75 -162 21 346 -170 -116
7802 -116 86 62 -67 -7 -23 107 -171 -20 10 6 33 85 -86 -131 -138 -69 152 -117 -37 26 -267 51 -35 106 -70
7827 -70 56 75 16 183 47 62 82 66 5 105 -46 239 -171 -53 37 107 -39 102 -133 57 156 -59 -106 -28
7851 -28 -11 31 -3 -38 51 -17 214 54 25 -30 57 -24 -138 -339 10 -313 14 149 -14 35 55 142 173 97 68 -67
7877 -67 -257 -20 39 35 -30 -153 -63 -5 84 171 -20 136 -65 -20 44 -195 -54 9 -28 -172 -46 21 5 -311 -26
7902 -26 197 -57 18 -56 -47 76 35 189 -184 -7 -99 91 -35 17 239 192 -22 -56 54 128 310 62 66 -27 -149
7927a49j14L82m7PQ1k45P5j88J22K95m04K46n8j31J59Pj02J64k11K20r4J10j61
7950c6J25k01k2K00k33M5K4L22j74M7k4J3j31k04J30Q7J14j21J47J80l91L5J55
7973H7L8j42K4M0n9Q3k05K51j87K12j72O6j31l9J3J45R7l3J9N1j77n1J51Jk38
7998a56J16p8K63m9rj55j69J36J37r9R1P2l5Q8k26kJ39J05j05j39Q7Q5K58k69
8022H6l07K12M9K6j35J95r6N5k00J37O1R2j49P7j27j10K21j82k5Q4M0O6j37rl1
8047a07M8R9J7r7j69K28j18rK61k85K02m1o7J51k20K8J25M6q0j59K7N06k34k64
8071a12R0O4r6q7K16P1m7j74J42j01J54r1o4p5K20k09j39J58p7P5J06J17k61J75
8095E5k69K74k21K81r8r3P1K48l58K8K92l47J2J6nK04p6j5O4k20O4Q8M2l2l8J02
$$ plain form
7927 -149 -263 119 72 79 160 -85 -10 -198 -76 219 -185 61 3 -128 31 38 -64 100 -111 109 15 125 -36
7950 -36 89 -112 -134 66 -167 -122 -98 224 50 97 73 86 -45 -249 -119 -32 82 -39 108 288 -103 -68 87
7973 87 125 -17 7 47 -12 71 -134 117 -70 142 -30 36 -95 -134 -121 24 121 88 107 158 -19 -70 81 82 -156
7998 -156 -40 -118 145 96 87 -68 -237 -101 36 -63 28 100 65 153 -73 -75 64 169 64 -75 12 97 355 86
8022 86 -221 -9 40 66 -69 126 30 85 -115 22 83 175 26 103 -24 -134 87 -95 -120 -36 4 70 -67 -76 -107
8047 -107 -59 40 57 -40 -209 19 -99 -108 153 -132 70 29 -38 113 -107 -79 46 92 12 -147 -120 386 152 -112
8071 -112 -22 42 -54 -141 75 146 99 -75 67 -34 120 29 -35 -110 110 -99 -238 -80 -157 -82 24 141 -120 55
8095 55 -214 60 -161 120 22 -71 0 248 -110 -82 210 -137 -125 -109 -114 90 14 -1 63 -157 -93 -5 37 5 -33 69
8121F9J3J8j50J74O7j95n8K91j27l93N9K59L5j98J75j25J18l3P1j93R2j7K06k52
8145i4R4p7j0J70j03J2j9J57k67J85m4Q5j97j3K8o5K16J45j70k26M0K06j58J47
8169D2J82k11j09M13l27l9Rj87J68P4R9q6k4n2q7J45K00l21o3O1L7j13
$$ plain form
8121 69 82 100 -50 124 191 -4 -62 229 102 -291 -232 27 62 -136 39 -86 32 -1 70 -123 -31 -48 158 -94
8145 -94 0 -77 -87 83 -20 -8 -27 130 -137 48 4 89 -108 -121 -93 -158 58 203 33 -193 -153 53 -105 42
8169 42 224 13 -96 317 -10 -49 -40 -227 -59 15 114 28 4 -48 -135 10 210 -111 -174 -113 -76 -189
8191a89
$$ Imaginary data points
##PAGE= N=2
##DATA TABLE= (X++(I..I)), XYDATA
0@%%%%%%Mj2J6j6K3l1L2m0N6p2Q8j11J35j60J93k33K80l29L85m50N24o10P05q10
30d33R30j064J210j371J552j751J967k207K470k756L073l419L794m204M654n145
46b700N680o265O906p609Q383r236J0177j1225J2397j3711J5198j6903J8874k1181
60a1215K3928k7261L1411l6745M3888n4004O9540r6694J57629n37804J59630J060571
72G82874m86582o35713J0104M22935J2152o9378o8253m8659L07K24957O824k73792
84a22224j20907L31262K27668k73347l89584J79044M31056M777l55222j21073
94b08550J46473J33406K6935j5131j25105j04186J38423J82207j30352j82267
104a38147R5829J40769p0784q1106M6518K4390k9552N1816J0778j50443l3576
$$ plain form
0 0 0 0 0 0 0 0 4 -8 8 -8 15 -16 16 -24 32 -40 48 -63 72 -88 105 -128 152 -177 208 -242 282 -328 377 -433
30 -433 497 -567 643 -728 824 -927 1040 -1167 1303 -1453 1620 -1799 1995 -2209 2445 -2700
46 -2700 2980 -3285 3621 -3988 4395 -4841 5336 -5889 6508 -7203 7995 -8908 9966 -11215
60 -11215 12713 -14548 16863 -19882 24006 -29998 39542 -57152 100477 -437327 -277697 782874
72 782874 296292 -339421 -329317 93618 105770 36392 -31861 -80520 -80213 144744 151568 -122224
84 -122224 -243131 88131 315799 42452 -347132 -168088 262968 267745 -87477 -208550
94 -208550 -62077 71329 98264 83133 -41972 -146158 -7735 174472 44120 -138147
104 -138147 -42318 98451 27667 -53439 -6921 17469 -12083 39733 50511 -99932 -133508
115a33508K12488R1220j84927j45266R8132J52125j7823j03857n508L8252j5969
126a4641R952O3220k1261j15058N054J50790Q417j60284p920J48794O558j27433
138e3812k3728R4390M1269m7589k6778N295o728K2913L8760l1217n9047J6524
150b9748P0353J1427p0917l1892N3693K8599l2986j8843J6627J3134j1189q946
162a0688J3798k59j5674R021J3398j505J851q415j7644O617K4091K162k7427n570
176a6244L7233K826n1560j0222N4114K8678m6196n1737L1094O2828p540m4775
188a1501j4886J0636K4760J7865j6572k4074M715K0943m070k6402Q511L5534k969
201B2490l8378k1630K2874M8953J714n7549k5364L9122L8904n915l0738j1048
$$ plain form
115 -133508 78980 170200 -14727 -159993 -61861 90264 72441 -31416 -36924 1328 -14641
126 -14641 -4689 58531 37270 -77788 -72734 78056 86473 -73811 -81731 67063 73621 -53812
138 -53812 -77540 16850 58119 10530 -16248 -10953 -17681 5232 43992 12775 -46272 -29748
150 -29748 40605 52032 -18885 -50777 2916 31515 -1471 -20314 -3687 9447 -1742 -10688
162 -10688 3110 2851 -12823 -3802 9596 8091 9942 1527 -16117 -9500 14591 16753 -10674 -16244
176 -16244 20989 23815 -27745 -37967 16147 44825 -1371 -53108 -22014 40814 33274 -11501
188 -11501 -26387 -15751 9009 26874 10302 -13772 -9057 11886 7816 -18586 -10075 25459 22490
201 22490 -15888 -37518 -14644 34309 36023 -21526 -46890 -7768 31136 25221 -5517 -16565
213a6565J0975P026L111q31l271Q900j011k2704n645K0029K2390O10l6471k9787
227d3244K7933M9178J292m7879k4687L1884K3990j0436l760R94r895j629J962
240d297Q11J3346J0862j4038k9316m056L4814K1129k0127k7100q087K1379K8167
253B3487r767k3368L639N654m439M874J0605J589j1009j0705o14L687J7281J3588
267B4502k4682k5826J2601K0961O223q336j6681k407J3508Q734j320o172j356
280b51j002p740O077J2868k700j742k753j8739N16K8085R740k3059k2931R345
294a4286K3968M256j0161j1581p015J4415J2721r869l971O207l419o191j227N891
308b62J1551O05j3791j5356N221K7002L823k7857r672J2866J0729P847o061j6033
$$ plain form
213 -16565 -5590 1436 4547 3716 445 9345 8334 -14370 -20015 14 22404 23014 -13457 -43244
227 -43244 -15311 33867 35159 -12720 -37407 -5523 18467 8031 4271 5265 -4630 -6259 -4297
240 -4297 -3486 9860 20722 6684 -22632 -26688 8126 29255 9128 -17972 -26059 -4680 23487
253 23487 13720 -9648 -6009 -355 -4794 80 10685 12274 1265 -9440 -10054 -6367 10914 24502
267 24502 -180 -26006 -13405 7556 13779 5443 -11238 -13645 -137 8597 7277 1105 -251
280 -251 -1253 -8993 -2916 9952 7252 5510 2757 -15982 -15466 12619 22359 -700 -23631 -14286
294 -14286 9682 13938 3777 -7804 -14819 -404 12317 2448 -1523 4684 1265 -4926 -6153 -262
308 -262 11289 11894 -1897 -17253 -12032 14970 18793 -9064 -18736 -5870 4859 12706 6645 -9388
322i388p25J3582N188r263m456J2757R77j6518o82J0908O058R07j3649j2629J1982
337d951J7627j598j7369j0408J0758J4175J155o030r723l03J2704k407r571P128
351A187P416o798r131J572J1119L888q031r415n949J0707K0131o527k2233r06
365a2970J3522O749l166n469J817J475l150r22J132O390M744j3382j1135J1363
379c002J3528J398j0496j6703j793J9142J5547q328k0985L81J7156K15q454L794
393A400K435k364k527m509L122J2636L222j6392j7265R060K4908L230j5292j4924
407a3260n021J7064J9428r567j8862K923J1179j90n800L157N389m820o183k304
421f867K519J5767O342k2968j6477J2606J6753L800p497j1691l497Q973J1480
$$ plain form
322 -9388 -10113 3469 8657 -606 -5062 7695 8672 -7846 -8528 2380 8438 9345 -4304 -16933 -4951
337 -4951 12676 11078 -6291 -16699 -5941 8234 9389 3359 -6364 -6667 6037 3630 -5941 1187
351 1187 8603 1805 -7326 -5754 5365 9253 1222 -8193 -14142 -3435 16696 10169 -12064 -12970
365 -12970 552 7301 4135 -1334 483 1958 -1192 -2114 -982 5408 10152 -3230 -14365 -3002
379 -3002 10526 11924 1428 -15275 -17068 2074 17621 9293 -11692 -11311 5845 6060 -2394 1400
393 1400 3835 1471 -1056 -5565 -2443 10193 13415 -2977 -20242 -11182 13726 16956 1664 -13260
407 -13260 -18281 -1217 18211 8644 -10218 -7295 3884 3694 -2106 1051 6440 1620 -4563 -6867
421 -6867 -4348 11419 17761 -5207 -21684 -9078 7675 11475 3978 -7713 -11210 -2237 9243
434I243l542j0754M669M979j1075N74J4492K866q863j0439n893J0497J8539j13
448A5180k2956j2996J7466J5606q253p628L89j31N762K226p553J751Q424k745
462D542j1640k812J3170J1182m773j4529j4199Q030K8860J639l0674j0038K0086
475a156J3746n253j1456k820N011O031K252p726m914R454M991p307o726k135R994
490A986J4248j0425k4680J855K7503J0861k3517j9353J3455J8139Q57r243j0199
503h513L078J1204j490n452J403n41n72L930p60o244o80R970J524j7032k571K0320
519G574N756j4914j1067P030J4393j638j2491M797P762r500o867J1748J2548j2525
533B606j7158R291J4207m536m721m2o041j535Q670R419m127j4733q04J4538L981
$$ plain form
434 9243 5701 -5053 -384 4595 -6480 -5906 8586 11452 2589 -7850 -13743 -3246 15293 15180
448 15180 -7776 -20772 -3306 12300 4047 -3581 -3192 -3323 2439 4665 -2888 -1137 7287 4542
462 4542 -7098 -9910 3260 14442 9669 -4860 -19059 -11029 17831 19470 -11204 -21242 -1156
475 -1156 12590 7337 -4119 -6939 -1928 4103 6355 -1371 -6285 3169 8160 853 -5873 -8008 1986
490 1986 16234 5809 -18871 -17016 10487 21348 -2169 -21522 -8067 10072 10929 1686 -8513
503 -8513 -5435 5769 4279 -1173 230 -311 -883 3047 2287 -3957 -4637 5333 6857 -10175 -12746 7574
519 7574 13330 -1584 -12651 -5621 8772 7134 -5357 -560 7202 -2298 -9165 2583 15131 2606
533 2606 -14552 -5261 8946 4410 -311 -353 -6394 -7929 741 10160 6033 -8700 -9504 5034 9015
548I015j0427n840J0110R538j3983j4127J5109J7069p378j6775p771R531J7194
561A1265K878j6900j4914Q840J9928p17j3209k737J939M936N676p591o167J1918
575E145O201j5313j1593J3242J8775n368j9342p336Q772J6787L092j8204o591
588a1733J2409K838n021L623J934m058k546P95N70K751P733l585j6492L39J5421
603D978M508n443p661p454N546J3364P24j2064m329Q953L774o445J83M884j288
618B230j480l711l603R734R762r102j4534N45J1056P381k332r009q166N407J5174
633I352k643j3780K999Q940l907l108K252J402K088p58o982k722R078P421q172
648A460q800L406K882K366N180o428j0332O628R397j899l673P75j642l859K695
$$ plain form
548 9015 -1412 -7252 2858 12396 -1587 -15714 -605 16464 9086 -7689 -15460 -5929 11265
561 11265 14143 -2757 -17671 -8831 11097 10380 -2829 -5566 -3627 1309 6985 -606 -6773 5145
575 5145 11346 -3967 -15560 -2318 16457 11089 -8253 -15589 -6817 9970 13062 -5142 -11733
588 -11733 676 3514 -1507 2116 4050 -8 -2554 -1759 -1189 1562 9295 5710 -10782 -10443 4978
603 4978 9486 4043 -3618 -11072 -5526 7838 8562 -3502 -7831 1122 4896 -1549 -1366 3518 2230
618 2230 750 -2961 -6564 3170 12932 3830 -10704 -10159 897 8278 5946 -3063 -11229 -5822 9352
633 9352 6709 -7071 -4072 4868 961 -2147 105 1507 3595 2837 -4145 -6867 2211 9632 1460
648 1460 -7340 -3934 -1052 1314 6494 66 -10266 -3638 5759 3860 187 962 -680 -4539 -1844
663a844O763o89k675r40n721Q25R585k76p810m97J213L85L935J469n851l991P402
680A283M316q762L98J0066l688r458K343N329L771L93r473p038R056J2509n318
695E727j4540L38R322K401R25l100q569N596J0342p751q733Q066Q732m988r188
710e420K41O096M998Q18j0241r858J1531J3482o706j0952j641M365P887J697p870
725a573n007N823P278n046o586O458L993n738j603p94R97Q743J244j3244p508
740a2563R685J2170k623j0093k450K779M769M469n916n064O555J743o219J163
754a595N549J022m458n534j18N747O664j519j2247l183J0187M207k468j945m485
769d176L89O010J279l135j03J700k123n013L397Q650j116p063m322p06P617O590
$$ plain form
663 -1844 4919 4230 1555 615 -5106 -4281 5304 5028 -2782 -3279 -2066 -1681 2254 3723 -2128 -6119 1283
680 1283 5599 -3163 -2765 7301 3613 -5845 -3502 1827 5598 5991 -3482 -10520 -1464 11045 5727
695 5727 -8813 -8475 847 3248 4173 1073 -7496 -1900 8442 691 -8042 24 8756 3768 -5420
710 -5420 -5179 917 5915 6733 -3508 -13366 -1835 11647 4941 -6011 -7652 -3287 4600 6297 -1573
725 -1573 -6580 -757 6521 1475 -5111 1347 5340 -398 -2001 -2795 -1798 6945 8189 -5055 -12563
740 -12563 -2878 9292 6669 -3424 -5874 -3095 1674 6143 227 -4837 1718 3461 -2758 -1595
754 -1595 3954 4976 518 -5016 -5134 613 7277 5758 -6489 -9672 515 4722 2254 309 -4176
769 -4176 -3787 2223 3502 367 264 1964 -159 -5172 -1775 6875 5759 -1304 -5626 -6332 1285 7875
785G875n844p796J69N645L748j704k983m69L42J837l51j767N152J816q055m188
801f573N162O309J957o807p449J446P852M986n460p737K576N755Q4j305j715R60
817D1L378l534m979N014P066j503q138m288N370O075O04m798p174J262R540J098
833E034o342k382J767L210J163l375m50L979R81m727m005M736O877l015p069r45
849d563K985N176J023p471m254N591N411j200m925l70L076Q10q64j397m19M297
865B906J471p182j882O711L135l307n742j697N421N583j604p580l730P218N539
880E260m121l169J062J058J956r32l442K380M117k282n779r6P108K911n669n173
896d811r84M384P579j229r167j619O195L211j549l372L34K264k70j372m27K511
$$ plain form
785 7875 2031 -5765 -5596 49 3797 2093 -890 -1359 -1017 820 469 -1298 3854 5670 -2385 -6573
801 -6573 -1411 4898 6855 48 -7401 -5955 1897 6883 1423 -6314 -3738 2017 2101 796 -919 41
817 41 3419 -115 -5094 -80 6986 5483 -2655 -6943 -1573 4502 5106 308 -6866 -5604 3936 5034
833 5034 -1308 -3690 -1923 1287 2450 -925 -1375 2604 3585 -1142 -5147 -411 6466 3451 -3618 -4563
849 -4563 -1578 3598 4621 -2850 -7104 -1513 3898 2698 -2227 -2597 479 1289 425 -972 -1391 2906
865 2906 4377 -2805 -4687 2024 5159 1852 -3890 -5587 -166 5417 3813 -3767 -7497 -279 5260
880 5260 1139 -2030 -968 90 2046 1114 -2328 52 4169 1887 -3892 -3988 3120 6031 362 -4811
896 -4811 -5795 -1411 6168 4939 -4228 -5847 348 3559 2010 -1362 -1028 1236 966 -406 -833 1678
912A678L058m606o560L368O409J225l124n902j384N355M674j397n331j386N082
927A159P29k559J204J626r50j853k782K140O055N8o151m852K509P325J055n088
943c75l497J09L890M088l349l560K160K075p03k368R09M530J05o265k838L421
959a668O403R01p808m374M100N409Q45l707l946R57L506K066p60l762M39M472
975C073k067l888K116M396O53n885l883M182N214n04m328l903K109M882J69k170
991A66j707j151K221K888j343j304M79J163j380l275L039M970k919m668l68K401
1007g88L445m15m635r75K716K562p34k247N10J320j468L83O67K54K519j280n598
1024c764Q57N542J733m246m291R35M281K491j368n744j512O684K660m908j605
$$ plain form
912 1678 4736 130 -6430 -3062 3347 4572 1448 -4454 -5838 -483 4191 2794 -2537 -3923 1159
927 1159 1888 -671 533 2159 1209 -644 -3426 -1286 4769 4827 -1324 -6176 -3667 3658 4713 -375
943 -375 -3872 -3763 127 4215 866 -2694 -534 1541 838 -1530 -621 3909 4014 -2251 -5089 -1668
959 -1668 4735 5636 -2172 -6546 -2446 2963 3808 101 -3845 -2888 618 2684 1924 -1838 -1399 3073
975 3073 1006 -2882 -766 3630 4283 -1602 -5485 -1303 3911 3407 -921 -4824 -2715 2167 2336 166
991 166 -1541 -2692 -471 2417 1074 -230 249 1412 32 -3243 -204 4766 1847 -2821 -3189 -788
1007 -788 2657 2242 -2393 -3368 -652 1910 1176 -1071 -561 759 -709 -326 341 595 3114 1834 -3764
1024 -3764 -2907 2635 4368 122 -4169 -3234 1047 3538 2170 -3574 -5086 1598 4258 -650 -2255
1039b255K581J624l01l195p54L651K701k852n517J206P134Q24n988l363L86M391
1055B73N058l242o619Q01N602J089l827j746L644J380j360j730j512L050M104
1070D965m803o206L614N955O25m476l799K38L986L556k173n145J996M335j777
1085H91k099K166K24m86m14k195O63M425J153n891m288M373N219j786k963j489
1101b497J2L856J853m177j562L244R57k320l18K473J138j622k451j773J833N977
1117D623m46p758j168N187K089j615k191j006P70K935J123l144j063L380K57m165
1133b192N46L247J639r20m659k924N047N550l087o195L4M477J086q77o47j988
1149a863L27L299q02k666K138K160j968k286m6K546K486j631m410j756M875M204
$$ plain form
1039 -2255 326 1950 1649 -1546 -2300 1351 4052 1200 -4317 -3111 4023 4847 -1141 -4504 -4118 273
1055 273 5331 2089 -4530 -3729 1873 2962 -865 -2611 1033 2413 1053 -677 -2189 861 4965
1070 4965 162 -6044 -2430 3525 4150 -326 -4125 -3887 99 3655 1482 -3663 -1667 2668 891
1085 891 -1208 958 1182 696 282 -1913 -1250 3175 4328 -1563 -5851 -1478 3741 1955 -1008 -2497
1101 -2497 -2485 1371 3224 -953 -2515 729 1686 -634 -952 1521 2659 1037 -1414 -3187 -1354 4623
1117 4623 4177 -3581 -4749 438 2527 912 -1279 -2285 -1515 1420 2543 -601 -1664 1716 1973 -2192
1133 -2192 -1646 1601 3240 2320 -2339 -5263 -216 5334 2247 -3948 -3914 563 1649 772 125 -1863
1149 -1863 -1536 1763 961 -1705 433 2593 625 -1661 -1707 839 3325 1694 -2716 -4472 403 4607
1165D607l939m010J585J289J253J081k073j490K150R92k284q75L586J811l380
1180C03l013J171K443K087j176n451K82M740J120k572j755J28J481J572o17j900
1196a157K07L554q15m872J885M612j583k602j108K57K990J285k970l661J775M381
1212B178n54k628K11n6M9K726j581k748L329K454l519k393K594K458j183k308
1228i71q37O3L266K054m643l493M444K360j861j075l49M66J575M96k215n91L007
1245A696Q49m836j06M820K62k201j134k570O16N382O17n311j618L425K119j977
1261C3o00O80n89J594K27l038J499L851k481m298J261L414N26j385j788k147J721
1278a520M930j375n290R28L400r57J4J070j370l29J554j282j610K384L687l458
$$ plain form
1165 4607 668 -3342 -1757 -468 785 1866 -207 -1697 453 1445 -839 -1714 1872 3683 303
1180 303 -2710 -1539 904 2991 1815 -3636 -3354 1386 2506 -66 -1821 -1693 -212 1360 743 -1157
1196 -1157 -950 2604 1789 -3083 -1198 3414 1831 -771 -1879 -1622 1368 2653 -317 -3978 -2203 2178
1212 2178 1624 -1004 -793 -849 -800 1926 345 -2403 926 3380 -139 -2532 62 2520 1337 -971
1228 -971 -1808 -1745 1521 3575 -1068 -4561 -117 2243 382 -693 -1042 -576 999 1495 -720 -1311 1696
1245 1696 2545 -2291 -2397 2423 2685 484 -650 -3220 -2604 2778 3395 -1916 -3534 -109 2010 33
1261 33 -567 113 -476 1118 1345 -1693 -194 3657 1176 -3122 -1861 1553 2079 694 -1094 -3241 -1520
1278 -1520 3410 2035 -3255 -2327 1073 116 130 1200 -170 -499 1055 -227 -1837 547 4234 776
1294G76m819K153L518K9m74k811j979L659K630k599j938J609J208j396K3J515
1310A104o69K99Q76l186j375N108J789m647k374J966K195P14j236k574n79L038
1326D49K154l239q12K626m41j898Q72M68O70J939k066l841J130M650K5m113r69
1343b396J931P04Q05k49k877J26L488o01k239M15K179j78j465q73Q84J848J047
1360B549k865l100K790L814k065l225L18P63J734J000j989j691J470J913j059
1375C57j941J760J872j364r61n08K7K761J18l683j345L067K221j316k815j43J377
1392e16J408K31j843r88K870M25k327J31J493L79n15j395q79J973K003j106l841
1409b497n41L594J261j421j263q41R05K126p82j961J021J551m94j338J25J619
$$ plain form
1294 776 -4043 -1890 1628 1657 1183 -1628 -3607 52 2682 83 -1855 -246 962 -434 -411 1104
1310 1104 435 734 1610 -1576 -2951 2157 3946 -701 -3075 -1109 1086 1800 564 -2010 -2589 449
1326 449 2603 -636 -1448 1178 737 -1161 -289 179 849 2788 722 -3119 -1989 2661 2686 -1427 -2396
1343 -2396 -465 239 1044 795 -2082 -1956 1532 931 -1308 -893 1286 1108 -357 -1230 -346 1502 2549
1360 2549 -316 -3416 -626 3188 1123 -2102 -1784 -1021 713 1713 -276 -1967 -497 1416 357
1375 357 -1584 176 2048 684 -277 -785 -758 2003 2121 -1562 -2907 160 2381 1065 -1750 -1893 -516
1392 -516 892 1123 -720 -1708 1162 1587 -740 -609 884 1263 748 -647 -1526 447 2450 1344 -2497
1409 -2497 -3038 556 1817 396 -867 -1708 -803 1323 541 -1420 -399 1152 658 -680 -555 1064
1425A064N04j096j880o65K678K737l045l039J300K059P09j254j249K66J235P97
1441A121p23j435J193J418j715j011J199R30Q80j375k553jL340J266k544k546
1457b556J584J924j84p22j023q0J670J61j738Q16J741o41j715q33J318K069N5
1474A846j716k537P73L223M26l005p99J025J092P20j221l18P43L42o78j192J115
1491a61K293p94k521l69J403J782J63k779j613K203J791l42j792o38J034N61k06
1508A5j28j82J104L52j973q60K290J253m38k439j182K006K270q37k646q92K068
1525b19J829j307j200L22O96L50n13q59J271R71m72j677l73J726J398j071k304
1542a432k58J572J890r18k584J62J741M74o12r23K99J251%r44l95Q19J337r75
$$ plain form
1425 1064 1568 472 -1408 -2073 605 3342 297 -2742 -1442 617 1326 72 -1177 -911 324 1121
1441 1121 398 -1037 156 1574 -141 -1152 47 977 1857 482 -2071 -2072 1268 2534 -10 -2556
1457 -2556 -972 952 768 46 -977 -1057 613 774 -964 -148 1593 952 -763 -1596 -278 1791 1846
1474 1846 130 -2407 -1634 1589 2015 -990 -1789 -764 328 1048 -173 -491 252 594 -84 -1276 -161
1491 -161 2132 1338 -1183 -1552 -149 1633 1796 -983 -2596 -393 1398 1056 -736 -1374 -340 221 15
1508 15 -113 -295 809 1161 -812 -1672 618 1871 1433 -1006 -2188 -182 2088 1251 -1395 -2287 -219
1525 -219 1610 303 -897 -575 121 471 -42 -901 370 1341 869 -808 -1181 545 1943 872 -1432
1542 -1432 -1690 -118 1772 854 -1730 -1568 173 647 35 -888 -589 662 662 -282 -677 142 1479 504
1560E04k044L68K226O29j430k118J76K181P87j433j037L41J276K87j166lM67N95
1578F06n7j010J4J515L73j731j196N41K296M96k400j307J132J452K62j520n99
1595a133J061P90j18j051p3J343Q6j266l14P44J126K13j968j342J151K370j55
1612A464k316j064J742J087l47j055p39Q67J386p61j649J202J621p24j578k14
1628a078J447J080n28j548j427J356K525p56k771K56J092R29l2o86m86O74O74
1645G21q75j176J814J736j601k161N95J027J376j47k272j328K245J620j123j875
1661a424Q22Q79k65J28L82p02R20J7j581k56K295O84j458j416j26J228J057j45
1679A039k200q35K513R06k182p8J073l5m57J63RO18P70m93j870l4K135K97j726
$$ plain form
1560 504 -1540 -1172 1054 1683 253 -1865 -1689 492 1279 -154 -1191 -850 426 713 -453 -456 11 606
1578 606 549 -461 -447 1068 1441 -290 -1486 -945 1351 1847 -553 -1860 -728 724 986 -534 -1133
1595 -1133 -72 718 600 -451 -524 819 905 -361 -675 69 1195 1408 -560 -1902 -751 1619 1464
1612 1464 -852 -1916 -174 913 566 -489 -1228 -361 1025 264 -1385 -183 1438 714 -864 -1078
1628 -1078 369 1449 921 -627 -2054 -698 1827 1071 -1700 -1444 -352 577 545 -141 -627 47 721
1645 721 -154 -1330 484 2220 619 -1542 -947 80 1456 1309 -963 -2291 -46 1574 451 -1424
1661 -1424 -602 277 12 140 522 -180 740 757 -824 -1080 1215 1899 441 -975 -1101 127 1184 1039
1679 1039 -1161 -1996 517 1423 -759 -837 236 201 -256 -93 -84 534 1304 811 -1059 -1093 1042 1339 -387
1698c87m31N2O97J466r08k039O33J665j61j519L12J388j55o87k29j36Q80J378
1716A819j712j834J790J763r21j667o21P98R82M70j063j324J353R98j164m83R82
1733A66n7J37K48q97l06K014K81j995j539J834J842r24j378n65L73J525K92k021
1751i70l84J830N68j217j04N05L58j83l53p07N27J920l22k537k61J474P59o51
1769B52m24j116O23J631j06k108K70J754l26j231P18L68J65M25j205r86J723J461
1787A888j685j567O90J276j80k56n94p59Q20J616r64j309J214N24j150j4P67L74
1805F91L02j05j836l13K014J137k002j377J228O53N6j9q58o27J680j8j325K8J673
1824I82k44j118J28M61O3N38j05k065K79K389q8j909l69N58N46N20k58j142K74
$$ plain form
1698 -387 -818 -766 -69 1397 489 -1550 -917 748 587 -932 -620 768 613 -74 -303 -439 441 1819
1716 1819 107 -1727 63 1826 905 -762 -1383 -585 397 867 -196 -1520 -167 831 -333 -816 166
1733 166 109 246 494 -403 -709 1305 1586 -409 -1948 -114 1728 804 -574 -1139 -766 759 1051 -970
1751 -970 -1354 476 1044 -173 -277 228 586 403 50 -657 -130 1790 1468 -1069 -1330 144 903 252
1769 252 -172 -1288 -665 966 860 -1248 -978 776 450 -781 -63 305 470 895 -310 -1296 427 1888
1787 1888 203 -1364 -674 602 422 166 -428 -1187 -367 1249 285 -1024 190 714 -436 -450 317 691
1805 691 993 888 -948 -1261 753 1890 -112 -1489 -261 392 448 429 -429 -1056 624 606 -719 -691 982
1824 982 738 -380 -252 209 272 810 705 -1360 -1081 1308 1220 -689 -1058 -500 46 566 308 -834 -560
1843e60J235m49j644J532J505j093j180N41q5N40J111j168j946Q32K117k49j891
1860h52J26M60j16R17n03j163J306J102j549o32R76R53o20o37r2m10J493P33k056
1879e64j694K279J066j102o34M02L5K34J80l75k82J217N10j659m84J561J59n56
1897B93l81n37j11K000k71j979m56J811N25j586J05O12l42R06j63j147L92J655
1915A326q74j262O88R30j43p27j66p18O02J478o12j672O23J337n78o24Rp0O45
1934A92L25m20j003J110J275j438j089R84Q98m71n6p64o74J573O76j411r34R39
1952b88P64l48l85J13Q6J39O42j159k44J621M17j725n31P31Q23K99r71j130K33
1971i13J532K01j522o43J618nn52M12k32Q2O95n04j159Q53J289k34j433l30Q51
$$ plain form
1843 -560 675 226 -1418 114 1619 526 -654 -113 -198 342 1453 285 -1661 -829 1288 1039 -852
1860 -852 -726 -266 -382 535 32 -1131 175 1277 -272 -904 72 1025 405 -232 -324 -734 759 1492 -564
1879 -564 -2258 21 1087 -15 -649 -247 -212 22 202 -173 -455 762 1272 -387 -871 690 849 293
1897 293 -88 -625 -736 1264 993 -986 -1442 369 894 -692 -587 25 -317 589 426 -721 -329 1326
1915 1326 452 -810 -122 808 665 -62 -228 -946 -344 1134 522 -1150 -527 810 232 -392 -383 -453 192
1934 192 517 97 -906 204 1479 41 -1048 -64 834 363 307 -457 -1131 442 1118 -293 -1227 -288
1952 -288 476 128 -257 -144 -58 81 723 -436 -680 941 1358 -367 -898 -167 656 955 -16 -1146 -913
1971 -913 619 820 -702 -1345 273 268 -284 128 -104 -22 673 169 -990 -137 1152 918 -515 -845 6
1990FN71j42l56j340N57J559r4j460K77N66M7l94Q1K59N43P4r30p58R84J346q16
2011E80j156P1L05N51K41q00n62M94Q50o78n89P79L50k11j27l04L57O41J14j372
2031d66l05J004Q40p16r33j62O47O12L9j006k54J061j55r95M31P36p0J88p16j06
2051c26N86O78p01q95q1J182L88q05n41j46N07N98l87r66P42Q26l45r70M10Q88
2071F42j36m31m64j61R67O59r86r05N79P37l27k96m69K02O41J90r17l81P85P63
2091F92o45m07L84N03J54o16p86L28J002M34r50q00O13N43j39n46l62L61N87j73
2111A77n52J9N66J14m99j66N58L99k70k90n46J16R88K79j122p96Q62L23j2m74
2131c26m71P65K56k81k55j8R44k59r01J84P97J83l97o29k08P67L19J08p52n08
$$ plain form
1990 6 577 435 79 -1261 -704 855 761 -699 -422 144 191 -203 -122 137 680 754 -176 -934 50 1396 580
2011 580 -576 -505 -200 351 592 -208 -770 -276 574 -104 -693 86 436 225 98 -206 151 792 906 -466
2031 -466 -771 233 1073 357 -576 -738 -91 521 560 -446 -700 361 206 -789 -358 378 308 496 -220 -326
2051 -326 260 938 237 -658 -739 443 831 26 -515 -661 -154 444 57 -909 -167 659 314 -656 -246 642
2071 642 506 75 -389 -550 417 1076 90 -815 -236 501 174 -122 -591 -389 252 442 -475 -856 -71 692
2091 692 47 -360 24 527 681 65 -721 -393 609 1043 93 -707 -94 449 310 -236 -598 -237 350 177
2111 177 -375 -356 210 324 -175 -341 217 616 346 56 -490 -374 614 893 -229 -1025 -163 160 148 -326
2131 -326 -797 -32 224 -57 -312 -330 614 355 -546 -362 435 618 221 -408 -616 151 470 578 -174 -682
2151f82N15N21k57m67R0L76K0k56j84M72L51Q9j004k15R03O65p73o47j7O74N84
2172G58o54q04J26O42K75l00l61O29J52n19j2l04L89J020o39r84R7J176J70j039
2192a82l30J59L93L36k47n01q7Q32k46n70K64L62L58m07m73K15N10L22n96o91
2212e79K18Q87k1l85o98K7M75N42l75n79K94P54n01o13O93M59l05j30o75R6J194
2233G78Rj066l16N76M69j51n41k32Q0L32L04p23jP46N9o70r8N09K25l5l76k75
2255c97J08R88j8q64l42N88P2k04j02j87P7P67l34p17M00O62k39q48K66O94j8
2276C52j25k77p21O11Q55k19j142K62M85l3j07l58j77N23N47m69n47N92P10p37
2296B5o53N87K85qK32o41l16P61M20q65n29L35O26k84P6j47j31L94L38r28O2R65
$$ plain form
2151 -682 -167 354 97 -370 -280 96 116 -140 -324 148 499 588 -416 -631 272 937 164 -483 -500 174 758
2172 758 104 -700 -574 68 343 43 -318 311 463 -56 -68 -372 17 1037 398 -586 -489 687 857 -182
2192 -182 -512 -353 40 376 129 -372 -459 373 127 -443 -179 183 541 134 -339 -124 386 708 112 -579
2212 -579 -361 526 505 120 -578 -551 -76 466 91 -488 -194 560 59 -554 139 598 293 163 -512 -416 778
2233 778 787 -279 -595 -19 450 299 -242 -474 -394 -62 242 -481 -482 264 323 -347 -445 64 289 254 -122 -397
2255 -397 -289 699 681 -183 -525 63 135 -69 -171 -358 -281 486 152 -565 -165 497 258 -590 -324 370 352
2276 352 227 -50 -771 -160 695 476 -666 -404 81 48 -59 -417 -594 -71 476 7 -540 52 762 25
2296 25 -628 -41 244 236 468 -173 -489 272 692 -173 -702 -367 259 -25 51 -96 -227 167 505 -423 -361 604
2318F04m8n69m61N08K19K5m5p57k87J391R0r84j63L19QJ50J68l38k4N43j70q66
2340f87K68J151k07q19J0M03L2M55o8j241J31J205l28o22P3K26n9M5K6j42J17
2361c1P86p09o80P11N93p75q0j99K00M64N3l80o20M69N56n13k22M03J18j65K07
2382A86l12n52J050M21r38j96O82M57r57n3j71k5P46K10j067nO38J24m76jM27
2403A88j39R6Q5n68O1R02J01j253L05P38l33p9l21k03Q0O53k00p03K68O58l87
2424e1k57J80L26l79L42k09l93O93N57p39p29N41M73r1k92k07k43J84Q34n76p02
2445g38N66N35m93N5Q6J46L6J20n40l10P71L39p65l18O74O7j98m0k61l51O61M89
2467E31p84R5L95o3k75K0M26k02L17j73r08K45R48j78p39J72J36J22q8J75m25
$$ plain form
2318 604 556 -13 -474 34 253 278 233 -524 -811 580 670 -314 -477 -158 -150 0 168 -170 -194 349 179 -687
2340 -687 -419 732 525 -294 -284 119 151 606 538 -703 -572 633 305 -317 -244 -18 -77 -32 -6 -148 -31
2361 -31 755 46 -634 77 670 -105 -185 -384 -184 280 333 -47 -667 -198 358 -155 -377 26 144 -21 186
2382 186 -126 -678 372 793 -145 -341 341 798 -159 -212 -383 -408 338 548 -519 -524 114 238 -238 -239 188
2403 188 49 145 230 -338 -277 625 726 -527 -222 516 183 104 -217 -420 -340 313 113 -590 -322 336 -51
2424 -51 -308 -128 198 -181 161 -48 -441 252 809 70 -659 -118 355 264 -28 -235 -478 -294 540 -36 -738
2445 -738 -172 363 -130 -75 11 157 193 313 -227 -537 234 573 -192 -510 164 231 33 -7 -268 -619 42 531
2467 531 -253 -158 237 174 -101 -81 345 143 460 287 -621 -376 572 394 -345 -173 -37 85 -3 172 -253
2488b53j96N88P8p34K54O69m71l23L40L3M00K9l50n54N39N42l64p81M51J38R0
2509A25K80l54m76L00M63m86k26N86J54k60l45M9K83L25J2n54n35Q04K68o13k14
2530d14L58M8j17L47l44j68M08J22l97j0N25j68j45K8l31J80O31k39r29J76P31
2551B92kl41q7J12n4K12n6m71M35M03k61o13M07L76r7r0k33k46L58M41j77o92
2573c84J18M59r6m14K33R8o8L02m94o8L87L68n70m50M67L50n6l86k9m9K40L93
2595C51m86j59J93K26q2k04J98r9O8K05k76j77N38K80p54j01K79L35j73n3l34
2616b25pM19L7m28j71M48j10k00J17N0J10L14l01l52J51M51p9m34j12N74k87M77
2638D42l74n59M63M62k76l41k07N95m4j41k25L42K0J09j46n95O93K57k07n72K18
$$ plain form
2488 -253 -449 139 217 -517 -263 406 -65 -388 -48 -15 385 414 64 -490 49 591 227 -554 -103 35 125
2509 125 405 51 -425 -125 338 -148 -374 212 366 106 -239 -190 93 418 430 -124 -659 145 413 -200 -414
2530 -414 -56 -8 -125 222 -122 -290 118 240 -157 -167 358 190 45 73 -258 -78 553 314 -615 -439 292
2551 292 290 -51 -138 -26 -80 132 76 -395 40 443 182 -431 -24 352 255 165 -68 -314 44 485 308 -384
2573 -384 -266 193 97 -317 -84 14 -54 248 -246 -314 73 441 -129 -579 -112 238 182 -204 -233 -282 -42 351
2595 351 -135 -294 -101 125 43 -161 37 -62 6 211 -65 -242 296 576 -178 -279 0 335 162 109 -225
2616 -225 -232 187 224 -204 -375 73 -37 -237 -120 -70 40 354 53 -299 -148 303 224 -210 -322 252 -35 442
2638 442 68 -491 -28 434 158 -183 -390 205 161 20 -205 137 157 266 120 -475 218 475 268 -304 -86
2659h6J68K19L5n13O1L4K70j35j82j0K62Q5o6m54L90J81l5k09l50M33J90o8n01
2682b81K52J91K2L2j85l04L96k7k83k6L9J86K63m63j81N81K02m30k97M21J7N0
2704A75k26j93N7L64L11n98j28K55J25o1j99q6K44J00j56j54J21J8M39o40k0L51
2726I9J49r9j31k09K9K92m4j73j0M3J59j61k0l03M05K66n75p4L60M10q0l55j89
2749b11K85J91L5l28p4N9Nj0j06J76r3J86j43n2N5K93j14k56r0R3L55J10n51K8
2773a57K99j31R7n72R2N68j61j80r1J59J24K35l81j18K54K31j82k20J12J30J16
2794B24n0l11j4J07K08k11j13M5O4K08l22n0K74k2Q2l46J46L19N6l05r5J63j08
2817e1K38k82k55J37J92K29m87K25J05j20Q8J23j40q6J84O8l75K69M02l36k96
$$ plain form
2659 -86 82 301 336 -177 -116 -82 188 53 -129 -139 123 208 142 -312 78 259 224 15 -335 98 288 220 -281
2682 -281 -29 162 184 216 31 -273 123 96 -187 -213 -174 12 275 -188 -369 212 414 -16 -313 108 125 175
2704 175 -51 -244 -187 177 488 -110 -238 17 142 81 -118 -204 40 140 -16 -170 -49 -31 408 -232 -252 99
2726 99 248 149 18 -191 -162 130 86 -87 -97 -54 105 -56 -76 -379 26 292 -283 -357 3 413 333 -22 -211
2749 -211 74 265 300 -28 -102 -43 -38 -48 -154 22 -71 115 -28 -80 -25 268 154 -102 -192 -99 256 366 -185 -157
2773 -157 142 11 108 -464 -372 196 35 -145 -236 -77 47 282 -99 -217 37 268 86 -134 -22 108 224
2794 224 174 -137 -151 -44 164 -47 -160 -115 -51 157 -165 -215 59 37 119 -227 -81 238 294 -11 -106 57 -51
2817 -51 187 -95 -350 -213 -21 208 -279 -54 51 -69 19 142 2 -84 100 168 -207 62 464 128 -168
2838a68N2J72OJ13k63k24K51K66J5o69M70M9j00K9j32Q9K44k48J86m19K76L91
2860C86l59o6k1P1J51L33l96m76K86K67l74r4L84R2r1m4j86M7L41K99o17j11M58
2883B80l1j3k29j46J11q1K83j31k42K86q2j82K7J15J14k20N02l97j09M72M3n25
2905a55l5L86J6k68J02o5N9Lj43L8j82K73j86j28K49J30j4lK2k41Q4K55r6k87
2929a86N0Q5l3Q8p4j36J93M0J4l39L12L2k88n3K85L05k07J2o6r2J21K40j61n22
2953c80M92j51Q5j83K31pj14L04l97J04O1J30l07N6Q2K1J21k15j55L9M25J04o52
2976c06K51J92k90L3J08j05J08L9q2Q1j94J51J3j7J15k10K46P1q5m18L10L55l46
2999B0l80J95J85l7r7M1k49L05K58n07K12L99j2n15k2K27pK05k37j24J46k3J03
$$ plain form
2838 -168 -116 56 62 175 -88 -312 -61 205 220 -449 21 70 -30 -1 -133 -44 200 -48 138 -281 -5 386
2860 386 27 -39 -60 11 162 495 99 -377 -91 176 -198 -292 92 184 93 49 -137 -90 251 550 -67 -178 280
2883 280 249 236 7 -139 -28 -109 174 43 -199 87 5 -177 -150 -35 79 -141 361 -36 -145 327 370 -155
2905 -155 -190 196 212 -56 46 -19 40 43 -100 -62 -244 29 -157 -285 -36 94 80 77 99 -142 -58 197 101 -186
2929 -186 -136 -51 -84 4 -70 -206 -13 27 41 -298 14 46 -242 -295 -10 295 88 100 34 -58 63 303 142 -380
2953 -380 112 -39 46 -137 94 87 -27 277 -120 -16 45 175 -132 -76 6 27 148 -67 -222 -183 242 346 -306
2976 -306 -55 137 -153 -120 -12 -117 -9 30 -52 29 -165 -14 -1 -18 97 -113 133 204 119 -299 11 366 20
2999 20 -360 -165 20 -17 -114 -73 -322 -17 241 -266 -54 345 333 -182 -204 23 16 221 -16 -140 6 -17 86
3022H6p2o8L30l85j90M63m9k40L30p3m65K44M35r1j90o6m9nM52k06l65J56L3L
3046A8l58J38K34n3n0P7r0j35L82J8j80o9K10l3PJ1q2j27L17j81l0l1K22k99j84
3071b68M82k82Q4j04J55k59L03J52k07j97K9m4L07m8l41J40k15O29l70l80O33
3092A99j39m1r8P9j82R5N2n7J22J80k4m98J83K48k87N5L4J9j04L61r5j54j33J83
3116bk5k73K86M8O1J19k41k63K74K33j66k65m7L62m7J96l03j1J41MM2l03M9M36
3140C05n12J82J04n7n3K98l10j65K86j75J80p8p3Q1Q3l8j4p0o6N9L4l94M26j44
3164a11J76o8k20M60j55j06n0n1M45j91k40Q5j1J94j67O5j68J2k7J99J0j08J08
3187H1L4k20P3n6M0L8j00o4J04J46L9k67L1l5J29J75k11l8j5L39k90m2q0K04j25
$$ plain form
3022 86 14 -54 276 -109 -299 164 115 -125 205 132 -333 -89 346 255 65 -1 -50 -55 397 191 -174 -18 15 18
3046 18 -340 -202 32 -21 -71 6 -84 -219 163 181 1 -68 142 109 116 127 45 -82 235 54 24 -7 215 -84 -268
3071 -268 214 -68 16 -88 67 -192 111 263 56 -141 -112 -156 151 103 -238 -98 -313 316 -54 -434 199
3092 199 60 19 -79 0 -182 -87 -35 -92 30 210 186 -312 -129 119 -168 -113 -79 -60 -164 197 102 -52 -185 -2
3116 -2 -27 -300 -14 34 95 214 -27 -290 -16 217 51 -214 -261 101 54 250 -53 -64 77 81 123 -180 -131 305
3140 305 -207 -25 79 22 -31 267 -43 -208 78 -97 83 5 -68 13 96 58 44 -26 -92 -33 1 -393 33 -111
3164 -111 65 -3 -223 237 82 -24 -74 -125 320 129 -111 -26 -37 157 -10 55 -113 -101 -128 71 81 -27 81
3187 81 115 -105 -32 -88 -48 -10 -110 -174 -70 76 115 -152 -121 -156 -27 148 -63 -101 -116 223 -67 -109 -189 15 -110
3212a10M2j5R5J76Kj74k25K54r6J64j09L7j46L56l72P7Q7j0J22k27k7L64j20j72
3236b7j73PL60j31l3O8j49J04n5M1m9P0K7p9j42m7L54l9M1j80L9M4K09l88J4j45
3262b59M43l5l76K60j43K24j83j29J41P7q5L71l84r9L22m07N0J56j91J78k7J42
3284D6p8j10J97p4K02l69K66J22j87J99k83q2J14J27k07j30J30L26j82P9rk07
3306a10P3J51k76J87L8L6j46j05L71k68k07J36nJ58Q3R2k12j48J53O2O3j88P3
3329A1O8j52K1n5K21j07j51L02J0j26J23k14K48j2L8j47k5j18L9J59j53j38J64
3352Fn9Q8O7j54O8R0l70L45k49J37R2N4M9l87K48J26l03RJ49P0Q3n5j49K8K84
3377B67l29Nj79K58J10k66K38j99j9J23O4r8J75j13p7j87L10j46J15K41k31oK7
$$ plain form
3212 -110 -68 -83 12 188 190 16 -209 45 -51 113 4 41 -105 251 -121 -44 43 33 155 -72 -99 265 145 -27
3236 -27 -200 -193 167 36 3 71 -78 26 -29 12 -37 33 60 -19 -161 -208 146 107 148 -32 7 51 260 -128 -114 -259
3262 -259 184 149 -227 33 -110 114 -69 -198 -57 20 -65 306 -78 -177 145 -262 -212 -56 -247 -69 -96 46
3284 46 -32 -142 55 -19 183 -186 80 202 15 214 -69 -151 -37 90 -117 -247 -117 209 27 106 97 -110
3306 -110 -37 114 -162 25 63 99 -47 -152 219 -49 -256 -120 -125 33 116 208 -4 -152 1 63 126 -62 11
3329 11 79 -73 -52 -107 114 7 -144 158 168 42 165 -49 199 187 225 78 53 -65 -26 133 -20 -158 6
3352 6 -53 35 102 -52 16 106 -264 81 -168 -31 61 115 164 -223 25 151 -152 -143 6 76 159 104 -45 -17 267
3377 267 -62 -57 -236 22 132 -134 104 -95 -114 9 73 -25 150 37 -40 -227 83 -63 52 293 62 56 83
3400H3L8j48l9l7r0L06K60m92RQ5J55n2k97J08J06K3j41Q9j23K60J98m30J59j51
3424a21L61j17n5k44M2J33j71K09Oj32J38j05J32J41R6k83k99K50L3K01j17j2
3446H6k10K11Q8j41j10M9K26k03J39k49j12K58J2R3j31Qp8J18J62j36l11j2M60
3469B17j21k37J23J3k9j94L0P7J58k3J8n3P1j19J17o8MJ35R0m93K71N6J4J0o1
3494FL9o2q9J55q8j30K67l2l3M7J2j25N1P9J30k64pJ77k8j49J26k16j67M69J7
3519A85k53J5j23R7kN2O4k79R4L15k2j36j17J48N5k01L6K3J09n9j3J42k82R2k83
3544c43M36j1m9RL7q2j63N00l78N6j37J86j11J28Q2j87j27L99j5k91j17J97l7
3567a8r8O7K19j5o5%k34J08K11j43Q6j34L2l48L68j63r9K21L7J06k91K56K1N8
$$ plain form
3400 83 121 -27 -66 -103 -193 113 373 -119 -110 -25 130 78 -219 -111 -5 18 -123 -34 -157 103 301 -129 30 -121
3424 -121 240 123 68 -176 -134 -1 -172 37 43 -89 49 -56 76 217 313 30 -269 -19 14 215 98 86
3446 86 -124 87 175 34 -76 -27 199 -4 135 -114 -226 32 44 137 6 14 -64 54 216 80 -231 -243 217
3469 217 96 -141 -18 -5 -34 -228 -198 -121 37 14 32 -21 50 -69 48 -20 -16 119 209 -284 -13 43 57 67 6
3494 6 45 -17 -106 49 -39 -169 98 66 33 80 92 -33 18 97 227 -37 -44 133 105 -44 82 -134 -301 168 185
3519 185 -68 -53 -176 -79 -81 -29 35 -244 -150 165 143 7 -110 38 93 -108 -72 -49 60 1 -12 130 -152 -60 -343
3544 -343 93 82 33 42 79 -3 -166 334 -44 12 -125 61 -50 78 160 -27 -154 245 230 -61 -178 19 -18
3567 -18 -116 -49 170 155 90 90 -144 -36 175 32 118 -16 16 -332 36 -127 -226 -5 32 138 -153 103 124 182
3591A82k29J16j94n0L95k6j32j07P5J02k45R9N1q5K54j86j00J86J14l92Q9Q7L6
3614D0o0J04k24K43j48P6j41L56j82M9l06J44J03O9j98l6K86j10P4m7n8j74K57
3637A17j50M7j57J22R0K7k3lj05l3J99k36K94k34nK70k24m0J59p3q8Q2j62K88
3661A62j82r6O1j24J22J38n6Q2Q7M5k62o9r6J12l3K83j18j26J18J32k76o0K01
3684D5n8L9K5j78J94Q8o6p8K15q9j51Q3Kj55n2N6K22k48RK04r0J22L7p6k36K62
3710A26j08n8O1j96J88J45j10j56q1J20K8k6J85J68l57l50L29J14K9p5M9N6k37
3733a56K21J3m2R0M6l0k54M7Q6k8j6N0j89k7K39j26M3n5K61o8j05q8K8N6q2M6
3759d0qL46k70m4m7m8P9J0K30k93k39M31l2j45o7L53k76J41O0m6PJ87j65k42P1
$$ plain form
3591 182 -47 69 -125 -175 220 194 62 -45 30 132 -113 -14 37 -48 206 20 -80 106 220 -172 -83 4 40
3614 40 -20 84 -140 103 -45 31 -110 246 64 113 -193 -49 54 123 -75 -111 175 65 139 92 34 -140 117
3637 117 -33 14 -143 -21 69 96 73 70 -35 -68 131 -105 189 -45 -50 220 -4 -44 115 42 -46 36 -126 162
3661 162 -20 -116 -55 -179 -57 81 25 107 194 239 -23 -92 -188 -76 -109 174 56 -70 48 180 -96 -156 45
3684 45 -13 26 51 -127 67 155 89 11 226 137 -14 69 71 -84 -136 -80 142 -106 -97 107 17 139 176 100 -136 126
3710 126 18 -40 21 -175 13 158 48 -108 -189 -69 -41 -67 118 286 -71 -421 -92 22 51 -24 25 81 -156
3733 -156 65 78 36 126 172 142 -112 -65 21 -7 -23 27 -162 -189 50 -76 -33 -88 173 105 0 -88 -60 -4 -86 -40
3759 -40 -48 298 28 -16 -63 -111 -32 -22 208 -85 -324 107 75 -70 -137 216 -60 81 141 95 102 289 124 -118 -47
3784d7J23p1k2n5O2q6J1R4k09J27J25k30N1K32R9k35j38J71J09k1j00nQQ2O7l03
3810a61m8N9J52k7Qj59J12J4KJ5O4J5m8j0m9J66r8J60J24l35j16K1O4J04K10l49
3836a10K12j4j33n6L8J88k53j69J18K08P9j48J00M5N6l1j42jK37k21O7k84J65
3859d9J47j14K75n27J39J10KnQK89k7m3l52K55l14K56J41j10j25J98r5r2l2k19
3883b84M71l29q6L56l22M46j24M5k38J92Q2j32N2k65J65K18l29Q4j14KK36r0n7
3906b1n8J25K99k32k27K94k15J35j54N7Q3o0J03m2Q9k29N6k41Q4J94k16J45j00
3929a31K0M7J80j47ln7J09R3j44o1PK01J20j50j69J72m8J65l45K15Q6M4j48L9
3953I5k32J34P5po3qQ5p4J20j27l7L06j65j79O1j02K02j25L2q4K01j96P6q1M40
$$ plain form
3784 -47 76 5 -17 -72 -10 -96 -85 9 -200 -73 52 -178 -127 105 204 -31 -169 2 111 90 -10 -15 -7 75 142 -161
3810 -161 -209 -150 2 -25 -17 -176 -64 -50 -48 -33 31 46 -2 -12 -61 105 7 167 291 -44 -160 -139 -75 29 239 -110
3836 -110 102 88 -45 -101 -63 125 -128 -297 -179 29 108 -40 60 105 161 130 -12 -13 224 3 70 -214 -49
3859 -49 98 -16 259 -268 -129 -19 -17 -22 -14 275 248 205 -147 108 -206 50 191 81 -44 154 59 -33 -65 -284
3883 -284 187 -142 -228 128 -194 252 128 173 -65 127 209 77 129 -136 29 247 -82 2 -112 -110 126 36 -21
3906 -21 -79 46 345 113 -114 180 -35 100 -54 3 86 26 129 87 176 -53 3 -238 -154 40 -176 -31 -131
3929 -131 -111 -64 116 -31 -34 -91 18 111 -33 -94 -87 114 234 84 -85 87 39 204 -141 74 160 204 56 95
3953 95 -137 -3 72 65 2 -6 79 5 125 -2 -39 267 102 -77 -16 -118 84 -41 -9 -93 108 -88 -12 -93 347
3978C47k02j61J06Rj21n0K68j72L0j19J06O5lk19J23kJ29k04j30J98J97o5k33
4001a03J15J02j91J00Q5j02K06P9j24k09jj54K23J08k69j8J4J54n0o9J0K10k87
4024a71J01p6L25m9j95lJ45J01%%l22J29K52r8q1m2MQ7o6J4k04L9K09r6P6K3k01
4051i9N7J27P1k30k0L91n85K82J09j05O4k38J36K13P4k08r8l0K12j53j62L49n0
4074A07q9R8k37J06K70k01J5n5rR9j30k26K99r3P7J5l4j12J47J24Q9j66k63J62
4098gk19J96N3o%m2j47L20j49q8k6OO5k06L25J41j4k95K20J07j97K22k07j58J20
4123A4J57j61j70M03k61k04K34J17Q6M4l32j29J57J08j8N9j88K07r9R3o9P2j5
4146A05M7k15k59K58O1J66l89K47kq3J77p5j97K91P7j01p5N1jK2j01J8J21k7M0
$$ plain form
3978 347 145 -16 90 99 -22 -72 196 24 54 -65 41 106 103 -116 7 5 134 -70 -200 -2 195 130 -103
4001 -103 12 114 -77 23 108 6 212 291 167 -42 -43 -197 26 134 -135 -153 -139 15 -35 -104 -94 116 -171
4024 -171 -70 -146 179 130 -65 -68 77 178 178 178 -144 -15 237 139 58 16 20 107 41 55 -149 -110 99 3 79 102 -99
4051 -99 -42 85 156 -74 -94 297 -288 -6 103 -2 62 -176 -40 173 247 39 -59 -89 123 -30 -192 157 107
4074 107 18 116 -121 -15 255 54 69 14 5 104 -26 -252 47 -46 31 46 12 -100 47 171 260 94 -169 -7
4098 -7 -226 -30 23 17 17 -25 -172 148 -1 -89 -115 -109 -44 -250 75 216 202 -93 127 234 37 259 52 -106 14
4123 14 171 10 -160 243 -18 -222 12 129 215 259 -73 -202 -45 63 45 104 -84 123 24 117 48 120 105
4146 105 152 -63 -322 -64 -3 163 -226 21 19 -64 113 38 -159 132 209 108 33 84 83 105 4 22 143 116 156
4171A56j32n9J13k11Mj15L59k56J49k05K52q4j06K62j66l9L04j79l42L12r7L37
4193B57j96Nk13j02L27k80J30J74L0J6j52j20J19j4j03R6l23M28kj30R9o9k21
4216b44m2L82j52j05R3K22l5j20j16J94m5N2q4j36K15n9j24M0j3K06l07M1R2L9
4240fJ46j54j40oK08j34k9J79Ol32K87M2L9j77K15P0m04K31R0j2j06m6j0J16Q3
4265A56j81m8j7O5o5M17l96k6K19pn9O4j37M8J06l39K26K14k21K7m9j62J62K96
4289B93m44l8J67J36k20J01K39j96j85M30j79k41J08K83j99q2p1J55j51L9m1K44
4311A48j39Q7j65j5M25l07j91J06p2K52J33R3m82O6Q0o3j14J06o2P7J3J9J28j32
4335il0J5q9K21n2j81J65r8P6K7n4K6j87R7JN6nj24J23L4r0J55k64K75j82J37
$$ plain form
4171 156 24 -35 78 -133 -129 -244 115 -141 8 -197 55 -29 -135 127 -39 -78 226 47 -295 17 -80 257
4193 257 61 66 -147 -249 78 -202 -72 102 132 148 -4 -124 -5 -19 -122 -26 -349 79 77 -53 46 -23 -244
4216 -244 -286 96 -56 -161 -68 154 119 -1 -117 77 32 84 0 -136 79 20 -104 -64 -77 129 -178 -137 -45 -6
4240 -6 140 -14 -154 -160 48 -86 -115 64 70 -262 25 67 106 -71 144 214 -190 41 131 119 13 -33 -43 73 156
4265 156 -25 -73 -90 -25 -90 327 -69 -95 124 117 58 122 -15 33 139 -200 26 240 19 46 -3 -165 -3 293
4289 293 -151 -189 -22 114 -106 -5 234 38 -147 283 104 -137 -29 254 55 -27 -98 57 -94 -55 -96 148
4311 148 9 96 -69 -84 341 34 -157 -51 -123 129 262 355 -127 -61 19 -44 -158 -52 -114 -37 -24 -5 123 -9
4335 -9 -39 -24 -113 108 56 -125 40 -58 18 45 -9 17 -170 -73 -72 -16 -21 -145 -22 12 -78 77 -187 88 -94 43
4361D3j01J01J78k18J27j73%K3J70l59J70L9J65k54PJ28p4J44o4m6M7K23m5j00
4385A31k79J95m8j21J01k1J11lP8r8k8j21L02k34k09K88o1k5o5J38J96j20r0n
4409A2j6K54K5j55l3j59P7P1k27M8K42j53M1j41J81J6j21J76j50Ql1J6L7j17Q0
4434a9J30p0K22l59K94K0j81K9k28J57K95k71j07r0KJ62L31m02K22P8k78l3J02
4457Fp2L3J16k37K13k4j16J87m1j36L47l28o9J22K1K62k55M8j66K23l53K34j58
4480a43O8K4n3J09m9o0K39Ol97K80k75M01j07j85P2J94n1j31k3mJ54o4J4o2M7
4505DP9k29L10q2j71K34j32N9j46J1J34j90J84K4j15o6k0J11J13j65K09j90l8
4528g2J38j7j8Rk94N0O1K38l57J4J79Q3J23j74l8K25k59l1K74j11P4J85l48l1
$$ plain form
4361 43 -58 43 221 3 130 -43 -43 -20 150 -209 -39 0 165 -89 -82 46 -28 116 52 6 53 276 231 131
4385 131 -148 47 -1 -122 -21 -42 69 66 144 46 18 -103 199 -35 -244 44 -17 -42 -107 31 227 107 17 12
4409 12 -4 250 275 120 87 -72 5 76 -151 -103 139 -14 27 -114 67 83 -38 138 -12 -4 -35 -19 18 -99 -19
4434 -19 111 41 263 -96 198 218 37 66 -162 -5 290 19 -88 -178 -176 -14 317 -85 137 215 -63 -96 6
4457 6 -66 -33 83 -154 59 35 -81 106 65 -71 276 -52 -121 1 22 284 29 77 -89 134 -219 15 -143
4480 -143 -75 -51 -104 5 -44 -104 135 141 -256 24 -251 150 43 -142 -70 124 73 -58 -81 -85 69 5 19 -43 4
4505 4 83 -146 164 82 -89 145 13 72 -74 -63 71 -119 65 89 -26 -92 -112 -1 112 -53 156 -34 -72
4528 -72 66 49 31 40 -254 -204 -143 95 -262 -248 -69 14 137 -37 -75 150 -109 -140 134 23 97 282 -66 -97
4552i7L4N8K13l50L6j23L10l03K60j23n4K95j24p3p0J47k31L22j12m1K12k23k08
4575b45J9K72O2r3O0j21mL06j21k74m0L74P9p2l41J62J68k74J28K9O8j10K38j53
4599A17j10qj59L31j39k54O3O0PJ8Q7J46L6k13r8K41j96L7M3k05K14J55p0j53
4623e0O0J55j85j29J62l7J63j34p1n7J14J13k62M31O0m40ML2j55K10j14J63j34
4646a01k34K66K20Rk51J48p7nP3j89J74R9j41j71J17N8N3N5j49K40n57N38n3k1
4670A01k39QK16P4j49o6nJ25K09l55O8J76kj74R3n3j5p1j24J20m1K09j43p1J79
4695G0M7j50J59j28J78k79K69q0l25L42j14k4L4jM8L7j49j28N5J09m0J20kl9m
4720Ek21L21l5k12K77j40J15k50L39k16K3o2Q0j3O1k65J8Q3J98m4k98J36OJ86
$$ plain form
4552 -97 -63 -5 208 -142 -106 -229 81 -222 38 -85 -139 156 32 -41 -111 36 -195 127 15 -26 186 -37 -245
4575 -245 -226 46 108 15 75 -46 -50 256 135 -139 -179 195 274 202 -139 23 191 -83 45 74 142 32 270 117
4599 117 7 -1 -160 171 32 -222 -159 -99 -92 -74 13 159 195 -18 -116 125 -71 -34 9 -196 18 173 103 -50
4623 -50 10 165 -20 -149 13 -24 139 5 -66 -123 -9 104 -158 273 333 -107 -103 -71 -226 -16 -130 33 -101
4646 -101 -335 -69 151 160 -91 57 -20 -25 48 -141 33 132 -9 -180 -63 -5 48 103 -46 194 -363 175 122 101
4670 101 -138 -130 86 160 11 -55 -60 65 274 -81 -13 163 161 -13 80 27 12 -59 -183 -63 -104 105 -38 -109 70
4695 70 117 -33 126 -2 176 -103 166 86 -239 103 -11 -35 -1 -2 46 83 -66 -194 -139 -30 -70 50 48 9 5
4720 5 -216 105 70 -142 135 -5 110 -140 199 -17 6 -56 24 11 72 -193 -175 -92 106 62 -236 -100 -94 92
4744I2J0J27k91J26L27l97l30M08j92L38l09j12J6n4L03N0k65N2J11j56K9L9K09
4767A31k30J58%k54K50L47j79m21J74n6r6K61o3N5o2P9k60PK16J8J4q0J96l76
4791a71J85k4R0j78J57J76k26j58J10J70k14L46m26L0j7K59k26o0L38Ok49J25
4813D3l1P9P8j47q8p2K30k15n6K46j42P0Q7P4m3j23M8J25l85K57Mp9P6k44L07
4838I9j05J34l14J07r2O3r2J54J45p4J71m23K44j73J41P3J6j16J85J57k74K5K7
4861G8j68J56j67O9j57L29K2l61J23R9J0j75J2N3j00L40J28m22K26J00j39Ok52
4884a90J89l58M97J16m51O0K34o0k4J2J15m01K37J92l01R1J03j8j32j4J97j59
4906f5K21k0m28L24J24m5j12j24J25L3k09P2J37k15J51J53k03n7J94k56J39lj18
$$ plain form
4744 92 102 229 -62 64 391 -6 -336 72 -120 218 -91 -203 -187 -241 62 112 -153 -101 10 -146 -117 -78 131
4767 131 -99 59 59 -195 55 402 223 -198 -24 -80 -176 85 22 77 15 94 -166 -159 57 75 89 9 205 -171
4791 -171 14 -10 80 -98 59 235 9 -149 -39 131 -83 263 -163 -133 -150 109 -117 -177 161 167 -82 43
4813 43 12 91 169 22 -66 -138 92 -123 -179 67 -75 -5 82 156 113 -10 38 163 -222 35 39 -40 36 -208 99
4838 99 -6 128 -186 -79 -171 -108 -200 -46 99 25 196 -227 17 -156 -15 58 74 -42 143 300 26 51 78
4861 78 -90 66 -101 -32 -189 140 162 -199 -76 23 33 -142 -130 -77 -177 163 291 -131 95 195 56 62 -190
4884 -190 -1 -359 138 254 -197 -137 97 37 13 25 140 -261 -24 168 -133 -42 61 43 -89 -103 94 -65
4906 -65 156 136 -292 32 156 111 -1 -125 0 33 -176 -104 33 -182 -31 122 -81 -138 56 -200 -61 -64 -182
4929a82J92K7k6o5k5P7J44k16J04j68J36l4J30j62J0J56p8j02L18qm26J52J57
4952A11J9k98J80Kq3K13k2k46j6j9J82M3J58k15Q7K9q0%p1K8J64k48J41j53J41
4977D7p1J18k28K38r9j04J05j37Q1l1p3J49k41K92J01j27q3L5J94k25j67K58n5
5000b3M1L1j34o2J23J61o0k49Q6J07M5K7j94K01Jk3j0N0J44k34o4J16j9n0M2q
5026D5k02j1pK03j09q6J2J83O7k78J00J03p5R8o5J03N6n5k18K94r5j79K09j90
5050i7j87J96R0p9R0jJ10M5j18k4M5j65J23J15j61K5P0o5j20j97N3L02m3j40K47
5075A14K9q7k2k4RL80k68o5m4M0j04J45j60J76q4j05K47k71K9J11J5j25K7m9J91
5100A05l1p5j04N5O2j51K79O8j14j97R8j35J68j17O2p8K9M2J18Q1m5j18j72J54
$$ plain form
4929 -182 10 37 11 -54 -79 -2 142 -74 30 -138 -2 -36 94 -68 -58 98 20 -82 236 228 -198 -46 111
4952 111 130 -168 12 14 -69 144 122 -124 -140 -159 23 66 224 9 96 125 45 45 -26 2 166 -82 59 -94 47
4977 47 -24 94 -134 104 5 -99 6 -131 -50 -81 -154 -5 -246 46 147 20 -63 -28 166 -59 -226 32 -23
5000 -23 18 49 -85 -147 -24 137 77 -172 -86 21 66 93 -101 100 101 78 68 118 262 28 -36 80 61 11 53 45
5026 45 -157 -168 -175 28 -81 -167 -155 28 95 -183 -83 20 -55 43 -22 81 137 82 -136 158 63 -116 93 -97
5050 -97 -284 -88 2 -77 13 12 122 167 49 25 70 -95 28 143 -18 7 77 12 -108 -305 -252 50 7 -133 114
5075 114 143 56 34 10 19 399 131 66 22 62 -42 103 -57 119 35 -70 177 -94 -65 46 61 -64 -37 -86 105
5100 105 74 -1 -105 -50 12 -139 140 208 94 -103 -5 -140 28 -89 -27 -105 -76 -34 84 165 120 2 -170 -16
5124a6l5Q3J15k87K31P9k25J5o4J02l2J64j64J07j30q6k7J26Q6j74K41k6j54K69
5148A98p0j59J19K5J38m60qJ19J48j96J34j52K18K9q6j5m5L7J09j9j57J30j87
5171a50K09Q9j90k89O90m66p9J40P3j59J48P8o6p5J81k6k17N0k19L67l1p2O8N8
5195A12J85k68olJ79o0k77k6K96j96J4P5k70J99K56l95P6O1M8p3K71o0p3q6J06
5220H5j16o3K2qm5K02l79J34J85J6j53p8J95P1k21Q4p1K03J56K7l31J03J14k19
5244h7J45N3r6P1j73J31j50l2j4K60m14O9M51j98j77K38n7j8M9J30l13j7J84K5
5268F0k13J77J82j55j43R8m7o3K5r6J35MJ91k35K05m3L2L5j46K8k68L82p2j48
5292g5j0J58j43l6j8Mj08L34Rj64J1j51L93k10J07K1j37j08L70j69k98L23J86
$$ plain form
5124 -16 -51 32 147 -140 91 170 -55 -40 -104 -2 -34 130 -34 73 -57 -143 -170 -44 42 -132 109 83 -71 198
5148 198 128 -31 88 113 251 -209 -217 -98 50 -146 -12 -164 54 83 -3 -18 -63 -26 83 64 -93 37 -150
5171 -150 59 148 -42 -331 359 -107 -186 -46 27 -132 16 94 28 -47 134 108 -109 -59 -278 89 58 -14 54 112
5195 112 297 29 23 20 199 139 -138 -164 132 -64 -50 25 -245 -46 210 -185 -109 -48 0 -73 198 138 65 -21 85
5220 85 -31 -94 -72 -80 -125 77 -302 -168 17 33 -120 -198 -3 68 -153 -69 -140 63 219 246 -85 18 132 -87
5244 -87 58 111 15 86 -87 44 -106 -138 -152 108 -306 -237 214 16 -161 77 20 2 51 181 -132 -149 35 60
5268 60 -153 24 206 51 -92 6 -41 -104 -79 -175 -40 -36 155 -80 125 82 114 149 3 31 -237 145 73 -75
5292 -75 -85 73 -70 -106 -124 -120 -228 106 115 -49 -38 -189 204 -6 101 122 -15 -123 247 78 -220 103 289
5315B89o46K78Mjk2J54m4j99K70n7j80L14M4j53l14K12J61n6P6kM2j79L40k39
5339I2j67N4l3l4J43J82l68K31L5k0j79M7J84j08j52n9L3J11K06j00j62P8J61
5362A75m58K04L16l5o2k8q9P7J07J0r2j73J62k6r3J78k27j24J45K43m27J77K13
5385A73r6r9j18K50k98K65L1j88J48jM7o7k0K05j38j74K24Q5k70K11j91q8J08
5408aJ21k35N8Q3M7q3N0o0n7J54J77k71l6Q4jK18r0k51O1J54j67R0m5j83J60m4
5434f7P4L7oO3q5j45J61o2l1o5J6K47l8jl25n4J57Q6J82l65J47J88q0o4mM6n9
5461d7J22J26l78J94K19j13o5Rj90L9P3m1N5k56K95m4j61k0L34k10M8K6N3k2k34
5486a88J90o8L86j69k01j78K75n7Oj18P0j15J07l4j45J31J18J5l4L9k2J60j58
$$ plain form
5315 289 -357 -79 -75 -76 -98 56 12 -187 83 26 -154 160 204 51 -263 -51 110 54 130 128 170 -9 331 92
5339 92 -75 -21 -54 -88 55 237 -131 100 135 115 -64 -17 167 59 -93 -152 -119 -8 198 98 -64 14 175
5362 175 -283 -79 237 202 140 112 23 100 207 217 125 -48 114 88 -5 173 -54 -178 -33 210 -217 -40 173
5385 173 77 -22 -140 110 -188 77 108 -80 68 67 114 47 27 232 94 -80 144 229 -41 170 -21 -109 -1
5408 -1 120 -115 -57 26 73 -10 40 -20 -77 77 254 -17 -53 31 30 248 158 -93 -32 122 -45 45 0 -183 -23 -67
5434 -67 7 44 38 101 16 -129 32 -30 -61 -126 -110 137 99 98 -227 -281 -124 -38 144 -221 -74 114 34 -30 -34 12 -47
5461 -47 75 201 -177 17 236 123 58 67 -123 -84 -11 -52 3 -253 42 -2 -163 -183 151 -59 -11 15 68 46 -188
5486 -188 2 -66 320 151 -50 -228 47 -10 -4 -122 -52 -167 -60 -94 -239 -108 10 25 -9 30 8 168 10
5509A0m1q9J7K07j02o6p0R5J5J45j48j23m3K43j19M4NK7J95m63M65k47K8L41j84
5534A42j86j22qJ56j17j6J55p2j0q4Q5j5K00O4k46M4J31N9n8p3l5J05N7j89l09
5559c42L47R6j92K27k46J3Q0L1Q0k48M14n0j63j01J92k17J21k4J7p7K56r4l42
5582b22%L31o6k21J78Ol7l2M6K12l28K3Jm1K25R8j19J26m1j15k82K98K4j80J18
5607BJ22r3k29K78P3k93L36Ok42O1J67n7k14J49q7K55j88O2k37J57Q2k54J96j30
5631g8J40L0q8L8k36K19m5J18j16O3Q9l2k26K28j82J56L0j17k00L60ql73J92k39
5655b77K21j1J37k73J66M5M3k02K99j5j57J26l09K10J25q7j73P1J8K72l04P6j30
5678a29M5m2L29l64J34J98j64J90j76j02Q1l7K33k38l7j02K75j23K1K4J28J10
$$ plain form
5509 10 -31 -120 -103 104 2 -64 -134 -39 -24 121 -27 -150 -193 50 -69 -25 -20 7 202 -261 204 -43 -15 326 142
5534 142 -44 -166 -174 -18 -135 -151 4 -68 -78 -162 -77 -92 108 172 -74 -30 101 160 102 29 -6 99 156 -33 -342
5559 -342 5 101 -91 136 -110 -97 -17 14 94 -154 260 210 47 -54 138 -79 42 18 35 -42 214 120 -222
5582 -222 -222 109 43 -178 0 6 -31 -63 -17 195 -133 -110 -109 -150 75 173 54 180 139 24 -258 40 64 -116 2
5607 2 124 31 -198 80 153 -140 196 202 -40 21 188 131 -83 66 -21 234 46 108 -129 28 110 -144 52 -78
5631 -78 62 92 4 42 -194 25 -20 98 -18 45 134 102 -124 104 -78 78 108 -9 -209 151 143 -230 -38 -277
5655 -277 -56 -67 70 -203 -37 8 51 -151 148 133 -24 102 -207 3 128 41 -132 -61 -43 229 -75 1 -129
5678 -129 -84 -126 203 -161 -27 171 7 197 21 -81 0 -37 196 -42 -79 -181 94 -29 -8 16 144 254
$$ [...]
8191a28
##END NTUPLES=NMR FID
##END=
