##TITLE=1H_Pr t-Bu-D
 200.13MHz,CDCl3,
 8 sc
 
 24.6.2025
##JCAMPDX= 6.0         $$ Bruker NMR JCAMP-DX V2.0
##DATA TYPE= NMR FID
##DATA CLASS= NTUPLES
##ORIGIN= UXNMR, Bruker Analytische Messtechnik GmbH
##OWNER= pz
$$ XWIN-NMR		Version 3.5
$$ Tue Jun 24 16:41:47 2025 Russian Standard Time (UT+4h)  she@DPX200
##.OBSERVE FREQUENCY= 200.1313
##.OBSERVE NUCLEUS= ^1H
##.DELAY= (6, 6)
##.ACQUISITION MODE= SIMULTANEOUS
##.ACQUISITION SCHEME= undefined
##.AVERAGES= 8
##.DIGITISER RES= 18
##SPECTROMETER/DATA SYSTEM= spect
##.PULSE SEQUENCE= zg30
##.SOLVENT NAME= CDCl3
##.SHIFT REFERENCE= (INTERNAL, CDCl3, 0, 14.3821)
##AUDIT TRAIL= $$ (NUMBER, WHEN, WHO, WHERE, WHAT)
$$ ##TITLE= Audit trail, XWIN-NMR		Version 3.5
$$ ##JCAMPDX= 5.01
$$ ##ORIGIN= Bruker BioSpin GmbH
$$ ##OWNER= she
$$ F:/spectra/data/she/nmr/H-C/1/audita.txt
$$ ##AUDIT TRAIL=  $$ (NUMBER, WHEN, WHO, WHERE, WHAT)
(   1,<2025-06-24 16:40:28.89 +0400>,<she>,<DPX200>,
      <created by zg, POWCHK disabled, PULCHK disabled
       configuration hash MD5:
       00 E9 B6 7A A2 85 ED C7 34 08 36 98 17 FE 4E 26
       data hash MD5: 16K
       50 19 CA A5 FA CA 3D D1 BE EE 62 B4 E5 39 82 0D>)
$$ ##END=
$$ 
$$ hash MD5
$$ 81 87 69 EC 39 70 14 D0 95 49 C6 C1 32 F9 D5 96
##$RELAX= 
##$RELAX= 
##$RELAX= 
##$RELAX= 
##$RELAX= 
##$RELAX= 
$$ Bruker specific parameters
$$ --------------------------
##$DU= <F:/spectra>
##$EXPNO= 1
##$NAME= <H-C>
##$PROCNO= 1
##$TYPE= <nmr>
##$USER= <she>
##$AMP= (0..31)
100 100 100 100 100 100 100 100 100 100 100 100 100 100 100 100 100 100 
100 100 100 100 100 100 100 100 100 100 100 100 100 100 
##$AQSEQ= 0
##$AQ_mod= 1
##$AUNM= <au_zg>
##$AUTOPOS= <>
##$BF1= 200.13
##$BF2= 200.13
##$BF3= 200.13
##$BF4= 200.13
##$BF5= 200.13
##$BF6= 200.13
##$BF7= 200.13
##$BF8= 200.13
##$BYTORDA= 1
##$CFDGTYP= 0
##$CFRGTYP= 5
##$CHEMSTR= <none>
##$CNST= (0..31)
1 1 145 1 1 1 1 1 1 1 1 1 1 1 1 1 1 1 1 1 1 1 1 1 1 1 1 1 1 1 1 1 
##$CPDPRG= <>
##$CPDPRG1= <>
##$CPDPRG2= <>
##$CPDPRG3= <>
##$CPDPRG4= <mlev>
##$CPDPRG5= <mlev>
##$CPDPRG6= <mlev>
##$CPDPRG7= <mlev>
##$CPDPRG8= <mlev>
##$CPDPRGB= <>
##$CPDPRGT= <>
##$D= (0..31)
0 0.7 0 0 0 0 0 0 0 0 0 0.03 0 0 0 0 0 0 0 0 0 0 0 0 0 0 0 0 0 0 0 0 
##$DATE= 1750768828
##$DBL= (0..7)
120 120 120 120 120 120 120 120 
##$DBP= (0..7)
150 150 150 150 150 150 150 150 
##$DBP07= 0
##$DBPNAM0= <>
##$DBPNAM1= <>
##$DBPNAM2= <>
##$DBPNAM3= <>
##$DBPNAM4= <>
##$DBPNAM5= <>
##$DBPNAM6= <>
##$DBPNAM7= <>
##$DBPOAL= (0..7)
0.5 0.5 0.5 0.5 0.5 0.5 0.5 0.5 
##$DBPOFFS= (0..7)
0 0 0 0 0 0 0 0 
##$DE= 6
##$DECBNUC= <off>
##$DECIM= 32
##$DECNUC= <off>
##$DECSTAT= 4
##$DIGMOD= 1
##$DIGTYP= 9
##$DL= (0..7)
0 120 120 120 120 120 120 120 
##$DP= (0..7)
150 150 150 150 150 150 150 150 
##$DP07= 0
##$DPNAME0= <>
##$DPNAME1= <>
##$DPNAME2= <>
##$DPNAME3= <>
##$DPNAME4= <>
##$DPNAME5= <>
##$DPNAME6= <>
##$DPNAME7= <>
##$DPOAL= (0..7)
0.5 0.5 0.5 0.5 0.5 0.5 0.5 0.5 
##$DPOFFS= (0..7)
0 0 0 0 0 0 0 0 
##$DQDMODE= 0
##$DR= 18
##$DS= 0
##$DSLIST= <SSSSSSSSSSSSSSS>
$$ [...]
##$SUBNAM0= <"">
##$SUBNAM1= <"">
##$SUBNAM2= <"">
##$SUBNAM3= <"">
##$SUBNAM4= <"">
##$SUBNAM5= <"">
##$SUBNAM6= <"">
##$SUBNAM7= <"">
##$SUBNAM8= <"">
##$SUBNAM9= <"">
##$SW= 18.0517328524113
##$SWIBOX= (0..15)
0 0 2 0 0 0 0 0 0 0 0 0 0 0 0 0 
##$SW_h= 3612.71676300578
##$TD= 16384
##$TD0= 1
##$TE= 0
##$TE2= 300
##$TE3= 300
##$TEG= 300
##$TL= (0..7)
0 120 120 120 120 120 120 120 
##$TP= (0..7)
150 150 150 150 150 150 150 150 
##$TP07= 0
##$TPNAME0= <>
##$TPNAME1= <>
##$TPNAME2= <>
##$TPNAME3= <>
##$TPNAME4= <>
##$TPNAME5= <>
##$TPNAME6= <>
##$TPNAME7= <>
##$TPOAL= (0..7)
0.5 0.5 0.5 0.5 0.5 0.5 0.5 0.5 
##$TPOFFS= (0..7)
0 0 0 0 0 0 0 0 
##$TUNHIN= 0
##$TUNHOUT= 0
##$TUNXOUT= 0
##$USERA1= <user>
##$USERA2= <user>
##$USERA3= <user>
##$USERA4= <user>
##$USERA5= <user>
##$V9= 5
##$VALIST= <valist>
##$VCLIST= <CCCCCCCCCCCCCCC>
##$VD= 0
##$VDLIST= <DDDDDDDDDDDDDDD>
##$VPLIST= <PPPPPPPPPPPPPPP>
##$VTLIST= <TTTTTTTTTTTTTTT>
##$WBST= 1024
##$WBSW= 4
##$XGAIN= (0..3)
0 0 0 0 
##$XL= 0
##$YL= 0
##$YMAX_a= 38759
##$YMIN_a= -48122
##$ZGOPTNS= <>
##$ZL1= 120
##$ZL2= 120
##$ZL3= 120
##$ZL4= 120
##$ABSF1= 10
##$ABSF2= 0
##$ABSG= 5
##$ABSL= 3
##$ALPHA= 0
##$AQORDER= 0
##$ASSFAC= 0
##$ASSFACI= 0
##$ASSFACX= 0
##$ASSWID= 0
##$AUNMP= <proc_1d>
##$AZFE= 0.1
##$AZFW= 0.1
##$BCFW= 1
##$BC_mod= 2
##$BYTORDP= 1
##$COROFFS= 0
##$CY= -3
##$DATMOD= 1
##$DC= 2
##$DFILT= <>
##$DTYPP= 0
##$F1P= 0
##$F2P= 0
##$FCOR= 0.5
##$FTSIZE= 0
##$FT_mod= 4
##$GAMMA= 1
##$GB= 0.15
##$INTBC= 1
##$INTSCL= 1
##$ISEN= 128
##$LB= 0.25
##$LEV0= 0
##$LPBIN= 0
##$MAXI= 10000
##$MC2= 0
##$MEAN= 0
##$ME_mod= 0
##$MI= 1.114404
##$NCOEF= 0
##$NC_proc= 0
##$NLEV= 6
##$NOISF1= 3.799351
##$NOISF2= 2.8
##$NSP= 1
##$NTH_PI= 0
##$NZP= 0
##$OFFSET= 14.38212
##$PC= 1
##$PHC0= -1202.953
##$PHC1= 15.9922
##$PH_mod= 1
##$PKNL= yes
##$PPARMOD= 0
##$PSCAL= 0
##$PSIGN= 0
##$REVERSE= no
##$SF= 200.129724274929
##$SI= 16384
##$SIGF1= 3
##$SIGF2= 2
##$SINO= 400
##$SIOLD= 16384
##$SREGLST= <1H.CDCl3>
##$SSB= 0
##$STSI= 0
##$STSR= 0
##$SW_p= 3205.1282051282
##$SYMM= 0
##$S_DEV= 0
##$TDeff= 0
##$TDoff= 0
##$TI= <>
##$TILT= no
##$TM1= 0
##$TM2= 0
##$TOPLEV= 0
##$USERP1= <user>
##$USERP2= <user>
##$USERP3= <user>
##$USERP4= <user>
##$USERP5= <user>
##$WDW= 1
##$XDIM= 8192
##$YMAX_p= 0
##$YMIN_p= 0
$$ End of Bruker specific parameters
$$ ---------------------------------
##NTUPLES= NMR FID
##VAR_NAME=  TIME,          FID/REAL,        FID/IMAG
##SYMBOL=    X,             R,               I
##VAR_TYPE=  INDEPENDENT,   DEPENDENT,       DEPENDENT
##VAR_FORM=  AFFN,          ASDF,            ASDF
##VAR_DIM=   8192,          8192,            8192
##UNITS=     SECONDS,       ARBITRARY UNITS, ARBITRARY UNITS
##FACTOR=    0.0002768,     1,               1
##FIRST=     0,             0,               0
##LAST=      2.2672688,     0,               0
##MIN=       0,             -48122,          0
##MAX=       2.2672688,     38759,           0
$$ Real data points
##PAGE= N=1
##DATA TABLE= (X++(R..R)), XYDATA
$$ [...]
1584hN24j349N14Q64n89o98Q74N76j045q6Q75j62q26R56M90j507L93Q47o97n79
$$ -8 516 -833 -319 545 -44 -742 132 708 -337 -423 452 290 -536 420 910 -597 -204 643 -54 -633
1604f33N47J35o21m2R77m03o49R99J74j072M58P26n03l81P65K08q58pR49p00p90
$$ -633 -86 49 -572 -614 363 -40 -689 310 484 -588 -130 596 93 -288 477 685 -173 -180 769 69 -721
1625g21R30K01j176M41Q45o69m60R27j51n02j4J195p14n16Q94k00p02L32P70p09
$$ -721 209 410 -766 -325 520 -149 -609 318 167 -335 -349 846 132 -384 510 310 -392 -60 710 1
1645Am19Q99N4j058K12O93n67o74J265j08j018N52P08p38k35O88K81q43K25Q06
$$ 1 -418 481 535 -523 -311 382 -185 -859 406 298 -720 -168 540 -198 -433 255 536 -307 -82 724
1665G24q53l17Q50p4q88K81P24p32k6O08j96p06L22Q03n30o93J211j96q02P29
$$ 724 -129 -446 404 330 -558 -277 447 -285 -311 297 101 -605 -283 520 -10 -703 508 312 -490 239
1685B39L96m70n54P70Qp40L4R52p16o89J304k91q55O95M08p89J57L37l9m58K82
$$ 239 635 165 -389 381 389 -351 -317 635 -81 -770 534 243 -612 83 491 -298 -141 196 157 -301 -19
1706a9O87o99k98P49k64p63O89N57o97k29N02k07n97M74N29n68m79R08j45p31
$$ -19 668 -31 -329 420 156 -607 82 639 -58 -287 215 8 -589 -115 414 -154 -633 275 130 -601
1726f01P00N40p30j1N44j03o72K28P59q14k27Q94l59p47P90J36p24J77M14j97
$$ -601 99 639 -91 -102 442 339 -333 -105 654 -160 -387 507 148 -599 191 327 -397 -220 194 -3
1746cl64K47P78r08j87J115n30n14P47o4m57j08N40n6o62M66N46j011j2R21m58
$$ -3 -367 -120 658 -250 -437 678 148 -366 381 317 -140 -248 292 236 -426 40 586 -425 -437 484 26
1767B6o38O29L70o18N8N45j86n59L85N44q05j69R49o72k25N79K02p15j01O37l3
$$ 26 -612 17 387 -231 -173 372 186 -373 12 556 -249 -418 531 -141 -366 213 415 -300 -401 236 203
1788B03q39O34N29j032J44Q82n29m48O99L20q19J90N41k40m75K88L50n71j60Q17
$$ 203 -636 -2 527 -505 -361 521 -8 -456 243 563 -256 -66 475 235 -240 48 398 -173 -333 484
1808D84n32n29P41N9m44j22P25j98o80N69M15o93o2Q86l13n66O39Lq76M19K99
$$ 484 -48 -577 164 223 -221 -343 382 184 -496 73 488 -205 -267 619 306 -260 379 382 -494 -75 224
1829B24k94n28M17O26r24J69P61n24l33P35j23m80M0Q00k49m78M34K23q62L2Q14
$$ 224 -70 -598 -181 445 -479 -310 451 -73 -406 329 206 -274 -234 566 317 -161 273 496 -366 -334 480
1850D80n13m94O57J93o60P5M86l25m82P39K78o13j50R96o84m91J123l14n23K70
$$ 480 -33 -527 130 323 -337 -262 224 -101 -583 156 434 -179 -329 667 -17 -508 615 301 -222 48
1870D8M87n13m32N66n4o11J85O51n72j11O41p5m40J25N51k12o53N62L43o30OO98
$$ 48 535 22 -410 156 102 -509 -324 327 -245 -356 285 210 -230 -105 446 234 -419 143 486 -144 -138 560
1892E60p21l46P68n2n30K17K72m37m62O66L07n54J62O34n15l43Q56k14o97K25
$$ 560 -161 -507 261 209 -321 -104 168 -269 -731 -65 242 -312 -150 484 -31 -374 482 268 -429 -204
1912b04O25m80k82N89K25q48K54O23q77jM22K1n96M96O98o05l66N93J24o44M89
$$ -204 421 -59 -341 248 473 -375 -121 502 -375 -376 46 67 -529 -33 665 60 -306 287 411 -233 256
1933B56K12m31l70O85j96l94K64l1j71l6J45K34q31M88P28r84L21M28j72m54L95
$$ 256 468 37 -333 352 156 -238 26 -5 -176 -212 -67 167 -664 -176 552 -432 -111 317 145 -309 86
1954H6M35m34k50N08K4m52K49K06o31j07Q04m69n28M85J62m06n7N34N1m50K05
$$ 86 521 87 -163 345 369 -83 166 372 -259 -366 438 -31 -559 -74 88 -318 -375 159 210 -240 -35
1975c5O03n09j61N46m55k68N39j69k74J19K89k38n07M82L60o42l4O64l21l24M73
$$ -35 568 59 -102 444 -11 -279 260 91 -183 -64 225 -13 -520 -38 322 -320 -354 310 -11 -335 138
1996A38L24m46k63N16r1l92L94K20m87Q6K87k31k87J98J42l94L1O52l20m12L93
$$ 138 462 16 -247 269 178 -214 180 400 -87 -1 286 55 -232 -34 108 -286 -255 397 77 -335 58
2017E8L26m75J9O73n44j84K48P9l26j49N60j76m07J54L40n14P2M05k87p5N07l8
$$ 58 384 -91 -72 601 57 -127 121 200 -126 -275 285 109 -298 -144 196 -318 -246 159 -128 -203 304 266
2039B66m24j5O84k38m06L89J01p32N38K56m62l97M17J92m95j3N59j48n92N15K60
$$ 266 -158 -173 511 273 -133 256 357 -375 163 419 -43 -440 -23 169 -326 -339 220 72 -520 -5 255
2060B55o36J79Q18n80k00K15L64o18k8M60o6n62L55K48q38N84L24n04J49K1P3
$$ 255 -381 -202 616 36 -164 51 415 -203 -231 229 163 -399 -44 204 -634 -50 274 -230 -81 -60 13
2081A3j04j47N45k07m39P62k54l78M03K66n68n7L37k08k02j17M65m01q2K46J07
$$ 13 -91 -238 307 100 -339 423 169 -209 194 460 -108 -165 172 -36 -238 -355 110 -291 -373 -127 -20
2102b0k67K98M15m46k50L61J85l48O7L89l90j79M58j30m25L35R2j34k66M13n4
$$ -20 -287 11 426 -20 -270 91 276 -72 -5 384 -6 -185 273 143 -282 53 145 11 -255 158 104
2123A04k95Q2K43j28k18M45k07k68L11K83m97J91J13R5l55j71M64k64j41M80P0
$$ 104 -191 -109 134 6 -212 233 26 -242 69 352 -145 46 159 254 -101 -272 192 -72 -213 267 337
2144C37p48L55K79m30j47L24qk98K38K86j14l13O36k8o30L24J64k20l22L35J32
$$ 337 -411 -56 223 -207 -354 -30 -38 -336 -98 188 74 -239 397 369 -261 63 227 7 -315 20 152
2165A52m03K63K98m58j24M03j99j44K25K86m06J43L75l04l68L56J36j32k93M45
$$ 152 -251 12 310 -148 -272 131 -68 -212 13 299 -107 36 411 107 -261 95 231 99 -194 251
2185B51j36o13N04J42m75J19L41J65n00J63K26k50k95O71j34k79J19qn3j72L08
$$ 251 115 -498 6 148 -327 -208 133 298 -202 -39 187 -63 -358 313 179 -100 19 11 -42 -214 94
2206I4r9q0R4J25p8l45M13J44m07K64Q7l62m2M41j79l25J33K18j38j45L15q8l60
$$ 94 -5 -85 9 134 56 -289 124 268 -139 125 212 -150 -192 249 70 -255 -122 96 -42 -187 128 40 -320
2229c20L09K6j16k28M67j17l78M23j2j75j35M88k52k29M38J55m95L5M80l08j87
$$ -320 -11 15 -101 -329 138 21 -357 66 54 -121 -256 232 -20 -249 189 344 -151 -116 364 56 -131
2250a31r5O00n64N0L23k05k45J91P4j3J60q2Qj45k22M90L8m97M39K79p26K39J67
$$ -131 -226 374 -190 -140 183 -22 -267 -76 -2 -15 145 63 71 -74 -296 194 232 -265 174 453 -273 -34 133
2273A33j25k71L73j78j97J14K89l14M0K75m7l22M35l1l35RL20j24r0J57j49n3
$$ 133 8 -263 110 -68 -265 -151 138 -176 -136 139 92 -230 205 174 -161 -152 168 44 -46 111 -38 -91
2295i1OJ60J0l85M14p1j66J13K26l06lL59q6k03k4K94m8m26L39N7j53J92o4l71
$$ -91 -85 75 85 -300 114 43 -123 -10 216 -90 -93 266 180 -23 -47 247 199 -227 112 169 16 208 144 -227
2319b27J24K99pk55l0M78o06o3O59l37RQJ37k60k0J53L2o8l5J19k42j63L80k7
$$ -227 -103 196 189 -66 -96 382 -224 -287 372 35 44 52 189 -71 -91 62 94 26 -9 110 -132 -295 85 58
2343E8l44M29l5p1k60L36j95j19J94K97l07k87M99M9l98L28J34k81j72N3K92m58
$$ 58 -286 143 108 37 -223 113 -82 -201 -7 290 -17 -304 195 244 -154 174 308 27 -145 -92 200 -258
2365b58K56L26m24l8K85p5j42N6N8qJ01q5K02l76K93q0r4k48K42kj09J3M60k97
$$ -258 -2 324 -100 -138 147 72 -70 -14 44 36 137 52 254 -122 171 91 -3 -251 -9 -11 -120 -107 353 56
2389E6j81N55j72l66J50J92k27l77M82j8j76N6R1k05K04K9j56J07k62L70k23M2
$$ 56 -125 430 258 -108 42 234 7 -370 112 94 -82 -26 65 -140 64 93 -63 44 -218 152 -71 -29
2411b9J87l54q8J58J41m7j19J51J04k26J92K7l00J50K60j41k57J18lJ38k03M27
$$ -29 158 -196 -284 -126 15 -32 -151 0 104 -122 70 97 -203 -53 207 66 -191 -73 -76 62 -141 286
2433B86l4l67j4L25m71O9M34k76j7K39j7l37J41M07k82l10P5L27l48L6K59r4j15
$$ 286 252 -115 -129 196 -275 -206 228 -48 -65 174 157 -180 -39 368 86 -224 -149 178 -170 -134 125 31 -84
2456h4P8J62j50r4K5n7P3m7K52l59J94K2j5J42K0O7r5j90j50L95l73P4K99j09
$$ -84 -6 156 6 -88 -63 -120 -47 -94 158 -201 -7 15 0 142 162 229 134 -56 -206 189 -184 -110 189 80
2480H0j28K60j89l96N37j40j11N2LK32n0j66J14j92L8J7J22j23J49J3k35J72O9
$$ 80 -48 212 23 -373 164 24 -87 -35 -32 200 150 -16 98 -94 -56 -39 83 -40 109 122 -113 59 128
2503A28j52l04M34J83l82P9J58r6j15L76m02O7j41M55k44j41j00L68l30K29o0
$$ 128 -24 -328 106 289 -93 -14 144 48 -67 309 -93 -26 -167 288 44 -97 -197 171 -159 70 10
2524A0j09j60K78n2o3L13k25J05k73K45J20j38p6J09m5q6Q0J01j96O4J17k16M
$$ 10 -99 -259 19 -33 -96 217 -8 97 -176 69 189 51 -25 84 39 -47 33 134 -62 2 119 -97 -93
2547i3L5J60j99J57Q6m10K49RJ59k39p2L40o5q0OO7r3o7J48l46L02R8k83J19k07
$$ -93 -58 102 -97 60 146 -264 -15 -6 153 -86 -158 182 117 37 43 110 17 -50 98 -248 54 152 -131 -12 -219
2572b19L62j21j00J22j4P6k59M92m91j9M21k36j30J37J0L10n18J05J43k61J87
$$ -219 143 22 -78 44 30 106 -153 339 -152 -171 250 14 -116 21 31 341 -177 -72 71 -190 -3
2593cJ68k15o3J01O6j0p1J50j30n5K58N8j07lK4m1r2n0p3l21L93J05j67J27j44
$$ -3 165 -50 -113 -12 54 44 -27 123 -7 -62 196 254 147 144 168 127 35 -15 -88 -409 -16 89 -78 49 -95
2618i5K78j88j6J65L4j42R1k25j24K56m6j75J14K93j87l96K43K96k13j11K41j85
$$ -95 183 -5 -21 144 178 36 127 -98 -222 34 -12 -187 -73 220 33 -363 -120 176 -37 -148 93 -92
2640i2R2K1m0Q1m4j7R2j22O6M5j30L8Q9O4k14Q7P2kj56j7K17k85K04m2j97N2J0
$$ -92 0 21 -19 62 18 1 93 -29 37 82 -48 -10 79 143 -71 16 88 86 -70 -87 130 -155 49 7 -190 -138 -128
2667a28MJ00p2J38j52l4M30k45p4L2L16l38k40M16j87o8J81Q1l9j65P1P9p0J9
$$ -128 -124 -24 -96 42 -110 -144 286 41 -33 -1 315 -23 -263 153 -34 -102 79 160 121 -44 27 106 36 55
2691E5o6j77K42j10J15M0N5j17p8j82K31J02m42K46J48j88J39J85m17l9K39jN4
$$ 55 -11 -188 54 -56 59 99 154 37 -41 -223 8 110 -332 -86 62 -126 13 198 -219 -258 -19 -20 34
2714C4j11J43j23K7L0K26k08N8L2qk28K07j43J59p2m2O4L9j04M4m6J78r8j6q0
$$ 34 -77 66 -57 -30 0 226 18 76 108 100 -128 79 -64 95 23 -19 45 84 -20 24 -22 156 58 42 -38
2739c8p4J67K7j20P2R0l68K60R9k10R0o1Q4j6R4rk72l8L80n1j13J07k5k08J29
$$ -38 -112 55 82 -38 34 124 -244 16 115 -95 -5 -66 18 2 96 87 -185 -223 157 106 -7 100 75 -133 -4
2764dj64K58j85R8N1k43Q0K78l06N2K13j64k87J26L39l40L49m9K4k06J11J24j63
$$ -4 -168 90 -95 3 54 -189 -109 169 -137 -85 128 -36 -323 -197 142 -198 151 102 126 -80 31 155 -8
2787hp4K93k86j06K89j0j11n8M4M4k4J2N4j57L1O3Q4nj07L52j79j19n7o0P1M6
$$ -8 -82 211 -75 -181 108 98 -13 -71 -27 17 -7 5 59 -98 -67 -4 80 75 -32 320 141 22 -35 -95 -24 22
2813B2k1J98k23J22O5l09J01J90j78Q7l9o8Q2r2K93l51o2J92j3K2LRk11O1J82
$$ 22 1 199 -24 98 163 -146 -45 145 -33 54 15 -53 29 -63 230 -121 -183 9 -4 18 21 30 -181 -120 62
2838F2r2j05R0J30k9j03O8k21Q4K73K3j14oJ9N4j12K86l21L6k29j3L27j95J31
$$ 62 -30 -135 -45 85 56 -47 21 -200 -116 157 180 66 60 79 133 21 307 -14 22 -207 -220 107 -88 43
2862D3l4j23N1Q9k54J46j20K08L4l1K4L9j17K60j37j5j06j23J86j1K2q5lm2J67
$$ 43 9 -114 -63 26 -228 -82 -202 6 40 9 33 72 -45 215 78 63 -43 -166 20 9 31 -54 -57 -99 68
2887F8R9k41M3N9P3k3n1K26k41rK64l50j16L29q5j21k4J84o1j59N7q5P5j2Q1P7
$$ 68 167 -74 -31 28 101 78 27 253 12 3 267 -83 -199 130 45 -76 -100 84 23 -136 -79 -164 -89 -101 -20 57
2913E7l6n6K13k26K53r1m19L27j02J22j51j7J00k26O6J57j60K32N1p9J35l42L00
$$ 57 21 -35 178 -48 205 114 -305 22 -80 42 -109 -126 -26 -252 -186 -29 -189 43 94 15 150 -192 108
2936A08j45OJ3L37j24m17K17L9k69K26mK0p6qL9Mj10Q6p5J7K52j06j06J25j96
$$ 108 -37 -31 -18 319 195 -222 -5 34 -235 -9 -13 7 -69 -77 -38 -34 -144 -58 -133 -116 136 30 -76 49 -147
2961a47J3K94k36n0K83j32P1p7j09J65j13K9J40l79R5J29n1%L3r8R1J01j98J77
$$ -147 -134 160 -76 -126 157 25 96 19 -90 75 -38 -9 131 -248 -153 -24 -75 -75 -42 -140 -49 52 -146 31
2985C1R6Oj17K7J17l18R2J05j12P0P6L8k29L77k47j10P6NNR0P6m26L44m4J9j17
$$ 31 127 133 16 43 160 -158 -66 39 -73 -3 73 111 -118 259 12 -98 -22 -17 -12 78 154 -272 72 28 47 -70
3011g0jK96m28K49j52%P0J23Jm1Q5r8L6j4n4L04l40P0K7m6l6j2K12l39J12J28
$$ -70 -71 225 -203 46 -106 -106 -36 87 88 47 132 34 70 56 2 306 -34 36 63 17 -19 -31 181 -158 -46 82
3037H2k1j26N2j7m0k8K11j17Q0J27j58j46J6O9J17N1j73K60l97J59p8M3M2j66
$$ 82 61 -65 -13 -30 -70 -98 113 -4 76 203 45 -101 -85 -16 101 152 -21 239 -158 1 -77 -34 8 -158
3061a58J75J1mM5j47M6m7J47j18j27L56k10J21q5m0p7J84M4o1K9p1j7J10j30m7
$$ -158 17 28 24 69 -78 -32 -79 68 -50 -177 179 -31 90 5 -35 -112 72 116 55 84 13 -4 106 -24 -71
3086g1K01l41J63j27P4J8J59m3j94K14j0Kl23J56J27j32K05n5j06j07K71k33J44
$$ -71 130 -211 -48 -175 -101 -83 76 33 -161 53 43 45 -278 -122 5 -127 78 23 -83 -190 81 -152 -8
3109hJ5L2k76K88Q9j26q9J96n1J25l84K59j3r1j9J72K4j55q7J22J9n3Ro5O1j9
$$ -8 7 39 -237 51 140 14 -75 121 70 195 -189 70 57 -34 -53 119 143 -12 -99 23 42 -11 -2 -67 -6 -25
3135b5J32p5j23R1L3R0k17p5K52J38j95n5J10j85K47q2M3j2k68J73pj12j52R6
$$ -25 107 32 -91 0 33 123 -94 -169 83 221 26 -29 81 -104 143 61 104 92 -176 -3 -10 -122 -274 -178
3159a78J08k1J28R7j82J06L7j70PQ4M6J23j60m5k21J63L64k69Q6n2j15P5o0m3
$$ -178 -70 -91 37 134 -48 58 95 -75 -68 16 62 185 25 -20 -241 -78 286 17 103 51 -64 11 -49 -92
3183i2J12j05J27j73K44L1j34J95r4j84N8J33k29J40j89R5o7K43J5r3m5M8l0k16
$$ -92 20 -85 42 -131 113 144 10 205 111 -73 -15 118 -111 29 -160 -65 -132 111 126 33 -12 36 6 -210
3207b10K32j50q7N9L19j31j59L03k60K3J4K2N6l3n8J62k44L19j88M3q5N9l4n9
$$ -210 22 -128 -215 -156 163 32 -127 176 -84 -61 -47 -25 31 -2 -60 102 -142 177 -11 32 -53 6 -28 -87
3231h7R5j43O2l2Q8J13j9m3J5p9LJ68j00o5q2J84N0q6N1j30p7M9n0K29k10N2K0
$$ -87 8 -135 -73 -105 -17 96 77 34 49 -30 -27 141 41 -24 -106 78 128 42 93 -37 -114 -65 -115 114 -96 -44 -24
3258b4m4K67l53L30m22K15K5nk0M9j15J12n3J52j34J54l71K76K7qJ33m63K22L1
$$ -24 -68 199 -154 176 -246 -31 -6 -11 -31 18 -97 15 -38 114 -20 134 -237 39 66 58 191 -272 -50 -19
3282a9j78J37J11k72L76k47K12j75o9r7L28k24q5K50j18MJ70k52K04n7q1J33n4
$$ -19 -197 -60 51 -221 155 -92 120 -55 -124 -221 107 -117 -202 48 -70 -66 104 -148 56 -1 -82 51 -3
3305ck1J91j95j08K43r4J26k9k39J77k41L04k16J16J8j38P3L7J61k8j68o6R7M4
$$ -3 -24 167 -28 -136 107 13 139 110 -129 48 -193 111 -105 11 29 -109 -36 1 162 134 -34 -100 -3 41
3329D1j79n9M45l84R5J8j87L08m5J07l25J34Q2j57k6J26J80k91J87K21l33K10
$$ 41 -138 -197 248 -136 -41 -23 -210 98 53 160 -165 -31 51 -106 -132 -6 174 -117 70 291 -42 168
3351A68j05j37O9K16j26r7K63l50PJ35J81k06M9m4r8L2k4J53j37N7L4o0n7L20
$$ 168 63 -74 -5 211 85 -12 251 -99 -92 43 224 18 67 23 -75 -43 -67 86 -51 6 40 -20 -77 243
3375B43K5k44j69O1o9J94J92l21N0J05n5n4J34k03K1m7J56j84J72M3q8K3OK5l7
$$ 243 268 24 -145 -84 -153 41 233 -88 -38 67 12 -42 92 -111 -90 -137 19 -165 7 50 -38 -15 -9 16 -21
3400b1J77j92J04N7p5k28J77O5L3l40K51O7k38J65J92q7j51m4L3p8K08J2p2J48
$$ -21 156 -36 68 125 50 -178 -1 64 97 -243 8 75 -163 2 194 107 -44 -88 -55 -133 75 87 15 163
3424A63Ll73K59jj7R0n6R6j24N6L2j52k2J9K07k68j24K71J42n5j81J92q8p4N1
$$ 163 166 -207 52 51 34 124 68 164 40 96 128 -24 -46 -27 180 -88 -212 59 201 146 -35 157 69 -5 46
3449D6k12L10p3O0r8o8j0NLJ24o2J28l66P0n5J97k4L2k30K96q7j07J57q6K8L46
$$ 46 -166 144 71 131 33 -35 -45 -40 -37 87 25 153 -213 -143 -198 -1 -25 7 -223 73 -14 -121 36 -50 -22 324
3475C24m68K77j09o3K50j60k78K77J02k47O0j9N1Q7k14j20L08m7J89j51j24K55
$$ 324 -144 133 24 -39 211 51 -227 50 152 -95 -35 -54 -3 84 -130 -250 58 11 200 49 -75 180
3497A80j49RnN0j59J77k13J30j16O5J51j80J25L0k67L13j78J13J11l0o9j39M7
$$ 180 31 40 35 85 -74 103 -110 20 -96 -31 120 -60 65 95 -172 141 -37 76 187 157 88 -51 -4
3520dPO7r9R6K74k35L6k09J13o4nP7J24j68l49M28k86lJ43p0J02J73j07o9Q3j23
$$ -4 3 70 -29 67 341 106 142 -67 46 -18 -23 54 178 10 -339 89 -197 -200 -57 -127 -25 148 41 -28 55 -68
3546f8J4l2J93M4r4j85J50k14L34l14M4O2J49k2r1J09PJ96k46p1pJ19m3j05K4
$$ -68 -54 -86 107 151 57 -128 22 -192 142 -172 -128 -66 83 61 -30 79 86 282 36 -35 -42 77 34 -71 -47
3571d7J59j35M1j0j59J6K42j01l29L54mk45O2m8Q1L20j83R9k08JN5N7K11k36k
$$ -47 112 -23 18 8 -151 -135 107 6 -323 31 27 -218 -156 -204 -123 197 14 113 -95 -94 -39 18 229 -7 -9
3596ij29O2R8K7O3q8OK52j43L9j95o2L01k6l78K16n9J10j15J20k13Q5N9J30k02
$$ -9 -138 -76 22 49 112 24 30 282 139 178 -17 -79 222 196 -182 34 -25 85 -30 90 -123 -38 21 151 -51
3621e1J35q2Q1K4j88Q3J75j18n2j06J54j09Q4P6q5k5o5K21k22N8K08q5l82L65
$$ -51 84 2 83 107 -81 2 177 59 7 -99 55 -54 30 106 21 -4 -69 152 -70 -12 196 111 -271 94
3645I4p8j91K33k94J6J60K61j75k71M00j76j00o3M74m83QK59q8N9p1r6K24KK3
$$ 94 16 -175 58 -236 -220 -60 201 26 -245 155 -21 -121 -184 290 -193 -185 74 -14 45 -26 -122 102 104 127
3669A27o5J45k04p2J42p9M4J3j18K11j64P6j01j33K87j62P9j11K61p1N6n2k21
$$ 127 62 207 3 -69 73 -6 38 51 -67 144 -20 56 -45 -178 109 -53 26 -85 176 105 161 109 -112
3692a12K15q4l8r9J19J32p8p4J43k12K0K42k07p8LR3K3j5N6q3L8K5M7M2o8q3r
$$ -112 103 19 -19 -118 1 133 55 -19 124 -88 -68 174 -33 -111 -108 -15 8 -7 49 -34 4 29 76 118 50 -33 -42
3719d2K04j98J70j27p1R2j94k3M26k98m8R2j15J26p5QQ8m9P0J6M8l2j09N1%Oq
$$ -42 162 -36 134 7 -64 28 -166 -189 237 -61 -109 -17 -132 -6 -81 -73 15 -34 36 52 100 68 -41 10 10 16 8
3746HJ15l15J31pOkJ62M4j92J04P8l77J50R7n6J16ol8N9j22K3J55k13j26K89J1
$$ 8 123 -192 -61 -68 -62 -64 98 142 -50 54 132 -245 -95 2 -54 62 56 18 77 -45 -22 133 -80 -206 83 94
3772I4k41K9M%J64p2J73j87L0M3K4j62J51J27k62p9J85r3j10L21l13J26J82j06
$$ 94 -147 -118 -114 -114 50 -22 151 -36 -6 37 61 -101 50 177 -85 -164 21 -72 -182 139 -174 -48 134 28
3796B8n4K7k2J84j94J91j58j42K9P0L14j72q1O7RJ7j7m8j15r6K42j18Q2n0j8j5
$$ 28 -26 1 -21 163 -31 160 2 -140 -111 -41 273 101 20 87 96 113 96 48 -67 -163 79 -39 43 -7 -25 -40
3822d0p0K07J2K4K3k9j94R1O0j74L1J04j97J73j18nK29k76K50N8k68J92J4l36
$$ -40 -110 97 109 133 156 127 -67 24 84 -90 -59 45 -152 21 -97 -102 127 -149 101 159 -109 83 97 -239
3846b39K09J77p3m2Q2r9L2j17J14n3K7J68q8M7k03l8J18l5R2j08j01K44j22j32
$$ -239 -30 147 74 32 114 15 47 -70 44 -9 18 186 98 145 -58 -96 22 -13 79 -29 -130 114 -8 -140
3870a40K72k20j6j7J03kM6J8j6M5J74n88N63k18j95K84M5k31L6J57l54K36k0Q
$$ -140 132 -88 -104 -121 -18 -20 26 44 28 73 247 -341 222 4 -191 93 138 -93 -57 100 -254 -18 -38 -30
3894c0K3J02k14J79l2k2N5J10k7j79J10q7l0K49j87Q1P9k74K12k63O8N2n1O5j3
$$ -30 -7 95 -119 60 28 6 61 171 144 -35 75 -12 -42 207 20 101 180 -94 118 -145 -77 -25 -76 -11 -24
3919b4l5K02k52K08p5lJ10j07O5o9j47J38j52J16j35P2J08RM1N4J9k11K14o7o
$$ -24 -59 143 -109 99 24 21 131 24 89 20 -127 11 -141 -25 -160 -88 20 29 70 124 143 -68 146 79 73
3944G3L0P3j32k15K61J8j89j7K10n4l9J39m36K85M5q2Lp0m7L37k55K8L05m46N
$$ 73 103 176 44 -171 90 108 -81 -98 112 58 19 158 -278 7 52 -30 -27 -97 -144 193 -62 -34 271 -175 -170
3969a70Q8J0J10R2K1j62L0n1QJ05K1j68P4O0j28K19n0j25Q7M5q7K7j46J23j90
$$ -170 -82 -72 38 130 151 -11 19 -32 -24 81 102 -66 8 68 -60 159 109 -16 71 116 29 56 -90 33 -157
3994a57J36K72l84o7J48M6M7n8K32m38J85m5K43j06M9N0l42J92l8R4J03j54R2
$$ -157 -21 251 -133 -200 -52 -6 41 -17 215 -223 -38 -83 160 54 103 153 -189 3 -35 59 162 8 100
4017A00j01m6K2n1K69k29j34L2J17J90m21M03o5J6r0P6j47j6l7k6J77l3Jn5J41
$$ 100 -1 -47 -25 -76 193 -36 -170 -138 -21 169 -252 151 86 102 12 88 -59 -75 -112 -138 39 6 7 -48 93
4042I3j49J16O3j43o0j5jR3O5O6l07K14j12Q8m5J58k1j68J34n8o0r9K55j61L2
$$ 93 -56 60 123 -20 -80 -95 -96 -3 62 128 -179 35 -77 11 -34 124 103 -65 69 11 -49 -148 107 -54 -22
4067b2J53k55J46k00J65j7n3J59rn2L8K7k9m6L3K3j8L1m4k10Q4P5O5K11n58L75
$$ -22 131 -124 22 -178 -13 -30 -83 76 67 15 53 80 51 5 38 61 43 74 30 -180 -96 -21 44 255 -303 72
4093G2L6k06J23j6R7k29J66J02k18J42l0r6K5J70k10PJ66q8k6j84K03Q7j23L6
$$ 72 108 -98 25 9 106 -123 43 145 -73 69 39 -57 -32 138 -72 -65 101 13 -13 -197 6 93 -30 6
4117FJ6L4j15K0K07j33l5j8LK6J43j75L7J19j67Q2k8l6r0K16j25J42k53P7j95
$$ 6 22 56 -59 -39 168 35 0 -18 -15 11 154 -21 16 135 -32 50 22 -14 -104 112 -13 129 -124 -47 -242
4142b42J95J05LK8k11L29k95K09J1j55j82J05J71n7r5L6rJ08k9j20K63ll94J39
$$ -242 -47 58 61 89 -122 207 -88 121 132 -23 -205 -100 71 14 -81 -45 -54 54 25 -95 168 165 -229 -90
4166i0N4j98L9K35M2J56l62OJ18j02K1k19J34M17l26J02M3o9K7q6L25k72r7J70
$$ -90 -36 -234 -195 40 82 238 -124 -118 0 -102 -81 -300 -166 251 -75 27 70 1 28 -58 267 -5 -102 68
4190F8q7j8O7P8j14q0j1J09j42R2j07J25K34k29p5J70K0j37M1k4k1N2J08q8r4
$$ 68 -19 -37 30 108 -6 -86 -97 12 -130 -38 -145 -20 214 -15 -90 80 100 -37 4 -20 -41 11 119 31 -63
4215f3J8l0J18j52J97K3j62R8J1j14J2Q9j97K83k1k50J63R3P2k43M8j77%L83j14
$$ -63 -45 -75 43 -109 88 111 -51 47 58 -56 -44 45 -152 131 110 -140 23 116 188 -55 -7 -184 -184 199 85
4240H5K9j20j69K87p5j09K12k29J62j02L9q3K47k84P5J99k84QJ77N7k60J81J03
$$ 85 114 -6 -175 112 37 -72 140 -89 73 -29 10 -73 174 -110 -35 164 -120 -112 65 122 -138 43 146
4263A46j89O6Q5q8n4j81J21J37L33l76J10k13K73K9j14p8R6o6k8j11K05l5j3j00
$$ 146 -43 23 108 20 -34 -215 -94 43 376 0 110 -103 170 199 85 7 103 37 9 -102 103 68 55 -45
4287d5K1j95L44j33J09m8R1k19m1R8J23k0j50L8q7J60p8P6L1k0k0r1J44R8k51
$$ -45 -24 -219 125 -8 101 53 144 -75 -116 -18 105 85 -65 -27 -114 46 -32 44 75 55 35 -56 88 186 -65
4312f5l2Q1k8L11j41j94J36P5r9k8np9J26k7N8J33k26K47j86j97R9k7p0M9n4m1
$$ -65 -97 -16 -44 267 126 -68 68 143 44 16 11 -68 58 31 89 222 -4 243 57 -140 -41 -68 -138 -89 -143 -184
4338a84N5J47N5L3N9j48J27l92J25J16j36L78l09L5J08j52J0K1J85k99K02L1j37
$$ -184 -129 18 73 106 165 17 144 -248 -123 -7 -143 235 -74 -39 69 -83 -73 -52 133 -166 36 67 -70
4361g0M1l3K74nQ0k81p2l1n1J80m1O3l8Q3r7l4J98j62L0j73P5K16KJ16j79q7J22
$$ -70 -29 -62 212 207 287 6 -66 -97 -148 32 -9 54 16 99 2 -32 166 4 34 -139 -64 152 154 270 91 4 126
4388A26j7p1j08R4j25J99r0k9N3r0r4M03r4j13K4J41p8O3j32P6j11q8L1j8Q9k21
$$ 126 109 38 -70 24 -101 98 8 -21 32 -58 -152 251 157 44 68 209 131 194 62 138 27 -61 -30 -48 41 -180
4414a80L28l4l0k01p7P8PJ61k14L42k93K56j97J50k97M8K27p4P9n2N3k38L50l05
$$ -180 148 114 84 -117 -194 -116 -109 52 -162 180 -113 143 -54 96 -201 -153 74 0 79 27 80 -158 192 -113
4438a13R3M7N0j86J10j05J50j49j82N20k50j33J46O0k19j1O8q8J08K17l0j87K41
$$ -113 -20 27 77 -109 1 -104 46 -103 -285 235 -15 -148 -2 58 -161 -172 -104 -192 -84 133 103 -84 157
4461A57qK0k57Q0J01j60K07j53K20j59l47L99j03j38J24L2N0j21j1P4n6J3J06
$$ 157 149 169 -88 -8 93 -67 140 -13 207 48 -299 100 -3 -141 -17 15 65 -56 -67 7 -49 -36 70
4484G0j52ML5O2l9lj04K57j36J6mo9J21J7Mo0O4oq7K3J81j19j51j1O0K72k85M5
$$ 70 -82 -78 -43 19 -20 -23 -127 130 -6 10 6 -63 58 75 79 19 83 77 -10 13 194 75 -76 -87 -27 245 -40 5
4512Ej6J88n2j01j76M4J57n0J29j98J7j49O1Lp0M49l04K8P6J4l6O0k27J75j23
$$ 5 -11 177 125 24 -152 -108 49 -1 128 -70 -53 -202 -141 -138 -208 241 -63 -35 41 55 19 79 -148 27 -96
4537i6J94j14j9j1K3L8m1M6N0l3K1j26j11j22L46j7j00J25J18o5j6o0r5N5o8K51
$$ -96 98 -16 -35 -46 -23 15 -26 20 70 37 58 -68 -179 -301 45 28 -72 53 171 106 90 30 -65 -10 -78 173
4563A73n3j96J29LJ0p1J19Nj09o8L45n9k58K5K24q0j34K8k4j04J79J22k58%L0
$$ 173 120 -76 53 56 66 -5 114 119 10 -58 287 228 -30 -5 219 139 5 33 9 -95 84 206 -52 -52 -22
4588b2P4k03M50k60j38Q3O7j62K4K24k32J40j92k1J62N5J40j99L6p8o1K83n7r
$$ -22 52 -151 299 39 -99 -16 51 -111 -87 137 -95 45 -147 -168 -6 49 189 -10 26 -52 -113 170 113 104
4612A04j1k3o1k07J78J53o4k11J95j44J85n4n8J70j79J19o2QJ03r0j72J73P6q2
$$ 104 93 70 9 -198 -20 133 69 -142 53 -91 94 40 -18 152 -27 92 30 38 141 51 -121 52 128 46
4636D6R4j76R4Q2J6l25M64k90R4j97n4J91p2nk23N18j32p4m3k14J47K43k29N2
$$ 46 140 -36 58 140 156 -169 295 5 99 -98 -152 39 -33 -38 -261 257 125 51 8 -206 -59 184 -45 7
4660GN6j6r9J01k59L34P1l72J88n9q1K4K54j63M3r1j32J75j13K41k10J3O7j57
$$ 7 63 47 -52 49 -210 124 195 -177 11 -48 -129 -105 149 -14 29 -62 -194 -19 -132 109 -101 -88 -21 -178
4684a78J95n5P5j14j8l2k8N9M1JQ7j54L63j23q2j13K27p4j77L7Q1k26K21o4O4
$$ -178 17 -38 37 -77 -95 -127 -155 -96 -55 -54 33 -121 242 119 37 -76 151 77 -100 -63 18 -208 13 -51 13
4709A3Q2q2j41K23j64j75K72j43m1K5J18mm3N1j48N6O3l9l6K29j44j58J96mP7
$$ 13 95 13 -128 95 -69 -244 28 -115 -156 -131 -13 -17 -60 -9 -157 -101 -38 -77 -113 116 -28 -186 10 6 83
4734H3kL3p6qN5k12J76q0j7L70k52j0j04k0n8K2k7R2P6j58J81q4q2K20r8j05O0
$$ 83 81 114 38 30 85 -127 49 -31 -48 322 70 60 -44 -64 -122 -100 -127 -35 41 -117 64 -20 -102 118 20 -85 -25
4761b5o1J03p4k44M28m17K04K06o9M2n6P1Mk17N3L7p5R3p7J83o9pl8M6j74OP4
$$ -25 -86 17 -57 -301 127 -290 -86 120 51 93 37 108 112 -105 -52 -15 -90 3 -74 109 40 33 -5 41 -133 -127 -53
4788e3pj32J98o0N4K8q9J3N8j84L4K03j75L37k53N8m1L9m4J3L52n76J77J64k08
$$ -53 -60 -192 6 -54 0 28 -61 -48 10 -174 -140 63 -112 225 -28 30 -11 28 -16 -3 349 -227 -50 114 -94
4813i4R4K09j05J07k11J06k15J26J2nr4J70j39J9J47M4k17K48k21q1k1K19k85
$$ -94 0 209 104 211 0 106 -109 17 29 24 -70 100 -39 -20 127 171 -46 202 -19 -100 -121 98 -187
4836a87J4K8j1K96l05P9P3J86j94QJ27j49P6j02p4K05l5k1r8L1K56l43K70k49
$$ -187 -173 -145 -156 140 -165 -86 -13 173 -21 -13 114 -35 41 -61 -135 70 35 14 -84 -53 203 -140 130 -119
4860a19K0j33K47l0l6Ln7K85k94J61k29M2l2J8J29J6J11j82J36J09k65J67n2M5
$$ -119 -99 -232 15 -15 -51 -48 -105 180 -114 47 -182 -140 -172 -154 -25 -9 102 -80 56 165 -100 67 15 60
4884F0j25k2j61J21O9J33Q6j98Q2K6j36K28M4j06r1L8N9j31J00l0q3J95k23R1
$$ 60 -65 -87 -248 -127 -58 75 161 -37 45 71 -65 163 207 101 10 48 107 -24 76 46 -37 158 -65 26
4908B6j43L9J0J39k5M0k84J55n6J60l33M41k14N6j04R6J15q1k85J62k5J77j04
$$ 26 -117 -78 -68 71 46 86 -198 -43 -99 61 -272 169 -45 11 -93 3 118 37 -248 -86 -111 66 -38
4931c8Qo1Q1m3M53l41j55N5q3M8L40j43j7p5j85K91k51J65n2R9j50L4J1J21k63
$$ -38 -30 -91 -10 -53 400 59 -96 -41 -124 -76 264 121 104 29 -156 135 -116 49 -3 96 -54 -20 -9 112 -151
4956a51L29p9j83J69J71Qk05j5j80j1N1J15J38j79K7r8J13k6n2M4j2J50p7l17
$$ -151 178 99 -84 85 256 264 59 44 -136 -147 -96 19 157 -22 5 -93 20 -6 -58 -14 -26 124 47 -270
4980b70J87J01pk0l2J8m8J73p0N5L3om5Jl2m5j4k15L11mp3M5k85N24j45k42K36
$$ -270 -83 18 11 -9 -41 -23 -71 102 32 87 120 114 69 70 38 -7 -21 -236 75 71 -2 43 -242 282 137 -105 131
5007A31K5l32J05J22q6l2K51q7L1j81J74k49J57j82J96l2j41O4Q1j66N4N5o1M3
$$ 131 156 -176 -71 51 -35 -67 184 97 128 -53 121 -128 29 -153 43 11 -130 -66 15 -151 -97 -42 -103 -60
5031f0M6L9R3J6p7O8j40p5p6J19N7Jq7K92k12l39L92oj4o3m3R3PK6j79J11R3N
$$ -60 -14 25 118 134 57 125 -15 -90 -166 -47 10 11 -76 216 4 -335 57 51 37 -26 -69 24 31 57 -122 -11 82 87
5059H7k95J91J36j38Q6j83J53J56j04j21r5K39M1R1j90N0l30J23M2M4j17n1K04
$$ 87 -208 -17 119 -19 67 -116 37 193 89 -32 -127 112 153 244 54 104 -226 -103 -61 -17 -134 -185 19
5082A9k16K39j4m1o9O4o2N1K57l19M0N5j05m1L48p9q0J23j73j97L05l5k23K62
$$ 19 -197 42 28 -13 -82 -18 -80 -29 228 -91 -51 4 -101 -142 206 127 47 170 -3 -200 105 70 -153 109
5106A09j4n0J00j02j36J22r3k6J5K67j80k9k90M72k48P1R7k37K27j41J71m0n5
$$ 109 95 45 145 43 -93 29 -64 -90 -75 192 12 -17 -307 165 -83 -12 85 -152 75 -66 105 65 10
5129A0K42k93J06j75O9K2J28k4j39R3j04N7K48l84l0J88k42K93l7M2j58LJ03q8
$$ 10 252 -41 65 -110 -41 -19 109 85 -54 39 -65 -8 240 -144 -174 14 -228 65 28 70 -88 -85 18 -70
5153g0L40J8k16l9j25J01j03J46k45k6K46p3k70L34l6O5k07J47L4L5J57k20o2
$$ -70 270 288 72 33 -92 9 -94 52 -193 -219 27 -46 -316 18 -18 47 -160 -13 21 56 213 -7 -69
5176f9J5j98J09L42j03J37k34m0K61l36j40K73q3K81j67Q3L3j89J32l1j24N5K22
$$ -69 -54 -252 -143 199 96 233 -1 -41 220 -116 -256 17 -66 215 48 131 164 -25 107 76 -48 7 229
5199B29k39P4j61J37p6J23J24l33J54j3o0l1j80J57n6R7n3J76o6j48J13O4K50
$$ 229 -10 64 -97 40 -36 87 211 -122 32 19 -41 -72 -252 -95 -151 -54 -107 69 3 -145 -32 32 282
5222B82l53J75P7l47J20K45k7j44l4L9P2p5r7Q4J26j37J33L9k17J36l7j38K04
$$ 282 -71 104 181 -166 -46 199 172 28 -6 33 105 30 -67 17 143 6 139 178 -39 97 60 -78 126
5245A26j26J3p4K02r8M4k1K4q7m9K81l46J66l8J01j55K41l89K48j03J54P1l08
$$ 126 0 13 -61 141 43 87 66 90 3 -46 235 -111 55 17 118 -37 204 -185 63 -40 114 185 -123
5268a23K36j21O9k36J94j82J80J46k53j07L17j91K68j87J67k08r2K38J24k69J79
$$ -123 113 -8 61 -175 19 -163 17 163 -90 -197 120 -71 197 10 177 -31 -123 115 239 -30 149
5289A49o3o0p7M0Q9l18L76q4j45m4Q4M0J25k28J26N2j15M6j61K77l7j50J81n9
$$ 149 86 26 -51 -11 78 -240 136 52 -93 -137 -53 -13 112 -116 10 62 -53 -7 -168 109 72 -78 103 44
5313D4m2j6j98K12N5m5q0R8J32k70J76k21K28q9J0J80j86j67J17K68n8j34N0N6
$$ 44 2 -14 -212 0 55 10 -70 28 160 -110 66 -155 73 -16 -6 174 -12 -179 -62 206 148 14 64 120
5337A20j92J61j96M1k00L46l39M18o1K0L9j99j9J28J85j51j03j83R2m9J48n6Q
$$ 120 -72 89 -107 -66 -266 80 -259 159 98 118 157 -42 -61 67 252 101 -2 -185 -93 -142 6 -50 -42
5360d2K12k12J13j59J73r4k5P2j97P2K57k8k35J38j03p0J50J07k41j9m6J37L24
$$ -42 170 -42 71 -88 85 -9 -34 38 -159 -87 170 142 -93 45 -58 -128 22 129 -112 -131 -177 -40 284
5383B84k24N6o8k09K31K6r1o4k9Jj27L22j70K57k58J01j25K64j65Q5j14r3J20
$$ 284 60 116 48 -161 70 96 5 -59 -88 -87 -214 108 -62 195 -63 38 -87 177 12 97 -17 -110 10
5406A0m9o5K12j32j47L05K0j70j19K85j01j14P8m2j04m1J2L20q3k05R3P7J7j78
$$ 10 -39 -104 108 -24 -171 134 154 -16 -135 150 49 -65 13 -29 -133 -174 -162 158 75 -130 -37 40 57 -121
5430a21J36K4o7R2j60K81Q1j93L2N0l22J13J62j22J9j59K67o6M0j94k9K18j30
$$ -121 15 39 -28 64 -96 185 266 73 105 155 -167 -54 108 -14 5 -154 113 47 87 -107 -136 82 -48
5453d8P1J49j41Q8j47j24k5o5J73j33q4K40r3L4l3J3J40J50k2j21N8M8r2j56m
$$ -48 23 172 31 119 -28 -152 -177 -242 -69 -202 -286 -46 -139 -105 -138 -125 15 165 143 22 80 128 36 -120 -124
5478a24J71K%K4o5Q5q3J4k4Ol4J91k44J8O6M4k16K72j13L4P9j9p2m4J16jj65N6
$$ -124 47 49 49 73 8 93 10 24 0 6 -28 163 -81 -63 3 47 -169 103 -10 24 103 84 12 -32 84 83 -82 -26
5506b6J10j18M4K12k87L6J7j08J69j07M9j63L63l85L69N1k04o3j02K59N6r1m8
$$ -26 84 -34 10 222 -65 -29 -12 -120 49 -58 -9 -172 191 -194 175 226 22 -41 -143 116 172 81 33
5529C3j63K2L10l23K03k1j0j57J02J40n0n7j44N7K5J52r3j38O5J47J13k43M2P
$$ 33 -130 -108 202 -121 82 61 51 -106 -4 136 86 29 -115 -58 -33 119 26 -112 -47 100 213 -30 12 19
5553A9j28K14m4Q6j94j4p1J77j11J86j12j55J31L4k6n5K83j25l35J54J16L6j75
$$ 19 -109 105 61 147 -47 -61 -132 45 -66 120 8 -147 -16 18 -8 -63 220 95 -240 -86 30 66 -109
5576a09Q4R6l17J61r8K67k97L7L5K70p5m4m5OP9K9L7j42J39p0j29J43r1l0Mq3
$$ -109 -25 71 -246 -85 -183 84 -213 -176 -141 129 54 10 -35 -29 50 79 116 -26 113 43 -86 57 -34 -64 -60 -143
5602a43J02q5Q1N0P7j22j00K11l4j02J53Q1j9q0k35N8O1R4r9j27JJ66K6o9K70
$$ -143 -41 -126 -45 5 82 -40 -140 71 37 -65 88 169 150 70 -165 -107 -46 48 -51 -178 -177 -11 15 -54 216
5627B16k69J73r2P0l1j50L8O2j0R7j16o7J24l6n4NJ45o2mK25l25J83k50J59pm4
$$ 216 -53 120 28 98 67 -83 -45 17 7 104 -12 -79 45 9 -45 -40 105 43 39 264 -61 122 -128 31 24 -20
5653b0J88j72n0K15k62K19k36R1O6p8k9J00k7p6J72j37n0J47j57J24j22J68j4
$$ -20 168 -4 -54 161 -101 118 -118 -27 39 -39 -68 32 5 -71 101 -36 -86 61 -96 28 -94 74 60
5676F0k16K00r3M3N3l5J92l59J24k0j93L92m27M50k12L4n1J10L1j32K04k94o5
$$ 60 -156 44 -49 -6 47 12 204 -155 -31 -51 -244 148 -279 171 -41 -7 -58 52 83 -49 155 -139 -204
5699b04J17j23J91LQ8j98K88j36M8K1n5Q2o4j43J65nj64J50k0k76J20K83j72k93
$$ -204 -87 -210 -19 -16 72 -126 162 26 74 95 40 122 58 -85 80 75 -89 61 41 -235 -115 168 -4 -297
5723b97K91J7n6K56k62J08l9j42l1M2K25m3L9k20J88O8k55J08J3q6j46K10j04
$$ -297 -6 11 -45 211 -51 57 18 -124 -155 -113 112 69 108 -112 76 144 -111 -3 10 -76 -222 -12 -116
5746a16J3L36j38j85J9O7JJ50k44J50j83J97j44J11n2P4M9k11K46j17MO9j02O7
$$ -116 -103 233 95 -90 -71 -4 -3 147 -97 53 -130 67 -77 34 -18 56 105 -106 140 23 27 96 -6 61
5770F1j19K67k48J31M3o4R7j56J48k76O1J35K6k07J44j34J21p0j3Q3q6N2K97l78
$$ 61 -58 209 -39 92 135 71 168 12 160 -116 -55 80 106 -101 43 -91 30 -40 -53 30 -56 -4 293 -85
5794h5J31O5lj0k27J58j5M6k77K22L27k26j50N7L1L0j60K63j02r5j02Q3J43n4
$$ -85 46 111 108 98 -129 29 14 60 -217 5 332 106 -44 13 44 74 -86 177 75 -20 -122 -39 104 50
5818E0JQJ88l98K27j06J36j35k04J10L95k57j49J38Qj33m8Q9J62j39K1L0L6J49
$$ 50 51 59 247 -151 76 -30 106 -29 -233 -123 272 15 -134 4 12 -121 -169 -80 82 -57 -36 -6 30 179
5842A79m23K03OJ14m5p3K37k22J05l3J00j31l16L10L0R6j92r2Q9j13K29r7J43
$$ 179 -244 -41 -35 79 34 -39 198 -24 81 48 148 17 -299 11 41 137 -55 -147 -58 -171 58 -39 104
5865A04k5j57j28L35j82J23k33M6J40o7MON0J1J12j16j4J66j32M5j52j40L43k3
$$ 104 79 -78 -206 129 -53 70 -163 -117 23 -44 -40 -34 16 27 139 23 9 175 43 88 -64 -204 139 116
5889A16k07R7J67l2Nj36O1qr4J65j42J55k3k01K08Q9j9j05j77J18N5K0K0j55o6
$$ 116 -91 6 173 141 146 10 71 63 -31 134 -8 147 124 -77 131 220 201 96 -81 37 92 112 132 -23 -89
5914h9k09J92J75j60J56j7m9M2N3J59l81J61P1j11j13Q5J76k55oL32j62J8k4l1
$$ -89 -298 -106 69 -91 65 48 -1 41 94 253 -128 33 104 -7 -120 -35 141 -114 -120 212 50 68 44 13
5938A3k8J31j87J66j08k5k2O9j12L01j51L4k30n3L32p6o1p2O5m6O7kJ20q0L8l10
$$ 13 -15 116 -71 95 -13 -38 -60 9 -103 198 47 81 -149 -202 130 54 -7 -79 -14 -60 7 5 125 45 83 -227
5964b27K02J5Pj53J63K6p8J08p0o3K28j93j4J4J73j34M3m3j63J97j39J37j72K46
$$ -227 -25 -10 -3 -156 7 33 -45 63 -7 -70 158 -35 -49 -35 138 4 47 4 -159 38 -101 36 -136 110
5988A10l44K41o1J38k95J28J72L3j18Jj8j36K92m66J39J56kk0j18J59J3q5kJ20
$$ 110 -234 7 -54 84 -211 -83 89 122 4 5 -13 -149 143 -323 -184 -28 -30 -50 -168 -9 4 -81 -83 37
6012C7J3j87K16n4Q0k58L74m4k81N1K16l37K54p0Lj21J76K8q1rqJ54j3j15J04
$$ 37 50 -137 79 25 105 -153 221 177 -104 -53 163 -174 80 10 13 -108 68 96 15 6 -2 152 139 24 128
6037A28p3L6j38N8J46l27J72P8J7j61K09k13K6L4j10O5p0m9K26j14J18p3J90j44
$$ 128 55 91 -47 11 157 -170 2 80 97 -64 145 -68 -42 -8 -118 -53 -123 -172 54 -60 58 -15 175 31
6061C1n4K0j2o6N5J13r7R4j32O3n0J10l90K97L05m26n1L14Q9j83l5p5O8L6j35
$$ 31 -23 -3 -15 -81 -26 87 -10 84 -48 15 -35 75 -315 -18 287 -139 -190 124 213 30 -5 -80 -12 24 -111
6086a11R9P4j74O2KO7R3Lm6Q1Mk66J17j50J56J2J3j08J14M8q7J08P9k65K5J78
$$ -111 -12 62 -112 -50 -48 19 112 115 69 150 154 -112 5 -145 11 23 36 -72 42 90 3 111 190 -75 -50 128
6112A28K2kL1j14j40J39r6K45j71k30K31k31qP1m4J85M1l41K75R5Kk21j0k9M64
$$ 128 150 148 179 65 -75 64 -32 213 42 -188 43 -188 -196 -125 -169 16 57 -284 -9 86 88 -133 -143 -172 292
6137B92l78J94j38j92L26r3J66k32R2k01J54M6j68J81M0N7k9p5J0m3Q3j53O3k97
$$ 292 -86 108 -30 -222 104 11 177 -55 37 -164 -10 36 -132 49 89 146 117 42 52 9 92 -61 2 -295
6161b95N67j11j98j44K61p3o6nl4J83j69K70k46M0J87j61M8M2M6k07J52J2k68
$$ -295 272 161 -37 -181 80 7 -59 -64 -98 85 -84 186 -60 -20 167 6 54 96 142 -65 87 99 -169
6184a69J26L4n4R9Rj1k94L30K6j57k5O2m7K8J78l06K37M1k97L08J1p4p4o5J7J74
$$ -169 -43 -9 -63 36 45 34 -260 70 96 -61 -86 -24 -71 -43 135 -171 66 107 -190 118 129 55 -19 -84 -67 107
6210A07j7k3j45R4J88l27L92j27j41j26J79m3o5PK00o7L3q5j64j3J03J08j23J0
$$ 107 90 67 -78 16 204 -123 269 142 1 -125 54 11 -54 -47 153 86 119 34 -130 -143 -40 68 -55 -45
6234d5jJ0K65k56O8K6j49R4k34K58Ql41K0L73j26N6P2j01R5M0j36o6R1r3O6KO9
$$ -45 -46 -36 229 -27 41 67 -82 12 -222 36 44 -297 -277 96 -30 26 98 -3 92 132 -4 -70 21 -72 -6 -4 65
6261F5r5m2q2J93J34p1P6Nl91K48J04k10r8L72k71L9L25l21k0p7J58k3O3J73j77
$$ 65 -30 -72 -154 39 173 102 178 183 -208 40 144 -66 -164 208 -63 -24 301 -20 -40 -117 41 18 81 254 77
6286G7j52M0R1l1P2j36l7J50k48K83l01L9l9J75m1o5j24L39j79Q2l1J92j03l11
$$ 77 -75 -35 56 25 97 -39 -76 74 -174 109 -192 -153 -192 -17 -58 -123 -247 92 -87 -5 -36 156 53 -258
6310b58K69k05K90L3q8K23l16j6l0L15j24r5J04o3L2J82j27p3m3o1J02j14j36
$$ -258 11 -194 96 129 41 264 -52 -68 -98 217 93 -2 102 39 71 253 126 53 10 -51 51 -63 -199
6333a99L02k69K5J73j26o4O5NR2J71k73K72k75K37j74j18J96L1j57L83l66P5l
$$ -199 103 -166 -141 32 -94 -158 -93 -88 4 175 -98 174 -101 136 -38 -156 40 71 -86 297 -69 6 3
6356CO9j32J73j24J00j66J6J77m6m4j81J40J05J58m19J24L4k5J04j07j5O0k4Q1
$$ 3 72 -60 113 -11 89 -77 -61 116 70 26 -155 -15 90 248 -171 -47 -13 -38 66 -41 -56 4 -20 61
6380F1j08m5r5J29K0j7K18n6o8J08j12k28K75j20M1J02k51K85K6k70K38k57K96
$$ 61 -47 -92 -187 -58 -38 -55 163 107 39 147 35 -193 82 -38 3 105 -146 139 165 -105 133 -124 172
6403A72r5j16rN3l8J21o3K49l57J8J6J11J34k18m5J61k93Q6Q6J07n6N8j85lL6
$$ 172 77 -39 -48 5 -33 88 25 274 -83 -65 -49 62 196 -22 -67 94 -199 -113 -27 80 24 82 -103 -106 -70
6428g0Q6j4o4k4l6J70N6j38j7J54j84J50o1K30k37q7M4j2LR4M1k86K25j4J99l26
$$ -70 16 2 -62 -86 -122 48 104 -34 -51 103 -81 69 8 238 1 -86 -42 -54 -51 43 84 -202 23 9 208 -118
6454a18K62r7r2Rlj27L16oj64J1k34K63k4p8K34j29j15M0O2q8K57l7JO8j07k59
$$ -118 144 47 -45 -36 -39 -166 150 144 -20 -9 -243 20 -4 -82 152 23 -92 -52 10 -78 179 142 143 211 104 -155
6480a55Q5Po3R7m5J23K0j3k26J62j13J30o6q0J44J03j4k35L03n9k31K24k09J38
$$ -155 -70 -63 -126 -29 -74 49 69 56 -170 -8 -121 9 -57 -137 7 110 96 -139 164 105 -126 98 -111 27
6504B7L1l9p1j8k2K18K0Jk27J28q2rQ1j11J53j50k2L72k00N7j52J35j68J14P1
$$ 27 58 19 -52 -70 -92 126 146 147 -80 48 -34 -43 38 -73 80 -70 -92 280 80 137 -15 120 -48 66 137
6529A37k37M5o2K61j55J69k25nJk6M19k18j80J42J1N5m21K97J3N3r4j0j28J93
$$ 137 -100 -55 -117 144 -11 158 -67 -72 -71 -97 322 104 -76 66 77 132 -289 8 21 74 -20 -30 -158 35
6553C5R3l25J79n0J09j14J15Q5l84J93J68m5k09p1L18M1l39J02J03L5J26k13J
$$ 35 128 -197 -18 -68 41 -73 42 127 -257 -64 104 59 -150 -221 97 138 -201 -99 4 39 165 -48 -47
6576d7k5q9N5N3j1j3J89j09j21K15r8L2k51J91m3m0J22r3N2J28j62O4J4N1j32
$$ -47 -72 -161 -106 -53 -64 -77 112 3 -118 97 -1 31 -220 -29 -72 -112 10 -83 -31 97 -65 -1 13 64 -68
6601f8Q0m1n5L7j93L48J47j04k26J95j91k5J12qm6%O4k00K15P8k37l9L40oj20
$$ -68 12 -29 -84 -47 -240 108 255 151 -75 120 -71 -96 16 8 -38 -38 26 -174 41 119 -118 -157 183 177 57
6626E7r8P6O2n5k8J45k09N0j8J26k70N0j6J3K36k03l6J62q0kJ3J41j8m4p5K5K44
$$ 57 -41 35 97 42 14 159 -50 0 -18 108 -162 -112 -128 -115 121 -82 -118 44 -36 -38 -25 116 98 54 -21 4 248
6653B48j78j42Q4k61K26J37k57J48J4l4j71O9J51k51K43J4q1k36L87k3j09J34
$$ 248 70 -72 12 -249 -23 114 -143 5 19 -15 -186 -117 34 -217 26 40 -41 -277 110 87 -22 112
6675A12k93M37l30P2M7n5J08j05j96J81J69k07K1j19N8K8P8J57k27n4J47m0J03
$$ 112 -181 256 -74 -2 45 -10 98 -7 -203 -22 147 -60 -39 -158 -100 -72 6 163 -64 -118 29 -11 92
6698I2j17K26l99M45l30J08Q9j19P6j86Q3jl7O1L5J47k47o4J59R5l0L2j80k05
$$ 92 -25 201 -198 247 -83 25 114 -5 71 -115 -32 -33 -70 -9 26 173 -74 -138 21 116 86 118 -62 -267
6722b67K12j8J48q3j62j09M20j67l8L06m03J96L1Jn7K3j20j46Q4L8jK64Q1l75
$$ -267 -55 -73 75 -8 -170 -279 141 -26 -64 242 -161 35 66 67 10 33 -87 -233 -149 -111 -112 152 233 -142
6746a42J10m3M1Mo6K79k67k2K40j34O4P4j05nN6K9l13J01O6J24k30N6J53L1p1
$$ -142 -32 -75 -34 -30 -96 183 -84 -106 134 0 64 138 33 28 84 113 -200 -99 -33 91 -139 -83 70 101 30
6771C0L2j08m0R7R6j34K16j88O5J02j09O2l30J32J90q1J03j31L41l25k83L85k22
$$ 30 62 -46 -86 11 107 -27 189 1 66 168 59 121 -209 -77 113 32 135 4 345 20 -263 122 -100
6794a00K83l09RL43r2k6j58%J42j16oO4j55K39j95K8L5K4j65L29k30j30L04l16
$$ -100 183 -126 -117 226 134 108 -50 -50 92 -24 -30 34 -121 118 -77 -49 -14 10 -155 174 -56 -186 118 -198
6818a98L20j54k41J43j2K38J27r5j09K17k58KK46l91N9O4N2j17J65QM7o7K1j23
$$ -198 122 -32 -273 -130 -142 96 223 128 19 236 -22 -20 226 -165 -106 -42 10 -107 58 66 113 46 67 -56
6842e6m8p0K26j60K15q5P6J2j5k59L31j16q7J73l56K60j23K48k03J53k54J97j98
$$ -56 -104 -174 52 -108 107 22 98 110 95 -164 167 51 -36 137 -219 41 -82 166 -37 116 -138 59 -139
6865a39O8J44j6k22J25J6M5J3j82K60j56K40j74J40j09K09m10J67j80K68o0pJ78
$$ -139 -71 73 57 -165 -40 -24 21 34 -148 112 -44 196 22 162 53 262 -148 19 -161 107 47 40 218
6888B18l22R6J16l27K73p7k19L79j22Q2k81M24k68P8K46k99lk63J28J97n3J0K38
$$ 218 -104 -8 108 -219 54 -23 -242 137 15 97 -184 240 -28 50 296 -3 -6 -269 -141 56 3 13 251
6911B51k62J35j11j17J28k2l3J37k80q7L31j74kK57l12J84k25J59L9Q6m7p8J75
$$ 251 -11 124 13 -104 24 2 -31 106 -174 -261 70 -104 -106 151 -161 23 -202 -43 -4 82 35 -43 132
6934A32j4o6p2j25L13j24j64J5L41k35M2L9k48J00J14j08m9L86m88K38j2L0j71
$$ 132 118 52 -20 -145 168 44 -120 -105 236 1 43 82 -166 -66 48 -60 -109 277 -211 27 15 45 -126
6957a26J10q8p4k0J18P1q1R4r0J5R4m6n4m7m4J3J96N2mj34o9J10j35K36j6j55
$$ -126 -16 -104 -178 -198 -80 -9 -90 4 -86 -71 23 -23 -77 -124 -168 -155 41 93 89 -45 -114 -4 -139 97 81 -74
6983g4P2q4J31j85K35j24K5l6K99k36p5J34j26J22j68lj94M25j00j75P0k4%J89
$$ -74 -2 -86 45 -140 95 -29 -4 -40 259 23 -52 82 -44 78 -90 -93 -287 138 38 -137 -67 -91 -91 98
7007I8n4P2j73P0L8J41j53m4N6L6Po0Rp9L1p8M3K7K00j87j56J92O8p9Op4J22j32
$$ 98 44 116 -57 13 51 192 39 -5 51 87 94 34 43 -36 -5 -83 -40 -13 187 0 -156 36 104 25 31 -43 79 -53
7035e3M9n9L1o9J61k21K85k29K32Mj88K33k36kP5j81L03j87J2K9J52K9L4k86m6
$$ -53 -4 -63 -32 -101 60 -161 124 -105 127 131 -57 176 -60 -62 13 -168 135 -52 -40 -11 141 170 204 -82 -128
7060a28K08k28K43j93M9J02j06j01K71Rm0j70%K3L5J0JP0k10l3N1P9O3o7L60m31
$$ -128 80 -148 95 -98 -49 53 -53 -154 117 126 86 -84 -84 -61 -26 -16 -15 55 -155 -188 -137 -58 5 -62 298 -133
7086a33J64K12j02n5k27J31j90L55j3k43K10%m9j30L8j32K42J15p8l18J09K3N1
$$ -133 31 243 141 86 -141 -10 -200 155 142 -101 109 109 60 -70 -32 -164 78 193 115 -203 -94 -71 -20
7109b0j36J77j17J24L4q5J78R2l13n1K80j32k86J06J09j50K47q8L0Q3M1r1j34
$$ -20 -156 21 -96 28 62 -23 155 247 -66 -117 163 31 -255 -149 -40 -190 57 -31 -1 82 123 32 -102
7132a02j9K70j71J3J2J11j29j04J49m9q3o6J27K04p3j4J39k1j70j56K18K5j91
$$ -102 -121 149 -22 -9 3 114 -15 -119 30 -19 -102 -168 -41 163 90 76 215 194 24 -132 86 111 -80
7155h0K05m5K3j39J12J81k18M5j06q3N0R6k1kk7l7J51j77m1J58k25J56q1j00J01
$$ -80 125 80 103 -36 76 257 39 84 -22 -105 -55 41 20 18 -9 -46 105 -72 -113 45 -180 -24 -105 -205 -104
7180a04J45j5J74k51j60K35J32J1k28m5K0l8K82k42K65j94L5k34K88j59J43r6
$$ -104 41 26 200 -51 -211 24 156 167 -61 -106 -86 -124 158 -84 181 -13 22 -212 76 -83 60 -36
7202c6k1K30k31M8J16pq0k08K79O1q4mj8J61k73K68k09K9kL5j7J06k5k8o4o6J00
$$ -36 -57 173 -58 -10 106 99 19 -189 90 151 67 63 45 206 -67 201 -8 21 19 54 37 143 118 90 26 -40 60
7229F0k32K07j82K35r2J4J63m4k7k04R0J51k07L05k86J9PQ7jj03j30J70l1l57
$$ 60 -172 35 -147 88 -4 10 173 129 102 -102 -12 139 -68 237 -49 -30 -23 64 63 -40 -170 0 -31 -388
7253c88M92j01QP8j64J10j28R0P1p0J38k54k6J59kJ57jl12JL25j56Q8k17K44k66
$$ -388 104 3 11 89 -75 35 -93 -3 68 -2 136 -118 -144 15 13 170 169 -143 -142 183 27 115 -102 142 -124
7278a24M0J47j74K13k43K13j51K07k43J42J55K1l23NJ61O3M0j59Pm3O8l4Q6p9
$$ -124 -84 63 -111 102 -141 72 -79 128 -115 27 182 203 -120 -115 46 109 149 -10 -3 -46 22 -12 74 -5
7302eJ12j78M8O9j21J92l8j85P9J73m60L94k28L6J40j17m5K62q9q0K4o4J20K6
$$ -5 107 -71 -23 46 -75 117 79 -106 -27 146 -314 80 -148 -112 28 -89 -134 128 39 -41 -17 -81 39 65
7326F5K6J41k86j6M9J02j68J18j00o0K7m1k0j7J30J75R2o5k64K59jk94R9J50m4
$$ 65 91 232 -54 -70 -21 81 -87 31 -69 -129 -102 -143 -163 -180 -50 125 217 152 -112 147 146 -148 -49 101 57
7351E7j08J66j42n4J35Nm9M9n3qj04LR0p1Pj73L74k53J57J31q4m6m2l1N0L1L17
$$ 57 -51 115 -27 -81 54 59 10 59 6 -2 -106 -103 -13 -84 -77 -250 124 -129 28 159 75 29 -13 -44 6 37 354
7378C54l14l4q8K39m6j3r4J09K61l68K06m35J44J8P1K9lL1j59Q3k8J51k25J10
$$ 354 40 6 -82 157 111 98 4 113 374 6 212 -223 -79 -61 10 39 36 67 -92 -9 -37 114 -111 -1
7402aJ37j65K25j49j62K0J38l5J42l46L25j69J43k66K16QO9k4k36J58k51J36L5
$$ -1 136 -29 196 47 -115 -95 43 8 150 -196 129 -40 103 -163 53 61 130 106 -130 28 -223 -87 -52
7425e2j0Q8m2J14J5j17N9j61J55J3j91J57J09oj0j41J52m9%q0Q7l0J16j2k42J54
$$ -52 -62 26 -16 98 113 -4 55 -106 49 62 -129 28 137 131 121 -20 132 83 83 3 90 60 176 164 -78 76
7451G6j67L18j42p7o2L3L6J7j45N1P7K5j31n2K82lq1L3n9j19M2N2J2r7k1o5K76
$$ 76 -91 227 85 8 -54 -21 15 32 -113 -62 15 40 -91 -143 139 136 55 88 29 -90 -48 4 16 -81 -102 -167 109
7478A09m3j42m2K67k05N8O0q6O3L2k46K52l6j36K7O1k77K78%lL6O9l0r3Q0M1r9
$$ 109 66 -76 -118 149 -56 2 62 -24 39 71 -175 77 41 -95 -68 -7 -284 -6 -6 -9 27 96 66 -27 53 94 -5
7505eR2j1j51j21J44j6J23k20M68l23k9R6l5J11j67P3j03L4P3P3Km6J27j52J6
$$ -5 87 76 -75 -196 -52 -68 55 -165 303 -20 -49 47 12 123 -44 29 -74 -40 33 106 108 62 189 37 53
7530E3j11M9q2K87l32O7J37n1k5kJ95k7k04kn8J34K66j94k04k0J77k8k5L0m4r
$$ 53 -58 -9 -91 196 -136 -69 68 17 -8 -10 185 158 -46 -48 -106 28 294 100 -104 -124 53 25 0 30 -14 -23
7556b3J24k06P5o7o2J80PQ6j49J82j56k8R6J10j98j49M16l87J54N9L6k55J26J00
$$ -23 101 -105 -30 -97 -159 21 28 114 -35 147 -9 -37 59 169 -29 -178 238 -149 5 64 100 -155 -29 71
7580G1J55k49J97l97J96J14r3P2k91L19j7k43J91M1q5j8k2j16K17k53J74n3J16
$$ 71 226 -23 174 -223 -27 87 -6 66 -225 94 77 -166 25 66 -19 -37 -59 -175 42 -211 -37 -90 26
7603B6J11l40K02l2m0ML60k33k13J42j03J68k35K81n2P6j23J02o3m2J38j55J32
$$ 26 137 -203 -1 -33 -73 -69 291 58 -155 -13 -116 52 -183 98 46 122 -1 101 38 -4 134 -21 111
7626A11l12R8J71J14m09K93r8R6k08J70M4N5M2k55p1m4K65n8K4M4Q0j31J11N2
$$ 111 -201 -103 68 182 -227 66 -32 64 -144 26 70 125 167 -88 -159 -203 62 4 28 72 152 21 132 184
7650A84j11oj09Q3k1M1k75K84k83K89r4R6j87J24J57k77N8o7J43j3n0P7Q9O6n7
$$ 184 73 67 -42 41 20 61 -214 70 -213 76 -18 78 -109 15 172 -105 -47 -114 29 16 -34 43 132 198 141
7675A41k33K05j65oJ54j79J33n3O3n5o3R1j1j70P4J77n9j2j59O0j64J28J57O4
$$ 141 -92 113 -52 -58 96 -83 50 -3 60 5 -58 33 22 -148 -74 103 44 32 -127 -67 -231 -103 54 118
7699A18k50J53n6j3J35j15j76K13j21K58j66j1J7RJ91j89r4J64p8q7J23k1Q0n8
$$ 118 -132 21 -35 -48 87 -28 -204 9 -112 146 -20 -31 -14 -5 186 -3 -97 67 -11 -98 25 4 84 26
7723B6K38k68J71k04j54k04K22J33J93q7r3k9p3L58k72J46j90L1L0R0j8R8k54
$$ 26 264 -4 167 -37 -191 -395 -173 -40 153 66 -27 -56 -129 229 -43 103 -87 -56 -26 64 46 144 -110
7746a10L22j52k8J27k46K6J05k1j46N8J19L1R8k34K02j01l43J55J32j8j57M5Q1
$$ -110 212 60 32 159 -87 -61 44 23 -123 -65 54 85 183 -51 151 50 -293 -138 -6 -24 -181 -136 -55
7769e5j05K04M9q8N6k2j27K4kj4J86k14O6l6j01RJ41J79k40J11m3J09l53K53j59
$$ -55 -160 44 93 5 61 39 -88 -64 -66 -80 106 -108 -42 -78 -179 -170 -29 150 -90 21 -22 87 -266 -13 -172
7794a72K95k07K58o7n7j05J00j39J47o9r6QKJ82j77J66O0N0k14K4J57j44l44K28
$$ -172 123 -84 174 107 50 -55 45 -94 53 -16 -112 -104 -102 80 -97 69 129 179 -35 -11 146 2 -342 -114
7818a14L5P2K0m5L4P9k72J10J39j83J32k4P0Mk01J15j1R6L9k27Q5J24r6j49J53
$$ -114 -79 -7 13 -32 2 81 -191 -81 58 -125 7 -17 53 57 -144 -29 -40 56 95 -132 -47 77 -19 -168 -15
7843a5j86L25j63M5r0M2L1q1J03j34L1J49o1j24J65o9rJ2j79K22k07L33j90J45
$$ -15 -201 124 -39 6 -84 -42 -11 -92 11 -123 -92 57 -4 -128 37 -32 -41 -29 -208 14 -193 140 -50 95
7867I5Mj49K13L8k63L6p8J50Rj76J44o4J58J4k10K30k71M5PK57j60n4l5L20k16
$$ 95 99 -50 163 201 -62 -26 -104 46 55 -121 23 -41 117 131 -79 151 -120 -75 -68 189 29 -25 -60 260 44
7892D4k84J46L22l03N8O6K2M1R3j61p5j25J03P2O5k7OlQ8m4j72m0KM7J57k73K00
$$ 44 -240 -94 228 -75 -17 49 71 112 205 44 -31 -156 -53 19 84 57 63 60 148 104 -68 -108 -106 -59 98 -175 25
7919B5j08J88k4j06J46j49J74k39J29j51J66r4l5K29k06m9L1n2O8J39j63R8K7
$$ 25 -83 105 81 -25 121 -28 146 -93 36 -115 51 -43 -78 151 -55 -104 -73 -125 -57 82 -81 17 44
7942D4l7j11NJ72m8N3p8P4p0l1R6q9k30K30kn8k2Q1j3M0J05j82J25j91Q2N1oJ8
$$ 44 7 -104 -99 73 25 78 0 74 4 -27 69 -20 -250 -20 -22 -80 -102 -21 -34 6 111 -71 54 -137 -55 -4 -10 8
7970Hj41J69J39q6P8k30J54k17L25j75j11J65k27N0j09K65q1n1KjJ2L7J0R5j53
$$ 8 -133 36 175 89 167 -63 91 -126 199 24 -87 78 -149 -99 -208 57 -24 -75 -73 -74 -62 -25 -15 80 -73
7995g3J15p3N5o6Q7J20j86M4L9k04j04M26L4j34j58J01J12k03J34j00o9R5J35
$$ -73 42 -31 24 -42 45 165 -21 23 62 -142 -246 180 214 80 -78 23 135 -68 66 -34 -103 -8 127
8018A27l32K16N8q4n3Q2L8l2nj12L1K24j82J13j01J31n8j61M0R1J22p5j8OJ50
$$ 127 -205 11 69 -15 -68 14 52 20 15 -97 -66 158 -24 89 -12 119 61 -100 -60 31 153 78 60 66 216
8043B16l60J5R6J86lk02O5n6k5J45q2J28k53K17m7j28K07k94j9J32q3J06Pp3J25
$$ 216 -144 -129 -33 153 150 -52 13 -43 -68 77 -5 123 -130 87 40 -88 119 -175 -194 -62 -145 -39 -32 -105 20
8068B0O4j12j86L50o4k29P0K56Lj49n0r6K4J85j64j8P3K58k11L3j14j42J52R9
$$ 20 84 -28 -214 136 72 -157 -87 169 172 23 -27 -123 -99 86 -78 -96 -23 235 24 57 -57 -199 -47 52
8092E2j70K13n0Q0l8P9q9n4jO8n6K7j3Q8k35L4Q5j81O6m5n1L16l1j79J92l1k8
$$ 52 -118 95 45 125 87 166 77 23 22 90 34 61 48 136 -99 -65 20 -161 -95 -140 -191 125 94 -85 107 76 48
8119D8J42j96m9j26J65J49p3R9l97KK56j34M1J64N1k9k93J33O1r2K31p7O5n6j61
$$ 48 190 -6 -55 -181 -16 133 60 159 -238 -236 20 -114 -73 91 142 113 -180 -47 14 -78 153 76 141 85 -76
8144g6J41k46K89j78J5l5J93K6j62l5l1o0J25P9j9j4j97K66J46j03k81J24K7j18
$$ -76 65 -181 108 -70 -55 -90 103 129 -33 -68 -99 -159 -34 45 26 12 -185 81 227 124 -157 -33 -6 -124
8168a24k4J71L3N3k00J12K30l19p1J96k5l0OJ9K00l92K06j81J11k6J8L9J1
$$ -124 -148 23 56 109 -91 21 251 -68 -139 57 32 2 8 27 227 -165 41 -140 -29 -55 -37 2 13
8191A3
$$ Imaginary data points
##PAGE= N=2
##DATA TABLE= (X++(I..I)), XYDATA
0@%%%%%%%%%%%%%%%%%qJ6j6J6j6K0k8L2l2M0m8N6o4P2q7R9j08J20j36J56j77J97
$$ 0 0 0 0 0 0 0 0 0 0 0 0 0 0 0 0 0 0 -8 8 -8 8 -8 12 -16 16 -16 24 -24 32 -32 40 -47 52 -56 64 -72 84 -93 104
39A04k21K48k74L02l37L74m13M57n04N55o11O73p41Q16r00R95j102J220j354J513
$$ 104 -117 131 -143 159 -178 196 -217 240 -264 291 -320 353 -388 428 -472 523 -579 641 -713 800
59H00j699J915k179K508k927L487m273N472p543J2142m6322L1101L3006o4617
$$ 800 -899 1016 -1163 1345 -1582 1905 -2368 3104 -4439 7703 -38619 -7518 25488 -39129
73c9129J2494L9073j0755k3620L1659J3407k6737N391L6976k5022k3216K9460
$$ -39129 -26635 12438 1683 -21937 9722 23129 -3608 1783 38759 13737 -9479 19981
85A9981o50l2982J6114J3844l0528j1370L0254l096l4896J3993L5930k6060j5863
$$ 19981 19331 -13651 2463 16307 -14221 -25591 4663 1567 -33329 -19336 16594 -9466 -25329
98b5329L9449j97l2910K2919K7619k5136j5634K8267L839l3000M901K5714k5418
$$ -25329 14120 13923 -18987 3932 31551 6415 -9219 19048 22887 -10113 -5212 20502 -4916
111d916j7295L1621m447l2972J6220K2063k0214q696K6024M400k4141J0127K4564
$$ -4916 -22211 9410 4963 -28009 -11789 10274 -9940 -18636 7388 11788 -12353 -2226 22338
124B2338k0896j0812K9533o184k6125J7314J1625k7492n613K6757l896k9696J2115
$$ 22338 1442 -9370 20163 13979 -12146 5168 16793 -10699 -16312 10445 6549 -23147 -11032
137a1032K5895k3100j3295L0714J49k2750J6832J5887k0622o497K2559K92k4467
$$ -11032 14863 -8237 -21532 9182 9331 -13419 3413 19300 -1322 -7819 14740 15032 -9435
150i435P873J9034k1405j1804K2891o061k0604J5759J1605j8958k858K1168j700
$$ -9435 -1562 17472 -3933 -15737 7154 1093 -19511 -3752 7853 -11105 -13963 7205 5505
163E505j8748J4068J9090k0774o243K5858p784k2016J5954J1694k1572o145J8500
$$ 5505 -13243 825 19915 -859 -7102 18756 10972 -11044 4910 16604 -4968 -11113 7387
176G387l537k2017R972J7114j9477o111K4948n046j8520J5899J2894j4755k722
$$ 7387 3850 -18167 -8195 8919 -10558 -16669 8279 3233 -15287 612 13506 -1249 -3971
189c971J6961j957j5890R719J0350k0048k996K1548j0762k0186J4827R244j7863
$$ -3971 12990 11033 -4857 4862 15212 -4836 -7832 13716 2954 -17232 -2405 6839 -11024
202a1024k836J7424k519j4829J2412J3378j8001k253K3008n754j6215J3755P954
$$ -11024 -13860 3564 1045 -13784 -1372 12006 -5995 -8248 14760 9006 -7209 6546 14500
215A4500j5888l093J3689m392j5454R273J0391j8023l426J7915p022j2406J4975
$$ 14500 -1388 -4481 9208 4816 -10638 -1365 9026 -8997 -12423 5492 -1530 -13936 1039
228A039O182j4533J285J5802m152j3663J1730J1025j7244k329J7270r387j3706
$$ 1039 7221 -7312 -6027 9775 5623 -8040 3690 14715 -2529 -4858 12412 3025 -10681
241a0681J3914M936j5994p17J4183m551j3975J0816J0362j5037n68J7365p500
$$ -10681 3233 8169 -7825 -8542 5641 1090 -12885 -2069 8293 -6744 -7312 10053 2553
254B553j1143J3219M808j2730N49J2062n587j1964R702P175j6384j05J6187q714
$$ 2553 -8590 4629 9437 -3293 -2744 9318 3731 -8233 1469 8644 -7740 -7845 8342 -372
268c72j0988J2712M200j2640J920J2911m830j0753J0989P794j5799OJ5686q506
$$ -372 -11360 1352 5552 -7088 -5168 7743 2913 -7840 3149 10943 -4856 -4850 10836 2330
282B330j0633J1582K786j2462P66J0863m945j0370J0257O894j4276J388J4552
$$ 2330 -8303 3279 6065 -6397 -5631 5232 287 -10083 174 7068 -7208 -5820 8732
295H732q117p983J2716K416j1491J589J0796n954r858J0004N215j5089J295J3203
$$ 8732 615 -7368 5348 7764 -3727 -2138 8658 2704 -7154 2850 8065 -7024 -5729 7474
309G474r464q671J2396K580j1309K208J1032m948q694J0457N472j2551K055J2272
$$ 7474 -1990 -10661 1735 4315 -6994 -4786 6246 1298 -7396 3061 8533 -4018 -1963 10309
323A0309q713p652J0957R63j1153K176Q712o206q290R436L805j2521L087J2071
$$ 10309 1596 -6056 4901 5864 -5289 -3113 5599 -607 -8897 539 4344 -8177 -5090 6981
337F981q554n947J1786J383j0049L229R358n689p639R528L094j3130K760J0753
$$ 6981 -1573 -7520 4266 5649 -4400 -1171 8187 2498 -5141 4387 7481 -5649 -2889 7864
351G864r135o299J0292K66r971K703Q903n723o484R975L568j1815L831J0417q465
$$ 7864 -1271 -7570 2722 2988 -6983 -4280 4623 -1100 -7584 2391 5959 -5856 -2025 8392 -73
366g3m783J0691n98r596L331P371o518o924R530K342j2040L605R872q799m652
$$ -73 -4856 5835 5237 -4359 -1028 6343 -175 -7099 2431 4773 -7267 -3662 6210 -2589 -7241
381g241J0961q4q736L729P911o151n755R404J976j1032L788Q583q834m509R755
$$ -7241 3720 3636 -5100 -1371 6540 389 -5366 4038 6014 -5018 -1230 7353 -1481 -5990 3765
396C765q96q744L705O722n700n131R312J490j0750M661R067q619l587R712j304
$$ 3765 2869 -5875 -2170 4552 -1148 -6279 3033 4523 -6227 -1566 7501 -1118 -4705 5007 3703
411C703q048L761O092o569m521Q818Q86j0725M533Q019q399k764R286j695p236
$$ 3703 -4345 -584 5508 -1061 -5582 3236 4122 -6603 -2070 5949 -2450 -5214 4072 2377 -4859
426d859M116O633o202m275Q260J267r850M283P017q758k092Q541k226p544M521
$$ -4859 -743 5890 -312 -4587 3673 4940 -4910 -627 6390 -2368 -4460 4081 1855 -5689 -1168
441a168N459n945l932Q649L46q952N115O608q339j904Q580j333p239M253M809
$$ -1168 4291 -1654 -5586 3063 3409 -5543 -428 6180 -2159 -4063 4517 3184 -4055 198 5007
456E007o146l239P845n78q601N038N897q532j051Q198k467o500N051N096o514
$$ 5007 -1139 -4378 3467 2889 -5712 -674 5223 -3309 -4360 3838 1371 -5129 -78 5018 -1496
471a496k906Q142k49q375N115N452q056r58P975l002o200M438M445o052k467P445
$$ -1496 -4402 3740 3491 -4884 231 5683 -2373 -3331 4644 1642 -4558 -120 4325 -1727 -4194 3251
487C251j293p535N776N013q581j54P770k566n721M061L798n136j918O793j719
$$ 3251 1958 -5577 199 5212 -3369 -3523 4247 1681 -4040 21 3819 -1317 -3235 3558 1839
502A839o698N612M275q075J35P268l056n147M406L333o062j304P310k027o936
$$ 1839 -4859 753 5028 -3047 -2912 4356 1300 -3847 559 3892 -2170 -3474 3836 1809 -5127
517e127N675L747p303rO801l154m392M727K474n402o85O513k327n790N533L202
$$ -5127 548 4295 -3008 -3017 3784 630 -3762 965 3439 -1963 -2648 3865 1538 -4252 1281 4483
533D483p700N29O728l129m947M297K928n494p62O285k314n590N799K864o914R65
$$ 4483 -3217 -2688 4040 911 -4036 261 3189 -2305 -3067 3218 904 -4686 1113 3977 -2937 -1972
549a972N707l482l308M529J973n517p5O347k682o181N305L084o479O30N005l356
$$ -1972 3735 253 -3055 1474 3447 -2070 -2145 4202 1520 -4661 644 3728 -2751 -2121 2884 -472
565d72k965M474J440m856J39O006k651n219N636K200o540J704N163m049l173M516
$$ -472 -3437 1037 2477 -2379 -2240 3766 1115 -4104 1532 3732 -2808 -1104 4059 10 -3163 1353
581A353J496n432J88N439k650m487N469J415o121J983M887l950k396M454J146
$$ 1353 2849 -2583 -2395 3044 394 -4093 1376 2791 -3330 -1347 3540 -410 -2806 1648 2794
596B794m897O61N196l131m470N555J223o076J913M063l567k078M054P00m094L11
$$ 2794 -2103 -1442 3754 623 -3847 1708 2931 -3145 -1232 2831 -736 -2814 1240 1940 -2154 -1843
612a843M968k952l607N321R81n747K503L988m106k123M476N74m736M96M515k876
$$ -1843 3125 173 -3434 1887 2868 -2879 -376 3612 -494 -2617 1859 2433 -2303 -1807 2708 -168
628a68l120M773Q4m997K726L883m107j411L910O12m187J337M017l526k555N179
$$ -168 -3288 1485 1569 -3428 -702 3181 -926 -2337 1573 2185 -2002 -665 3352 -174 -2729 2450
644B450k45n467K822L557m247j571L866J89l728J215L743l154k291M956j41m689
$$ 2450 2205 -3262 -440 3117 -1130 -2701 1165 1354 -2374 -1159 2584 -570 -2861 2095 1954 -2735
660b735K829L082l876j014L810k22l939J377L442l318k525N066q11m417K714K678
$$ -2735 94 3176 -700 -1714 2096 1874 -2065 -688 2754 -564 -3089 1977 1166 -3251 -537 2141
676B141l681p52L761j98l433J648L666l333j992M898o71m462K859K352l731r67
$$ 2141 -1540 -2292 1469 1271 -2162 -514 3152 -181 -2173 2725 2054 -2408 451 2803 -928 -1895
692a895L597q66l330J616L100l439j550M591p20m095L081K528l935j67L388l51
$$ -1895 1702 836 -2494 -878 2222 -1217 -2767 1824 1104 -2991 90 2618 -1317 -1484 1904 1553
708A553l130J668K851l668j413M462j329l872L032J705l462k14K972m83k864J885
$$ 1553 -1577 91 2942 -726 -2139 2323 994 -2878 154 1859 -1603 -1817 1155 672 -2192 -307
724c07K551l277r45M438j148l564L073J593l343l1K775p02l181J953K101l333
$$ -307 2244 -1033 -1978 2460 1312 -2252 821 2414 -929 -960 1815 1113 -2068 -115 1986 -1347
740a347j039M370j426l127L021J469l105j97L398j055k739K178K066l212p67L948
$$ -1347 -2386 1984 558 -2569 452 1921 -1184 -1381 2017 962 -1777 401 2467 -745 -1512 2436
756B436j765l149L108J103l246O8K763j064k654K289K016l305l48L892j323k949
$$ 2436 671 -2478 630 1733 -1513 -1445 1318 254 -2400 -111 1905 -1400 -1748 2144 821 -2128
772b128L203Q51l201N54K544j369k152J762J992l478m23L649j771k471K929Q05
$$ -2128 1075 1926 -1275 -721 1823 454 -1698 64 2056 -1422 -1845 1804 33 -2438 491 1296
788A296k795N45K449r04k230K190J637l163j65L628k126k552L165L69l005O25
$$ 1296 -1499 -954 1495 591 -1639 551 2188 -975 -1140 2488 362 -2190 975 1344 -1661 -1036
804a036K269j251k094K110J559l113K49L222j759k043L034L87k760J061J799j363
$$ -1036 1233 -18 -2112 -2 1557 -1556 -1307 1915 156 -1887 1147 1534 -1226 -165 1634 271
820B71j736K184J313l436K79K906k049k184L235J20k632R72K031j276j509K185
$$ 271 -1465 719 2032 -1404 -1125 1781 -268 -2452 783 903 -1729 -757 1274 -2 -1511 674
836F74R73k723L02L166k206j842L099R5k863Q73J988j645j625K171P89l015P57
$$ 674 1647 -1076 -774 2392 186 -1656 1443 1538 -1325 -452 1536 -109 -1734 437 1226 -1789 -1032
853a032K709k143j306L093l61k306J113J907j488j503K467N49k998O77K604k457
$$ -1032 1677 -466 -1772 1321 960 -1346 -233 1674 186 -1317 1150 1699 -1299 -622 1982 -475
869d75j336K963l12k457J151J770j777r73K247J86k494R83K538k333j036K798
$$ -475 -1811 1152 840 -1617 -466 1304 -473 -1446 801 987 -1507 -524 2014 -319 -1355 1443
885A443m43k432J455J381j560j206J982K65k557R47K443k473o22K501l94k159
$$ 1443 1000 -1432 23 1404 -156 -1362 620 885 -1672 -725 1718 -755 -1377 1124 730 -1429
901a429J431J207j538p15K058L15k598R43J979k243p55K776q78k068J635J207
$$ -1429 2 1209 -329 -1044 1014 1329 -1269 -326 1653 -590 -1345 1431 553 -1515 120 1327
917A327j837p07J971J70k363J270J831k349o27K824q83j785J467J261j933q17
$$ 1327 -510 -1217 754 924 -1439 -169 1662 -687 -1314 1510 627 -1158 309 1570 -363 -1180
933a180J948Mk342J293J828k378o61K816j049j677J715R32j779n11K216l02k200
$$ -1180 768 772 -1570 -277 1551 -827 -1488 1328 279 -1398 317 1249 -530 -1041 1175 873 -1327
950a327J154J564k394j64K638j260j528J661R37j802m11J870Qk492J551J501k466
$$ -1327 -173 1391 -1003 -1167 1471 211 -1317 344 1281 -521 -932 938 946 -1546 5 1506 -960
967i60r5K662j313j624J762P66k129J82J701k04j995J346J527k682p5K319j171
$$ -960 -1055 1607 294 -1330 432 1198 -931 -749 952 748 -1247 99 1626 -1056 -1131 1188 17
984A7j205J398O88j671r3J990q69j923J843J185k289P0K343j572j136J706M97
$$ 17 -1188 210 898 -773 -866 1124 255 -1668 175 1360 -929 -859 1484 -88 -1224 482 979
1001I79j595o9J853o95j815J758J035k514L89J987j532j059J772K63j691L77J898
$$ 979 -616 -685 1168 473 -1342 416 1451 -1063 -674 1313 -219 -1278 494 757 -934 -557 1341
1018A341j026j692J860Q73k649O57K194j543j109J678N0j505K22J780r36j748
$$ 1341 315 -1377 483 1356 -1293 -636 1558 15 -1094 584 634 -871 -649 1131 195 -1553
1034a553J843Q93k459O91J936j686n36J556P2j713K94J876q43j672K010M90k347
$$ -1553 290 1183 -1276 -585 1351 -335 -871 685 757 -956 -662 1214 371 -1301 709 1199 -1148
1051a148P67J908j936p20J664k0j617P01J397j058j298J900O33k623J299J558
$$ -1148 -381 1527 -409 -1129 535 515 -1102 -401 996 -62 -1360 540 1173 -1450 -151 1407
1067A407j713l57J461j14j179M1J421q62j281J859K17k264J362J154j765m15J700
$$ 1407 -306 -663 798 684 -495 -454 967 105 -1176 683 900 -1364 -2 1152 -613 -1028 672
1084F72k06j357M87J593j267j112K111N8k100J240J197k012j82J862m86j409Q14
$$ 672 466 -891 -404 1189 -78 -1190 921 979 -1121 119 1316 -696 -878 984 498 -911 -97
1101i7J009j241r59K049j60k196J623J232j674l55J890m67j403O12J232j212r59
$$ -97 912 -329 -1288 761 601 -1595 28 1260 -414 -769 1121 654 -749 -137 1095 -117 -1076
1118a076K052m83j907J545J213k042l1J512o43j117Q04J097j308n43J851k48j775
$$ -1076 976 493 -1414 131 1344 -698 -729 783 140 -977 -173 924 -384 -927 924 676 -1099
1135a099J393J036j757n9J402o63r00M74R63j162p20J876p57j605J733N93j588
$$ -1099 294 1330 -427 -486 916 253 -647 -173 790 -372 -1092 784 27 -1578 155 748 -840
1152h40K53J139n69p38R94O46j141m67K012o66j943J884P13k016N7J353p57j083
$$ -840 -587 552 -17 -755 239 885 -256 -723 1289 623 -1320 564 1277 -739 -682 671 -86 -1169
1170a169J206P03j519k07J812k71j724J497J001j778K51J383r55q92J170L42j273
$$ -1169 37 740 -779 -986 826 555 -1169 328 1329 -449 -198 1185 230 -662 508 850 -423
1187d23k17J363n49j685J778J99j664M06J414q40o16Q80P68j320JJ708q43j228
$$ -423 -640 723 174 -1511 267 466 -1198 -792 622 -218 -834 46 814 -506 -505 1203 360 -868
1205h68J325N65j726M83J010p64r70J083M46j339l5J572p66j267J695R7j260O07
$$ -868 457 1022 -704 -221 789 25 -945 138 584 -755 -790 782 16 -1251 444 541 -719 -112
1223a12J104p07q86J426K64j519jJ550r67j396J845m5j520L60J178j029l15Q78
$$ -112 992 285 -601 825 1089 -430 -431 1119 152 -1244 601 556 -964 -604 574 -455 -770 108
1241A08N42j322J29K054j398r00J959k79j659O95R89r35n16R67J90j527K40J589
$$ 108 650 -672 -543 1511 113 -787 1172 893 -766 -71 918 -17 -533 434 624 -903 -663 926
1259I26j122j081J689J35j510J120O85q20o07J250K15j310J87J534j201q66J555
$$ 926 -196 -1277 412 547 -963 157 842 22 -585 665 880 -430 -243 1291 90 -776 779
1276G79l70j517R84O67j076n95J159K97j128K04J366q09p97J736k34j330R64P99
$$ 779 409 -1108 -124 543 -533 -1128 31 328 -800 -596 770 -39 -836 900 666 -664 300 1099
1294A099r07o77Q96J86j283K51J323j362q32J724l04j473J193Q41j110k08J293
$$ 1099 192 -485 411 597 -686 -435 888 -474 -1306 418 114 -1359 -166 675 -435 -643 650
1311F50J54j337N83J100j352o18J651k86j365P85N64j156q5P17J45j156O93J006
$$ 650 804 -533 50 1150 -202 -820 831 545 -820 -35 529 -627 -712 5 150 -1006 -313 693
1329F93j099n58J847j99j491J110P32j067j25J255n47j188O94P33j193m34J367
$$ 693 -406 -964 883 684 -807 303 1035 -32 -157 1098 551 -637 57 790 -403 -837 530
1346E30o01j248J327M61j053o7J115K1j220P06J010j067j88J339p44j265J300
$$ 530 -71 -1319 8 469 -584 -651 464 485 -735 -29 981 -86 -274 1065 321 -944 356
1363C56M72j290l05J092p2j196P03R93j418k60J640n00j119J336L62j122O2J002
$$ 356 828 -462 -767 325 253 -943 -240 753 -665 -925 715 215 -904 432 794 -328 -266 736
1381G36o5j291P97P61j444PJ410r05j221J384J73j143L07P63M8j227P10J306j377
$$ 736 671 -620 177 938 -506 -499 911 6 -1215 169 342 -801 -494 269 317 -910 -200 1106 -271
1400b71j49J558q57p86J070M01j309n4R49n74j004R07Q97j519j72J430n10p16
$$ -271 -420 1138 281 -505 565 966 -343 -397 552 -22 -1026 -119 778 -741 -913 517 7 -709
1418g09J395j16r04k4J109k82j079R97O53j366q6J362j105o54R95j43r96M15Q02
$$ -709 686 570 -334 -358 751 469 -610 387 1040 -326 -412 950 -155 -809 186 43 -953 -538 264
1437B64j55j187J072Q71j378K0J732j016p42J017M23j392L55R13p59o94O35N61
$$ 264 109 -1078 -6 865 -513 -493 1239 223 -519 498 921 -471 -116 797 38 -656 -21 540
1455E40j581N30R79p31p46J350j68q95P74Q27m97j065J092N93j313R7J153p90
$$ 540 -1041 -511 468 -263 -1009 341 173 -722 52 879 382 -683 409 1002 -311 -214 939 149
1473A49p60J032p5q86L26O65n87p85J065L97j388M79J415j022o29J381q5j029
$$ 149 -611 421 346 -540 -214 451 -136 -921 144 541 -847 -368 1047 25 -604 777 692 -337
1491c37M15O92p04n51Q91O8j147L91Q74j183l64J303k11q94P10O42p81m47J228
$$ -337 78 770 66 -485 406 474 -673 -282 592 -591 -955 348 137 -757 -47 595 -186 -633 595
1510E95Rj074N02Q98j112j17J038n07q03M63O65q82m67J069o4j331P96J295j464
$$ 595 604 -470 32 930 -182 -299 739 232 -571 -108 557 -325 -792 277 213 -1118 -322 973 -491
1529d91Q0J057k91q85N52J025q18o24J127j51j382P73P18j229m2J299q57o27M62
$$ -491 -411 646 355 -530 22 1047 229 -395 732 581 -801 -28 690 -539 -581 718 -139 -766 -304
1548c04P69p47l92J149k14q84N24Q40r58j48J146p11l63N72K53p34k16R40k51
$$ -304 465 -282 -674 475 261 -623 -99 741 -217 -365 781 70 -293 279 532 -202 -418 522 271
1567B71j168P64O35r16j04R66k77o11O89O33j188k9J001j88q22N73O32j160o3
$$ 271 -897 -133 502 -414 -518 448 171 -440 249 882 -306 -335 666 478 -344 229 861 -299 -362
1586c62R16o04n41M69N69p04l91J081k24j063J018P12j064j32J060n64m52O74
$$ -362 554 -50 -591 -122 447 -257 -648 433 209 -854 164 876 -188 -320 740 176 -276 398
1604C98K48q63j16R09m59r04R58K45j166K05J009o77m62Q80L67o83l28J032k22
$$ 398 646 -217 -333 576 117 -787 171 416 -750 -545 464 -213 -675 205 572 -111 -439 593 371
1623C71r99J021K75j383K88J159p26n63Q46R1r73J53R57m97r13J077N13j275M34
$$ 371 -628 393 668 -715 -427 732 6 -557 289 380 -593 -440 517 20 -893 184 697 -578 -144
1642a44Q40m54o21O56K23o22j39J013m58r32P46L15j183N51P18p20m88P92N13
$$ -144 696 242 -379 277 500 -122 -261 752 294 -638 108 423 -760 -209 509 -211 -699 93 606
1661F06j050R0R49k79q25R84J28j215L61J054q42l88Q63%q20m9O89j08j054J059
$$ 606 -444 -354 595 316 -509 475 603 -612 -251 803 -39 -427 436 436 -384 -433 256 148 -906 153
1681A53L08j093L77O40m36k63P35M1p71N4R78n70o89J052N6j212N08Q27r30l19
$$ 153 461 -632 -255 385 -51 -314 421 462 -309 -255 723 153 -536 516 572 -640 -132 695 -235 -554
1701e54O66J05n77N4P33k86p83R78K44j137N43N09o34n8P74k45n93K78M63n89
$$ -554 112 217 -360 -306 427 141 -642 336 580 -557 -14 495 -139 -197 577 332 -261 17 480 -109
1721a09n67R98j93p77M37O92o95l13P97q5n30K18P48o53m16R16J10j112O63L86
$$ -109 -676 322 129 -648 -211 481 -214 -527 270 185 -345 -127 621 -32 -448 468 578 -534 129 515
1741E15o60k58N80p1o51K20O94m71l76P90J10j125O17K11l60jO21j42n22M78M69
$$ 515 -145 -403 177 106 -545 -325 369 -102 -478 312 422 -703 -86 125 -235 -236 385 243 -279 199 668
1762F68r06l39J021k43o90L61Q01r43r0N46j83n17L9Q58m94m07P81J85r05P13
$$ 668 -238 -577 444 201 -489 -128 673 -270 -360 186 3 -514 -475 383 -111 -518 263 448 -457 256
1782B56M00p63J8O51k41o92R3O88o11m42R43k06p97P88K95o62Q9N27r9n73N38
$$ 256 656 -107 -89 562 321 -371 -278 410 -201 -643 300 94 -703 85 380 -282 -193 334 235 -338 200
1803B00L36n17m48J166k99j011O01K95o94o3P53m3p91J06Q04n46j97M51O6o40
$$ 200 536 19 -429 737 438 -573 28 323 -371 -434 319 276 -515 -409 395 -151 -348 103 169 -471
1823d71P04M09j018K58P01o62j23J68N33p54r9R00n19p72P07O4l24m0O96k79l75
$$ -471 233 642 -376 -118 583 -79 -202 -34 499 -255 -354 546 27 -745 -38 26 -298 -338 358 79 -296
1844b96M04K90l21k27O85m49k38L27K31o02N6M53k84m58M03J49m56j49Q49n54
$$ -296 108 398 77 -150 535 86 -152 175 406 -196 -140 313 29 -429 -26 123 -333 -482 367 -187
1864a87l80O33J84n39K52N77l74m02M63M75q43J6O01l48n81N91K86p77M5O38l98
$$ -187 -567 66 250 -289 -37 540 166 -236 227 702 -141 -125 476 128 -453 138 424 -353 -308 330 -68
1885f8l59N13M92p78p3O48j39m88N48Po17K86N29l50n13L62J48n51K9O29l21n11
$$ -68 -427 86 578 -200 -273 375 236 -252 296 303 -314 -28 501 151 -362 0 148 -403 -374 255 -66 -577
1907e77Q55K8n44M51L6j62l70O18J76p94J47L79M2p97N22J98p41M33K58k8n58
$$ -577 278 306 -238 213 249 87 -283 335 511 -283 -136 243 285 -512 10 208 -533 -100 158 130 -428
1928d28L12K11n98J93O90m87k26P76j82o89N45K32l37q3L28p3l61r9O50n80k37
$$ -428 -116 95 -503 -310 380 -107 -333 443 261 -428 117 349 12 -71 257 184 -177 -276 374 -206 -443
1949d43O88j59n23K45N14m61k81N40J74m75R0P00n66m11P25k26l66J17M33l49
$$ -443 245 86 -437 -192 322 -139 -420 120 294 -181 -91 609 43 -368 357 131 -235 -118 315 -34
1969c4l31L33J63o80K86N93k68m16O35r0m73J99N64k60l95M08R2m64j05M33l29
$$ -34 -365 -32 131 -549 -263 330 62 -354 281 191 -282 -83 481 221 -174 234 326 -138 -243 190 -139
1990a39k85P28m2p64M98J27k98k90O75p0p11O34M99p62O6O19m28m42N34M5l41
$$ -139 -424 304 262 -502 -4 123 -175 -465 210 140 -571 63 562 -200 -134 485 57 -385 149 194 -147
2011a47n6L25J4p72L03O86l77l36N43j78l64N63J23n65K14M83j67n36L78L61n30
$$ -147 -203 122 136 -636 -333 353 -24 -360 183 5 -359 204 327 -238 -24 459 292 -244 134 495 -35
2032c5l20M86j87l69L21M77n06l01M61l9m53M54L46o13rO88m14r4N10j00m71j26
$$ -35 -355 131 -56 -425 -104 373 -133 -434 27 -12 -465 -11 335 -278 -287 401 -13 -107 403 303 -168 -294
2054b94N01l21l92M11N15o30J7M09l73j89K98J23p4k14N44j60l12L02L85n34j88
$$ -294 207 -114 -506 -95 420 -210 -193 216 -157 -346 -48 75 1 -213 331 171 -141 161 546 12 -176
2075a76M24l61k39N81J7m61j15K98L3k46K39L78o54R7M55k74L3j5M15n69J72K57
$$ -176 248 -113 -352 229 246 -215 -330 -32 1 -245 -6 372 -282 -185 270 -4 29 14 429 -140 32 289
2097B89j98l02J48J67n84K58M82l07m67L96K99p06L38K28L48m28J72J92m80K37
$$ 289 91 -211 -63 104 -480 -222 260 -47 -514 -118 181 -525 -187 41 389 -39 133 325 -155 82
2117H2L03j27m29K14K43l71n5K52j52j77L74r0k70K30M25o85K6M70k17K7j87M31
$$ 82 385 258 -171 43 286 -85 -140 112 -40 -217 157 67 -203 27 452 -233 -207 263 46 73 -114 317
2139C17k69l48M94Q3o40J97M67m58j03J74J21m00J52N62l10m49P00j50m63J62
$$ 317 48 -300 194 277 -363 -166 301 -157 -260 -86 35 -365 -213 349 39 -410 290 140 -323 -161
2159a61N48n41j17N86k6o19K67L68m03j13L59R4m02j64N87n27j34O24j80j07R7
$$ -161 387 -154 -271 315 289 -330 -63 305 -98 -211 148 242 -160 -324 263 -264 -398 226 46 -61 36
2180C6K71k96l35N02K9m64K47K78m22j20K65J44l48P5L41l73o7K49J31m50J39
$$ 36 307 11 -324 178 207 -257 -10 268 -154 -274 -9 135 -213 -138 203 -170 -237 12 143 -307 -168
2201a68N34n85J53L28j23k78J56J69k08j84M08on68L88K40n44K47L07m87J76J29
$$ -168 366 -219 -66 262 139 -139 17 186 -22 -206 202 196 -372 16 256 -288 -41 266 -221 -45 84
2222H4R6k44R4J95M1l42K29J81n78J55P9k1l5j35M14j79k89M33K5m71L12mk18
$$ 84 180 -64 30 225 266 -76 153 334 -244 -89 -10 -31 -66 -201 213 34 -255 178 203 -268 44 40 -178
2245a78J2J39L9j52K89K11m41N2R8O0k58J19K00n08J02M16j78l32K84J11k80O8
$$ -178 -166 -27 12 -140 149 360 -81 -29 69 129 -129 -10 190 -318 -216 200 22 -310 -26 85 -195 -127
2267a27L24m6k20j10N78l40j92L40o8k22J64L0l26J21L09n8m92J85K84l98K5L60
$$ -127 197 151 -69 -179 399 59 -133 207 139 -83 81 111 -215 -94 215 157 -335 -150 134 -264 -239 121
2289A21J8k78L13j9j78j92M12n7m52K59J26j44k5K48l09N6m0L59n73J51L82j00
$$ 121 139 -139 174 155 -23 -215 197 140 -312 -53 73 -71 -96 152 -157 -101 -141 218 -355 -204 178 78
2311G8k53Q4M98n78K46M2k4j80M19r7n28R7K76l2m72M37K02l39j91N09j53k54
$$ 78 -175 -91 407 -171 75 117 93 -87 332 235 -293 -196 80 48 -424 13 215 -124 -315 194 41 -213
2333b13J82J00j07L4K70o4l42K75R1l40L1L16l21j24Q3L3l5j23L13K54n38M70
$$ -213 -31 69 -38 -4 266 202 -140 135 226 -114 -83 233 -88 -212 -129 -96 -131 -254 59 313 -225 245
2355B45r7l45J03k7N7k12L63ql5l2J88j8n40L88J55m70J72K22k10j54K99JQ8l87
$$ 245 148 -197 -94 -121 -64 -276 87 79 44 12 200 182 -358 30 185 -285 -113 109 -101 -255 44 45 133 -254
2379b54L65l9k30L67L6k75J28J73l84R2j29K57j51p8J73j89k3K45P1m22K90O7
$$ -254 111 72 -158 209 245 -30 98 271 -113 -21 -150 107 -44 -122 51 -138 -161 84 155 -267 23 90
2401I0J0k77ML48j22O2M6o1k32K16k50j4k0J98L3M9lk0j3j66L5J36o3M24k70k75
$$ 90 100 -177 -173 175 53 115 161 100 -132 84 -166 -180 -200 -2 31 80 77 57 44 -122 -87 49 -14 410 140 -135
2427a35K04Q6p2k39O9K25o22L45L16k07j58L96k39n23N79L2k36m5K07J12j68j50
$$ -135 69 155 83 -156 -87 138 -484 -139 177 -30 -188 208 -31 -554 25 57 -179 -224 -17 95 -73 -223
2449b23R5Lj88L99p1q6K03j52K11k84K38j77O6Q5M7k77J54Q7k07k70K92L21l47
$$ -223 -128 -125 -313 86 15 -71 132 -20 191 -93 145 -32 34 119 166 -111 43 130 -77 -347 -55 266 -81
2472h1j35K27J2M6Q2J74l28k86M57o8k50K2M29j58l66L47q8l99K79J00q0k27L89
$$ -81 -216 11 23 69 151 325 -3 -289 168 100 -150 -128 301 143 -223 124 36 -363 -84 16 -64 -291 98
2495I8j67J7J53n5j2J60p4J45k86j76N00n57J93r1P9J27J02j28k0K58r4l9k23
$$ 98 -69 -52 101 46 34 194 120 265 -21 -197 303 -254 -61 -152 -73 54 156 28 8 266 172 133 -90
2518i0o5K10pj70J91k04L4L07k22K81k75p6N3m1k4J72k10j88M22o6p8jJ22j76
$$ -90 -155 55 48 -122 69 -135 -101 206 -16 265 -10 -86 -33 -74 -98 74 -136 -324 98 32 -46 -47 75 -101
2542a01K39K0p2o9r6K11J9j54L18j96j34O4L61m74R5j59Q8p5k5L60j20j33O2P
$$ -101 138 158 86 17 -79 132 151 -3 315 119 -15 49 410 -64 31 -128 -40 -115 -140 220 100 -33 29 36
2566C6n8j5J19kmJ29m63J61O6J39j35k21M91l33n4K60j28o1K45j41j10o4M2M44
$$ 36 -22 -37 82 80 76 205 -258 -97 -31 108 -27 -248 243 -90 -144 116 -12 -73 172 31 -79 -143 -101 343
2590C43n84J35L87m80J11K23n3k04J39K2l8n0J12M2k10%M36l21k62K43L4r0o6
$$ 343 -241 -106 281 -199 -88 135 82 -122 17 39 1 -49 63 105 -105 -105 331 10 -252 -9 25 -65 -131
2613a31P6P4r8J11O2j50P1J21l25l2K42Pj92J76O5k17L8J93J17j34k07J71J8k00
$$ -131 -55 19 -79 32 94 -56 15 136 -189 -221 21 28 -164 12 77 -140 -102 91 208 74 -133 38 56 -144
2637a44M37k01j61r4J14Mj22J56K04j49k97M17o5k06J23K50j84jo8K8kj61J8l4
$$ -144 293 92 -69 -163 -49 -45 -167 -11 193 44 -253 164 99 -107 16 266 82 81 13 41 39 -122 -104 -138
2661a38K9J95j42q5K35J30k24k22M75m64J72R5J96k53J26k24KJ54k9J02N2j86
$$ -138 -109 86 -56 -141 94 224 0 -222 253 -211 -39 56 252 -1 125 -99 -97 57 28 130 182 -4
2683dj44K6J77j36M3j64J61J53k6q8n8K10l35j4J90L7j04J58o5j87k4K17l65Q7
$$ -4 -148 -122 55 -81 -38 -202 -41 112 86 -2 -60 150 -185 -199 -9 28 -76 82 17 -170 -194 23 -342 -255
2707b55M51l00j18L54j91o3O2K84k28k03J85L75m91l6K65P0q7j4P7l7k21J67j63
$$ -255 196 -104 -222 132 -59 -122 -60 224 -4 -207 -22 353 -138 -174 91 161 74 60 137 100 -121 46 -117
2730a17J17J37j55j69R3J54k8N8j38J64j59J81j60L57k81J2R5k22K03%j93l5J59
$$ -117 0 137 -18 -187 -94 60 32 90 -48 116 -43 138 -22 335 54 66 161 -61 142 142 -51 -86 73
2753G3k30N6K87k11L03l66K4R5j78L70j76k8j83L49p9k57q0L04j41K5N0K52j85
$$ 73 -157 -101 186 -25 278 -88 -64 31 -147 223 47 19 -164 185 106 -151 -231 73 -68 -43 7 259 74
2776G4k65L16N2l05L14l3k43L10l32L16m16R2K90l07J45L7p6q4J33J74l01N3j0
$$ 74 -191 125 177 -128 186 153 -90 220 -112 204 -212 -120 170 -137 8 45 -31 -115 18 192 -109 -56 -66
2799f6o3j01K44K38m91K14J64k42kM0L65k36j46J52L1m67K87K38j17L3K12l16
$$ -66 -129 -230 14 252 -239 -25 139 -103 -105 -65 300 64 -82 70 101 -366 -79 159 42 75 287 -29
2821b9P4p2J0j50L7J22K16o6k16J67j02o4K42j86j78K32J7k15J75J38J6k75r1
$$ -29 45 -27 -17 -167 -130 -8 208 142 -74 93 -9 -73 169 -17 -195 37 54 -161 14 152 168 -107 -198
2844a98L92k11J41j58Jk15L79n6l47M32m0k24J42K00j85Q5k4q6q6k6K40j67J26
$$ -198 194 -17 124 -34 -33 -248 131 75 -272 160 120 -104 38 238 53 138 114 28 -58 -84 156 -11 115
2867A15k63J18n8j14J80J76l87J43J27k1N8K10k05k64L34j45O7k04o0K96k30J21
$$ 115 -148 -30 -88 -202 -22 154 -233 -90 37 16 74 284 79 -185 149 4 71 -133 -193 103 -127 -6
2889fL2j44l2L68m15K11o0J5Q4j66NR1L8j9J05m9N5j25j28j82J96N7J96k56R1
$$ -6 26 -118 -150 218 -197 14 -46 -31 53 -113 -108 -17 21 2 107 58 113 -12 -140 -322 -126 -69 127 -129 -38
2914c8P3j73J47p3j11L66k1j54q9J70P9j16kJ18j2l01J07J90l56L5J47j3R3q3
$$ -38 35 -138 9 -64 -175 191 170 16 -73 97 176 60 58 176 164 -137 -30 160 -196 -161 -14 -27 66 -17
2938a7l8M8j57K00O5p5J61j69J46k59J70J4m49M37l03O9J76j65N3j06L62j71j22
$$ -17 -55 -7 -164 36 101 26 187 18 164 -95 75 89 -360 77 -226 -157 19 -146 -93 -199 163 -8 -130
2961a30o0J72K7O0J68k21M2M2k7L5j76K20k31r2J17o4J39j51K46j73P0k30J66
$$ -130 -190 -18 9 69 237 16 58 100 73 108 -68 152 -79 -171 -54 -118 21 -130 116 -57 13 -217 -51
2984e1j7j41K97j22OJ03l2k05K91j08q9J07o9R7n2k30M06j38j57J94k27P1R9J23
$$ -51 -68 -209 88 -34 -28 75 43 -162 129 21 -68 39 -30 67 15 -215 191 53 -104 90 -137 -66 33 156
3008A56r2k82K83K62k24k6j8j13k17N24k04j35K03o5k45K07k63J71q9K64N7o6
$$ 156 64 -218 65 327 103 77 59 -54 -271 253 49 -86 117 52 -193 14 -249 -78 -167 97 154 88
3030H8j90J43n8P9m9O0ll5M7J11k92M3J72p6M5j37r8K7J46j1J39k43O8N1J01n2
$$ 88 -102 41 -17 62 13 73 70 35 82 193 -99 -56 116 40 85 -52 -150 -123 23 12 151 -92 -24 27 128 76
3056G6j11L7j25J09P1J6j34J60R8r8j08m3O0k23K42j48N5J19nm5oj16K86p8j27
$$ 76 -35 2 -123 -14 57 73 -61 99 197 99 -9 -52 8 -215 27 -121 -66 53 48 3 -3 -119 167 89 -38
3081c8mJ04J49j23q3o5k4Q0P6j89R3m1j6kJ76k61K10J13j4j58m7M5P6j41K04j70
$$ -38 -42 62 211 88 5 -60 -84 -4 72 -117 -24 -65 -81 -83 93 -168 42 155 141 -17 -64 -19 57 -84 120 -50
3107e0n8J41K7l7O1L5j62j59J32J50J4k94r8J79k27L62K5N8o4l6n6M5J10J25k18
$$ -50 -108 33 60 23 84 119 -43 -202 -70 80 94 -200 -298 -119 -346 16 41 99 35 -1 -57 -12 98 223 5
3132Ej34J63Q0P9k33J84k59J87j66J69l34K53J60j40q9J97J05l05q4P3K00j11
$$ 5 -129 34 114 193 -40 144 -115 72 -94 75 -259 -6 154 14 -75 122 227 -78 -162 -89 111 0
3154@K0Q7j36j90L80l49J43J7P3P4j99J18j05M4O8J10j80J70K1k28J54J9j10K5
$$ 0 20 107 -29 -219 161 -188 -45 -28 45 119 -80 38 -67 -23 45 155 -25 145 166 -62 92 111 1 26
3178B6j00K1M4k12K96k7r4O8o9n2J06M8k24J44J17O6k29L1J15j46K06j8k29Q0
$$ 26 -74 -53 -9 -221 75 48 -46 22 -47 -99 7 55 -169 -25 92 158 -71 -40 75 -71 135 117 -112 -32
3202c2j44J8J21K61k85n6L21r8j71K19j05m8O2j42J6K43j90j21J44J13j68L2M
$$ -32 -176 -158 -37 224 -61 -117 204 106 -65 154 49 1 63 -79 -63 180 -10 -131 13 126 -42 -10 -6
3225fj14J94m9j15J38l16K31p5L06P8m36N8R2J10l60L67M5k16R7j26O7J9KlJ45
$$ -6 -120 74 25 -90 48 -268 -37 -112 194 272 -164 -106 -14 96 -264 103 148 -68 29 -97 -30 -11 -9 -12 133
3250A33k61M24l19p4l7K21j08J4M5Pl2Q5j52j17Q6N9M7o3p0M3J92j14n0j07K68
$$ 133 -128 296 -23 -97 -134 87 -21 -7 38 45 13 98 -54 -171 -85 -26 21 -42 -112 -69 123 9 -41 -148 120
3275A20j39p0kJMq1K4J57j18J64j00q5J75j26L5L2m4R3k67J41J62j57N8N2p7M9
$$ 120 -19 -89 -91 -90 -86 -167 -143 14 -104 60 -40 -125 50 -76 -41 -9 -53 40 -227 -86 76 -81 -23 29 -48 1
3301AQ4k77R2J98k13NN8k0j3%j9L27k81N4q1m2Q1M0j11J57k44K07O4j49JJ38j47
$$ 1 85 -192 -100 98 -115 -110 -52 -72 -85 -85 -104 223 -58 -4 -85 -127 -46 -6 -117 40 -204 3 67 -82 -81 57 -90
3328i0K11k72J41J89j66J13o5K6k67J25K54j97q4K79l72K68J11k09R1m7j7J17
$$ -90 121 -151 -10 179 13 126 61 87 -180 -55 199 2 -82 197 -175 93 204 -5 86 39 22 139
3350A39J09l22j65L18J21n82L83K6l8R0k41M28j93j21L41j19k93R8K47l85K47
$$ 139 248 -74 -239 79 200 -382 1 27 -11 79 -162 266 73 -48 293 174 -119 -21 226 -159 88
3371H8q0J68l68K11j3%K15k78J3J7K20r3M2l53K67k09K04j28J13l79N72j29r2
$$ 88 8 176 -192 19 6 6 221 -57 -44 -27 193 100 142 -211 56 -153 51 -77 36 -343 229 100 8
3394HR9p9p5MK59k30L1M4J11j97Q8j69R2Q6j18K89r8k08jJ65r0R2j5j03nj5m8
$$ 8 107 28 -47 -43 216 -14 17 61 172 -25 63 -106 -14 72 -46 243 145 -63 -64 101 11 103 88 -15 -20 -35 -83
3421h3L07k23L0K58k77r9J77Q1r3J21k77j07J59J36k9j20K55k50j36K48j46J93
$$ -83 224 1 31 289 12 -87 90 171 78 199 -78 -185 -26 110 81 -39 216 -34 -170 78 -68 125
3443A25l34J90L5P8j58l3J12j54j05J08O3J18j49J18p6J66n2m52L26L3J07j43
$$ 125 -209 -19 16 94 -64 -97 15 -139 -244 -136 -73 45 -104 14 -62 104 52 -400 -74 -41 66 -77
3465g7J52j8j38K3M4N3k87L42K5l03M26j07j54Kl1O3j11J55O2k00m6P5r0kP9Q7
$$ -77 75 57 -81 -58 -14 39 -248 94 119 -184 242 135 -19 -17 -48 15 -96 59 121 -79 -125 -50 -140 -142 -63 24
3491B4j2k39K15l1J80J09k89J95j66L3q3J10M7p7j34rL78J5k78N7J0J16k54R5
$$ 24 12 -227 -12 -43 137 246 -43 152 -14 19 -64 46 93 16 -118 -127 251 266 -12 45 55 171 -83 12
3515A2np6K17j33Q2k1O0j82J37o4Oj4K3M0J15k17m0J68j13n9K78k34j01L8K61
$$ 12 7 -69 148 15 97 76 136 -46 91 27 33 19 42 82 197 -20 -60 108 -5 -64 214 -20 -121 -83 178
3540A78j52lNm7J6K27j08k3q5J04p9j55J71q5P5Q6j31M0p5O1L1o1n9Jj7QJ48M1
$$ 178 26 23 28 -19 -3 224 116 93 8 112 33 -122 49 -36 39 125 -6 34 -41 20 51 -10 -69 -68 -85 -77 71 112
3568A12k43M02l39n4J17m7q0J18n6N1o8jJ28j6J31l20K17l19L91nj51M3r4N1J72
$$ 112 -131 271 -68 -122 -5 -52 -132 -14 -70 -19 -87 -88 40 24 155 -165 52 -267 124 119 -32 11 -83 -32 140
3593A40j73L00q1n4k35K89k00K2M8q5p7p4K01Q5k22J92Lm5n1q0J0J20m2J82r2
$$ 140 -33 267 186 132 -103 186 -14 8 56 -29 -106 -180 21 106 -116 76 79 34 -17 -97 -87 33 -9 173 81
3618H1j41J64k23QJ35qj48K14J9j00J07K07m65K70j52p9K67l66K92k18J51j38
$$ 81 -60 104 -119 -111 24 16 -132 82 101 1 108 315 -150 120 -32 -111 156 -210 82 -136 15 -123
3640a23K04M1n8j19o4Q1j8l01M21k03Q3K9K70k48j32J9k05K75n7N0O5J0k9j28
$$ -123 81 122 64 -55 -119 -38 -56 -357 64 -139 -56 -27 243 -5 -137 -118 -323 -48 -105 -55 10 20 -9 -137
3664a37J16J5j26NJ98k00M3O9J3j54K3K16k00J45kk09N9N4R2J29j71k6J17j07
$$ -137 -21 -6 -132 -127 71 -129 -86 -17 -4 -158 -135 81 -119 26 24 -185 -126 -72 20 149 -22 -48 69 -38
3688c8Q4p5n6l4J44Q1m5Q6j33j81j17L42J1r2J11l7j69K54l1K7m4k7o6j88J01
$$ -38 46 -29 -85 -119 25 106 61 147 14 -167 -284 58 69 -23 88 51 -118 136 105 132 88 61 -5 -193 -92
3713i2J29m7j28J82m3R8n5k1q8oJ34j10P0j82J06q0J25N7j75N3P7NO5q4O9J4J59
$$ -92 37 -10 -138 44 1 99 44 23 -65 -71 63 -47 23 -159 -53 -133 -8 49 -126 -73 4 9 74 -10 59 73 232
3740B32l39J79j35O1o5j6J44j04Q4O6O2j93m6J19q5onn3Q9J47k55L8K5k4o1M20
$$ 232 -107 72 -63 -2 -67 -83 61 -43 41 107 169 -24 -70 49 -36 -42 -47 -100 -11 136 -119 -81 -56 -80 -141 279
3766B79r9l14J82j37K21k07J04p3O0k39J22K23j11J58j56n8J30L7L5k61K56k27
$$ 279 180 -134 48 -89 132 -75 29 -44 16 -223 -101 122 11 169 13 -45 85 122 157 -104 152 -75
3788g5K9k6j39L11k21M38m14J93j07j2l7J67k21J41j3J49j02j98Q7J08M5P5M8
$$ -75 -46 -72 -211 100 -121 317 -97 96 -11 -23 -60 107 -114 27 14 163 61 -137 -50 58 103 178 226
3811B26j73j00l1J15o2M1q2k8K04j40k6K04m63L42P9k48N9RM7J88J09k13rj13
$$ 226 53 -47 -78 37 -25 16 -66 -94 110 -30 -56 148 -315 27 106 -142 -83 -74 -27 161 270 57 48 -65
3835f5M1L6Qn2Q6j11k5J78q1r2j8K35j00k29O4K64k89j6j3L08Rk40J21J29j27
$$ -65 -24 12 20 -32 54 -57 -82 96 15 -77 -95 140 40 -189 -125 139 -150 -166 -179 129 138 -102 19 148 21
3860B1nL9m9J7r4J9j39J66k02K37M6J73j55L1o7jp6M4P8n3j10J10J7n4Q8l94N12
$$ 21 16 55 6 23 -71 -52 -191 -25 -227 10 56 229 74 105 38 37 -39 5 83 30 -80 30 47 -7 81 -313 199
3887A99l12K9J75k37KL23j84J84q4j42k42L90j16P1j73K4L1j75K73j61R5J30q6
$$ 199 -113 -84 91 -146 -144 179 -5 179 95 -47 -289 101 -15 56 -117 -93 -62 -237 36 -125 -30 100 14
3910A4o3N2J92j76k1m7PK71k12NJ28q4j24o3M8J62m6J8M1j92J2J30j16L1K61j17
$$ 14 -49 3 195 19 -2 -49 -42 229 17 22 150 66 -58 -121 -73 89 43 61 102 -90 -78 52 -64 -33 228 111
3936A11l4k90L96l86J92o1n5K43j55J85j03k6j35M7j18J43n7J1P2j56J7J94m6
$$ 111 77 -213 183 -203 -11 -72 -127 116 -39 146 43 17 -118 -71 -189 -46 -103 -92 -20 -176 -159 35 -11
3959a1j4j66k1K39j48K17k82J89j99K23K5QJ61r0n0j46J94j67M5o6pK35l17J34
$$ -11 -25 -191 -212 27 -121 96 -186 3 -196 27 52 60 221 131 81 -65 129 -38 7 -59 -66 169 -148 -14
3983a4j78K03o2K8q8J53m2O4j53J50K7r2k4K4j69J81O7k10J27n0J57j8j63Oj1
$$ -14 -192 11 -51 -23 -111 42 0 64 -89 61 88 -4 -28 -4 -173 8 75 -135 -8 -58 99 81 -82 -76 -87
4008h7J51j73L47l05K04j53J11r6k29K37J22k09N7P3J49j62j59J93p0J01q9Q9
$$ -87 64 -109 238 -67 137 -16 95 -1 -230 7 129 -80 -23 50 199 37 -122 71 1 102 13 102
4030A02j58R5j1j21Q1kk1K14q2k04p7L19k29K3K16k00j25J41j24J75J86j96J78
$$ 102 -56 39 28 -93 -12 -14 -35 179 97 -107 -184 135 -94 -71 145 -55 -180 -39 -163 12 198 2 180
4053A80j99l7J58o5J4q9N7K0K5j04Lj58K83n8P9q3K1j84J52r5R5j4J36k26M1R5
$$ 180 -19 -56 102 37 51 -38 19 39 64 -40 -37 -195 88 30 109 26 47 -137 15 -80 15 1 137 -89 -48 47
4079D7J09k6l04J63P0P2r2n8l9p8R1o8J56j37JK13k22J9J31j04O6L2P5jn4Lj84
$$ 47 156 130 -174 -11 59 131 39 -19 -58 -136 -45 -113 43 -94 -93 120 -102 -83 48 -56 10 42 117 116 62 65 -119
4106a19L5O1K01l23n5J98J27r4N5k0j94Q9J8j77Q1Q7O7K1O5l2q6Rj00J49K04l26
$$ -119 -84 -23 178 -145 -200 -2 125 31 86 66 -128 -39 -21 -198 -117 -30 37 58 123 91 5 14 -86 63 267 -59
4132e9N4K2J05l14J44p6J13R3J13j47j75K74k73l8L3J25O4m4j75L30m20K52J46
$$ -59 -5 17 122 -192 -48 -124 -11 82 195 48 -127 147 -126 -164 -131 -6 58 14 -161 169 -251 1 147
4155A47r8k09M39Mk56l3o2J11j62L43k49j31J26P2j02J21j52R1Q8m1Q1j21j04
$$ 147 49 -160 279 283 27 -6 -68 43 -119 224 -25 -156 -30 42 -60 61 -91 0 88 47 128 7 -97
4178i7K06J19j97M8j26M7J11J17j07m2N8p7j52j33L17m9RK1j45j1j10K74j12Q9
$$ -97 109 228 31 79 -47 0 111 228 121 79 137 60 -92 -225 92 43 52 73 -72 -83 -193 81 -31 58
4202E8Pk58J31J93k27o9K98j62n0J46P8j61o8K99j30p2M7q7K98j57K1k88K39j37
$$ 58 65 -193 -62 131 -96 -165 133 -29 -79 67 145 -16 -84 215 85 13 60 -27 271 114 135 -153 86 -51
4226e1J5J85j21O1k04KL35M3j78l5k2j5j17J14k78J69M4pM4J19L6n5J41l55L71
$$ -51 -36 149 28 89 -115 -113 222 265 87 52 30 15 -102 12 -266 -97 -53 -60 -16 103 139 84 225 -130 241
4251B41o2l16R7j14J77l2M5Q5k11%K28j06q4n9r3K48n6M1M2j78P7K16j63j30K58
$$ 241 179 -137 -40 -154 23 -9 36 121 -90 -90 138 32 -52 -111 -204 44 -12 29 71 -107 -30 186 23 -107 151
4276A51j43j23N9L13k91j00R0J58k20j63K53J0l4l0l7Q0J8P7k48J93M7k66PJ18
$$ 151 8 -115 -56 257 -34 -134 -44 114 -106 -269 -16 -6 -40 -70 -107 -27 -9 68 -180 13 60 -206 -199 -81
4300h1J47k48K50k5J74j81P2j57J18j17K69j43o2j39R4m4J54n3J26J9k09J55k45
$$ -81 66 -182 68 43 217 36 108 -49 69 -48 221 78 16 -123 -29 -73 81 28 154 173 -36 119 -126
4323a26J93P1l05J51M01n11J49j63J46K39j99l7j30L3J08R3r6j36K39l13K00J91
$$ -126 67 138 -167 -16 385 -126 23 -140 6 245 46 9 -121 -88 20 113 17 -119 120 -193 7 198
4345A98l57J15k3J46Pk74K3K73oq6J03L9j64J18k28K79k36J59m7j19N0j09J36
$$ 198 -159 -44 -67 79 86 -188 -165 108 102 16 119 158 -6 112 -116 163 -73 86 39 -80 -30 -139 -3
4368cK99j72J6j42K9k32J89J12j61K09j83J80l77P7J29N9k04K87k5k02O9R4p9
$$ -3 296 124 140 -2 27 -205 -16 96 -65 144 -39 141 -236 -159 -30 29 -175 112 87 -115 -46 48 -31
4391c1k25K14J48j05o7J40l28K49j21K02k5l8l1J6k8j4L1j34R6O1j14KJ45pj49
$$ -31 -256 -42 106 1 -66 74 -254 -5 -126 76 51 13 -18 -2 -30 -44 -13 -147 -51 10 -104 -102 43 36 -113
4416a13J46l0n9O7J65k12K65j33J0n9R3J21k90J47j45k5o4J63l2k10M29l15J07
$$ -113 33 3 -56 11 176 -36 229 96 106 47 140 261 -29 118 -27 -52 -116 47 15 -195 234 -81 26
4439B6k36K31rl3J7M0J0m0l8J42j70Q8j30R7j8K66K8k44l8p7J29J6q1o4J48m9
$$ 26 -210 21 12 -21 -4 36 46 6 -32 110 -60 28 -102 -5 -23 243 271 27 -11 -88 41 57 -24 -88 60 11
4465A1j45L50j83k2j67K20n5l2J28M7m8p7m0R1r7K7J18j13O7k25Q6O2n1N6o6l3
$$ 11 -134 216 33 11 -156 64 9 -23 105 152 104 27 -13 78 -19 8 126 13 80 -145 -59 3 -48 8 -58 -91
4491i1L33j90j65J69J0N1j49l5O4L6J55o1j60j9Q9p2M7K04j13M0q7k5j54K22o1
$$ -91 242 52 -113 56 66 117 -32 -67 -3 33 188 127 -33 -52 37 -35 12 216 103 143 56 31 -123 99 38
4516C8oN9j18NL8O1j42J64j70n8P3r0J77j84M6K88k45J76j32Jj7J36k20r9K19
$$ 38 32 91 -27 -22 16 77 -65 99 -71 -129 -56 -146 31 -153 -107 181 -64 112 -20 -19 -36 100 -120 -219 0
4541@N3j49j61J78K72l55K49K1k41n8J43K9K8J74j87k8o0J69j77J52k22J01P0
$$ 0 53 -96 -257 -79 193 -162 87 108 -133 -191 -48 -19 9 183 -4 -32 -92 77 -100 52 -170 -69 1
4564Ap5K09q5J68k45mJ07j33J83r4Oj4j76N4J51m8J33k40j13K92j19j12K90o6
$$ 1 -74 135 50 218 -27 -31 76 -57 126 32 38 24 -152 -98 53 5 138 -102 -215 77 -42 -154 136 70
4588G0Q5j46k1R2k11o4K42K44l22L3J36k23J58j99LJ27L61l84l39L46K42k42n0
$$ 70 155 9 -12 80 -131 -195 47 291 -31 2 138 -85 73 -126 -123 4 365 -19 -358 -12 230 -12 -62
4611f2J99j01On4J62Lj92K6P4j05J96l30J92o3J97k22J09K6P8k02q6R4J13j00
$$ -62 137 36 42 -12 150 153 -39 -13 61 -44 152 -178 14 -49 148 -74 35 61 139 -63 -149 -55 58 -42
4635d2J14j14K20m05L11j61K7K27k30Q7k5m5J55j35m1Q1k01J66j84K99k26L1j1
$$ -42 72 -42 178 -227 84 -77 -50 177 -53 34 9 -36 119 -16 -57 24 -177 -11 -195 104 -122 -91 -102
4658a02J02j17J38j72Q2k5K50r8l4J05M2r7k1j21N4R9r1j88K72j96L38m6j69K4
$$ -102 0 -117 21 -151 -69 -94 156 58 24 129 171 74 53 -68 -14 85 -6 -194 78 -118 220 174 5 29
4682B9j27K07p3J1k67J2J41j8J32j06J83j09r2l7J10N9K5q0K8K15k58j1J65nj55
$$ 29 -98 109 36 47 -220 -208 -67 -85 47 -59 124 15 -77 -114 -4 55 80 0 28 243 -15 -26 139 134 -21
4707b1N9K8%k81P9J98N8J08k06K0j82J35j07PJ47J8P6k24J49k2K0k5o7p1M9J53
$$ -21 38 66 66 -215 -136 62 120 228 22 42 -140 -5 -112 -105 42 60 136 -88 61 39 59 34 -33 -104 -55 98
4733I8L7k1q7k30N2J13J07J8j60R3j19P7q9NJ49j14K0n0L75j91r1J26k15j46M09
$$ 98 135 114 27 -203 -151 -38 69 87 -73 20 -99 -22 -111 -106 43 -71 -51 -101 274 83 -8 118 -97 -243 166
4758A66j96M3J91q0k85j3L04n02M71j55L1j28QQ3m3p9J48K8Kk03K90jj56L8N2
$$ 166 -30 13 204 124 -161 -174 130 -372 99 -56 -25 -153 -145 -62 -105 -184 -36 -8 -6 -209 81 80 -76 -38 14
4783A4J62l2k21K8j24J76J61k36R9n7J23n2q1P8r9Qm7O2o8J40j80qM5O9j11K15
$$ 14 176 144 -77 -49 -173 3 164 -72 27 -30 93 41 -40 38 -61 -53 -100 -38 -106 34 -146 -154 -109 -40 -151 64
4809F4j25J47M9j81j42J14M0LJ71r9j72L24m30K15Q4J44k24j5J53j61J6J44o9
$$ 64 -61 86 135 -46 -188 -74 -34 -31 140 41 -131 193 -237 -22 62 206 -18 -33 120 -41 -25 119 50
4832E0j43J37j15M5R7k56J32n7J52j81J07K51j9j73J9J74l25J25j14K40j34n2
$$ 50 -93 44 -71 -26 71 -185 -53 -110 42 -139 -32 219 200 27 46 220 -105 20 -94 146 12 -40
4854d0N2r9J15k69N7K04jR4k61K60M3j54o5J0%MJ31K7j41o7O1n8P3q7J24j27K68
$$ -40 12 -87 28 -241 -184 20 19 113 -148 112 155 1 -64 -54 -54 -50 81 108 -33 -100 -39 -97 -24 -111 13 -114 154
4881A54k85J38N1j04O9J5p6q0K08p8n7j5j3o3K19K5j4k43J49K07m4l90K41j01
$$ 154 -131 7 58 -46 23 38 -38 -118 90 12 -45 -60 -73 -136 83 108 94 -149 0 207 163 -227 14 -87
4905h7p7J34n3q4J26J5J73j01N4k1J43o7j91p6l6K25j9q4n0N6K64k01k78Q3J63
$$ -87 -164 -30 -83 -167 -41 -26 147 46 100 79 222 155 -36 -112 -148 77 58 -26 -76 -20 244 43 -235 -152 11
4930A1l6k8R1R6j9l2k15K37%j53R1R8l98L25J07j80k9j25J89j25J09q9K30k08
$$ 11 -25 -53 38 134 115 83 -132 105 105 -48 43 141 -257 68 175 -5 -34 -159 30 -95 14 -75 155 -53
4954e3mJ68q3k04M0J78r9j56R9J93j39o4J36P9k9j58L6q1K05p9J66j18K3r6J63
$$ -53 -57 111 28 -176 -136 42 -57 -213 -114 79 -60 -124 12 91 62 -96 -60 -141 64 -15 151 33 56 -40 123
4979A23j40oK4O0k40K63l95L45J41l14K16J43j47j01K3Q8p1l7p0J6K89j50K6q8
$$ 123 -17 -23 1 61 -179 84 -311 34 175 -139 77 220 73 -28 -5 83 12 -25 -95 -79 210 60 86 -2
5003brn3M8M2N7J4J27j78j16J15k8l17J70J25J85k02K2J2j57K06L5K4j15J5jO1
$$ -2 -11 -64 -16 26 83 97 224 46 -70 45 17 -300 -130 -5 180 -22 0 12 -145 61 96 120 5 20 19 80
5029H0m5m3J24j11o5M2j4J7j41r6K14p9K10N6k48J6J07K0j7j54L08j10P9j47O7
$$ 80 35 -8 116 5 -60 -18 -32 -15 -156 -252 -38 -117 93 149 -99 -83 24 44 27 -127 181 71 150 3 70
5054G0k03K44j80J43N9j85N7K3l2m1r1J11O7O1mL4j16J26Qm18K28J72K2p9j26
$$ 70 -133 111 -69 74 133 -52 5 28 -4 -45 -136 -25 42 103 99 133 17 143 151 -267 -39 133 155 76 -50
5079e0J06l65N29j76kk33J47J18j14p1J83J28l65J70P0J9j95J77J0J1k19R0N8
$$ -50 56 -309 220 44 42 -191 -44 74 -40 -111 72 200 -165 5 75 94 -101 76 86 97 -122 -32 26
5102B6j0r3J09j8Q6j83rK54j06r1Q0QL0j64j59J28J55k88K56J41l71K31n5J55
$$ 26 16 -77 32 14 100 -83 -92 162 56 -35 45 53 83 -81 -240 -112 43 -245 11 152 -219 12 -43 112
5126A12j40N4j03Q6k5KJ68j75K38l61J29J03q9Q4m0K8n4j11J34J27j66N4l7o6
$$ 112 -28 26 -77 9 -16 -14 154 -21 217 -144 -15 88 -1 83 43 71 17 -94 40 167 1 55 18 -48
5150d8J08j85K00j69L6RJ93j64j01J03j87K58j72J03q5j2J09j66P6J35r4L26k44
$$ -48 60 -125 75 -94 -58 -49 144 -20 -121 -18 -205 53 -119 -16 -101 -113 -4 -170 -94 41 -53 273 29
5173B9k3Q5O0j34P9N8k23J55m7j96R9J18m06L54q2L6P3K63m50K5P3j3O2p9p3L59
$$ 29 6 91 151 17 96 154 -69 86 39 -157 -58 60 -346 8 -74 -38 35 298 -152 -127 -54 -67 -5 -84 -157 202
5199B02j47q0J31j82N2lO6k83J36o1K15j6j5j54J88p9k9J32k37K62J9j95j1J89
$$ 202 55 -25 106 -76 -24 -27 39 -244 -108 -169 46 30 15 -139 49 -30 -59 73 -164 98 117 -78 -89 100
5223A00q5K3J68j17RRP9k62R8Q9r3o3J1k24L73R9n8j35j0J2o4O4j54J30K79m43
$$ 100 15 38 206 89 98 107 186 -76 22 111 18 -45 -34 -258 115 214 156 21 11 23 -41 23 -131 -1 278 -165
5249a65K51L7j72k03K91P2J00l71J53lr0Q5O0q0j19J75J18J3q9J79j71j12K6l7
$$ -165 86 123 -49 -252 39 111 211 -160 -7 -10 -100 -15 45 -35 -154 21 139 152 63 242 71 -41 -15 -52
5273e2R4k07J06mj05K98k09J8J20P3j5j15Q5l00K13J46k17OK67j21j39k8R0Q5
$$ -52 42 -165 -59 -63 -168 130 -79 -61 59 132 117 2 87 -213 0 146 -71 -65 202 81 -58 -86 4 89
5297H9j57j4j22J60k6q8J3J73k0P8k6M8j67m8M9L7J07j96K73M9j28jk20K01j10
$$ 89 -68 -82 -204 -44 -70 -158 -145 28 8 86 60 108 -59 -107 -58 -21 86 -110 163 212 84 83 -137 64 -46
5322d6J84J13k62q6J62k9j54J11J25r8QR6p2k4o7j2L8j12J28NM1j06K42o6K5K5
$$ -46 138 251 -11 -97 65 36 -118 -7 118 20 28 124 52 28 -39 -51 -13 -125 3 8 49 -57 185 119 144 169
5348A69k84J31M0j4m5P0j12K18j88p5L25j94k27K72L4Pj89J27l16K83Nn6K4j82
$$ 169 -115 16 56 42 -3 67 -45 173 -15 -90 235 41 -186 86 120 127 -62 65 -251 32 37 -19 5 -177
5372a77J46J45Q8k30J16j73k6L1p6J77r7L22K9l96J40N1N6k11L9K16N3j83p7P5
$$ -177 -31 114 202 -28 88 -85 -111 -80 -156 21 -76 246 275 -121 19 70 126 -85 -46 170 223 40 -37 38
5396C8j60J78Q7k72O8J25j66J27K6l2M6j79J72l24K44J14k06M9N2k3K31j60j7
$$ 38 -122 56 143 -129 -61 64 -102 25 51 19 65 -114 58 -266 -22 92 -114 -65 -13 -36 195 35 18
5419A8n0j72L07j2q8P1J3j66J30j62q5R1j65L05J18k23J36M1k0j11J50L1j79Q4
$$ 18 -32 -204 103 91 3 74 87 -79 51 -111 -196 -105 -270 35 153 -70 66 107 87 -24 126 157 -22 62
5443F2R1j35n6J9Q2Mj50J01K6k16O4K33l36L04J2rk57OJ48l55N00K0k03n0J28
$$ 62 153 18 -38 -19 63 67 -83 18 44 -172 -108 125 -211 93 105 96 -161 -155 -7 -362 138 158 -45 -95 33
5468C3m8j09n5K8K16k76K08N6k06J26O0M7Q2o8k17r0J90j37R9J88j40J28j43J08
$$ 33 -15 -124 -179 -151 65 -211 -3 53 -153 -27 33 80 162 94 -123 -213 -23 -160 -61 127 -13 115 -28 80
5492H0k11J11J01j60LM5P8k09R2K6j14K58J3r6j25M4QK77j35j33o2NJ28P1J26
$$ 80 -131 -20 81 -79 -76 -31 47 -162 -70 -44 -158 100 113 17 -108 -64 -56 221 86 -47 -109 -104 24 95 221
5517B21k53J86p3M6k04J16o9pJ31j2j11J06j49n5J12M6l0J8k70L04J16k42L07
$$ 221 -32 154 81 127 -77 39 -30 -37 94 82 -29 77 -72 -127 -15 31 1 19 -251 53 169 -73 234
5540B34j90K6j42Q4j86J8K0K55j27J27q0N3M2r1M6k2M2J18l32J07r8p0R9M0J8
$$ 234 44 70 -72 12 -174 -156 -136 119 -8 119 39 92 134 43 89 67 109 227 -105 2 -96 -166 -67 -27 -9
5565iq2J92j95K23J03j94j18O0J3KJ59j43j7J21m4j11J70l13K42l0n8L46k18j25
$$ -9 -91 101 -94 129 232 38 -80 -20 -7 -5 154 11 -6 115 71 -40 130 -183 59 29 -29 317 99 -26
5589b6j3J28M0p6j30K83k78M3j05NN8K25j3j92J44O6j4j20K4O1l44J26J24P7l84
$$ -26 -39 89 129 53 -77 206 -72 -29 -134 -129 -71 154 141 -51 93 159 145 25 49 110 -234 -108 16 93 -291
5614b91L43m5j3j6J40j17L5l3j07O5L00k93m6Q3j11P0rR7k7P4k22K90j23q1J36
$$ -291 52 7 -6 -22 118 1 36 3 -104 -39 261 -32 -78 5 -106 -36 -45 52 25 99 -123 167 44 -37 99
5639I9l2O6j09O6k53j7K39M6j56l3J55j68J03J59j66j68M3j75L44p5Q6j77K40
$$ 99 67 133 24 90 -163 -180 59 105 -51 -84 71 -97 6 165 -1 -169 -126 -301 43 -32 54 -123 117
5662A17j37N7l6mK11k59O7J34M7o8l3o9P5j6J14o1J09k94K13o3j39J4p7J02j74
$$ 117 -20 37 1 -3 208 -51 16 150 197 129 96 27 102 86 200 139 248 -46 167 104 -35 -21 -98 4 -170
5687a70J52J07j04o9J33J37k55J76l30K23Rj7l8J05k34J50j36K56j01n4j10K65
$$ -170 -18 89 -15 -84 49 186 -69 107 -223 0 9 -8 -46 59 -175 -25 -161 95 -6 -60 -170 95
5709I5o9k96K91J16o0K8r4o1m3P8j74J02J74j75r6J00J15j47K08l6K4l55K02J74
$$ 95 26 -270 21 137 77 105 11 -50 -93 -15 -189 -87 87 -88 -184 -84 31 -116 92 56 80 -275 -73 101
5733A01j38k8K14k35L5J95j52j08l6L9J1L32m14J66p3j81L93j64P3o8J13m7K2
$$ 101 -37 -65 149 -86 -51 144 -8 -116 -152 -113 -102 230 -184 -18 -91 -272 121 -43 30 -38 75 28 50
5756E0j75J01J50M4k11M6j48k7K44k63M03k93J21j00k0j2k3K62j75K8j00J05K5
$$ 50 -125 -24 126 170 -41 5 -143 -170 74 -189 214 -79 42 -58 -78 -90 -113 149 -26 2 -98 7 32
5779C2qr0J6K7K6P0j26J17Np2j11J36J13k80O5R7k3J3J5K63j0o3k37o5J70J03
$$ 32 24 -66 -50 -23 3 73 -53 64 69 -3 -114 22 135 -145 -80 17 -6 7 22 285 275 212 -25 -90 80 183
5805A83l9l01O2K39j57k8j17N6j05M35l18J59J48j87p7J1J62j27k08J68L04j36
$$ 183 144 -157 -95 144 -13 -41 -158 -102 -207 228 -90 69 217 30 -47 -36 126 -1 -209 -41 263 127
5827A27j58J04m5J11j98K53j84k8Q2j24K44k23L8j10J18k5L0j32J61m5j4J11p3
$$ 127 -31 73 28 139 -59 194 10 -18 64 -60 184 -39 -1 -111 7 -18 12 -120 41 -4 -18 93 20
5850B0j12M26l41j77J90J4j02k3m3K76q6M2Lj31n0J40M4Ok96K49k60M47k80LM1
$$ 20 -92 334 -7 -184 6 20 -82 -105 -148 128 42 84 87 -44 -94 46 90 96 -200 49 -211 236 -44 -41 0
5875@j16mJ37J62k22L7m0M3o6K06j74L7J4k13K72j41J75j21J6K10Q8j94j79k0
$$ 0 -116 -120 17 179 -43 -6 -46 -3 -69 137 -37 0 14 -199 73 -68 107 -14 2 212 300 106 -73 -93
5899i3Q8J11m6k21K27r1r9J0Q5O5r2L1O5l6o4K57j82j38K24j9jl2j27J52j00j18
$$ -93 -5 106 60 -161 66 -25 -124 -114 -29 36 -56 -25 40 4 -60 197 15 -123 101 82 81 49 -78 74 -26 -144
5925a44K01k7j7L6j87J26n0J39j36J07k27K52j32L7N1j44J31K16k55kj2L5L7j14
$$ -144 57 30 13 49 -138 -12 -62 77 -59 48 -179 73 -59 -22 29 -115 16 232 -23 -25 -37 -2 35 -79
5949g9K52r4j94QL6R1p6L01l97j34K60m0J23m5j55K46j47k8J75m9m6N8l2k7JJ
$$ -79 173 79 -115 -107 -71 20 -56 245 -152 -286 -26 -66 57 12 -143 103 -44 -72 103 54 8 66 34 7 8 9
5975Ij32J02K41o1q6j20l6J40j50K98j20p6o9J9O8K2J45j25J43nj59J41j58q8
$$ 9 -123 -21 220 159 73 -47 -83 57 -93 205 85 9 -60 -41 27 49 194 69 212 207 48 189 31 -57
5999e7J88n2j91K25j25m9j0j23J62j28J39m8R7p4J42j78M0j53n3J11J79j42N9
$$ -57 131 79 -112 113 -12 -61 -71 -194 -32 -160 -21 -69 28 -46 96 -82 -42 -195 -248 -137 42 -100 -41
$$ [...]
8191E7
##END NTUPLES=NMR FID
##END=
