##TITLE=1H_Pr t-Bu-Am
 200.13MHz,CDCl3,
 8 sc
 
 23.6.2025
##JCAMPDX= 6.0         $$ Bruker NMR JCAMP-DX V2.0
##DATA TYPE= NMR FID
##DATA CLASS= NTUPLES
##ORIGIN= UXNMR, Bruker Analytische Messtechnik GmbH
##OWNER= pz
$$ XWIN-NMR		Version 3.5
$$ Mon Jun 23 16:44:25 2025 Russian Standard Time (UT+4h)  she@DPX200
##.OBSERVE FREQUENCY= 200.1313
##.OBSERVE NUCLEUS= ^1H
##.DELAY= (6, 6)
##.ACQUISITION MODE= SIMULTANEOUS
##.ACQUISITION SCHEME= undefined
##.AVERAGES= 8
##.DIGITISER RES= 18
##SPECTROMETER/DATA SYSTEM= spect
##.PULSE SEQUENCE= zg30
##.SOLVENT NAME= CDCl3
##.SHIFT REFERENCE= (INTERNAL, CDCl3, 0, 14.3821)
##AUDIT TRAIL= $$ (NUMBER, WHEN, WHO, WHERE, WHAT)
$$ ##TITLE= Audit trail, XWIN-NMR		Version 3.5
$$ ##JCAMPDX= 5.01
$$ ##ORIGIN= Bruker BioSpin GmbH
$$ ##OWNER= she
$$ F:/spectra/data/she/nmr/H-C/1/audita.txt
$$ ##AUDIT TRAIL=  $$ (NUMBER, WHEN, WHO, WHERE, WHAT)
(   1,<2025-06-23 16:42:55.85 +0400>,<she>,<DPX200>,
      <created by zg, POWCHK disabled, PULCHK disabled
       configuration hash MD5:
       00 E9 B6 7A A2 85 ED C7 34 08 36 98 17 FE 4E 26
       data hash MD5: 16K
       67 DE 70 D6 82 76 5E FA 53 74 A7 AA B1 48 0F 28>)
$$ ##END=
$$ 
$$ hash MD5
$$ 68 E3 18 87 83 6E 75 8D C3 33 BD DD 91 E6 90 1F
##$RELAX= 
##$RELAX= 
##$RELAX= 
##$RELAX= 
##$RELAX= 
##$RELAX= 
$$ Bruker specific parameters
$$ --------------------------
##$DU= <F:/spectra>
##$EXPNO= 1
##$NAME= <H-C>
##$PROCNO= 1
##$TYPE= <nmr>
##$USER= <she>
##$AMP= (0..31)
100 100 100 100 100 100 100 100 100 100 100 100 100 100 100 100 100 100 
100 100 100 100 100 100 100 100 100 100 100 100 100 100 
##$AQSEQ= 0
##$AQ_mod= 1
##$AUNM= <au_zg>
##$AUTOPOS= <>
##$BF1= 200.13
##$BF2= 200.13
##$BF3= 200.13
##$BF4= 200.13
##$BF5= 200.13
##$BF6= 200.13
##$BF7= 200.13
##$BF8= 200.13
##$BYTORDA= 1
##$CFDGTYP= 0
##$CFRGTYP= 5
##$CHEMSTR= <none>
##$CNST= (0..31)
1 1 145 1 1 1 1 1 1 1 1 1 1 1 1 1 1 1 1 1 1 1 1 1 1 1 1 1 1 1 1 1 
##$CPDPRG= <>
##$CPDPRG1= <>
##$CPDPRG2= <>
##$CPDPRG3= <>
##$CPDPRG4= <mlev>
##$CPDPRG5= <mlev>
##$CPDPRG6= <mlev>
##$CPDPRG7= <mlev>
##$CPDPRG8= <mlev>
##$CPDPRGB= <>
##$CPDPRGT= <>
##$D= (0..31)
0 0.7 0 0 0 0 0 0 0 0 0 0.03 0 0 0 0 0 0 0 0 0 0 0 0 0 0 0 0 0 0 0 0 
##$DATE= 1750682575
##$DBL= (0..7)
120 120 120 120 120 120 120 120 
##$DBP= (0..7)
150 150 150 150 150 150 150 150 
##$DBP07= 0
##$DBPNAM0= <>
##$DBPNAM1= <>
##$DBPNAM2= <>
##$DBPNAM3= <>
##$DBPNAM4= <>
##$DBPNAM5= <>
##$DBPNAM6= <>
##$DBPNAM7= <>
##$DBPOAL= (0..7)
0.5 0.5 0.5 0.5 0.5 0.5 0.5 0.5 
##$DBPOFFS= (0..7)
0 0 0 0 0 0 0 0 
##$DE= 6
##$DECBNUC= <off>
##$DECIM= 32
##$DECNUC= <off>
##$DECSTAT= 4
##$DIGMOD= 1
##$DIGTYP= 9
##$DL= (0..7)
0 120 120 120 120 120 120 120 
##$DP= (0..7)
150 150 150 150 150 150 150 150 
##$DP07= 0
##$DPNAME0= <>
##$DPNAME1= <>
##$DPNAME2= <>
##$DPNAME3= <>
##$DPNAME4= <>
##$DPNAME5= <>
##$DPNAME6= <>
##$DPNAME7= <>
##$DPOAL= (0..7)
0.5 0.5 0.5 0.5 0.5 0.5 0.5 0.5 
##$DPOFFS= (0..7)
0 0 0 0 0 0 0 0 
##$DQDMODE= 0
##$DR= 18
##$DS= 0
##$DSLIST= <SSSSSSSSSSSSSSS>
$$ [...]
##$SUBNAM0= <"">
##$SUBNAM1= <"">
##$SUBNAM2= <"">
##$SUBNAM3= <"">
##$SUBNAM4= <"">
##$SUBNAM5= <"">
##$SUBNAM6= <"">
##$SUBNAM7= <"">
##$SUBNAM8= <"">
##$SUBNAM9= <"">
##$SW= 18.0517328524113
##$SWIBOX= (0..15)
0 0 2 0 0 0 0 0 0 0 0 0 0 0 0 0 
##$SW_h= 3612.71676300578
##$TD= 16384
##$TD0= 1
##$TE= 0
##$TE2= 300
##$TE3= 300
##$TEG= 300
##$TL= (0..7)
0 120 120 120 120 120 120 120 
##$TP= (0..7)
150 150 150 150 150 150 150 150 
##$TP07= 0
##$TPNAME0= <>
##$TPNAME1= <>
##$TPNAME2= <>
##$TPNAME3= <>
##$TPNAME4= <>
##$TPNAME5= <>
##$TPNAME6= <>
##$TPNAME7= <>
##$TPOAL= (0..7)
0.5 0.5 0.5 0.5 0.5 0.5 0.5 0.5 
##$TPOFFS= (0..7)
0 0 0 0 0 0 0 0 
##$TUNHIN= 0
##$TUNHOUT= 0
##$TUNXOUT= 0
##$USERA1= <user>
##$USERA2= <user>
##$USERA3= <user>
##$USERA4= <user>
##$USERA5= <user>
##$V9= 5
##$VALIST= <valist>
##$VCLIST= <CCCCCCCCCCCCCCC>
##$VD= 0
##$VDLIST= <DDDDDDDDDDDDDDD>
##$VPLIST= <PPPPPPPPPPPPPPP>
##$VTLIST= <TTTTTTTTTTTTTTT>
##$WBST= 1024
##$WBSW= 4
##$XGAIN= (0..3)
0 0 0 0 
##$XL= 0
##$YL= 0
##$YMAX_a= 410355
##$YMIN_a= -491053
##$ZGOPTNS= <>
##$ZL1= 120
##$ZL2= 120
##$ZL3= 120
##$ZL4= 120
##$ABSF1= 10
##$ABSF2= 0
##$ABSG= 5
##$ABSL= 3
##$ALPHA= 0
##$AQORDER= 0
##$ASSFAC= 0
##$ASSFACI= 0
##$ASSFACX= 0
##$ASSWID= 0
##$AUNMP= <proc_1d>
##$AZFE= 0.1
##$AZFW= 0.1
##$BCFW= 1
##$BC_mod= 2
##$BYTORDP= 1
##$COROFFS= 0
##$CY= -3
##$DATMOD= 1
##$DC= 2
##$DFILT= <>
##$DTYPP= 0
##$F1P= 0
##$F2P= 0
##$FCOR= 0.5
##$FTSIZE= 0
##$FT_mod= 4
##$GAMMA= 1
##$GB= 0.15
##$INTBC= 1
##$INTSCL= 1
##$ISEN= 128
##$LB= 0.25
##$LEV0= 0
##$LPBIN= 0
##$MAXI= 10000
##$MC2= 0
##$MEAN= 0
##$ME_mod= 0
##$MI= 1.114404
##$NCOEF= 0
##$NC_proc= 0
##$NLEV= 6
##$NOISF1= 3.799351
##$NOISF2= 2.8
##$NSP= 1
##$NTH_PI= 0
##$NZP= 0
##$OFFSET= 14.38212
##$PC= 1
##$PHC0= -1200.017
##$PHC1= 14.7922
##$PH_mod= 1
##$PKNL= yes
##$PPARMOD= 0
##$PSCAL= 0
##$PSIGN= 0
##$REVERSE= no
##$SF= 200.129724274929
##$SI= 16384
##$SIGF1= 3
##$SIGF2= 2
##$SINO= 400
##$SIOLD= 16384
##$SREGLST= <1H.CDCl3>
##$SSB= 0
##$STSI= 0
##$STSR= 0
##$SW_p= 3205.1282051282
##$SYMM= 0
##$S_DEV= 0
##$TDeff= 0
##$TDoff= 0
##$TI= <>
##$TILT= no
##$TM1= 0
##$TM2= 0
##$TOPLEV= 0
##$USERP1= <user>
##$USERP2= <user>
##$USERP3= <user>
##$USERP4= <user>
##$USERP5= <user>
##$WDW= 1
##$XDIM= 8192
##$YMAX_p= 0
##$YMIN_p= 0
$$ End of Bruker specific parameters
$$ ---------------------------------
##NTUPLES= NMR FID
##VAR_NAME=  TIME,          FID/REAL,        FID/IMAG
##SYMBOL=    X,             R,               I
##VAR_TYPE=  INDEPENDENT,   DEPENDENT,       DEPENDENT
##VAR_FORM=  AFFN,          ASDF,            ASDF
##VAR_DIM=   8192,          8192,            8192
##UNITS=     SECONDS,       ARBITRARY UNITS, ARBITRARY UNITS
##FACTOR=    0.0002768,     1,               1
##FIRST=     0,             0,               0
##LAST=      2.2672688,     0,               0
##MIN=       0,             -491053,         0
##MAX=       2.2672688,     410355,          0
$$ Real data points
##PAGE= N=1
##DATA TABLE= (X++(R..R)), XYDATA
$$ [...]
$$ plain form
2253 -1941 464 1120 -1721 -1115 1390 10 -1848 751 1614 -1241 -103 2098 157 -1055 1519 1280
2269 1280 -1587 -228 1596 -481 -1787 995 288 -2222 -543 1054 -1468 -1742 1161 335 -1836 414
2285 414 1938 -711 -776 1885 697 -1494 990 1841 -1169 -616 1708 75 -1689 487 1104 -1832
2301 -1832 -832 1490 -621 -1980 863 931 -1582 -319 1761 -208 -1131 1246 1130 -1483 -296 1574
2317 1574 -897 -1519 1315 211 -1744 -242 1290 -1182 -1164 1508 645 -1547 426 1884 -725 -766
2333 -766 1993 446 -1228 887 1401 -1223 -886 1348 -194 -1867 469 683 -1957 -756 1474 -334
2349 -334 -1650 1028 1016 -1096 -125 1765 -352 -1084 1551 1292 -1467 -176 1739 -500 -1394 893 336
2366 336 -1639 -127 1598 -880 -1521 1208 897 -1597 294 1551 -635 -806 1675 975 -1528 49
$$ packed form
2253a941K405O56k841O06K505j380j858K599Q63k855J138K201j941j212K574k39
2269A280k867J359J824k077j306K782p07k510J679J597k522k74K903q26k171K250
2285D14J524k649o5K661j188k191K484Q51l010N53K324j633j764K176O17k936
2301a832J000K322k111j359K843O8k513J263K080j969r23K377j16k613J187J870
2317A574k471o22K834j104j955J502J532k472J8K672q63k192J973J458k609m1
2333g66K759j547j674K115N14k624L37K234j542j673K336K14k640J201K230j808
2349c34j316K678j2k112R71J890k117p32K635k59k759J291J915k239q94K287n57
2366C36j975J512J725k478o41K729l11k494J891J257k186j71K481p00k503J577
$$ plain form
2382 49 1464 -907 -1306 1086 83 -1913 105 1339 -1002 -1456 975 365 -1099 433 1490 -783
2398 -783 -549 1721 689 -1059 436 1165 -427 -477 1104 -28 -1633 246 1215 -1000 -1253 399 -110
2415 -110 -1074 612 817 -806 -586 1405 770 -886 60 807 -381 -98 932 -234 -1283 -3 979
2432 979 -523 -1035 144 -60 -608 145 550 -870 -669 1234 397 -333 -22 505 127 187 640 -172 -919
2451 -919 -72 937 -168 -778 -205 -247 -249 45 144 -507 -659 606 1082 -123 -332 201 457 277 276 5 -652
2472 -652 -227 526 403 -1051 -1085 -106 116 -149 -90 -638 -841 291 1150 239 -846 -22 701 486 166 269
2492 269 -257 -433 566 955 -769 -1115 -142 635 -338 -349 -163 -747 -26 1077 567 -869 -303 919 750
2511 750 -228 73 22 -758 398 1213 -359 -1581 -92 714 -206 -291 166 -471 -755 1042 933 -1184 -894
$$ packed form
2382D9J415k371l99K392j003j996K018J234k341m54K431o10j464J532J057k273
2398g83K34K270j032j748J495P29j592n0J581j132j605J879R69k215k53J652n09
2415a10r64J686K05j623K20J991o35j656R46P47j188K83J030j166j049J280R82
2432I79j502n12J179k04n48P53M05j420K01J903q37p30L11N27l78O0M53q12p47
2451i19Q47J009j105o10N73m2kK94R9o51j52J265M76j205k09N33K56j80jk71o57
2472f52M25P53j23j454l4R79K22k65N9n48k03J132Q59r11j085Q24P23k15l20J03
2492B69n26j76R99L89j724l46R73P77r73j1J86n84P21J103n10j436N66J222j69
2511G50r78L01n1p80J156Q15j572j222J489Q06r20q5M57o37k84J797j09k117K90
$$ plain form
2530 -894 1130 834 -274 287 397 -521 -149 1349 61 -1766 -172 1394 -305 -606 340 -412 -1204
2547 -1204 624 1203 -937 -1310 1189 864 -838 115 813 -985 -178 1857 453 -1714 -132 1665
2563 1665 -226 -788 862 -87 -1521 695 1568 -1136 -1559 1289 879 -1173 1 984 -1015 -582 2068
2580 2068 546 -2278 -60 1828 -380 -967 1171 -117 -1962 735 1576 -1428 -1540 1436 795 -1301
2596 -1301 392 1367 -1248 -200 2359 611 -2096 94 1965 -810 -809 1282 -423 -1777 874 1485
2612 1485 -1524 -1466 1346 350 -1386 643 1193 -1494 -408 2193 190 -1883 603 1581 -714 -479
2628 -479 1293 -119 -1623 1080 1395 -1488 -913 1297 34 -1256 585 728 -1253 -179 1725 129
2644 129 -1587 870 880 -1093 -7 1103 -588 -1447 1314 479 -1494 -710 940 -338 -830 790 294
$$ packed form
2530h94K024k96j108N61J10r18L72J498j288j827J594J566j699l01R46p52p92
2547a204J828N79k140l73K499l25j702R53O98j798Q07K035j404k167J582J797
2563A665j891n62J650r49j434K216Q73k704m23K848m10k052J174R83j999M33K650
2580B068j522k824K218J888k208n87K138j288j845K697Q41l004j12K976o41k096
2596a301J693R75k615J048K559j748k707K190J871k775JK091j705j354K651O11
2612A485l009N8K812r96j736K029N50k687J086K601k003k073K486R78k295K35
2628d79J772j412j504K703L15k883N75K210j263j290J841J43j981J074J904j596
2644A29j716K457J0j973J086J110j691q59K761q35j973P84J650j278m92J620m96
$$ plain form
2661 294 -1285 373 1389 -518 -778 1164 637 -460 595 952 -630 -582 966 152 -1237 225 638
2678 638 -723 -405 550 -492 -1098 406 815 -563 -196 866 -192 -498 953 602 -916 168 874
2695 874 -331 -960 397 -113 -781 -1 611 -678 -681 930 137 -799 496 602 -589 85 1034 9
2713 9 -673 982 674 -757 -58 935 -461 -810 654 42 -1085 -105 916 -589 -743 714 288 -846
2731 -846 495 1003 -701 -438 1191 164 -784 652 720 -739 -428 877 -158 -1467 396 687 -1144
2748 -1144 -376 1064 -347 -773 826 437 -1012 55 1451 -332 -823 925 543 -1306 140 1111
2764 1111 -770 -1022 737 364 -1397 267 1043 -851 -798 1351 283 -979 421 1038 -870 -177 1171
2781 1171 63 -918 447 708 -1144 -459 858 -624 -1309 462 635 -896 -129 1054 -398 -815 1085
$$ packed form
2661B94j579J658J016j907k60J942n27j097J055L57j582M8J548q14j389J462M13
2678F38j361L18R55j042o06J504M09j378L67J062j058l06J451l51j518J084P06
2695H74j205o29J357n10o68P80O12j289lJ611p93r36J295J06j191O74R49j025
2713Io82J655l08j431O99R93j396l49J464o12j127R80J021j505j54J457m26j134
2731h46J341N08j704K63J629j027r48J436O8j459L11J305j035j309J863K91j831
2748a144P68J440j411m26J599l89j449J067J396j783m91J748l82j849J446R71
2764A111j881k52J759l73j761J664P76j894N3K149j068j262J400O17j908O93J348
2781A171j108r81J365K61j852O85J317j482o85J771J73j531P67J183j452m17J900
$$ plain form
2798 1085 734 -1123 121 1427 -410 -558 1319 519 -1087 92 939 -806 -868 630 142 -1316 -48
2815 -48 844 -840 -811 956 36 -1097 725 1132 -515 -58 1171 287 -1046 571 844 -921 -434 1052
2833 1052 -414 -1047 466 593 -1294 -301 1053 -190 -1026 800 555 -1186 89 948 -223 -501 741
2850 741 687 -925 -247 735 -845 -791 510 7 -1193 36 908 -494 -689 926 290 -686 539 976
2868 976 -356 -335 1097 316 -572 291 429 -673 -165 436 -366 -1039 -92 421 -754 -236 581 -108 -287
2887 -287 610 322 -545 64 899 275 -373 166 346 -426 10 452 -368 -527 78 82 -443 -167 156 -121 -228
2908 -228 544 290 -319 119 773 5 129 297 -53 -317 84 77 -563 -413 -11 -62 -232 -97 -97 -234 78 655
2930 655 67 -177 219 152 417 603 309 -150 213 541 275 -400 10 -244 -322 254 -17 -470 -384 175 97
$$ packed form
2798A085l51j857J244J306j837j48J877q00j606J179Q47j745o2J498m88j458J268
2815d8Q92j684K9J767r20j133J822M07j647M57J229q84j333J617K73j765M87J486
2833A052j466o33J513J27j887R93J354j243q36J826k45j741J275Q59j171k78J242
2850G41n4j612O78R82j580N4J301n03j200J229Q72j402j95J615o36r76J225M37
2868I76j332K1J432p81q88Q63J38j102N08O01q02o73R47N13j175N18Q17o89j79
2887b87Q97k88q67O09Q35o24o48N39J80p72M36M42q20j59O05Mn25K76L23k77j07
2908b28P72k54o09M38O54p68J24J68l50k64M01po40J50M02n1j70J35%j37L12N77
2930F55n88k44L96o7K65J86k94m59L63L28k66o75M10k54p8N76k71m53Q6N59p8
$$ plain form
2951 97 -261 94 -66 -136 291 658 99 -684 265 450 -99 69 139 -431 -413 488 181 -845 -327 193 -142
2972 -142 -232 273 -70 -441 251 927 -93 -322 395 629 -363 239 288 -743 -332 701 -39 -1062 -159
2991 -159 242 -258 -212 309 -134 -898 543 1093 -516 -655 784 515 -174 503 339 -620 -416 1049 394
3010 394 -1085 -250 683 -541 -504 359 -319 -986 334 912 -330 -930 592 377 -682 430 523 -722
3028 -722 -414 977 302 -1131 -80 543 -370 -456 506 -74 -1269 337 1036 -598 -903 661 323 -352
3046 -352 396 752 -544 -441 1291 558 -1023 -49 725 -747 -746 444 -271 -1351 -40 1054 -441 -988
3064 -988 501 361 -471 565 832 -610 -405 1241 443 -775 95 809 -466 -582 824 -186 -1110
3081 -1110 277 821 -699 -965 584 140 -697 361 942 -734 -586 1203 469 -930 127 697 -404
$$ packed form
2951I7l58L55j60p0M27L67n59p83R49J85n49J68P0n70J8R01l07j026N18N20l35
2972a42r0N05l43l71O92O76j020k29P17K34r92O02M9j031M11J033p40j023R03
2991a59M01n00M6N21m43p64J441N50j609j39J439k69o89O77j64r59K04J465o55
3010C94j479Q35R33j224L7Q63o78o67J320N78j242o00J522k15j059J112R3j245
3028g22L08J391o75j433J051O23r13q6R62n80j195J606O99j634l05J564l38o75
3046c52P48L56j296J03J732p33j581R74P74j472JJ190p15j080J311J094j495n47
3064i88J489j40q32J036K67j442K05J646p98j218Q70P14j275j16J406j010r24
3081a110J387N44j520k66J549m44q37J058N81j676J48J789p34j399J057N70j101
$$ plain form
3098 -404 -372 495 -362 -983 178 778 -349 -791 602 72 -474 382 684 -550 33 1058 342 -515 163
3117 163 563 -405 -276 704 -245 -859 209 398 -631 -684 332 -368 -348 136 430 -649 -27 831 176
3136 176 -369 465 460 -173 194 499 -410 -696 447 326 -742 -83 217 -457 -286 466 -112 -727 216 451
3156 451 44 -338 525 108 -183 471 304 -630 -163 775 -187 -310 149 -7 -479 -47 390 -413 -307 575
3176 575 87 -187 286 384 -387 -85 726 -76 -348 246 406 -397 -257 319 -624 -439 216 109 -444 -274
3196 -274 351 -122 -526 344 404 -619 442 426 -419 -274 673 260 -351 251 468 -512 -522 491 -36 -942
3216 -942 209 364 -729 -383 648 -192 -639 661 743 -436 -54 842 96 -617 592 368 -767 -66
3234 -66 556 -677 -811 433 -45 -791 46 635 -298 -691 693 292 -784 427 820 -352 -214 893
$$ packed form
3098d04L2Q67q57o21J161O00j127m42J393n30n46Q56L02j234N83J025p16q57O78
3117A63M00r68J29R80r49o14J068J89j029n3J016p00K0M84K94j079O22Q58o55
3136A76n45Q34no33L67L05r09k86J143j21j068O59L00o74J71P52n78o15R43K35
3156D51m07l82Q63m17k91O54j67r34M67R38r62j23M59j56m72M32M37q03J06Q82
3176E75m88k74M73R8p71L02Q11q02k72N94J60q03J40N76r43J85O55j07n53J70
3196b74O25m73m04Q70O0j023J061j6q45J45R47m13o11O02K17r80j0J013n27r06
3216i42J151J55j093L46J031q40m47J300Q2j179L82Q96p46p13J209k24j135P01
3234f6O22j233j34J244m78p46Q37N89r33l93J384m01j076J211L93j172J38J107
$$ plain form
3252 893 242 -708 184 519 -626 -299 438 -199 -988 221 328 -945 -388 786 -212 -597 627 749
3270 749 -434 -55 1084 34 -499 881 546 -874 -43 670 -311 -894 418 91 -1133 0 740
3287 740 -420 -575 662 183 -573 208 991 -266 -18 946 236 -836 319 791 -649 -620 750 -148
3305 -148 -841 333 457 -796 -345 922 82 -610 802 718 -357 -33 952 160 -573 622 498 -710
3323 -710 -32 496 -513 -927 289 202 -1070 -190 587 -266 -627 582 465 -622 121 882 -374 -274
3341 -274 787 113 -363 320 399 -636 -167 352 -200 -661 129 436 -575 -67 810 -92 -306 428 597
3360 597 -413 42 477 105 -496 361 172 -562 -404 471 -258 -598 289 17 -480 102 402 -215 -244 671
3380 671 274 -150 201 536 -108 -101 362 -175 -452 199 271 -484 -289 8 -212 -567 162 34 -432 13 400
$$ packed form
3252H93o51r50Q92L35j145L27P37o37p89J209J07j273N57J174r98l85J224J22
3270G49j183L79J139j050n33J380l35j420Q31P13r81n83J312l27j224J133P40
3287G40j160j55J237m79p56P81P83j257K48R64p10j072J155M72j440K9J370q98
3305a48o93J174J24j253M51J267q40o92J412q4j075L24R85p92p33J195j24j208
3323g10O78N28j009m14J216q7j272Q80P77q53l61J209j17j087P43P61j256J00
3341b74J061o74m76O83P9j035M69N19n52m61P90L07j011N08Q77r02k14P34J69
3360E97j010M55M35l72o01Q57j89p34J58Q75p29l40Q87k72m97N82L00o17k9R15
3380F71l97m24L51L35o44PM63n37k77O51P2p55J95K97k20l55P29j28m66M45L87
$$ plain form
3401 400 22 -201 399 498 -227 432 405 -297 -96 490 240 -388 125 -46 -466 -108 169 -462 -599 268 305
3422 305 -218 99 483 85 -207 677 335 -383 -43 422 -345 -177 492 -95 -723 29 233 -615 -585 424
3442 424 -89 -453 254 416 -326 -57 824 -133 -525 248 606 -338 102 495 -360 -610 455 337 -519 -423
3462 -423 448 0 -251 302 17 -738 -41 1062 -84 -682 615 316 -350 106 572 -513 -736 775
3480 775 245 -955 -242 459 -462 -521 546 97 -976 -45 909 -266 -544 448 320 -396 30 790 -689
3499 -689 -419 731 -36 -841 -313 286 -492 -478 545 -122 -828 90 898 -416 -375 524 268 -497 556
3518 556 677 -337 -356 883 299 -762 -147 188 -470 -96 486 -378 -673 86 524 -424 -726 375 26
3537 26 -455 495 570 -509 -372 656 167 -415 -1 403 -397 -176 505 -191 -958 120 396 -294 -433 380
$$ packed form
3401D00l78k23O00R9p25O59k7p02K01N86k50o28N13j71m20L58K77o31j37Q67L7
3422C05n23L17L84l98k92Q84l42p18L40M65p67J68O69n87o28P52K04q48L0J009
3442D24n13l64P07J62p42K69Q81r57l92P73L58r44M40L93q55k50J065j18q56R6
3462d23Q71m48k51N53k85p55O97J103j146n98J297k99o66M56M66j085k23J511
3480G75n30j200P13P01r21n9J067m49j073R31R54j175k78R92j28p16M26P60j479
3499f89K70J150p67q05N28N99p78J4J023o67p06R18Q08j314M1Q99k56p65J053
3518E56J21j014j9J239n84j061O15L35o58L74N82q64k95P59M38r48l02J101l49
3537B6m81R50P5j079J37J028m89n82M14M04q00K21O81o96p67J078K76o90j39Q13
$$ plain form
3557 380 120 -242 377 549 -336 -245 686 308 -357 253 384 -325 -344 214 -187 -684 56 462 -343 -262 238
3578 238 -61 -298 250 494 -303 23 565 343 -251 -21 486 -372 37 429 -143 -582 79 317 -411 -243
3598 -243 25 -112 -301 145 177 -154 -198 508 216 -145 167 288 -191 -19 331 -141 -430 261 201 -310 41
3619 41 129 -164 -309 190 -25 -167 129 141 47 75 69 120 15 254 193 -389 -37 214 -330 -109 172 -46 -341
3642 -341 1 -32 -307 -208 68 77 -111 140 78 15 -23 435 -106 -140 109 25 -173 9 88 -237 -293 178 28 -247
3666 -247 -34 32 -135 -338 271 473 -424 189 480 -24 -81 329 138 -43 147 414 -303 -280 372 -162 -518
3687 -518 -29 160 -510 -311 511 134 -334 302 369 -411 42 647 -31 -183 312 259 -361 -49 262 -112 -413
3708 -413 233 -17 -623 -94 394 -184 -271 577 449 -545 208 481 -156 -334 285 17 -491 211 410 -500
$$ packed form
3557C80k60l62O19J72q85R1R31l78o65O10J31p09j9N58m01m97P40M06q05Q1N00
3578B38k99k37N48K44p97L26N42k22n94K30N07q58M09L92n72m39O61K38p28J68
3598b43K68j37j89M46L2l31m4P06k92l61L12J21m79J72L50m72k89O91o0n11L51
3619D1Q8k93j45M99k15j42K96J2r4K8oN1j05K39o1n82L52K51n44K21K81k18k95
3642c41L42l3k75R9K76Rj88K51o2o3l8M58n41l4K49q4j98J82P9l25n6M71j50k75
3666b47K13O6j67k03O09K02q97O13K91n04n7M10j91j81J90K67p17K3O52n34l56
3687e18M89J89o70J99Q22l77m68O36O7p80M53O05o78j52M95n3o20L12L11l74l01
3708d13O46k50o06N29M88n78q7Q48j28r94P53K73o37j78O19k68n08P02J99r10
$$ plain form
3728 -500 -455 336 -102 -632 20 367 -451 -167 462 -2 -469 461 364 -316 -206 886 20 -513 462 305
3748 305 -497 -104 483 -259 -518 545 200 -762 -136 491 -314 -472 449 255 -460 150 642 -187 -411 320
3768 320 332 -692 204 496 -430 -321 359 196 -709 -15 255 -522 -329 581 55 -405 338 558 -394 -76
3788 -76 378 24 -492 466 449 -379 -357 649 -378 -520 409 119 -495 96 676 -314 -345 432 159 -496 3
3809 3 526 -183 -449 584 270 -567 194 360 -636 -314 447 66 -651 287 455 -457 -123 583 148 -396
3829 -396 324 357 -239 -149 700 -21 -475 488 189 -499 -378 377 -424 -418 398 25 -385 -151 397 -408 -275
3850 -275 433 388 -359 327 465 -122 -68 390 223 -279 407 291 -603 -225 376 152 -533 134 144 -632 84
3871 84 341 -133 -222 398 147 -536 52 383 -391 -364 412 60 -497 -35 234 -481 -254 221 -95 -518 166
$$ packed form
3728e00M5P91m38n30O52L47q18K84O29m64m67R30r7o80J10J092q66n33R75j57
3748C05q02L93N87p42k59J063l45r62O26O27q05j58R21j94p15O10M92q29k24P31
3768C20J2j024Q96K92r26J09O80j63r05O94K70p77J93R10n26m60P43K20r52L18
3788g6M54l54n16R58j7q28K2J006j027j42R29k90o14N91N80r90l1P77k73o55M99
3809CN23p09k66J033l14q37P61J66r96L22P61l81p17R38J68r12L34P06m35n44
3829c96P20L3n96R0Q49p21m54R63k99o88J21P55q01OQ16l73m10K34N48q05J33
3850b75P08m5p47O86J38n87N4M58j67n02O86j16q94L78O01k24o85O67J0p76P16
3871H4K57m74q9O20k51o83N88L31p74K7P76l52n57M62K69p15K27M75l16m23O84
$$ plain form
3892 166 291 -313 31 531 38 -493 634 586 -491 106 428 -175 -502 240 5 -568 -243 340 -431 -610
3912 -610 36 103 -624 77 579 -433 -276 805 256 -526 390 446 -367 -129 377 153 -556 310 247 -587
3932 -587 -294 337 106 -882 410 301 -418 20 720 -62 -394 301 408 -206 3 631 -296 -554 547
3951 547 276 -683 -89 427 -294 -611 579 350 -575 177 640 -275 -594 350 135 -291 426 696 -522
3970 -522 -724 561 321 -536 30 350 -333 -446 680 43 -827 155 519 -248 -449 442 237 -359 428
3989 428 522 -298 -101 653 -128 -541 212 300 -551 -378 469 -102 -521 158 600 -240 -359 316 85 -201 496
4010 496 596 -293 -111 465 139 -161 151 209 -631 -83 443 -205 -509 -2 255 -488 -249 236 -131 -142 322
4031 322 237 -269 15 265 -68 -174 296 -2 -211 -41 308 -260 -310 -69 148 -296 -159 240 -166 210 186
$$ packed form
3892A66J25o04L44N00m93n31J127m8j077N97L22o03l27P42k35n73L25N83p71j79
3912f10O46O7p27P01N02j012J57J081n49p82R16N6q13K38N06k24p09Q66o3q34
3932e87K93O31k31r88J292j09p19M38P00p82l32O95J07o14K09O28r27k58J101
3951E47k71r59N94N16p21l17J190k29r25P52M63r15l19R44k15m26P17K70j218
3970e22k02J285k40q57N66L20o83j13J126o37q70R82L64p67k01Q91k05n96P87
3989D28R4q20J97P54p81m13P53Q8q51J73Q47n71m19O79M42q40j19O75k31k86O97
4010D96J00q89J82N76l26l00L12N8q40N48N26o48l04N07K57p43K39M85l67j1M64
4031C22q5n06K84K50l33j06M70k98k09J70L49n68n0K41K17m44J37L99m06L76k4
$$ plain form
4052 186 127 -47 -125 317 191 -71 198 -255 -127 34 63 -220 -220 110 -257 -182 35 15 -117 -135 82 -73 -220
4075 -220 61 58 -216 123 -4 -146 78 142 -149 -298 -233 -94 -57 -116 137 -115 -339 -155 309 11 10 -36 45
4098 45 -24 0 -134 37 -306 137 63 -177 45 -90 -128 9 209 -455 -346 14 75 -370 100 116 -148 -78 46
4121 46 -94 -113 253 405 -223 -79 -46 -43 -250 257 58 -104 -317 276 31 -271 199 -103 -87 17 440 173
4143 173 -199 197 380 64 -269 368 -6 -440 237 208 -301 188 214 -248 -381 224 121 -445 106 330 -153
4164 -153 -45 294 417 -168 35 395 45 -185 319 11 -449 -28 116 -202 -339 46 -59 -372 2 312
4184 312 -253 -210 521 345 -485 209 394 -318 -198 406 -10 -487 105 174 -127 -202 329 87 -364 175 231
4205 231 -137 -244 442 75 -205 253 216 -290 -19 609 18 -151 428 140 -410 -23 430 -285 -398 115
$$ packed form
4052A86n9j74p8M42j26k62K69m53J28J61K9k83%L30l67P5K17k0j32j8K17j55j47
4075b20K81lk74L39j27j42K24O4k91j49O5J39L7n9K53k52k24J84M64k98jm6Q1
4098D5o9K4j34J71l43M43p4k40K22j35l8J37K00o64J09L60O1m45M70J6k64P0J24
4121D6j40j9L66J52o28J44L3Lk07N07j99j62k13N93k45l02M70l02J6J04M23k67
4143A73l72L96J83l16l33O37l74m34O77k9n09M89K6m62j33O05j03n66N51K24m83
4164a53J08L39J23n85K03L60l50k30N04l08m60M21J44l18j37L85j05l13L74L10
4184C12n65M3P31j76q30O94J85p12J20O04m16m77N92O9l01p5N31k42m51N39N6
4205B31l68j07O86l67k80M58l7n06K71O28n91j69N79k88n50L87M53p15j13N13
$$ plain form
4225 115 115 -524 -45 504 -1 -299 518 49 -377 242 378 -332 -293 428 274 -214 -177 291 -444 -321 226
4246 226 -85 -269 333 221 -220 -81 419 10 -165 501 284 -152 -56 312 -222 -352 206 218 -323 -141 276
4267 276 -165 -312 111 154 -527 39 371 -95 -411 383 236 -128 272 569 42 -233 440 -132 -405 39
4287 39 108 -313 -419 268 -121 -454 -36 126 -271 -181 537 51 -283 360 367 -276 129 261 -142 -275 323 293
4309 293 -346 -257 82 -325 -246 7 128 -320 170 481 -337 -216 307 174 -381 19 422 -444 -109 354 -19
4330 -19 -213 245 170 -354 -142 416 26 -362 215 230 -262 -11 376 -119 -171 375 354 -386 -17 509 -257 -399
4352 -399 263 163 -459 -41 356 -475 -181 394 -156 -364 -44 433 -197 -211 466 -18 -395 434 575 -466
4372 -466 -325 231 -44 -208 160 311 -513 -103 303 -304 -484 340 226 -616 -27 623 25 -345 544 132
$$ packed form
4225A15%o39M79N49n05k98Q17m69m26O19J36p10L9P21j54m88L7M68p35J23N47
4246B26l11j84O02j12m41J39N00m09j75O66k17m36R6L68n34j30N58J2n41J82M17
4267B76m41j47M23M3o81N66L32m66l16P94j47l64M00K97n27k75O73n72k73M44
4287C9O9m21j06O87l89l33M18J62l97R0P18m86l34O43Po43M05J32m03j33N98l0
4309B93o39Q9L39m07P9K53J21m48M90L11q18J21N23j33n55M00M03q66L35M63l73
4330a9j94M58p5n24K12N58l90l88N77J5m92K51L87m95n2N46k1p40L69N26p66j42
4352c99O62j00o22M18L97q31K94N75n50k08L20M77o30j4O77m84l77Q29J41j041
4372d66J41N56k75j64L68J51q24M10M06o07j80Q24j14q42N89O50n98l70Q89m12
$$ plain form
4392 132 -288 -209 428 -285 -222 292 50 -649 133 408 -536 -96 132 -103 -332 216 480 -288 -281 559 104
4413 104 -442 326 384 -331 -78 609 -150 -485 316 299 -301 -170 409 -333 -481 459 317 -574 117 829 66
4434 66 -190 413 162 -428 159 434 -304 -536 436 -67 -611 -37 230 -372 -316 403 76 -448 194 501 -178
4455 -178 -38 551 235 -280 298 323 -269 -252 488 294 -424 -11 94 -247 -183 316 -207 -417 168 425 -37
4476 -37 -134 446 -141 -261 334 386 -448 -175 505 -214 -277 58 285 -521 -128 437 -89 -403 9 262 -296
4497 -296 101 334 99 -60 440 294 -45 -97 347 -147 -186 372 -116 -350 80 118 -140 -215 14 -81 -217 41
4519 41 279 -249 -101 313 94 -224 183 91 -110 117 261 -148 -150 62 206 -272 -258 150 -243 -67 199 -363
4541 -363 -327 241 306 215 -250 238 28 -170 284 192 -83 -98 -36 -195 -129 33 -107 -44 64 155 -351 -79 261
$$ packed form
4392A32m20P9O37p13O3N14k42o99P82K75r44M40K28k35k29N48K64p68PQ40m55
4413A04n46P68N8p15K53O87p59l35Q01j7o00J31N79p42j48R40j42q91O91P12p63
4434F6k56O03k51n90N87K75p38k32R72n03n44N74K67o02N6P19l27n24O42L07o79
4455a78J40N89l16n15N78K5n92J7P40j94p18M13J05l41O4M99n23k10N85K57m62
4476c7r7N80n87j20N95N2q34K73O80p19o3L35K27q06L93N65n26l14M12K53n58
4497b96L97K33k35j59N00j46l39n2M44m94l9N58m88k34M30L8k58p5K29r5j36K58
4519D1K38n28J48M14k19l18M07r2k01K27J44m09kK12J44m78J4M08l93J76K66n62
4541c63L6N68O5r1m65M88k10j98M54r2k75j5O2j59O6J62j40O3J08R1n06K72L40
$$ plain form
4564 261 128 -161 250 231 -87 146 397 159 -213 176 243 -158 -112 96 39 -466 57 104 -310 70 130 6
4586 6 -193 51 162 -130 -47 540 46 18 252 206 -131 205 124 -207 -262 229 -7 -312 -146 268 -210 -92
4608 -92 385 -64 -295 -76 346 101 -204 380 121 -28 0 212 -389 -242 177 -77 -105 -65 -149 -24 -82 441
4630 441 47 -230 224 332 -175 -9 325 94 -69 231 63 10 -154 342 -88 -290 148 17 -343 -206
4650 -206 426 -224 -231 41 216 -89 84 87 232 -116 150 204 -276 -244 200 15 -261 -38 324 -227 -174 193
4672 193 -146 -484 228 393 -216 -231 224 227 -151 325 195 -377 42 342 -96 -416 208 206 -350 31 105 -260
4694 -260 -178 171 -4 -448 131 438 20 -202 595 168 -95 217 249 -87 -250 351 92 -258 -166 202 -391
4715 -391 -371 193 148 -91 -1 233 -293 -126 446 2 -198 204 312 -77 100 156 -110 -351 115 273 -361
$$ packed form
4564B61j33k89M11j9l18K33K51k38l72L89O7m01M6K08n7n05N23M7m14L80O0j24
4586Fj99K44J11k92Q3N87m94k8K34m6l37L36q1l31n5M91k36l05J66M14m78J18
4608i2M77m49k31K19M22k45l05N84k59j49K8K12o01J47M19k54k8M0q4J25n8N23
4630D41l94k77M54J08n07J66L34k31j63L00j68n3j64M96m30k02M38j31l60J37
4650b06O32o50pK72J75l05J73LJ45l48K66N4m80L2M44j85k76K23L62n51N3L67
4672A93l39l38P12J65o09j5M55Ll78M76j30n72M19L00m38l20O24kn56L81P4l65
4694b60Q2L49j75m44N79L07m18k22P97m27k63L12L2l36j63O01k59l50R2L68n93
4715c91K0N64m5k39R0K34n26J67N72m44k00M02J08l89J77N6k66k41M66J58o34
$$ plain form
4736 -361 -253 -12 -164 -453 -8 36 -219 23 418 -42 87 7 365 -186 47 285 -146 -513 144 41 -169
4757 -169 -101 188 -234 -147 228 -29 -223 13 173 -261 -138 323 162 -234 168 82 -148 -29 341 18 -406
4778 -406 -74 152 -308 -191 -1 -341 -408 280 131 -252 -37 425 -180 -86 446 76 -283 45 232 -76 -295
4799 -295 427 96 -331 -41 229 -232 -82 129 -136 -267 18 110 -339 -49 286 -77 -146 410 -32 -365 -149
4820 -149 373 44 -262 244 31 -617 5 224 -356 -335 127 193 -367 100 235 62 -2 485 115 -334 132
4841 132 215 -156 30 139 -22 -255 15 77 -555 -238 267 -157 -488 216 352 -421 -62 464 122 -153 278
4862 278 342 -110 -156 305 -183 -424 218 89 -393 -56 215 -103 -235 7 121 -462 69 543 70 -258 455
4883 455 154 -323 171 315 -369 -176 280 -74 -598 -157 237 -351 -434 315 -67 -509 137 307 -211 4
$$ packed form
4736c61J08K41j52k89M45M4k55K42L95m60J29q0L58n51K33K38m31l67O57j03k10
4757a69O8K89m22Q7L75k57j94K36J60m34J23M61j61l96M02q6k30J19L70l23m24
4778d06L32K26m60J17J90l40o7O88j49l83K15M62o05R4N32l70l59L28J87l08k19
4799b95P22l31m27K90K70m61J50K11k65j31K85R2m49K90L35l63o9N56m42l33K16
4820a49N22l29l06N06k13o48O22K19n80K1M62O6n60M67J35j73o4M87l70m49M66
4841A32Q3l71J86J09j61k33K70O2o32L17N05m24l31P04J36p73L59N26l42k75M31
4862B78O4m52m6M61m88k41O42j29m82L37K71l18j32K42J14n83N31M74m73l28P13
4883D55l01m77M94J44o84J93M56l54n24M41L94n88q3P49l82m42O46J70n18K15
$$ plain form
4903 4 612 218 -398 328 336 -264 -45 308 -152 -320 213 70 -444 -152 430 -47 -621 284 239 -352 -19 283
4925 283 -55 -383 291 -2 -305 -18 401 -300 -308 151 135 -477 -41 272 -167 -212 337 122 -477 -143 242
4946 242 -237 -41 326 375 -328 235 318 14 -178 163 -177 -594 215 -12 -139 -225 234 14 -536 -152 162
4967 162 -118 -122 422 142 -165 147 321 -244 -157 212 -36 -63 259 -25 -425 -264 16 21 -376 93 21 -230
4989 -230 52 250 -79 -223 322 135 -20 112 102 97 47 179 -65 -137 -14 65 -223 -50 326 -51 -114 231
5011 231 188 -187 -25 327 195 -66 192 -13 -251 -32 0 -154 -171 176 55 -108 -170 -98 -196 -119 276 -119
5033 -119 -201 425 331 -137 158 308 -33 -33 8 44 -236 -58 282 -252 -101 159 -85 -544 -1 208 -324 -125
5055 -125 331 288 -26 233 286 -180 -206 542 -80 -345 157 349 -322 -98 296 51 -420 217 101 -368 20
$$ packed form
4903DO08l94o16P26Qo00K19L53m60j68N33j43n14K92N82m77n74R05m5n91L33L02
4925B83l38l28O74k93l03K87M19p01qM59j6o12M36L13m39m5N49k15n99L34L85
4946B42m79J96L67M9p03N63Q3l04j92L41l40m17Q09k27j27q6M59k20n50L84L14
4967A62k80mN44k80l07L12J74n65Q7L69k48k7L22k84m00J61K80Nl97M69p2k51
4989b30K82J98l29j44N45j87j55J32j0nn0J32k44p2J23P9k88J73L76l77o3L45
5011B31m3l75J62L52j32k61K58k05k38K19L2j54j7L47j21j63o2P2r8P7L95l95
5033a19q2O26r4m68K95J50l41%M1L6k80J78L40n34J51K60k44m59N43K09n32J99
5055a25M56m3l14K59N3m66k6P48o22k65N02J92o71K24L94k45m71O37j16m69L88
$$ plain form
5076 20 108 -118 -309 503 178 -242 -29 463 -98 -176 124 164 -210 33 49 -197 -164 144 -59 -331 -54 401
5098 401 -42 -411 183 228 -276 104 495 -133 -22 271 102 -182 103 351 -94 -398 276 -1 -274 18
5118 18 149 -307 -3 27 103 -273 86 243 221 -95 246 203 -484 -43 144 -226 -261 229 9 -220 -57 21
5140 21 -326 -160 231 80 -274 202 265 -384 201 243 143 -205 27 72 -95 20 362 -76 -458 31 -95
5161 -95 -359 35 107 97 -320 -82 45 -77 35 7 29 -132 207 75 -166 134 123 -126 -302 110 -259 -265 18
5184 18 259 -226 -195 72 6 -85 47 87 -66 5 176 11 9 79 332 -290 -23 177 254 14 37 117 -233 -22
5208 -22 188 -81 -210 126 9 -40 -68 282 41 -67 387 86 -138 158 91 -44 -107 36 4 -184 -74 96
5230 96 -245 -20 155 -10 22 -10 174 -306 -88 288 -61 -139 345 -47 -21 36 148 -16 -35 154 133 -222 -83
$$ packed form
5076B0Q8k26j91Q12l25m20K13M92n61p8L00M0l74K43J6k46L3L08k03k72K77M55
5098D01m43l69N94M5n04L80L91o28J11K93j69k84K85K48m45l04O74k77k73K92
5118A8J31m56L04L0P6l76L59J57k2l16L41m3o87M41J87l70l5M90k20k29J63P8
5140B1l47J66L91j51l54M76O3o49N85M2j00l48K32M5j67J15L42m38l82M89j26
5161i5k64L94P2j0m17K38J27j22J12k8K2j61L39j32k41L00j1k49j76M12l69oK83
5184A8K41m85L1K67o6r1J32M0j53P1J71j65kP0K53o22K67K00P7k40K3Q0l50K11
5208b2K10k69j29L36j17m9k8L50k41j08M54l01k24K96o7j35o3J43l2j88J10J70
5230I6l41K25J75j65L2l2J84m80K18L76l49p8M84l92K6N7J12j64j9J89k1l55J39
$$ plain form
5253 -83 162 -151 -326 274 58 -193 24 102 78 -97 189 198 -271 3 182 -242 -197 168 79 -124 -12 133
5275 133 -133 -328 180 59 -421 66 142 -155 130 292 73 -131 290 237 -155 5 104 -21 -95 160 130 -532
5297 -532 -128 349 -254 -202 -1 225 -260 -115 586 163 -414 264 126 -292 -9 205 -188 -159 255 21 3
5318 3 -130 237 -103 -192 134 -127 -463 58 81 -287 -304 460 -78 -239 153 133 -259 -94 287 217 -285 -14
5340 -14 198 -278 -256 296 -89 -198 87 245 -154 83 387 -37 -374 168 182 -151 19 441 -169 -228 308
5361 308 175 -464 72 179 38 -152 174 226 -503 63 386 -84 -116 275 249 -95 174 259 -28 -323 380
5382 380 116 -289 233 31 -299 -287 332 148 -280 100 168 -328 -17 241 54 -95 331 190 -228 -46 313
5403 313 -83 -196 88 -84 -325 -196 203 -165 -282 125 -195 -321 -18 146 -48 -76 289 104 -266 57
$$ packed form
5253h3K45l13j75O00k16k51K17P8k4j75K86Rm69K74J79m24M5L65q9k03J12J45
5275A33k66j95N08j21m80M87P6k97K85J62k19k04M21n3l92J60R9j25p4K55l0o62
5297e32M04M77o03N2K01K26m85J45P01m23n77O78j38m18K83K14l93K9M14k34j8
5318Cj33L67l40q9L26k61l36N21K3l68j7P64n38j61L92k0l92J65L81p0n02K71
5340a4K12m76K2N52l85j09K85J58l99K37L04m24l37N42J4l33J70M22o10n9N36
5361C08j33o39N36J07j41j90L26N2p29N66L23m70l2L91k6l44K69Q5k87k95P03
5382C80k64m05N22k02l30J2O19j84m28L80O8m96L11K58j87j49M26j41m18J82L59
5403C13l96j13K84j72k41J29L99l68j17M07l20j26L03J64j94k8L65j85l70L23
$$ plain form
5423 57 322 -181 -179 125 -64 -182 -49 328 -362 -136 340 57 -270 147 169 52 104 432 293 -269 289 151
5445 151 -177 49 202 -93 -294 150 133 -111 86 127 -265 -418 130 -62 -125 54 462 -33 -95 214 130 -72
5467 -72 175 167 -71 -27 222 -243 -52 127 48 -98 -36 94 -94 -34 -102 -51 -199 94 189 -100 -247 211 89
5490 89 -170 54 233 -99 -446 90 -25 -366 -138 -23 -225 -250 52 45 -232 97 186 -126 20 187 298 -268
5512 -268 200 354 -325 -139 44 -166 -141 100 21 -230 -201 139 -26 -264 139 41 -132 23 193 -79 24
5533 24 437 -60 -272 69 -46 -188 -121 138 12 -293 41 171 42 -315 121 112 -270 228 64 -150 132
5554 132 103 84 -176 202 316 -146 -119 231 -332 -193 136 137 -286 -314 106 -82 -298 212 160 -289 -98 481
5576 481 -85 -355 107 98 -280 -113 457 7 -337 122 36 -435 100 258 -120 -199 341 85 -183 -130 162 -7
$$ packed form
5423E7K65n03KL04j89j18J33L77o90K26M76k83l27M17K2j17N2L28j39n62N58j38
5445A51l28K26J53k95k01M44j7k44J97M1l92j53N48j92o3J79M08m95o2L09q4k02
5467g2K47qk38M4K49m65J91J79p9j46O2J30j88O0o8N1j48K93R5k89j47M58j22
5490H9k59K24J79l32l47N36j15l41K28J15k02k5L02pk77L29Q9l12J46J67J11n66
5512b68M68J54o79J86J83k10K5K41p9k51K9L40j65k38M03r8j73J55J70k72J03
5533B4M13m97k12L41j15j42O7K59j26l05L34J30j29l57M36rl82M98j64k14K82
5554A32k9j9k60L78J14m62K7L50n63J39L29Jm23k8M20j88k16N10n2m49J91N79
5576D81n66k70M62rl78J67N70m50l44M59q6m71N35J58l78p9N40k56k68N3K92j69
$$ plain form
5598 -7 -28 241 25 -108 207 328 -278 -143 85 107 -240 44 46 -92 -8 353 -213 -336 286 83 -27 70 197
5621 197 101 -53 41 21 -18 -84 -12 -55 -427 144 219 -362 -67 241 -135 -255 244 133 -71 -91 198 -52 63
5644 63 145 162 -150 75 182 -396 -14 75 184 35 63 252 -28 -46 54 -66 -135 145 28 163 -153 148
5666 148 50 -286 39 -51 -317 -196 209 -36 -167 -268 22 127 -152 15 42 -139 -60 201 -121 18 212
5687 212 227 -14 94 171 17 1 241 -130 -110 19 49 -149 -155 -14 1 -251 217 24 -208 58 1 -47 -6 318
5711 318 -156 -183 163 184 -129 26 99 12 -149 22 -92 -164 -194 114 75 -91 153 298 -20 195 160 1 -50
5734 -50 151 195 -264 -64 107 -168 -143 -16 -114 -235 -129 84 -55 -219 138 87 2 116 175 -170 -205 143 83
5757 83 -140 299 4 -138 -28 85 -79 -274 -79 145 -163 91 133 -44 -172 160 248 -84 -3 293 139
$$ packed form
5598gk1K69k16j33L15J21o06J35K28K2l47K84Kj38Q4L61n66j23O22k03j10R7J27
5621A97r6j54R4k0l9o6P2m3l72N71P5n81K95L08l76j20M99j11k04k0K89k50J15
5644F3Q2J7l12K25J07n78L82Q9J09j49K8J89k80j8J00j20o9K80j17J35l16L01
5666A48r8l36L25r0k66J21M05k45j31j01K90J05k79J67K7j81P9K61l22J39J94
5687B12J5k41J08P7j54j6K40l71K0J29L0j98oJ41J5k52M68j93k32K66n7m8M1L24
5711C18m74k7L46K1l13J55P3q7j61J71j14p2l0L08l9j66K44J45l18K15l5j59n1
5734e0K01M4m59K00J71k75K5J27r8j21J06K13j39j64L57n1q5J14N9l45l5L48o0
5757H3k23M39k95j42J10J13j64j95J95K24l08K54M2j77j28L32Q8l32Q1K96j54
$$ plain form
5778 139 -149 174 156 -241 -34 231 10 -38 263 -54 -152 91 318 96 -140 183 163 -69 158 213 134 15
5800 15 162 -46 -131 36 175 -107 -130 92 -63 -135 -24 29 11 -238 106 22 -74 128 171 -193 -61 411 -82
5823 -82 -19 152 -68 -155 82 110 -115 -377 30 19 -277 23 203 -47 -140 -25 -3 -224 57 131 50 -119 76
5846 76 -134 -137 38 104 -274 -149 -47 -43 -406 -189 -34 -46 -112 122 -9 -315 -59 86 90 17 331 87 -76 194
5870 194 148 -240 -18 90 -48 -326 -76 -69 -345 -70 87 -154 -225 -50 139 -190 -158 272 -132 -179 368 103
5892 103 -38 48 284 -46 -189 171 33 -159 -182 70 71 78 318 31 -295 85 244 -55 -23 179 -299 -104
5914 -104 15 302 -80 -57 76 -252 -193 31 42 -185 -121 200 -102 -171 4 173 -88 70 354 73 -144 103
5936 103 263 -354 -60 3 -135 -201 -37 -290 -176 127 58 -131 -26 321 52 -40 164 62 -56 -6 298 -11
$$ packed form
5778A39k88L23j8l97K07K65k21m8L01l17r8K43K27k22k36L23k0k32K27N5p9j19
5800A5J47k08q5J67J39k82k3K22j55p2J11N3j8k49L44q4r6K02M3l64J32M72m93
5823h2O3J71k20q7K37K8k25k62M07j1k96L00J80k50r3J15K2k21K81P4q1j69J95
5846G6k10lJ75O6l78J25J02Ml63K17J55j2o6K34j31l06K56J45Mp3L14k44j63K70
5870A94m6l88K22J08j38k78K50Pk76K75J57k41p1J75J89l29L2M30m04m7N47k65
5892A03j41Q6K36l30j43L60j38j92k3K52JPK40k87l26L80J59k99L2K02m78J95
5914a04J19K87l82K3J33l28N9K24J1k27O4L21l02o9J75J69k61J58K84k81k17K47
5936A03J60o17K94O3j38o6J64k53J14L03o9j89J05L47k69r2K04j02j18N0L04l09
$$ plain form
5958 -11 -43 83 186 -84 -82 63 -294 -384 24 0 -141 -49 87 -200 -57 199 139 -189 215 196 -112 88 136
5981 136 -10 -73 21 -19 -57 -72 279 -127 -354 -12 135 -34 -159 287 -121 -145 361 118 -99 5 282 -106
6003 -106 -242 81 261 -299 -27 136 -210 -147 -69 -34 -256 29 273 -33 72 51 86 -126 142 205 31 99
6025 99 17 151 -239 17 108 -181 -175 232 -123 -326 217 7 -428 -92 206 -46 29 -34 172 -222 -37 283
6047 283 -14 -145 256 107 -109 -67 171 46 -199 78 233 -350 -13 398 2 -24 265 224 -114 34 144
6068 144 156 -201 316 -67 -124 48 52 -221 -57 -6 -115 -90 15 40 -271 -13 100 188 -121 88 288 19 83
6091 83 332 195 -64 -89 119 -135 -23 169 -71 -381 -55 -10 -48 -135 193 -6 -229 209 272 -178 28 451
6113 451 32 -173 40 83 -265 -71 47 -214 20 105 25 -258 97 86 49 45 236 114 42 127 387 -18 76
$$ packed form
5958a1l2J26J03k70KJ45l57r0M08k4j41R2J36k87J43K56o0l28M04j9l08K00M8
5981A36j46o3R4m0l8j5L51m06k27L42J47j69j25M46m08k4N06k43k17J04K77l88
6003a06j36L23J80n60K72J63l46O3P8L5k22K85K44l06J05k1L5k12K68O3j74O8
6025I9q2J34l90K56R1k89OM07l55k03N43k10m35L36K98k52P5o3K06l94J85L20
6047B83k97j31M01j49k16M2K38j25k45K77J55n83L37M11l96k6K89m1l38J48J10
6068A44J2l57N17l83n7J72Mk73J64N1j09K5J05K5l11K58J13Q8l09K09K00k69O4
6091H3K49j37k59k5K08k54J12J92k40l10L26M5l8q7L28j99k23M38O3m50K06M23
6113D51m19k05K13M3l48J94J18k61K34Q5q0k83L55j1l7mJ91j22p2Q5K60m05R4
$$ plain form
6136 76 184 171 -227 61 102 -120 283 18 58 -253 71 -37 -109 22 256 15 -171 90 -19 49 87 242
6158 242 -9 53 122 91 -142 -71 -68 -144 56 -61 -40 71 -86 34 -21 -11 166 -49 -6 201 84 -110 -50 96
6182 96 -75 -137 116 119 -34 -92 -6 -83 -24 -3 211 -35 -145 95 105 111 -33 188 -57 51 107 77 -117 142 55
6207 55 -12 -101 130 130 -340 -45 29 -174 -70 157 60 -45 50 136 -132 126 109 -112 -14 70 -19 -276 76 142 -119
6232 -119 -180 -63 55 -56 -125 2 -23 -43 62 -72 -78 58 115 15 180 184 121 -73 119 62 -201 -220 184 -44
6256 -44 -191 -45 34 -246 -160 47 -126 -52 91 262 -198 295 169 -170 -189 298 69 -137 -46 -17 58 21 329
6279 329 -72 -168 77 68 9 -94 59 23 -34 151 168 -28 -28 164 -193 -2 165 61 -192 -43 89 66 99 135
6303 135 137 -121 1 291 46 -153 188 36 -163 97 -3 104 -122 -53 81 3 -48 30 -248 -246 56 39 73
$$ packed form
6136G6J08j3l98K88M1k22M03k65M0l11L24j08p2J31K34k41j86K61j09O8L8J55
6158B42k51O2O9l1k33P1Lp6K00j17K1J11j57J20n5J0J77k15M3K07j17j94O0J46
6182I6j71o2K53Lj53n8Q6p7N9K1K14k46j10K40J0Oj44K21k45J08N6l0j94K59q7
6207E5o7q9K31%m70K95P4k03J04K27r7j05R5Q6k68K58j7k21R8Q4q9k57L52O6k61
6232a19o1J17J18j11o9J27k5k0J05j34oJ36N7j00J65Mo3j94J92n7k63j9M04k28
6256d4j47J46P9k80Q6K07j73P4J43J71m60M93j26l39j9M87k29k06R1K9P5l7L08
6279C29m01r6K45rn9j03J53l6n7J85J7j96%J92l57J91J67j04k53J49J32k3L3L6
6303A35Kk58J22K90k45j99L41j52j99K60j00J07k26O9J34p8n1P8k78KL02j7L4
$$ plain form
6326 73 -55 77 -54 -251 67 -75 -72 -46 43 -22 56 245 62 -143 91 118 -135 -256 -83 -122 -153 -188 209 -183
6350 -183 -338 64 -215 -201 320 95 -63 136 164 24 -90 -7 104 -75 -128 269 -17 -157 -74 -53 16 -154
6372 -154 85 -29 -138 -15 178 -83 18 363 -89 -90 317 -47 -184 116 59 144 -6 255 -182 -164 157 132
6394 132 -99 -111 181 -134 7 9 -98 -53 127 79 123 -69 13 61 -139 182 39 -152 -226 -104 -6 -62 -74 31
6418 31 -103 12 126 160 -26 201 34 -263 101 -103 97 -88 218 51 -184 164 26 -55 83 144 45 -43
6440 -43 -92 104 168 34 163 200 -250 269 8 -175 81 253 -40 -157 -173 -11 -160 50 10 -149 -182 -101 110
6463 110 -334 -114 196 -142 65 231 216 -116 146 202 67 79 44 190 -93 -94 -37 -173 -115 101 -94 -106 -315
6486 -315 139 -297 -149 83 204 -26 82 262 97 -274 122 -65 -358 -63 100 -106 -106 -5 -13 -128 -185 252
$$ packed form
6326G3j28J32j31j97L18j42LK6Q9o5P8J89j83k05K34K7k53j21J73l9l1l5L97l92
6350a83j55M02k79J4N21k25j58J99K8j40j14Q3J11j79n3L97k86j40Q3K1O9j70
6372a54K39j14j09J23J93k61J01L45m52jM07l64j37L00n7Q5j50K61m37J8L21k5
6394A32k31j2K92l15J41Kj07M5J80m8M4j92Q2M8k00L21j43j91p4J22R8n6j2J05
6418C1j34J15J14L4j86K27j67k97L64k04K00j85L06j67k35L48j38q1J38O1r9q8
6440d3m9J96O4j34J29L7m50N19k61j83K56J72k93j17j6J62j49K10m0j59l3Q1K11
6463A10m44K20L10l38K07J66j5l32K62N6j35J2l5J46k83jN7j36N8K16j95j2k09
6486c15M54m36J48K32J21k30J08J80j65l71L96j87k93K95J63k06%J01qj15n7M37
$$ plain form
6508 252 -132 -35 35 25 68 -10 186 -113 -357 98 164 -287 32 167 -84 -53 15 61 -157 -1 -104 -44 -153
6531 -153 -3 -70 54 73 10 -16 -54 299 -10 -29 253 -54 -234 -145 54 -143 -132 216 59 23 -111 15 -75
6554 -75 -139 234 67 -149 -167 31 3 -59 122 145 127 -8 159 112 -120 -129 178 -254 128 24 -151 14 35 68
6578 68 -144 203 128 19 91 24 74 -239 -19 66 -100 -157 -31 2 -132 60 52 95 -75 99 43 3 18 124 -71
6603 -71 202 27 -30 -15 109 -123 -29 103 177 -127 -71 163 -28 -162 -208 -131 -14 -34 -66 -32 -58 0 277 110
6627 110 100 127 -4 -366 -69 34 -128 -235 -10 48 -142 5 -83 -120 -38 88 -41 -27 28 55 97 -147 66
6650 66 63 -220 33 205 -130 -374 180 57 -1 105 -190 -98 85 100 -2 -207 82 -45 70 341 75 -53
6672 -53 50 -28 -75 20 279 79 -96 160 205 -217 -98 12 71 -21 -18 178 171 -11 109 202 -15 -77 5 141 -127
$$ packed form
6508B52l84R7P0j0M3p8J96k99k44M55O6m51L19J35k51L1O8M6k18J56j03O0j09
6531a53J50o7J24J9o3k6l8L53l09j9K82l07j80Q9J99j97J1L48j57l6j34J26r0
6554g5o4L73j67k16j8J98k8o2J81K3j8j35J67m7k32rL07m32L82j04j75J65K1L3
6578F8k12L47p5j09P2o7N0l13K20Q5j66n7J26L3j34J92qM3j70J74n6m0J5J06j95
6603g1K73j75n7J5J24k32R4J32P4l04N6K34j91j34m6P7J17k0l2L4k6N8K77j67
6627A10j0K7j31l62K97J03j62j07K25N8j90J47q8l7Q2J26j29J4N5K7M2k44K13
6650F6lk83K53J72l35k44N54j23n8J06k95R2J83J5j02k05K89j27J15K71k66j28
6672e3J03p8m7R5K59k00j75K56M5m22J19J10N9r2LJ96pj82J20R3k17o2Q2J36k68
$$ plain form
6697 -127 58 -106 -101 -23 -15 -238 -164 66 23 -42 176 126 -78 23 164 -21 -43 -37 237 96 93 172 -65 -91 88
6722 88 -99 -47 -193 77 -205 60 -21 -51 -181 4 70 139 -236 164 117 -63 52 301 -18 -256 -30 253
6744 253 -114 151 62 -252 -102 100 -87 -147 -111 78 -51 4 362 -101 -238 135 193 -92 63 167 -18 58
6766 58 175 -33 -6 -229 -154 -212 -155 14 82 -77 -209 218 -72 60 29 112 56 109 74 223 -128 20 150 -57
6790 -57 63 86 33 -253 -98 59 -88 -77 217 -133 -140 124 139 -199 -37 -68 -159 -98 149 79 43 42 69 -343 32
6815 32 -18 81 -35 49 86 -221 -82 188 191 -43 217 83 -8 32 141 -122 52 -92 -200 172 -201 131 -23
6838 -23 -72 151 -4 156 -80 25 -49 -157 203 98 89 -9 -17 -10 11 31 48 43 -67 54 -188 -100 -42 -54 -187 -113
6864 -113 53 59 -31 -78 -29 -131 63 78 -160 87 -72 15 -5 -99 -72 -135 31 -102 -39 -245 -104 168 -93 124
$$ packed form
6697a27J85j64NP8Qk23P4K30m3o5K18n0k04J01J41j85k2OK74j41lP9k37k6J79
6722H8j87N2j46K70k82K65q1l0j30J85O6O9l75M00m7j80J15K49l19k38K26K83
6744B53l67K65q9l14J50K02j87o0L6J89j29N5L58m63j37L73N8k85J55J04j85P6
6766E8J17k08K7k23P5n8N7J69O8j59j32M27k90J32l1Q3n6N3l5J49l51J48J30k07
6790e7J20K3n3k86J55J57j47J1K94l50pK64J5l38J62l1r1O1K47p0l6jK7m12L75
6815C2n0R9j16Q4L7l07J39K70Lk34K60j34r1M0J09k63J74j44j08L72l73L32j54
6838b3m9K23j55J60k36J05p4j08L60j05rr8qPK1K0J7nj10J21k42Q8N8j2j33P4
6864a13J66Or0m7M9j02J94J5k38K47j59Q7k0r4K7o3J66j33O3k06J41K72k61K17
$$ plain form
6888 124 -6 -121 -67 268 87 -185 -68 -10 113 6 135 -110 134 158 -3 -340 68 -10 -105 36 64 150
6910 150 49 132 115 106 -252 102 31 -154 -56 217 -57 -193 -70 67 -181 -164 -80 -114 -144 23 95 -4 127 98
6934 98 -48 123 165 -61 25 6 -36 2 -41 -68 39 131 -89 109 -160 11 81 -185 -89 70 -130 -149 -72 111
6958 111 70 -30 -60 178 -93 78 242 123 -103 29 186 -247 -2 181 -25 54 48 32 23 32 -154 -72 -21 297
6982 297 213 -90 -122 5 180 -56 -75 100 -157 25 291 58 -54 54 71 -114 -130 -124 -53 -6 -41 -76 42 170
7006 170 175 -20 -75 81 23 -124 36 -76 -122 -56 161 33 -143 -82 139 -31 14 125 -68 -196 59 59 -119
7029 -119 32 -3 113 -100 128 15 -149 -77 -38 -136 -130 98 -79 -188 134 -52 -4 -122 96 66 -208 217 143
7052 143 0 34 358 88 183 -21 -18 18 -65 96 -100 -171 28 -97 -97 137 117 56 -79 122 -2 72 10 156
$$ packed form
6888A24j30j15N4L35j81k72J17N8J23j07J29k45K44K4j61l37M08p8r5J41K8Q6
6910A50j01Q3j7rl58L54p1j85R8K73k74j36J23J37k48J7Q4l4l0J67P2r9J31k9
6934I8j46J71M2k26Q6j9m2L8m3k7J07R2k20J98k69J71P0k66R6J59k00j9P7J83
6958A11m1j00l0K38k71J71J64j19k26J32J57m33K45J83k06P9oj6rRj86Q2N1L18
6982B97q4l03l2J27J75k36j9J75k57J82K66k33j12J08J7j85j6OP1M7l5l5J18J28
7006A70Nj95n5J56n8j47J60j12m6O6K17j28j76O1K21j70M5J11j93j28K55%j78
7029a19J51l5J16k13K28j13j64P2L9r8OK28j77j09L22j86M8j18K18l0k74M25p4
7052A43j43L4L24k70R5k04LL6q3J61j96p1J99j25%K34k0o1j35K01j24P4o2J46
$$ plain form
7076 156 42 77 31 148 -37 37 121 53 -212 30 -175 -319 -118 -64 -111 49 188 -72 125 138 89 30 -30 75
7100 75 269 -92 79 67 -26 -264 130 -242 -233 -81 327 -119 -9 -10 -1 114 326 84 57 98 -27 -185 -83 -134
7124 -134 142 -93 -62 -8 -353 118 -8 93 -5 51 93 -38 23 83 156 -47 -41 -38 47 -201 35 -138 -58 14 67
7149 67 -45 -63 196 -200 10 -105 143 -186 131 24 -154 -52 -9 20 5 292 62 -63 -26 -95 -43 -168 -176
7172 -176 63 -111 126 25 52 -142 -61 118 74 200 -100 -120 -49 -118 -11 -86 -39 120 92 -17 271 132 -164
7195 -164 -54 13 53 -12 -146 122 -83 -69 30 -80 23 168 -31 -75 -48 33 -161 -81 197 -58 -14 0 -99 125
7219 125 -28 16 47 -76 -33 19 -109 -203 151 -100 -45 192 72 -34 51 94 99 -12 46 170 -3 3 186 -112
7243 -112 -24 180 76 -171 89 276 -53 94 58 260 -141 44 199 88 -2 233 7 -135 -20 -66 75
$$ packed form
7076A56j14L5m6J17j85P4Q4o8k65K42k05j44K01N4m7J60J39k60J97J3m9n9o0J05
7100G5J94l61J71j2r3k38L94l72RJ52M08m46J10jRJ15K12k42k7M1j25j58J02n1
7124a34K76k35L1N4l45M71j26J01r8N6M2j31O1O0P3k03OLQ5k48K36j73Q0P2N3
7149F7j12j8K59l96K10j15K48l29L17j07j78J02M3K9j5K87k30j25L7o9N2j25q
7172a76K39j74K37j01K7j94Q1J79m4J26l00k0P1o9J07p5M7J59k8j09K88j39k96
7195a64J10O7M0o5j34K68k05J4R9j10J03J45j99m4K7Q1j94Q0K78k55M4J4r9K24
7219A25j53M4L1j23M3N2j28r4L54k51N5K37j20j06Q5M3Nj11N8J24j73OJ83k98
7243a12Q8K04j04k47K60J87l29J47l6K02m01J85J55j11r0K35k26j42J15m6J41
$$ plain form
7264 75 -169 6 11 6 -217 207 5 -199 -64 -31 -51 68 36 -38 -177 25 10 -11 -45 117 -127 81 -69 26
7288 26 -241 93 -166 97 -11 104 62 5 41 102 -131 -7 -59 -30 -178 -109 7 -140 -141 -102 110 -27 -50 72
7312 72 -31 -90 88 282 210 63 267 52 46 -152 136 -96 -3 -65 30 275 -83 -57 -119 -93 -133 -156 -37 92
7336 92 -29 -54 87 -99 12 78 106 146 -66 52 136 -182 36 -72 -155 -252 -51 -111 -136 15 178 155 133 4
7360 4 -80 32 37 51 25 146 89 -6 -143 132 17 -119 -261 -39 -8 -189 32 -125 -116 21 36 209 -49 -17 251
7385 251 19 99 4 -76 -246 115 -11 -137 51 102 -95 -23 229 201 -114 56 68 -34 -122 55 -66 38 272
7408 272 149 3 102 146 -36 19 -61 166 -189 -102 -98 63 -230 -148 54 92 -207 250 30 191 228 181 -123 -238
7432 -238 21 -58 1 123 149 -46 3 4 -247 9 25 170 -120 -197 63 -186 -121 30 86 -41 -242 206 47
$$ packed form
7264G5k44J75Nnk23M24k02k04J35L3k0J19l2p4j39K02j5k1l4J62k44K08j50R5
7288B6k67L34k59K63j08J15m2n7L6O1k33J24n2K9j48O9J16j47jL9K12j37k3J22
7312G2j03n9J78J94p2j47K04k15oj98K88k32R3o2R5K45l58K6o2K6m0k3J19J29
7336I2j21k5J41j86J11O6K8M0k12J18Q4l18K18j08q3r7K01o0k5J51J63k3k2j29
7360Dq4J12NJ4k6J21n7r5j37K75j15j36j42K22L1j81K21j57RJ37J5J73k58L2K68
7385B51k32Q0r5q0j70L61j26j26J88N1j97P2K52k8l15J70J2j02q8J77j21J04K34
7408B72j23j46R9M4j82N5q0K27l55Q7MJ61k93Q2K02L8k99M57k20J61L7m7l04j15
7432b38K59p9N9J22K6j95M9Jk51K56J6J45k90p7K60k49O5J51N6j27k01M48j59
$$ plain form
7455 47 -77 -29 -106 24 175 122 -9 -61 -19 38 113 60 -114 -239 20 226 144 -31 -37 52 -341 -202 13 -29 65
7480 65 301 179 -91 -52 2 -15 55 -43 52 26 -16 214 -53 -90 229 -107 17 -114 -183 98 -53 60 77 31
7504 31 187 -39 40 60 -105 -144 151 55 138 55 -17 140 42 -125 125 -166 96 -102 4 41 -11 31 -144 79
7528 79 133 30 64 -73 -127 -273 118 261 54 -27 -26 -36 97 -101 162 146 -140 49 -84 -55 -123 64 244 -82
7552 -82 -18 248 -255 226 29 -137 34 -30 205 225 -30 160 49 -110 158 29 -34 65 2 -28 -206 47 -36
7575 -36 -51 31 108 16 -79 -88 147 180 -193 -23 -121 -71 -61 149 -101 -106 121 112 -28 63 -89 -322 -65 143 -257 -35
7601 -35 1 -127 -65 -46 -202 -108 -59 93 29 -86 -62 78 36 161 141 88 -19 -59 -6 -115 65 56 -1 -138 -106 -188
7627 -188 19 -142 101 12 60 152 -96 76 43 87 -13 -138 118 204 -23 -95 97 -6 80 -137 -112 -176 34
$$ packed form
7455D7j24M8p7J30J51n3j31n2M2N7P5n3j74j25K59K06q2j75oQ9l93J39K15m2R4
7480F5K36j22k70L9N4j7P0r8R5k6m2K30k67l7L19l36J24j31o9K81j51J13J7m6
7504C1J56k26P9K0j65l9K95r6Q3q3p2J57r8j67K50k91K62j98J06L7n2M2j75K23
7528G9N4j03L4j37n4j46L91J43k07q1Jj0J33j98K63j6k86J89j33K9o8J87J80l26
7552h2O4K66n03M81j97j66J71o4K35K0k55J90j11j59K68j29o3R9o3l0j78K53q3
7575c6j5Q2P7r2r5rK35L3l73J70r8N0J0K10k50nK27rj40R1j52k33K57K08m00K22
7601c5L6j28O2J9j56R4M9J52o4j15K4J40m2J25k0n3j07m0N3j09J80rn7j37L2q2
7627a88K07j61K43q9M8R2k48J72l3M4j00j25K56Q6k27p2J92j03Q6k17K5o4K10
$$ plain form
7650 34 81 157 14 150 73 -169 8 20 -95 8 37 15 -85 8 -80 -109 -69 151 -119 -63 -99 -37 23 -24 140
7675 140 137 -83 -39 123 -123 -106 52 8 -171 17 76 -3 -48 -23 -119 -32 -40 -152 180 -59 190 37 -141 73
7699 73 214 96 163 117 -103 134 151 -17 -270 -186 -268 85 -75 -86 46 135 -15 12 -133 35 193 158 307
7722 307 -68 249 -89 -214 -162 -7 -44 32 142 -187 -277 -78 -99 -40 -229 -65 -161 -10 79 -77 -245 -52 186
7745 186 80 24 182 -105 84 -205 49 -237 218 115 -93 2 299 160 181 -24 71 121 140 46 44 -22 20 206
7769 206 -32 93 53 150 -72 -101 -167 -198 148 -3 -275 7 130 180 -33 33 -194 -85 -94 -159 157 -17 46 -276
7793 -276 -167 -62 14 145 -233 65 149 -79 -40 -54 37 -11 57 85 -72 -12 97 -66 2 -119 129 -74 50
7816 50 33 116 12 -83 102 39 -95 -206 -113 49 -193 128 -33 -37 115 -35 271 -81 -40 -13 2 146 -177 -175
$$ packed form
7650C4M7P6j43J36p7k42J77J2j15J03K9k2j00R3q8k9M0K20k70N6l6O2O0m7J64
7675A40lk20M4J62k46J7J58m4j79J88N9p9m5K5r6Q7qj12L32k39K49j53j78K14
7699G3J41j18O7m6k20K37J7j68k53Q4q2L53j60j1J32Q9j50K7j45J68J58l5J49
7722C07l75L17l38j25N2J55l7P6J10l29r0J99k1N9j89J64r6J51Q9j56j68J93K38
7745A86j06n6J58k87J89k89K54k86M55j03k08R5K97j39K1k05R5N0J9r4ko6M2J86
7769B06k38J25m0R7k22k9o6l1L46j51k72K82J23N0k13O6k27J09ro5L16j74O3l22
7793b76J09J05P6J31l78K98Q4k28L9j4R1m8O8K8j57O0J09j63O8j21K48k03J24
7816E0j7Q3j04r5J85o3j34j11R3J62k42L21j61mJ52j50L06l52M1K7J5J44l23K
$$ plain form
7840 -175 100 24 -341 -48 -120 -92 -73 -57 157 -71 104 105 48 -198 47 -79 49 57 82 -14 40 90 64 69 297 -5
7866 -5 65 1 -55 -156 38 38 135 -128 61 129 -99 -116 5 53 53 -51 52 -174 -117 -216 43 -141 -44 61 -201
7891 -201 -60 39 2 44 12 -13 58 9 -69 26 67 140 42 74 33 -47 -76 -76 196 114 -227 -27 -48 105 37 177 163
7918 163 -17 -176 188 30 96 72 56 -3 -296 84 167 -137 73 -130 217 -60 2 103 -156 17 -185 103
7940 103 84 -51 67 198 168 102 109 -55 -21 136 -79 -77 68 -83 74 14 -4 37 -13 -119 104 6 19 -46 73
7965 73 138 -15 104 31 -59 -179 -10 69 -145 -259 -57 -25 47 -63 -127 53 -203 -35 65 -215 -102 16 -154
7988 -154 -268 34 156 -142 -152 87 95 -90 83 131 -125 94 -69 74 -259 211 85 106 -17 113 105 -11
8010 -11 1 -9 -31 -84 84 -59 -66 203 39 -27 -116 194 90 -124 -54 -41 77 98 -81 -101 -96 -25 97 62 176 -18
$$ packed form
7840a75K75p6l65K93p2K8J9J6K14k28J75Jn7k46K45j26J28QK5r6N4N0k6NK28l02
7866eP0o4n6j01J94%R7k63J89O8k28j7J21M8%j04J03k26N7r9K59j84R7J05k62
7891b01J41R9l7M2l2k5P1m9p8R5M1P3r8L2m1q0k9%K72q2l41K00k1J53o8J40j4
7918A63j80j59L64j58O6k4j6n9k93L80Q3l04K10k03L47k77O2J01k59J73k02K88
7940A03j9j35J18J31l0o6Pj64L4J57k15KJ45j51J57o0j8M1n0j06K23r8J3o5J19
7965G3O5j53J19p3r0j20J69P9k14j14K02L2P2j10o4J80k56J68J00k80J13J18j70
7988a54j14L02J22k98j0K39Qj85J73M8k56K19j63J43l33M70j26K1j23J30qj16
8010a1J2j0k2n3J68j43pK69j64o6q9L10j04k14P0J3J18K1j79k0NP1J22l5J14j94
$$ plain form
8036 -18 -107 38 -34 -103 -46 -1 42 -149 -116 -162 -71 -147 25 -207 -196 60 -10 22 -48 -188 57 176 -115 -159 -62 -2
8062 -2 38 52 98 -33 -2 -151 -8 182 53 -34 -26 -258 10 -74 79 194 20 66 -83 48 1 61 -93 175
8086 175 -3 252 -84 69 -131 -67 -150 40 16 -68 0 105 -20 -11 132 74 44 88 294 -122 27 -61 -79 -137
8110 -137 92 -99 -102 37 82 66 -54 -59 -31 149 -249 55 235 -90 13 125 -90 -109 98 -113 29 -41 3
8133 3 82 -57 131 -143 -68 -119 87 53 137 -82 32 142 -117 208 -5 -191 139 -35 -176 -12 6 -80 -89 74
8157 74 -31 69 198 -140 67 89 -114 -24 -78 73 -150 -47 190 -52 -54 -185 227 -40 -19 33 3 97 -62
8180 -62 -104 33 -63 216 40 34 118 70 11 -58 -86
$$ packed form
8036a8q9J45p2o9N7M5M3j91L3m6R1p6J72k32J1K56p0L2p0j40K45J19k91m4R7O0
8062bM0J4M6j31L1j49J43J90j29q7Qk32K68q4J53J15j74M6j49J31m7O0j54K68
8086A75j78K55l36J53k00O4q3J90k4q4O8J05j25RJ43n8l0M4K06m16J49q8j8n8
8110a37K29j91lJ39M5j6j20nK8J80l98L04J80l25J03J12k15j9K07k11J42p0M4
8133CP9j39J88k74P5n1K06l4Q4k19J14J10k59L25k13j86L30j74j41J64J8q6rJ63
8157G4j05J00J29l38K07K2k03R0n4J51k23J03K37k42kj31M12k67K1N2l0R4j59
8180f2m2J37r6K79j76oQ4m8n9o9k8
8191h6
$$ Imaginary data points
##PAGE= N=2
##DATA TABLE= (X++(I..I)), XYDATA
$$ plain form
0 0 0 0 0 0 0 0 0 0 0 -8 8 -8 16 -16 16 -24 32 -40 48 -56 72 -81 96 -116 136 -160 184 -215 247 -281 324
31 324 -369 419 -473 536 -605 679 -760 849 -948 1056 -1174 1302 -1441 1594 -1762 1944
47 1944 -2143 2363 -2603 2866 -3158 3482 -3842 4243 -4698 5212 -5804 6491 -7301 8270
61 8270 -9457 10949 -12888 15524 -19328 25327 -36238 62448 -262457 -52404 410355 -175422
73 -175422 -283572 11046 -24288 -147757 192133 153933 -248868 -128231 310924 137743
83 137743 -122893 30873 65700 -100697 92171 208124 -124793 -231335 119568 141651
93 141651 -123086 -48769 85759 -92642 -40938 217765 39164 -219540 56290 262129
103 262129 -14902 -102617 134096 56505 -130879 84796 202594 -113659 -171702 130131
$$ packed form
0@%%%%%%%%%qJ6j6K4l2L2m0N6p2Q8j04J28j53J77k12K52k96L44l99M62n28O05
31C24o93P88q92J009j141J284j439J609j797K004k230K476k743L035l356L706
47A944m087M506m966N469o024O640p324Q085q941R910j1016J2295j3792J5571
61H270j7727K0406k3837K8412l4852M4655o1565R8686l24905K10053M62759n85777
73a75422j08150K94618l5334j23469L39890l8200m02801J20637M39155j73181
83A37743k60636J53766L4827j66397J92868J15953l32917j06542L50903K2083
93A41651k64737P4317J34528j78401N1704K58703j78601k58704K75830K05839
103B62129k77031q7715K36713p7591j87384K15675J17798l16253n8043L01833
$$ plain form
113 130131 99157 -127502 -9397 113960 -73457 -108718 121303 116450 -88702 -65348 65850
124 65850 52182 38718 32218 -70578 -55836 105371 79392 -88120 -64958 39785 -13372
135 -13372 -48368 34542 -3707 -114008 -35264 64167 -27056 -84398 -6840 -2487 -51602 1204
147 1204 30268 -64211 -79770 39477 58022 -42792 -58907 -700 15254 8842 2798 -13840
159 -13840 -12261 2929 1972 6444 16329 -10657 -31328 17881 44506 -15083 -29521 24495 9659
172 9659 -21116 36905 48773 -46695 -52772 58853 69243 -25462 -36231 14289 14923 21865 34972
185 34972 -17805 -34625 44981 62849 -11146 -15854 33751 18555 9189 55371 25279 -48445
197 -48445 2395 70377 7516 -34843 15724 2999 -42181 15808 43915 -56402 -68105 54879
$$ packed form
113A30131l0974k26659J18105J23357j87417l5261K30021m853k05152K3354J31198
124F5850j3668j3464o500j02796J4742J61207k5979j67512K3162J04743n3157
135a3372l4996Q2910l8249j10301P8744R9431r1223n7342P7558M353m9115N2806
147A204K9064r4479j5559J19247J8545j00814j6115N8207J5954o412o044j6638
159a3840J579J5190r57M472R885k6986k0671M9209K6625n9589j4438N4016j4836
172I659l0775N8021J1868r5468o077J11625J0390r4705j0769N0520O34O942J3107
185C4972n2777j6820P9606J7868p3995m708M9605j5196r366M6182l0092p3724
197d8445N0840O7982o2861m2359N0567j2725m5180N7989K8107j00317j1703J22984
$$ plain form
209 54879 47302 -68673 -38135 45749 1574 -27531 28900 7052 -56362 -868 51875 -27997
221 -27997 -62195 17085 13583 -54971 -21540 15241 -37918 -36273 26827 -651 -49225 2810
233 2810 33434 -24229 -13800 49307 2999 -47434 24026 46193 -35038 -30463 37460 2581
245 2581 -49076 -57 20890 -38051 -22724 38073 -4702 -46556 18457 41971 -15721 -7188
257 -7188 43541 20034 -10993 24815 35291 -4567 6436 36561 2281 -15225 20682 10962
269 10962 -22031 4406 23966 -12920 -21582 18063 14531 -16907 5791 27000 -4920 -4798 29091
282 29091 8585 -17287 14874 28982 -9401 -20244 9290 5981 -19618 -7134 3474 -19367
294 -19367 -17256 1996 -10710 -18830 117 3210 -10620 -7025 3356 -3382 -6820 7446 3975
$$ packed form
209E4879p577j15975L0538Q3884m4175k9105N6431k1848o3414N5494N2743p9872
221b7997l4198P9280l502o8554L3431L6781n3159J645O3100k7478m8574N2035
233B810L0624n7663J0429O3107m6308n0433P1460K2167q1231M575O7923l4879
245B581n1657M9019K0947n8941J5327O0797m2775m1854O5013K3514n7692Q533
257g188N0729k3507l1027L5808J0476l9858J1003L0125l4280j7506L5907r720
269A0962l2993K6437J9560l6886q662L9645l532l1438K2698K1209l1920J22L3889
282B9091k0506k5872L2161J4108l8383j0843K9534l309k5599J2484J0608k2841
294a9367K111J9252j2706q120J8947L093j3830L595J0381o738l438J4266l471
$$ plain form
307 3975 -12970 -4000 3297 -12866 -11268 1189 -9016 -18291 -7202 -1401 -14361 -15571 3262
320 3262 4919 -8676 -2236 6704 1426 4100 11292 8929 4149 4501 7773 4943 -958 3093 5494
335 5494 -1060 -4426 -3833 -2128 315 -1569 343 3965 429 2352 8616 7635 8823 13009 10603 8235
351 8235 10126 11055 6071 3680 10822 6771 -6398 -1049 5667 -5644 -5699 4768 -2847 -11936 161
366 161 8200 -7642 -10474 11076 8167 -12290 -2027 9140 -7887 -7072 11192 -435 -20340
379 -20340 -5560 8569 -10699 -16901 3524 -2822 -20114 -1445 7142 -16755 -12870 12713 2851
392 2851 -15874 127 10440 -8659 -3489 19319 577 -18499 7749 16311 -11455 -8478 12601
405 12601 -2344 -16901 4037 7327 -19397 -11650 14451 -2400 -17722 5522 8584 -11688 1673
$$ packed form
307C975j6945Q970P297j6163J598J2457j0205r275J1089N801j2960j210J8833
320C262J657j3595O440Q940n278K674P192k363m780L52L272k830n901M051K401
335E494o554l366N93J705K443j884J912L622l536J923O264r81J188M186k406k368
351H235J891R29m984k391P142m051j3169N349O716j1311n5J0467p615r089J2097
366A61Q039j5842k832K1550k909k0457J0263J1167j7027Q15J8264j1627j9905
379b0340J4780J4129j9268o202K0425o346j7292J8669Q587k3897L885K5583r862
392B851j8725J6001J0313j9099N170K2808j8742j9076K6248Q562k7766K977K1079
405A2601j4945j4557K0938L290k6724P747K6101j6851j5322K3244L062k0272J3361
$$ plain form
418 1673 23262 6279 -7951 13009 20680 3659 7607 17608 2340 -423 16615 7738 -11854
431 -11854 -2327 10243 -342 -7054 -736 -4643 -8671 6447 10834 -6462 -8397 5413 8120 4789
445 4789 1633 -4748 -2568 7720 5119 -9466 -11485 -2844 -1384 -958 -676 -13553 -14592 7515 11033
460 11033 -7027 -5023 5315 462 3548 14336 -1612 -18306 6676 20738 -13445 -22867 5937
473 5937 -2338 -23046 655 9591 -25429 -22883 17110 7606 -20844 3397 16648 -14757 -2302
486 -2302 33696 -354 -29420 17221 30302 -20025 -15110 26214 -3367 -31466 20226 30396
498 30396 -32575 -20526 39612 12662 -21755 19093 22009 -24038 7068 52433 -7298 -47554
510 -47554 23107 40362 -29285 -19654 24456 -21876 -37423 36631 26176 -59168 -29008 50020
$$ packed form
418A673K1589j6983j4230K0960P671j7021L948J0001j5268k763J7038q877j9592
431a1854R527J2570j0585o712O318l907m028J5118M387j7296j935J3810K707l331
445D789l156o381K180J0288k601j4585k019Q641J460M26K82j2877j039K2107L518
460A1033j8060K004J0338m853L086J0788j5948j6694K4982J4062l4183r422K8804
473E937q275k0708K3701Q936l5020K546L9993r504k8450K4241J3251l1405J2455
486b302L5998l4050k9066M6641J3081n0327M915M1324k9581k8099N1692J0170
498C0396o2971J2049O0138k6950l4417M0848K916m6047L1106M5365n9731m0256
510d7554P0661J7255o9647R631M4110m6332j5547P4054j0455q5344L0160P9028
$$ plain form
522 50020 11507 -32948 18612 20040 -33600 12691 61627 -15558 -49279 34456 40544 -34238
534 -34238 -12493 34099 -24350 -41891 41102 25235 -66190 -24569 50157 -5010 -42474 17607
546 17607 13812 -39925 5820 49631 -25252 -49771 36078 33385 -39092 -4805 34307 -30879
558 -30879 -34071 51154 25933 -62363 -20797 47988 -919 -27338 25903 2603 -47776 19263
570 19263 62312 -22246 -47232 30106 31237 -20732 10320 29209 -34919 -24483 57766 23648
582 23648 -56291 -13336 37321 -7577 -18963 20869 -7539 -40703 17845 42924 -25887 -34636
594 -34636 27988 20731 -13263 14477 14435 -28096 891 52264 7440 -43384 -575 31343 -5532
607 -5532 -10982 12086 -14983 -27810 17777 21813 -24732 -22448 10655 3838 -5096 12933 948
$$ packed form
522E0020l8513m4455N1560J428n3640M6291M8936p7185l3721Q3735O088p4782
534c4238K1745M6592n8449j7541Q2993j5867r1425M1621P4726n5167l7464O0081
546A7607l795n3737M5745M3811p4883k4519Q5849k693p2477L4287L9112o5186
558c0879l192Q5225k5221q8296M1566O8785m8907k6419N3241k3300n0379O7039
570A9263M3049q4558k4986P7338J131n1969L1052J8889o4128J0436Q2249l4118
582B3648p9939M2955N0657m4898j1386L9832k8408l3164N8548K5079o8811q749
594c4636O2624p257l3994K7740m2m2531K8987N1373m4824n0824M2809L1918l6875
607e532n450K3068k7069j2827M5587M036m6545K284L3103o817q934J8029j1985
$$ plain form
620 948 -26025 -146 29902 2272 -19662 -3245 714 -5052 6682 3141 -19789 -14021 10271
633 10271 5201 -8902 -2621 -2490 -5922 11566 15564 -9067 -10459 11724 11245 350 2926 -3086
647 -3086 -12463 4423 16327 -7801 -19815 437 3786 -4475 5067 160 -18981 40 26838
660 26838 3657 -18539 5792 16356 -3946 4539 19107 -10100 -18913 19135 17478 -18628 -7834
673 -7834 14734 -7435 -12588 18274 6294 -27383 595 30110 -4599 -18705 14843 9046 -15442
686 -15442 9268 20973 -17694 -18191 22010 7866 -25597 273 15105 -20194 -13682 23266 -1830
699 -1830 -30619 6630 23463 -14808 -12603 21046 188 -21332 16862 22638 -23676 -14087 26097
712 26097 2941 -23864 5786 12343 -20397 -8839 20275 -7017 -25574 11591 16395 -18581
$$ packed form
620I48k6973K5879L0048k7630k1934J6417L959n766J1734l541k2930N768K4292
633A0271n070j4103O281J31l432J7488L998k4631j392K2183m79j0895K576o012
647c086r377J6886J1904k4128j2014K0252L349q261R542m907j9141J9021K6798
660B6838k3181k2196K4331J0564k0302Q485J4568k9207q813L8048j657l6106J0794
673g834K2568k2169n153L0862j1980l3677K7978K9515l4709j4106L3548n797k4488
686a5442K4710J1705l8667m97M0201j4144l3463K5870J4832l5299O512L6948k5096
699a830k8789L7249J6833l8271K205L3649k0858k1520L8194N776m6314R589M0184
712B6097k3156k6805K9650O557l2740J1558K9114k7292j8557L7165M804l4976
$$ plain form
724 -18581 -6055 20007 -4141 -13958 17684 13506 -18415 -2245 22107 -3622 -14925 13615
736 13615 6721 -19601 1872 17846 -12277 -15917 15512 8817 -17190 462 17480 -6781 -9137
749 -9137 18137 6529 -15037 5920 16297 -8152 -7977 13282 2189 -14140 3136 9887 -11584
762 -11584 -8024 12349 -754 -12266 6232 7711 -9737 -78 13461 -1806 -9357 9082 8390
775 8390 -10804 -2830 11124 -4991 -10805 5572 840 -13325 -1530 7208 -7580 -9869 5926
788 5926 3527 -9595 818 9706 -3676 -3563 9650 2093 -6667 4387 6963 -4750 -3252 5779
802 5779 -1448 -8638 2884 4549 -8535 -3677 6743 -2361 -6844 4158 3889 -4581 284 7510
816 7510 -983 -4880 6611 5730 -5029 -56 6594 -2012 -3706 4041 2042 -4024 -37 3640 -1825
$$ packed form
724a8581J2526K6062k4148r817L1642m178l1921J6170K4352k5729j1303K8540
736A3615o894k6322K1473J5974l0123l640L1429o695k6007J7652J7018k4261k356
749i137K7274j1608k1566K0957J0377k4449J75K1259j1093j6329J7276O751k1471
762a1584L560K0373j3103j1512J8498J479j7448R659J3539j5267p551J8439o92
775H390j9194P974J3954j6115n814J6377m732j4165J1795Q738j4788k289J5795
788E926k399j3122J0413Q888j3382J13J3213p557q760J1054K576j1713J498R031
802E779p227p190J1522J665j3084M858J0420r104m483J1002k69q470M865P226
816G510q493l897J1491q81j0759M973O650q606j694P747j999o066L987L677n465
$$ plain form
831 -1825 -3119 4183 2199 -3349 2116 4781 -1704 -805 4164 1865 -713 1793 2512 -1574 -1569 2881
847 2881 273 -3726 -21 93 -3396 -1910 -276 -2474 -3102 -1133 -599 -1987 -1936 83 10 414 2051
864 2051 690 23 1919 2034 2119 1718 -286 -323 1091 1050 -1076 -2420 -1110 -1050 -2523 -993 -1105 -4021
882 -4021 -1922 1972 97 -2126 -918 221 390 1974 2942 -791 -2784 2209 3908 -893 -1871 284
898 284 119 704 2415 171 -3211 -325 5523 3338 -1657 -299 2180 1517 2773 3355 -1368 -3504
914 -3504 1064 4466 -591 -4926 -1447 525 -1097 62 -563 -4046 -2776 3783 4221 -2471 -3936 1958
930 1958 2568 54 2623 728 -5087 -1555 6442 2448 -6795 -3391 3830 587 -1846 3212 -1054
945 -1054 -6454 3717 9925 -2105 -7823 2297 4503 -2528 711 2879 -8985 -7833 8875 3788
$$ packed form
831a825j294P302j984n548N465K665o485Q99M969k299k578K506P19m086NM450
847B881k608l999L705J14l489J486J634k198o28J969N34j388N1K019p3M04J637
864B051j361o67J896J15Q5m01k004l7J414m1k126j344J310O0j473J530j12k916
882d021K099L894j875k223J208J139J69J584R68l733j993M993J699m801r78K155
898B84j65N85J711k244l382K886N848k185m995J358K479o63J256N82m723k136
914c504M568L402n057m335L479J972j622J159o25l483J270O559M38o692j465N894
930A958O10k514K569j895n815L532P997l994r243L404P221l243k433N058m266
945a054n400J0171O208j2030n718J0120K206p031L239K168j1864J152J6708n087
$$ plain form
959 3788 -13786 -6478 6658 -986 -5077 4908 -34 -10912 3755 16972 -2546 -11600 8028
972 8028 9229 -4155 4329 8899 -9605 -8426 15737 8182 -17321 -5449 13278 -3569 -9449
985 -9449 9918 518 -17807 3824 19394 -6791 -16209 9490 8937 -10511 3566 13284 -12854
998 -12854 -11059 20433 8469 -20251 -2463 15737 -5768 -8762 14439 745 -22039 5604
1010 5604 23606 -9946 -17464 11943 6181 -11936 7726 13045 -17623 -11417 23455 8780 -22194
1023 -22194 -1024 14768 -10106 -6344 17669 -4447 -25102 7120 21196 -12422 -16993 11117
1035 11117 3219 -12998 9105 11723 -18498 -7641 23785 5433 -18015 3174 13326 -7309
1047 -7309 -2044 15741 -5281 -19564 10670 17696 -13703 -12691 9145 -397 -8389 9070 5375
$$ packed form
959C788j7574P308J3136p644m091R985m942j0878J4667J3217j9518r054J9628
972H028J201j3384Q484M570j8504J179K4163p555k5503J1872J8727j6847n880
985i449J9367r400j8325K1631J5570k6185r418K5699n53j9448J4077R718k6138
998a2854J795L1492j1964k8720J7788J8200k1505k994K3201j3694k2784K7643
1010E604J8002l3552p518K9407n762j8117J9662N319l0668O206L4872j4675l0974
1023b2194K1170J5792k4874L762K4013k2116k0655L2222J4076l3618m571K8110
1035A1117p898j6217K2103K618l0221J0857L1426j8352k3448K1189J0152k0635
1047g309N265J7785k1022j4283L0234P026l1399J012K1836r542p992J7459l695
$$ plain form
1060 5375 -17255 -4753 19775 3788 -14072 2849 7921 -6329 3383 13156 -7260 -14885 8430
1073 8430 13064 -7395 -8179 3990 -2275 -4425 8685 3333 -12588 -2586 11839 2958 -5517 766
1087 766 1830 -1885 4475 6636 -6169 -8535 5267 6302 -4047 -5160 -2080 -2022 1508 3526 -2935
1102 -2935 -7716 -705 6425 3476 -1572 -2796 -1482 4025 7086 404 -4700 -2417 1410 3877 2631
1117 2631 -4038 -7957 -797 5306 342 -4769 -1968 -1598 -1449 5391 4342 -6225 -3745 7868 5540
1132 5540 -2983 128 3041 -2673 545 8004 -1668 -10126 1847 7384 -4362 -4838 3706 -2011 -5835
1147 -5835 6041 6455 -9219 -4586 11652 3440 -7124 3567 5177 -6925 199 11715 -3181
1160 -3181 -13114 4146 8463 -8155 -4967 7265 -4087 -9234 9393 7422 -11669 -3184 13164
$$ packed form
1060E375k2630J2502K4528j5987j7860J6921N072j4250R712R773k0416p625K3315
1073H430M634k0459p84J2169o265k150J3110n352j5921J0002J4425q881q475O283
1087G66J064l715O360K161j2805k366J3802J035j0349j113L080N8L530K018o461
1102b935m781P011P130k949n048j224J314N507L061o682n104K283L827K467j246
1117B631o669l919P160O103m964n111K801L70J49O840j049j0567K480J1613k328
1132E540q523L111K913n714L218P459r672q458J1973N537j1746m76Q544n717l824
1147e835J1876M14j5674M633J6238q212j0564J0691J610j2102P124J1516j4896
1160c181r933J7260M317j6618L188J2232j1352n147J8627j971j9091Q485J6348
$$ plain form
1173 13164 1075 -7928 6987 6258 -9802 537 13212 -4778 -12833 6403 6020 -10682 -3080
1186 -3080 7887 -6731 -9920 9348 5167 -12841 -530 12861 -3418 -7229 9713 4051 -10574
1199 -10574 3137 12364 -6276 -9792 8988 3686 -11344 1203 8984 -8586 -6924 11072 2298
1212 2298 -10881 3095 10707 -5031 -4296 11087 1332 -10067 5135 8992 -8651 -5579 8043
1225 8043 -1567 -10058 2890 4432 -9455 -3913 8881 -1788 -8711 6284 6804 -6418 1038 10434
1239 10434 -1084 -4912 8296 5883 -6733 -325 8041 -3747 -6897 5362 885 -9744 -580
1252 -580 4964 -5855 -5829 4791 773 -6935 1862 5819 -4333 -2573 7694 873 -5841 3862 4566
1267 4566 -5572 -1606 5640 -1889 -6189 2854 2929 -6897 -1759 6133 -2514 -4686 5291 2856 -4883
$$ packed form
1173A3164j2089r003J4915p29j6060J0339J2675j7990q055J9236l83j6702P602
1186c080J0967j4618l189J9268m181j8008J2311J3391j6279l811J6942n662j4625
1199a0574J3711R227j8640l516J8780n302j5030J2547P781j7570J662J7996q774
1212B298j3179J3976P612j5738P35J5383r755j1399J5202L857j7643L072J3622
1225H043r610q491J2948J542j3887N542J2794j0669o923J4995N20j3222P456R396
1239A0434j1518l828J3208k413j2616O408Q366j1788l150J2259m477j0629R164
1252e80N544j0819K6J0620m018p708Q797L957j0152J760J0267o821o714R703P04
1267D566j0138L966P246p529m300R043P5r826N138P892q647k172R977k435p739
$$ plain form
1282 -4883 1605 6596 -1474 -2590 5467 2767 -5031 1085 4823 -4031 -4028 3608 -1211 -6824 41 1830
1298 1830 -5283 -3688 3418 -894 -4908 2966 4223 -3120 223 6889 697 -1876 5207 4785 -2227
1313 -2227 513 5031 -879 -3932 2536 1213 -5734 -1694 2306 -3629 -4249 2315 254 -3947 478
1328 478 3818 -1406 -1895 3996 1621 -2569 1798 3324 -2529 -1642 2947 -780 -3696 517 1153 -3344
1344 -3344 -1432 2996 -796 -2871 2972 2981 -1611 1177 4192 -46 -1030 3013 1808 -2805 -869 1867
1360 1867 -2360 -3267 584 -1567 -4419 -379 1108 -3128 -2096 2303 710 -1558 2022 3169 -1231
1375 -1231 711 4868 818 -2242 2130 2148 -1927 -437 2330 -1858 -3335 1994 2088 -3672 -1560 3115
1391 3115 -552 -1688 2746 1776 -2890 269 4452 -387 -3577 1040 1023 -3474 -306 2083 -3968 -4159
$$ packed form
1282d883O488M991q070j116Q057k700p798O116L738q854LP636m819n613O865J789
1298A830p113J595P106m312m014P874J257p343L343O666o192k573P083m22p012
1313b227K740M518n910l053O468j323o947M040M000n935o20O564k061m201M425
1328D78L340n224m89N891k375m190M367J526n853Q87M589l727k916M213O36m497
1344c344J912M428l792k075N843Rm592K788L015m238r84M043j205m613J936K736
1360A867m227r07L851k151k852M040J487m236J032M399j593k268L580J147m400
1375a231J942M157m050l060M372J8m075J490K767m188j477N329R4n760K112M675
1391C115l667j136M434r70m666L159M183m839l190M617j7m497L168K389o051j91
$$ plain form
1407 -4159 2471 1895 -3878 -1510 3201 -130 -1418 4365 2350 -3876 1336 6401 -40 -3254 2395
1422 2395 1940 -2981 530 3431 -3851 -5469 3373 2869 -5666 -2485 2653 -1634 -2733 3781 1476
1437 1476 -5800 -305 7061 130 -4807 2791 2949 -3220 1361 4971 -3324 -5675 4424 4574 -5310
1452 -5310 -3052 3984 -1403 -3488 4922 1831 -7515 -615 8254 286 -5324 2369 3500 -3822 1350
1467 1350 6681 -4058 -7295 5447 5329 -6153 -3172 3766 -2216 -4234 5156 2224 -8955 -1916
1481 -1916 8900 446 -6257 2856 3683 -3842 2332 7621 -3456 -7134 5747 6868 -5777 -3644
1495 -3644 4512 -2421 -4625 5296 1600 -9868 -2318 8530 -1 -6855 1741 3045 -4167 2307
1509 2307 8059 -3971 -6993 6516 6707 -4845 -2352 3869 -2438 -3505 5852 1772 -10060 -2585
$$ packed form
1407d159O630n76n773K368M711l331j288N783k015o226N212N065o441l214N649
1422B395m55m921L511K901p282j618Q842n04q535L181N138m287j099O514k305
1437A476p276N495P366o931m937P598J58o169M581L610q295k351J0099J50r884
1452e310K258P036n387k085Q410l091r346O900Q869p968n610P693J131p322N172
1467A350N331j0739l237J2742j18j1482K981O938n982k018R390k932j1179P039
1481a916J0816q454o703R113Q27p525O174N289j1077l678J2881J121j2645K133
1495c644Q156o933k204R921l696j1468P550J0848q531o854Q596J304p212O474
1509B307N752j2030l022J3509J91j1552K493O221o307j067R357m080j1832P475
$$ plain form
1523 -2585 7860 -507 -5852 1735 958 -4323 2505 6861 -3383 -6320 5463 6126 -3399 -1114 3361
1538 3361 -2608 -1970 5851 765 -7939 -1613 5653 -337 -4642 398 -255 -2887 3140 4893 -3805
1553 -3805 -4156 4560 4618 -963 -564 848 -1724 442 4383 -500 -6369 -1777 2613 -132 -2165 -1734
1569 -1734 -2654 -1155 2870 2265 -2258 -2082 1974 3412 2489 1073 -640 -210 2905 2424 -503 -1953
1585 -1953 -1748 -274 1231 -283 -3970 -3611 663 1172 -1802 -954 -479 -1477 1739 4650 -522 -3338
1601 -3338 2280 4206 -33 -528 1145 -2082 -2237 3809 1816 -6188 -2877 3767 -267 -2850 1985
1616 1985 190 -4098 2186 7160 -1605 -4636 4257 4378 -2701 1085 3853 -3962 -3632 5452 1399
1631 1399 -7991 -1550 4372 -2995 -4335 3744 -379 -6626 2603 6923 -3616 -4200 6213 3287 -3995
$$ packed form
1523b585J0445q367n345P587p77n281O828M356j0244k937J1783O63r525K285M475
1538C361n969O38P821n086q704O326P266n990m305N040o53k632O027J753q698
1553c805l51Q716N8n581L99J412k572K166L941m883n869M592M390k745k033M31
1569a734r20J499M025o05m523J76M056J438r23j416j713M30L115m81k927j450
1585a953K05J474J505j514l687L59M274N09k974Q48M75r98L216K911n172k816
1601c338N618J926m239m95J673l227j55O046j993q004L311O644m034k583M835
1616A985j795m288O284M974q765l031Q893J21p079L786K768p815L30R084m053
1631A399r390O441N922p367j340Q079m123o247R229M320j0539n84J0413k926p282
$$ plain form
1646 -3995 2864 5397 -4460 -2380 7581 1021 -7602 1019 4972 -4331 -2969 4975 -1713 -7268 3249
1661 3249 5808 -5568 -3838 6026 469 -4900 3705 3839 -5892 -1683 7004 -419 -6503 2414 3835
1676 3835 -5524 -1248 5495 -2649 -5769 4582 4020 -5196 -1016 6109 -576 -3530 4986 3320 -5115
1691 -5115 791 6480 -2069 -4542 3527 1608 -5473 -211 3719 -4227 -4908 3895 1096 -5872 80
1706 80 4077 -2849 -1818 5122 1084 -3667 2545 5103 -1814 -1658 4327 694 -3843 2145 2897 -4423
1722 -4423 -2205 3522 -1161 -4087 1639 1962 -3270 -483 3981 -749 -2949 3552 2621 -2873 487
1737 487 3530 -1587 -2493 2808 260 -4329 -717 2130 -3102 -3083 2329 -271 -3554 1591 3116 -1713
1753 -1713 -272 4267 1583 -1276 3016 3361 -1595 -92 3873 -746 -3328 1432 401 -4196 -1728
$$ packed form
1646c995O859K533r857K080R961o560q623Q621L953r303J362P944o688n555J0517
1661C249K559j1376J730R864n557n369Q605J34r731M209Q687p423o084Q917J421
1676C835r359M276O743q144l120J0351n62r216M180P125o685k954Q516j666q435
1691e115N906N689q549k473Q069j919p081N262L930p946o81Q803k799o968N952
1706H0L997o926J031O940m038m751O212K558o917J56N985l633m537N988P52p320
1722d423K218N727m683k926N726L23n232K787M464m730k200O501r31n494L360
1737D87L043n117r06N301k548m589L612K847n232J9N412k600l283N145J525m829
1753a713J441M539k684k859M292L45m956J503L965m619k582M760j031m597K468
$$ plain form
1768 -1728 1154 -2909 -3736 1227 394 -3455 94 3331 -1269 -1252 3821 1544 -1900 1886 3261 -1513
1784 -1513 -1239 2890 -62 -3480 752 1874 -3310 -1773 2539 -1114 -2678 1735 2326 -2028 13
1799 13 3458 298 -1771 2308 2058 -2683 15 2628 -1780 -2982 1573 101 -3751 -945 1503 -2472
1815 -2472 -2462 2049 697 -2677 1243 3149 -823 -277 3613 1227 -1349 1770 2523 -1884 -874 2490
1831 2490 -549 -3008 748 932 -2978 -1002 1897 -1020 -2582 1472 1511 -2319 119 2951 -716 -1662
1847 -1662 2598 1335 -2510 335 2351 -1534 -1847 1805 158 -3106 200 2527 -1807 -1802 2444 520
1863 520 -2019 1742 2353 -1442 -672 3148 844 -2165 1038 1895 -2318 -1129 2250 -1153 -3574 896
1879 896 1466 -3031 -1643 2003 -519 -2301 2051 1959 -2326 -75 3429 342 -1813 1910 1691 -2100
$$ packed form
1768a728K882m063q27M963q33l849L549L237m600J7N073k277l444L786J375m774
1784a513K74M129k952l418M232J122n184J537M312l653j564M413N91m354K041
1799A3L445l160k069M079k50m741K698K613m408j202M555j472l852K806K448l975
1815b472J0M511j352l374L920J906l972N46L890k386k576L119P53m407J010L364
1831B490l039k459L756J84l910J976K899k917j562M054L9l830K438K832l667r46
1847a662M260j263l845K845K016l885l13L652j647l264L306K327m334NM246j924
1863E20k539L761O11l795P70L820k304l009L203Q57m213J189L379l403k421M470
1879H96N70m497J388L646k522j782M352r2m285K251L504l087k155L723k19l791
$$ plain form
1895 -2100 186 2933 -1186 -3207 1657 1520 -3021 -767 1898 -1564 -2148 2080 1278 -2890 -310 3387
1911 3387 137 -1961 2233 1305 -2449 690 3082 -1518 -2928 1444 1582 -2404 -1171 1716 -1576
1926 -1576 -2284 2594 1203 -3165 -435 3362 305 -1293 1732 1361 -1737 563 3433 -1124 -3083
1941 -3083 1515 1823 -2540 -944 1126 -1710 -2130 1937 1268 -3285 -1264 2996 547 -1564 1502 960
1957 960 -1547 1047 3232 -664 -2760 1717 2312 -1649 -1009 1121 -1581 -2100 2152 1032 -3503 -1728
1973 -1728 2424 767 -1506 744 763 -1736 961 3623 -386 -2721 1233 2442 -848 -765 591 -1210
1989 -1210 -1708 1764 1319 -3099 -1970 1982 823 -1217 531 309 -1352 901 2869 99 -2377 710
2005 710 2316 -373 -337 394 -1374 -1260 1777 692 -2341 -2145 698 1022 -551 -335 -125 -887 939
$$ packed form
1895b100K286K747m119k021M864j37m541K254K665l462n84M228q02m168K580L697
1911C387l250k098M194r28l754L139K392m600j410M372J38l986J233K887l292
1926a576p08M878j391m368K730L797l057j598L025l71l098K300K870m557j959
1941c083M598L08m363J596K070k836m20M067o69m553K021M260k449k111L066n42
1957I60k507K594K185l896k096M477N95l961O40K130k702n19M252j120m535J775
1973a728M152j657k273K250J9k499K697K662m009k335L954J209l290Q3J356j801
1989a210m98L472m45m418J129L952j159k040J748k22j661K253J968k770k476L087
2005G10J606k689L6P31j768J14L037j085l033J96K843L24j573K16K10p62J826
$$ plain form
2022 939 2611 205 -1325 87 1930 1216 -66 -496 -646 -651 587 860 -1545 -2223 -214 995 36
2039 36 -1253 -1210 -238 384 1152 841 -973 -985 1645 2333 7 -1184 114 787 298 602 -45 -2033 -1146
2058 -1146 1798 787 -1961 -1595 558 160 2 1102 -175 -2009 788 2994 32 -1743 419 1113
2074 1113 -764 631 1165 -1955 -1931 1967 1603 -2622 -1484 1319 -645 -1007 1775 56 -2648 403
2090 403 3333 -375 -2291 1675 1710 -1295 1187 2184 -1848 -2122 2637 1767 -2946 -1428 1872 -936
2106 -936 -1687 1760 -126 -3869 261 3612 -1073 -2819 1605 1198 -1791 1069 2847 -1871 -2464 3265
2122 3265 1760 -3278 -476 2354 -1533 -1453 2668 284 -3733 469 3692 -1461 -2460 2302 964 -2546
2138 -2546 1380 2716 -2355 -1998 3384 1053 -3508 -112 2252 -2387 -1406 2741 -506 -3819 977
$$ packed form
2022I39J672k406j530J412J843p14j282m30j50nJ238K73k405o78K009J209r59
2039C6j289M3R72O22P68l11j814j2K630O88k326j191J298O73m89L04o47j988Q87
2058a146K944j011k748L66K153l98j58J100j277j834K797K206k962j775K162O94
2074A113j877J395N34l120K4L898l64m225J138K803j964l62K782j719k704L051
2090D03K930l708j916L966L5l005K482R97m032k74M759q70m713J518L300k808
2106i36p51L447j886l743M130L351m685j746M424m07k989K860J778m718n93N729
2122C265j505n038K802K830l887Q0M121k384m017M202L223n153r99M762j338l510
2138b546L926J336n071L57N382k331m561L396K364m639R81M147l247l313M796
$$ plain form
2153 977 2667 -2038 -1682 2604 217 -2239 2075 2670 -2369 -833 3727 594 -2601 1443 1797 -2313
2169 -2313 -751 2435 -1111 -3221 1387 1575 -2947 -1124 2237 -823 -1979 2358 1203 -2509 -62
2184 -62 2773 -381 -1850 1719 800 -2305 308 2027 -1864 -1990 1780 470 -2102 485 1608 -1145
2200 -1145 -634 2553 483 -1726 1491 2061 -1393 -454 1758 -520 -1829 976 638 -2173 -937 1211
2216 1211 -1082 -1941 967 526 -2125 212 1977 -769 -827 2025 933 -850 1015 1857 -950 -573
2232 -573 1961 188 -1820 534 957 -1673 -713 1246 -581 -1599 1049 899 -1688 -178 2002 -500
2248 -500 -1140 1679 581 -1401 400 1791 -822 -1169 1400 238 -1913 73 1036 -1784 -1256 1570
2264 1570 -149 -1799 932 1339 -991 -329 2242 407 -1249 1226 1572 -1248 -183 1830 -517 -1785
$$ packed form
2153I77J690m705L56M286k387k456M314N95n039J536M560l133l195M044L54m110
2169b313J562L186l546k110M608J88m522J823L361l060j156M337j155l712K447
2184f2K835l154j469L569r19l105K613J719l891j26L770j310k572K587J123k753
2200a145N11L187k070k209L217N70l454R39K212k278j309K805l38k811J236K148
2216A211k293q59K908m41k651K337J765k746n8K852j092j783J865Q42k807L77
2232e73K534j773k008K354M23k630R60J959j827j018K648j50k587J510K180k502
2248e00o40K819j098j982J801J391k613l47K569j162k151J986R63k820N28K826
2264A570j719j650K731M07k330O62K571j835j656K475L46k820J065K013k347j268
$$ plain form
2280 -1785 819 502 -1923 -648 1540 -983 -1678 956 743 -1884 275 1847 -818 -794 1798 616
2296 616 -1331 627 1667 -1087 -992 1547 28 -1921 513 1138 -1727 -875 1398 -218 -1509 1033
2312 1033 1139 -1174 -302 2011 -6 -1508 1358 1136 -1442 -24 1380 -904 -1580 901 487 -2005
2328 -2005 -564 1366 -889 -1521 1016 747 -1432 623 1889 -669 -678 1852 975 -1377 442 1604
2344 1604 -911 -944 1604 76 -2051 351 847 -1487 -1114 1194 -339 -1497 828 1235 -1460 -385
2360 -385 2022 58 -1176 1032 1352 -1265 -335 1701 -353 -1719 584 1044 -1637 -482 1329 -341
2376 -341 -1517 1210 1017 -1463 -257 1740 -17 -1035 1276 675 -1374 -29 1621 -627 -1477 763
2392 763 573 -1474 -310 981 -952 -1253 1190 702 -1268 110 1451 -64 -496 1050 344 -1059
$$ packed form
2280a785K604l17k425J275K188k523o95K634k13k627K159J572k665K4K592j182
2296F16j947J958J040k754R5K539j519j949K434O25k865Q52K273j616j291K542
2312A033J06k313Q72K313k017j502K866k22k578J418J404k284o76K481m14k492
2328b005J441J930k255o32K537k69k179K055J266k558rK530q77k352J819J162
2344A604k515l3K548j528k127K402M96k334L73K308j533j158K325M07k695J075
2360c85K407j964j234K208L20k617R30K036k054j366K303M60k681J155J811j670
2376c41j176K727j93k480J206J997j757j018K311o01k049J345J650k248q50K240
2392G63j90k047J164J291j933l01K443m88j970J378J341j515m32J546p06j403
$$ plain form
2408 -1059 539 1779 -477 -1372 788 424 -1100 62 455 -1035 -1031 986 476 -1393 -387 1175 29
2425 29 -289 1195 34 -744 387 1592 -236 -784 209 525 -443 -97 439 -901 -812 841 434 -768
2443 -768 -408 372 432 65 411 66 -588 545 1262 -15 -886 -41 231 -19 -13 -135 -788 -750 357 622
2463 622 -725 -862 90 492 191 369 -46 -474 78 994 595 -699 -476 595 310 -251 -222 -485 -604
2482 -604 22 444 -346 -1175 -372 679 185 -196 105 -2 -187 895 1055 -407 -576 430 933 21 -597
2501 -597 -244 -544 -333 779 -103 -1329 -817 1040 677 -490 -159 313 -251 302 1189 -108 -1233 291
2519 291 1112 -83 -801 -151 -219 -422 629 646 -1338 -1120 1169 717 -1095 -224 463 -368 -48 1366 371
2538 371 -1438 55 1533 -58 -922 475 180 -849 343 1019 -1204 -1588 983 857 -1156 -705 481
$$ packed form
2408a059J598J240k256q95K160l64j524J162L93j490MK017n10j869J006J562j146
2425B9l18J484j161p78J131J205j828n48R93L16r68L46N36j340Q9J653m07j202
2443g68L60P80O0l67L46l45o54J133P17j277q71Q45K72k50Oj22o53L8J107K65
2463F22j347j37R52M02l01J78m15m28N52R16l99j294K23J071k85n61K9k63j19
2482f04O26M22p90q29Q03J051m94l81L01j07j85J082J60j462j69J006N03r12o18
2501e97L53l00K11J112q82j226N12J857l63j167L31M72n64N53Q87j297j125J524
2519B91Q21j195p18O50o8k03J051J7j984K18K289m52j812Q71O87q31L20J414r95
2538C71j809J493J478j591q64J397k95j029J192O76k223l84K571j26k013M51J186
$$ plain form
2555 481 -770 -573 1277 246 -1689 -178 1929 283 -1231 697 613 -1012 519 1507 -862 -1703
2571 -1703 1513 1210 -1341 -685 1050 -653 -972 1697 779 -2146 -149 2143 -5 -1116 995 680
2587 680 -1521 175 1795 -1231 -2018 1372 1232 -1741 -396 1157 -1135 -1009 1724 433 -2019 28
2603 28 2045 -308 -1175 1609 416 -1311 726 1878 -1343 -1467 1539 862 -1599 -281 1093 -1086
2619 -1086 -1007 1696 204 -2251 266 1774 -643 -874 1245 317 -1415 927 1636 -1417 -1021 1374
2635 1374 434 -1535 432 743 -1087 -524 1482 18 -1526 369 1315 -582 -475 1423 -329 -892
2651 -892 1055 1134 -996 -514 1296 201 -1069 484 580 -1356 -368 1096 -701 -1196 429 564 -837
2668 -837 64 1062 -444 -520 1391 631 -1126 151 991 -383 -107 823 -307 -1074 235 459 -800 -598
$$ packed form
2555D81j251J97J850j031j935J511K107j646j514J928q4j625J531R88k369q41
2571a703L216l03k551O56J735j703l19K669r18k925J997K292k148j111K111l15
2587F80k201J696J620l026p87L390j40k973J345J553k292J26K733j291k452K047
2603B8K017k353q67K784j193j727K037J152l221j24L006o77k461J318J374k179
2619a086P9K703j492k455K517J508k417k31K119r28j732K342P09l053L96K395
2635A374r40j969J967L11j830N63K006j464j544J895R46j897J07J898j752n63
2651h92J947P9k130M82J810j095j270J553R6j936R88J464j797m95J625J35j401
2668h37R01R98j506p6J911p60j757J277Q40j374K76R30j130p67J309K24j259K02
$$ plain form
2686 -598 638 -56 -958 643 490 -929 123 946 -39 -282 669 467 -452 -186 734 -688 -984 588
2704 588 44 -1130 -3 488 -807 -487 874 -29 -1043 504 958 -503 -233 951 -74 -372 769
2721 769 447 -800 -159 948 -506 -971 518 323 -1217 -326 738 -839 -826 864 605 -892 160
2738 160 1048 -366 -359 1079 73 -977 489 1105 -805 -750 1076 -444 -997 233 578 -1074 -369 988
2756 988 -9 -918 855 973 -842 96 1261 -29 -892 848 412 -1253 102 983 -756 -1118 805
2773 805 518 -1383 175 827 -652 -680 979 543 -1010 182 1163 -522 -413 1054 250 -1161 307
2790 307 813 -1295 -568 793 -272 -1304 234 492 -980 -627 1133 -296 -975 1048 728 -874 135
2807 135 1217 -104 -867 1116 547 -1140 -120 931 -821 -1068 834 35 -1381 -276 972 -890
$$ packed form
2686e98J236o94r02J601j53j419J052Q23r85k43R51k02r19K66R20j422k96J572
2704E88n44j174J127M91j295L20J361r03j014J547M54j461K70J184j025k98J141
2721G69l22j247O41J107j454m65J489j95j540Q91J064j577J3J690k59j497J052
2738A60Q88j414PJ438j006j050J466O16j910N5J826j520n53J230L45j652P05J357
2756I88r97r09J773J18j815R38J165j290q63J740m36j665J355Q81j739l62J923
2773H05k87j901J558O52j479k8J659m36j553J192R81j685J09J467q04j411J468
2790C07N06k108P27J361j065j032J538K58j472L53J760j429o79K023l20j602J009
2807A35J082j321p63J983n69j687J020J051j752k47J902p99j416J105J248j862
$$ plain form
2823 -890 -838 945 497 -995 465 1235 -554 -447 1210 291 -947 500 818 -870 -748 1115 -132
2840 -132 -1348 366 672 -923 -514 936 -2 -946 812 698 -907 -26 934 15 -560 839 622 -1050
2858 -1050 -146 915 -604 -1151 360 273 -1033 -156 659 -383 -798 870 723 -682 394 949 -129
2875 -129 -100 891 320 -851 225 762 -369 -894 209 -296 -499 40 223 -675 -400 829 350 -509 179
2894 179 543 -297 168 924 -24 -512 455 409 -273 -312 151 -203 -242 288 83 -524 -185 395 85 -15 353
2915 353 -15 3 409 426 66 -212 177 238 -211 -139 -219 -541 -131 113 -512 -586 -229 58 -122 19 -96 -160
2937 -160 16 618 307 -116 10 325 187 309 169 -466 -276 335 -64 -408 -333 -195 -224 43 493 -365 -524
2958 -524 384 567 -86 -23 323 17 -14 584 501 -573 -248 697 -48 -797 -1 19 -540 210 473 -477 -716
$$ packed form
2823h90N2J783m48j492J460P70j789J07J657r19j238J447L18j688J22J863j247
2840a32j216J714L06j595M09J450r38r44J758j14j605Q81R60r19n75J399k17j672
2858a050R04J061j519n47J511q7j306Q77Q15j042m15J668j47j405J076N55j078
2875a29K9R91n71j171J076N37j131n25J103n05k03N39J83q98K75J229m79q59O88
2894A79L64q40M65P56r48m88R67m6o82l9M63l54l9N30k05o07L39N80l10j00L68
2915C53l68J8M06J7l60k78L89O1m49P2q0l22M10K44o25p4L57K87j80J41j15o4
2937a60J76O02l11m23J26L15j38J22j40o35J90O11l99l44P5J38k9K67M50q58j59
2958e24R08J83o53O3L46l06l1N98q3j074L25R45p45p49P96K0n59P50K63r50k39
$$ plain form
2979 -716 263 513 -318 -42 919 -218 -149 939 498 -778 -10 699 138 -671 37 -25 -1120 -58 559
2998 559 -835 -933 495 263 -323 -82 509 -287 -283 761 690 -898 -91 1054 96 -450 514 -78 -1070 318
3018 318 972 -581 -946 526 534 -602 -316 773 -551 -239 1048 617 -1170 -90 1061 -71 -640
3035 -640 493 232 -937 -32 803 -578 -1188 506 409 -693 -295 515 -513 -584 1121 395 -815 23
3053 23 1030 97 -650 629 127 -740 16 1092 -417 -1124 197 169 -1059 -289 747 -662 -662 1098
3071 1098 633 -1066 -85 1177 175 -495 631 200 -700 247 1119 -361 -864 783 407 -557 -169 636
3089 636 -594 -959 916 388 -931 -47 1040 161 -528 741 284 -541 102 1242 -439 -979 385
3106 385 180 -672 -11 528 -886 -618 738 92 -747 -62 903 -166 -242 727 35 -594 492 773 -519
$$ packed form
2979g16R79K50q31K76R61j137O9J088m41j276P68P09n61q09P08o2j095J062O17
2998E59j394r8J428k32n86K41N91p96MJ044p1j588Q07J145r58n46R64n92r92J388
3018C18O54j553l65J472Qj136K86J089j324L12J287m31j787J080J151j132n69
3035f40J133k61j169R05Q35j381o10J694r7j102L98Q10j028p1J705p26j210Q38
3053B3J007r33p47J279n02q67P56J076j509p07J321k8j228P70J036j409%J760
3071A098m65j699R81J262j002o70J126m31r00R47Q72j480n03J647l76r64L88Q05
3089F36j230l65J875n28j319Q84J087q79o89J269m57q25O43J140j681n40J364
3106C85k05q52O61N39j414K68J356o46q39O85R65j069p6R69o92o29J086K81j292
$$ plain form
3125 -519 -622 504 144 -606 141 544 -827 -334 648 30 -815 336 499 -216 103 496 -95 -325 640
3144 640 624 -404 -169 491 -210 -282 224 -98 -544 -298 365 -381 -566 245 68 -435 139 379 -453 -264
3164 -264 596 308 -188 127 449 -116 6 521 -347 -607 343 101 -426 -121 115 -512 -63 365 209 -234
3184 -234 309 573 -90 -146 387 -59 -424 418 274 -694 -171 211 -172 -799 159 198 -518 -262 689 -360
3204 -360 -398 574 290 -284 306 660 1 -222 866 494 -616 98 584 -319 -269 606 -82 -842 47 403
3224 403 -642 -484 481 102 -407 435 602 -635 -93 915 -88 -668 517 437 -693 -155 660 -298
3242 -298 -778 493 81 -802 -275 647 -346 -631 787 410 -687 275 958 91 -489 850 132 -841 75
3261 75 637 -818 -588 615 -322 -1348 -126 420 -622 -665 655 97 -829 632 815 -501 118 1000
$$ packed form
3125e19j03J126l60p50P47M03j371M93R82o18q45J151J63p15L19L93n91k30R65
3144F40j6j028K35O60p01p2N06l22m46K46O63p46j85Q11j77n03N74K40q32J89
3164b64Q60k88m96L15L22n65J22N15q68k60R50k42n27L05K36o27M49M28j56m43
3184b34N43K64o63n6N33m46l65Q42j44r68N23L82l83o27R58L9p16K56R51j049
3204c60l8R72k84n74N90L54o59k23J088l72j110P14M86r03N0Q75o88p60Q89L56
3224D03j045J58R65l79n09Q42J67j237N42J008j003n80J185q0j130N38Q15r58
3242b98m80J271m12q83N27R22r93k85J418l77j097R62O83q67n80J339p18r73R16
3261G5N62j455K30J203r37j026J222N46j042m3J320n58r26J461J83j316O19Q82
$$ plain form
3279 1000 -55 -497 667 575 -847 -33 772 -410 -924 445 268 -734 -126 661 -245 -677 817 380
3297 380 -573 222 826 -148 -398 708 258 -750 121 503 -509 -537 530 -126 -1046 105 559 -562
3315 -562 -289 604 27 -559 431 486 -527 -21 722 112 -775 504 534 -824 -257 619 -533 -748 351
3334 351 135 -713 -328 677 -400 -428 612 320 -564 256 941 -169 -218 590 213 -512 159 653 -529
3353 -529 -398 562 -82 -711 -18 429 -345 -231 650 -142 -200 186 456 -294 54 697 -127 -551 538 144
3373 144 -514 -157 181 -485 -469 172 116 -515 -271 513 -94 -160 535 64 -328 512 571 -104 -98 443 89 -320
3395 -320 167 79 -728 -210 3 -415 -509 149 142 -291 -164 316 -174 -443 552 329 -197 237 342 -383 53
3416 53 451 -180 -500 211 242 -364 -326 144 -579 -677 401 241 -568 -28 762 -57 -195 593 295 -687 341
$$ packed form
3279A000j055m42J164r2j422Q14Q05j182n14J369j77j002O08P87r06m32J494m37
3297C80r53P95O04r74k50J106m50j008Q71L82j012k8J067o56r20J151M54j121
3315e62K73Q93n77n86R90N5j013N06P43o10q87J279L0j358N67Q76j152k15J099
3334C51k16q48L85J005j077k8J040k92q84Q20O85j110m9Q08l77p25O71M94j182
3353e29J31R60o44o29O93M47p74J14Q81p92n8L86K70p50L48O43q24m24J089l94
3373A44o58L57L38o66J6O41n6o31K44P84o07o6O95m71l92Q40N9o75ON41l54m09
3395c20M87q8q07N18K13m18r4O58pm33J27M80m90k69R95k23n26M34J05p25M36
3416E3L98o31l20P11L1o06L8M70p23r8J078j60q09N40P90q19j38P88k98r82J028
$$ plain form
3437 341 648 -299 -461 275 27 -826 -182 54 -635 -473 520 -96 -840 167 706 -128 -207 846 -88 -324
3457 -324 763 810 -462 -346 614 79 -510 60 260 -679 -496 642 -116 -798 346 563 -236 -41 376
3476 376 -84 -641 646 701 -588 -195 702 -109 -574 492 85 -815 -76 904 -290 -735 161 517 -510
3495 -510 105 879 -405 -314 960 584 -567 -37 677 99 -267 559 64 -786 -100 589 -305 -910 210
3514 210 27 -747 -9 536 -381 -232 823 665 -501 -40 703 -261 -206 592 136 -537 -127 727 -490
3533 -490 -855 198 146 -558 88 255 -650 -300 824 398 -435 27 661 98 -183 668 63 -956 307
3552 307 529 -339 -702 312 -2 -591 -40 132 -469 -507 447 326 -407 141 402 -118 68 551 172 -449
3572 -449 226 241 -269 -261 86 -220 -135 -85 71 -530 -245 420 166 -277 -80 391 -266 38 373 143 -475 87
$$ packed form
3437C41L07r47j62P36k48q53O44K36o89J62R93o16p44J007N39q34p9J053r34k36
3457c24J087M7j272J16R60n35n89N70K00r39J83J138p58o82J144K17p99J95M17
3476C76m60n57J287N5j289L93Q97q11m65J066m07r00P39R80j194m45Q96L56j027
3495e10O15P74j284R1J274l76j151N30P14n78l66Q26m95q50O86O89q94o05J120
3514B10j83p74P38N45r17J49J055j58j166M61P43r64N5P98m56o73M10Q54j217
3533d90l65J053n2p04O46J67r05L50J124m26q33M62O34n63k81Q51o05j019J263
3552C07K22q68l63J014l14n89N51J72o01l8R54j21p33N48K61n20J86M83l79o21
3572d49O75J5n10QL47l06Q5N0J56o01K85O65k54m43J97M71o57L04L35k30o18N62
$$ plain form
3594 87 626 59 -179 138 -27 -164 144 130 -483 -242 278 -50 -252 182 -93 -18 -130 167 57 -428 310
3615 310 352 -75 126 -13 -154 -149 299 -58 -277 82 150 -190 -272 128 -47 -117 175 207 -152 136 243 192 39
3638 39 80 114 -244 134 234 -282 -666 226 -16 -370 134 70 -317 -116 133 155 -210 24 252 -194 128 265
3660 265 -9 -660 376 259 -443 -87 160 120 -99 65 -36 -549 92 208 -267 -281 337 144 -392 269
3680 269 219 -275 -108 452 168 -323 -50 434 -520 -220 341 -22 -535 188 404 -292 -262 300 44 -384 506
3701 506 432 -446 -249 756 70 -680 401 284 -466 -150 367 -429 -486 236 377 -762 35 656 -147 -435
3721 -435 506 478 -529 196 524 -60 -195 301 110 -355 159 732 -365 -677 652 -40 -655 41 391
3740 391 -417 -211 539 71 -543 261 533 -532 -323 694 49 -568 247 362 -765 -400 670 -201 -601
$$ packed form
3594H7N39n67k38L17j65j37L08j4o13K41N20l28k02M34k75P5j12K97j10m85P38
3615C10M2m27K01j39j41NM48l57k19L59O8l40q2M00j75p0K92L2l59K88J07n1j53
3638C9M1L4l58L78J00n16l84Q92k42l54N04o4l87K01K49K2l65K34K28m46L22J37
3660B65k74o51J036j17p02L56K47m0k19J64j01n13O41J16m75j4O18j93n36O61
3680B69n0m94J67N60k84m91K73M84r54L00N61l63n13P23K16o96L0N62k56m28Q90
3701E06p4q78J97J005o86p50J081j17p50L16N17p96n7P22J41j139P97O21q03k88
3721d35R41k8j007P25L28n84j35M96j91m65N14N73j097l12J329o92o15O96L50
3740C91q08K06P50m68o14Q04K72j065K09J017o45o17Q15J15j127L65J070q71m00
$$ plain form
3759 -601 243 244 -633 14 534 -245 -487 397 462 -214 181 615 -241 -228 504 256 -615 -35 425 -558 -553 458
3781 458 25 -694 81 632 -509 -100 577 82 -504 302 689 -230 95 871 189 -659 282 557 -417 -144
3801 -144 408 -243 -421 166 278 -738 73 445 -334 -402 574 219 -546 216 502 -258 -326 502 243 -738
3821 -738 -46 350 -264 -370 308 -209 -529 129 458 -364 -239 583 82 -304 364 479 -315 110 551 -57
3841 -57 -297 347 316 -605 -172 212 -250 -560 254 48 -574 -23 409 -264 -288 430 17 -581 291 574 -188
3862 -188 -182 188 194 -600 54 195 -525 45 313 -161 -542 272 235 -542 -103 364 -187 -181 333 432 -335 -38 603
3885 603 -97 -278 478 -135 -687 24 409 -375 -326 238 -303 -785 300 407 -306 -36 610 117 -284 322
3905 322 401 -446 181 806 -197 -459 426 70 -687 -192 276 -593 -458 523 237 -564 177 637 -180 -269
$$ packed form
3759f01Q44Jq77O47N20p79k42Q84O5o76L95M34q56J3P32k48q71N80M60r83NJ011
3781D58m33p19P75N51j141M09O77m95n86Q06L87r19L25P76o82q48R41K75r74K73
3801a44N52o51j78N87J12j016Q11L72p79o8R76l55p65P62K86p60o8Q28k59r81
3821g38O92L96o14j06O78n17l20O58L29q22J25Q22n01l86O68J15p94M25M41o08
3841e7k40O44l1r21M33L84m62l10Q14k06o22N51M32o73k4P18m13n98Q72K83p62
3862a88OL70Op94O54J41p20N70K68m74l81Q14l7p77M39M67n51ON14R9p67K97O41
3885F03p00j81P56o13n52P11L85p84M9N64n41m82J085J07p13K70O46m93m01O06
3905C22P9q47O27O25j003k62Q85l56p57M95M68q69J35R81k86q01P41M60q17q9
$$ plain form
3925 -269 497 166 -479 472 506 -311 -228 494 43 -372 -3 428 -584 -598 726 -187 -664 290 349 -308 -290
3946 -290 561 -95 -724 399 695 -550 -141 700 20 -537 478 185 -427 -209 565 -206 -888 386 319
3965 319 -538 99 876 -168 -448 508 571 -371 -39 459 5 -241 495 203 -924 -101 576 -183 -555 289
3985 289 -207 -513 38 452 -260 -275 758 372 -416 188 658 -177 -128 381 -12 -581 19 369 -208 -443
4005 -443 566 134 -399 284 367 -528 -268 469 154 -190 541 343 -108 90 364 -256 -463 89 100 -248
4025 -248 -271 102 -278 -531 466 114 -190 -41 187 -146 -310 241 78 -226 -19 398 -113 -163 117 255 -191
4046 -191 -144 128 -215 -159 281 111 -434 -71 79 -71 86 68 44 -232 70 321 -85 -37 61 69 15 86 -106
4069 -106 -195 33 60 -85 -299 5 56 54 -87 81 -33 -221 185 239 -59 215 89 86 -158 -63 -58 -149 -130 161
$$ packed form
3925b69P66l31o45R51L4q17Q3P22m51m15L69M31j012j4J324r13m77R54N9o57J8
3946b90Q51o56o29J123K96j245M09Q41o80n57J015k93o12K18P74p71o82J274o7
3965C19q57O37P77j044k80R56O3r42L32M98m54k46P36k92j127Q23O77p59l72Q44
3985B89m96l06N51M14p12j5J033l86p88O04M70q35M9N09l93n69O00L50n77k35
4005d43J009m32n33O83Q3q95K60P37l15l44P31j98m51J98K74o20k07N52J1l48
4025b48k3L73l80k53R97l52l04J49K28l33j64N51j63l04K07M17n11n0K80J38m46
4046a91M7K72l43N6M40j70n45L63J50j50J57j8k4k76L02K51m06M8R8Qn4P1j92
4069a06q9K28K7j45k14L04N1kj41J68j14j88M06N4k98K74j26lk44R5Nr1J9K91
$$ plain form
4093 161 -366 -123 68 -34 -176 49 86 -124 -119 199 52 -169 170 13 15 160 380 -146 -186 83 -71 -254
4115 -254 -92 -164 -338 -353 105 -63 -415 -216 267 -124 53 48 -18 87 228 257 -247 -171 161 11 -304 -4
4137 -4 124 -171 -165 273 -121 -390 41 399 -156 8 305 -37 -91 281 246 -384 194 420 -67 -144 55 77 -373
4160 -373 -158 235 -230 -473 92 212 -286 -87 339 -13 -207 266 299 -227 80 416 63 -22 48 24 -384
4181 -384 -185 99 -233 -359 54 44 -353 18 77 -176 -107 376 192 -271 6 391 -28 -361 271 269 -354 148
4203 148 374 -355 -419 266 -42 -359 240 379 -221 -115 551 50 -339 134 357 -170 67 291 100 -173
4223 -173 79 228 -350 -206 320 79 -619 182 467 -558 -193 357 5 -485 348 293 -297 -31 471 131
4243 131 -385 165 239 -465 -174 374 -104 -573 202 171 -513 -205 337 -155 -225 493 57 -211 181 330 -57
$$ packed form
4093A61n27K43J91j02j42K25L7k10NL18j47k21L39j57KJ45K20n26m0K69j54j83
4115b54J62p2j74j5M58j68l52J99M83l91J77no6J05J41K9n04P6L32j50l15L00
4137dJ28k95OM38l94k69M31L58n55J64K97l42n4L72l5o30N78K26m87p7J99K2m50
4160c73K15L93m65k43N65J20m98J99M26l52j94M73L3n26L07L36l53q5P0k4m08
4181c84J99K84l32j26M13j0l97L71N9k53O9M83j84m63K77L85m19l33O32ko23N02
4203A48K26p29o4O85l08l17N99J39o00J06O66n01l89M73K23n27K37K24j91k73
4223a73K52J49n78J44N26k41o98Q01K85j025L65N50l52m90Q33n5n90K66N02l40
4243A31n16N50P4p04K91N48m78m69P75l1o84L08N42m92p0P18m36k68L92J49l87
$$ plain form
4264 -57 -74 384 131 -220 358 320 -102 -163 183 -326 -307 100 221 -242 72 377 -140 -108 219 267 -368 -107
4286 -107 451 -78 -303 201 104 -552 -79 304 -368 -216 258 -149 -462 141 182 -81 -115 120 20 -108 158
4307 158 243 -111 -245 441 89 -464 213 315 -359 -234 373 -285 -482 330 84 -341 -74 308 -85 152
4327 152 362 181 -429 170 504 -169 -219 320 -85 -355 -126 237 -495 -207 207 38 -168 63 239 -153
4347 -153 -134 388 117 -89 201 325 -317 118 448 -126 -303 347 321 -608 -197 294 -372 -277 302 345 -535
4368 -535 3 489 -390 -223 399 152 -305 257 422 -412 -211 485 29 -454 258 197 -517 38 398 -259
4388 -259 -547 371 190 -312 -138 605 43 -391 490 315 -382 221 650 -138 -332 249 70 -562 -341 358
4408 358 -357 -488 462 75 -365 42 623 -327 -341 338 -35 -335 97 387 -416 -482 370 -143 -500 46 268
$$ packed form
4264e7j7M58k53l51N78l8m22o1L46n09J9M07J21m63L14L05n17L2L27M8o35K61
4286a07N58n29k25N04r7o56M73L83o72J52M74m07l13O03M1k63l4K35j00j28K66
4307A58Q5l54j34O86l52n53O77J02o74J25O07o58j97Q12k46m25K67L82l93K37
4327A52K10j81o10N99L34o73n0N39m05k70K29L63p32K88M14j69k06K31J76l92
4347a53J9N22k71k06K90J24o42M35L30n74j77O50k6r29M11M91o66R5N79M3q80
4368e35N38M86q79J67O22k47m57N62J65q34K01O96m56m83P12o1p14N55L60o57
4388b59k88R18j81n02J74P43n62m34Q81j75o97O03M29p88j94N81j79o32K21O99
4408C58p15j31R50l87m40M07N81r50j4O79l73l00M32K90q03o6Q52n13l57N46K22
$$ plain form
4429 268 -615 -385 494 114 -489 46 343 -369 -177 443 -193 -445 409 585 -201 -214 533 -126 -255 283
4449 283 359 -645 -322 413 -326 -515 230 141 -322 139 574 88 -398 520 575 -310 79 310 -370 -461 375
4470 375 250 -628 -64 213 -304 -342 186 56 -385 290 456 -343 -78 318 225 -365 148 248 -206 -105 268
4491 268 11 -494 178 131 -150 -158 227 -127 -424 360 268 -396 -75 372 286 -49 426 125 -194 113 392 83
4513 83 -402 4 -15 -107 -38 -40 -279 -329 175 -267 -253 74 288 -76 -24 321 -289 -214 221 423 -326 -54 -59 -195
4537 -195 -276 -125 86 -349 -48 243 91 -250 228 46 -282 100 383 -29 49 292 172 -200 341 87 -56
4558 -56 16 -30 -24 -514 -127 -55 -368 -75 39 -408 -107 208 56 -152 -28 392 27 -144 221 85 -99 214
4580 214 275 -224 -156 132 -224 -368 -104 189 -469 -248 447 191 -243 176 225 65 27 80 71 -342 540 179
$$ packed form
4429B68q83K30Q79l80o03N35K97p12J92O20o36k52Q54J76p86j3P47o59j29N38
4449B83P6j004L23P35p39j89P45q9m63M61M35m86m86R18N5q85L89K31o80r1Q36
4470C75j25q78N64K77n17l8N28j30m41O75J66p99K65L96r3n90N13J00m54J01L73
4491B68k57n05O72m7k81qL85l54k97P84r2o64L21M47q6l35M75l01l19L07K79l09
4513H3m85M06j9r2O9kk39n0N04m42J4L27K14l64N2L45o10P5M35K02p49K72nj36
4537a95q1J51K11m35L01K91j52l41M78j82l28L82K83m12P8K43j20l72N41k54j43
4558e6P2m6Om90L87P2l13K93J14m47L01L15j52k08J24M20l65j71L65j36j84L13
4580B14O1m99O8K88l56j44K64K93o58K21O95k56m34M19M9j60l8N3rm13Q82l61
$$ plain form
4602 179 -366 -168 377 -1 -422 35 49 -170 -71 290 21 -499 35 434 -195 -125 266 -11 47 495 26
4623 26 -201 -258 166 -139 -272 -15 55 -443 -180 331 -308 -378 325 109 -285 22 127 -83 -67 141 150 -192
4645 -192 -35 227 -438 -195 32 94 -241 -72 143 49 -317 -29 250 -252 104 180 -104 -64 312 284 -272 112
4667 112 416 0 38 136 216 -486 -92 103 -184 -77 292 187 -149 63 -109 -196 -31 391 305 -490 82 365
4689 365 -207 -160 216 -135 -238 111 186 -195 -253 231 -42 -300 8 137 -424 54 586 -36 130 87 146 -247
4711 -247 -65 391 -17 -122 140 236 -455 -127 213 -43 -196 151 -172 -375 -115 296 -222 -90 492 1
4731 1 -96 61 315 6 4 210 115 -206 50 258 -160 -179 119 -137 -330 17 170 -135 -39 140 -89 -194 418
4754 418 194 -161 -33 304 -53 99 212 220 -166 -69 11 -386 -314 11 103 -82 -61 375 -150 -3 381 196
$$ packed form
4602A79n45J98N45l78m21M57J4k19R9L61k69n20N34L99o29P0L91k77N8M48m69
4623B6k27n7M24l05j33K57P0m98K63N11o39p0P03k16l94L07J05k10J6K08Rl42
4645a92J57K62o65K43K27O2l35J69K15r4l66K88K79n02L56P6k84M0L76k8n56L84
4667A12L04m16L8R8Q0p02L94J95k87J07L69j05l36K12j72q7J65M22q6p95N72K83
4689C65n72M7L76l51j03L49P5l81n8M84k73k58L08J29n61M78N32o22J66m3N9l93
4711b47J82M56m08j05K62R6o91L28L40k56j53L47l23k03K60M11n18J32N82m91
4731Ar7J57K54l09kK06r5l21K56K08m18j9K98k56j93L47J53l05R6J79k29j05O12
4754D18k24l55J28L37l57J52J13Ql86R7Q0l97P2L25R2j85K1M36n25J47L84j85
$$ plain form
4776 196 -25 187 185 92 62 308 88 -367 -1 0 -194 -158 267 -232 -152 149 146 -375 70 313 -11 -5 223 192
4800 192 -350 54 265 -90 -222 114 127 -372 -84 166 -320 -241 248 49 -448 223 165 -211 -112 193 23
4821 23 -43 292 230 -121 -91 405 -159 -389 -30 98 -415 -51 111 -255 -513 181 9 -515 -57 418 -144
4842 -144 -243 86 208 -20 -150 398 -178 -263 323 240 -516 -176 329 -321 -100 281 -144 -464 155 236 -381
4863 -381 -61 482 205 -445 280 106 -434 -56 528 -83 -523 6 374 -530 -126 176 -116 -268 182 258
4883 258 -250 -17 542 -16 -271 304 99 -259 208 410 -208 -231 182 104 -575 -171 380 -267 -413 327 -1
4904 -1 -357 236 356 -29 -11 534 119 -312 229 357 -268 -194 248 -209 -344 43 349 -453 -242 389 21
4925 21 -530 278 164 -494 -76 357 60 -256 479 251 -333 148 451 -118 -328 128 12 -394 -198 97
$$ packed form
4776A96k21K12kr3l0K46k20m55L66Jj94L6M25m99Q0L01ln21M45K43l24OK28l1
4800A92n42M04K11l55j32L36J3m99K88K50m86P9M89j99m97O71n8l76R9L05j70
4821B3o6L35o2l51L0M96n64k30L59J28n13L64J62l66k58O94j72n24M58M75n62
4842a44r9L29J22k28j30N48n76q5N86q3p56L40N05o50K21L81m25l20O19Q1o17
4863c81L20N43k77o50P25j74n40L78N84o11m40N29L68r04M04L02k92j52M50P6
4883B58n08K33N59n58k55N75k05l58M67K02o18k3M13p8o79M04N51o47j46P40l28
4904al56N93J20l85J8N45m15m31N41J28o25P4M42m57j35L87L06q02K11O31l68
4925B1n51Q08j14o58M18M33k97l16P35k28n84M81L03n69k10M56j16m06J96K95
$$ plain form
4945 97 -93 -359 82 133 -375 46 789 1 -199 260 200 -79 53 115 2 -197 200 174 -426 -59 121 -345
4967 -345 -373 261 -119 -368 84 126 -236 -59 130 -50 -134 232 325 -73 122 412 -188 -219 118 -120 -183 8
$$ packed form
4945I7j90k66M41N1n08M21P43p88k00M59o0k79J32O2j13j99L97k6o00L67J80m66
4967c45k8O34l80k49M52M2l62J77J89j80q4L66R3l98J95K90o00l1L37k38o3J91
$$ [...]
8191I0
##END NTUPLES=NMR FID
##END=
