##TITLE=1H_Pr oct 2
 200.13MHz,CDCl3,
 8 sc
 
 11.7.2025
##JCAMPDX= 6.0         $$ Bruker NMR JCAMP-DX V2.0
##DATA TYPE= NMR FID
##DATA CLASS= NTUPLES
##ORIGIN= UXNMR, Bruker Analytische Messtechnik GmbH
##OWNER= pz
$$ XWIN-NMR		Version 3.5
$$ Fri Jul 11 14:52:10 2025 Russian Standard Time (UT+4h)  she@DPX200
##.OBSERVE FREQUENCY= 200.1313
##.OBSERVE NUCLEUS= ^1H
##.DELAY= (6, 6)
##.ACQUISITION MODE= SIMULTANEOUS
##.ACQUISITION SCHEME= undefined
##.AVERAGES= 8
##.DIGITISER RES= 18
##SPECTROMETER/DATA SYSTEM= spect
##.PULSE SEQUENCE= zg30
##.SOLVENT NAME= CDCl3
##.SHIFT REFERENCE= (INTERNAL, CDCl3, 0, 14.3821)
##AUDIT TRAIL= $$ (NUMBER, WHEN, WHO, WHERE, WHAT)
$$ ##TITLE= Audit trail, XWIN-NMR		Version 3.5
$$ ##JCAMPDX= 5.01
$$ ##ORIGIN= Bruker BioSpin GmbH
$$ ##OWNER= she
$$ F:/spectra/data/she/nmr/H-C/1/audita.txt
$$ ##AUDIT TRAIL=  $$ (NUMBER, WHEN, WHO, WHERE, WHAT)
(   1,<2025-07-11 14:50:48.96 +0400>,<she>,<DPX200>,
      <created by zg, POWCHK disabled, PULCHK disabled
       configuration hash MD5:
       00 E9 B6 7A A2 85 ED C7 34 08 36 98 17 FE 4E 26
       data hash MD5: 16K
       E1 95 03 17 6C 22 24 C2 DE AC F6 2A 7F 9C 2D 50>)
$$ ##END=
$$ 
$$ hash MD5
$$ D0 00 46 96 E1 20 C8 AB 98 47 C1 DD 32 47 04 8B
##$RELAX= 
##$RELAX= 
##$RELAX= 
##$RELAX= 
##$RELAX= 
##$RELAX= 
$$ Bruker specific parameters
$$ --------------------------
##$DU= <F:/spectra>
##$EXPNO= 1
##$NAME= <H-C>
##$PROCNO= 1
##$TYPE= <nmr>
##$USER= <she>
##$AMP= (0..31)
100 100 100 100 100 100 100 100 100 100 100 100 100 100 100 100 100 100 
100 100 100 100 100 100 100 100 100 100 100 100 100 100 
##$AQSEQ= 0
##$AQ_mod= 1
##$AUNM= <au_zg>
##$AUTOPOS= <>
##$BF1= 200.13
##$BF2= 200.13
##$BF3= 200.13
##$BF4= 200.13
##$BF5= 200.13
##$BF6= 200.13
##$BF7= 200.13
##$BF8= 200.13
##$BYTORDA= 1
##$CFDGTYP= 0
##$CFRGTYP= 5
##$CHEMSTR= <none>
##$CNST= (0..31)
1 1 145 1 1 1 1 1 1 1 1 1 1 1 1 1 1 1 1 1 1 1 1 1 1 1 1 1 1 1 1 1 
##$CPDPRG= <>
##$CPDPRG1= <>
##$CPDPRG2= <>
##$CPDPRG3= <>
##$CPDPRG4= <mlev>
##$CPDPRG5= <mlev>
##$CPDPRG6= <mlev>
##$CPDPRG7= <mlev>
##$CPDPRG8= <mlev>
##$CPDPRGB= <>
##$CPDPRGT= <>
##$D= (0..31)
0 0.7 0 0 0 0 0 0 0 0 0 0.03 0 0 0 0 0 0 0 0 0 0 0 0 0 0 0 0 0 0 0 0 
##$DATE= 1752231048
##$DBL= (0..7)
120 120 120 120 120 120 120 120 
##$DBP= (0..7)
150 150 150 150 150 150 150 150 
##$DBP07= 0
##$DBPNAM0= <>
##$DBPNAM1= <>
##$DBPNAM2= <>
##$DBPNAM3= <>
##$DBPNAM4= <>
##$DBPNAM5= <>
##$DBPNAM6= <>
##$DBPNAM7= <>
##$DBPOAL= (0..7)
0.5 0.5 0.5 0.5 0.5 0.5 0.5 0.5 
##$DBPOFFS= (0..7)
0 0 0 0 0 0 0 0 
##$DE= 6
##$DECBNUC= <off>
##$DECIM= 32
##$DECNUC= <off>
##$DECSTAT= 4
##$DIGMOD= 1
##$DIGTYP= 9
##$DL= (0..7)
0 120 120 120 120 120 120 120 
##$DP= (0..7)
150 150 150 150 150 150 150 150 
##$DP07= 0
##$DPNAME0= <>
##$DPNAME1= <>
##$DPNAME2= <>
##$DPNAME3= <>
##$DPNAME4= <>
##$DPNAME5= <>
##$DPNAME6= <>
##$DPNAME7= <>
##$DPOAL= (0..7)
0.5 0.5 0.5 0.5 0.5 0.5 0.5 0.5 
##$DPOFFS= (0..7)
0 0 0 0 0 0 0 0 
##$DQDMODE= 0
##$DR= 18
##$DS= 0
##$DSLIST= <SSSSSSSSSSSSSSS>
$$ [...]
##$SUBNAM0= <"">
##$SUBNAM1= <"">
##$SUBNAM2= <"">
##$SUBNAM3= <"">
##$SUBNAM4= <"">
##$SUBNAM5= <"">
##$SUBNAM6= <"">
##$SUBNAM7= <"">
##$SUBNAM8= <"">
##$SUBNAM9= <"">
##$SW= 18.0517328524113
##$SWIBOX= (0..15)
0 0 2 0 0 0 0 0 0 0 0 0 0 0 0 0 
##$SW_h= 3612.71676300578
##$TD= 16384
##$TD0= 1
##$TE= 0
##$TE2= 300
##$TE3= 300
##$TEG= 300
##$TL= (0..7)
0 120 120 120 120 120 120 120 
##$TP= (0..7)
150 150 150 150 150 150 150 150 
##$TP07= 0
##$TPNAME0= <>
##$TPNAME1= <>
##$TPNAME2= <>
##$TPNAME3= <>
##$TPNAME4= <>
##$TPNAME5= <>
##$TPNAME6= <>
##$TPNAME7= <>
##$TPOAL= (0..7)
0.5 0.5 0.5 0.5 0.5 0.5 0.5 0.5 
##$TPOFFS= (0..7)
0 0 0 0 0 0 0 0 
##$TUNHIN= 0
##$TUNHOUT= 0
##$TUNXOUT= 0
##$USERA1= <user>
##$USERA2= <user>
##$USERA3= <user>
##$USERA4= <user>
##$USERA5= <user>
##$V9= 5
##$VALIST= <valist>
##$VCLIST= <CCCCCCCCCCCCCCC>
##$VD= 0
##$VDLIST= <DDDDDDDDDDDDDDD>
##$VPLIST= <PPPPPPPPPPPPPPP>
##$VTLIST= <TTTTTTTTTTTTTTT>
##$WBST= 1024
##$WBSW= 4
##$XGAIN= (0..3)
0 0 0 0 
##$XL= 0
##$YL= 0
##$YMAX_a= 55221
##$YMIN_a= -74922
##$ZGOPTNS= <>
##$ZL1= 120
##$ZL2= 120
##$ZL3= 120
##$ZL4= 120
##$ABSF1= 10
##$ABSF2= 0
##$ABSG= 5
##$ABSL= 3
##$ALPHA= 0
##$AQORDER= 0
##$ASSFAC= 0
##$ASSFACI= 0
##$ASSFACX= 0
##$ASSWID= 0
##$AUNMP= <proc_1d>
##$AZFE= 0.1
##$AZFW= 0.1
##$BCFW= 1
##$BC_mod= 2
##$BYTORDP= 1
##$COROFFS= 0
##$CY= -3
##$DATMOD= 1
##$DC= 2
##$DFILT= <>
##$DTYPP= 0
##$F1P= 0
##$F2P= 0
##$FCOR= 0.5
##$FTSIZE= 0
##$FT_mod= 4
##$GAMMA= 1
##$GB= 0.15
##$INTBC= 1
##$INTSCL= 1
##$ISEN= 128
##$LB= 0.25
##$LEV0= 0
##$LPBIN= 0
##$MAXI= 10000
##$MC2= 0
##$MEAN= 0
##$ME_mod= 0
##$MI= 1.114404
##$NCOEF= 0
##$NC_proc= 0
##$NLEV= 6
##$NOISF1= 3.799351
##$NOISF2= 2.8
##$NSP= 1
##$NTH_PI= 0
##$NZP= 0
##$OFFSET= 14.38212
##$PC= 1
##$PHC0= -1205.401
##$PHC1= 18.99254
##$PH_mod= 1
##$PKNL= yes
##$PPARMOD= 0
##$PSCAL= 0
##$PSIGN= 0
##$REVERSE= no
##$SF= 200.129724274929
##$SI= 16384
##$SIGF1= 3
##$SIGF2= 2
##$SINO= 400
##$SIOLD= 16384
##$SREGLST= <1H.CDCl3>
##$SSB= 0
##$STSI= 0
##$STSR= 0
##$SW_p= 3205.1282051282
##$SYMM= 0
##$S_DEV= 0
##$TDeff= 0
##$TDoff= 0
##$TI= <>
##$TILT= no
##$TM1= 0
##$TM2= 0
##$TOPLEV= 0
##$USERP1= <user>
##$USERP2= <user>
##$USERP3= <user>
##$USERP4= <user>
##$USERP5= <user>
##$WDW= 1
##$XDIM= 8192
##$YMAX_p= 0
##$YMIN_p= 0
$$ End of Bruker specific parameters
$$ ---------------------------------
##NTUPLES= NMR FID
##VAR_NAME=  TIME,          FID/REAL,        FID/IMAG
##SYMBOL=    X,             R,               I
##VAR_TYPE=  INDEPENDENT,   DEPENDENT,       DEPENDENT
##VAR_FORM=  AFFN,          ASDF,            ASDF
##VAR_DIM=   8192,          8192,            8192
##UNITS=     SECONDS,       ARBITRARY UNITS, ARBITRARY UNITS
##FACTOR=    0.0002768,     1,               1
##FIRST=     0,             0,               0
##LAST=      2.2672688,     0,               0
##MIN=       0,             -74922,          0
##MAX=       2.2672688,     55221,           0
$$ Real data points
##PAGE= N=1
##DATA TABLE= (X++(R..R)), XYDATA
$$ plain form
0 0 0 0 0 0 0 0 0 0 0 0 0 0 0 0 0 0 0 0 0 -1 8 -8 8 -8 8 -8 11 -16 16 -16 20 -24 24 -30 32 -37 41 -46 51 -57 63 -70
42 -70 77 -87 95 -105 115 -128 141 -154 169 -188 207 -229 254 -281 312 -350 394 -446 508 -588 690
63 690 -829 1023 -1321 1817 -2813 5528 -29459 -74922 12438 35620 6658 -19450 -24587 15573
77 15573 11969 -16621 15841 3614 -23577 5683 9173 6297 4695 -24176 3104 22492 -11212
90 -11212 845 8199 -11075 7370 5003 742 11658 -15865 -4037 24340 -10140 -11496 7914
103 7914 -5227 125 -7974 -11489 15654 -8397 -21121 12748 318 -6176 7624 -4843 7089
116 7089 7195 -9369 19593 12813 -16427 7127 12446 3459 2186 -17991 4142 18425 -22582
129 -22582 -13463 9319 -5980 -3482 -12035 -11875 14858 -3620 -10655 10872 -5250 1366 18373
$$ packed form
0@%%%%%%%%%%%%%%%%%%%jRj6J6j6J6j6J9k7L2l2L6m4M8n4O2o9P8q7R7j08J20j33
42g0J47j64J82k00K20k43K69k95L23l57L95m36M83n35N93o62P44q40R54j096J278
63F90j519J852k344L138m630Q341l4987m5463Q7360K3182k8962k6108n137M0160
77A5573l604k8590L2462j2227k7191K9260L490k876j602k8871K7280J9388l3704
90a1212J2057P354j9274J8445k367m261J0916k7523J1828K8377l4480j356J9410
103G914j3141N352q099l515K7143k4051j2724L3869j2430o494J3800j2467J1932
116G089J06j6564K8962o780k9240K3554N319q987j273k0177K2133J4283m1007
129b2582R119K2782j5299K498q553J60K6733j8478p035K1527j6122O616J7007
$$ plain form
142 18373 -1508 3666 5406 -2995 18533 4885 -12800 8568 -1109 -7205 7285 -8010 -5000
155 -5000 -2755 -17842 8184 9446 -20948 -6281 3975 3700 10780 -10060 -4676 16778 -1850
168 -1850 3829 12381 -8619 2275 7267 -3178 8765 -5309 -11224 10623 -4145 -8272 6695
181 6695 -7318 -2759 1808 -9954 9574 4332 -15294 6022 5373 -2265 7244 -6821 -1117 10278
195 10278 -8010 2819 6836 -11979 3331 5468 -6473 5695 -3291 -4784 10961 -5067 -1431
208 -1431 10535 -7478 -521 6019 -4823 6375 -3027 -11687 10232 -288 -10313 2607 -5813
221 -5813 54 5590 -10493 2303 6027 -7255 7943 3909 -5830 9995 2232 -466 9115 -5715
235 -5715 1277 9235 -8906 227 2554 -9500 2517 -3962 -9099 6024 -7058 -8283 7899 -4274
$$ packed form
142A8373j9881N174J740q401K1528j3648j7685K1368r677o096J4490j5295L010
155e000K245j5087K6026J262l0394J4667J0256k75P080k0840N384K1454j8628
168a850N679Q552k1000J0894M992j0445J1943j4074n915K1847j4768m127J4967
181F695j4013M559M567j1762J9528n242j9626K1316o49p638R509j4065N704J1395
195A0278j8288J0829M017j8815J5310K137j1941J2168q986j493J5745j6028L636
208a431J1966j8013O957O540j0842J1198r402q660K1919j0520j0025J2920q420
221e813N867N536j6083J2796L724j3282J5198m034r739J5825p763k698R581j4830
235e715O992P958j8141R133K327j2054J2017o479n137J5123j3082j225J6182j2173
$$ plain form
249 -4274 -753 4973 -5508 8215 6781 -5649 9905 3495 -3782 10733 -1237 -3560 6114 -6644
263 -6644 120 3491 -11867 348 598 -10161 3007 -2566 -6067 6917 -5014 -1589 10382 -4134
277 -4134 1065 7349 -2770 7074 3029 -6026 8075 -166 -5141 6803 -5442 -4558 5068 -6715
291 -6715 -369 1817 -8853 4727 2074 -7440 5960 -473 -3253 7895 -3916 -396 7768 -6513
305 -6513 1835 5127 -6523 3596 2 -5932 6511 -3232 -4625 7221 -4985 -1120 7084 -5476
319 -5476 2116 4293 -5125 6180 515 -6201 6857 -2101 -4069 5532 -6279 -1443 3900 -8054
333 -8054 1470 2746 -6944 4182 735 -3942 6878 -1761 -986 8565 -3291 1551 6589 -5220
347 -5220 3467 3374 -6017 3866 -2418 -6555 4344 -5282 -4913 3871 -6426 -318 3738 -6601 3406
$$ packed form
249d274L521N726j0481J3723j434j2430J5554o410p277J4515j1970k323R674j2758
263f644O764L371j5358J2215K50j0759J3168n573l501J2984j1931L425J1971j4516
277d134N199O284j0119R844m045r055J4101q241m975J1944j2245Q84R626j1783
291f715O346K186j0670J3580k653r514J3400o433k780J1148j1811L520Q164j4281
305f513Q348L292j1650J0119l594n934J2443r743j393J1846j2206L865Q204j2560
319e476P592K177r418J1305n665o716J3058q958j968R601j1811M836N343j1954
333h054R524J276r690J1126l447m677J0820q639P75R551j1856M842N038j1809
347e220Q687r3r391R883o284m137J0899r626L69Q784j0297O108M056j0339J0007
$$ plain form
362 3406 3401 -4060 7093 1885 -2008 7966 -1424 453 7081 -5324 939 4059 -6895 2186 -45
377 -45 -7657 2230 -3091 -4949 4422 -5404 -2724 5468 -4295 2669 4539 -4623 5368 3715 -3378 6448
393 6448 -53 -2505 6042 -3427 -1121 3981 -6402 503 1726 -7261 2421 68 -5624 4140 -1782
408 -1782 -2366 6092 -3125 729 5260 -4400 3435 4017 -4840 3510 -56 -3875 5436 -2862 -4326 3265
424 3265 -4102 624 3789 -6510 1376 3166 -3538 5547 152 -4167 5920 -566 -965 4760 -4800
439 -4800 -180 3123 -5445 1891 470 -6734 2945 -905 -3839 4571 -2588 -1571 5301 -2848 2405
454 2405 5278 -3505 3314 1981 -2841 5945 -1244 -4718 3701 -3164 -1707 2455 -6658 -894 1623
469 1623 -5055 3081 336 -5354 4527 523 -535 6501 -2704 14 6343 -1484 2483 1921 -4893
$$ packed form
362C406np461J1153n208l893R974r390J877O628j2405O263L120j0954R081k231
377d5p612R887n321j858R371r826K680Q192r763O964J870r162R991j653p093R826
393F448o501k452Q547r469K306N102j0383O905J223q987R682k353n692R764n922
408a782n84Q458r217L854M531r660P835N82q857Q350l566l819R311q298j464P591
424C265p367M726L165j0299P886J790o704R085n395m319J0087o486l99N725r560
439d800M620L303q568P336j421p204R679l850k934Q410p159J017O872q149N253
454B405K873q783O819j333m822Q786p189l474Q419o865J457M162r113N764K517
469A623o678Q136k745n690R881m004j058P036r205K718O329p827L967n62o814
$$ plain form
484 -4893 3811 171 -5501 2617 -3043 -4015 2206 -5352 -1020 3791 -5413 429 2138 -2465 5545
499 5545 872 -3635 5587 248 -48 5847 -3199 -655 2594 -4039 2991 1086 -7305 783 -578
514 -578 -2299 3679 -5155 -3851 5544 -1600 647 2445 -4336 3978 3400 -3177 4035 -591 -3184 4600
530 4600 -1970 -1555 2864 -5030 162 3245 -5163 1251 752 -3216 3900 -1564 -2544 6365 -1284 -1120
546 -1120 3367 -2701 2923 2928 -5525 1767 1144 -3445 3155 -2497 -3622 3081 -3770 -631 4105 -4413
562 -4413 488 2585 -2365 4919 1183 -3905 4835 769 -690 3751 -3709 -415 3948 -4989 37
577 37 1135 -4986 1203 -1769 -3259 4338 -2059 -3186 3354 -911 2307 4010 -3863 2304 3448 -2317
593 -2317 4021 164 -3851 3140 -1550 -906 2729 -5733 -1614 2755 -3909 903 -64 -4762 3679 1119
$$ packed form
484d893Q704l640n672Q118n660r72O221p558M332M811r204N842J709m603Q010
499E545m673m507R222n339k96N895r046K544L249o633P030j905q391Q088j361
514e78j721N978q834J304R395p144K247J798o781Q314n78o577P212m626k593P784
530D600o570M15M419p894N192L083q408O414m99l968P116n464r80Q909p649J64
546a120M487o068N624Nq453P292o23m589O600n652j125O703o851L139M736q518
562d413M901K097m950P284l736n088Q740m066j459M441p460L294M363q937N026
577C7J098o121O189k972j490P597o397j127O540m265L218J703p873O167J144n765
593b317O338l857m015O991m690O44L635q462M119M369o664M812r67m698Q441k560
$$ plain form
609 1119 -1678 4306 -1428 -19 5850 -1781 1055 3031 -3642 2537 1226 -4086 2404 -1849 -3587
624 -3587 3010 -3106 -2361 2475 -3352 905 1912 -4142 3759 2515 -2735 3400 368 -336 4681 -2474
640 -2474 -878 3436 -3028 683 1139 -4472 1523 -111 -3762 2943 -1524 -2452 3491 -1737 475 3542
656 3542 -2884 1890 2545 -2932 3556 320 -3583 3135 -1563 -2445 2542 -3331 -692 1956 -4302 1460
672 1460 1638 -3582 2738 506 -1766 4594 -988 -817 3974 -2088 999 3170 -3636 1108 649 -3509
688 -3509 2337 -1723 -3992 2744 -1994 -1868 2308 -2998 307 2624 -2608 2862 1965 -2125 3690 477
704 477 -1127 3777 -2276 -908 2758 -3458 -92 925 -4588 754 -85 -3296 2235 -1392 -1812 3434
720 3434 -1661 -351 3851 -2060 1880 2447 -2247 3311 603 -2858 3255 -912 -2292 2281 -2917
$$ packed form
609A119k797N984n734J409N869p631K836J976o673O179j311n312O490m253j738
624c587O597o116P45M836n827M257J007o054P901j244n250O135l032p04N017p155
640b474J596M314o464L711M56n611N995j634l651O705m467r28N943n228K212L067
656C542o426M774O55n477O488l236l903O718m698q82M987n873K639K648o258N762
672A460J78n220O320k232k272O360n582J71M791o062L087K171o806M744m59m158
688c509N846m060k269O736m738J26M176n306L305K317n232N470q97m090N815l213
704D77j604M904o053J368L666o216L366J017n513N342q39l211N531l627m20N246
720C434n095J310M202n911L940N67m694N558k708l461O113m167j380M573n198
$$ plain form
735 -2917 -992 1929 -4061 338 854 -3187 2443 246 -2346 3406 -492 -323 3908 -1764 268 3514
751 3514 -2622 1105 1233 -3719 2071 -823 -3369 2182 -2041 -2362 2635 -2637 137 2229 -2715 2036
767 2036 1642 -2231 3199 364 -1642 3620 -1451 -974 2426 -3090 -136 1728 -4076 736 178 -3282
783 -3282 2150 -793 -2002 3233 -1357 -99 3530 -1996 1155 2754 -2343 2366 828 -2970 2700
798 2700 -1223 -2391 2376 -3052 -1344 1905 -3409 593 1189 -3319 2310 1147 -2157 3281 -188
813 -188 -694 3851 -1606 538 3072 -2987 745 1008 -3554 1388 -754 -3569 2041 -2194 -1674 2380
829 2380 -2774 -228 2664 -2006 1701 2167 -2379 3395 915 -1662 3456 -1352 -1476 2656 -3098 -491
845 -491 1358 -3716 607 289 -3234 1989 -489 -2207 2986 -1139 -388 3511 -1743 1420 2660 -2317
$$ packed form
735b917J925K921n990M399N16m041N630k197k592N752l898J69M231n672K032L246
751C514o136L727J28m952N790k894k546N551m223l21M997n272K774K092m944M751
767B036l94l873N430k835k006N262n071M77L400n516K954J864n804M812n58l460
783c282N432k943j209N235m590J258L629n526L151J599n097M709j538l798N670
798B700l923j168M767n428J708L249n314M002N96m508N629j163l304N438l469
813a88n06M545n457K144K534o059L732K63m562M942k142k815N610m235N20M054
829B380n154K546K892m670L707M66m546N774k480k577N118m808j24M132n754K607
845d91J849n074M323l18l523N223k478j718N193m125P51L899n254L163J240m977
$$ plain form
861 -2317 2235 1210 -2737 2476 -668 -2273 2470 -2228 -1521 1832 -2924 352 1517 -3131 1558
876 1558 708 -2182 3213 18 -1112 3495 -911 165 2379 -2736 483 1310 -3160 1367 -44 -3142
892 -3142 2069 -1486 -1628 2456 -1957 -279 2407 -2083 1580 1802 -2064 2799 878 -1416 3223 -1145
908 -1145 -1678 2792 -2436 -539 1557 -3569 599 299 -2915 1740 -536 -2329 2900 -709 -490 3331
924 3331 -1880 853 2983 -2035 1584 1149 -2403 2223 -514 -2451 2130 -2338 -1795 1663 -2679 207
940 207 1493 -3192 1483 1077 -1815 2846 -3 -1343 3512 -1016 129 2803 -2184 417 1423 -2471
956 -2471 1286 -263 -3408 1757 -734 -1667 1954 -2340 -401 2706 -2117 1065 2137 -1684 2459
971 2459 929 -1417 2714 -699 -1217 2416 -2121 -582 1406 -2971 560 764 -3010 1315 -330 -2116
$$ packed form
861b317M552j025l947N213l144j605M743m698P07L353m756L276J165m648M689
876A558q50k890N395l195j130M607m406J076K214n115L219Q27m470M527j411l098
892c142N211l555j42M084m413J678K686m490L663K22l866M863j921k294M639m368
908a145n33M470n228J897K096n126M168l00l214M655k276j793N229l609K19L821
924C331n211K733K130n018L619m35l552M626k737j937M581m468N43L458m342K886
940B07J286m685M675m06k892M661k849j340M855m528J145K674m987K601J006l894
956b471L757j549l145N165k491r33L621m294J939L107m823L182J072l821M143
971B459j530k346M131l413n18L633m537J539J988m377L531K04l774M325j645j786
$$ plain form
987 -2116 2472 -912 -675 3242 -1407 413 2882 -1529 1681 952 -2843 1949 -262 -1996 1749 -1905
1003 -1905 -1329 1806 -2708 -126 1458 -2836 1065 1313 -1665 2433 32 -1213 3435 -284 -655 2430
1019 2430 -2062 361 1325 -2987 1067 210 -3010 1619 -940 -1623 2267 -1751 -708 2342 -1737 989
1035 989 1835 -2116 2234 828 -1649 2806 -780 -1600 2070 -1688 -647 1309 -3471 40 965 -2814
1051 -2814 1256 -45 -2122 2698 -769 -944 3307 -1339 117 2293 -1643 1562 1245 -2754 1691
1066 1691 -130 -2440 1655 -1723 -1775 1322 -2612 -418 1770 -2672 1212 1143 -1848 2607 491 -1401
1082 -1401 2767 -534 -41 2427 -1912 213 1478 -2512 979 293 -2724 1785 -758 -1882 1982
1097 1982 -1261 -813 2283 -1660 842 1831 -2023 2079 1326 -1707 2349 -122 -1425 2101 -1827 -843
$$ packed form
987b116M588l384K37L917m649J820K469m411L210p29l795M792k211j734L745l654
1003a905N76L135m514K582J584m294L901K48k978M098k401j245M648l719l71L085
1019B430m492K423R64m312M054q57l220M629k559o83L890m018J043L050m079K726
1035I89Q46l951M350j406k477M455l586q20L670l758J041J956m780L511R25l779
1051b814M070j301k077M820l467j75M251m646J456K176l936L205l17l999M445
1066A691j821k310M095l378n2L097l934K194K188m442L884o9k991M455k116j892
1082a401M168l301M93K468m339K125J265l990L491o86l017M509k543j124L864
1097A982l243M48L096l943K502R89l854M102p53l033M056k471j303L526l928R84
$$ plain form
1113 -843 1829 -2704 -78 546 -2538 1146 -176 -2209 2143 -409 -950 2713 -1135 133 2623 -1284
1129 -1284 1084 1213 -2121 1819 54 -2288 1589 -1326 -1735 1839 -2182 -552 1612 -2529 1040
1144 1040 1424 -2182 2198 347 -1092 2865 -556 -230 2522 -1644 -38 1587 -2160 719 215 -2405
1160 -2405 968 -835 -2297 1885 -1113 -707 2198 -1637 835 2027 -1364 1900 1291 -1379 2053
1175 2053 -171 -1423 2038 -1700 -687 1689 -2580 -321 977 -2397 1071 -111 -1901 1787 -515
1190 -515 -746 2604 -643 5 2436 -1449 698 1513 -1739 1237 -161 -2064 1628 -1065 -1816 1656
1206 1656 -1887 -628 1365 -2243 569 1370 -1600 1878 915 -1257 2484 -283 -699 2338 -1684 -51
1222 -51 1735 -2180 403 572 -2265 1009 -656 -2170 1634 -1108 -770 2261 -1582 515 1723 -1573
$$ packed form
1113h43K672m533K626O24l084L684j322k033M352k552n41L663l848J268K490l907
1129a284K368J29l334L940j765k342L877k915m09L574m021J630K164m141L569
1144A040L84l606M380j851j439L957l421L26K752m166J606J625l747K879n04k620
1160b405L373j803j462M182k998M06K905l835K472J192l391L264o09k670L432
1175B053k224j252L461l738J013K376m269K259J298l374L468j182j790L688k302
1190e15k31L350l247O48K431l885K147Q15l252K976j398j903L692k693p51L472
1206A656l543J259J993l608K812Q01k970L478r63k172L741k767m16L037m022J633
1222e1J786l915K583J69k837L274j665j514L804k742L38L031l843K097J208l296
$$ plain form
1238 -1573 1568 1247 -1693 1982 24 -1398 2012 -1341 -1024 1398 -2065 -186 748 -2295 622 477
1254 477 -1845 1572 -201 -707 2362 -798 249 2311 -1402 576 1601 -1812 1093 389 -1968 1148
1270 1148 -1023 -1731 1232 -1517 -909 1452 -1470 666 992 -1714 1572 681 -1195 2094 -286 -519
1286 -519 2060 -1228 12 1444 -2356 623 698 -2398 954 -227 -1895 1283 -980 -965 1842 -1133
1302 -1133 222 1725 -1420 1230 1290 -1190 1673 -15 -1428 1937 -700 -811 1237 -1710 -642 675
1318 675 -2281 595 562 -1817 1530 140 -940 2443 -407 -28 2275 -1133 488 1645 -1857 782
1334 782 915 -1729 1763 -652 -1754 1497 -1378 -699 1394 -1857 491 1185 -1376 1488 708 -1167
1350 -1167 1925 24 -727 2178 -851 -186 1439 -1883 130 585 -1973 589 -399 -1725 1072 -432
$$ packed form
1238a573L141l21k940L675j958j422L410l353L17K422l463J879R34l043K917j45
1254D77k322L417j773n06L069l160J047K062l713J978J025l413K905p04k357L116
1270A148k171p08K963k749O08K361k922K136L26k706L286q91j876L289k380k33
1286e19K579l288J240J432l800K979P5l096L352j181j668L178k263J5K807k975
1302a133J355J503l145K650O0k480K863j688j413L365k637j11K048k947J068J317
1318F75k956K876l3k379L347j390j080L383k850L79K303l408J621J157l502K639
1334G82J33k644L492k415j102L251k875O79K093l251K348O94k561K864p80j875
1350a167L092j901p51K905l029O65J625l322K013M55k558K562r88j326K797j504
$$ plain form
1366 -432 -846 1901 -860 -47 1768 -1087 896 1391 -1221 1704 607 -1458 1539 -861 -1185 1192
1382 1192 -1436 -558 952 -2103 351 488 -1842 1400 -2 -1037 1960 -326 -160 2040 -1001 327
1398 327 1625 -1391 853 747 -1827 939 -667 -1943 1505 -1345 -883 1270 -1240 413 1428 -1399
1414 -1399 867 962 -1225 1732 264 -656 1753 -857 -334 1272 -1736 -73 489 -1949 509 100
1430 100 -1726 1183 -364 -1001 1721 -672 -188 1529 -848 751 1265 -1453 1239 327 -1181 1153
1446 1153 -757 -1057 1275 -1308 -587 835 -1843 136 558 -1723 1224 162 -917 1714 -126 -303
1462 -303 1899 -862 204 1391 -1267 330 276 -1881 868 -682 -1592 1017 -836 -948 1287 -1629
1478 -1629 503 1339 -1164 962 986 -1190 1726 72 -744 1833 -711 -490 1422 -1290 26 631
$$ packed form
1366d32m14K747k761Q13J815k855J983M95k612K925j097k065K997k400l24K377
1382A192k628Q78J510l055K454J37k330L242j402j035K997k286J66K200l041J328
1398C27J298l016K244j06k574K766j606j276L448k850M62K153k510J653J015k827
1414a399K266R5k187K957j468r20K409k610N23J606l008J663N62k438K458m09
1430A00j826K909j547o37K722k393M84J717k377J599N14k718K692r12j508K334
1446A153j910l00K332k583P21J422k678J979M22k281K947j062j079K631j840j77
1462c03K202k761J066J187k658J597n4k157K749j550r10K609j853j12K235k916
1478a629K132Q36k503K126K4k176K916j654q16K577k544K21J912k712J316O05
$$ plain form
1494 631 -1923 718 -48 -1609 737 -402 -899 1512 -585 -198 1583 -845 902 1085 -1277 968
1510 968 564 -1399 1276 -567 -1072 933 -1392 -600 621 -1291 49 581 -1261 902 368 -775
1526 -775 1435 12 -457 1860 -552 44 1186 -1170 301 517 -1298 726 -358 -1461 886 -1041
1542 -1041 -964 1162 -1413 9 1265 -1185 825 921 -1032 1514 238 -434 1426 -590 -512 1193 -1267
1559 -1267 -32 626 -1421 -74 17 -1520 799 -283 -901 1608 -566 -217 1616 -752 571 1153
1575 1153 -851 1019 350 -956 892 -111 -1171 1139 -1262 -696 795 -1490 298 770 -1244 1037
1591 1037 854 -989 1404 -202 -526 1899 -349 -18 1250 -1230 476 530 -1291 556 -222 -1291
1607 -1291 801 -587 -1049 1071 -911 -163 1539 -785 760 990 -1105 1220 557 -730 1304 -127
$$ packed form
1494F31k554K641p66j561K346j139m97K411k097L87J781k428J747J83k362K245
1510I68m04j963K675j843n05K005k325P92J221j912J340N32j842K163n34j143
1526g75K210j423m69K317k412N96J142k356J471K16j815K024j084j103K347j927
1542a041P7K126k575J422J256k450K010R6j953K546j276o72J860k016P8J705k460
1559a267J235O58k047J347R1j537K319j082o18K509k174L49J833k368J323N82
1575A153k004J870o69j306J848j003j060K310k401N66J491k285J788M72k014K281
1591A037j83j843K393j606l24K425k248L31J268k480J706N4j821J847p78j069
1607a291K092j388m62K120j982P48J702k324J545K30k095K325o63j287K034j431
$$ plain form
1623 -127 -577 1142 -1226 -489 586 -1286 129 229 -1399 1009 -134 -964 1472 -517 -504 1430 -884
1640 -884 307 1409 -1080 648 774 -1090 1216 -370 -813 898 -1240 -866 507 -1261 -240 567
1656 567 -1078 743 466 -850 1725 -1 -391 1685 -784 -107 1094 -1166 109 779 -1473 455
1672 455 73 -1022 638 -555 -903 1197 -852 -291 1093 -1213 710 729 -850 1223 417 -614 1222
1689 1222 -341 -510 1065 -825 -295 629 -1300 295 228 -1329 722 38 -952 1095 -344 -339 1252
1706 1252 -358 230 1122 -848 480 635 -928 948 -153 -1168 1015 -863 -672 663 -1165 -160
1722 -160 552 -1344 387 395 -1072 1156 35 -633 1326 -42 47 1279 -632 317 516 -1339 320
1739 320 -39 -1248 735 -468 -1001 873 -694 -221 924 -870 616 887 -857 1067 362 -933
$$ packed form
1623a27m50J719k368P37J075j872J415J00j628K408j143q30K436j989J3J934k314
1640h84J191J102k489J728J26j864K306j586m43J711k138L74J373j768J021Q07
1656E67j645J821k77j316K575j726l90K076k469O77J201k260J275O70k252J928
1672D55l82j095J660j193l48K100k049N61J384k306J923J9j579K073q06j031J836
1689A222j563j69J575j890N30R24j929J595o7j557K051o84r90K047j439NJ591
1706A252j610N88Q92j970J328J55j563J876j101j015K183j878J91J335j828J005
1722a60P12j896J731Qj467K228j121o68J959j368Q9J232j911R49J99j855J659
1739C20l59j209J983j203n33J874j567M73J145j794J486K71j744J924p05j295
$$ plain form
1755 -933 1216 -334 -548 1057 -798 -559 377 -1361 -67 547 -1256 903 32 -1108 1023 -301
1771 -301 -594 1310 -319 429 1320 -1018 514 665 -756 743 -93 -1269 834 -692 -968 752 -818
1788 -818 -414 474 -1079 814 521 -911 1122 1 -573 1638 -341 -58 1107 -568 271 783 -1209
1805 -1209 211 10 -1395 381 -446 -1095 948 -606 -265 1168 -710 359 1174 -888 1011 584
1821 584 -662 1068 30 -811 994 -749 -309 392 -1149 99 442 -1101 584 -18 -1258 1117
1837 1117 -333 -249 1074 -475 20 1228 -737 448 633 -1150 760 16 -1022 967 -567 -759
1853 -759 874 -1279 -158 632 -1247 405 282 -888 982 203 -784 1276 -190 -326 1202 -652
1869 -652 382 810 -1205 467 214 -1163 704 -434 -717 757 -567 -353 730 -634 203 901 -785
$$ packed form
1755i33K149j550k14J605j855K39R36j738J294O14j803K159q71j140K131j324
1771c01k93J904j629P48Q91k338J532J51j421J499q36j176K103j526k76J720j570
1788h18M04Q88j553J893k93j432K033j121n74K211j979K83J165j675Q39N12j992
1805a209J420k01j405J776q27o49K043j554L41J433j878J069Q15k062J899m27
1821E84j246J730j038q41J805j743M40P01j541J248L43j543J685o02j240K375
1837A117j450Q4J323j549M95J208j965J185J85j783J910p44j038J989j534j92
1853g59J633k153J121P90j879J652j23j170J870p79r87K060j466j36J528j854
1869f52J034M28k015J672k53j377J867j138k83J474j324K14J083j364Q37O98j686
$$ plain form
1886 -785 831 552 -730 1103 243 -442 977 -823 -317 636 -1139 75 387 -1307 419 -113 -1049
1903 -1049 961 -182 -502 1346 -120 110 1245 -756 428 841 -1099 620 153 -1352 385 -541
1919 -541 -903 726 -796 -502 601 -1092 -46 521 -950 1150 162 -720 1174 -178 -91 1141 -438
1936 -438 -113 581 -972 98 397 -1065 415 -400 -824 890 -424 -434 962 -849 258 867 -481
1953 -481 783 405 -1083 979 -40 -722 869 -553 -378 554 -1268 -365 340 -1427 451 -88 -919
1970 -919 1084 -157 -501 1264 -256 93 946 -662 688 635 -1027 577 187 -1044 582 -217 -872
1987 -872 877 -814 -539 721 -924 136 290 -811 996 153 -394 1098 -133 -482 988 -849
2003 -849 -39 789 -1107 183 174 -1380 572 91 -1117 730 -802 -342 845 -496 197 1187 -711
$$ packed form
1886g85J616k79j282J833q60o85J419j800N06R53j775J214L12j694J726n32r36
1903a049K010j143l20J848j466K30J135k001J184M13j940J719m67j505J737r26
1919e41l62J629j522K94J103j693J046N67j471K100r88q82J894j352Q7J232j579
1936d38L25O94j553J070K99j462J480q15m24J714j314j0J396j811J107O09j348
1953d81J264l78j488K062j019o82J591j422J75R32j822R03P05j767J878n39q31
1970i19K003j241l44J765j520L49Q53j608J350n3j662J604l90j231J626p99o55
1987h72J749j691K75J260j645J060J54j101J807q43n47J492j231l49J470j837
2003h49Q10Q28j896J290rj554J952m81j208J847j532M60J187j341O93R90j898
$$ plain form
2020 -711 652 689 -698 766 -121 -536 940 -487 -483 643 -819 -145 353 -1023 289 93 -748 724
2038 724 -202 -435 1057 -197 73 1245 -586 316 444 -693 668 340 -876 800 -279 -993 847
2055 847 -459 -631 930 -781 260 540 -579 1032 464 -548 947 -112 -236 945 -422 -246
2071 -246 977 -890 199 162 -1242 448 29 -1099 582 -563 -565 958 -801 -49 832 -744 624
2088 624 617 -565 680 196 -588 1038 -398 -669 713 -889 -185 735 -1128 2 188 -1086 663
2105 663 -125 -647 1049 -399 -162 1030 -531 476 545 -799 771 326 -798 572 -389 -786 722
2122 722 -758 -330 382 -958 215 483 -715 881 250 -811 1181 -149 -344 1125 -548 -104 400
2139 400 -950 320 228 -1103 257 -5 -1090 602 -686 -541 846 -599 -147 894 -574 663
$$ packed form
2020g11J363L7j387J464q87m15J476j427MJ126j462O74M98j376J312j96q41J472
2038G24r26k33J492j254K70J172j831R02J28j137J361l28j216J676j079p14J840
2055H47j306j72J561j711J041K80j119J611n68j012J495j059j24J181j367J76
2071b46J223j867J089l7j404J690m19j128J681j145kJ523j759P52Q81j576J368
2088F24pj182J245m84p84J626j436k71J382j602P04R20j863J130J86j274J749
2105F63p88n22J696j448K37J192j561J007O9j344J570m45j124J370r61l97J508
2122G22j480M28P12j340J173K68j198J596o31j061J992j330j95J469j673M44N04
2139D00j350J270r2j331J360k62j085J692j288J45J387j445M52J041j468J237
$$ plain form
2155 663 584 -568 875 180 -524 996 -301 -470 663 -795 -150 262 -1012 407 269 -868 674
2172 674 68 -630 1011 -35 -249 1055 -793 329 856 -678 402 222 -804 589 -363 -884 510
2189 510 -1056 -436 429 -731 331 393 -620 565 483 -456 1192 84 -97 908 -386 -272 618 -902
2207 -902 -1 413 -1048 390 -10 -1034 622 -310 -330 1077 -563 37 774 -571 677 814 -790
2224 -790 799 440 -508 926 -172 -464 546 -908 -399 163 -840 212 235 -876 604 -105 -675
2241 -675 1006 -90 -360 903 -538 216 596 -334 490 521 -971 320 -127 -621 483 -381 -659 578
2259 578 -669 135 720 -775 318 356 -596 795 202 -323 920 -467 -497 699 -625 148 217 -1174
2277 -1174 302 -231 -1211 360 -109 -437 904 -632 -284 787 -462 315 912 -404 497 504 -419 923
$$ packed form
2155F63p9j152J443o95p04J520j297j69J133j458O45M12j274J419j38j137J542
2172F74o06o98J641j046k14J304j848J122N27j534J080j80j026J393r52n21J394
2189E10j566O20Q65j160J062O2j013J185q2r39J648j108j81J005j294J14Q90j520
2207i02R01M14j461J438m00j024J656r32k0J407j640O00P37j345J248J37j604
2224g90J589l59r48J434j098k92J010j454N09N62j003J052K3j111J480p09n70
2241f75J681j096k70J263j441P54L80r30Q24L1j492J291m47m94J104q64k78J237
2259E78j247Q04N85j495J093L8r52J391n93n25J243j387l0J196j324P73O9j391
2277a174J476n33r80J571m69l28J341j536L48J071j249P77N97j316R01Pr23J342
$$ plain form
2295 923 -238 -664 620 -690 -298 320 -950 111 374 -799 434 -247 -477 918 -183 -115 825
2312 825 -530 30 701 -576 435 210 -881 529 -363 -838 689 -390 -617 763 -802 50 532
2329 532 -694 519 590 -521 837 151 -79 992 -375 -158 731 -761 175 423 -945 468 -183
2346 -183 -977 506 -192 -589 920 -343 43 681 -460 529 663 -580 342 98 -453 534 -44 -349
2364 -349 486 -586 -321 289 -908 108 435 -571 707 556 -671 899 -47 56 766 -457 18
2381 18 458 -643 170 433 -697 563 92 -1058 519 -559 -538 364 -599 110 764 -774 304 251
2399 251 -474 681 138 -318 832 -257 -335 833 -599 174 500 -836 190 245 -741 596 -300 -527
2417 -527 593 -382 -128 667 -190 373 692 -377 765 429 -575 632 0 -743 610 -485 -484 540
$$ packed form
2295I23j161m26J284j310L92O18j270J061K63j173J233o81k30J395j101O8R40
2312H25j355N60O71j277J011k25j091J410q92m75J527j079k27J380j565Q52M82
2329E32j226J213P1j111J358o86k30J071j367K17Q89j492R36K48j368J413o51
2346a83p94J483o98l97J509j263L86O38j141R89J34j243R22k44n51R87n78l05
2364c49Q35j072K65O10j197J016L27j006J278j51j227J570r46J03P10j223M75
2381A8M40j101Q13K63j130J260m71j150J577j078K1R02r63P09O54j538J078n3
2399B51p25J155n43m56J150j089p8J168j432P73L26j336J026N5r86J337q96k27
2417e27J120r75K54P95q57N63L19j069J142l36j004J207o32p43J353j095JJ024
$$ plain form
2435 540 -806 34 298 -751 512 92 -560 702 -209 -464 821 -422 -176 768 -634 63 538 -595
2453 -595 683 43 -722 662 -374 -505 384 -529 87 688 -557 401 538 -587 679 27 -187 940
2471 940 118 -365 752 -379 -5 341 -992 293 238 -881 62 -256 -438 555 -315 -311 919 -292 423
2490 423 676 -518 576 106 -560 533 -231 -523 564 -642 -206 611 -805 61 -35 -687 255 -11
2508 -11 -782 630 -203 -357 1000 -136 -336 495 -357 165 292 -710 363 277 -695 507 -414 -279 163
2527 163 -776 -103 454 -250 148 295 -489 615 232 -205 698 -179 -156 445 -603 -459 465 -847 402
2546 402 -146 -785 455 -165 -566 550 -270 -241 649 -324 -16 409 -232 360 531 -700 384 -164 -563
2565 -563 534 -449 -103 552 -502 69 305 -832 595 75 -562 460 274 -254 674 -188 113 795
$$ packed form
2435E40j346Q40K64j049J263m20o52J262r11k55J285j243K46R44j402O97M75j133
2453e95J278o40p65J384j036j31Q89r13O16O01j245R58J37j125J266o52k14J127
2471I40q22m83J117j131L74L46j333J285n5j119R43l18j82R93q70MJ230j211P15
2490D23K53j194J094m70o66J093p64k92J087j206M36Q17j416Q66r6o52R42k66
2508a1p71J412q33j54J357j136k00Q31q52N22J27j002J073q6r72J202r21J35M42
2527A63r39O73N57p04L98J47p84J104l83m37R03q77K3O01j048J44R24j312J249
2546D02n48o39J240o20m01J116q20K9Q90r73L08M25o41N92J71j231J084n48l99
2565e63J097r83L46O55j054N71K36j137J427n20o37J022j86n28R28q62L01O82
$$ plain form
2583 795 -545 448 365 -691 190 35 -562 320 -291 -270 536 -610 -453 272 -809 -43 499 -281 586
2602 586 438 -310 726 -126 -348 348 -296 -153 356 -720 138 291 -855 80 -19 -372 387 -406 -330 635
2622 635 37 139 664 -524 231 331 -764 400 -9 -483 762 -107 -344 239 -667 86 285 -236 189
2641 189 -21 -509 453 304 243 1032 -217 -270 668 -406 73 544 -470 263 -172 -798 298 -249 -649
2660 -649 431 -737 -401 417 -724 146 346 -423 658 315 -495 699 -179 -225 717 -433 148 321
2678 321 -468 14 126 -803 8 -101 -579 399 -234 -303 442 -422 59 505 -531 282 153 -555 373 -294
2698 -294 -532 707 -271 -241 259 -543 -189 599 -480 193 327 -312 668 101 -203 744 -191 19 651 -593
2718 -593 -58 621 -720 345 177 -562 118 -215 -354 396 -388 -388 550 -538 165 552 -581 407 -76
$$ packed form
2583G95j340R93q3j056Q81j55n97Q82o11K1Q06j146J57P25j081P66N42p80Q67
2602E86j48p48J036q52k22O96o44J43N09j076Q58J53j146R35r9l53P59p93P6R65
2622F35n98J02N25j188P55J00j095J164m09m74J245q69k37N83r06P53J99n21M25
2641A89k10m88R62j49o1P89j249n3R38j074M79M71j014P33m35o26J096n47m00
2660f49J080j168L36Q18j141Q70K00p69J081l43q10J194q78m6R42j150N81J73
2678C21p89M82J12r29Q11j09m78R78o33o9P45q64M81M46j036Q13j29p08R28o67
2698b94k38J239r78L0N00q02L54P88j079O73J34o39R80n67l04R47r35K10O32j244
2718e93N35O79j341J065j68p39O80l33j39P50p84%R38j088P03L87j133R88m83
$$ plain form
2737 -76 -375 759 230 -132 628 -513 -105 563 -801 107 78 -864 225 219 -204 439 -120 -123 347 -145 -162
2758 -162 604 -350 129 510 -309 312 -51 -592 511 -382 -422 262 -620 54 428 -597 39 210 -572 406
2778 406 -55 -54 526 -88 116 307 -168 23 369 -360 136 223 -688 346 81 -635 720 -447 -298 164
2798 164 -351 212 347 -226 375 543 -123 598 267 -519 304 -334 -279 558 -283 -157 158 -591 111 250
2818 250 -423 523 -163 -460 348 -401 -3 771 -91 386 421 -420 502 59 -520 656 -379 -436 440 -384
2838 -384 -37 459 -354 100 460 -589 272 113 -49 653 124 -78 512 -400 123 308 -432 161 2 -667
2858 -667 220 -204 -565 201 -488 -297 379 -457 305 629 -227 419 359 -337 491 -129 -398 714 -576 -205
2878 -205 125 -624 -214 411 -532 47 30 -450 433 12 -138 566 151 -7 732 -415 291 530 -575 393
$$ packed form
2737g6k99J134n29l62P60j141M08O68j364R08k9r42J089om23O43n59lM70m92j7
2758a62P66r54M79L81q19O21l63n41J103q93m0O84q82O74L74j025O36J71p82R78
2778D06m61JN80o14K04J91m75J91L46p29M96Q7r11J034k65p16J355j167J49M62
2798A64n15N63J35n73O01J68o66P21l31p86Q23o38N5Q37q41J26L15p49P02J39
2818B50o73R46o86k97Q08p49L98P74q62M77L5q41R22m43n79J176j035n7Q76q24
2838c84L47M96q13M54L60j049Q61j59j62P02n29k02N90r12N23J85p40N93j59o69
2858f67Q87m24l61P66o89J91O76q36P62L24q56O46o0o96Q28o20k69J112j290L71
2878b05L30p49M10O25r43N79j7m80Q83m21j50P04m15j58P39j147P06K39j105R68
$$ plain form
2898 393 48 -819 186 20 -323 361 -311 20 294 -391 -19 215 -431 264 95 -293 760 -201 -246 572
2918 572 -250 105 316 -485 186 224 -799 222 -86 -239 106 -227 -246 673 -350 -28 116 -540 356 224
2938 224 -164 419 133 -427 646 -340 -300 301 -469 -175 488 -780 210 -121 -788 249 -268 -248 654 -347
2958 -347 -81 433 -390 272 536 -363 419 162 -296 410 36 -376 330 -280 -399 339 -548 -43 266 -422
2978 -422 639 -10 -219 434 -99 -188 904 -167 -5 306 -636 -20 73 -709 14 -104 -546 167 -59 -262
2998 -262 330 -527 252 397 -530 76 408 -166 577 136 -425 576 -378 -143 609 -516 -114 132 -478
3017 -478 25 139 -464 340 32 -170 756 -113 -24 614 -344 253 632 -279 260 63 -632 490 -131 -725
3037 -725 86 -136 -350 306 -334 -114 231 -604 407 241 -387 529 48 -217 723 -255 102 597 -317 286
$$ packed form
2898C93l45q67J005j66l43O84o72L31K74o85L72K34o46O95j69l88J053r61m5Q18
2918E72q22L55K11q01O71L8j023J021l08j53L45l33j9R19j023L22J44o56Q96j32
2938B24l88N83k86n60J073r86M0O01p70K94O63j268R90l31o67J037n17K0R02j001
2958c47K66N14q23O62K64q99P82k57m58P06l74m12P06o10j19P38q87N05L09o88
2978d22J061o49k09O53n33q9J092j071J62L11r42O16R3p82P23j18m42P13k26k03
2998b62N92q57P79J45r27O06L32n74P43m41n61J001r54K35P52j125M02K46o10
3017d78N03J14o03Q04l08k02R26q69Q9O38r58N97L79r11N39j97o95J122o21n94
3037g25Q11k22k14O56o40K20L45q35J011j66o28R16m81k65R40r78L57M95r14O03
$$ plain form
3057 286 60 -454 242 -295 -547 327 -194 -181 446 -286 241 374 -404 343 270 -461 744 55 -204 326
3077 326 -324 -230 432 -694 -179 90 -381 136 166 -569 210 -151 -386 974 -342 -230 443 -231 236 590
3097 590 -270 464 133 -417 310 -182 -150 571 -504 -298 348 -364 -156 199 -527 370 238 -231 521 11
3117 11 -104 308 -333 -112 508 -274 227 243 -299 27 -22 -386 34 -280 -209 580 -364 140 612 -175 508
3138 508 352 -427 338 164 -159 372 95 -432 242 -329 -205 510 -541 274 -46 -556 247 -320 -424 560
3158 560 40 149 583 -325 250 779 -58 292 560 -318 260 -197 -369 521 -135 -289 410 -424 6 53
3178 53 -767 244 166 -307 613 265 -259 475 -167 123 273 -167 -68 315 -541 62 285 -729 309 -378
3198 -378 -153 512 -422 -102 329 -467 187 405 -264 564 144 -316 505 -187 -279 162 -237 -241 263 -617 31
$$ packed form
3057B86k26n14O96n37k52Q74n21J3O27p32N27J33p78P47p3p31J205o89k59N30
3077C26o50R4O62j126N15K69m71N17L0p35P79l61k35J360j316J12O73o74M67L54
3097E90q60P34l31n50P27m92L2P21j075K06O46p12K08L55p26Q97j32m69P52n10
3117A1j15M12o41K21O20p82N01J6n42L26m9l64M20l14P1P89r44N04M72p87O83
3138E08j56p79P65j74l23N31k77n27O74n71J24P15j051Q15l20n10Q03n67j04R84
3158E60n20J09M34r08N75N29q37L50K68q78N78m57j72Q90o56j54O99q34M30M7
3178E3q20J011p8m73R20l48n24P34o42K90J50m40R9L83q56O03K23j014J038o87
3198c78K25O65r34L20M31p96O54K18o69Q28m20m60Q21o92r2M41l99mN04q80O48
$$ plain form
3219 31 408 -570 368 -13 -345 580 -38 -117 443 -237 -262 501 -200 207 159 -359 171 -260 -337 537 -344 -250
3241 -250 146 -404 -275 458 -490 310 73 -244 390 235 -104 520 -474 62 599 -399 -17 355 -347 217
3261 217 -147 -542 101 -145 -346 414 -83 -214 516 -496 274 484 -271 502 299 -522 408 0 -362 220
3281 220 -638 -194 321 -577 4 110 -262 262 271 -532 423 -18 -174 638 -385 232 400 -327 -36 282
3301 282 -310 309 72 -502 249 -254 -44 235 -390 -113 296 -620 191 86 -487 672 64 -350 346 -477
3321 -477 -148 473 -526 -39 373 -408 106 152 -603 438 -51 -414 336 -316 -250 542 -521 303 342 -323
3341 -323 214 236 -249 622 -147 -66 365 -189 -285 488 -491 -106 37 -404 397 122 -453 -30 -38 -27 586 -111
3363 -111 -67 313 -426 443 247 -202 405 247 -385 194 -344 -385 191 -295 -1 71 -233 332 40 -157 479
$$ packed form
3219C1L77r78R38l81l32R25o18p9N60o80k5P63p01M07m8n18N30m31p7Q74q81R4
3241b50L96n50J29P33r48Q00k37l17O34j55l39O24r94N36N37r98L82L72p02N64
3261B17l64l95O43k46k01P60m97j31P30j012P70K10p55P73k03q21R30m08l62N82
3281B20q58M44N15q98N81J06l72N24Rq03R55m41j56Q12j023O17J68p27K91L18
3301B82n92O19k37n74P51n03K10K79o25K77M09r16Q11j05n73J159o08m14O96q23
3321d77L29O21r99M87M12p81N14M6p55J041m89l63P50o52O6P92j063Q24L9o65
3341c23N37K2m85Q71p69Q1M31n54r6P73r79L85J43m41Q01k75n75M23qJ1O13o97
3363a11M4L80p39Q69j96m49O07j58o32N79n38m1N76m86K94P2l04N65k92j97O36
$$ plain form
3384 479 241 -195 523 -222 -24 273 -261 -198 207 -472 301 -70 -531 111 135 -347 145 -284 -263 323 75
3405 75 40 326 -265 347 179 -366 647 -41 -307 452 -324 -47 206 -266 -69 62 -406 275 119 -335
3425 -335 398 -280 -180 541 -366 -311 466 -381 -143 203 -127 553 105 -456 580 -294 -366 301 -378 42
3445 42 304 -319 136 -7 -181 365 -12 -216 507 49 85 237 -609 5 493 -585 -105 155 -399 152
3465 152 -126 -455 299 -145 -246 285 -349 -20 507 -284 254 34 -380 360 164 -4 510 -253 -310 123
3485 123 -822 38 169 -716 133 255 -239 351 -60 -169 458 -138 -24 572 -277 -112 167 -491 100 12
3505 12 -254 553 82 -408 170 -408 -192 265 -430 275 274 -330 493 181 -137 444 -85 -398 176 -407 -88
3526 -88 481 -483 154 -141 -596 149 -86 -166 365 -391 86 518 -55 149 273 -659 381 148 -182 355
$$ packed form
3384D79k38m36P18p45J98K97n34O3M05o79P73l71m61O42K4m82M92m29K1N86k48
3405G5l5K86n91O12j68n45J013o88k66P59p76K77K53m72J97J31m68O81j56m54
3425c35P33o78J00P21r07N5P77q47K38L46l30O80m48n61J036q74p2O67o79M20
3445D2K62o23M55j43j74N46l77k04P23m58L6J52q46O14M88j078M80K60n54N51
3465A52k78l29P54m44j01N31o34L29N27p91N38k20m14P40j96j68N14p63n7M33
3485A23r45Q60J31q85Q49J22m94N90m11j09O27n96J14N96q49J65K79o58N91q8
3505A2k66Q07m71m90N78n78K16M57o95P05jo04Q23l12l18N81n29l13N74n83L19
3526h8N69r64O37k95m55P45k35q0N31p56M77M32n73K04J24r32J040k33l30N37
$$ plain form
3546 355 -180 -67 513 -367 -305 373 -375 -112 345 -317 60 -246 -173 478 174 -259 531 -357 -47 575 -248
3567 -248 121 264 -59 82 25 -445 253 -386 -370 140 -262 17 453 -96 76 180 -114 429 -106 -48 567
3588 567 78 -176 422 -165 -128 202 -267 -11 246 -650 261 -47 -196 416 -265 22 421 -442 250 445
3608 445 -341 97 338 -346 299 -49 -413 217 -24 -205 235 -554 -199 -126 -563 71 88 -304 295 -55 -261
3629 -261 528 -166 -39 417 -28 330 199 -375 383 240 -206 445 -13 -532 347 -487 -49 471 -534 157
3649 157 259 -163 -49 245 -484 355 19 -281 547 -125 -169 372 -332 -3 15 -658 64 -49 -296 397 -282
3670 -282 -55 415 -23 269 520 -84 129 237 -311 180 -246 -346 71 -350 -56 411 -128 -6 186 -337
3690 -337 12 36 -247 204 -6 -217 282 86 191 506 -174 -2 186 -263 -103 -130 -387 372 -108 -335 67
$$ packed form
3546C55n35J13N80q80O2O78p48K63M57o62L77l06P3O51l04m33P90q88L10O22q23
3567b48L69J43l23J41n7m70O98o39J6N10m02K79M36n49J72J04k94N43n35N8O15
3588E67m89k54N98n87L7L30m69K56K57q96R11l08j49O12o81K87L99q63O92J95
3608D45p86M38K41o84O45l48l64O30k41j81M40p89L55P3m37O34J7l92N99l50k06
3629b61P89o94J27M56m45L58j31n74P58j43m46O51m58n19Q79q34M38N20j005O91
3649A57J02m22J14K94p29Q39l36l00Q28o72m4N41p04L29J8o73P22j13k47O93o79
3670b82K27M70m38K92K51o04K13J08n48M91m26j00M17m21K94M67n39J22J92n23
3690c37L49K4k83M51k10k11M99j96J05L15o80J72J88m49J60k7k57P59m80k27M02
$$ plain form
3711 67 -145 -399 100 -489 -21 291 -285 452 158 -255 163 -68 4 557 58 -90 106 -190 -254 155 -542
3732 -542 215 112 -512 230 -236 -152 444 -131 48 348 -97 -5 566 -69 250 99 -174 211 -309 0 148
3753 148 -219 -362 40 -403 508 16 -326 395 155 85 559 -80 -368 557 -197 -93 57 -32 99 206 -279
3774 -279 414 68 -402 105 -497 -192 239 -294 177 553 -292 533 79 -369 381 -67 -34 706 71 -126
3794 -126 338 -164 -60 182 -210 131 -355 -273 314 -60 -411 338 67 -168 332 -143 333 288 -225 31 331
3815 331 -96 211 -246 -426 321 -391 -164 138 -340 136 40 -254 38 112 24 569 26 -43 323 -20 55 386
3837 386 5 330 216 -360 32 -197 -223 243 -208 -208 -24 -280 124 311 -74 467 111 -274 145 241 -166
3858 -166 194 -248 -209 214 -243 11 58 -542 184 -88 -483 145 -42 -267 595 -221 116 80 -203 268 464
$$ packed form
3711F7k12k54M99n89M68L12n76P37k94m13M18k31P2N53m99j48J96k96o4M09o97
3732e42P57j03o24P42m66Q4N96n75J79L00m45R2N71o35L19j51k73L85n20L09J48
3753A48l67j43M02m43R11m92l42P21k40p0M74o39k88R25p54J04J50q9J31J07m85
3774b79O93l46m70N07o02L05M31n33M71L76q45Q25m54m48P50m48L3P40o35j97
3794a26M64n02J04K42l92L41m86Q2N87l74l51P49k71k35N00m75M76m5n13K56L00
3815C31m27L07m57j80P47p12K27L02m78M76r6k94K92P4q8N45n43o9L66l43P5L31
3837C86l81L25j14n76L92k29k6M66m51%J84k56M04J87l85N41l56l85M19R6m07
3858a66L60m42L9M23m57K54M7o00P26k72l95O28j87k25Q62q16L37l6k83M71J96
$$ plain form
3879 464 -47 117 -101 -362 166 -96 -272 200 -155 122 100 -190 -11 374 -214 61 108 -449 316 60 -332
3900 -332 173 -192 -124 268 -222 225 26 -138 133 -132 -419 160 -47 -221 407 -595 67 191 -296 113
3920 113 48 -240 337 170 -135 335 -254 -190 318 -369 -385 248 -454 29 -32 -419 198 330 -454 332 -252
3941 -252 -171 306 -73 205 539 -223 97 257 -215 462 -98 -292 82 -256 -292 308 10 -172 355 -342 -123
3962 -123 296 -206 277 77 -208 623 -136 -204 269 -174 -88 316 -206 -88 -142 -320 301 -252 -54 38 -240
3983 -240 63 204 -322 222 337 -63 251 238 -177 32 37 -23 253 -551 115 88 -348 -223 302 -316 175 -138
4005 -138 -289 15 -82 114 427 -184 142 116 -217 176 193 -35 154 38 -353 224 -99 -239 278 -267 206
4026 206 200 30 100 202 94 326 371 -75 500 90 -215 56 -207 -356 223 -197 192 229 -255 245 117 -267
$$ packed form
3879D64n11J64k18k61N28k62j76M72l55K77k2k90J79L85n88K75M7n57P65k56l92
3900c32N05l65O8L92m90M47j99j64K71k65k87N79k07j74O28j002O62J24m87M09
3920A13o5k88N77j67l05M70n89O4N08o87j6O33p02M83o1l87O17J32p84P86n84
3941b52Q1M77l79K78L34p62L20J60m72O77n60j94L74l38l6O00k98j82N27o97K19
3962a23M19n02M83k00k85Q31p59o8M73m43Q6M04n22J18n4j78O21n53J98R2k78
3983b40L03J41n26N44J15m00L14j3m15K09No0K76q04O66k7m36J25N25o18M91l13
4005a38j51L04r7J96L13o11L26k6l33L93J7k28J89j16l91N77l23j40N17n45M73
4026B06oj70P0J02j08K32M5m46N75m10l05K71k63j49N79m20L89L7m84N00j28l84
$$ plain form
4048 -267 175 -568 89 147 -280 -23 243 -377 234 289 -150 120 -139 151 331 -296 -2 250 -472 -36 90
4069 90 -569 341 177 -73 231 1 -340 310 -95 69 81 -386 7 55 -270 224 78 -297 66 -357 -63
4090 -63 97 -51 -52 162 -272 78 305 -278 359 -62 -556 423 6 -153 410 -267 124 -11 -295 523 256
4111 256 -485 8 10 -59 190 -224 -7 345 -338 126 5 -24 111 155 -28 361 143 -50 354 -70 -153 123
4133 123 -311 -167 -160 -527 310 45 -199 375 -52 -191 523 -280 -13 265 -291 -53 104 -421 297 110 -149
4154 -149 312 -22 -141 95 -447 -287 350 -391 48 175 -333 466 -55 -262 595 5 36 298 -54 -3 67
4175 67 -298 -26 -26 -92 -53 -1 -22 210 -175 -131 223 -282 59 139 -245 213 208 -274 346 156 -226 373 -153 -217
4199 -217 61 -30 91 -182 -598 215 87 -271 406 -141 -286 399 -233 -67 541 -110 359 123 -147 187
$$ packed form
4048b67M42p43O57N8m27K57K66o20O11N5m39K70k59K90J80o27K94K52p22M36J26
4069I0o59R10j64k50L04k30l41O50m05J64J2m67L93M8l25M94j46l75L63m23K94
4090f3J60j48jK14m34L50K27n83O37m21m94R79m17j59N63o77L91j35k84Q18k67
4111B56p41M93Ko9K49m14K17L52o83M64j21k9J35M4j83L89k18j93M04m24q3K76
4133A23m34J44Pl67Q37k65k44N74m27j39P14q03K67K78n56K38J57n25P18j87k59
4154a49M61l34j19K36n42J60O37p41M39J27n08P99n21k07Q57n90L1K62l52N1P0
4175F7l65K72%o6L9N2k1K32l85M4L54n05L41Q0l84M58nm82O20j90l82N99n26o4
4199b17K78r1J21k73m16Q13j28l58O77n47j45O85o32J66O08o51M69k36k70L34
$$ plain form
4219 187 5 -534 295 0 -120 137 -161 59 -143 -303 78 302 -150 21 214 -200 494 -31 56 235
4239 235 -235 -94 87 -20 260 -9 -54 292 0 -217 196 -87 -42 300 16 8 164 -125 118 187 -298 95
4261 95 71 -41 464 37 -101 -110 -554 -73 177 -315 148 -75 -385 172 135 -330 404 -91 -126 -108 -103 99 216
4284 216 -306 499 1 -446 51 22 -240 -26 -161 -36 172 -205 -11 180 -106 156 -3 87 156 -316 112
4305 112 464 -402 214 323 -434 227 64 -298 189 41 -168 200 -407 -128 241 -162 -242 160 -202 443
4325 443 33 -65 179 -90 -236 93 -84 -34 298 -74 309 12 -190 218 266 -201 136 38 -122 270 -151
4346 -151 2 261 -240 52 101 -178 217 98 10 212 105 -242 61 -205 98 208 -324 143 106 -357 437
4367 437 100 -77 466 -113 -163 325 -272 97 25 -333 170 -230 -254 224 -108 -284 50 -167 -388 189 -3
$$ packed form
4219A87j82n39Q29k95j20K57k98K20k02j60L81K24m52J71J93m14O94n25Q7J79
4239B35m70J41J81j07K80k69m5L46k92k17M13k83M5L42k84qJ56k89K43O9m85L93
4261I5k4j12N05m27j38rm44M81K50m92M63k23l10N57l7m65P34m95l5J8NK02J17
4284B16n22Q05m98m47M97k9k62K14j35J25K08l77J94J91k86K62j59R0O9m72M28
4305A12L52q66O16J09p57O61j63l62M87j48k09L68o07K79L69m03q0M02l62O45
4325D43m10r8K44k69j46L29j77N0L32l72L83k97k02M08M8m67L37r8j60L92m21
4346a51J53K59n01K92M9k79L95j19q8K02j07l47L03k66L03J10n32M67l7m63P94
4367D37l37j77N43n79n0M88n97L69p2l58N03m00k4M78l32j76L34k17k21N77j92
$$ plain form
4388 -3 -5 131 -281 74 352 75 298 45 -136 186 6 -162 114 -226 -202 90 -99 35 37 -350 21 -90
4410 -90 -224 321 25 -274 313 -130 145 70 -209 89 90 -341 37 -166 -162 322 116 -94 167 -49 172 236
4432 236 -40 389 -142 -231 399 -157 -58 272 -182 -40 119 112 -31 149 -243 35 144 -186 160 141 -89 354
4454 354 -240 31 347 -178 166 195 -94 86 20 -479 245 -180 -171 171 -279 56 265 -396 109 -54 -551
4475 -551 -99 16 41 514 -120 30 294 -99 -61 83 -253 28 101 -21 456 -36 -157 102 29 -146 -57 -248
4497 -248 -217 -154 -68 276 -168 -96 317 38 -20 16 -22 -78 -46 -176 20 -64 11 176 -39 -243 109 10 -57 129
4521 129 -53 289 332 -287 257 92 -61 255 45 -167 73 -104 50 50 -83 181 291 -107 16 24 35 308
4543 308 6 -112 159 -186 -251 137 104 118 449 -187 113 129 -74 103 -80 -209 290 -163 -216 62 -456 78
$$ packed form
4388ckJ36m12L55K78k77K23k53j81L22j80j68K76l40K4K92j89J34Kl87L71j11
4410i0j34N45k96k99N87m43K75p5k79K98Jm31L78k03MM84k06k10K61k16K21O4
4432B36k76M29n31q9O30n56R9L30m54J42J59pj43J80l92K78J09l30L46j9k30M43
4454C54n94K71L16n25L44K9k89J80o6m99P24m25RL42m50L35K09o61N05j63m97
4475e51M52J15K5M73o34J50K64l93L8J44l36K81P3j22M77m92j21K59p3j75Q9j91
4497b48L1O3Q6L44m44P2M13k79n8L6l8n6L2j30J96q4P5J65k15k04L52r9o7J86
4521A29j82L42M3o19N44j65j53L16k10k12K40j77J54%j33K64J10l98J23QJ1K73
4543C08l02j18K71l45o5L88l3J4L31o36L00J6k03J77j83j29M99m53n3K78n18N34
$$ plain form
4565 78 102 -193 317 195 -176 291 179 -157 161 -197 143 326 -195 -454 175 -576 90 -64 -220 95 -306
4586 -306 157 254 -235 26 8 -5 192 409 -38 356 83 -217 322 -119 63 330 -296 -111 -67 -170 160
4607 160 14 -239 195 20 -155 395 102 94 423 -212 28 -10 -379 224 220 1 67 -82 -395 193 -344 33
4629 33 256 -212 221 239 -77 133 127 -68 148 90 -1 17 -106 -289 10 -88 -4 -19 -349 -48 -33 -218 175 -39
4653 -39 -254 280 -204 -471 -21 -47 -102 117 -103 325 58 16 198 -87 145 109 -280 -32 361 -49 -139 -76
4675 -76 -213 278 116 -262 226 24 11 322 -104 290 363 -147 230 47 -244 39 15 -161 310 -117 -94 94
4697 94 43 -51 -64 29 171 135 -209 406 -78 -279 210 11 2 138 -99 -61 -36 -183 -25 183 -131 27 -96
4720 -96 -327 300 -223 -85 188 59 160 10 -48 54 272 -134 251 -259 -2 401 18 41 188 -398 95
$$ packed form
4565G8K4k95N10j22l71M67j12l36L18l58L40J83n21k59O29p51O66j54j56L15m01
4586c06M63R7m89K61j8j3J97K17m47L94k73l00N39m41J82K67o26J85M4j03L30
4607A60j46k53M34j75j75N50k93qL29o35K40l8l69O03mk19O6j49l13N88n37L77
4629C3K23m68M33J8l16K10oj95K16n8r1J8j23j83K99r8Q4j5l30L01J5j85L93k14
4653c9k15N34m84k67M50k6n5K19k20M28k67m2J82k85K32l6l89K48L93m10r0O3
4675g6j37M91j62l78M88k02j3L11m26L94P3n10L77j83k91K83k4j76M71m27K3J88
4697I4n1r4j3R3J42l6l44O15m84k01M89j99rJ36k37L8K5j47J58K08l14J58j23
4720i6k31O27n23J38K73j29J01j50n8J02K18m06L85n10K57M03l83K3J47n86M93
$$ plain form
4741 95 228 -315 317 309 -33 226 14 -92 489 -144 -81 128 -151 409 -52 -48 -13 -237 -209 75 -319 -62 207
4764 207 -163 -57 183 -158 6 -237 -112 333 114 -73 324 -263 -115 136 -137 193 203 -296 -54 -107 -546
4785 -546 45 209 -282 253 120 -151 73 -1 258 301 -360 104 182 -283 5 74 -48 143 -222 -102 -67 -113
4807 -113 101 51 -58 212 235 113 454 -35 146 154 -88 4 56 -73 -146 -30 -207 -180 -199 -9 3 121 -264
4830 -264 -70 -246 -118 289 -149 76 49 -159 -161 135 -35 55 81 -218 209 -237 48 381 -95 272 288 -61
4852 -61 -9 147 -209 185 -41 127 276 -198 202 137 -168 17 97 -79 35 34 -39 179 -117 -201 -142 131 43
4875 43 205 -222 221 -150 -246 159 -24 -41 -49 -35 65 152 -151 -187 -23 21 -53 -20 -78 363 -40 -138 213 -371
4899 -371 234 348 -110 216 5 -61 -112 -2 38 209 -73 91 36 -71 37 339 -91 -53 -186 -299 -46 -350
$$ packed form
4741I5J33n43O32ql42K59k12j06N81o33O3K09k79N60m61ML5k24K8K84l94K57K69
4764B07l70J06K40l41J64k43J25M45k19j87L97n87J48K51k73L30J0m99K42n3m39
4785e46N91J64m91N35j33k71K24p4K59M3o61M64P8m65K88O9j22J91l65J20L5m6
4807a13K14n0j09K70K3j22L41m89J81Qk42R2N2j29p3J16j77K7j9J90J2J18l85
4830b64J94j76J28M07m38K25k7k08kK96j70R0K6k99M27m46K85L33m76L67J6l49
4852f1N2J56l56L94k26J68J49m74M00o5l05J85Q0j76J14jp3K18k96q4N9K73q8
4875D3J62m27M43l71r6M05j83j7qJ4J00Q7l03l6J64M4p4L3n8M41m03r8L51n84
4899c71O05J14m58L26k11o6n1J10M0J71k82J64n5j07J08L02m30L8j33j13K53l04
$$ plain form
4921 -350 39 338 -147 -47 -3 -53 82 88 -144 217 -140 -193 -80 63 -150 173 -115 44 315 -224 -226 142
4943 142 -126 81 134 -124 45 64 223 335 -16 -219 58 -160 291 101 107 -7 -65 -198 111 -169 -30 243
4965 243 112 -270 229 144 -35 103 -53 117 -18 345 22 112 -196 82 -95 -29 145 18 235 176 83 37
4987 37 -98 24 218 -19 145 277 -263 147 320 -207 252 61 -97 217 240 192 304 -148 -162 198 -14
5008 -14 -202 198 -159 -75 166 -240 24 -152 -183 166 -33 -140 335 79 24 -60 -142 73 -72 -31 81 11 -91
5031 -91 121 -34 -331 -15 -174 285 224 54 221 117 77 186 89 -175 303 -90 -56 -87 -176 -315 -78 51
5053 51 1 3 -323 71 -254 80 -58 -76 44 122 -119 240 280 23 147 -22 -169 91 -76 -49 -170 -103 -238
5076 -238 -73 17 198 89 -175 -82 133 -69 295 280 -318 323 -18 -149 217 -237 -126 101 -78 91 -387
$$ packed form
4921c50L89K99m85J00M4n0J35Ok32L61l57n3J13J43k13L23k88J59K71n39kL68
4943A42k68K07N3k58J69J9J59J12l51k03K77k18M51j90Oj14n8j33L09k80J39K73
4965B43j31l82M99q5j79J38j56J70j35L63l23R0l08K78j77O6J74j27K17n9r3m6
4987C7j35J22J94k37J64J32n40M10J73n27M59j91j58L14K3m8J12m52j4L60k12
5008a4j88M00l57Q4K41m06K64j76l1L49j99j07M75k56n5q4q2K15j45M1J12p0j02
5031i1K12j55k97L16j59M59o1j70J67j04m0J09r7k64M78l93L4l1q9j39K37J29
5053E1n0Kl26L94l25L34j38j8J20P8k41L59M0k57J24j69j47K60j67K7j21O7j35
5076b38J65R0J81j09k64R3K15k02L64j5n98O41l41j31L66m54J11K27j79J69m78
$$ plain form
5097 -387 74 -183 -77 -102 196 -83 153 165 0 257 171 -266 51 -102 -136 62 -162 15 53 -7 -156 176
5119 176 -393 25 59 -56 297 52 30 -44 -234 169 154 -197 113 -147 3 87 91 -206 -31 63 -127 -58 43
5142 43 -260 78 49 73 -67 -266 253 110 185 62 -63 11 31 -124 -1 -58 -218 -52 11 138 181 -104 -45
5165 -45 127 110 -21 153 -152 113 -78 -6 121 150 -155 394 -75 208 190 -126 85 55 -315 -32 24 161
5187 161 243 68 -218 34 -197 13 200 -187 -262 208 -427 -136 84 -177 297 -81 -223 35 -43 -136 -25
5208 -25 -132 -87 43 -171 111 -180 -28 -24 39 183 143 32 -170 310 -154 70 -4 -349 84 -50 -15 -68 -29
5231 -29 -148 85 -160 -76 -57 -149 71 -78 134 31 399 304 -85 -174 75 103 69 150 412 -58 63 189 -214
5254 -214 353 -36 -66 331 -159 57 87 356 -21 262 -220 128 218 -105 249 -80 -65 -79 -211 -169 172 -73
$$ packed form
5097c87M61k57J06k5K98k79K36J2j65K57q6m37L17j53l4J98k24J77L8o0j49L32
5119A76n69M18L4j15L53k45k2p4j90M03j5l51L10k60J50Q4Mk97J75R4j90O9J01
5142D3l03L38k9K4j40j99N19j43P5j23j25P4K0j55J23n7j60J66O3J27M3k85N9
5165d5J72j7j31J74l05K65j91P2J27K9l05N49m69K83j8l16K11l0l70K83N6J37
5187A61Q2j75k86K52k31K10J87l87p5M70o35K91K20k61M74l78j42K58p8r3J11
5208b5j07M5J30k14K82k91J52MO3J44m0j11k02M80m64K24p4l45M33j34L5n3L9
5231b9j19K33k45Q4J9r2K20j49K12j03L68r5l89q9K49K8l4Q1K62m70J21J26m03
5254b14N67l89l0L97m90K16L0K69l77K83m82L48R0l23L54l29J5j4j32M2L41k45
$$ plain form
5276 -73 78 197 85 -105 -178 -74 219 -5 -421 235 -300 -85 314 24 -112 -149 107 13 53 -40 -39 -95 -118
5299 -118 -102 -363 124 -81 -138 -221 189 -86 37 -57 165 18 -17 101 -87 -35 -117 165 -117 43 -20 -351 10
5322 10 183 -77 -13 -203 86 382 -195 26 -279 -318 165 68 -180 124 -108 12 24 -30 32 112 -242 -51 88
5345 88 -111 65 172 123 234 119 56 334 119 -69 -149 -53 -44 43 -351 431 -187 -346 179 -202 112 -5 -17
5368 -17 177 317 -89 -40 89 -60 -146 259 -19 156 413 67 -17 -195 105 -18 -314 -78 -50 -135 299 457
5390 457 -142 38 133 -331 178 224 120 157 -167 42 233 -236 111 227 -156 7 -65 -131 190 -32 -97 178
5412 178 -42 243 -2 -467 290 40 7 27 -374 152 140 -212 164 66 -334 125 117 -114 52 161 -144 156
5434 156 84 -167 166 -57 142 -96 124 151 -41 -51 85 -39 -11 200 -154 -44 62 -287 44 36 -194 48
$$ packed form
5276g3J51J19j12j90p3J04K93k24m16O56n35K15L99k90j36l7K56r4M0r3Jn6k3
5299a18J6k61M87k05n7q3M10k75J23r4K22j47l5J18j88N2q2K82k82J60o3l31L61
5322A0J73k60O4j90K89K96n77K21l05l9M83r7k48L04k32J20J2n4O2Q0l54J91J39
5345H8j99J76J07m9J11j15o3K78k15j88q0R6RQ7l94P82o18j59N25l81L14j17j2
5368a7J94J40m06M9J29j49q6M05k78J75K57l46q4j78L00j23k96K36K8q5M34J58
5390D57n99J80R5m64N09M6j04L7l24K09J91m69L47J16l83J63p2o6L21k22o5K75
5412A78k20K85k45m65P57k50l3K0m01N26j2l52L76r8m00M59qk31J66J09l05L00
5434A56p2k51L33k23J99k38K20K7j92j0J36j24K8K11l54J10J06l49L31qk30K42
$$ plain form
5456 48 264 116 177 237 137 10 -162 -87 241 -178 99 37 -347 39 187 2 258 -40 -60 26 168 -75
5478 -75 -54 50 -102 118 157 -139 -194 -287 -85 211 -59 -64 30 87 208 62 -154 -41 -70 139 198 -404 79 -137
5502 -137 -98 14 -193 121 -66 -121 12 44 8 11 -153 -121 -102 140 -305 -5 -224 -144 -194 -288 -194 116 172 97 19
5527 19 205 88 236 96 144 89 142 212 -13 114 46 33 -16 37 29 91 -88 -126 -78 -118 -232 105 -194 355 -169
5552 -169 67 84 6 -84 -109 157 -74 289 -104 44 -271 -362 12 8 99 39 32 -52 -29 -243 104 167 -199 339 -40
5577 -40 -45 10 117 26 -5 -103 -116 -5 -120 26 99 -131 198 -43 -3 -39 38 179 99 77 -20 145 233 62 -124
5602 -124 -331 181 160 79 62 53 83 5 92 -45 16 19 -8 105 -57 -231 213 -107 -169 57 -35 181 177 73 138 -64
5628 -64 99 310 -148 -55 46 -171 144 -48 79 -14 -218 273 -7 -93 -67 -45 -201 57 149 -174 55 -60
$$ packed form
5456D8K16j48O1O0j00j27j72P5L28m19K77o2l84L86J48j85K56k98k0Q6J42k43
5478g5K1J04j52K20L9k96n5r3K02K96k70nR4N7J21j46k16J13k9K09N9o02M83k16
5502a37L9J12k07L14j87n5J33L2l6Lj64L2J9K42m45L00k19Q0n0r4R4L10N6p5p8
5527A9J86j17J48j40M8n5N3P0k25J27o8j3m9N3qO2j79l8M8m0j14L37k99N49n24
5552a69K36J7p8r0k5K66k31L63l93J48l15r1L74mR1o0pq4K3k14L47O3l66N38l79
5577d0nN5J07r1l1r8j3J11j15J46P3k30L29k41M0l6P7J41q0k2r7J65Q8j71j86
5602a24k07N12k1q1j7rL0p8Q7j37O1Lk7J13j62j74M44l20o2K26r2K16mj04O5k02
5628f4J63K11m58R3J01k17L15j92J27r3k04M91k80q6K6K2j56K58R2l23K29j15
$$ plain form
5650 -60 9 56 -104 -83 -312 -195 146 129 -216 69 -117 27 -44 71 -81 -120 -277 94 108 164 -44 -4 -40 76
5674 76 87 -171 -138 -148 168 60 -265 -185 210 -271 219 37 -304 108 20 -249 250 -119 -30 18 92 -116 4
5697 4 -93 -120 -241 -72 210 -62 -271 -20 -157 183 -144 -118 91 47 -235 9 23 -175 333 46 -33 -34 -86 34
5721 34 45 -175 -132 -34 60 99 9 -81 94 -139 -148 -6 78 -135 -167 -135 87 -9 -408 -99 11 5 175 26 -208
5746 -208 38 -183 25 374 1 136 116 39 97 -158 79 123 73 -4 -17 -60 73 84 -83 223 80 -488 16
5769 16 99 133 29 208 -103 -7 -41 240 21 -77 4 -26 -192 -36 193 58 175 -195 4 126 -136 3 -140
5792 -140 -141 1 254 27 -153 -46 -9 215 103 133 150 -113 145 -89 -183 47 -190 185 -122 105 102 294 223
5815 223 -74 -32 105 253 -87 -60 159 -19 -41 -7 -68 294 2 252 -207 18 16 23 -53 -217 166 353 -16
$$ packed form
5650f0O9M7j60K1k29J17L41j7l45K85j86J44p1J15j52l9j57L71J4N6k08M0l6J16
5674G6J1k58L3j0L16j08l25Q0L95m81M90j82l41M12q8k69M99l69Q9M8P4k08J20
5697Dr7k7j21J69K82k72k09K51j37L40l27K6K09m4k82K44J4j98N08k87p9jn2J20
5721C4J1k20M3R8R4L9r0r0J75k33rJ42Q4k13l2L2K22r6l99L09J10oJ70j49k34
5746b08K46k21K08L49l73J35k0p7N8k55K37M4n0p7j3m3J33J1j67L06j43n68N04
5769A6Q3L4j04J79l11R6l4K81k19r8Q1l0j66J56K29j35J17l70J99J22k62J39j43
5792a40jJ42K53k27j80J07L7K24j12L0J7k63K58k34r4K30k37L75l07K27lJ92p1
5815B23k97M2J37J48l40K7K19j78k2L4o1L62k92K50m59K25kPp6j64L83J87l69
$$ plain form
5838 -16 -61 132 -40 -71 20 95 128 -23 197 -86 -109 -141 114 73 241 -175 139 175 -78 274 -146 -147 -8 -87
5862 -87 22 144 6 -127 54 -21 -64 130 146 -99 178 109 252 -383 50 -27 -57 -54 -216 -270 114 -53 -260
5885 -260 215 -55 -139 19 -95 -122 140 -48 -54 176 187 94 -274 -368 159 88 126 26 97 49 -143 -109 135 -54
5909 -54 -8 246 47 -209 294 139 168 73 102 -329 136 82 -7 250 -188 113 -92 -76 90 -127 142 194 192 164
5933 164 165 -235 -36 52 127 -112 97 133 474 39 -248 169 -73 95 -118 -221 -118 65 -224 430 37 -122
5955 -122 -60 113 108 249 -347 62 378 257 -30 -167 -61 -216 94 -123 -178 -42 -82 184 -187 87 -1 -19
5977 -19 67 25 -20 224 -152 89 2 38 -114 226 -89 -138 -36 -212 127 45 -105 -7 -30 -198 134 -290 22
6000 22 333 96 117 44 -139 131 -147 -228 -197 55 -120 -153 -360 -105 -21 6 -202 130 -221 8 267 -160 80
$$ packed form
5838a6m5J93j72l1R1P5L3j51K20k83k3l2K55m1J68m16L14L6k53L52m20jJ39p9
5862h7J09J22j38j33J81p5m3J94J6k45K77o9J43o35M33p7l0Lj62n4L84j67k07
5885b60M75k70q4J58j14k7K62j88oK30J1r3l68r4N27p1L8j00P1m8j92L4K44j89
5909e4M6K54j99k56N03j55K9r5K9m31M65n4q9K57m38L01k05J6J66k17K69N2kk8
5933A64Jm00J99Q8P5k39K09L6L41m35k87M17k42J68k13j03J03J83k89O54l93j59
5955a22O2J73nJ41n96M09L16j21k87j37J06j55L10k17n5J36m0K66l71K74q8j8
5977a9Q6m2m5K44l76K41q7L6j52L40l15m9J02j76L39q2j50R8k3j68L32m24L12
6000B2L11k37K1p3j83K70k78q1L1K52j75l3k07K55Q4K7k08L32l51K29K59m27K40
$$ plain form
6023 80 -24 -42 327 154 315 75 -259 -217 -149 -14 -173 4 -109 -213 -128 -292 196 -48 248 -198 216 245
6045 245 -72 -66 -230 42 119 176 -2 83 165 -132 248 356 -142 -78 46 -175 -158 86 -172 37 -99 -203 136
6068 136 29 -65 247 -238 16 130 112 -103 -2 45 -166 34 181 -170 -10 -107 -248 253 -191 200 -212
6089 -212 25 69 -284 -36 187 -147 4 -115 65 -212 -206 22 122 -16 288 -298 148 61 -126 -38 -56 -107
6111 -107 -88 -60 -292 -149 -28 -169 100 111 9 -28 -114 -40 -91 -192 158 101 -276 -273 5 192 199 -257 -92 -92 -133
6136 -133 -6 243 49 327 100 -56 -38 61 30 143 -117 -172 92 -189 -8 226 19 102 125 161 91 -289 322
6159 322 34 -40 -401 319 -152 -140 224 -125 -30 -120 -201 298 -126 189 3 -614 117 -118 -129 -277 -36 192
6181 192 618 2 -151 205 -67 140 197 -51 111 74 -71 33 -127 -426 208 -17 12 46 22 -61 449 92
$$ packed form
6023H0j04j8L69j73J61k40l34M2O8J35j59J77j13j04Q5j64M88k44K96m46M14K9
6045B45l17Oj64K72P7N7j78Q5Q2k97L80J08m98O4J24k21J7K44k58K09j36j04L39
6068A36j07r4L12m85K54J14j8k15J01M7k11K00J47l51J60r7j41N01m44L91m12
6089b12K37M4l53K48K23l34J51j19J80k77OK28J00j38L04n86M46q7j87Q8j8n1
6111a07J9K8k32J43J21j41K69J1j02l7q6P4n1j01L50n7l77LK78J87Pm56J65%m1
6136a33J27K49j94K78k27j56J8R9l1J13k60n5K64k81J81K34k07Q3K3L6p0l80O11
6159C22k88p4l61P20m71J2L64l49R5r0q1M99m24L15j86o17P31k35j1j48K41K28
6181A92M26o16j53L56k72K07N7k48J62l7j45J04j60k99O34k25K9L4k4q3N10l57
$$ plain form
6203 92 168 273 231 -99 67 -42 -46 -11 -84 -52 13 -141 -47 -111 10 143 135 127 -118 -91 -171 216 -32 92 -257 115
6229 115 187 -64 -19 -264 99 45 -236 118 159 158 64 2 167 -2 18 -166 91 83 -126 -137 120 -182 110 -19
6253 -19 -141 20 150 -323 72 261 -109 -7 -191 -126 49 -126 15 299 -44 261 29 127 154 -109 -55 49
6275 49 7 236 177 94 -105 43 108 128 -282 20 195 -114 162 -153 -80 -116 190 -48 106 -5 105 96 38 -246
6299 -246 77 -128 -40 -183 -234 254 -1 -241 3 -202 51 -104 -203 184 1 -99 20 57 81 369 84 -69
6321 -69 170 174 -179 29 -60 -100 -83 -159 36 -141 157 87 168 151 41 120 2 27 -172 -190 -12 -157 3 6 -75
6346 -75 153 -126 63 -90 -86 -229 111 -29 -22 52 12 -60 61 49 179 -136 -159 294 -201 271 19 -227 -53
6369 -53 -151 7 128 -141 -52 -31 -38 -111 104 88 73 411 -206 205 -165 96 78 94 -143 -88 -94 138 -119 110 -169
$$ packed form
6203I2P6J05m2l30J66j09mL5p3L2O5j54R4o4J21J33qqk45K7q0L87k48J24l49L72
6229A15P2k51M5k45L63n4k81L54M1jr4o2J65j69K0j84K57qk09j1K57l02K92j29
6253a9j22J61J30m73L95J89l70J02j84O5J75j75J41K84l43L05k32R8K7k63N4J04
6275D9m2K29n9q3j99J48O5K0m10L02J75l09K76l15P3l6L06k38J54j11J10rn8k84
6299b46L23k05Q8j43n1M88k55k40K44k05K53j55r9L87j83j00J19L7K4K88k85j53
6321f9K39Ml53K08q9m0J7p6J95j77K98p0Q1j7j10P9j18K5j99j8J78j45J60Lq1
6346g5K28k79J89j53Mj43L40j40PP4m0p2J21j2J30l15k3M53m95M72k52k46J74
6369e3r8J58J21k69Q9K1pp3K15j6j5L38o17M11l70K61j8J6k37N5oK32k57K29k79
$$ plain form
6394 -169 199 53 14 120 -220 113 -188 -168 180 116 -148 -264 -40 132 9 -63 102 108 -131 31 -31 -23 9
6417 9 -222 -10 -185 -6 159 -41 -32 -126 74 13 124 84 -287 95 -42 248 173 168 -196 85 207 264 294 -201
6441 -201 45 6 223 141 -108 -261 87 257 414 136 -269 91 -25 63 166 72 102 104 76 210 -30 -61 135
6464 135 -26 -186 19 -66 -178 177 -209 92 133 39 261 -131 187 85 134 117 -66 -100 -100 166 -80 -14 89
6487 89 -106 -22 87 54 103 198 -62 60 -158 -201 269 -198 -48 -63 256 17 -121 -86 204 -278 -16 -50 -478
6510 -478 -130 36 -164 -83 441 -109 -105 0 -183 -260 254 -8 -53 -127 -27 370 -142 66 187 -85 223 -17
6532 -17 -23 -97 -16 -70 -25 -61 -200 -25 -204 -60 19 40 24 -88 148 498 116 263 13 202 -70 199 -91 -72
6556 -72 33 -140 122 84 78 91 16 -30 28 111 -127 269 1 164 160 47 -54 -147 -79 22 -174 -48 -10 -172 23
$$ packed form
6394a69L68j46l9J06l40L33l01K0L48o4k64j16K24J72j23p2J65Ok39J62o2QL2
6417Ik31K12j75J79J65k00Rr4K00o1J11m0l71L82j37K90p5nl64K81J22N7L0m95
6441b01K46l9K17q2k49j53L48J70J57k78m05L60j16Q8J03r4L0Kk8J34k40l1J96
6464A35j61j60K05q5j12L55l86L01M1r4K22l92L18j02M9j7j83l4%K66k46O6J03
6487H9j95Q4J09l3M9R5k60J22k18m3M70m67J50j5L19k39j38L5K90m82K62l4m28
6510d78L48J66k00Q1N24n50MJ05j83p7N14k62m5p4J00L97n12K08J21k72L08k40
6532a7op4Q1n4M5l6j39J75j79J44P9K1j6j12K36L50l82J47k50J89k72K69k90J9
6556g2J05j73K62l8oJ3p5m6N8Q3k38L96k68J63mj13j01r3O8J01j96J26L8j62J95
$$ plain form
6581 23 -198 -295 -58 -24 57 -184 -125 47 218 98 125 184 -190 72 -62 -34 48 32 -4 -18 -298 -94 -213 -308
6605 -308 210 189 -221 166 -79 -293 152 -220 -223 -70 -56 129 -74 11 -54 -7 -251 -4 102 -171 -89 146 -116
6628 -116 67 -89 47 -11 -227 -378 -131 -268 -138 -110 -24 235 -208 19 -170 137 -100 36 -78 17 -64 155
6650 155 290 -101 23 240 48 -138 -148 -107 132 224 -46 -225 -26 -259 4 -111 -285 -104 27 -104 244
6671 244 -155 -183 60 -140 34 13 117 -20 147 -45 52 191 194 -98 -21 -35 123 -155 25 260 -116 -242
6693 -242 -283 -51 118 66 -143 167 -67 -137 -138 -89 -13 280 -252 60 109 -55 147 -201 -46 -13 -168 148 96
6716 96 -72 165 61 -120 245 -24 -42 168 21 4 -61 -44 147 30 -57 -115 -60 -115 -122 253 -109 296 -45 -113
6740 -113 34 -32 196 247 -9 313 131 3 354 -258 -89 64 -127 -236 86 -333 -156 -40 14 70 69 -148
$$ packed form
6581B3k21r7K37L4Q1k41N9J72J71j20K7N9l74K62j34K8Q2j6l6j4k80K04j19r5
6605c08N18k1m10L87k45k14M45l72lJ53J4J85k03Q5o5M7k44K47J06k73Q2K35k62
6628a16J83j56J36n8k16j51K47j37J30K8Q6K59m43K27j89L07k37J36j14R5q1K19
6650A55J35l91J24K17j92j86j0M1K39R2k70j79J99k33K63j15j74J81J31j31L48
6671B44l99k8K43k00J74k1J04j37J67j92R7J39Lk92P7j4J58k78J80K35l76j26
6693b42m1K32J69n2k09L10k34p0jM9P6K93n32L12M9j64K02l48J55L3j55L16n2
6716I6j68K37j04j81L65k69j8K10j47j7o5J7J91j17q7n8N5n5pL75l62M05l41o8
6740a13J47o6K28N1k56L22j82j28L51o12J69J53j91j09L22m19J77J16N4N6jk17
$$ plain form
6762 -148 343 -22 65 243 -203 -31 51 -49 10 -33 -110 -265 -92 -43 56 -35 -72 190 -27 8 -227 -33 18 129
6786 129 -31 -208 104 230 194 130 -78 222 -254 267 87 -241 60 92 -289 50 159 -375 41 42 22 103
6808 103 -215 45 153 7 13 214 -32 19 -66 -171 249 -122 -36 4 -202 -84 -120 -47 48 -200 -196 46 -104 -71
6832 -71 203 -109 -25 -7 68 100 205 -193 -143 -40 -204 242 -83 -78 141 -52 9 352 -204 -168 -31 -273 413
6855 413 -48 -335 -48 -187 -159 -51 37 131 -101 90 73 179 116 -93 152 69 204 372 -74 197 73 -99
6877 -99 340 126 26 -264 10 38 210 25 -97 -117 -114 -20 41 169 -56 -78 237 57 -100 221 -217 -82 31
6900 31 -165 175 70 -118 109 -63 -41 -97 -3 -156 115 -160 -22 -162 56 388 17 73 -162 131 -271 208
6922 208 -59 68 43 157 24 -13 34 -149 53 -232 -48 3 -66 -49 160 -235 236 -98 -201 71 -34 19
$$ packed form
6762a48M91l65Q7J78m46J72Q2j00N9m3p7j55J73M9R9r1l7K62k17L5k35J94N1J11
6786A29j60j77L12J26l6o4k08L00m76N21j80l28L01L2l81L39J09n34M16Jk0Q1
6808A03l18K60J08j46OK01k46N1q5j05M20l71Q6M0k06J18l6P3R5k48MK42j50L3
6832g1K74l12Q4J8P5L2J05l98N0J03j64M46l25NK19j93O1L43n56L6J37k42O86
6855D13m61k87K87j39K8J08Q8R4k32J91j7J06o3k09K45q3J35J68m46K71j24j72
6877i9M39k14j00k90K74K8J72j85j22k0LR4O1J28k25k2L15j80j57L21m38J35J13
6900C1j96L40j05j88K27j72K2n6R4j53K71k75J38j40K18L32l71N6k35K93m02M79
6922B08k67J27k5J14j33l7M7j83K02k85J84N1o9J7K09l95M71l34j03K72j05N3
$$ plain form
6944 19 133 -202 211 122 -108 231 -5 -56 -52 -230 -21 108 -101 -29 129 -238 284 160 -387 102 -37 48
6966 48 94 -12 26 350 -30 239 -298 104 12 -66 -212 81 -90 2 -35 -63 35 262 -139 -112 61 -100 101
6989 101 -178 -101 20 224 -15 113 -308 23 103 -72 143 -26 -331 -279 44 -117 58 -23 -131 94 34 97
7011 97 -38 -30 230 102 -238 251 -117 -25 -74 -89 22 0 110 205 47 -152 110 182 -171 90 198 -110 -191
7034 -191 -271 -190 118 -154 30 -150 -254 -68 -224 245 11 31 -198 -6 -222 -163 137 -504 294 -32 -43 47
7056 47 -27 -207 -102 -53 144 -106 -24 40 67 -182 -215 -101 -65 165 67 -140 218 -374 -470 -7 -87 65 -127 5
7080 5 2 283 93 239 10 -321 -150 -206 -15 28 47 -2 -282 -179 -50 -191 -122 -43 140 149 200 -27 83 178 148
7105 148 65 -118 -182 200 33 68 -254 -232 -230 -113 48 21 208 -154 179 -176 -109 -92 -130 -260 25 -65 -196 112
$$ packed form
6944A9J14l35M13q9k30L39k36n1Mj78K09J29k09P2J58l67N22j24n47M89j39Q5
6966D8M6j06L8L24l80K69n37M02r2p8j46K93j71R2l7k8R8K27m01K7J73j61K01
6989A01k79P7J21K04k39J28m21L31Q0j75K15j69l05N2L23j61J75q1j08K25o0O3
7011I7j35QK60j28l40M89l68R2m9j5J11k2J10R5j58j99K62P2l53K61J08l08q1
7034a91q0Q1L08k72J84j80j04J86j56M69k34K0k29J92k16N9L00o41P98l26j1R0
7056D7p4j80J05M9J97k50Q2O4K7k49l3J14L6K30r8k07L58n92r6M63q0J52j92J32
7080ElK81j90J46k29l31J71n6J91M3J9m9k80J03J29j41O9P9J83RN1k27J10R5l0
7105A48q3j83o4L82j67L5l22K2KJ17J61k7J87l62L33l55O7J7l8j30K85r0j31L08
$$ plain form
7129 112 -151 248 2 -90 -272 -16 -191 -34 132 35 35 -141 -84 271 -143 -4 187 -131 177 -168 50 -110
7151 -110 203 -129 -78 85 20 -37 -341 158 287 -69 208 74 -345 273 -19 79 -140 43 -76 -11 94 169
7173 169 133 -233 167 165 -89 -40 122 80 -380 -319 -12 62 -69 63 187 230 43 8 -69 123 29 -8 284 57
7197 57 -51 -77 -409 -90 25 341 157 -31 -350 260 -43 -121 -50 -219 74 -86 -178 179 39 338 71 -87
7219 -87 69 262 27 -239 66 -326 10 -89 -263 -29 383 -159 106 -23 -163 14 -48 -120 254 -49 -216
7240 -216 62 -34 -10 76 13 140 9 -117 21 -77 -37 64 -10 -61 116 -82 -106 -23 -157 383 -20 -201 98
7263 98 -118 154 29 7 22 -73 -13 -125 -107 -107 144 112 95 -12 56 155 330 -98 196 33 -296 194 64 85
7287 85 -30 -320 195 71 -129 -344 186 -94 116 -27 -128 302 -69 -148 -35 48 212 352 -23 235 38
$$ packed form
7129A12k63L99k46r2j82K56j75J57J66r7%j76N7L55m14J39J91l18L08l45K18j60
7151a10L13l32N1J63o5n7l04M99J29l56K77j34m19O18k92R8k19J83j19O5J05P5
7173A69l6l66M00kk54M9J62m2m60O1L07P4j31J32J24M3j87l5p7J92r4l7K92k27
7197E7j08k6l32L19J15L16j84j88l19O10l03p8P1j69K93j60r2L57j40K99k67j58
7219h7J56J93k35k66L05l92L36r9j74K34M12n42K65j29j40J77o2p2L74l03j67
7240b16K78r6K4Q6o3J27j31j26J38r8M0J01p4n1J77j98k4Q3j34N40m03j81K99
7263I8k16K72j25k2J5r5O0j12J8%K51l2j7j07O8R9J75m28K94j63l29M90j30K1
7287H5j15k90N15j24k00k15N30k80K10j43j01M30l71p9J13Q3J64J40l75K58j97
$$ plain form
7308 38 77 7 -26 -288 113 311 -117 -143 193 -87 161 -46 247 -19 172 181 -1 -212 -13 -51 119 -157 -53
7331 -53 127 89 120 260 196 -101 -112 28 48 136 97 19 254 -16 78 -80 9 80 292 15 110 117 55 52 -63 67
7357 67 -130 -146 21 -53 174 -9 -69 -41 -60 432 -116 -91 -217 144 34 -84 154 8 -154 345 260 147 308
7380 308 55 -125 -26 51 18 -75 103 -271 110 -38 98 -229 -91 229 -1 54 294 -18 -243 -95 -85 -14
7402 -14 83 -332 213 -136 -149 227 -65 -56 60 274 -175 -75 -157 118 300 78 88 84 -179 15 140 268 75
7425 75 -241 226 249 -12 346 187 -82 -45 -68 -52 224 -77 32 14 -181 238 0 154 186 142 164 221 -23
7448 -23 -285 -52 -253 200 -19 -161 -57 40 16 118 122 6 87 67 -209 345 -90 -97 176 -158 1 229 -28
7471 -28 79 -51 58 27 -331 0 -38 89 115 -33 -264 186 -24 -183 39 337 132 231 -126 -292 172 -119
$$ packed form
7308C8L9p0l3k62M01J98m28k6L36k80K48k07K93k66J91Rj82k11J99l8J70k76J04
7331e3J80l8L1J40o4k97j1J40K0Q8l9p8K35k70R4j58Q9P1K12k77R5Po2lj15J30
7357F7j97j6J67p4K27j83o0K8j9M92n48K5j26L61j10j18K38j46j62M99q5j13J61
7380C08k53j80R9P7l3r3J78l74L81j48J36l27J38L20k30N5K40l12k25J48J0P1
7402a4R7m15N45l49j3L76k92RJ16K14m49J00q2K75J82k22J0mk63J94J25J28j93
7425G5l16M67K3k61L58j59k69L7k3J6K76l01J09j8j95M19k38J54L2m4K2N7k44
7448b3k62K33k01M53k19j42J04R7k4J02Mj16Q1k0k76N54m35pK73l34J59K28k57
7471b8J07j30J09l1l58L31l8J27K6j48k31M50k10j59K22K98k05R9l57j66M64k91
$$ plain form
7493 -119 28 60 -426 -53 -93 -101 224 74 -185 296 -224 -106 133 -178 88 -137 -303 33 -4 -257 83 2
7515 2 -452 -159 40 -122 -48 11 -91 55 -4 1 -207 -208 71 156 68 351 146 -29 167 -169 -33 136 -219 223
7539 223 -105 -290 69 -29 -59 302 -72 -411 198 -134 38 20 -75 -66 -129 122 239 -23 6 143 122 138 88 -233
7563 -233 -32 137 -195 207 -58 -74 -11 -90 -207 256 -181 105 121 10 -236 -65 -202 -225 -55 -217 -89 -179
7585 -179 -12 265 -4 -161 12 -259 67 32 69 2 -37 -19 310 -422 145 170 -118 -92 65 192 159 26 -105
7608 -105 -139 196 -96 121 -109 -312 158 -47 92 21 4 -276 -144 -60 168 34 -8 125 -109 2 30 102
7630 102 -11 36 124 -4 68 74 158 -17 -196 153 -19 13 178 -81 107 -61 15 -12 125 128 125 -62 -82 107 121
7655 121 -101 328 -104 -266 52 -61 151 145 113 -35 327 -61 -91 -193 -278 261 -228 -143 97 -277 196 -253
$$ packed form
7493a19J47L2m86L73m0qL25j50k59M81n20J18K39l11K66k25j66L36l7k53L40q1
7515Bm54K93J99j62P4N9j02J46n9Nk08jK79Q5q8K83k05j75J96l36J36J69l55M42
7539B23l28j85L59r8l0L61l74l39O09l32J72j8r5Ro3K51J17k62K9J37k1J6n0l21
7563b33K01J69l32M02k65j6O3p9j17M63m37K86J6j11k46J71j37k3J70j62J28r0
7585a79J67K77k69j57J73k71L26l5L7o7l9J8L29p32N67K5k88K6J57J27l3j33j31
7608a05l4L35k92K17k30k03M70k05J39p1j7k80J32Q4K28j34m2J33k34J11K8P2
7630A02j13M7Q8j28P2OQ4j75j79L49j72L2J65k59J88j68P6k7J37Llj87k0J89J4
7655A21k22M29m32j62L18j13K12ol2j48L62l88l0j02q5N39m89Q5K40l74M73m49
$$ plain form
7677 -253 -303 111 -358 -160 -97 174 0 -159 -130 -54 -52 294 173 -1 90 -311 -422 -24 40 -65 54 -34 -45
7700 -45 -105 0 -69 320 175 344 -13 82 -60 -78 -184 -135 32 -162 128 -147 -118 83 -103 57 35 144 132
7723 132 -34 17 87 -218 -174 -101 -1 54 -59 173 68 201 133 343 143 -284 89 12 -154 -73 50 151 -107
7746 -107 100 -14 59 -59 43 -209 -257 -4 40 -53 300 28 -248 185 -30 -176 154 257 9 273 -259
7767 -259 293 197 -118 -22 144 136 190 54 -78 -67 -87 -103 86 -37 -29 -49 288 152 -141 -21 41 3 4 147 213
7792 213 0 238 16 61 151 -246 53 130 -144 117 -281 -393 -114 -28 88 55 277 127 -94 6 74 -215
7814 -215 -15 177 20 240 -10 -77 -5 70 -343 -17 279 19 151 -23 -141 76 204 131 139 450 73 171
7836 171 -1 426 87 -56 169 -98 -77 -38 -89 64 29 -105 -40 4 -40 32 -179 35 336 -232 -77 -7 11
$$ packed form
7677b53n0M14m69J98O3K71j74j59K9P6KL46j21j74R1m01j11L98O4j05J19q8j1
7700d5o0J05o9L89j45J69l57R5j42j8j06M9J67j94K90k75K9K01j86J60k2J09j2
7723A32j66N1P0l05M4P3J00N5j13K32j05J33o8K10k00m27L73p7j66Q1J23J01k58
7746a07K07j14P3j18J02k52m8K53M4r3L53k72k76M33k15j46L30J03k48K64n32
7767b59N52r6l15R6J66qN4j36j32J1k0j6J89j23Qk0L37j36k93J20O2l8JJ43O6
7792B13k13K38k22M5R0l97K99P7k74K61l98j12K79Q6J16l3K22j50k21J00O8k89
7814b15K00J92j57K20k50o7P2P5m13L26K96k60J32j74j18K17J28p3QL11l77R8
7836A71j72M27l39j43K25k67K1L9n1J53l5j34O5M4m4P2k11K14L01n68J55P0J8
$$ plain form
7859 11 -78 35 -172 4 92 -1 -131 206 -23 -51 -72 -100 62 -170 239 54 -66 -35 8 -353 11 62 -54
7882 -54 -8 26 183 152 131 -130 -36 -261 29 117 -177 218 93 -194 -71 119 40 287 -211 147 227 91 15
7905 15 142 -357 114 228 -88 47 66 186 70 -231 272 -80 90 50 6 55 252 -206 -116 98 1 -61 171
7928 171 -49 32 128 -277 202 87 -127 59 179 28 53 31 282 191 -26 -129 10 -371 203 -63 138 271
7950 271 7 7 -156 327 -265 -64 -134 21 15 131 399 -263 152 -218 -62 -260 130 195 333 79 -311 -67
7972 -67 287 -185 -27 -19 -125 115 -376 30 52 -20 -98 -100 -81 110 10 -100 302 -33 11 84 120 36 186 -42
7996 -42 194 358 -104 -52 36 -149 -38 -37 -129 12 -337 -216 -31 -203 199 -135 -152 180 84 205 275 -113 347
8019 347 58 26 -70 -26 45 -290 30 -187 80 43 -163 -131 24 72 255 -88 28 138 -82 206 283 -163 116
$$ packed form
7859A1q9J13k07J76Q8r3j30L37k29k8k1k8J62k32M09j85j20L1M3l61L64N1j16
7882e4M6L4J57l1k1k61R4k25K90Q8k94L95j25k87J23J90p9K47m98L58Q0j36p6
7905A5J27m99M71J14l16J35J9J20j16l01N03l52J70m0m4M9J97m58R0K14r7o2K32
7928A71k20Q1R6m05M79j15k14J86J20j51K5k2K51r1k17j03J39l81N74k66K01J33
7950B71k64%j63M83n92K01p0J55oJ16K68o62M15l70J56j98L90O5J38k54l90K44
7972f7L54m72J58Qj06K40m91M06K2p2p8kJ9J91j00j10M02l35M4P3L6q4J50k28
7996d2K36J64m62N2Q8j85J11Jr2J41l49J21J85j72M02l34j7L32r6J21P0l88M60
8019C47k89l2r6M4P1l35L20k17K67l7k06L2J55M8J83l43J16J10k20K88P7m46K79
$$ plain form
8042 116 -86 -68 351 324 -11 -50 110 -67 -4 -162 -17 -51 -298 -102 -10 -71 -25 238 98 30 -60 273 71
8065 71 -59 97 9 178 136 -21 -129 -11 19 -104 -45 -37 306 108 -219 260 -3 -248 315 -25 -221 -214 -52
8088 -52 18 167 -179 184 -188 -202 193 -4 -137 -41 -319 -10 -5 -235 46 -14 -125 -83 22 89 -26 150 78
8111 78 -177 21 -163 -147 -316 -58 -159 68 -87 -117 -171 -194 39 -126 104 -283 36 206 -74 174 346 -30
8133 -30 312 41 -180 99 169 -17 144 -52 -24 253 -72 116 183 33 12 127 57 -1 -73 213 82 53 158
8156 158 6 -539 43 47 -229 121 -32 -194 274 -120 -146 320 -128 255 -88 213 94 162 131 -130 207 -72
8178 -72 87 -259 -110 -50 -106 -74 -73 -32 76 -189 17 373 -259
$$ packed form
8042A16k02J8M19k7l35l9J60j77O3j58J45l4k47J96R2o1M6K63j40o8r0L33k02
8065G1j30J56q8J69m2j57j08J18L0j23N9QL43j98l27M79k63k45N63l40j96PJ62
8088e2P0J49l46L63l72j4L95j97j33R6k78L09Nk30K81o0j11M2J05O7j15J76p2
8111G8k55J98j84J6j69K58j01K27j55l0n4k3K33j65K30l87L19J70k80K48J72l76
8133c0L42k71k21K79P0j86J61j96K8K77l25J88O7j50k1J15p0n8p2K86j31k9J05
8156A58j52n45N82Mk76L50j53j62M68l94k6M66m48L83l43L01j19O8l1k61L37k79
8178g2J59l46J49O0n6L2JM1J08k65K06L56o32
8191b59
$$ Imaginary data points
##PAGE= N=2
##DATA TABLE= (X++(I..I)), XYDATA
$$ plain form
0 0 0 0 0 0 0 0 0 0 0 0 0 0 0 0 0 -8 8 -8 8 -8 9 -16 16 -17 24 -25 32 -35 40 -48 56 -62 70 -81 90 -102 114
37 114 -127 143 -159 178 -198 219 -243 269 -298 328 -360 399 -440 484 -534 588 -649 717 -793
56 -793 880 -978 1096 -1232 1392 -1591 1840 -2159 2594 -3216 4196 -5959 10181 -46788 -616
71 -616 55221 -15031 -25800 -24206 17158 21672 -12651 5728 18387 -17443 11588 24904 5280
84 5280 4725 -11196 -485 28618 -9805 -14023 7168 -13833 -6143 3827 -13298 -1405 -13455
97 -13455 -14140 20135 -4680 -19205 14044 4644 188 5989 -2633 18042 8128 -17325 15376 12998
111 12998 -10775 5802 -1937 -4437 5517 -13177 2570 9324 -24230 -4675 13667 -5393 -3353
124 -3353 -10311 180 22521 -12451 -15323 20749 3758 -4871 44 -5899 14303 4853 -16045
$$ packed form
0@%%%%%%%%%%%%%%%qJ6j6J6j6J7k5L2l3M1m9N7o7P5q8J04j18J32j51J71j92K16
37A14k41K70l02L37l76M17m62N12n67O26o88P59q39R24j018J122j237J366j510
56g93J673j858K074k328K624k983L431l999M753n810P412j0155J6140n6969M6172
71f16N5837p0252j0769J594M1364M514l4323J8379J2659l5830K9031J3316j9624
84E280n55j5921J0711K9103l8423m218K1191k1001P690R970j7125J1893j2050
97a3455o85L4275k4815j4525L3249r400m456N801q622K0675r914k5453L2701k378
111A2998k3773J6577p739k500R954j8694J5747O754l3554J9555J8342j9060K040
124c353o958J0491K2341l4972k872L6072j6991q629M915n943K0202r450k0898
$$ plain form
137 -16045 8038 1199 -7766 13633 -3133 -8769 5938 -4199 8156 6942 -17220 4187 7771
150 7771 -8942 6846 -790 -8719 3258 -8874 3177 13501 -19509 -10676 12284 2023 3985
163 3985 -6699 -9323 17068 3917 -4926 12349 -4451 -2127 13564 -1919 3023 1065 -12342
176 -12342 8443 2155 -14264 3591 -4126 -10004 2683 -9046 881 6593 -15682 1714 12622
189 12622 -4537 5276 1936 -1855 15043 439 -1054 12520 -6611 -753 10559 -8112 -1127
202 -1127 -464 -11161 4259 -4634 -12072 6061 -7227 -8519 7763 -3657 1025 4288 -8154 11060
216 11060 10284 -8243 6338 5557 -379 8943 -5329 -2417 9050 -7955 -1233 3921 -11858 1209
230 1209 2084 -9118 3297 -3764 -5598 10045 -4889 -3606 9555 -4418 2348 6050 -6211 6791
$$ packed form
137a6045K4083o839q965K1399j6766n636J4707j0137J2355j214k4162K1407L584
150G771j6713J5788p636p929J1977j2132J2051J0324l3010Q833K2960j0261J962
163C985j0684k624K6391j3151q843J7275j6800K324J5691j5483M942j958j3407
176a2342K0785o288j6419J7855p717n878J2687j1729R927N712k2275J7396J0908
189A2622j7159R813l340l791J6898j4604j493J3574j9131N858J1312j8671O985
202a127O63j0697J5420q893p438J8133j3288j292J6282j1420M682L263j2442J9214
216A1060p76j8527J4581p81n936R322j4272K912J1467j7005O722N154j5779J3067
230A209Q75j1202J2415p061j834J5643j4934J283J3161j3973O766L702j2261J3002
$$ plain form
244 6791 2059 -8565 8469 811 -7081 4655 -5016 -177 6868 -9043 1396 5521 -7512 5975
258 5975 2904 -6931 6662 -679 -2857 7537 -7186 -2139 7033 -7904 162 2795 -8225 3707
272 3707 -690 -6908 8377 -2282 -4992 8210 -1824 1915 6654 -5899 5614 5974 -6470 6038
286 6038 543 -6951 6201 -3538 -5775 3186 -8195 -1544 4037 -9990 849 2976 -6554 5847
300 5847 458 -3454 9674 -1172 -593 10239 -2787 1661 6344 -5177 4398 1633 -8405 4657
314 4657 -2793 -8154 4410 -5703 -5463 4227 -6473 383 3902 -7011 5195 4310 -4386 7674
328 7674 1480 -1998 8849 -2430 -697 6963 -5857 612 3610 -7133 2191 -836 -7480 4439
342 4439 -3139 -5577 5496 -4278 -1583 6271 -4550 2272 4309 -4392 6059 1981 -5287 6442
$$ packed form
244F791m732j0624J7034p658p892J1736r671M839P045j5911J0439M125j3033J3487
258E975l071r835J3593p341k178J0394j4723N047R172j4937Q066K633j1020J1932
272C707m397o218J5285j0659k710J3202j0034L739M739j2553J1513L60j2444J2508
286F038n495p494J3152r739k237Q961j1381O651N581j4027J0839K127r530J2401
300E847n389l912J3128j0846N79J0832j3026M448M683j1521R575k765j0038J3062
314D657p450n361J2564j0113K40R690j0700O856L519j0913J2206q85q696J2060
328G674o194l478J0847j1279J733P660j2820O469K998j0743R324l027o644J1919
342D439p578k438J1073r774K695P854j0821O822K037q701J0451m078p268J1729
$$ plain form
356 6442 -935 -3535 5730 -5230 -1603 4883 -6496 1185 2683 -6680 3934 328 -4279 6299
370 6299 -2034 -2712 7171 -4112 -13 5211 -5940 1744 2981 -5525 3677 -1531 -6191 5218 -2761
385 -2761 -3195 4980 -4935 383 5815 -4620 3664 3558 -3953 5835 1000 -3028 5695 -2835 -2071 4977
401 4977 -5985 -1403 2498 -7177 822 297 -6049 3433 -1510 -3948 5633 -2036 95 7213 -3255
416 -3255 1972 5523 -3006 5155 2187 -5068 4410 -863 -3452 3472 -6278 -3832 3487 -5901 -280
431 -280 1177 -6970 3323 1955 -3734 5296 -819 -1243 7397 -1171 1024 5228 -4412 2143 3553
446 3553 -5090 2503 -678 -5779 3072 -2793 -3748 3686 -5000 -1578 3821 -4104 3063 2470 -5273 4956
462 4956 2626 -1983 5146 -2429 -1773 5562 -3259 323 2337 -6560 1098 2012 -4704 2541 -2163 -4660
$$ packed form
356F442p377k600R265j0960L627O486j1379P681J498r363J0614l606m607J0578
370F299q333o78R883j1283M099N224j1151P684J237q506R202n208m660J1409p979
385b761m34Q175r915N318N432j0435Q284j06p511R788m835m028Q723q530P64P048
401D977j0962M582L901r675P999n25o346R482m943k438R581p669K131P118j0468
416c255N227L551q529Q161k968p255R478n273k589O924r750K446P319r388N621
431b80J457q147J0293j368n689R030o115m24Q640q568K195M204r640O555J410
446C553q643P593l181n101Q851n865r55P434q686L422N399p925P167n93p743J0229
462D956k330m609P129p575O56P335q821L582K014q897P658R14o716P245m704k497
$$ plain form
478 -4660 5700 -789 -1517 3609 -3655 2148 4591 -4256 3004 2558 -4420 3427 -1307 -2825 4483
493 4483 -4494 -3803 3361 -3326 1306 1667 -5947 3217 2459 -2982 4950 -743 -2606 5334 -875 867
509 867 4080 -5872 217 3566 -3429 1404 -3037 -6321 4778 -261 -4053 2025 -3911 476 5138
524 5138 -3381 1894 3326 -2846 4843 2122 -2635 4427 -1612 -1650 4952 -3862 -2019 2025 -4712 341
540 341 -331 -5737 3239 -441 -5160 3213 -594 56 4714 -3528 867 5781 -2099 2851 2100 -3673
556 -3673 4031 -249 -2900 3762 -3570 -3477 2881 -3600 -144 1009 -6115 1982 2529 -2997 2911 -809
572 -809 -1494 5723 -1588 -842 4913 -2193 453 2043 -3488 3037 -78 -5977 2697 -195 -2495 2541
588 2541 -4593 -1324 4413 -2452 1300 2281 -4070 3184 2094 -1838 3825 -2086 -2241 5335 -2022 -1576
$$ packed form
478d660J0360o489p28N126p264N803K443q847P260m46o978P847m734j518P308
493D483q977O91P164o687M632L61p614R164p58n441P932n693j863P940o209J742
509H67L213r952O089L349o995M833m441l284J1099n039l792O078n936M387M662
524E138q519N275J432o172P689k721m757P062o039l8O602q814J843M044o737N053
540C41o72n406Q976l680m719Q373l807O50M658q242M395M914p880M950p51n773
556c673P704m280k651O662p332R3O358o481L456J153p124Q097N47n526N908l720
572h09o85P217p311P46N755p106K646J590n531O525l115n899Q674k892k300N036
588B541p134L269N737o865L752R81o351P254j090l932N663n911j55P576p357M46
$$ plain form
604 -1576 1610 -4803 911 2166 -4735 1185 -515 -3469 4624 -606 -1898 4156 -1936 1065 4525
619 4525 -2924 1555 2126 -3333 3130 -343 -4096 2594 -2374 -2656 2354 -4249 -113 2786 -4653 549
635 549 2304 -2011 3591 -111 -1802 5118 -196 -617 4053 -2605 334 2733 -4036 1145 333 -4953
651 -4953 1684 -1040 -3398 2673 -2454 -1296 3408 -2355 1164 3212 -2827 3169 2471 -2013 3670
666 3670 -84 -1644 3579 -2471 -1092 2854 -4249 -625 1039 -4362 1575 -61 -3832 3322 -700
681 -700 -1496 3880 -1604 -155 3666 -1964 1967 1709 -3551 3145 873 -3378 2046 -1618 -2226 2330
697 2330 -3135 -638 2232 -3776 1209 1887 -2843 2673 400 -2132 3965 -629 -1121 3679 -2349 -139
713 -139 2504 -3475 907 658 -3574 2437 -834 -3277 2752 -1601 -1264 2767 -2423 1123 2697 -2884
$$ packed form
604a576L186o413N714J255o901N920j700k954Q093n230j292O054o092L001L460
619D525p449M479N71n459O463l473l753O690m968k82N010o603M136K899p439N202
635E49J755m315N602l702j691O920n314m21M670o658K939K399o769N181q12n286
651d953O637k724k358O071n127J158M704n763L519K048o039N996o98m484N683
666C670l754j560N223o050J379L946p103L624J664n401N937j636l771P154m022
681g00p96N376n484J449L821n630L931k58n260O696k272m251N424l664o08M556
697B330n465K497K870o008M985O78m730N516k273k532O097m594m92M800o028K210
713a39K643n979M382k49m232O011l271k443O029m353L37M031n190L546J574n581
$$ plain form
729 -2884 2456 2094 -2431 3118 -66 -1812 3167 -2212 -1884 2382 -3363 -236 1175 -4238 1217 444
745 444 -2933 2860 -600 -1572 4318 -957 -120 3642 -1790 1640 1989 -3009 1948 395 -3411 2531
761 2531 -1453 -2493 1876 -2812 -974 2008 -2995 716 1521 -2649 2696 1056 -1705 3603 -346
776 -346 -665 4016 -1899 -141 2586 -2995 423 369 -3373 1288 -878 -3480 2847 -1991 -1697 2747
792 2747 -2208 506 2953 -2447 2219 2379 -1964 3080 240 -1928 2958 -1360 -1522 2087 -3286 -536
808 -536 1855 -3952 412 583 -3056 2543 -347 -1614 3710 -915 -243 3540 -2011 830 2353 -2811
824 -2811 1867 845 -3179 2370 -1366 -2799 2259 -2662 -1407 2158 -2865 735 1993 -2415 2299
839 2299 1084 -1614 3306 -118 -992 3213 -1896 -263 2470 -3148 369 1013 -3449 1271 -666 -3076
$$ packed form
729b884N340l62m525N549l184j746M979n379L28M266n745L127J411n413N455p73
745D44l377N793l460r72N890n275Q37L762n432L430L49m998M957j553l806N942
761B531l984j040M369m688J838K982n003L711Q05m170N345j640k761N308l949
776c46l19M681n915J758K727n581L418n4l742M661k166k602O327m838K94M444
792B747m955K714K447n400M666J60m343N044k840k168M886m318j62L609n373K750
808e36K391n807M364J71l639N599k890j267N324m625O72L783n551K841J523n164
824b811M678j022m024N549l736j433N058m921J255L565n023L600J258m408M714
839B299j215k698M920l424q74M205n109J633K733n618L517O44m462M720j937k410
$$ plain form
855 -3076 2321 -1157 -1436 2744 -1782 38 3317 -2213 1690 2418 -2157 2684 477 -2261 2647 -1236
871 -1236 -1526 2236 -3204 -975 1837 -3559 387 689 -2984 2432 242 -1774 3339 -464 110 3490
887 3490 -1236 940 2484 -2458 1556 962 -2948 1806 -1001 -2797 2307 -1953 -1475 1992 -2939 15
903 15 1976 -2651 1924 1225 -1844 3391 351 -1194 2927 -1680 -509 2596 -2655 387 934 -3144
919 -3144 1291 104 -3007 1803 -1068 -1488 2756 -1526 -227 2725 -1871 1475 1984 -2101 2301 766
935 766 -2118 2526 -1031 -1498 1938 -2781 -1077 1649 -2943 766 494 -3152 1980 216 -1872 2722
951 2722 -625 -768 3374 -1410 712 2058 -2376 1248 1431 -2626 1433 -1017 -2371 2300 -1874 -1793
967 -1793 1723 -2549 5 1937 -2111 1686 1152 -1835 3150 39 -1443 2737 -1253 -589 2212 -2365
$$ packed form
855c076N397l478k79M180m526J820L279n530L903P28m575M841k207k738M908l883
871a236k90L762n440K229K812n396L946L02l673N416k190k016N113l803N74L380
887C490m726K176J544m942M014n94l910M754k807j796N104m260M78L467m931K954
903A5J961m627M575o99l069N235l040j545M121m607J171L105n251L042N47m078
919c144M435j187l111M810k871m20M244m282J299K952m596L346N09m085M402j535
935G66k884M644l557m67L436m719J704K726m592L709k72l646N132j764k088M594
951B722l347j43M142m784K122J346m434L624J83m057M059k450j354M671m174Q1
967a793L516m272K554J932m048L797n34k987M985l111j482M180l990O64K801m577
$$ plain form
983 -2365 199 1245 -3103 879 -199 -2622 1770 -1052 -1897 2749 -1077 62 2503 -2002 1368
998 1368 2543 -1696 2162 749 -1626 2445 -1037 -1647 2069 -2526 -1257 1652 -2634 198 636 -2880
1014 -2880 1953 324 -1986 2792 3 -388 3173 -1006 788 2524 -2244 977 1216 -2304 1287
1029 1287 -873 -2462 1859 -1503 -1544 1791 -2430 137 2090 -2299 1458 1287 -1749 2689 605 -908
1045 -908 2604 -1405 -706 2557 -2410 -253 1217 -2689 1056 192 -2909 1652 -673 -1677 2033 -1257
1061 -1257 -320 2635 -1809 1172 2145 -2138 1760 880 -1830 2039 -788 -1635 2042 -2222 -1386 1536
1077 1536 -2531 132 1048 -2819 1551 756 -1591 2386 -345 -944 2931 -1079 288 2250 -2124 1094
1093 1094 1245 -2557 1136 -192 -2518 1900 -1415 -1571 1665 -1992 113 2292 -2438 1112 1507 -1792
$$ packed form
983b365K564J046m348L982j078k423M392k822q45M646l826J139K441m505L370
998A368J175m239L858j413k375M071l482o10L716m595J269K909m286K832M38l516
1014b880M833j629k310M778k789l91L561m179J794J736m768L221K39l520L591
1029A287k160j589M321l362m1L335m221K567J953m389L757j71l036M438k084j513
1045i08L512m009O99L263m967K157J470l906L745q64l101M561k325j004L710l290
1061a257R37K955m444K981R73m283L898q80k710L869k827q47L677m264Q36K922
1077A536m067K663R16l867M370p95k347L977k731n99L875m010J367J962m374L218
1093A094J51l802L693j328k326M418l315j56L236l657K105K179m730L550L95l299
$$ plain form
1109 -1792 2307 422 -1171 2574 -830 -959 2485 -1792 -231 1321 -2724 534 274 -2610 1378
1124 1378 -417 -1974 2461 -819 -470 2384 -1449 711 2063 -1814 1802 1161 -1853 1990 -515
1139 -515 -1791 2028 -1816 -1190 1515 -2227 54 933 -2280 1502 512 -1602 2569 -230 -1065 2845
1155 2845 -964 -87 2247 -1801 577 1365 -2415 1451 -126 -2551 1639 -1131 -1841 1402 -1883 -636
1171 -636 1598 -1871 1083 1587 -1513 2139 747 -1245 2625 -658 -670 2108 -1921 -264 1403 -2663
1187 -2663 485 467 -2342 1318 -561 -1618 1909 -621 -314 2317 -1267 559 2148 -1542 1392 1086
1203 1086 -1704 1690 -244 -1847 1531 -1590 -1115 1416 -2327 -18 1211 -2358 1031 891 -1627
1218 -1627 2267 68 -663 2683 -809 -52 2136 -1585 429 869 -2175 958 155 -2137 1341 -1088
$$ packed form
1109a792M099j885j593L745l404j29L444m277J561J552m045L258k60k884L988
1124A378j795j557M435l280L49K854l833K160J352l877L616o41l014L843k505
1139e15j276L819l844O26K705l742K281Q79l213L782r90k114M171k799q35L910
1155B845l809Q77K334m048K378P88l780L866j577k425M190k770p10L243l285J247
1171f36K234l469K954N04l100L652j392j992L870l283j2K778m029J657J667m066
1187b663L148j8k809L660j879j057L527k530L07K631l584J826J589l690K934l06
1203A086k790L394j934j603L378l121M75K531l743K309J229l569L389j40k518
1218a627L894k199p31L346l492P57K188l721K014M40l044L133q03k292L478k429
$$ plain form
1234 -1088 -1592 1915 -1525 -590 1738 -1556 913 1575 -1540 1855 838 -1193 2262 -460 -849 2154
1250 2154 -1577 -556 1338 -2519 -59 506 -2471 1198 -216 -1618 2090 -725 -379 2172 -1043
1265 -1043 244 1913 -1254 1230 947 -1703 1539 -57 -1516 1252 -1203 -1225 1446 -2013 -180 1213
1281 1213 -1794 808 830 -1505 1816 406 -650 2602 -680 -120 2116 -1513 -119 1327 -1968 770
1297 770 168 -2494 1089 -683 -1712 1503 -1075 -607 1495 -1606 617 1415 -1603 1481 870 -1130
1313 -1130 1849 -61 -811 2076 -1077 -468 1252 -2194 295 679 -2239 877 -191 -1801 1984 -293
1329 -293 -920 2004 -675 267 2008 -1393 990 1021 -1741 1364 22 -1702 1376 -1004 -1586 1166
1345 1166 -1859 -683 1308 -1801 656 969 -1797 1852 251 -862 1886 -270 -101 2033 -1262
$$ packed form
1234a088n04L507l440R35K328l294K469O62l115L395j017k031L455k722l89L003
1250B154l731J021J894l857K460N65k977L669j414j402L708k815L46K551l215
1265a043J287J669l167K484k83k650L242j596j459K768k455k2K671l459J833J393
1281A213l007K602K2k335L321j410j056L252l282N60K236l629J394J446l295K738
1297G70o02k662L583j772j029L215k578M68K102l101K223P98l018L084o11k000
1313a130K979j910p50K887l153O09J720l446K489L84k918L116j068j610L785k277
1329b93o27K924k679R42J741l401K383L1k762L105j342j724L078k380n82K752
1345A166l025J176J991l109K457L13k766L649j601j113K748k156J69K134l295
$$ plain form
1360 -1262 176 1290 -1800 892 321 -2094 941 -613 -1385 1394 -1430 -727 1500 -1217 669 1641
1376 1641 -1437 1499 1031 -1194 1564 104 -865 1639 -986 -793 1169 -1703 -247 800 -1856 781
1392 781 -196 -1670 1491 -193 -724 2153 -640 -42 1716 -854 773 1265 -1342 1186 358 -1836
1408 -1836 1121 -1041 -1244 1219 -1421 -587 1010 -1959 487 1317 -1222 1444 628 -714 1892 -218
1424 -218 -508 1990 -1215 23 1046 -1777 286 438 -2002 825 -436 -1515 1205 -1077 -608 1423
1440 1423 -859 386 1456 -1184 1148 1024 -1060 1653 135 -1018 1302 -897 -781 1061 -1788
1455 -1788 -3 685 -1913 455 164 -1619 1444 54 -506 1871 -483 -260 1512 -878 1034 1210
1471 1210 -1375 1099 210 -1358 952 -869 -921 1149 -1718 -556 1038 -1564 441 697 -1292 1292
$$ packed form
1360a262J438J114l090K692n71k415L035j554p72K779k824P03K227k717J886R72
1376A641l078K936m68k225K758j460r69K504k625J93J962k872J456J047k656K637
1392G81r77j474L161j684n31K877k793N98J758k570J627M92k607K528q28k194
1408a836K957k162k03K463k640Q34J597k969K446Q30k539K666q16j342K606k110
1424b18k90K498l205J238J023k823K063J52k440K827j261j079K720k282M69K031
1440A423k282J245J070k640K332j24k084K713j518j153K320k199J16J842k849
1455a788J785O88k598K368k91j783L063j390n60K377k354K23J772k390J912J76
1471A210k585K474q89j568K310j821n2K070k867J162J594k602K005K56j989K584
$$ plain form
1487 1292 563 -1039 1713 -85 -564 1953 -861 138 915 -1532 389 419 -1773 425 -374 -1289 1217
1504 1217 -679 -693 984 -1061 50 1236 -1065 1158 1082 -1084 1595 247 -1018 1296 -718 -615
1520 -615 1204 -1525 -424 694 -1674 449 -90 -1358 1237 -220 -710 1476 -287 -56 1756 -1003
1536 -1003 670 1091 -1455 937 216 -1425 1026 -334 -1155 1025 -1232 -684 936 -1419 131 830
1552 830 -1380 1101 512 -697 1570 -102 -656 1624 -779 -171 944 -1530 348 297 -1553 421
1568 421 -163 -1534 756 -660 -658 1094 -949 327 1180 -923 853 1335 -967 1548 200 -934 1245
1585 1245 -674 -884 746 -1284 -553 478 -1586 389 296 -1663 914 52 -1107 1547 -386 -27
1601 -27 1539 -816 238 1295 -1124 599 356 -1308 896 -197 -1341 1009 -1173 -573 1165 -1315
$$ packed form
1487A292p29j602K752j798m79K517k814R99P77k447J921L0k192K198p99r15K506
1504A217j896j4J677k045J111J186k301K223p6k166K679j348j265K314k014J03
1520f15J819k729J101J118k368K123n39j268K595j457m90K186j763K31J812k759
1536a003J673M21k546K392p21j641K451j360q21K180k257N48J620k355J550O99
1552H30k210K481n89j209K267j672n54K280k403O08J115k474J878n1j850J974
1568D21n84j371K290j416KJ752k043J276Q53k103J776M82k302K515j348j134K179
1585A245j919k10J630k030P31J031k064J975r3j959K577q62j159K654j933L59
1601b7J566k355J054J057k419J723k43j664K204j093j144K350k182O00J738k480
$$ plain form
1617 -1315 25 1062 -1020 972 658 -593 1515 61 -597 1407 -547 22 1203 -1569 76 381
1633 381 -1830 490 130 -1242 1013 -467 -629 1113 -863 -64 1318 -625 670 998 -990 979
1649 979 48 -913 979 -375 -854 1167 -1149 -334 498 -1378 305 134 -1260 834 146 -1114 1231
1666 1231 -60 14 1751 -503 -9 1406 -1146 813 587 -1212 711 -334 -1314 771 -1069 -587
1682 -587 945 -947 -12 966 -987 945 926 -728 1553 78 -542 1165 -365 -220 1216 -1214 135
1699 135 438 -1490 302 -22 -1408 619 -548 -818 1100 -751 -201 1468 -753 659 753 -776 1052
1716 1052 220 -761 1393 -548 -580 815 -1043 -365 663 -1274 72 564 -1208 796 219 -724 1180
1733 1180 -176 -23 1193 -429 261 1191 -789 576 554 -1257 700 -279 -1151 628 -666 -622 953
$$ packed form
1617a315J340J037k082J992l14j251K108j454o58K004j954N69J181k772J645L05
1633C81k211K320l60j372K255j480j62J742j976P99J382j943J295L28j988J969
1649I79r31r61J892j354m79K021k316Q15Q32j876J683j71j394K094o88j260K345
1666A231j291P4J737k254M94J415k552J959k26j799J923j045r80K085j840M82
1682e87J532j892R35R78j953J932j9j654K281j475o20J707j530J45J436k430J349
1699A35L03j928J792l24j386K027j167k70J918j851N50J669k221J412R4j529J828
1716A052q32r81K154j941l2J395j858O78J028j937J346M92j772K004n77r43J904
1733A180j356J53J216j622O90R30j980J365k2j811J957r79q72J779j294M4J575
$$ plain form
1750 953 -974 -31 738 -926 710 429 -892 989 291 -364 1183 -552 -118 1279 -1192 -162 658
1767 658 -1071 316 -63 -1403 761 -172 -987 1198 -395 -275 1257 -354 462 786 -868 638 519
1784 519 -937 1011 -464 -765 520 -663 -365 562 -1036 -90 211 -1193 848 263 -798 1293 -303
1801 -303 -488 1358 -525 90 996 -834 751 365 -1172 513 -233 -928 697 -524 -896 835 -1040
1818 -1040 -79 750 -1015 437 594 -900 1097 275 -460 1291 -304 -554 777 -716 64 505 -1198
1835 -1198 166 -32 -1374 753 -179 -762 1123 -600 -327 1314 -379 582 1245 -762 898 352 -796
1852 -796 862 -206 -566 892 -751 -501 774 -990 -42 263 -1262 857 208 -774 882 -182 -413
1869 -413 1144 -281 310 1249 -834 336 628 -1048 410 -118 -1232 690 -437 -655 872 -1072
$$ packed form
1750I53j927R43P69j664J636k81j321J881o98o55J547j735M34J397k471J030Q20
1767F58j729J387l79j340K164r33q15K185j593J20J532j611Q16L24j654J506j19
1784E19j456J948j475l01J285j183K98R27j598R46L01j404K041n85j061K091j596
1801c03j85J846j883O15R06j830J585l86j537J685p46o95J625j221l72J731j875
1818a040R61Q29j765J452J57j494J997q22p35J751j595k50J331j493P80M41j703
1835a198J364j98j342K127r32n83J885j723K73J641j693R61O63k007J660n46j148
1852g96J658j068l60J458j643K50J275j764R48L05j525K119o49r82J656j064k31
1869d13J557j425N91R39k083J170K92j676J458n28j114J922j127k18J527j944
$$ plain form
1885 -1072 -356 975 -980 419 675 -766 1265 459 -768 1100 -329 -379 1050 -854 -237 253 -1198
1902 -1198 170 318 -1297 577 86 -854 780 -403 4 1456 -526 363 1137 -688 499 420 -828
1919 -828 766 -241 -729 874 -524 -422 475 -828 -124 175 -1139 277 373 -939 877 157 -406
1936 -406 936 -364 -67 1126 -809 128 498 -677 344 -23 -1162 531 -468 -859 583 -667 -8
1953 -8 927 -554 307 1055 -606 967 358 -577 1130 -408 -381 1214 -763 16 476 -768 -134 249
1971 249 -1191 557 -153 -965 736 -196 -281 841 -444 180 934 -649 500 688 -744 773 7
1988 7 -1043 960 -685 -360 934 -889 -179 408 -1131 475 58 -953 678 165 -154 1157 -211
2005 -211 81 1085 -686 471 621 -943 240 46 -960 519 -572 -803 749 -686 -256 759
$$ packed form
1885a072P16J331j955J399K56j441K031q06j227J868j429n0J429j904O17M90j451
1902a198J368J48j615J874m91r40J634j183M07J452j982Q89P74j825J187p9j248
1919h28J594j007m88J603j398J02Q97j303P04K99j314J416R6j312J816p20n63
1936d06J342j300K97J193j935R37L70j175J021l67j139J693r99l91J442j250O59
1953hR35j481Q61P48j661J573o09r35J707j538K7J595j977P79M60j244O34L83
1971B49j440J748p10q12J701r32q5J122j285O24P54j583J149J88j432J517p66
1988Gj050K003j645L25J294j823P10N87j539J606m17j011J631n13l19J311j368
2005b11K92J004j771J157J50j564J183j94j006J479j091k31J552j435M30J015
$$ plain form
2021 759 -738 369 696 -615 909 317 -474 1269 138 -525 983 -500 -222 784 -1234 145
2037 145 236 -1190 470 -172 -843 985 -462 -355 765 -206 231 1094 -548 535 418 -908 821
2054 821 -120 -744 794 -446 -561 677 -1186 -182 578 -1175 420 559 -821 717 -62 -342 1124
2071 1124 -425 -393 1152 -727 100 765 -1298 561 106 -972 702 -512 -927 812 -776 -131 648
2088 648 -665 481 687 -591 741 328 -618 807 -25 -333 964 -513 -61 363 -1029 190 110
2105 110 -1172 246 163 -1119 608 -571 -369 1121 -708 161 1093 -321 480 755 -800 781 -103
2122 -103 -917 755 -576 -562 550 -910 -127 576 -1304 328 522 -644 905 78 -400 981 -308
2139 -308 -103 1019 -754 279 755 -818 444 26 -946 662 -142 -898 697 -486 -609 889 -371
$$ packed form
2021G59j497J107L27j311J524n92p91J743j131o63J508j483K78J006k018J379
2037A45R1j426J660o42o71J828j447J07J120r71M37Q63j642J083j17j326J729
2054H21r41o24J538j240j15J238j863J004P60j753J595J39j380J538p79k80J466
2071A124j549L2J545j879Q27O65k063J859m55j078J674j214m15J739j588O45P79
2088F48j313J146K06j278J332m13r46J425q32l08J297j477M52M24j392J219q0
2105A10j282J418q3j282J727j179K02J490j829Q69R32j414Q01K75j555J581q84
2122a03q14J672j331J4J112j460P83P03j880J632J94j166J549q27m78J381j289
2139c08K05J122j773J033M76j573J262m18r72J608q04p56J595j183j23J498j260
$$ plain form
2156 -371 60 853 -892 777 463 -450 784 134 -633 944 -234 -299 633 -1290 132 300 -1289 306
2174 306 -187 -680 726 -327 -388 972 -210 -117 1015 -772 520 756 -368 625 159 -942 555
2191 555 -660 -843 707 -808 -341 604 -1203 217 252 -801 632 132 -529 1039 -284 -37 928
2208 928 -647 -98 433 -551 302 222 -851 549 -247 -891 415 -485 -585 721 -460 171 361 -599
2226 -599 620 479 -574 796 -18 -362 897 -421 -154 681 -1022 131 82 -979 427 -41 -922
2243 -922 738 -371 -617 710 -477 26 878 -511 353 909 -501 666 74 -676 917 -572 -748
2260 -748 655 -700 -365 639 -879 -192 538 -758 389 85 -384 892 -322 112 813 -281 -4
2277 -4 727 -875 454 247 -1080 459 -412 -836 629 -393 -290 469 -691 159 760 -722 533 261
$$ packed form
2156c71M31P93j745J669l14r13J234o50p67J577j178o5R32j923J422J68j589J595
2174C06m93m93J406j053o1J360j182R3J132j787J292K36j124R93m66j101J497
2191E55j215j83J550j515M67R45j807J420L5j053J433n00o61J568j323K47R65
2208I28j575N49N31r84Q53q0j073J400p96o44J306r00j00J306j181O31J90r60
2226e99J219j41j053J370q14l44J259j318K67Q35j703J153m9j061J406m68q81
2243i22J660j109k46J327j187N03Q52j389Q64N56j410J167n92p50J593j489j76
2260g48J403j355L35J004j518O87P30j296J147l04m69J276j214M34P01j094K77
2277dP31j602J329k07j327J539q71m24J465j022J03P59j160Q50O01j482J255k72
$$ plain form
2295 261 -588 988 10 -575 821 -135 -193 544 -676 23 360 -1005 340 -188 -1140 960 -243 -503
2313 -503 892 -437 -32 967 -483 163 620 -691 383 275 -806 536 -567 -630 864 -621 -6
2330 -6 465 -826 -141 402 -803 527 54 -627 796 -71 19 1112 -400 -69 432 -769 328 85
2348 85 -972 412 -289 -582 600 -520 -488 831 -758 -34 821 -670 467 579 -272 1042 270 -382
2366 -382 772 -394 -342 622 -705 -156 596 -1109 134 -143 -941 462 -276 -621 712 -529 -359 1110
2384 1110 -508 553 669 -820 497 129 -819 443 -277 -469 748 -507 -289 505 -788 -151 417
2401 417 -723 727 291 -615 770 -86 -388 778 -333 -91 743 -593 327 104 -606 441 -98 -560
2419 -560 395 -588 -411 727 -361 18 775 -544 473 389 -388 574 -67 -609 692 -300 -134 512 -606
$$ packed form
2295B61q49J576r78n85J396r56n8P37j220O99L37j365J345n28r52K100j203k60
2313e03J395j329M05R99j450O46M57j311J074j08j081J342j103o3J494j485O15
2330fM71j291O85N43j205J330m73o81J423q67R0J093j512L31N01j201J097k43
2348H5j057J384p01k93J182j120L2J319j589P24Q55j491J137J12q51J314p72o52
2366c82J154j166N2R64j327N49P52j705J243k77p98J403p38l45J333j241J70J469
2384A110j618J061J16j489J317l68r48J262p20j92J217j255K18P94j293O37N68
2401D17j140J450m36r06J385q56l02J166j111K42Q34j336R20k23p10J047n39m62
2419e60R55r83J77J138j088L79P57j319J017q4p77R62o41n42J301r92J66O46j118
$$ plain form
2438 -606 -70 460 -472 247 173 -852 570 -214 -434 769 -54 -52 839 -292 351 577 -533 564 50
2457 50 -726 495 -183 -586 413 -649 -372 670 -686 -141 254 -485 586 -22 -617 822 8 -332
2475 -332 767 -218 -150 628 -534 215 270 -702 145 -117 -564 338 -366 -488 673 -481 -175 647 -664
2494 -664 -20 410 -271 694 -54 -634 375 -142 -486 298 -568 -331 392 -669 156 111 -735 346 -41
2513 -41 -356 508 -77 -76 750 -106 53 412 -408 280 375 -528 357 -208 -648 673 -789 -436 546 -691
2533 -691 181 466 -601 386 274 -442 737 -145 -31 627 -426 -279 670 -819 212 366 -753 290
2551 290 -11 -779 320 -341 -443 551 -333 -4 789 -604 246 532 -645 607 285 -323 456 -167 -359
2570 -359 627 -732 -183 386 -811 79 -11 -656 260 -129 -563 837 -337 -24 618 -380 -52 646 -583
$$ packed form
2438f06N36N30r32P19p4j025J422p84k20J203q23KQ91j131O43K26j110J097n14
2457E0p76J221o78m03R99j062K77J042j356N45L95p39J071o08n95J439q14l40
2475c32J099r85O8P78j162P49N5r72Q47k62m47R02p04j22J161j154L06Q22j311
2494f64O44M30o81R65p48n80J009n17l44P84q66K37P23j061Q25m5q46J081l87
2513d1l15Q64n85JQ26q56J59L59q20O88R5r03Q85n65m40J321j462L53R82j237
2533f91Q72K85j067R87j12p16J179q82J14O58j053J47R49j489J031J54j119J043
2551B90l01p68J099o61j02R94q84L29P93j393Q50K86j177J252l22o08P79o23j92
2570c59R86j359N49N69j197Q90r0o45R16l89m34J400j174L13O42r98L28O98j229
$$ plain form
2589 -583 733 412 -835 382 -123 -538 349 -586 -529 467 -591 -107 292 -584 276 216 -543 797 -139
2608 -139 -146 743 -289 -26 812 -448 152 222 -759 91 29 -706 667 -188 -623 629 -471 -230 512 -489
2628 -489 217 544 -388 580 245 -422 551 -9 -452 411 -459 -255 270 -640 219 328 -837 403 53
2647 53 -445 597 42 -157 935 -256 127 387 -394 435 24 -633 463 -312 -437 305 -499 -675 504
2666 504 -447 65 382 -551 234 227 -388 792 91 -447 807 -210 -23 557 -379 221 424 -715 7
2685 7 -21 -593 256 -69 -16 475 -561 -409 729 -450 94 569 -491 690 338 -506 512 -158 -309
$$ packed form
2589e83J316l21j247J217n05m15Q87r35N7R96j058M84L99q76Q60o0p59J340r36
2608a39pQ89j032K63Q38j260O00P0r81Q50o2p35J373q55m35J252j100K41P42j001
2628d89P06L27r32R68l35o67R73n60m43Q63q70K04N25r10Q59J09j165J240l50
2647E3m98J042n55j99J092j191L83K60p81Q29m11o57J096p75j25P42q04j76J179
2666E04r51N12L17r33P85po15J180p01n38J254j017J87N80r36O00K03j139P22
2685Gk8n72Q49l25N3M91j036J52J138j179N44M75j060J181l52q44J018o70j51
$$ [...]
8191a7
##END NTUPLES=NMR FID
##END=
