##TITLE=1H_Pr o-Me
 CDCl3, 8 sc, 
 9.6.2020
##JCAMPDX= 6.0         $$ Bruker NMR JCAMP-DX V2.0
##DATA TYPE= NMR FID
##DATA CLASS= NTUPLES
##ORIGIN= UXNMR, Bruker Analytische Messtechnik GmbH
##OWNER= root
$$ XWIN-NMR		Version 3.5
$$ Tue Jun  9 12:42:49 2020 Russian Standard Time (UT+4h)  she@DPX200
##.OBSERVE FREQUENCY= 200.1315
##.OBSERVE NUCLEUS= ^1H
##.DELAY= (6, 6)
##.ACQUISITION MODE= SIMULTANEOUS
##.ACQUISITION SCHEME= undefined
##.AVERAGES= 8
##.DIGITISER RES= 18
##SPECTROMETER/DATA SYSTEM= spect
##.PULSE SEQUENCE= zg30
##.SOLVENT NAME= D2O
##.SHIFT REFERENCE= (INTERNAL, D2O, 0, 15.7039)
##AUDIT TRAIL= $$ (NUMBER, WHEN, WHO, WHERE, WHAT)
$$ ##TITLE= Audit trail, XWIN-NMR		Version 3.5
$$ ##JCAMPDX= 5.01
$$ ##ORIGIN= Bruker BioSpin GmbH
$$ ##OWNER= she
$$ F:/spectra/data/she/nmr/H-F/1/audita.txt
$$ ##AUDIT TRAIL=  $$ (NUMBER, WHEN, WHO, WHERE, WHAT)
(   1,<2020-06-09 12:41:35.75 +0400>,<she>,<DPX200>,
      <created by zg, POWCHK disabled, PULCHK disabled
       configuration hash MD5:
       00 E9 B6 7A A2 85 ED C7 34 08 36 98 17 FE 4E 26
       data hash MD5: 16K
       D8 B9 72 64 BC 38 E0 E3 B5 1B E1 D8 CD 2F 1E FA>)
$$ ##END=
$$ 
$$ hash MD5
$$ FC 24 8A 16 83 8F B1 A9 0D CC DB 26 40 C8 47 78
##$RELAX= 
##$RELAX= 
##$RELAX= 
##$RELAX= 
##$RELAX= 
##$RELAX= 
$$ Bruker specific parameters
$$ --------------------------
##$DU= <F:/spectra>
##$EXPNO= 1
##$NAME= <H-F>
##$PROCNO= 1
##$TYPE= <nmr>
##$USER= <she>
##$AMP= (0..31)
100 100 100 100 100 100 100 100 100 100 100 100 100 100 100 100 100 100 
100 100 100 100 100 100 100 100 100 100 100 100 100 100 
##$AQSEQ= 0
##$AQ_mod= 1
##$AUNM= <au_zg>
##$AUTOPOS= <>
##$BF1= 200.13
##$BF2= 200.13
##$BF3= 200.13
##$BF4= 200.13
##$BF5= 200.13
##$BF6= 200.13
##$BF7= 200.13
##$BF8= 200.13
##$BYTORDA= 1
##$CFDGTYP= 0
##$CFRGTYP= 5
##$CHEMSTR= <none>
##$CNST= (0..31)
1 1 145 1 1 1 1 1 1 1 1 1 1 1 1 1 1 1 1 1 1 1 1 1 1 1 1 1 1 1 1 1 
##$CPDPRG= <>
##$CPDPRG1= <>
##$CPDPRG2= <>
##$CPDPRG3= <>
##$CPDPRG4= <mlev>
##$CPDPRG5= <mlev>
##$CPDPRG6= <mlev>
##$CPDPRG7= <mlev>
##$CPDPRG8= <mlev>
##$CPDPRGB= <>
##$CPDPRGT= <>
##$D= (0..31)
0 1.2 0 0 0 0 0 0 0 0.06 0 0.03 0 0 0 0 0.0002 0 0 0 0 0 0 0 0 0 0 0 0 
0 0 0 
##$DATE= 1591692095
##$DBL= (0..7)
120 120 120 120 120 120 120 120 
##$DBP= (0..7)
150 150 150 150 150 150 150 150 
##$DBP07= 0
##$DBPNAM0= <>
##$DBPNAM1= <>
##$DBPNAM2= <>
##$DBPNAM3= <>
##$DBPNAM4= <>
##$DBPNAM5= <>
##$DBPNAM6= <>
##$DBPNAM7= <>
##$DBPOAL= (0..7)
0.5 0.5 0.5 0.5 0.5 0.5 0.5 0.5 
##$DBPOFFS= (0..7)
0 0 0 0 0 0 0 0 
##$DE= 6
##$DECBNUC= <off>
##$DECIM= 24
##$DECNUC= <off>
##$DECSTAT= 4
##$DIGMOD= 1
##$DIGTYP= 9
##$DL= (0..7)
0 120 120 120 120 120 120 120 
##$DP= (0..7)
150 150 150 150 150 150 150 150 
##$DP07= 0
##$DPNAME0= <>
##$DPNAME1= <>
##$DPNAME2= <>
##$DPNAME3= <>
##$DPNAME4= <>
##$DPNAME5= <>
##$DPNAME6= <>
##$DPNAME7= <>
##$DPOAL= (0..7)
0.5 0.5 0.5 0.5 0.5 0.5 0.5 0.5 
##$DPOFFS= (0..7)
0 0 0 0 0 0 0 0 
##$DQDMODE= 0
##$DR= 18
##$DS= 0
##$DSLIST= <SSSSSSSSSSSSSSS>
##$DSPFIRM= 0
$$ [...]
##$SUBNAM2= <"">
##$SUBNAM3= <"">
##$SUBNAM4= <"">
##$SUBNAM5= <"">
##$SUBNAM6= <"">
##$SUBNAM7= <"">
##$SUBNAM8= <"">
##$SUBNAM9= <"">
##$SW= 24.9337058887773
##$SWIBOX= (0..15)
0 0 2 0 0 0 0 0 0 0 0 0 0 0 0 0 
##$SW_h= 4990.01996007984
##$TD= 16384
##$TD0= 1
##$TE= 0
##$TE2= 300
##$TE3= 300
##$TEG= 300
##$TL= (0..7)
0 120 120 120 120 120 120 120 
##$TP= (0..7)
150 150 150 150 150 150 150 150 
##$TP07= 0
##$TPNAME0= <>
##$TPNAME1= <>
##$TPNAME2= <>
##$TPNAME3= <>
##$TPNAME4= <>
##$TPNAME5= <>
##$TPNAME6= <>
##$TPNAME7= <>
##$TPOAL= (0..7)
0.5 0.5 0.5 0.5 0.5 0.5 0.5 0.5 
##$TPOFFS= (0..7)
0 0 0 0 0 0 0 0 
##$TUNHIN= 0
##$TUNHOUT= 0
##$TUNXOUT= 0
##$USERA1= <user>
##$USERA2= <user>
##$USERA3= <user>
##$USERA4= <user>
##$USERA5= <user>
##$V9= 5
##$VALIST= <valist>
##$VCLIST= <CCCCCCCCCCCCCCC>
##$VD= 0
##$VDLIST= <DDDDDDDDDDDDDDD>
##$VPLIST= <PPPPPPPPPPPPPPP>
##$VTLIST= <TTTTTTTTTTTTTTT>
##$WBST= 1024
##$WBSW= 4
##$XGAIN= (0..3)
0 0 0 0 
##$XL= 0
##$YL= 0
##$YMAX_a= 752367
##$YMIN_a= -593835
##$ZGOPTNS= <>
##$ZL1= 120
##$ZL2= 120
##$ZL3= 120
##$ZL4= 120
##$ABSF1= 10
##$ABSF2= 0
##$ABSG= 5
##$ABSL= 3
##$ALPHA= 0
##$AQORDER= 0
##$ASSFAC= 0
##$ASSFACI= 0
##$ASSFACX= 0
##$ASSWID= 0
##$AUNMP= <proc_1d>
##$AZFE= 0.1
##$AZFW= 0.1
##$BCFW= 1
##$BC_mod= 2
##$BYTORDP= 1
##$COROFFS= 0
##$CY= 11.3945322036743
##$DATMOD= 1
##$DC= 2
##$DFILT= <>
##$DTYPP= 0
##$F1P= 16.9975609425685
##$F2P= -3.02152046262296
##$FCOR= 0.5
##$FTSIZE= 0
##$FT_mod= 4
##$GAMMA= 1
##$GB= 0.15
##$INTBC= 1
##$INTSCL= 1
##$ISEN= 128
##$LB= 0.24
##$LEV0= 0
##$LPBIN= 0
##$MAXI= 10000
##$MC2= 0
##$MEAN= 0
##$ME_mod= 0
##$MI= 1.114404
##$NCOEF= 0
##$NC_proc= 0
##$NLEV= 6
##$NOISF1= 3.799351
##$NOISF2= 2.8
##$NSP= 1
##$NTH_PI= 0
##$NZP= 0
##$OFFSET= 15.70392
##$PC= 1
##$PHC0= -9793.602
##$PHC1= 13.40088
##$PH_mod= 1
##$PKNL= yes
##$PPARMOD= 0
##$PSCAL= 0
##$PSIGN= 0
##$REVERSE= no
##$SF= 200.130013532006
##$SI= 16384
##$SIGF1= 3
##$SIGF2= 2
##$SINO= 400
##$SIOLD= 16384
##$SREGLST= <1H.CDCl3>
##$SSB= 0
##$STSI= 0
##$STSR= 0
##$SW_p= 3612.71676300578
##$SYMM= 0
##$S_DEV= 0
##$TDeff= 0
##$TDoff= 0
##$TI= <>
##$TILT= no
##$TM1= 0
##$TM2= 0
##$TOPLEV= 0
##$USERP1= <user>
##$USERP2= <user>
##$USERP3= <user>
##$USERP4= <user>
##$USERP5= <user>
##$WDW= 1
##$XDIM= 8192
##$YMAX_p= 0
##$YMIN_p= 0
$$ End of Bruker specific parameters
$$ ---------------------------------
##NTUPLES= NMR FID
##VAR_NAME=  TIME,          FID/REAL,        FID/IMAG
##SYMBOL=    X,             R,               I
##VAR_TYPE=  INDEPENDENT,   DEPENDENT,       DEPENDENT
##VAR_FORM=  AFFN,          ASDF,            ASDF
##VAR_DIM=   8192,          8192,            8192
##UNITS=     SECONDS,       ARBITRARY UNITS, ARBITRARY UNITS
##FACTOR=    0.0002004,     1,               1
##FIRST=     0,             0,               0
##LAST=      1.6414764,     0,               0
##MIN=       0,             -593835,         0
##MAX=       1.6414764,     752367,          0
$$ Real data points
##PAGE= N=1
##DATA TABLE= (X++(R..R)), XYDATA
$$ [...]
2184D951J774q592n826N296Q580n39r381l393P416P002l732q842n74Q588M540
2199G268o015q453K212Q938J987q219o139N052Q018q03q688l983O914O858l586
2214A361q723l89P962M958n389p647J886Q752K623o954o172M540Q616j39q330
2229c045l244O171P189k864p795j428P595N369n116p558J451Q128K394o211o381
2244e345L502Q011L62p745m333N774O787k889p920j461O945M946m640p497J183
2259d320P571K771o669n981L282P376N32p738l824N208O992k425p814j611P203
2274E53M911m101p359J093P622K708n776n904L054P352N20o835l808M794O462
2289E286j734p223j832O161N125l864o781J18P287L267n603n870L104O707J195
$$ y = [4951, 6725, -1867, -7693, -2397, 6183, 5644, -3737, -7130, 286, 7288, 3556, -5286, -5860, 2728, 7268, 1253, -7200, -4988, 3950, 5937, -2282, -8421, -3369, 4649, 3846, -4842, -8825, -1911, 4947, 1361, -7362, -7751, 211, 5169, -220, -7867, -5981, 2771, 5394, -1560, -7732, -3192, 5424, 5285, -3045, -6289, -118, 7071, 4207, -3588, -5016, 2579, 7948, 2832, -4726, -3275, 4853, 7247, 1036, -5345, -1843, 6168, 6530, -1215, -5548, 226, 7013, 4124, -3796, -5257, 1688, 6634, 1994, -5503, -4320, 3251, 6022, -647, -6628, -3346, 4030, 4562, -3176, -7000, -1792, 5200, 2775, -5039, -6650, 553, 5464, 1363, -5996, -4903, 2719, 5427, -349, -6253, -3199, 4153, 4673, -2162, -5970, -1176, 5286, 3552, -3671, -5503, 658, 5783, 1919, -4862, -4744, 2543, 5810, 207, -5663, -2559, 4148, 5343]
2304E343o451l814M726O246r71o914j934N801N121l127o468rO373L304m727o209
2320c710K179O480J264o287m505L674N938j210o878k419N018M975l190o866ON996
2336D65L403m599n770J783O683J638n939m051M299N538l28n967k354N310M695
2351D806k425o220m10O101L143m453n535J771N775J521n693m161L153N783m12
2366B744o352k451M791M723k004o117j93N440L640l751n073J778N729J749m459
2381A94m329L350N909n07n314k468L890N049k066n836j141M811L502l733n395
2396d084R07N278J937m872m563K456N608J64n538k294L585M974j202n485j239
2411d368N318L816k740n266J008N517K156m149m406K621N242N6m942l131L419
$$ y = [5343, -1108, -4922, -196, 6050, 5079, -1835, -3769, 2032, 7153, 4026, -2442, -2451, 3922, 7226, 2499, -3710, -1531, 4949, 6213, -74, -4579, -905, 5033, 3823, -3055, -5474, -456, 4519, 1329, -5537, -5531, 465, 3868, -731, -6501, -4718, 1965, 3603, -2336, -6387, -2088, 3450, 3122, -2845, -5199, 111, 4806, 2381, -3839, -4249, 1852, 4995, 542, -4993, -3222, 2553, 4074, -1619, -5780, -2627, 3156, 2744, -3608, -6059, -1268, 3455, 1451, -4666, -4859, 581, 4221, 470, -4603, -2825, 2904, 4653, 194, -4135, -785, 5124, 4617, -697, -3165, 725, 5774, 3708, -2128, -3269, 1542, 5044, 1311, -4084, -3177, 2101, 4038, -834, -5397, -2941, 2667, 2831, -2707, -5001, -1416, 3558, 2356, -3129, -4368, 950, 4766, 2026, -3240, -2232, 3285, 5441, 1292, -3114, -493, 4749, 4805, -137, -3268, 151]
2426A51M500j791n417j404M584L613l417m725J4N247K091m345l540K003N009L83
2442B956m375k590L423M704o76n368j246M431L384k235m834L05M474K213l915
2457F51m315J530N019K41m722l124L187L587m80n006j462L272L976k323m433L71
2473d031M597K216l243l490J813M604Q93l698k736K795M556n51m367j846L934
2488A446L160j872m742m1L872K056l005m578J432M115O64l921l156K433L503k49
2504A117l996j851L890L346k085l847R2M229K254k653l392J067M462J214l743
2519A04k801K126M176m61m341j840K911L414j986l965o58L260K467k897l629P15
2535c405L893J043k795l159K436L594J37l604j469L226L403r67l493m7L295K548
$$ y = [151, 4651, 2860, -2557, -3961, 623, 4236, 819, -3906, -3892, 1355, 3446, -899, -4439, -2436, 2573, 2956, -1419, -4009, -586, 4118, 3442, -1926, -3172, 1259, 4643, 2408, -2426, -2121, 2353, 4566, 651, -3664, -2134, 2885, 3126, -1596, -4720, -1533, 2054, 1574, -3432, -4894, -1622, 2354, 31, -4402, -4031, 566, 2782, -461, -3951, -2138, 2466, 3359, -339, -3075, -280, 4276, 3725, -642, -2488, 1446, 4606, 2734, -2008, -2049, 1823, 3879, 874, -3704, -2272, 1843, 2507, -1414, -4570, -2137, 1366, 1117, -2879, -4730, -840, 2506, 421, -3426, -3334, 895, 3149, 496, -2896, -1829, 2633, 3847, 104, -2697, -571, 3605, 3144, -1197, -3037, -126, 3288, 1302, -2663, -3321, -61, 2406, -491, -4120, -3405, 488, 1531, -1264, -4423, -1987, 1607, 1744, -1860, -3329, -103, 3300, 2333, -1160, -1207, 2088, 4636]
2551D636j813l631O61M474R50l350k596J448L285p4l718j970K354K802j526l892
2567a960p63K723K598k224l102L8L621R79k854k569J930L419j7l200j567K622
2583c26K935q61l226j072K989K186j853l404K80L568R65k587k653Q47L040J1k799
2600a960j937J992K810q50l222o95L067K026j418l185O02L320J552k377k083J255
2616a103K945P44k792j856K017L161o70l124p09K638K186j645k946o5K826J419
2632C026k378k376N63K976L93k701j717J724K789m19k920j040K246K153j196l151
2648b028J46K798J292k059k424J50L220M37k718j682J378K837m32k826r33K044
2664h00K122j059k546m9K828J498k073j848Q12K827N10k182j616J405K874K2k754
$$ y = [4636, 2823, -808, -147, 4327, 5277, 1927, -669, 779, 4064, 3990, 272, -1698, 656, 3458, 1932, -1960, -2723, 0, 2598, 374, -2728, -2690, 931, 1910, -944, -3513, -1583, 1836, 1819, -1381, -2948, -326, 2609, 1748, -1478, -2550, 439, 2625, 772, -2632, -2352, 1216, 2181, -406, -3059, -2212, 828, 839, -1960, -3897, -1905, 905, 55, -3167, -3862, -795, 1231, -187, -3372, -2770, 550, 2102, -275, -2358, -1103, 1842, 2586, -206, -2062, -45, 3116, 2446, -678, -1387, 1251, 3437, 1792, -1154, -1219, 1607, 3026, 648, -1728, -1165, 1811, 2204, -497, -2214, -490, 2299, 1880, -1040, -2080, 166, 2319, 1123, -2028, -1882, 916, 2208, 149, -2275, -2125, 1095, 1532, -1186, -2868, -1490, 1347, 915, -1911, -2844, -800, 1322, 263, -2283, -2332, 496, 1994, -79, -1927, -1115, 1712, 2222, 40, -1576, -171, 2703, 2725, -29]
2681b9j250K327J987j164k429o39K189J920j669k943K50K880L22j814j882J042
2697i02K297k1k282j026J891K165n80k469l38K428J714j320k145N94K080P47j903
2714I30j618P35K183l66k247j317J360J806j057k458p31J599J326j254k458O30
2730b937J987M64j739j361J066K371K28j921p13J917K047l42j736l86K265J479
2746B689r60j838K70K097L77j582j731J175J642k73k510j105J175J584r35k179
2762b104n97J103J798j374j945O5K479Q10j040j289N71K412L99j388o44J340J765
2779B361Oj742o34J836J459r31k104K89J884K09j383j995L64J341j53j750j310
2796b253R80J541p44j819l02J215J453n61j657j54K273R55o42j521R14K040N51
$$ y = [-29, -1279, 1048, 3035, 1871, -558, -1197, 992, 2912, 1243, -1700, -1450, 1430, 1752, -62, -1944, -902, 1395, 1374, -908, -1934, -43, 2122, 1542, -927, -1265, 1163, 2877, 1557, -588, 6, 2086, 2833, 930, -688, 47, 2230, 1864, -383, -1700, -340, 1466, 409, -2049, -2780, -1181, 145, -1109, -3567, -2937, -950, -486, -2225, -3586, -2520, -149, 79, -1842, -2555, -638, 1409, 1067, -669, -1055, 1210, 2689, 1729, -109, 161, 2258, 2635, 1053, -678, 497, 2139, 1866, -644, -1749, -574, 1010, 75, -2104, -2701, -1598, 200, -1174, -3119, -3054, -575, 235, -805, -2094, -1523, 889, 1288, -100, -744, 596, 2361, 2367, 625, -9, 1827, 3286, 2355, 251, 540, 2424, 2633, 1250, -745, -381, 960, 807, -943, -2253, -1273, 268, -476, -2295, -2597, -1382, 71, -490, -2147, -2301, -28, 927, 285, -1236, -322, 1718, 2269]
2813B269j165p34P66J746o1j452n49J017J467q62k307J11R26R30j735j492qJ132
2831aN22j839j227Q66J382l86j370n64J133J354n67j152M1J511J198o66j016L58
2849d23J644M89j123j046R66J315M5j780n82J126Q44m00j715k42P99R20q88j658
2867a709L78J377R0j196q96N26J241R6j320m64J202J091j41j479J41J170R53n56
2885E04j065K44J309M18q45j022Q18Q33J18r69j131J008Q25k89j406l07R25O68
2903F36q10j011n3J212K45q87j025O29J059K33j394k79P58J102j39j138J8R41
2921I7R26o24p96QJ209O06q93p43L98J062N02j205o04P03J138j68j233p1Q69O87
2941A868o08r98k26O90L31q10p84J39R62J67j335l36M90N66Lq03l14N70R73l57
$$ y = [2269, 1104, 370, 1136, 2882, 2821, 1369, 820, 1837, 3304, 2442, 135, 246, 1172, 2102, 367, -1125, -1133, -1, 521, -1318, -2545, -1679, -297, -683, -2053, -2617, -1484, -130, -697, -1849, -1808, -297, 901, 235, -781, -423, 1221, 1710, 587, -459, 507, 1822, 1867, 87, -495, 631, 1475, 1075, -640, -882, -83, 837, -51, -1709, -1331, 46, 136, -1060, -1956, -1430, -189, -93, -1413, -1877, -675, 416, 275, -1204, -1063, 107, 1060, 504, -561, -317, 992, 1410, 565, -457, 361, 1194, 1312, 343, -788, 220, 1045, 756, -650, -957, -32, 636, -174, -1185, -1238, -26, 219, -668, -1693, -1064, -5, 228, -1166, -1445, -687, 415, 276, -862, -844, 97, 1023, 399, -397, -389, 820, 1426, 533, -210, 188, 1250, 1752, 547, -57, 646, 1784, 1616, 383, 312, 1181, 1868, 1260, 262, 36, 726, 1057, 247, -537, -398, 564, 731, -604, -940, -450, 116, 119, -684, -998, -428, 545, 188]
2961A88j102L14N54J025n84q78M51R58J25j61j155N54R71n54p53m72O32O76l41
2980D48j255q1N14M36m11j048Q8Q73m75k71p61L59J005k2j015K53Q06O43o5p35
3000g14L9J043O68m02n01K20P73L31q21j00M07M76n8q20m69K36K26p4j059l39
3020i38M37K17m10o82k15P71L11q07m42N82O21K58n69J60N30Q11j56l77k6P50
3040H26R20q19n05p6R46N28p48o67J75J70M00j030m54K96M75j80j050l91P09K50
3060b25l26p66K27Q70J2k23l61K29P71K81k33m07N73Q51J22q00J10O69N2p9p47
3081F00J06M60P2p28m41r3L09j65o60j58J03K10j8n87k49K89M54l31m52L28N10
3102d41M09l24J9N70K44oL3j84K86L81M2r18K36K96p2l60l96p%K46n38m18K20
$$ y = [188, -914, -600, -46, 979, 395, -483, -32, 926, 1051, 890, -265, 289, 1260, 706, -47, -519, 113, 789, 448, -807, -888, -374, 62, -349, -1397, -1309, -436, -911, -1182, -1943, -1584, -579, -601, -1616, -1363, -557, 86, 21, -714, -675, 368, 1036, 634, 133, 353, 1126, 1457, 636, 536, 943, 1419, 1361, 541, 72, 308, 534, 460, -599, -938, -501, -284, -694, -1376, -1591, -820, -509, -1316, -1758, -1176, -555, -297, -866, -706, -176, 635, 479, 102, 76, 826, 1746, 927, 422, 346, 1292, 1820, 1072, 405, 580, 750, 1150, 120, -334, -38, 437, 257, -793, -1184, -475, -225, -551, -1317, -1090, -220, -208, -431, -792, -563, 208, 489, 256, -151, 422, 1273, 1395, 595, 705, 1374, 1426, 1347, 600, 706, 1166, 1238, 510, 69, -24, 285, 120, -540, -698, -595, -385, -403, -990, -1239, -950, -496, -827, -1279, -951, -441, -32, -356, -337, 233, 477, 471, 504, 320, 606, 987, 1029, 111, 347, 643, 571, 211, -185, -192, -192, 54, -484, -902, -682]
3125f82Rp7m33K06j11L90l8k47k71O29N38Pl78K39L86L56k03k32Q9L55L62n73
3147C21l21J11K48q1m44q2J53J64l54m47JK29J10m17j97K44J72J36j34j30J93
3168e25N67K56l75K04M02J20K53k47M13j01J94j60j31j96N05j13k97k49k52K84
3188E52l59j41o01K74K34q9o10R6L03l27O5J95J28N93k76r7o7L00N01p0k04M3
3210D43K74K49Lm87j46K06O8j5m10J54n56L20k7n32q2J17m91q8o2K50J43k46k4
3233i39l9P9O10k55l1N3L95Q8Q6Q3N93k88K87J93l95L45J7k63k31jj55K51j94
3256B89j72l37N3l5n77J30k19L51j94o2j23L8K44j93J61n3L61K04j68K57j1M35
3278C79l2j77K19q9J93k2L4M8j59Q5k79M3M4k68J25l17M8j57j28Q2o5k99K45L1
$$ y = [-682, -673, -750, -1183, -977, -1088, -698, -736, -983, -1254, -625, -87, -80, -458, -219, 167, 523, 320, 88, 177, 532, 894, 321, 0, 111, 359, 278, -166, -248, -95, 69, -285, -732, -731, -502, -392, -809, -1006, -762, -590, -454, -588, -718, -525, 42, 298, -77, 127, 529, 649, 902, 655, 1068, 967, 1161, 1001, 870, 674, 1179, 1066, 769, 520, 268, 552, 193, 52, -549, -275, -41, -130, -740, -644, -341, -668, -603, -408, -280, 313, 37, -60, -127, 173, 674, 604, 400, 443, 717, 966, 969, 482, 336, 542, 610, 595, 185, 339, -217, 103, 76, -456, -538, -421, -912, -1000, -1062, -812, -669, -915, -939, -978, -899, -289, -544, -575, -522, -127, -39, 47, 130, 723, 435, 722, 915, 520, 865, 882, 619, 388, 387, 232, 483, 289, 117, -220, -167, -202, -779, -649, -868, -517, -711, -773, -896, -858, -614, -807, -646, -699, -338, -134, -302, -45, -56, 379, 347, 170, 389, 300, 493, 471, 505, 553, 394, 479, 200, 243, 287, 19, 144, -173, -125, -282, -410, -328, -393, -692, -447, -416]
3302d16O8j45J53l5L2M12j18P2q5K36K28q4J52k4j5R3L71j76M8j98J9J4K12j71
3326F43j97J12j28R4r5j44j70N1R6k77j8k77J98n8n0n9k55K80k35J04j6r8J25
3349c74K09k4k2K54l26N64M2JQ9n8j91J42O6j96K91l05j9j95P9K58lm32k8l56
3373e34K24jl05j43P7n3Q5l61N21j45j95L39j42K72L8%J63R5j41N03k71M64P0
3396E60K84m24K75o3N6q6k19L09j03n00j2k65P2j76j13m9n04L07J3k02Kj08K58
3419f88m26O0L66K37O0J48P8m5K47P00k8l20K53O33l50J3J45j25L01l12o2j76
3441G09k18K16m83j19P9k70l01K58o36k6j48L03q3j11J05n2K33J21J35K97J45
3462A54Q7K39j56M65K61o0j28J93J15q6n5j33R3j66j62n12j66P8J26m67m25K26
$$ y = [-416, -348, -493, -340, -375, -343, 69, -49, 23, -62, 174, 402, 318, 470, 446, 431, 524, 895, 719, 767, 569, 588, 602, 814, 643, 446, 558, 430, 524, 429, 285, 115, 166, 262, -15, -33, -310, -112, -170, -220, -279, -534, -254, -489, -385, -401, -499, -374, -165, -189, -211, 43, -283, 281, 323, 324, 413, 355, 164, 306, 372, 176, 467, 162, 143, -52, 27, 285, 282, -150, -178, -534, -310, -311, -616, -759, -682, -735, -650, -1011, -490, -635, -830, -491, -633, -361, -323, -323, -160, -65, -206, 297, 26, 490, 560, 844, 420, 695, 632, 688, 602, 383, 692, 589, 89, 77, -188, -116, -292, -405, -454, -958, -651, -638, -840, -838, -946, -688, -1114, -1054, -688, -451, -391, -243, -165, -210, 37, 737, 709, 389, 642, 1275, 925, 938, 1083, 958, 1259, 947, 885, 709, 491, 707, 224, 105, 184, -86, -387, -129, -765, -791, -939, -636, -719, -830, -725, -777, -544, -423, -288, 9, 154, 241, 480, 324, 789, 1050, 990, 862, 1055, 1170, 1084, 1029, 896, 989, 823, 661, 149, -17, 61, 187, -280, -705, -479]
3484d79j34k64Mk86K16J67j88J60j14J95K85J80j17J25J82O15k06N0k7L15l8O3
3506G04l3o0K84K1Ro48j6J88m33l01j15k32J69k74k6l9J10j89L8J58j16K06j18
3529g13K95p5N4K37Q8r3K85J19K26K36l96J82J5K37J44n37j86M52m66j05J43k5
3551A17j42j26j25j63L04P9R0n81L23J34q4j03K96J43r0L4P6K8R6L81l76J48O4
3574E23j28qK58k96j0J02R9k84n0p0J84j41k40L2J11j86M15l25k56R4K2J29j70
3597a95K54n5o0K56M9q2k1l3j43J16M8p7L08l89K8j3p6J40k7j31J04j35j91l0
3621c55K6N13k10K09o92M78K15k02j22k29N23P1L77n45j8L44k87K1o43K61K98
3642C3l01L4l7m5O3j0j19j58K95J18j7j88q1j52M26J39m95K98K22K88K8j26J61
$$ y = [-479, -613, -877, -873, -1159, -943, -776, -964, -804, -918, -723, -438, -258, -375, -250, -68, 547, 341, 391, 364, 679, 641, 704, 671, 611, 895, 916, 925, 277, 261, 449, 16, -285, -400, -632, -463, -737, -763, -802, -692, -881, -843, -685, -801, -595, -713, -418, -493, -439, -202, -114, -207, 78, 197, 423, 659, 263, 445, 460, 697, 841, 304, 118, 570, 104, -1, 142, 117, -25, -151, -276, -439, -135, -56, 34, -547, -224, -90, -174, -277, 19, 162, 72, 106, 182, 210, 306, 687, 311, 459, 523, 395, 387, 645, 349, 339, 441, 540, 256, 206, 136, 320, 179, -61, -29, 82, -104, 311, -14, -270, -176, -154, -25, -195, 59, 4, -56, 200, 249, 167, 146, 113, -30, 86, 134, 57, 365, -24, 4, -9, -85, 55, 28, -103, 1, -134, -325, -355, -329, 184, -26, 183, -509, -31, 184, -18, -140, -369, 154, 225, 602, 57, 39, 383, 96, 117, -526, -265, 33, -268, -234, -271, -316, -253, -263, -382, -540, -245, -127, -144, -332, -413, -565, -139, 0, -495, -197, 25, 313, 341, 215, 376]
3665C76K16j23m2l74N02p3j6k72j37J40p6J84p28J47R1n2L21q26J35N04l94J35
3687c62q6P3J83o0n0R3L99L05j41R3l17K84J42j10J60K10j60J83j89k17j3q5l07
3710B8J32j22n6J95j63k68Q2l46M47r3l93PO9K31J35l3j26M77l0n14L10K41K72
3733D82j55j85J57M58K0l90j04K12J77j47P9o62k1j20K96m01j23j11jn2R4k10
3755g07k8M34k0n90L14L78K17l41R1j74L78L06p6k4Q2J47J99k47j3K29k00j97
3777A58j54J70k2j41l76K59J00Q7n17Jr6J70p7J0N1R5k38LN3Mn1O49K63l52m4
3802EJ38J40R2J83j96j35K70J19m47J12J31n2l00o9k0K12M0k95k35n2L66Nj85
3825a73j1N2K64k00J1n6J81M64k21j04l18M77j5M0j93J08J66k51M6j43K44k1J93
$$ y = [376, 592, 469, 427, 53, 555, 482, 466, 194, 57, 197, 121, 305, -423, -276, -185, -237, 84, -742, -607, -103, -497, -362, -448, -375, -192, -252, -302, -209, 190, 495, 354, 447, 130, 414, 556, 446, 606, 816, 656, 839, 650, 433, 420, 335, 28, 160, 38, -18, 177, 14, -254, -172, -518, -71, -164, -557, -550, -481, -250, -115, -148, -274, 203, 173, -341, -31, 210, 482, 327, 142, 299, 757, 777, 387, 283, 495, 672, 525, 604, -58, -79, -199, 97, -304, -427, -538, -539, -591, -497, -707, -735, -301, -321, -911, -597, -219, -2, -343, -252, -426, -48, 258, 182, 158, 240, 387, 586, 339, 326, 555, 355, 158, 4, 174, 152, 11, -365, -106, -6, 81, -436, -435, -531, -361, -438, -428, -377, -282, -520, -517, -464, -460, -511, 138, 401, 49, 5, 143, 283, 375, 558, 362, 227, 497, 616, 169, 281, 412, 360, 60, -9, -29, 183, 223, -72, -307, -359, 7, 12, -173, -184, -132, 132, -68, -57, -113, 68, 532, 311, 207, -111, 366, 351, 391, 198, 306, 472, 221, 267, 124, 368, 347, 540]
3848E40k49j38k01m8L56n24k21L55j02O5j25K94l7J69J17m90M87k63l3M5q7K89
3870A99J85j61j68J36J82l5n24L14P2J59k47j07j68%R6P6j46j44N6J0l15L94j69
3893c05j20K32R2J53j68RL62l90J25k6n8K44j76j57J30K70q7J06k47k37Q6J21
3915d1k58k6K97p7l80j9K54J10k43J26k37J60M73l11k19L28J1R4K32m59J47L47
3937C09j95m9K02J13J15k02nm07K32L18j35j16r0K68l2l31k57J23L96j43k39k2
3959a47J86j61Q9J42n40N03L36m45k2RP0J02R5m75N09K41nl8j41J60k62L34l69
3982A71RJ94j66n7p2j72p5R1J93k94j17r6j76L26L4j74Q2J68J6l83M27j4j73j40
4006c98K25l3K84k2k86M12p2L26j92j50K23k34J60j37r7j02K15K00l48l48L59
$$ y = [540, 291, 153, -48, -96, 260, -264, -485, -130, -232, -167, -292, 2, -35, 134, 251, -239, 248, -15, -48, -3, -90, 199, 384, 223, 55, 191, 373, 338, -186, 128, 200, 359, 112, 5, -163, -163, -67, 9, -137, -281, -225, -215, -530, -136, -305, -425, -193, -101, 52, -116, -107, 255, -135, -10, -36, -94, 150, -26, -183, -53, 217, 130, 236, -11, -248, -162, -41, -299, -325, -28, -105, -485, -504, -250, -140, -383, -257, -494, -334, 139, -172, -391, -63, -52, 42, 274, -185, -38, 309, 114, 65, 267, 380, 495, 293, 288, -119, 113, 431, 296, 180, 90, 358, 326, -5, -262, -139, 257, 114, -125, -147, 39, -122, -33, 109, -431, 72, 408, -37, -59, -50, 20, 122, 217, -258, 251, 492, 487, 449, 308, 468, 206, 540, 171, 180, 374, 208, 151, 79, -93, -168, -77, 116, -178, -295, -391, -567, -241, -207, -381, -299, -131, -115, -498, -71, -85, -258, -398, -173, -206, 78, 56, -230, 182, 110, 436, 244, 94, 317, 83, 243, 106, 9, -93, 122, 322, -26, -374, -15]
4027a5k47J42p6k84k69O29l9k86q5m3R7n8L40j72L51p0J22j55K79J94q2q1N3K86
4051E31J4n01K16j26K25j05k50M3p6K02k91j77qJ25k19O0k8k56J80K98j76j57
4073d76M47Q7p7k25Q9J9L50pp5n9K50K97n3pP4MP0k06m39M1K35r3o2J58j65L6
4099B13k02l48R9o3m4j50N7K70j76L23p2o04K25J34L03n7oK60o1p7K13K43l36
4122A44M97r9r1r2pJ9l40O3R5k60P2l97J03L30m55pm23N18k93K92n9ll18M98q0
4147b93j74O3K96j10K25J65J05j48j1K69k46J06j0L30o6k73l70K29j06P2j48j46
4169b41q3O6j60K68k29k2J7k63K84J87l37K90J0L9J5O2J1L22j81L3p1K78j21L75
4193E49l30L10k2n33L9J6K45k32K95j03l0j79K5p8J51k75K5k16K13k60K76k66
$$ y = [-15, -262, -120, -196, -480, -749, -120, -159, -445, -530, -573, -476, -534, -194, -366, -15, -85, 37, -118, 161, 355, 273, 192, 245, 531, 545, 44, 260, 134, 359, 254, 4, 47, -29, 173, -118, -295, -303, -178, -397, -337, -365, -621, -441, -143, -319, -476, -29, 58, -19, -244, -155, -136, 214, 207, 132, 73, 323, 620, 567, 560, 634, 638, 708, 502, 63, 104, 339, 246, 184, 342, 177, 213, 11, -337, -238, -301, -345, -495, -438, -168, -344, -21, -93, -697, -472, -338, -35, -92, -98, 162, 101, 24, 237, 480, 144, 641, 542, 451, 359, 352, 371, 31, 94, 189, -71, 1, -396, -293, 37, -418, -425, -848, -330, -623, -331, -390, -393, -711, -213, -293, -467, -404, -108, -218, 7, 172, 277, 129, 118, 387, 141, 247, 237, 567, 501, 228, -142, 87, -19, 53, -95, -241, -324, -258, -418, -150, -379, -401, -384, -647, -363, -176, -513, -223, -213, -174, -159, -97, -86, 236, 55, 88, 17, 295, 174, 549, 219, 529, 507, -26, 13, 29, 274, 42, 337, 234, 204, 25, 50, -28, 123, -152, -127, -343, -130, -390, -114, -380]
4215c80J22K00J46K12j88P4M0n1q5KJ88K15k52K8r2j2L41j64k50R7k44J56J80
4238B83l72J84n0k07j84O3j99K96R1N3k54L6J27QO1j23K89l33L60p2J62j98J83
4261B04J09j32j70J82j39l1N5l16M05l87j66M17k13K38j43j94K80j98j19K00k19
4282c37L78j46P7k08MN1J84o8j51L04q9K71j76J72k95j66K30k01K56l43M31k6
4304A52k82l61N70l9p1k32j7L88Q5l36M4k5J96j16j53K49J85P2j18J02j95N2K22
4327C72k34J44j64J14J07j10J16j16q3O2m8l25K34j35j48J68O0kj68O5k13K00
4349a04L9J21P2k32K91k48M70k54j32M12j17K19k73J7j73K89k46L11l11r6j01
4370d6J35j49k38J42j2k12J64J62j06r6J77R2k97K40K08k14j58J91Q0p6Q0l2J7
$$ y = [-380, -258, -58, 88, 300, 112, 186, 226, 175, 90, 92, 280, 495, 243, 271, 179, 167, 508, 344, 94, 191, -53, 103, 283, -89, 95, 45, -162, -346, -283, -482, -186, -95, -42, -296, -260, -133, -125, -64, -187, 102, -231, 129, 57, 219, 21, 204, 313, 181, 11, 193, 54, 23, 78, -238, 167, -220, -386, 31, -182, 56, -87, -281, -1, -199, -318, -118, -337, 41, -105, -28, -236, -232, -181, 3, -65, -216, 88, -1, 270, 94, 266, -29, -195, 35, -166, 90, -253, 178, 152, -130, -491, 79, 40, -31, -263, -280, 108, 193, -143, -99, -124, 72, -44, -197, 52, 237, 309, 191, 293, 98, 150, 372, 138, 282, 118, 232, 339, 229, 345, 229, 146, 208, 160, -165, 69, -66, -214, -46, 14, 12, -156, -91, -304, -104, -65, 56, 128, -104, 187, -61, 409, 155, 23, 435, 318, 537, 264, 281, 108, 397, 151, 462, 151, 55, -46, 89, -60, -298, -156, -168, -380, -216, -54, -160, -256, -79, 13, -284, -44, 164, -50, -208, -17, 63, -13, 67, 35, 52]
4393E2N52k70k75J03j14N2q4M19l88j22m02N76l05K1o1j39N30n48L14r8Q9l32
4415d30r4L21Pp3KM24j3j95K38k59O64n74k7J0j52L00j23k44N90j91K13m30K7
4438in7N43n88m9j45Q2Q6k02M56k11J58k67o4J10K0O6K8J48J66k57J31K71n40
4461a24L88n2q2L56j34K1k14O9j93Nj82L10K5K0Mk28J64l9k06K74k33K46P1o49
4485c83L87M6r8K24k54N6Q4J64j97o0K60Mk45L65j31j63K06k88N0l97L97R4k35
4508a14KJ70J25l20jM9K28r0k00j40M8K61j49j87M8L23l20L2J32K11k63J09j18
4531a64L03j28k59K55lj33J91j48Q6J92l96K02M9k67J60k30K82n7K6j82k82M81
4553b2N7J64k94k04M55K02l92j52K48j18K09k51K15j64o6K26qj65j58J26J80j15
$$ y = [52, 604, 334, 59, 162, 48, 100, 16, 435, 47, -75, -477, 99, -206, -185, -246, -385, 145, -403, -89, -187, -98, -430, -524, -203, -196, -269, -267, 157, 144, -51, 187, -72, 592, 18, -9, 1, -151, 149, 26, -218, 372, 181, 394, -36, -9, -66, 477, -111, -160, -305, -223, -137, -339, 117, -94, 64, -203, -267, -157, -137, -71, -43, 105, 271, 14, 145, 416, -124, 264, 212, 130, 486, 352, 373, 159, 228, 35, 40, -142, 168, 193, 213, 217, -11, 153, 114, -92, 182, -51, 195, 266, -383, 4, 50, -48, 176, -78, -22, 62, 226, 29, -31, 229, 233, -12, 353, 222, 59, 265, -23, 27, -370, 27, 121, -114, -112, 58, 183, -137, -138, -89, 139, 49, -151, -291, -243, 18, -131, -318, -270, 53, -267, -235, -103, 108, -155, -46, -164, 139, 11, -248, 7, 4, -129, 62, -86, 0, 192, -204, -2, 47, -220, -60, -290, -8, -65, -39, -221, -503, -22, 35, 199, -95, -299, 156, 358, -34, -186, 62, -56, 153, -98, 117, -47, -113, 113, 105, -60, -218, -92, 88, -27]
4575b7K6m5L0o9L0J40k04O3Q8l6j41o6K81j46Q6J2K23j93l62M94k41L18m38L31
4599A54k36M78q9j93k21j21L69k79K99j48M5L14j29k84J56m30N87k60K1J24k79
4620a22K40m6O9k99K74K6l7l06K25J47j77J97l51L90k56j86L27k79K87N6l68J81
4642hk05M40l0k63k9j93rJ63j91j56P80l98J18J82n01L12M2n4N0k35O98l30r6
4665H7N9j66m1J85pk89L20L7k54K3j63j71L40J5k41J69j65k6N24k61j98J45j13
4688a91J57NJ2k28K65q5K55j19j87K57l56K45J27m39N88k44q0L56j28k25m0J98
4710A43j01K84m56K01J08k2j29qR8k27M16j31m38L07M6P6j49Q3m04L87n8K97l27
4733dR3J57o6j2M8M9j69P7j02L23k38J41j63P9k00j45L55k76Kk03L99j15k54K55
$$ y = [-27, -1, -46, -16, -85, -55, 85, -119, -56, 32, -4, -145, -211, 70, -76, 10, 22, 245, 52, -310, 184, -57, 261, -177, 154, -82, 396, 307, 114, -107, -228, 141, -138, 161, 13, 58, 372, 243, -41, 115, -315, 272, 12, 33, 157, -122, 118, 72, 141, -158, 116, 142, 105, -201, 24, 171, -6, 191, -160, 230, -26, -212, 115, -164, 123, 179, -189, -8, -213, 227, 197, -66, -95, -288, -297, -134, -325, -481, 299, -99, 19, 201, -300, 12, 54, 0, 50, -185, 513, 183, 87, 146, -20, -61, 124, 117, -172, 148, 185, -69, -46, -209, -380, -40, -25, -266, -97, -262, -288, 236, -25, -223, -78, -191, -34, -29, -17, -245, 20, -65, 190, 71, -116, 141, -215, 30, 157, -282, 306, 62, -18, 338, 210, -15, -55, 143, 42, 326, -130, 71, 179, 157, 28, 20, 118, -109, 307, 176, -262, 45, 91, 167, 18, 101, -303, 84, 26, 323, -4, 89, 246, 180, 168, 216, 265, 96, 173, 71, 394, 156, 297, 134, 213, 13, -132, 223, -53, -51, -254, 145, 30, -224, 31]
4757C1p2Kj41RJ65kQ9j27o1j1r3M09o9k93rM14k55p9j40N29l58Q6j34j93L50J86
4783B33n58K30J48l38LM22m06J13j59k0J82O2qk6m29K0M66J5P4l39J47j18L84
4806I8q6j56L31k04L98m32l7J57r9M57k51P7j22k45L68j61j74j13K91l27M9Q4
4828i7J83q4J5r4j51k9L14k56M1K1Q2J09q1k5K55n8j38O7N7K28j36n0l68K44R7
4853A46j31L16k34q8J33n4J44k26J22j5j18Q1l41M58j21J23k82n4q2K13J56j05
4875D1l2j99M58l9j79Qq6J0M01k26r0n6M31m01k04L64k30K8j32j46L05m7m7j34
4899b02Q7p0K19l53J91M66k77k65K03j11L99K8k69o8M3J03K94m73R4Kr5J14l1
4922B9k54L57L9k87J42k76J42J86j29p5j65J5J59p1J1J41P7J58k53P5Q2j18ll
$$ y = [31, -41, -39, -180, -171, -6, -8, 81, -46, -107, -118, -211, 198, 129, -164, -173, 241, -14, -93, -233, 296, -62, 24, -110, -303, 47, 233, -325, -95, 53, -285, -282, 140, -266, -153, -312, -332, -150, -88, -96, -122, -551, -531, -65, -50, 24, -315, -168, -286, 98, 12, -144, 187, -17, 381, -51, -88, 69, -30, 427, 176, 253, 131, -114, 254, 93, -81, -194, 97, -230, -181, -97, 86, 2, 17, -77, -228, -257, 57, -199, -158, -137, -55, 54, -27, -52, 203, 145, 7, 74, 131, 359, 223, 173, -195, 49, 146, 15, 331, 97, 9, 142, 88, 232, 6, 128, 113, -5, 76, -265, 193, 72, 195, -87, -141, -223, -10, 146, 41, 9, -190, 268, 229, 50, 58, -28, -18, 383, 157, 67, 11, 442, 41, -163, 201, -29, -1, -133, -279, 26, -21, -68, -202, -115, -185, 34, -319, -128, 338, 61, -204, -1, -112, 287, 315, 46, -22, 21, 124, 418, -55, 39, 41, -54, 60, 29, -225, 132, 171, -116, 26, -250, -108, 78, -51, -126, -291, -276, -117, -188, -177, -36, 41, 199, -54, 21, 103, -15, -18, -21]
4946b1M16n07J60j18K07j40n8K9j16J27K18r3Oj3j89J90J52j01j44O0n7K29j24
4969A13k01P2L15l05j71L0J13K93l61J50R8K21k00R3l95J84k10K06k35J36R9K34
4991B79k57j82K25j59J67j10j94J45m9J69L2O6q5j35J39J1k82J75J1R1j73j47
5013b63P0K21K46j19m06M45k7j31j64K00j85J20k9O1q9p2J15N4k05J58q3L8j40
5036a85K4K80j62J6mk16L93J35j73J49k88N2jo6k85K67J58k60m7M8j74J33kJ0
5060a98J6L53l25J70l64K76J92N0l29L9J97j95J89k13R7j62J24l3jJ12J44l88
5082b49J14L0K9K67P1m90L95j99J00j97J95%j71J11J84k15J76j97K13l25j04K85
5104B3N9p7k5J22j77J72j9q0P4K35N1k9k44R2j55K78N1O0l32O0k15J25j90L48
$$ y = [-21, 395, -112, 48, -70, 137, -3, -61, -32, -148, -21, 197, 104, 110, 97, -92, 98, 250, 149, 5, 65, 8, 237, 113, -88, -16, 299, -6, -177, -147, -34, 259, -102, 48, 146, 367, 167, 260, -135, 49, -161, 45, -190, -54, 45, 279, 22, -160, 65, -94, 73, -37, -231, -86, -135, 34, 66, 132, 47, -88, 51, 62, -220, -45, -34, 57, -116, -263, -193, 28, 274, 155, -251, 194, 167, 36, -128, 72, -113, 7, -22, 39, -50, -122, -7, 47, -158, 0, -83, -45, -185, -161, 119, -43, -27, -31, -247, 146, 281, 108, 257, -31, 21, 20, -46, -331, -64, 94, -166, -213, -165, -339, -206, -208, -198, -182, 171, -154, 16, -348, -72, 120, 170, -159, -120, 77, -118, 71, -142, -45, -207, -83, -116, -117, -5, 139, -249, -135, -105, -76, 191, 262, -228, 167, -32, 68, -129, 66, 66, -105, 6, 190, -25, 151, -46, 167, -158, -262, 23, 82, 5, -20, 102, -75, 97, 78, -2, 72, 307, 358, 329, 85, 177, 22, 300, 351, 411, 79, 139, -76, 49, -141, 207]
5128B07k46K35j04o9j79P0M10k75rJ20k82L5J89l7J28j57j93j09p5L94L5k12L8
5151h6p0Q0J56m00K38L73l84j11k9M55j28k53q7J58j70p4J39J15j72K52K33l63
5173a28J4P2n9j09P2J71r1o8N5J6q6M5J31L3N6k74P4j47K44K08k62K79l25qk27
5198c14N62k19k21j86L89Jp1P6j73K57j50K29k14L3j10J59l31L55j50Q0J57n8
5220A01L7k87K34j07R3k02K1M01k15p9K26l47K30k45N2j95K57K75n1l60K42J9
5242A00oO3K1J03k29J11K2K00o85O54l58o7J30k26L64K7l00M5K07j18P4j35J13
5265A10J7J37j66OQ8j51l5N5j40J30m4J05R4L8j19k68QM64o69K95R4m0N7n2r1
5290g7j13J38m6j03Q1k9K36l21N1L4j22J08J91J73k24j0k34L22p3j11J16k66N5
$$ y = [207, -39, 196, 92, 23, -156, -86, 324, 49, 40, 160, -122, -87, 102, 65, 193, 36, -157, -266, -341, 53, 88, -124, -86, -156, -76, 80, -320, -82, 291, -93, -204, -233, 222, 94, -159, -246, -88, -258, -332, -193, -78, -250, 2, 235, -128, -114, -42, -101, -210, -138, 33, -58, -126, -71, -55, -141, -96, 35, 68, 124, -150, -76, -223, 21, 229, -33, 246, -79, -87, -314, 248, 29, -192, -378, 11, 12, -59, 17, -156, 101, -49, 180, -34, -1, -111, 48, -283, 72, -78, 2, 159, 101, 138, -149, 85, -22, 71, -131, -110, 291, 76, -3, 223, -124, 106, -139, -87, -282, -25, 250, 199, -161, 81, 100, 94, 157, 178, 281, 52, 163, 185, 385, -300, 354, -4, -71, 59, -167, 197, 224, -76, -31, 176, 58, 132, -3, 110, 127, 264, 98, 104, 192, 41, 6, 61, -79, 51, 7, 112, 206, 244, 125, -143, -135, 329, -340, -45, 49, 9, 66, 14, -77, -190, -52, -98, -201, -120, -149, 87, -234, -183, -149, -271, -163, 28, 201, -23, -33, -267, 55, -18, -129, -13, -279, -224]
5313b24K84J95l55j93J38R1K96oj48k71P5J47J89l80L03j02M8j19k3L7m0K50j70
5336B2j8L4k16P7o3O6M7Q9kK10l60M76k54j13J81K18l20j39K43M3j10q1K11k54
5360a3l6k4%K46m07L89p8k26J95j70j60K29J12j42k06m3K53nJ88p3R5j4j23n8
5384g1J38k29J4J23J71j20j31J16R7j98J74k97K16k23J67K95l84K68j92K31l0
5405A35P8j89mQ1L41m17L5j21Q2l90R6L50j67l8R1P7j34Q9p3j07K32j11k6J39
5429D9J38k57n2L41lm89J04J15r2m5K4J34j76L29J89o61K71j22p0K79j24j35J81
5452g2J0k02J37k8K76o3K06m03K12Jl73O1K41k3LR0P2o7l8K66p5m08J71N2L77
5477D23n12J48J93j90K46l79J57K14k97K71r9K60m85M12m0l95L16j51Q3k74M2
$$ y = [-224, 60, 255, -100, -293, -155, -64, 232, 226, 78, -193, -118, 29, 218, -162, 141, 39, 87, -32, -55, -18, -58, 192, 22, 4, 38, -178, -101, -164, -98, -51, 38, 36, 246, -114, 362, 108, -5, 176, 394, 74, -65, 178, 221, 111, 30, 241, -13, -49, -73, -73, 173, -234, 155, 77, -149, 46, -124, -284, -55, 57, -85, -291, -334, -81, -86, 102, 29, 124, 110, -13, -71, 67, -162, -148, -25, 146, 26, -105, 11, 108, -90, 84, -213, 3, -220, -53, 242, -142, 126, -66, 165, 135, 213, 24, 20, 101, 442, 25, 60, -61, 21, -369, -273, 77, -90, -128, -37, 40, -94, -5, -78, -185, 47, -64, -90, 49, 187, -70, -122, 219, 216, -273, -169, -54, -146, -191, -167, -33, -209, 120, 309, -352, -81, -203, -273, 6, -118, -253, -72, -62, -264, -127, -155, 121, 58, 264, -139, 73, 74, -299, -238, 3, -20, -17, 73, 145, 78, 40, 306, 231, -177, -6, 46, 423, -89, 59, 252, 62, 308, -71, 86, 300, 3, 274, 175, 435, -50, 362, 322, -73, 243, 92, 175, -99, -57]
5498e7O3K6L2J50k22Q0K07n4n01L10j38J38J75k43K8p0J75j7k34j05L19l59J50
5521a47K27j01j04J5P9J33r1k38L3L15j24j20j00J4K85o8j03J65l7q6l8L0L73
5544C12n42J62J85k33N7J12o5q5j71J55p6J53k48N21l03J96k37L18l78J66r5K97
5566B01j40j04L20l15O1J65p2%J30n79L52J04k56N7J51P5l20l21O28j70l13M68
5588A22n07J25j1J73k65M47l4J23q2Q3m41L19l31K36O3L88l41k70j28M74j71J53
5610A25l36M77j6m40J00J0O0P1Oj29N1J94J61l77J91j61j55L27j33o2J30l13J34
5633h5L69m36K94l01L67k33P8m9K98R1l81j76J18mQ2nL2J83m24J24J15j33P7o2
5657f1m2K20O2r2k8K4p0k62M46l25r4J57K5J69j82Kr4K70j85n0J89P3j72Q3r3
$$ y = [-57, 6, 32, 64, 214, -8, 72, 279, 225, -276, 34, -104, 34, 209, -34, -6, -76, 99, 82, -152, -257, 62, -297, -147, 80, -21, -125, -110, -31, 102, 11, -227, -194, 121, -3, -123, -223, -209, 76, 8, -95, 70, 33, -53, -91, -61, 312, -230, -68, 117, -116, -59, 53, -12, -97, -268, -113, -189, -36, -284, 237, -66, 130, -107, 211, -167, -1, -96, 201, 61, -43, 277, -38, 23, 188, 116, 116, 246, -333, 19, 123, -133, -76, 75, 150, -170, -491, 137, -33, -346, 122, -385, -260, -271, -98, -363, 84, 50, 173, 91, 174, -267, 52, -279, -43, 20, 408, 67, -203, -331, 143, -28, 125, -211, 266, 250, -190, -90, -80, -20, 51, 57, -72, -21, 173, 334, -43, 148, -13, -168, 159, 26, -36, 94, -219, -85, 284, -152, 142, -159, 208, -25, 53, 4, 302, 393, 12, -164, -46, -50, 32, 27, 59, 242, -182, -58, 57, -76, 1, -61, -103, 117, 179, 87, 59, 83, 13, -249, 197, -128, -222, -65, -40, 129, -53, -51, -145, 125, -60, -110, 79, 152, -20, 63, -30]
5682c0J47k03J60K12k24k35K54j24K35l89LJ10jN6J96m74L58j00J01l4lj85L26
5705A56n01L92k98J22M40o86L92J80j56j92j03L22J31l6r4l58J30R5R9j21k9N97
5727D82m09j42O1M4K75k68K41j38m19P02l03J8Nn70N70j52Q8K7r1P7J85o55K49
5750a23J16j66M05k55p1K18j59l8K55j48k94L11k1k4p8l9K21M3k15j06K55K33
5772C20l98P2K92J9l18j94L28k76M1L17l95j2M04j17k72r2K83J44J00n57J84L6
5794i1J08K5r0j4n5K94l99M5MK18q7K54l90P0K37l7J54j06J7M9J92l78j66L96
5818B50p5j20j61K25J01j08l00l0J46J2j71L99n14K10j00J40l9o5n5K99J7l76
5840c15K12NJ75k47p2K57l14N58k59m90M26r0J91J8n6j28m6J21L07l58M08J05
$$ y = [-30, 117, -86, 74, 286, 62, -173, 81, -43, 192, -197, -194, -84, -85, -29, 167, -307, 51, -49, 52, 18, 15, -170, 156, -345, 47, -251, -129, 311, -375, 17, 197, 41, -151, -254, 68, 199, 163, 69, -289, -159, -64, 35, -86, -115, 482, 73, -69, -8, 36, 311, 43, 284, 146, -273, 429, 126, 144, 149, -421, 149, -3, 85, 112, 21, 98, 283, -372, -123, -7, -173, 232, -23, -94, 124, -35, -73, 182, 34, -260, 51, 30, 6, -72, -111, 110, 153, -62, -168, 87, 320, -78, -6, 286, 305, -13, -207, 121, -155, -114, 203, -192, -204, 200, 83, -189, -281, 2, 146, 246, -311, -127, -91, 17, 42, -48, -62, -117, 177, -222, -177, -173, 45, -42, 212, -178, -108, 129, 92, 246, 140, 157, 206, 398, 20, -146, 250, 175, 55, -106, 119, 220, 112, -188, -218, -72, -60, -231, 168, -346, -136, -236, -96, -135, -200, -255, 44, 61, -315, -103, -98, 77, -170, -242, 15, -299, 259, 0, -490, -64, -154, 37, 55, -1, -129, -175, -54, 253, -105, 303, 408]
5862D08m71J87j7r5K18l56K93K14m09J70l22K27J34j44o6PJ19K29k39q5j74L53
5884A81j71K02k24o1m6J37k02J05J10k48R1k02L95j33K33l69m4J86k62M46j18
5905Fk59K18j33m5j38K99l77L99J3n4j48P2J06K2m26L10j98L63j57O4j25K28J22
5928A62l70L3K9M07O0j87l06J5l9K65rL8p2J00j38L19m29L64R0j40j98K27n8j17
5952D6J77l37J7K36j50k7K02k33J87P8k27J80l92J75J67l18K48J78m01J06k3j12
5974b23L8L18j70o8j46M0j08J42J87j0k2m1j43l8L53k06k7J58r6M22n37L72k61
5997f6j72L85k32J38m8j6L08o0k32L0n2K15k78K13P3K1J26p3k18l7J81R2l09l6
6021d7M14l93J86lk44J34nJ65j17j76r2J74O5j78L88k08k54k71nJ07M74l11k78
$$ y = [408, -63, 124, 107, 12, 230, -126, 167, 381, -28, 142, -180, 47, 181, 37, -29, -22, 97, 326, 87, 2, -172, 181, 10, 212, -12, -73, -119, 18, -184, -79, 31, -217, -126, -328, 67, -66, 167, -202, -246, -60, -322, 124, 6, -253, -35, -168, -213, -351, -52, -429, -30, -17, -71, -219, -147, -41, -19, -445, -135, -333, 30, -127, -63, -188, 40, 162, -208, -175, -146, 261, 321, 134, -172, -157, -196, 69, 60, 98, 26, 126, -12, 307, -122, 242, 332, 192, -6, 221, 163, 46, 223, -114, -97, 139, -11, -38, 164, -69, 118, 196, -31, 149, -243, -68, 99, -219, 29, 207, -194, -88, -111, -223, -185, 133, -37, -105, -251, -211, -319, -177, 10, 0, -22, -63, -206, -244, 109, -97, -124, 34, -62, 360, -177, 195, -66, -238, 147, -85, 53, 5, -11, 297, 237, 5, 35, -17, 198, -80, 133, 206, 227, 353, 280, 62, 25, 206, 298, -11, -47, 367, -26, 160, 157, -87, 47, 42, 207, 90, -86, -178, -4, 61, -117, 271, 63, -191, -462, -467, -360, 114, -197, -475]
6044d75L20K10M4l74R2l07P7K43J77k19R2k05L15n2N6j6j29l0j98K10L09j77j78
6067b15k4J70J47j44M6K03M9k42J86J55m37q7N51k50q0R3j2K7K10m22O2M36m43
6090b1L40k68j28M65j90j03j22N3K67l5l42M7l42K75J59M0k44j18K80k08J58k6
6112f3J71j03J10k07m6J5j20M2j03m6M62k69J65j8o7j56J14Q7J08L2l05L5J69
6135Gj63j11K29Q1l2j64M08k59P9k0J6Q7p3j60K11j74K49j70J12M6k01L69k06
6158A61k26K87J34k43P7J34j44P6k76K29K8k14j78K67k71L5K23q0k24K22j12o1
6180a56K21j59k9J23m23K2J74J22k1J13k82M7K72l76K69j34P6j27K33j62L27l00
6202a70J07o3J95kj79J36o7J43k51M14k86j60J38J95k53J64p9rl2K02j37K48L7
$$ y = [-475, -155, 55, 99, -275, -183, -490, -413, -170, 7, -212, -120, -325, -10, -62, -6, -22, -151, -181, -379, -169, 140, -37, -215, -239, -69, 78, -66, -20, 183, 232, -10, 176, 331, -106, -193, 358, 108, 28, 121, 109, 136, 346, -76, -14, 422, -21, 319, 51, -77, 388, 198, 95, -27, 26, 293, 258, -84, -37, -379, -104, 55, 95, -149, -267, 13, -195, -37, -63, 108, 5, 115, -92, -138, -123, -243, -201, -304, -350, 112, -157, 8, -10, -77, -233, -119, -32, 76, 108, -197, -162, 7, -156, -267, -38, 43, 11, -153, 255, -4, 75, 55, 71, 158, 85, -75, 136, -38, 211, 41, 153, 199, -2, 367, 161, -65, 222, 356, 113, 190, 324, 180, 256, -20, 209, 237, 23, -155, 112, -159, -124, 99, 19, -205, 17, -95, -156, 65, -94, -123, 0, -423, -401, -227, -105, -126, -13, -295, -248, 24, -352, -83, -217, -141, -268, -35, -197, 130, -170, -63, -126, 69, 67, -112, 24, -43, 100, -151, 263, -23, -183, -45, 150, -103, 61, -18, -27, -59, 143, 6, 254, 291]
6225B91j88k2L68j64j19j48l49N61l24L0J83K30l64L39j83o4j07K05l74M23j17
6246A07j57m6J65NK1k71K20R1r5k24l12K48J22j54M14j17k53K09n0r6p4J11j74
6269c10K73j4j55n1Q7J72M1k7n4k4O9j37K43N9o1j70J41j1r8KK71mj03l1k2j53
6295f7o2J57L16m38K87m91K01J49L15l74JJ83n2j3R6J02k00j38J86p9m76M19R0
6318A12k41k02J51Q4K2l02K56o2Km4k07N44J39k41k47M15o61O03l39K26p3m61
6340e26L84K38l97J17J47j6J77j14K01j29O0P1m27L29P8k13K52r8j79Q9j86K55
6362A13l47L10k84K91k9J49j04J9k05L4j90N3K58O4k19K32k74K97j5P8n2j17R
6385G1l32M31l33L90k56K5M1p3J60L61k75q6P1p5j32J60j69j0o5j55J7J77J96
$$ y = [291, 103, 81, 449, 285, 166, 18, -331, 230, -94, -64, 119, 349, -15, 324, 141, 77, -30, 175, -199, 224, 107, -50, -96, 69, 74, 95, -176, 44, 135, 40, -184, -496, -248, -126, -280, 134, 17, -236, -27, -77, -173, -247, -136, -310, -37, -51, -206, -257, -170, 2, 43, 16, -38, -62, 7, -130, 113, 172, 111, -59, 82, 71, -27, -25, 246, 242, 139, 108, 86, -67, -129, 28, 344, -94, 193, -298, -97, 52, 367, -7, -6, 177, 125, 112, 208, 310, 110, -28, 158, 79, -397, 22, 112, -129, -331, -180, -96, -74, -376, -120, -182, -180, -224, -431, 113, 252, 11, -236, 179, -482, 121, -218, 8, -65, -526, -142, 96, -301, -184, -37, -53, 124, 10, 211, 82, 142, 213, -214, 115, 193, -20, 232, 134, -45, 44, -142, 113, -234, 76, -208, 83, 54, 203, 99, 118, -87, -53, -243, -190, 68, 132, -87, 145, -129, 168, 153, 231, 179, 62, 71, -261, 170, -163, 227, -29, -4, 37, -36, 124, 485, 210, 124, 195, 120, -12, 148, -21, -31, -96, -251, -234, -57, 139]
6408A39j65l99J58J12J64k51N2L73J25l90K54l04K19k05K04l36L75M1l7j8p6j14
6430g9k03L71k65J50J06M5k1j74R1QJ0J21m56N85m46o8L89l5l45k5O35l91k46
6453b43L4M38m39K21L9J0j83J01j90R9K17r1j60K2j57r0O25o85L80m11K73J92
6475BJ59k73m3M63n5m40M6k23L60K27k07j65K48J29o1R6k92J56Q1j7j94J20k29
6498a12M48m67K59J43j44q2J62J15k22n3L2oq9L3l5j6j73k4K16J31o6j86J05J52
6522A21K7L9l82K07j39m9j33J90j39K38k47K46J21j77J30l45M01k35J78k47o1
6543b56Q8j07K9J05J16J2J49N8j57j2L0J08j08K13r9j9J8r8K01j58P4j83K43k12
6567C5K42Q3l14R5J5p1j74J90L7J28j51j72p2l3K36o5j09k57K22L8J07j25J53
$$ y = [139, -26, -425, -267, -155, 9, -242, -190, 183, 308, -82, 172, -132, 87, -118, 86, -250, 125, 166, 129, 111, 35, -79, -282, 89, -176, -26, 80, 125, 104, -70, 21, 29, 39, 160, -296, 289, -157, -225, 164, 129, -216, -241, 394, 3, -243, -209, 229, -210, 11, 50, 60, -123, -22, -212, -113, 104, 13, -147, -125, -282, -372, 253, -432, -52, -463, -190, 2, 161, -112, -155, 308, 253, -187, -141, -364, -4, 223, 16, -149, 99, 228, 167, 263, -29, 127, 208, 191, -3, 117, -112, 336, -131, 128, 271, 127, 45, 207, 322, 100, 47, 79, 73, -16, 17, -18, -34, -207, -231, -15, 116, 50, -136, -31, 121, 148, 187, -195, 12, -127, -176, -309, -119, -258, -20, -267, -21, 100, -77, 53, -292, 109, -126, 52, -195, -256, -168, -275, -246, -141, -25, -13, 136, 194, 37, 25, 55, 163, 55, 268, 169, 150, 168, 70, 271, 113, 187, 4, 247, 35, 277, 360, 46, 141, 156, 85, -89, 101, 138, 266, 115, -57, -129, -162, 74, 9, -100, -357, -135, -97, 10, -115, 38]
6590C8k70P3L71m58K89j15rj92j2K21l34n2L20J44L5k86j30K83l9J92k62l1K43
6613A9k54K05M6n3J1J02j82L24J3p0kJ73l28K96k46J12k6M11l71J82l48l8L60
6636C36l05J33o8K08k10P6l21J35Q7l55L39J00j48J87J4k97J30r8l41M96M3k05
6658f4K2N9n3o2R9l9k42O0J16J9n2P5J68m14J78K9j3n6J01o9r0J57J55R2j7j9
6684A40j82k5m8M7K5K24l03P9N59l66n6k4j39J28J42J41K30p88N77p4l30rJ89
6707A37J07K6j41O1k16L75l71j35N3J89N7K1m94K27P2j46R2k69K48j3q8K6J0j03
6731b75l8j05K68j01J08j60M27k32m3k4J16nK8j28J75O4j80m7N07l58Q6K72l12
6754D3R7n2J19j82L23o7l77j00N70m49P6M67k10k66rO19m58J8J62P9k27k79K97
$$ y = [38, -232, -159, 212, -246, 43, -72, -81, -273, -285, -64, -398, -450, -130, 14, 49, -237, -367, -84, -123, 69, -193, -224, 19, -235, -30, 16, -37, -26, 76, -106, 218, 231, 161, 159, 332, 4, 300, 54, 166, 140, 551, 180, 362, 14, -24, 336, 31, 164, 96, 304, 94, 170, -151, -16, 71, -284, 55, 155, 7, 194, 208, -89, 41, -57, -398, 98, 141, -64, -42, 17, -36, -98, 1, -38, -280, -220, -104, -85, -137, -62, 106, -308, -130, -101, -114, -170, -69, -138, -228, -71, 84, 176, 159, 140, -42, -67, -115, -68, -43, 181, -122, -43, 516, 150, 94, 70, -69, 59, 201, 342, 572, -216, 361, 287, -43, -52, 137, 244, 270, 129, 190, -26, 349, -22, -157, -104, 85, 142, 163, -331, -104, -32, -178, -86, -355, -107, -120, -208, -182, -172, -275, -313, -418, -150, -251, -143, -303, 124, -108, -151, -175, -59, -64, -36, -164, 11, 75, -105, -152, 355, -3, 83, 355, 43, 140, 88, 207, 25, 348, 281, -96, -196, 374, -75, 1, 468, 258, -8, -17, 602, 144, 162, 324, 403, 176, -103, 194]
6777A94L1j96K8LJ77k72R7k08LL64l01L12m05j19L70j59k2j3K7K4j80M6J14j80
6801b65K51l65J8K20K54l91L04n9k80K67k73Q3j51J22J83J07j73K15j48L4r1J56
6823A8L5J04k17J57j70J18k13L87Jj37o9j4N4K07J02m49K14K99k55J37j92j41
6845b4p1K87Q3j18J88m21L7M10q3l26J14J63l18OK8J3O5r0ok29KK80n7j42Pj5
6871b17mN2j01l8K00j94J08j2J31K06l84j04K91K82k48p9KO2K01l80P1J18P6j05
6895f6J80J32k51o3K76j58J96j13L28k49J54R9m59L32k86l3L51l06m9M14m43p6
6917i0M71k28j58j0k40K61m03P06j90n3m8J06m2N8k95J29N5j29p6J75l0ok08k2
6941b67N7M1K1O6K7P6n0l30L01p7k9l02L98n3j46K53p4N0p5j0J28L13j37l82K79
$$ y = [194, 225, 29, 57, 60, 237, -35, 62, -146, -143, 221, -80, 232, -173, -292, 78, -81, -103, -116, -89, -65, -245, -199, -85, -265, -14, -379, -361, -141, 113, -278, 26, -33, -313, -46, -319, -236, -387, -265, -82, 25, -148, 67, -81, -47, -138, 18, 53, 157, -60, 97, -73, 45, -168, 219, 220, 83, 14, 0, 54, 261, 363, -86, 128, 427, 172, 309, 117, -24, -95, 192, 275, 157, 345, -76, -39, 371, 288, -38, 76, 239, -79, -73, -45, -32, 33, -57, -63, -292, -290, -10, -67, -209, -202, -217, -221, -169, -270, -308, -108, -302, -194, -206, -75, 131, -253, -357, -66, 216, -32, -111, -109, -47, 154, -226, -155, -37, 39, -66, 114, 246, -5, -68, 208, 50, 246, 133, 461, 212, 366, 465, 6, 338, 52, 19, 370, 64, 15, 429, -14, -90, 381, 153, -5, -15, -255, 6, -397, 309, 119, 66, 18, 124, 82, 140, -155, -26, 29, -100, -176, -1, -31, -37, -245, -267, -210, -169, -148, -82, -55, 21, -29, -359, -58, -135, -164, -466, -68, -121, -267, -14, -88, -38, -113, -123, 5, 318, 181, -201, 78]
6966G8j19Q2J1M6o7M7j92K93k76M6J19k23J43J53Oj34L18k3n7l37K35j75K18J1
6990B03J5L0k22J24j12O2l1k42K08n5J55J26m37K36l45J51N5J00Q8k01p8L86k95
7013g9j85K87r0k23K42J23k19K73k41M08l18M5P8j74J21o9j41L50k19L3rJ45J6
7036A54p2J49K04k79n3l0Q4K01l25L62j90j63j6K40o5N2j14p3l1J52j81O7k11
7059a38r8L36K1j44P2oJ1l2j3J57J29m58J85j73J57m23L99J12k06j19K98M0j05
7082Bj83j13L8O1J29J45m23K30J88k75J89j57K20r2J22j90m4r1L20n10K40J80
7104a4M0J46j6q6j07M8J93qj8j43J37k54l6J14r1J15K33l49K37J11j05j52J54
7127A49L1n53N74j02k21M32k73J7j36K77j81k95K97j07K22n0r3J20R9k78k74L58
$$ y = [78, -41, 41, 52, 98, 31, 78, -114, 179, -97, -51, 68, -155, -12, 141, 147, 13, 331, 308, 251, -86, 149, -26, 192, 203, 218, 248, 26, 150, 38, 100, 69, -173, 35, -20, 135, 261, -176, 60, -285, -134, -79, 21, 109, -92, -170, 216, -79, -264, 23, -67, -290, -48, 75, -144, 129, -112, 296, -22, 23, 101, -73, 48, -21, -162, 188, -31, 2, -7, 138, 154, 82, 231, 435, 156, 103, 73, 157, 358, 33, 395, 205, 42, 26, 266, 201, 253, 139, 66, 35, 187, 6, 73, -138, -236, 100, 121, -23, 49, 43, 54, 22, 9, 166, 295, -163, 22, -151, 6, -417, -18, 94, -112, -231, 67, 107, 2, -181, -294, -256, -195, -66, 79, -344, -114, 74, -201, -12, -169, 51, -41, 81, -109, -153, -244, 76, -434, -194, -14, 26, 172, 156, 70, -37, 11, 204, 196, 178, 35, 172, -82, -118, -4, -95, 20, 253, -96, 141, 252, 147, -5, 149, 180, -373, 201, 99, -122, 310, 37, 54, -82, 195, 14, -281, 16, -91, 131, 81, -12, 108, 207, -71, -345, 13]
7149A3J5k58L37k3p7j04N3M6P4Q8j59k78o5L19j47K42j95K37k04J81q4L13m17
7172i3j22K24o8j89K68J25kk32o4J27J3mK21p5j50Q4j8j58L50k73k05L23l31M55
7196B06l73M28n27L55J55l36J13l07M84m72L60j57J56L1k67J72Oj8k40K46j79
7217a64k65N31k79M04k87J8o6K6l9J03J13m63R7L0K69j13K64j25J15j49L15n27
7239a92qL28l02L58j41j0n9O6k20j74O95m32L44k14M2J19r6j37j06L32M2j97m0
7262bK0o9K3j51M21j65l97L31J18Q6j70m9j90J98m2N6k7j19L28n20L89r8J85l61
7286b05J07l27L02mK37j29r5J6r7K83r0j70k5K71o3M32m26j16pn4M40M0k77n1
7310hQ5o4j06K94r9j28mO5q6N8o7k44M39j72J64l70M98m41N9J09J41j44pj87J61
$$ y = [13, 28, -230, 107, 84, 7, -97, -44, 2, 76, 164, 5, -273, -338, -19, -166, 76, -119, 118, -86, 95, 11, 324, -93, -215, 9, -59, -248, 20, 145, 143, -89, -153, -26, -13, -17, 204, 129, -21, 63, 45, -113, 237, -36, -241, 82, -249, 206, -167, 261, -266, 89, 244, -92, 21, -286, 198, -274, 86, -71, 85, 116, -151, 21, 27, 9, -231, 15, -164, -429, 102, -177, 227, -60, -42, -108, -82, -121, -18, 95, -368, -271, -241, 28, -85, 179, 54, 169, 20, 335, -192, -200, 128, -174, 184, 43, 33, -26, 40, -180, -354, 341, -91, 253, 39, 81, 200, 104, -33, -139, 193, 235, 38, -2, 18, -51, -28, -179, 242, 77, -320, 11, 129, 215, 45, -4, -194, 4, -38, 18, -9, -128, 200, -320, 69, -29, 156, -205, -98, -425, -123, -127, 110, -19, -114, -98, -195, 88, -2, -172, -197, 74, 11, 443, 17, -99, -106, -160, 280, 320, 43, -8, 77, 13, -93, 201, 102, -26, -30, 35, -51, 7, -60, -304, 135, -37, 127, -243, 255, -186, -127, -18, 123, -21, -28, -215, -54]
7335e4J10K03j87j55j6M01l61q9L87m20L13j64j35J86k15KL0p4K86n5J59m02J74
7358g6j71M1J61k16J06R6P3j92J5K89k70J08j25J90j13m46N99j04K14k01P6Q8
7380A42q1k45J31J7j4K69o8k21M9J33J14m15K33r5K93j47k37K49M0Jq5j78K42
7403A27P4k52K08j76L62l28n8J10P1R6j14j97K9m5j24R6j07Q8J56N9r1J75m58
7426b99K94J4J31k05j49J96j23k42P3M19k25l2J29J11j92K39k21K77m13K62n3
7447iJ64O0m01O7J21K50l70M50k61o2K61j78k55L43j38n6n6L74J3n43L71m38L41
7470D8J60l35j21J22K56k92r4M9L45k4J93o58K44J46n01K88K35k48P2L61k27l16
7492b97J70K0n6J79k27J89j08r8J66J3N2j06j99N28R3m64J91J03j35j26K23o0
$$ y = [-54, 56, 259, 72, -83, -99, 302, -59, -148, 239, -181, 132, -32, -167, 19, -196, -194, -164, -238, 48, -7, 152, -250, -76, -247, -206, -45, -261, -155, -59, 14, -178, -163, 126, -144, -36, -161, 29, -84, -530, 69, -35, 179, -22, 54, 142, 61, -184, -53, -36, -50, 219, 151, -70, -21, 112, 226, -189, 44, -51, 242, 95, -142, 107, 147, 148, 63, -115, 127, 201, -51, 157, -19, 343, 15, -43, 67, 138, 234, 120, -77, -48, -93, -217, -121, -228, -140, 16, 75, -16, 159, -299, -5, 9, 140, -65, -214, -18, -141, -383, -310, 109, -116, -148, -19, 92, -100, 139, -82, 195, -218, 44, -9, 155, 215, -186, -119, 2, 252, -118, 332, 71, 9, 270, 92, -163, 180, 42, -14, -70, 304, 317, -226, 145, -293, 48, 208, -127, -248, -126, 130, -162, -256, -207, 138, 114, 307, -351, -107, 39, -462, -174, 61, -187, -115, 246, 19, -297, -127, -107, -163, 16, -211, -22, -130, -228, -62, -49, 3, -103, -302, 226, 319, -145, 46, 149, 14, -112, 111, 51]
7514E1J41m7j48K62j83K87l7l39J50K03k89k29M84l98K25N2j93p1L13j33L5j40
7536dJ57k37K45n7l7Q1j50J44r2J26k02j3Q3l64K80n1p6K68J8j06j25k48K32J00
7560b8J05p6l7J79m86K04J81q0l39J11P9m3n4M71nj46N9j59J51l37L22k11J38
7583aK61k98J0k77M39j79M1L6k43M54k56J86n1J75l43K5l8M8L4p5k8J67l4n0j75
7608a72N56n07K52K1m36L20Kk15J19Q5m8k41M1L33k79J77J01J00m23J63k94M42
7630I7O6j01k52R8K02k51OM2J37j22J51k79J54Ok9k02K69o6kk43K19R7J80Q3n4
7655B06l14k0L28p4p9m3pj14J26K96k15M5j48M60l94j27L33k80oL89Nk16j19j7
7679A5N8J4K17l77J49m2J16k24M6o0J36P9k73q6J39J85j61J93K1O7k19j21J78
$$ y = [51, 192, 145, -3, 259, 76, 363, 326, -13, 137, 340, 51, -178, 306, -92, 133, 185, -8, -79, 234, 101, 136, -4, 153, -84, 161, 104, 67, 148, -2, 142, 50, 176, -26, -39, 44, -320, -40, -91, -167, 101, 119, 13, -112, -360, -128, -28, 77, 1, -36, 143, -343, -139, 42, -38, -377, -266, -187, -230, -284, 187, 182, 36, 95, -64, 87, -250, 72, -139, -1, 260, -38, -28, -305, 134, -45, -4, 32, -211, 243, -13, 173, 122, 297, -46, -21, -59, -11, 23, -52, -80, 87, 53, 3, -172, 384, -123, 129, 150, -286, 34, 36, -179, -60, 25, -23, -264, -223, 110, -169, 8, 109, 209, -214, -51, -345, 97, 163, 62, -190, -92, 110, -141, -135, -93, 44, -78, 73, -206, -52, -46, -75, -277, -8, -74, -76, -319, -100, -3, 177, 260, 206, -108, -128, 200, 126, 47, 4, -3, -117, 9, 305, 90, 135, -13, 447, 53, -74, 259, -21, -27, 362, 367, 151, 32, 15, 73, 87, 304, -73, 76, 34, 150, -74, -28, -88, 48, 127, -146, -232, -93, 92, -69, 124, 145, 212, -7, -128, 50]
7702E0l7k63L24lj91MJ50j85J65J3plk16nJ21n8J35K95m67L26j05j94L12nq2k8
7728D6J4J12j62p3J20r1K32N8m46L83K8k23J16k94K81p2J45J35l98J57j29k1j4
7751i6o9K59k55K71j82J37l7j09L8K4k10K4L53j45K2n2l25L38j24O5L0j86K03
7774b6j07kJ49j07N2j70K43m1j79M37k13L0j65K01N8Lk14K05l33M8L17Ml74K53
7798F9k11j17K77j23K90j96K17J04k91K06k79J42l8j92J63r9K35k77K9j29K56
7819C6K45r9j32P9j31lk74L76k27K97k23k66K77m5J48M8J04jl25j08j49M35k58
7842a96p2k8R2K73j63O8j01Q3j40J90K0k03K88l35J20Q9K7j5j96mL23j68J03m0
7866A5j77J47M5j01J84L2l95N9K52k31L13r3j73N4O0j86J88j93J62%M3J61k62
$$ y = [50, 13, -250, 74, 71, -120, -116, 34, -151, 14, 27, 20, 17, -199, -204, -83, -141, -6, 289, -178, 148, 43, -151, 161, 156, 74, 46, 60, 172, 10, -63, 57, -34, 198, 256, -190, 193, 221, -2, 114, -180, 101, 29, 174, 309, -89, 68, -61, -82, -96, -165, 94, -161, 110, -72, 65, 28, -81, -43, -19, -229, -205, 148, 3, 25, -27, -352, -14, -138, -73, -43, -229, -26, -133, -135, 14, -93, -41, -211, 32, -9, -188, 249, 36, 66, -99, 102, 160, 163, -51, 154, -179, -131, 186, 190, -184, 69, -142, -259, 18, -105, 185, -11, 206, 310, 19, 225, -54, 88, 50, -142, 21, -78, 157, -120, -91, -220, 36, 281, 182, 50, 129, -2, -5, -279, 97, -130, 167, -56, -322, -45, -90, 58, 106, 210, 209, -116, -224, -373, 62, -196, -268, -296, -204, 69, -94, -26, -127, -44, -184, 6, 26, -177, 111, -224, -104, -15, 12, -3, -199, -203, 120, -48, 55, 15, -162, -15, 30, -71, 113, 145, -250, -191, 61, -170, 143, 50, -123, -69, -9, -195, -7, -200, -38, -38, 5, 166, -96]
7889i6N6j11j1J83J12j43J03Om40L63Q4j14m7J16J40N3k84Q5K06k38J9o7k54L44
7913F5p5J89M3k34j91L12K0j23o7K30l58K70kK63l15p8J71J07k84m9L40n1k69
7936h6R2M7J69k17J90q0j52K60m10L56m43K77K22m0j30N6J13j94N1m36M36p3L40
7959C48k02m88N7L47k01q7P5q2J62J28j09K4K06n6m26M05j36r7J15Q4j77P0N3
7982A3J28k70l1J80%K55j44l80J45m0P2pJ08J97P5k9j07m47J49r1K83k53J30M3
8006b1K67j76j32j13J78j73J68j92L19P9r1j71K3M71k95k65K00J97m58L33j51
8027cj57L0L55l57L53p7m7K99l99k6K09m56K57j45K39p4K63q0j77j10qM9j34N28
8051C32k26j43M91p72M02K4j59r5J69k16j4M29r1N6j76k24M9J74j18K26k4j00
$$ y = [-96, -40, -151, -162, 21, 133, -10, 93, 99, -341, 22, 106, -8, -55, 61, 201, 254, -30, 55, 261, 23, 42, -25, -279, 65, -10, 179, 222, -12, -203, 109, 129, 6, -61, 169, -189, 81, 79, 342, 27, -51, 120, 227, -57, -106, 234, 183, -86, 6, 53, 222, 5, 195, 115, -37, 223, -187, 169, -274, 3, 225, 185, 55, 111, 224, 30, 81, -355, 81, 8, 348, 146, -342, -285, 62, -139, -226, -151, -233, -71, 57, -52, -28, 178, 122, -304, 101, -35, -132, -17, 67, -110, -40, 13, 141, -129, -160, 20, 20, 275, 131, -249, -104, -144, -72, -79, 29, 226, 301, 272, 165, -282, -133, -224, 59, -194, -64, -21, 246, 70, -62, -175, 3, -170, -2, -194, 125, 204, 113, -58, -35, 436, 141, -124, 76, 273, -185, 148, -3, -160, -130, 225, -132, 221, 144, 97, 396, -3, -29, 180, -276, -19, -164, 75, 1, 264, 184, 7, -103, -111, -62, -196, 332, 106, -37, 454, -318, 84, 108, -51, -146, 23, -193, -207, 222, 131, 187, 11, -213, -164, 10, -108, 118, 94, -6]
8073fl88M71l7J85j89j25K26k25P4J00J9J15j79o7o9L22l81K51M3m17K43J26J41
8096B33j33l19K62j00Q5L5k02K38j07p7J36J35m34j14N45j43L0L3M8j10j14J30
8118E7j85K17J6n5k9m5MK9j27J15N4k52J42N8k13k9M9r2r9M58j47J16K8l13K37
8143fl33M03J61j00j87L40n19p0L34M0K65l05j68J7k05M15q8k82N01k74L5Q4j65
8166a07K13K35l30K79J46m63k16K85J3L7lQ3p6k1j26K38Nk55j59J87J85j90j2
8189e2%J15
$$ y = [-6, -394, 77, 40, 225, 36, -89, 137, -88, -14, 86, 105, 220, 41, -26, -95, 227, -154, 97, 140, -277, -34, 92, 233, 100, -219, 43, -57, 28, 63, -139, 99, -8, -85, 51, 186, -248, -362, 183, 40, 70, 103, 151, 41, -73, 57, -128, 89, 105, 50, 21, -24, -20, 9, -118, -3, 51, -201, -59, -1, -214, -243, -194, -286, -385, 73, -74, 42, 70, -243, -6, -339, 64, 225, 125, -62, 278, -241, -311, 23, 63, 328, 23, -145, -128, -333, 82, -6, -288, 213, -61, -26, 58, -107, 106, 341, 11, 290, 436, -27, -243, 42, 55, 92, 89, 172, 96, 75, -51, 187, 192, -63, -222, -35, 150, -40, -52, -52, 63]
8191F3
$$ Imaginary data points
##PAGE= N=2
##DATA TABLE= (X++(I..I)), XYDATA
0@%%%qJ6j6J8k6L4m2N7p3R0j13J40j67J99k39K86l36L92m63N37o15P12q20R32
27D95j062J207j362J538j732J940k170K426k706L012l347L716m123M564n054N600
43B942o196O862p613Q454r405J0500j1768J3250j5023J7186j9885K3372k8082
56a5406L4829m5377O4367j09285M06426M16813n75944k29420J93151M18517j741
67E56930k69446j94545J09561N7720j30704j45061J35290J74059j33465m12147
77b51808j55497L13436L84819j04853m78986k55342K81927L99737J5889l13321
87a63999j59836J59329J84878m9975j05662R7427J87613n7789k82116r2236L04883
98B2517L24959j16679m42474j99169K86032L64388m7252l67986j97348J63057
$$ y = [0, 0, 0, 0, -8, 8, -8, 10, -16, 18, -24, 33, -40, 50, -63, 77, -90, 109, -130, 156, -180, 212, -251, 286, -329, 383, -437, 495, -567, 640, -722, 816, -916, 1024, -1146, 1280, -1426, 1586, -1761, 1955, -2168, 2396, -2658, 2942, -3254, 3608, -4005, 4449, -4956, 5544, -6224, 7026, -7997, 9189, -10696, 12676, -15406, 19423, -25954, 38413, -70872, 335554, 752367, 176423, -52997, 140154, 558671, 556930, 287484, 92939, 202500, 260220, 129516, -15545, 119745, 293804, 160339, -251808, -407305, -93869, 290950, 186097, -292889, -548231, -266304, 133433, 149322, -163999, -323835, -164506, 20372, -29603, -135265, -37838, 149775, 91986, -190130, -282366, 22517, 347476, 230797, -211677, -410846, -124814, 239574, 192322, -175664, -373012, -209955]
108b09955K00467n9800j72017J4702J49907j7739k16688p3734K62413K88227r2510
119G3273l63951j15011L39605L82938l3408l33753j35542K43929K76063k2741
129C11402j83371q144J66668L9185j70843r0894J86674K13041j17443l56082j31028
140a40835K74066K91548j16475l92395j69802K17072K41712p6612k53948o9308
150a94977J50228P0898j40814j07330J39256J92273p6413k78644p7517K77772
160d5268K80806r6809l39656j15682K57362K67353o7622k58453p2618J69710J11412
171I0535j14237j31145Q0403J58458n6006k43497q2217K28960K29807j10849l22091
182b71879r7851K57065K58332p4054k63518o6899K02197J62131q0440j32579O7208
$$ y = [-209955, -9488, -69288, -241305, -226603, -76696, -94435, -311123, -384857, -122444, 165783, 73273, -290678, -405689, -66084, 316854, 283446, -50307, -185849, 58080, 334143, 311402, 128031, 119887, 286555, 325740, 154897, 64003, 250677, 463718, 346275, -9807, -140835, 133231, 424779, 308304, -84091, -253893, -36821, 204891, 128279, -125669, -194977, -44749, 26149, -114665, -221995, -82739, 109534, 33121, -245523, -323040, -45268, 235538, 138729, -200927, -316609, -59247, 208106, 140484, -117969, -190587, -20877, 90535, -23702, -154847, -74444, 84014, 28008, -215489, -297706, -68746, 161061, 50212, -271879, -369730, -112665, 145667, 71613, -191905, -258804, -56607, 105524, 25084, -107495, -40287]
193d0287J76445M073j79220o0239K11555K18984r0059k86788p5373K56139K40519
204C75749r7821k85128q0681J98404J59421j04463j87355R757J50983R536j79130
215c0728r4575J53302J75409r5100k69818p3492K35913K18691j07885k82765o7564
226b38612K17604J77663r7277j95507P76J66530N1875j45125r7521J26244J65192
237A31842o9590k33740o0333K17205J94781j09623k69766o0112K18921J77561
247A37146j01973k08692j1546J73566P8347j23263j06738R9428J60467l6687j94178
258a34123m9268K04524J84907r7279k43501l9793K25502J79617j01754k14129
268h5297j5606J84348R6811j20378j29354O9900J50773k2643j80783o3272J69973
$$ y = [-40287, 136158, 140231, -38989, -99228, 112327, 331311, 241252, -45536, -120909, 135230, 375749, 277928, -7200, -87881, 110523, 269944, 165481, -21874, -12117, 138866, 148402, -30728, -125303, 27999, 203408, 108308, -161510, -235002, 911, 219602, 111717, -171048, -238612, -21008, 156655, 59378, -136129, -135353, 31177, 83052, -62073, -159594, -33350, 131842, 62252, -171488, -231821, -14616, 180165, 70542, -199224, -259336, -40415, 137146, 35173, -173519, -185065, -11499, 66848, -56415, -163153, -63725, 96742, 60055, -134123, -183391, 21133, 206040, 108761, -134740, -174533, 50969, 230586, 128832, -85297, -100903, 83445, 180256, 59878, -69476, 424, 151197, 128554, -52229, -115501, 54472]
279E4472J61233r9541k39183m1091K15588J66013j16389k25072j9130J91561J09426
290A57887j20876j48690N1587J57025J990j64585p0140J49377J51765q6719k18844
301a40223l6573K06361J56852j18123k25373j7757J96646J15386j22064j61874
311a46742L6252J58806K4104j48285q0363J26597J46291o7684j94232k9873J95187
322B0058J49687j08254k09647r497K01124J23758j15576j65624L0371J65587M3518
333A25505j34135r0781J03549J39298m9996j77848l6981J74480J35602j08032
343H0661k04538j0877J93980J17722j21004j76834K0968J68635N5671j33008j05894
354a14518Q6304J39439l3224j64348m2125J58373J31030r8477j94641q044J93275
$$ y = [54472, 215705, 116164, -123019, -164110, 51478, 217491, 101102, -123970, -143100, 48461, 157887, 37011, -111679, -60092, 96933, 98923, -65662, -135802, 13575, 165340, 78621, -140223, -176796, 29565, 186417, 68294, -157079, -174836, 21810, 137196, 15132, -146742, -110490, 48316, 72420, -75865, -156228, -29631, 116660, 48976, -145256, -175129, 20058, 169745, 61491, -148156, -157653, 43471, 167229, 51653, -113971, -83600, 81987, 125505, -8630, -99411, 4138, 143436, 93440, -84408, -121389, 53091, 188693, 80661, -123877, -134754, 59226, 176948, 55944, -120890, -99922, 68713, 124384, -8624, -114518, -28214, 111225, 78001, -86347, -128472, 29901, 160931, 62454, -132187, -140231, 53044]
365E3044J16764j22871j78795K0440J75415O6386j31672j18859P3160J44398j6732
376H0678j56536n1288J43234J25220q8647j82825r266J84219J13873j21549j78882
387a41769J9852J79275P2815j30296j26830O3403J46744L14j44748o0683J26109
398D186J23403p4104j68840r994J73380J08284j14619j70663J9205J77670P7057
409A44965j26476j32588N5809J49294J2468j36958o9589J08468J19488o0547j58786
420i4452j7914J58088J01572j11195j67924J5949J72051P4459j27546j39789M8741
431h7960J52095K2631j35407q0472R9638J23656m6664j48301k0276J50139J03639
442A32718r8665j58192J8898J74518P9703j24209j39007M9816J58756L2045j33315
$$ y = [53044, 169808, 46937, -131858, -111418, 63997, 130383, -1289, -120148, -46988, 97410, 80678, -75858, -127146, 16088, 141308, 52661, -130164, -139430, 44789, 158662, 37113, -141769, -121917, 57358, 130173, -123, -126953, -63550, 83194, 83508, -61240, -121923, 4186, 127589, 53485, -115355, -125349, 48031, 156315, 41696, -128967, -109762, 67908, 144965, 18489, -114099, -58290, 91004, 103472, -33486, -103075, 5393, 124881, 64334, -94452, -112366, 45722, 147294, 36099, -131825, -115876, 56175, 130634, 3088, -136701, -87960, 64135, 86766, -48641, -129113, -29475, 94181, 47517, -100784, -121060, 29079, 132718, 34053, -124139, -105241, 69277, 148980, 24771, -114236, -64420, 94336, 126381, -6934]
453f934r0122Q9447J26980l6228j46658l2056J36049R7582r5057j55882J1604
464a01275J62927P4951j24757j41692M5195J57915L6249j31049r4506Q2143J30135
475I6236k0285j35463l6565J26157J01466p9373j43623J0881J55845P4124j16698
486C2702j37177L9862J53768L8337j31293j04084P0578J26423j6329j36142m9816
497a13171J08382R5492p1996j40587P89J43883P2301j10997j33163M0091J54408
508D5432M4049j24089j01931P2154J36688m69j27613n2119J08435J05347n7509
519D8375j31899j258J39250P5168j03704j31264L5566J50767M3687j26548j08294
530a10154O5196J35509J725j29937o3298R8140J06884m9078j30706r106J31570
$$ y = [-6934, -97056, -7609, 119371, 83143, -63515, -95571, 40478, 138060, 43003, -112879, -101275, 61652, 136603, 11846, -129846, -84651, 73264, 109513, -21536, -116042, -33899, 96236, 75951, -59512, -96077, 30080, 131546, 52173, -91450, -80569, 75276, 149400, 32702, -104475, -64613, 89155, 127492, -3801, -107885, -37307, 89116, 72787, -63355, -113171, -4789, 90703, 18707, -121880, -121091, 22792, 95093, -15904, -149067, -108976, 45432, 89481, -34608, -136539, -64385, 72303, 71834, -55779, -107898, 537, 105884, 48375, -83524, -84782, 54468, 129636, 25932, -105332, -69766, 81001, 124688, -1860, -110154, -44958, 90551, 92276, -37661, -100959, -2819, 104065, 54987, -75719, -84825, 46745]
541D6745P6801r4031j24960L2920J47168M8157j19176j07396O2567J37006Q351
552A14152j27375o8710Q9085J06031m1610j28256k1684J16242P3461q9004j26034
563a03702K2521J34156M3224j16531j09038N4602J31793J2005j23944p2884Q4498
574d3300J09673l0620j20801k3501J12010P9286p4272j16358K0323J32241M8979
585I3660j07872j04436N3627J31718J5652j20832p5643P9344J12210k4411j20595
596f7578l1197J07480Q2397o6972j13288J6601J29227N3252r8988j00436N4162
607c5340J35182K2478j15820p4943Q0796J16558j7493j18629l7086J00583Q3626
618A39912o3147j17112M420J16271M7349j01869j07498L9544J20527J4863j20357
$$ y = [46745, 123546, 29515, -95445, -62525, 84643, 132800, 13624, -93772, -31205, 105801, 114152, -13223, -81933, 7152, 113183, 71573, -56683, -78367, 37875, 111336, 22332, -103702, -81181, 52975, 96199, -20332, -129370, -74768, 57025, 69030, -54914, -127798, -43300, 66373, 35753, -85048, -108549, 3461, 82747, 8475, -107883, -87560, 44681, 93660, -14212, -118648, -65021, 66697, 82349, -38483, -114126, -34782, 77428, 53017, -67578, -98775, 8705, 91102, 24130, -89158, -72557, 56670, 109922, 10934, -89502, -35340, 99842, 122320, 6500, -68443, 12353, 128911, 111418, -7211, -44297, 56286, 139912, 76765, -40347, -35927, 80344, 127693, 25824, -81674, -42130, 78397, 93260, -27097]
629b7097q5079O7598J10277j7903j20275m4274R2841Q5136n2272j10056J746J14404
641A5046N6111q4978r7167M1627J22827K4867j06860p8205O7455J11591r433j15137
653e2256m9008Q5984Q5087m8762j11884q937J02603N3676q2231r9367L0879J15742
665B1526K7182j02677p6929O6439J16122J46j05576m3187R2165R9111l0934r9972
677c6584l527J10564O7723o8165r2198L2152J15561L0950r9307q2243N6196J07650
689A38772p456j17445o0430P4235Q4287m3391j16149k6090R0146N7067p4639j03201
701a04294J6647J05508K9966r5141q0164N4835J10042M939j02251n1946Q1165
712c0694R7844k5002j00753j8154R6009O7985n8233r4350J4256J01466L3140q9796
$$ y = [-27097, -112176, -44578, 65699, 47796, -72479, -116753, -23912, 61224, 8952, -101104, -99358, 15046, 71157, -13821, -110988, -69361, 53466, 78333, -28527, -106732, -39277, 72314, 62881, -52256, -101264, -15280, 69807, 21045, -90839, -99776, 2827, 56503, -25728, -125095, -94216, 21526, 48708, -53969, -130898, -64459, 51663, 51809, -53767, -96954, -4789, 94322, 63388, -36584, -40111, 70453, 138176, 70011, -22187, 9965, 125526, 156476, 57169, -25074, 31122, 138772, 131316, 13871, -46559, 27676, 111963, 68572, -47577, -73667, 16479, 73546, -1093, -104294, -87647, 17861, 47827, -47314, -127478, -72643, 37399, 42338, -59913, -111859, -30694, 67150, 42148, -58605, -76759, 19250, 87235, 29002, -65348, -51092, 50374, 83514, -6282]
724f282q3670M2918R9210m89j06901o1777O6098Q7912k7079j04948k8688Q7545
736c6151O9773n1795r0155J3959J04151M6412p2259p0131N1368J10670J9173q8276
748F739m9645P5793R9891j4219r6166k6766Q6129P2041n0120r7343q51R0754L6042
761A32279q3596q8718K8795Q9719L649j03370o8965N5666Q5838k3057j04885l7334
773a13979P9442P1416m4406r2755L37R5352M9955o5875p6333L6229J01326K0731
785F1440q5155n7243O0965R2818j0969r6159l7198P5196P1800m2077r6244j0156
797g2982Q3018M4103o8171q3232K1095Q8379J7885q4055o2346N2879Q9688n755
809B0506q7561l4040P7219Q0219k6986q1600l620R0972N9329n0767p2109K6160
$$ y = [-6282, -89952, -47034, 52176, 51687, -55214, -116991, -50893, 37019, 9940, -95008, -123696, -36151, 33622, -18173, -108328, -94369, 9782, 56194, -16065, -86196, -34828, 75842, 95015, 6739, -42906, 32887, 132778, 118559, 22393, -4373, 81756, 153797, 103677, 6334, 5483, 96237, 132279, 48683, -40035, -11240, 78479, 82128, -21242, -90207, -34541, 51297, 28240, -76645, -113979, -34537, 36879, -7527, -100282, -99945, -4593, 45362, -20513, -96846, -60617, 40709, 61440, -23715, -80958, -19993, 72825, 61856, -34303, -71501, 3695, 75495, 33418, -62826, -72982, 10036, 54139, -14032, -97264, -76169, 12210, 30095, -53960, -116306, -63427, 26261, 20506, -67055, -101095, -23876, 56343, 29357, -52243, -55863, 35109, 94438, 43671, -28438, -2278]
821b278R3847K7774p4615n9840M8064Q6687n902r1451m4491O3891O9585l6595
833G4676r5299k0349P4387M6695o0517q5779R785Q2778K2038p7812o6060M2123
845e3334Q4075j208q5604m0971O6589P7362k4078q5729j3797Q1370N7813m8183
857A4305p6711J3008Q5430L0422o9298o4638L7547Q2132J299q4803m5546N8099
869a8754P1202k4581q7292k1911P2621N5868m6133p7927P466Q2023L3779o2015
881a5654o0408L6200Q3359J0548p3249m1225N9125P6609j4929p8280j9465P2023
893C4654N9106l9071p5899K661P7144L4321o1447o6403K6471P5433O637p7148
905c541m9535M7035O8862j8194q3315k7955O4646N6028l9965p7968j320P4771
$$ y = [-2278, 91569, 119343, 44728, -15112, 32952, 119639, 113737, 22286, -22205, 41686, 111271, 74676, -20623, -40972, 33415, 80110, 19593, -66186, -56401, 26377, 48415, -29397, -95457, -53334, 30741, 29533, -56071, -97042, -30453, 46909, 22831, -62898, -76695, 4675, 62488, 14305, -62406, -49398, 36032, 66454, -2844, -67482, -29935, 52197, 53496, -31307, -76853, -18754, 52448, 27867, -59425, -81336, -8715, 47153, 1020, -76907, -69441, 12582, 46361, -15654, -76062, -39862, 43497, 54045, -19204, -60429, -1304, 75305, 60376, -17904, -37369, 34654, 93760, 54689, -21210, -18549, 58595, 92916, 31469, -34934, -8463, 66970, 73607, -3541, -53076, -6041, 62821, 44627, -38688, -66643, -1997, 54031, 14066, -63902, -65222, 9549]
917I549L6882n7132o5343K5781P8121J3522p0383m6779M8808P3100j1235p6550
929d1659k6312O5259O0358l4407p6095l269P4413L9123n3685o5522K0543P5381
941C4128J5683o7876m9202M3392P1217q431p4849k8496O1195N9959k9841p2969
953d6090n452P1142M3005m7978o3497J7823P4500J9824o2113m8605L9279O9387
965F1225m062p0563l1114N6291N8530k6928p2529r930O5623M1522m6506o5573
977d4014J1531O9364K0288o0935n2218L3618O6654k769o9733l3451N1988N8394
989D8717k3633p1229j2259O5154M4072m2700o4310J1161O9628K4720n6568n1754
1001e9001L2383O8210K331o6728l3837N0365N9294k0379o9122j4069O1873M5278
$$ y = [9549, 46431, -10701, -76044, -50263, 27858, 41380, -29003, -75782, -26974, 46126, 34891, -41659, -67971, -2712, 57646, 23239, -52856, -56125, 18288, 57411, 3726, -61796, -41253, 34128, 49811, -18065, -67267, -23875, 47342, 38911, -35938, -64434, -3239, 56720, 26879, -46090, -51542, 19600, 62605, 14627, -48870, -31047, 43453, 63277, 1164, -47441, -8162, 61225, 57163, -13400, -44514, 11777, 70307, 43379, -29150, -39080, 26543, 68065, 21559, -44014, -32483, 36881, 57169, -3766, -55984, -22366, 44288, 41519, -28214, -61665, -9677, 48717, 25084, -46145, -58404, 6750, 50822, 8122, -56188, -45027, 24601, 49321, -7247, -59001, -26618, 41592, 43923, -22805, -56642, -6277, 53017, 32638, -36484, -50553, 11320, 56598]
1013E6598l9515o4903O782O7868K5479n4915n2243K7875O5768M343o3312l5978
1025e6153M5952N9330j6852o6695j5877N9429M5636l4920o2072L901O5208K8603
1037E5490m9783n2402K3804O4247P456o0020l7544M1176N6691j3540o5288j9229
1049d8942N3797M4890l2980o1961J12O0951K9472m7452n2478K0115O2512J0509
1061C8545n7386l7666L9734N7776r363o1477j9217N3011M7520k7708o0456n63
1073c7250O1226L1921m4340n3029J8667O1626J1528n5896m0033L5075N6159q511
1085C7143o1974k3226M8955M6278k7921o0244m069N8110L2619m2333n2520J5933
1097c3249O0987J5174n2460l9123L4323N6719l663n7336k3223M7157M8051k3254
$$ y = [56598, 17083, -47820, -41038, 26830, 52309, -2606, -54849, -26974, 38794, 43137, -20175, -56153, -10201, 49129, 32277, -34418, -50295, 9134, 54770, 19850, -42222, -38321, 26887, 55490, 5707, -46695, -22891, 41356, 48812, -11208, -48752, -7576, 49115, 35575, -29713, -48942, 4855, 49745, 16765, -45196, -45084, 15867, 45339, -2113, -54591, -34476, 28036, 38545, -18841, -56507, -16773, 41003, 31640, -29837, -49054, 3957, 51477, 23769, -36687, -37250, 23976, 55897, 11557, -41472, -22805, 38821, 50349, -5547, -45580, -10505, 45654, 37143, -24831, -48057, 898, 47176, 19255, -40989, -45058, 13052, 45671, 3338, -49182, -33249, 27738, 42912, -9548, -48671, -14348, 42371, 38708, -18628, -41851, 5306, 53357, 30103]
1109C0103n8443n636N5435L2629l9205n2957J1024N6766J5532n0815m2391K7911
1121b0047N3811l771n6834k6003M2325M5818j9949n6167p894N2972L5285l4405
1133E141n0359J1472N7141J9540m5159l9315K7684N5258J684n2990k5983M1197
1145E311M6865j8064n5378j0348M9432L3871l4378n2957N799N3770J8077m7131
1157e131m2880K3005N2477J019n2648k8496L8254M7085j4811n3813j0554N0212
1169C719L6716k9743m9611P432N4719K2623m1765m1274K2613N3411M456n0409
1181g113k8861L5324M5343j3469n3280j5203M4493L4562k9316n1626J772M9881
1193A2507K0867m0941m2102J8148N0344P122m7335k9228L3223M6867q417m8912
$$ y = [30103, -28340, -33976, 21459, 54088, 14883, -38074, -27050, 29716, 45248, -5567, -47958, -20047, 33764, 29993, -26841, -52844, -10519, 35299, 15350, -40817, -48711, 4261, 39546, 5141, -45218, -33746, 23395, 42935, -2224, -41539, -13855, 41403, 43087, -9903, -35886, 5311, 52176, 34112, -21266, -31614, 17818, 51689, 17311, -35646, -29847, 23923, 42000, -5131, -48011, -25006, 27471, 28490, -24158, -52654, -14400, 32685, 17874, -35939, -46493, 3719, 40435, 10692, -38919, -31487, 23232, 45855, 4090, -37184, -14571, 38840, 43296, -7113, -35974, -650, 44693, 31224, -22056, -37259, 7234, 41796, 12480, -39146, -37374, 12507, 33374, -7567, -49669, -31521, 18823, 25945, -21390, -50618, -17395, 29472, 21055, -27857]
1205b7857j3574M4703L7685k2891m7269K267N0067K4325l6119m1221J6463M9795
1217C6374Q146m5548l1188K8777M4431q305n0667j7771L9756L5527k3827m8928
1229c3223j910M6616K4142l5099m2092J4080M9483J0756m3391l0692K9099M6550
1241C4319m945m6702j6939L9729L7995j9791m6756k509M6373K5844l4137m1899
1253b9418J1679M6860J0708m3042l3072K4414M3785m806m7244k0580L5584L6265
1265C1133j8501m6126n552M3300K6272l0078m0910J0052M6229J3732l8266l1875
1277d0590K3525M4241l24m3317k0024L3958L7301j4399m4353o526M0960K6281
1289C6733k7077m0436O994M3648J4478l6892l3240K0769M2627M45m1912k1493
$$ y = [-27857, -41431, 3272, 40957, 18066, -29203, -26936, 23131, 47456, 11337, -29884, -13421, 36374, 44520, -1028, -32216, -3439, 40992, 32687, -17980, -35751, 4005, 39532, 15705, -33223, -35133, 11483, 35625, 526, -41566, -27486, 21997, 32753, -10638, -41330, -12231, 34319, 29374, -17328, -34267, 5462, 43457, 23666, -23090, -25599, 20774, 46618, 12481, -29418, -17739, 29121, 39829, -3213, -36285, -11871, 31914, 27108, -20136, -40716, -5132, 31133, 12632, -33494, -39046, 4254, 30526, 448, -40462, -30410, 15819, 29551, -8715, -40590, -17065, 27176, 26852, -16465, -36489, -2531, 34770, 20371, -23982, -30508, 10452, 36733, 9656, -30780, -23786, 19862, 34340, -2552, -35792, -15023, 27604, 28049, -13863, -35356]
1301c5356L1378L6925j2398m3292q253L9809K7888k5443l9761O050M3021J5833
1313C6401l5039l2999J8897M2281K304m1623k2127K9617L6611j1940m2595r923
1325c0135L7253K8177k4254m0297M024M1471J6743l4334l2702J6793M0840L859
1337B7438l8981k3671K7721L6886r479m1516j0917L5332K8400k1751l9352J670
1349b8220L9597J7455l1067l3107J3778M0375N137l7251k3529K5357L6545o958
1361A8112l9058j2154L4447K9488j8087l7243J325L8914J8934k7295l1918J2695
1373a1840L9516P513l5478k3822K3512L5556n778l8839j3603L1171K8139j7782
1385A8265l8336k030L6313J8800k8709l3275J0618L7469P230l4381k4655K1167
$$ y = [-35356, -3978, 32947, 20549, -22743, -30996, 8813, 36701, 11258, -28503, -22453, 20568, 36401, 1362, -31637, -12740, 29541, 31845, -9778, -31905, -2288, 34323, 22383, -20212, -30135, 7118, 35295, 11041, -29256, -25232, 16239, 32982, -1352, -34054, -17261, 23579, 27438, -11543, -35214, -7493, 29393, 19914, -21602, -32519, 2813, 31213, 9462, -29890, -28220, 11377, 28832, -2235, -35342, -21564, 18811, 23948, -13303, -36832, -11475, 25070, 18112, -20946, -33100, 1347, 30835, 12748, -24495, -23170, 15744, 34678, 7383, -24535, -11840, 27676, 35189, -289, -24111, -599, 34957, 29179, -9660, -23263, 7908, 36047, 18265, -20071, -22101, 14212, 33012, 4303, -28972, -18354, 19115, 26345, -8036, -32691, -11524]
1397a1524L5708l687l7497j4254L0998K9418j5312l6529k180L5771K0269k5180
1409F001l2885R028L7659Q833l3411k5961J9581L4108l215l6665j6812K7550K8784
1422B2595j4597l6943m905L3573K0426k3641l1983P608L5924J1314k9597k4734
1434c4960J8945L5532K12l2937j5077K7864L0211j0300l3676m535L2697K2087
1446C6063k0673l1540N449L4757J0909k8999k5945J4523L3042R8l4020j8444K3852
1459i28K8315j0948l4839p584L0077K1219j9446l2182M192L3490J3194k7231k5791
1472b8462J5331L3748K717l1444j7682K3537K9922q393l3519p798K9617K2399
1484B9973j9086l1519J914L1942J2664k6654k7524J2360L1701K238l1572j8904
$$ y = [-11524, 24184, 20497, -17000, -31254, -256, 29162, 13850, -22679, -24859, 10912, 31181, 6001, -26884, -17856, 19803, 28636, -4775, -30736, -11155, 22953, 19738, -16927, -33739, -6189, 22595, 7998, -28945, -33850, -277, 20149, -3492, -35475, -27867, 8057, 19371, -10226, -34960, -16015, 19517, 19729, -13208, -28285, -421, 29790, 19490, -14186, -18721, 13976, 36063, 15390, -16150, -10701, 24056, 34965, 5966, -19979, -5456, 27586, 27684, -6336, -24780, -928, 27387, 16439, -18400, -25984, 4093, 25312, 5866, -26316, -22124, 11366, 24560, -2671, -28462, -13131, 20617, 23334, -8110, -25792, -2255, 27667, 19274, -14245, -22043, 7574, 29973, 10887, -20632, -18718, 13224, 25888, -766, -28290, -15930, 15771, 18009, -13563, -32467]
1496c2467K0910K8744p527l2409q763K7758K3411j6135k9905K231L2182J5222
1508B3252k2892k4939J2223L2185N789k7722j8067K0162K9310m916l0604r788
1520a6007K5681K2623j4708l0176q44K8897J4272k3055k6869Q675K9339M900k8440
1533e712j9564J7197K7239m013l0174j1128K4620K2855j3193k9224r11K8933J5684
1546B2609k0500k4867P775L0347O763k6596j8918J6507K8181l808k9072j1590
1558b3169K2792K2887j2824k9176l227K7578J5026k0370k5879O819K8210P366
1570A6033k5388k0069J5376K7745j526k7603j2016K3081K3418r415k7090l104
1582b0558K6927J7332j6717k4802O277K8653Q983k3472j9680J4129K6466J6k6513
$$ y = [-32467, -11557, 17187, 9660, -22749, -31512, -3754, 19657, 3522, -26383, -24152, 8030, 23252, 360, -24579, -12356, 19829, 25618, -2104, -20171, -9, 29301, 24385, -6219, -16007, 9674, 32297, 17589, -12587, -13431, 15466, 29738, 6683, -20186, -11511, 17828, 22728, -5712, -25276, -8079, 19160, 15147, -15027, -26155, -1535, 21320, 8127, -21097, -22008, 6925, 22609, 2109, -22758, -14983, 15364, 22127, -4469, -23387, -6880, 21301, 17493, -11579, -23169, -377, 22510, 9686, -19490, -22717, 4861, 19887, -483, -26362, -19543, 8667, 16033, -9355, -29424, -14048, 13697, 12171, -15432, -27448, -4367, 19051, 9636, -17454, -20558, 6369, 23701, 6984, -17818, -11541, 17112, 26095, 2623, -17057, -2928, 23538, 23554, -2959]
1595b959j3429J9553K2683r019k7963n073K4108J6279j6663k5485L163K6465Q967
1608B0627k2137k0742J1974K5824O29k5544j2990J8747K2834o816k6256n626K4248
1621D772J7379j5201k4207L174K5800J0116k1057k0539J1027K5402J454k4727
1633f607j4631J7387K2526o871k6548o276K2307J7139j4186k4582J722K5310J0811
1646A7501k0212k0077J0221K5271L121k3696j3682J7166K3179n148k4841o387
1658a7584K1980J8101j2398k3544R44K3877J1181j8418k0254Q053K4045L481k2965
1671c501j5030J4538K1413m321k4139q494J9770J7600j1797k3304p75K3476J1341
1684A6777j6623k0477P580K3630M590k0766j4860J3863K2486k851k2749q389J8966
$$ y = [-2959, -16388, 3165, 25848, 16829, -11134, -16207, 7901, 24180, 7517, -17968, -14805, 11660, 20627, -1510, -22252, -10278, 15546, 16175, -9369, -22359, -3612, 19222, 12406, -13850, -19476, 4772, 22151, 6950, -17257, -14083, 11717, 21833, 776, -19763, -8736, 16666, 18120, -6607, -21238, -3851, 18675, 11804, -14744, -21020, 1287, 18426, 4240, -20342, -18620, 6690, 17501, -2711, -22788, -12567, 12704, 15825, -7871, -21553, -4387, 18792, 13644, -11197, -17584, 4396, 22497, 10099, -13445, -12501, 11376, 22557, 4139, -16115, -8062, 15983, 19464, -3501, -18531, -3993, 17420, 13099, -11040, -19534, 236, 17836, 6039, -17265, -18040, 5436, 16777, 154, -20323, -12743, 10887, 15477, -5289, -20149, -6286, 16200, 13349, -9400, -17789, 1177]
1697A177J8047j0027k2654j433K2339J1864j6319k0104O189K2486M777k0534j5487
1710a9679J2516K1531k359k2387r633J8435J7919r181k2300j817K1614J2928j4659
1723B928j9605N345K3030O242j9148j5296J2229K1043n14k1770r579J6716J7913
1736A9534p784k2374k868K0094J2442j4276j9447L453K0878O689j8327j5962J0005
1749g943K0310J06k0400j0344J5408J8143o466k0736l791J9472J3400j2059j9008
1762a3908K888K0836P661j6433j5635R260J9809J272j9624j0911J4283J7398n819
1775A1077k0687m525J7732J3385j1795j9403J431J9872Q019j6501j5488P800J9639
1788A0556J805j8733j0533J3499J7363m220j9765m725J7337J3964j0777j8365
$$ y = [1177, 19224, 9197, -13457, -14890, 7449, 19313, 2994, -17110, -10921, 11565, 16342, -4192, -19679, -7163, 14368, 12009, -10378, -20011, -1576, 16343, 7162, -15138, -16955, 4659, 17587, 2928, -16677, -11332, 11698, 17940, -1208, -16504, -4275, 16768, 16254, -5516, -15095, 1621, 19534, 11750, -10624, -13492, 6602, 19044, 4768, -14679, -11226, 9652, 16341, -1986, -17948, -7943, 12367, 12473, -7927, -18271, -2863, 15280, 8814, -11922, -15713, 3759, 17159, 5100, -13908, -11020, 9816, 17477, 1044, -14591, -5331, 14478, 15750, -3874, -14785, -502, 16896, 11077, -9610, -14135, 3597, 16982, 5187, -14216, -12785, 7087, 15106, -1395, -16883, -9083, 10556, 12361, -6372, -16905, -3406, 13957, 9737, -10028, -14753, 2584, 16548, 5771, -12594]
1800a2594J369J8831Q880j5016j6357P418J9173J889j8591j1433J2262J6852m125
1813H558j9053o105J5744J3509r456j8547J14J8380Q743j3653j5748O645J8661
1826G792L584j6501j1064J1438J7581k556j7726n918J5256J4058p806j7819j92
1839i873J7641R352j2921j5799N366J7600L476j5965j1863R812J6075j900j7549
1852f548p407J4125J3565p399j7292j324J6823R266j1540j5042M339J7606M621
1865A3793j4868j1624R267J6876j074j7093o835J3155J3890o713j7310j985J5931
1878E410R443j1946j5256L157J6753M404j4977j2269P843J6013o63j6697p524
1891a6309J2652J3728n538j6225k103J5198J0214r875j4599L363J7283N350j3497
$$ y = [-12594, -11225, 7606, 16486, 1470, -14887, -7469, 11704, 13593, -4998, -16431, -4169, 12683, 8558, -10495, -16600, -856, 12653, 3197, -15350, -15236, 3144, 11887, -1766, -17514, -10869, 7792, 11376, -5125, -16189, -4751, 12830, 10274, -7452, -13370, 1886, 15944, 8138, -9681, -9873, 7768, 17120, 4199, -11600, -6234, 11366, 14842, -1123, -12986, -3174, 12901, 11001, -6548, -13955, 170, 13735, 6336, -10956, -12280, 4543, 13809, 2269, -12773, -8434, 9172, 13793, -1075, -12699, -3432, 13444, 12370, -4723, -11558, 1597, 15487, 8774, -8536, -10521, 5410, 14853, 2907, -12349, -9192, 7561, 11965, -3012, -15281, -7438, 8575, 7912, -8785, -16309, -3657, 10071, 4533, -11692, -13795, 1403, 11617, 1742, -12857, -9494, 7789, 13139, -358]
1904c58j1122P712J5915P57j5356p929J1766J3545m804j6214l112J4099R458r203
1918E154j4907J398J5077N584j2759j2500O272J5398L94j4724q005J0416J3541
1931A0339l795j5310l521J3980J0799q284j4376J648J5073O612j1849j1880N823
1944d741J4636J420j4261q624R871J3088m153j5184m390J2524J0128q258j4511
1957a2455K62J4327O079j1298j1969N094J4908J654j3031q378R680J3418k144
1970F147j3875l871J2603J0877o375j3363M65J4006P075j0288j1334M468J3680
1983A0215K618j3017q736P992J2595k262j3818n532J1121R941o305j3734o43J2770
1997C205P019r384j1723L780J3638L092j1403q537P641J2701k71j3186m691J0345
$$ y = [-358, -11480, -3768, 12147, 12904, -2452, -10381, 1385, 14930, 10126, -6088, -9200, 4899, 14357, 5154, -9753, -8355, 6722, 12306, -453, -12953, -6681, 8717, 9111, -5613, -13618, -3202, 10339, 6544, -8766, -12287, 1693, 12492, 4208, -10168, -8520, 6553, 13165, 1316, -10564, -4741, 9895, 11315, -2946, -11570, -1699, 11389, 7236, -7948, -12338, 186, 10314, 2056, -12455, -12193, 2134, 8213, -3085, -15054, -9960, 4948, 6602, -6429, -14807, -5127, 8291, 6147, -7728, -11599, 1004, 11881, 5506, -7857, -7392, 6614, 13689, 3401, -7933, -3465, 10215, 12833, -184, -8920, -928, 11667, 9405, -4413, -9945, 1176, 11117, 4812, -8922, -9565, 3205, 10224, 840, -10883, -7103, 6535, 9627, -1776, -10313, -2672, 10029, 9758, -3428, -8119, 2226]
2011B226J0752m982j3135r12J2198P191r357j1528L085J2237K887j1748r125N876
2025d335J1587p80j3271n864R953R933n212j2741j141J1717P573p905j1356L162
2039h680J3034L844j0473q146O518J2462n1j1921n301R404J0669m549j2201j787
2053g178J1012P365p715j1442J615J1514L772j0037r486N233J1383k86j1518n814
2067a1582Q511J0022l238j1494j959J0459Q181o353j0440J665J1794M687q783
2080A470q525M865J1488Q72j0665n982P407R571k867j1740l138R683P304o458
2094C285j1213L29J0534M515r420r009M159J0805J149j0369o245P591R803k128
2108C786j0295k888R710P810n321r777N63J1027M903p881q856L892J0834J367
$$ y = [2226, 12978, 7996, -5139, -6051, 6147, 13338, 3981, -7547, -4462, 7775, 10662, -1086, -10211, -4335, 7252, 6472, -6799, -12663, -2710, 7223, 2011, -10730, -11871, -154, 7419, -486, -11842, -8680, 4354, 8198, -2275, -10421, -3903, 8559, 8508, -3413, -8714, 690, 11359, 6810, -5391, -7178, 3834, 11199, 3484, -7958, -6343, 5171, 8943, -1094, -10580, -5347, 6036, 5750, -5768, -11582, -3071, 6951, 3713, -7781, -9740, 719, 8900, 2547, -7893, -6228, 5566, 10253, 1470, -7055, -2190, 9298, 10170, -495, -6477, 930, 10501, 7634, -4106, -7244, 2439, 9743, 3285, -7928, -7599, 2935, 7450, -1970, -10979, -6820, 3985, 5134, -5235, -11480, -3889, 5914, 3786, -6509, -9397, 313, 8123, 2802, -6975, -6412, 4615, 9518, 1637, -7219, -3327, 7507, 8874]
2122H874j0189n843O615R108k585j0268l469Q479P319n194j0482Q1J0000M841
2136G287p851q282L113J0676K164r170o163O283R690q43r920l315Q705P807m380
2151E801r672R2R424N463p220q740K623R587J977q622p166N011Q860j020j0182
2166c784l935P015P579m498r519p93Q757N231o581q238J933R618K591p902o516
2181i042N220Q648l37q890l776P374P373l323r217q81Q322N307n865q414J783
2196e718R267K361p793o824M408Q773m6q803m235P203P303l132q575j256Q318
2211A251N593n264p822J525Q769L055o725o358L981Q397R22q104m462O043P455
2226H256k420q645j666P530N483n243p619P44Q252K846o698o558L164Q088J89
$$ y = [8874, -1315, -7158, -543, 8565, 5980, -4288, -7757, 722, 8041, 2847, -7635, -7554, 2446, 7287, -564, -8846, -5733, 4943, 7107, -2063, -8226, -1943, 7747, 6904, -3016, -6331, 2374, 10181, 5801, -3871, -3779, 5645, 11108, 3888, -4852, -2229, 7358, 9335, 713, -6453, -1442, 7418, 6398, -3784, -7719, -704, 6875, 2377, -7142, -7935, 822, 6053, -528, -8766, -6833, 2785, 5376, -2526, -9042, -3822, 4826, 4489, -4401, -8177, -803, 6570, 3247, -5970, -6851, 1471, 6778, 913, -7501, -5718, 3549, 5910, -1883, -8707, -4299, 4474, 4428, -4375, -8610, -1407, 5896, 2764, -5811, -7067, 1251, 6844, 1580, -6242, -4717, 4052, 7107, 382, -5976, -1995, 6402, 7324, -780, -5242, 801, 8256, 5836, -2809, -4475, 3055, 8538, 3295, -4324, -3580, 4672, 7518, 820, -5738, -2574, 5514, 5703]
2241E703p832m489N172P166j852q010k098O700N368m165p674M43P475L312n958
2256g39o275K920P713J219p710m457N380O786j195p716k161O822N551l643p667
2271e172M60P522L493n621o187K983P014J332o810m473M548O720j182p322k501
2286e196O209N429l422p152j84P229L094m768o404K379O977J677o526m233M371
2301e20O327n33p059k892N925N476l132p070m28O652L363m827o145J379O623J306
2317D445n952m815L349O282o32o975k661M954N124k503o684l65N976M027m739
2332a169n186J760O619K052n628m419L862O212J61o097k898N012N233k339o391
2347c216o66N807L747m329n844J141O518J582n527m738L298O023j44o286k804
$$ y = [5703, -2129, -6618, -1446, 5720, 3868, -4142, -6240, 460, 5828, 1663, -6011, -5568, 1907, 5219, -739, -7014, -4094, 3619, 4838, -2872, -7329, -1949, 4837, 3642, -4074, -6235, 587, 6138, 2495, -5172, -4712, 2810, 6303, 682, -5505, -2522, 4492, 5824, -986, -5459, -911, 5809, 4627, -2695, -5196, 1013, 6442, 3020, -4132, -4316, 2913, 6007, 1239, -5165, -2786, 4191, 5868, -658, -4891, -520, 5807, 5274, -1785, -4677, 1248, 6724, 3592, -3478, -3906, 2746, 6109, 1282, -4863, -3484, 3139, 4445, -1507, -6322, -2973, 3309, 2677, -4298, -6959, -2005, 3119, 616, -6068, -6433, -457, 3570, -1169, -6355, -4595, 2024, 4076, -1552, -5971, -2109, 4103, 4264, -1833, -4731, 281, 5514, 3175, -3216, -3882, 1925, 5672, 1343, -4501, -3360, 3158, 4740, -787, -5525, -2227, 3796, 3652, -2634, -5438]
2362e438M634N305j719o220q56N822L984l481n687J198O197K299m644m799L115
2377b90N173M73n689k996M113M763j827o074j844N109L797l504n697N07N415K378
2393C807m561m522J966N674O05n054k981L963N175j232n347j538N225L839k259
2408B760n483N25N429K167m133m279J882N132N65n153l375L055M989j266n422
2423b607k044M499L594k694n687N50N156K034l408m642K177N284J019m554k845
2438d168L103N020q83m686j896M457L498j865n318l38M536K819l800m615J584
2453b552M374J020m434l154K566M658p55n224j500M071L845k008m569k55M701
2468G84K838k604m460J628M912J144l569l133K393M469P9m999j807L169L528j625
$$ y = [-5438, -804, 4501, 2782, -3438, -4294, 1528, 5512, 2031, -3656, -2458, 3739, 6038, 1394, -3405, -290, 4883, 5356, -333, -3329, 784, 5547, 3720, -2354, -4198, 911, 4708, 1204, -4493, -3986, 1429, 3807, -754, -5276, -3310, 2364, 2969, -2085, -5066, -1103, 4072, 2840, -2507, -4045, 1180, 5019, 2760, -2723, -2198, 3231, 5398, 1265, -3014, -1132, 4000, 4565, -588, -3963, -908, 4081, 2815, -2607, -4651, -152, 3442, 748, -4939, -4389, 767, 2801, -607, -5249, -3072, 2212, 3231, -1323, -4168, -1065, 3955, 3072, -1614, -3510, 947, 4445, 2580, -2738, -3076, 1460, 4279, 479, -4136, -2552, 1822, 2842, -1592, -4746, -2180, 2478, 1723, -3501, -5001, -930, 2915, 907, -3662, -3917, 784, 3622, 1018, -3442, -1814, 3098, 4242, 673, -2460, -67, 4402, 4481, -518, -2325, 844, 4372, 2747]
2484B747m681p79M119K083l164m072O46M030J108l765l477K853M025m7m005k031
2500d410L221L760j140m228n53M437L086k846m151J464M124J363l269l417J919
2515f40M237r0m680j873K794L339j405m110j193L730K517k799l487O25M317J283
2531B565l136k723J973M006K14l267j739L063L142m79l695j300M121K503k242
2546C006l414J28L289J410l232l242J554L256k3l908k323K107L365j349l711j174
2562d261L088K605k093l499L72L858J391k743k601J329L548Q02l072j992K347
2577i21L131m83l341r23K630K601j841l648M72L010J465k660k762J049L455J07
2593A341l130j758J969L188o61l282p90L025K397j175k888K91K773J882k070k568
$$ y = [2747, -1934, -2713, 1406, 3489, 325, -3747, -3101, 929, 2037, -1728, -5205, -2352, 1673, 1626, -2379, -4410, -1189, 2571, 1431, -2797, -3350, 1087, 4173, 1327, -2824, -1360, 2764, 4127, 858, -2559, -640, 3597, 3507, -1173, -3046, -252, 3087, 1682, -2428, -3621, 109, 2626, -173, -3660, -3035, 1282, 2565, -571, -3294, -1321, 2685, 2899, -368, -2107, 956, 4098, 3619, -76, -1376, 2745, 5248, 3006, -408, -280, 3009, 4419, 1187, -2055, -501, 2755, 2732, -1176, -3499, -1392, 1973, 624, -3087, -4261, -1173, 1432, -661, -4160, -3788, 70, 1461, -1282, -3883, -2554, 994, 1796, -1276, -3268, -921, 2210, 1727, -1614, -2537, 93, 2694, 853, -2795, -2323, 687, 2152, -508, -3270, -2221, 1234, 1341, -1789, -3547, -1578, 1610, 949, -2333, -3123, -98, 2299, 1124, -1764, -1473, 1300, 3182, 1112, -1456]
2609a456J305L038O18k628k302J859L054l01l418j240K233K245j466k929q0K522
2625A054J618k410k502N61K835J068k783k091J629K934o28k579j441K291K466
2640B022j212k689l57K587J695j868k673P25K680P39k576j651J375K428M32l128
2656a471r63K402K138q20l011o2K750J562j598k421O65K792J211k561j910J276
2672b1K365N74k967j477K115K013q95k847l29K219J390j573k633K12K541J012
2688A699k213k091J488K437K12k560j364K400J838m79k634j76J688K024j201k499
2704a431O38K083R86k206j918Q92K145J98k440j808J394K066p11k576o31J556
2720a763K087j517k132L91K309R55j726j413J061K454O55j827j043J862K240p12
$$ y = [-1456, -151, 2887, 3505, 877, -1425, 434, 3488, 3187, -231, -1471, 762, 3007, 1541, -1388, -1468, 1054, 2672, 262, -2240, -1679, 1156, 2224, -559, -2650, -1021, 1913, 1285, -1294, -2735, -444, 2022, 810, -1879, -2236, 351, 2046, 178, -2495, -1770, 910, 1649, -927, -2578, -1203, 1225, 1657, -1471, -2434, -32, 2106, 1286, -1725, -1787, 963, 2525, 927, -1494, -829, 1963, 3174, 613, -1297, -21, 2344, 2918, -49, -1526, 589, 2602, 1707, -1140, -1469, 750, 2140, 567, -2066, -1854, 687, 1699, -514, -2605, -1117, 1320, 1532, -1028, -2392, 8, 1846, 1367, -1267, -1443, 245, 2269, 1068, -1431, -793, 1290, 2276, 70, -1848, -956, 1189, 1387, -1053, -2861, -1467, 599, -112, -2688, -3319, -1763, 324, -1193, -3325, -2934, -625, 330, -1396, -2809, -1748, 706, 1361, -466, -1509, 353, 2593, 1881]
2736A881j463p85K102J773j332j975K14J890L95j480k043J72K239j49k214j595
2752b370J147K071p88k347l47J187J870j079j727k0K512J128r84j796J043K308
2768A808N74j316j263J205K030j64j769p75J387J609j187j942l07J672M71j577
2784D56j946m2J979R3j947j221O00J769m3j875p48J680J641m55j625L56J414J317
2802A403n84r77K44J950Q21j591r94J034J195k76j432q60R98J115p04j692q31
2819a181J155N65j356j426J3J237P20j453j535R22J354M19j373p45J419J214N4
2836Cj268N0J885R78o04j555Q83J563K68j139j127R23J114l31j474q68J014J043
2854A358o65j734l82J321O10j210j316M73J050M31r23j078P97J334K13j062o51
$$ y = [1881, 418, -367, 1735, 3508, 2176, 201, 415, 2305, 2700, 1220, -823, -651, 1588, 1439, -775, -2370, -1223, 848, 60, -2287, -2634, -1447, 423, -656, -2383, -2403, 109, 1237, 253, -1543, -500, 1808, 2382, 1066, -197, 1008, 3038, 2874, 1105, 330, 1717, 3326, 2139, 197, -110, 1562, 2033, 456, -1490, -1532, 447, 540, -1407, -2628, -2028, -259, -302, -2177, -2925, -1245, 396, -59, -1684, -1328, 86, 1403, 819, -158, 86, 2036, 2857, 1266, 272, 1306, 2501, 2225, 793, -67, 931, 2046, 1342, -350, -1181, -26, 539, -817, -2243, -2230, -993, -273, -1726, -3261, -2339, -985, -566, -1939, -2684, -1265, -51, 3, -1265, -1215, 670, 1648, 1044, -511, 372, 1935, 2203, 1064, -63, 860, 1974, 1643, 169, -699, 315, 1358, 693, -1041, -1423, -102, 508, -702, -2018, -1545, -495, -64, -987, -2065, -1268, 66, 279, -783, -1434]
2871a434J302J263k38j331l80J715R88m73j667L10J329N55j125r88K49J097M03
2888A575j465o72K34J214m64j405r7O97O66k18j446R4J156O40r59j033P40J246
2906E03p1q47p91J113J226m78j041K3R28P87m59j072M62J002N92j081q75O81R84
2925A586k27p21n32N81Q48m23j129n73O89J126j044j006P4N96O74r73o20K3J066
2944A5K50q88q29N12O15L61j141l94J050R06q11l47r9R63L89m54p32K20J226L
2964H15q57j17oP50o9o70o02L68J179p80j136k55R61M73q65q10M7Q94N42j050
2984a188l64O58Q19K11q76Q7N66R85k85p45P7J026Q44n36r97J95R17K70n81p39
3004C44K73M17K10r50q52M09M56k99r99k14P49q0q3o22Q9M32N03m96n70O02R59
$$ y = [-1434, -132, 1131, 893, -438, -818, 897, 1885, 1412, -255, 55, 1384, 1939, 814, -174, 75, 1172, 1575, 110, -562, -328, 886, 422, -983, -1080, -383, 283, 65, -1381, -1287, -131, 509, -450, -1483, -743, 503, 432, -415, -1206, -93, 1133, 655, -386, -363, 565, 1352, 893, -179, 283, 1285, 1877, 796, -79, 602, 1586, 1359, 638, 106, 687, 1535, 1112, -17, -590, 99, 1225, 181, -825, -751, -155, 519, -454, -1074, -1051, 15, 265, -623, -1452, -940, -325, 36, -1105, -1499, -449, 457, -354, -701, -800, 163, 552, 98, -634, -414, 812, 815, -42, -159, -165, 585, 516, -154, -756, -388, 791, 11, -1125, -1380, -419, 54, -811, -1621, -1574, -680, -138, -1188, -1552, -894, -75, 136, -740, -653, -87, 898, 613, -132, -55, 971, 1815, 1279, 282, 477, 1394, 1664, 1083, 344, 617, 1034, 1244, 294, -558, -149, 307, 8, -991, -1205, -456, -536, -619, -1241, -1152, -720, -217, -713, -1283, -681, 278]
3025B78P5o7p01N49J264j78m54j58M96N08k18o42o1M67K72m97p15k19O97M8r17
3046a73o49M29K77l89n69l21M80O07l70m11J53M53O61k13l03K88N01N26m79k92
3066B06M78P96n23k02j12N57J95m27n95l03P21j70q51m80J48M0j99l67k85o1N45
3087h89K38n97j93M52L66k6k88n5R37K96j13l14L19O43L56m21m36K42K10K79p16
3108B90l12O20k56m46m84j14J39o1j62j62l50O38o6m47J71J74L84M20n55l2L22
3129b89L63J25J57j36O18j87J27k72j58O69n6k9q68L90K55j40n90m93M33J35k78
3150b24n64Q8K58L09n29j7L68P3M10m15K92K30J97N02j92k95L15N24J54l61j7
3171A106j47M08m99j55k61J41m2l18k81k89J79J45m25j57j65M35l57k10k77L54
$$ y = [278, 353, 286, -415, 134, 1398, 1220, 766, 608, 1104, 1612, 1394, 752, 691, 1158, 1430, 933, 218, -1, 696, 744, -173, -822, -393, -116, -505, -1074, -1395, -915, -308, -678, -1089, -936, -483, 178, -35, -338, -50, 451, 977, 498, 206, 684, 1480, 957, 755, 643, 1200, 1395, 968, 373, 70, 791, 621, -230, -710, -562, -522, -721, -1088, -1373, -1434, -889, -651, -1248, -1441, -989, -623, -649, -937, -992, -55, 241, 128, -186, 133, 776, 1132, 711, 275, 517, 727, 1006, 290, -22, 598, 342, -104, -588, -702, -563, -624, -786, -948, -1298, -660, -726, -1173, -1002, -828, -444, -24, -579, -611, -289, 74, 199, 356, 220, 838, 651, 778, 506, 348, 1017, 961, 932, 64, 454, 709, 569, -21, -514, -81, 54, -224, -788, -700, -442, -133, -662, -679, -311, -238, 172, -243, 49, 279, 476, 978, 786, 491, 806, 1330, 1484, 1123, 1106, 959, 1367, 868, 713, 452, 593, 551, 233, -48, -337, -158, -13, -438, -595, -760, -325, -682, -892, -1169, -815]
3191h15M74j03j44k70P75K21J30j72K38KM12j51j07J29J96k64n12L73j62j16r0
3212D4m01k56k0Ro3j76k8j96K29j8m07K96L30J09K6l4K35L67J93k73L04l8L44
3235E76q3J27j15M95Q5m39l35M8K10k4l17L4m21R1l10Q8k70O9k53N0j71J13K67
3258d85j76k5j99K29L77J39k46K94J7L06K32J12L8K26Mj75J06j19J70q3j26l99
3280B17J71q4O5j68l47L15R8m59l46L35j28J14j30J8J26J08J3m6k0mL21j16Q9
3303A42j20K99J87K18j68N9L77l35oj61M52k14k91j23J15j53k3k49N4k57J62l88
3325d23K3j3j05q7J26P8l13J21j95K69j51K47k25J34K3K75O9L8j2qK09k87J32
3348g5K81l99N29J28j97lj20R0j94Q6k11J02J4o2l77m3P5k36r9K80m87N74p56
$$ y = [-815, -341, -444, -588, -858, -83, 138, 268, 96, 334, 336, 748, 597, 490, 619, 815, 551, 39, 412, 250, 134, 44, -357, -613, -633, -624, -687, -863, -891, -1087, -858, -876, -1283, -987, -657, -548, -522, -556, -321, 46, 239, -34, 270, 232, 576, 493, 620, 505, 1000, 1085, 646, 311, 359, 569, 545, 228, 262, -159, -68, -378, -290, -560, -491, -744, -694, -865, -752, -485, -661, -686, -885, -656, -279, -140, -386, -92, -75, 231, 463, 575, 613, 839, 843, 668, 774, 655, 825, 742, 616, 217, 388, 304, 369, 201, -146, 169, 267, -192, -538, -203, -331, -217, -347, -329, -203, -95, -82, -128, -148, -152, 169, 53, 142, 22, 321, 508, 726, 558, 617, 994, 659, 653, 492, 944, 730, 439, 316, 431, 278, 255, 6, 60, -197, -35, -423, -400, -413, -518, -605, -479, -401, -714, -593, -788, -519, -670, -423, -648, -514, -491, -216, -147, -109, -121, -129, 80, -207, -75, 206, -193, 336, 464, 267, 264, 144, 234, 40, 126, -85, 17, 31, -31, -408, -451, -376, -612, -711, -431, -918, -344, -1100]
3371a100N94l46M58l13L88j06K3K67o4M80n02L91J1K9K58O1L34q4l4J31j06j17
3393F53j28j10K55k71r6j98k54J36Q6k68k92Q7m52J19k4J40oj42O5R3K92K5R4
3416a96J01M86L9L00M4k35K58r9J92K44rJ67l03j03N2p3j12k82m05j06M50p25
3438c15n9j23Mj22k25j42J38K72j58j53K15j57O42J69k84K43J04M81J93l56K04
3459E71L32r0j47J75l89L98O6m43O1r0o0k81Lm53l38K05k27k55k19m8n2R4M5K48
3483h94J81k47O0K11J29M29K77J43R0p4J77K23o4J90k70L22k83j36J34j10q9k70
3505A29m18L35j82j36k08j51j43Jr9Q9R6n1J91K15l81L67j57M25L28o35N45L10
3527D70L07n5m35M11K81k99J02j95J85O7l42j11N6j59j72J56l23J86k53K44n42
$$ y = [-1100, -506, -852, -394, -707, -319, -425, -402, -135, -199, 281, -221, 170, 181, 210, 468, 529, 863, 779, 745, 876, 770, 653, 525, 415, 670, 399, 303, 105, -149, -13, 73, -195, -487, -400, -852, -733, -757, -617, -623, -765, -700, -607, -315, -290, -196, -95, 391, 430, 730, 774, 539, 797, 698, 890, 1134, 1125, 1292, 989, 886, 938, 865, 753, 471, 66, -40, 410, -315, -374, -497, -493, -615, -840, -982, -844, -572, -730, -883, -668, -825, -183, -14, -298, -55, 49, 530, 723, 367, 571, 903, 813, 666, 841, 452, 850, 916, 473, 534, 444, 384, 103, 106, -347, -685, -480, -707, -962, -1181, -1229, -1281, -1187, -1142, -894, -713, -960, -900, -689, -560, -131, 146, 289, 379, 305, 482, 705, 641, 831, 561, 883, 600, 464, 598, 488, 399, 129, -289, 46, -136, -272, -480, -631, -774, -773, -872, -783, -687, -738, -547, -332, -713, -346, -503, -78, 250, -385, 160, 470, 777, 722, 287, 698, 979, 680, 782, 587, 772, 839, 497, 386, 442, 283, 111, 267, -56, 130, -123, 121, -421]
3548d21j2J65O8J24k74j21N3M78J2k61K03N07mM8j23J25R7n5q4j98K70J42l88
3571C51l42J72L92l13l33k54J27k4J45j50p5Jk22J23o1n0J9L31N7j08j06J37N9
3594a24j09N5N7K35K47o19J71O7J72J24j75n27J3N37n4l10o4j18O4J52L6k6J74
3617b2q6K41k23O5L94m63L73n44L51J68j51J00o18N16q1mR3l28K08N1O3n65LL95
3641f4L2k15k16K91K59l17r5P0k9J89J67N5MJ91K33n8j83j52L30O76n03l27M2
3664C80M11o82Q1n4K30k38n2m66P5J83L8q2m02L63j22K45l23L02j24L98J6m70
3686b93L52L40K14k46J51j58M7L16L0m57L21j84K95k15m57K6m4p0k53l9l13L36
3708c01nm44j51N13j59L6m9J02K48R4k7j94J74N00k11n6N6N4K38Q9k36J32k19
$$ y = [-421, -433, -268, -200, -76, -350, -471, -418, 60, 72, -189, 14, 521, 517, 565, 442, 567, 664, 609, 525, 327, 597, 739, 351, 9, 181, 573, 260, -73, -327, -200, -224, -79, -229, -304, -303, -525, -402, -463, -513, -494, -163, -106, -214, -320, -183, -124, -233, -178, -121, 114, 361, -258, -87, -20, 152, 276, 101, -426, -413, 124, 70, -240, -304, -422, -358, -206, -170, -196, -22, -108, 133, -90, -25, 369, -94, 279, -265, 86, 254, 103, 203, -415, 101, 20, 16, 109, -219, -11, 40, 103, -462, -459, -64, -32, -247, -463, -172, 87, -230, -325, -255, -284, -95, 72, 127, 131, 322, 555, 497, 314, 162, 492, 1168, 665, 338, 380, 791, 109, 190, 136, 366, 128, 76, -390, -315, -132, -94, -176, -578, -215, -337, -92, -415, -113, -237, 161, 177, -293, 59, 399, 613, 367, 518, 360, 407, 723, 753, 296, 617, 433, 728, 513, 56, 82, 38, -32, -285, -324, -637, -301, -306, -750, -901, -388, -547, -511, -560, -458, -210, -116, -143, -337, -163, 337, 126, 70, 126, 180, 418, 507, 271, 403, 184]
3731A84J77j48m85K7L30L8k52l45J12r5J06l33k20J68Q0J89k52j48L32K08Q3k23
3753d67l4M77M01m44n3K92j09N85l87J6J3j4M12l10Q4j92J49k90j26q7o1N75o30
3776b00Q7l49N51l82k06j87J30M49j52J7j19L47P3L8l6k37O72k6L3k97L26Q4l39
3799B77M38l42J12K35k60k02j03M3j11j12j51K17Rj05j59j33P8P8K50n82K52J99
3821g2J1J96k41l9L45K31k05m14L40P1J09M0j90n3M6K0l52M41n18L92j48k35j54
3844c79J31j12Q4k05l0L08J56j99j15K33K38n72N32k09j83K67R0l9j62L5Q9K62
3866B20m0p8p9L62l32k82J77N5Jm99K75j72L55K87k58k76r8Q9J10R0j98N12k08
3889A3Ql46K67J88r6K46r3l5L24l59K44m13K40j61K60k08K4J20j43N3j16r5K16
$$ y = [184, 361, 213, -272, -245, 85, 123, -129, -474, -362, -457, -351, -684, -904, -736, -656, -467, -719, -867, -535, -327, -244, -467, -501, -24, 377, -67, -120, 172, 63, 648, 261, 277, 290, 276, 688, 378, 462, 270, 419, 129, 3, -84, -145, 430, -200, -113, -462, 89, -293, -499, -686, -556, -107, -259, -242, -361, -14, 59, 97, 61, -176, 496, 470, 503, 206, 532, 616, 277, 715, 373, 485, 720, 460, 258, 155, 198, 87, -25, -176, 41, 50, -55, -214, -347, -269, -191, 59, -523, -271, -72, -61, 135, -106, -145, 200, 431, 226, -188, 152, 223, 332, 372, 182, 129, 175, 195, -157, 284, -234, 158, 10, -225, -379, -248, -360, -276, -481, -511, -203, -47, -246, -361, -128, 110, -462, 70, -139, -322, -55, 35, -4, -166, -131, -42, 220, 180, 102, 23, 385, 53, -229, -52, 3, 4, -495, -220, -392, -37, 250, -8, -284, -382, -293, -183, -93, -291, 221, 13, 21, -325, -58, 130, 34, 280, 187, 152, 476, 117, 361, -52, 188, 27, 287, 79, 103, 223, 80, 133, 17, -78, 138]
3912A38J8k21p4k17K17J01r9k04M73k57L50k67J94K56n0j86J12l28N74k99K65
3933D96l9q2J45m73L15N1p1j60K94m70j31K94o9r3J9j22O5jj91l24L95J3N3J4
3957g2l44N79k17Q6J11k7J72K76k43m14K81j29J02J37l44J73k83J93j5q2K70k41
3979c1%r1k57J48j91L6j77J18nOk48QL31p2O8q7K95K84r9J86o6k86K98K40j73
4004B35k19N1L0O6J06j66o2K29J2n08Q2J1K8J5k60M4J21J45m52L2L61l32J21j08
4028d18j44J23K34K45l01K05o3M3K61J00j57J97M3M8J76j05O7l9j00k28k3K48
4050D12j24j86l2r8j47J38j42N4j17L7J42j93j44J29Q2K6k1RJ47K42J51l64L74
4073C75r6R2P0K36k94K14m7j13oK5j88j45m8K00J02n75o2n6J49k8J22k89k69M05
$$ y = [138, 156, -65, -139, -356, -139, -38, -137, -341, 132, -125, 225, -42, 152, 408, 358, 172, 284, -44, 530, 231, 496, 457, 375, 520, 47, 362, 413, 342, 182, 476, 6, -125, 169, 100, 7, 26, -96, -31, -32, -223, -547, -152, -139, -86, -72, -416, 163, -54, 32, 143, 116, 288, 564, 321, -93, 188, 59, 161, 298, -46, 127, -156, 37, 22, -60, 210, -31, -31, -122, -379, -231, -422, -386, -563, -445, -450, -444, -692, -684, -353, -425, -357, -444, -149, 135, 36, 222, 156, -130, 168, 408, 235, 16, 67, 97, 163, 269, 103, 41, 270, 282, -226, -144, -133, -105, -90, -350, -306, -185, -40, -492, -460, -99, -431, -310, -418, -562, -439, -205, 40, -261, -56, -119, -76, 185, 285, 128, 325, 368, 416, 592, 487, 554, 515, 415, 187, 164, 412, 288, 102, 70, -28, -175, -37, -179, -125, -242, -205, -63, -256, -400, -271, -189, -163, -184, -175, -28, 214, 365, 1, 375, 279, 371, 441, 677, 383, 597, 550, 437, 431, 456, 268, 123, 75, 275, 377, -198, -260, -316, -167, -195, -73, -362, -631, -226]
4097b26j46J17l97N7J93J91o0k61K59J71L76j31J35j02K71J62l42j64M11k61J6
4118B69j25j48J81K5J04k85l69K94j87j68k25J48J84j48P8j79L74m08K67k2j09
4139d49K14k9M13p3j8J84P0n2k18M84K6j43K52k22j13J30rk66j70N0j08j1l7K08
4163A13m18O5L4k59J73j15k5nR6L6K15j34L21m10N61k71L76j25J41n9M27q8k06
4186D43k74N5J07l3K8j39k55k73K83l7J95k34j38J47m79K11K39j26J10J26r3P4
4208f3j08j49N13l4k58K78K63k23R7km0M3j5q1K15l98M02j69l98q2J57J68O4j99
4232a9j13nm8k7J02j88J52m59Q6O8J74P2N1k8K55l9p3j0J99j41Q7j89N9l2J81
4257A15j51J52NQ8o45N50r5j2m03J9Q6q3J97pj87j01M59j11ON6k06K28j34M35
$$ y = [-226, -372, -255, -652, -595, -402, -211, -271, -532, -273, -102, 274, 143, 278, 176, 447, 609, 267, 103, 514, 253, 269, 144, -4, 177, 202, 306, 21, -348, -54, -241, -409, -634, -486, -302, -450, -372, -551, -177, -585, -318, -340, -449, -235, -264, 149, 76, 58, 242, 312, 260, 42, 526, 552, 409, 661, 439, 326, 456, 447, 181, 11, 61, -47, -58, -95, 113, -305, -240, -206, -465, -292, -407, -432, -437, -341, -305, -90, -224, 97, -313, 248, -23, 353, 228, 369, 310, 737, 649, 443, 169, 224, 331, 298, 326, 187, -68, -341, -58, -95, 100, -134, -272, -125, -604, -393, -154, -280, -170, -44, -137, -63, -171, -320, 193, 159, -99, 179, 442, 219, 316, 314, 274, 317, 302, 221, 436, 38, 440, 271, -127, -209, -52, 116, 180, -19, -132, -137, -185, -212, -110, -298, -146, -605, -519, -451, -277, -205, -154, -182, 73, 34, -39, -49, 150, 9, 96, -93, -34, -66, 115, -36, 116, 121, 209, -436, 114, 19, 7, -396, -377, -291, -374, -177, -184, -371, -472, -13, -124, -118, -62, -268, -40, -174, 261]
4281B61rj67M62m88K4J51K60m61j95mK03M3J05oj94m9J45j15q8K62l33K20R5k78
4305a56q5K34N7l2p0J7Q5J02n1J30j16j29K51M9j99J62J39l10J24j31q9Q6L4J07
4329B09j81q3J25J13k34q8J50m2j49j20L41k97K35P1o1J08L6J95m41K53k90K82
4351A32MK27j18Ol31J85k65o5J90j12O9r4L12l18r0n9L40l61L7q7l7J29J33m8
$$ y = [261, 252, 85, 547, 59, 83, 234, 494, 33, -162, -166, 37, 80, 185, 179, -15, -64, 81, -34, -122, 140, -193, 27, 122, -156, -241, -7, 50, 18, -52, -35, 50, 152, 101, 231, 115, -14, 237, 286, 87, 249, 388, 78, 202, 71, -18, 68, 102, 209, 28, -55, 70, 183, -51, -139, 11, -31, -180, -300, 41, -256, -21, 50, -11, 97, 133, 328, -113, 140, -150, 132, 136, 363, 245, 251, -80, 105, -160, -225, -35, -147, -78, -172, 140, -178, -268, -327, 13, -348, -311, -398, -435, -306, -173, -221]
$$ [...]
8191c74
##END NTUPLES=NMR FID
##END=
