##TITLE=1H_Pr o-Br
 CDCl3, 8 sc, 
 9.6.2020
##JCAMPDX= 6.0         $$ Bruker NMR JCAMP-DX V2.0
##DATA TYPE= NMR FID
##DATA CLASS= NTUPLES
##ORIGIN= UXNMR, Bruker Analytische Messtechnik GmbH
##OWNER= root
$$ XWIN-NMR		Version 3.5
$$ Tue Jun  9 12:37:27 2020 Russian Standard Time (UT+4h)  she@DPX200
##.OBSERVE FREQUENCY= 200.1315
##.OBSERVE NUCLEUS= ^1H
##.DELAY= (6, 6)
##.ACQUISITION MODE= SIMULTANEOUS
##.ACQUISITION SCHEME= undefined
##.AVERAGES= 8
##.DIGITISER RES= 18
##SPECTROMETER/DATA SYSTEM= spect
##.PULSE SEQUENCE= zg30
##.SOLVENT NAME= D2O
##.SHIFT REFERENCE= (INTERNAL, D2O, 0, 15.7039)
##AUDIT TRAIL= $$ (NUMBER, WHEN, WHO, WHERE, WHAT)
$$ ##TITLE= Audit trail, XWIN-NMR		Version 3.5
$$ ##JCAMPDX= 5.01
$$ ##ORIGIN= Bruker BioSpin GmbH
$$ ##OWNER= she
$$ F:/spectra/data/she/nmr/H-F/1/audita.txt
$$ ##AUDIT TRAIL=  $$ (NUMBER, WHEN, WHO, WHERE, WHAT)
(   1,<2020-06-09 12:36:21.00 +0400>,<she>,<DPX200>,
      <created by zg, POWCHK disabled, PULCHK disabled
       configuration hash MD5:
       00 E9 B6 7A A2 85 ED C7 34 08 36 98 17 FE 4E 26
       data hash MD5: 16K
       FD EC 11 03 9E 5F 77 A8 A8 80 F8 8A 27 F8 3E FF>)
$$ ##END=
$$ 
$$ hash MD5
$$ 18 AB 41 B2 56 DE 01 99 16 ED 75 DD B6 41 C5 31
##$RELAX= 
##$RELAX= 
##$RELAX= 
##$RELAX= 
##$RELAX= 
##$RELAX= 
$$ Bruker specific parameters
$$ --------------------------
##$DU= <F:/spectra>
##$EXPNO= 1
##$NAME= <H-F>
##$PROCNO= 1
##$TYPE= <nmr>
##$USER= <she>
##$AMP= (0..31)
100 100 100 100 100 100 100 100 100 100 100 100 100 100 100 100 100 100 
100 100 100 100 100 100 100 100 100 100 100 100 100 100 
##$AQSEQ= 0
##$AQ_mod= 1
##$AUNM= <au_zg>
##$AUTOPOS= <>
##$BF1= 200.13
##$BF2= 200.13
##$BF3= 200.13
##$BF4= 200.13
##$BF5= 200.13
##$BF6= 200.13
##$BF7= 200.13
##$BF8= 200.13
##$BYTORDA= 1
##$CFDGTYP= 0
##$CFRGTYP= 5
##$CHEMSTR= <none>
##$CNST= (0..31)
1 1 145 1 1 1 1 1 1 1 1 1 1 1 1 1 1 1 1 1 1 1 1 1 1 1 1 1 1 1 1 1 
##$CPDPRG= <>
##$CPDPRG1= <>
##$CPDPRG2= <>
##$CPDPRG3= <>
##$CPDPRG4= <mlev>
##$CPDPRG5= <mlev>
##$CPDPRG6= <mlev>
##$CPDPRG7= <mlev>
##$CPDPRG8= <mlev>
##$CPDPRGB= <>
##$CPDPRGT= <>
##$D= (0..31)
0 1.2 0 0 0 0 0 0 0 0.06 0 0.03 0 0 0 0 0.0002 0 0 0 0 0 0 0 0 0 0 0 0 
0 0 0 
##$DATE= 1591691780
##$DBL= (0..7)
120 120 120 120 120 120 120 120 
##$DBP= (0..7)
150 150 150 150 150 150 150 150 
##$DBP07= 0
##$DBPNAM0= <>
##$DBPNAM1= <>
##$DBPNAM2= <>
##$DBPNAM3= <>
##$DBPNAM4= <>
##$DBPNAM5= <>
##$DBPNAM6= <>
##$DBPNAM7= <>
##$DBPOAL= (0..7)
0.5 0.5 0.5 0.5 0.5 0.5 0.5 0.5 
##$DBPOFFS= (0..7)
0 0 0 0 0 0 0 0 
##$DE= 6
##$DECBNUC= <off>
##$DECIM= 24
##$DECNUC= <off>
##$DECSTAT= 4
##$DIGMOD= 1
##$DIGTYP= 9
##$DL= (0..7)
0 120 120 120 120 120 120 120 
##$DP= (0..7)
150 150 150 150 150 150 150 150 
##$DP07= 0
##$DPNAME0= <>
##$DPNAME1= <>
##$DPNAME2= <>
##$DPNAME3= <>
##$DPNAME4= <>
##$DPNAME5= <>
##$DPNAME6= <>
##$DPNAME7= <>
##$DPOAL= (0..7)
0.5 0.5 0.5 0.5 0.5 0.5 0.5 0.5 
##$DPOFFS= (0..7)
0 0 0 0 0 0 0 0 
##$DQDMODE= 0
##$DR= 18
##$DS= 0
##$DSLIST= <SSSSSSSSSSSSSSS>
##$DSPFIRM= 0
$$ [...]
##$SUBNAM2= <"">
##$SUBNAM3= <"">
##$SUBNAM4= <"">
##$SUBNAM5= <"">
##$SUBNAM6= <"">
##$SUBNAM7= <"">
##$SUBNAM8= <"">
##$SUBNAM9= <"">
##$SW= 24.9337058887773
##$SWIBOX= (0..15)
0 0 2 0 0 0 0 0 0 0 0 0 0 0 0 0 
##$SW_h= 4990.01996007984
##$TD= 16384
##$TD0= 1
##$TE= 0
##$TE2= 300
##$TE3= 300
##$TEG= 300
##$TL= (0..7)
0 120 120 120 120 120 120 120 
##$TP= (0..7)
150 150 150 150 150 150 150 150 
##$TP07= 0
##$TPNAME0= <>
##$TPNAME1= <>
##$TPNAME2= <>
##$TPNAME3= <>
##$TPNAME4= <>
##$TPNAME5= <>
##$TPNAME6= <>
##$TPNAME7= <>
##$TPOAL= (0..7)
0.5 0.5 0.5 0.5 0.5 0.5 0.5 0.5 
##$TPOFFS= (0..7)
0 0 0 0 0 0 0 0 
##$TUNHIN= 0
##$TUNHOUT= 0
##$TUNXOUT= 0
##$USERA1= <user>
##$USERA2= <user>
##$USERA3= <user>
##$USERA4= <user>
##$USERA5= <user>
##$V9= 5
##$VALIST= <valist>
##$VCLIST= <CCCCCCCCCCCCCCC>
##$VD= 0
##$VDLIST= <DDDDDDDDDDDDDDD>
##$VPLIST= <PPPPPPPPPPPPPPP>
##$VTLIST= <TTTTTTTTTTTTTTT>
##$WBST= 1024
##$WBSW= 4
##$XGAIN= (0..3)
0 0 0 0 
##$XL= 0
##$YL= 0
##$YMAX_a= 516348
##$YMIN_a= -243952
##$ZGOPTNS= <>
##$ZL1= 120
##$ZL2= 120
##$ZL3= 120
##$ZL4= 120
##$ABSF1= 10
##$ABSF2= 0
##$ABSG= 5
##$ABSL= 3
##$ALPHA= 0
##$AQORDER= 0
##$ASSFAC= 0
##$ASSFACI= 0
##$ASSFACX= 0
##$ASSWID= 0
##$AUNMP= <proc_1d>
##$AZFE= 0.1
##$AZFW= 0.1
##$BCFW= 1
##$BC_mod= 2
##$BYTORDP= 1
##$COROFFS= 0
##$CY= 11.3945322036743
##$DATMOD= 1
##$DC= 2
##$DFILT= <>
##$DTYPP= 0
##$F1P= 16.9975609425685
##$F2P= -3.02152046262296
##$FCOR= 0.5
##$FTSIZE= 0
##$FT_mod= 4
##$GAMMA= 1
##$GB= 0.15
##$INTBC= 1
##$INTSCL= 1
##$ISEN= 128
##$LB= 0.24
##$LEV0= 0
##$LPBIN= 0
##$MAXI= 10000
##$MC2= 0
##$MEAN= 0
##$ME_mod= 0
##$MI= 1.114404
##$NCOEF= 0
##$NC_proc= 0
##$NLEV= 6
##$NOISF1= 3.799351
##$NOISF2= 2.8
##$NSP= 1
##$NTH_PI= 0
##$NZP= 0
##$OFFSET= 15.70392
##$PC= 1
##$PHC0= -9795.971
##$PHC1= 17.00088
##$PH_mod= 1
##$PKNL= yes
##$PPARMOD= 0
##$PSCAL= 0
##$PSIGN= 0
##$REVERSE= no
##$SF= 200.130013532006
##$SI= 16384
##$SIGF1= 3
##$SIGF2= 2
##$SINO= 400
##$SIOLD= 16384
##$SREGLST= <1H.CDCl3>
##$SSB= 0
##$STSI= 0
##$STSR= 0
##$SW_p= 3612.71676300578
##$SYMM= 0
##$S_DEV= 0
##$TDeff= 0
##$TDoff= 0
##$TI= <>
##$TILT= no
##$TM1= 0
##$TM2= 0
##$TOPLEV= 0
##$USERP1= <user>
##$USERP2= <user>
##$USERP3= <user>
##$USERP4= <user>
##$USERP5= <user>
##$WDW= 1
##$XDIM= 8192
##$YMAX_p= 0
##$YMIN_p= 0
$$ End of Bruker specific parameters
$$ ---------------------------------
##NTUPLES= NMR FID
##VAR_NAME=  TIME,          FID/REAL,        FID/IMAG
##SYMBOL=    X,             R,               I
##VAR_TYPE=  INDEPENDENT,   DEPENDENT,       DEPENDENT
##VAR_FORM=  AFFN,          ASDF,            ASDF
##VAR_DIM=   8192,          8192,            8192
##UNITS=     SECONDS,       ARBITRARY UNITS, ARBITRARY UNITS
##FACTOR=    0.0002004,     1,               1
##FIRST=     0,             0,               0
##LAST=      1.6414764,     0,               0
##MIN=       0,             -243952,         0
##MAX=       1.6414764,     516348,          0
$$ Real data points
##PAGE= N=1
##DATA TABLE= (X++(R..R)), XYDATA
$$ [...]
$$ plain form
2226 -66 123 -420 -428 -134 19 -592 -743 -1027 -638 -681 -831 -1106 -752 -950 -897 -1036 -529 -635 -704 -555 -576 -862
2248 -862 -814 -828 -575 -812 -408 -543 -548 -318 -464 -164 -50 292 -266 137 210 228 399 646 417 480 577 717 799
2271 799 276 848 527 721 518 200 576 731 267 152 202 232 -67 -384 122 -768 -530 -446 -504 -989 -633
2292 -633 -546 -767 -426 -733 -598 -948 -720 -430 -472 -381 -7 -83 -119 -106 137 309 521 876 943 1218 1153 1149 1217 1573
2316 1573 1738 1490 1469 1476 1408 1220 1168 1221 530 327 117 85 -156 53 -61 -740 -714 -434 -874 -639 -604 -147 -167
2339 -167 238 277 553 916 1467 1649 1908 1922 2138 2263 2329 2431 2402 2609 2148 1774 1305 1216 980 388 -18 -458
2361 -458 -1000 -1544 -1663 -2359 -2458 -2793 -2830 -2846 -2734 -2616 -2179 -1817 -1114 -877 -715 284 1001 1105 1957 2529 2792
2382 2792 3305 3724 3660 4062 3941 4074 3958 3480 3338 2749 2176 2293 1764 1347 709 100 -491 -475 -602 -879
$$ packed form
2226f6J89n43qK94J53o11j51k84L89m3j50k75L54j98N3j39N07j06o9J49k1k86
2248h62M8j4K53k37M04j35nK30j46L00J14L42n58M03P3J8J71K47k29O3R7J40Q2
2271G99n23N72l21J94k03l18L76J55m64j15N0L0k99l17N06q90K38Q4n8m85L56
2292f33Q7k21L41l07J35l50K28K90m2R1L74p6l6J3K43J72K12L55O7K75o5mO8L56
2316A573J65k48k1Po8j88n2N3o91k03k10l2k41K09j14o79K6K80m40K35L5M57k0
2339a67M05L9K76L63N51J82K59J4K16J25O6J02k9K07m61l74m69q9k36n92m06m40
2361d58n42n44j19o96r9l35l7j6J12J18M37L62P03K37J62R99P17J04Q52N72K63
2382B792N13M19o4M02j21J33j16m78j42n89n73J17n29m17o38o09n91J6j27k77
$$ plain form
2402 -879 -968 -780 -695 -585 -376 199 588 1124 1589 1852 2260 2858 3234 3892 4418 4779 4825 4807 4778 4809 5005 4763
2424 4763 4599 3892 3510 2939 2616 2205 1904 1450 998 590 34 -125 -421 -811 -717 -1041 -768 -920 -474 -241
2444 -241 48 637 1159 1742 1967 2338 2985 3662 4169 4524 4701 4852 5097 5417 5571 5488 5138 5022 4776 4333
2464 4333 3901 3244 2423 2472 1847 1151 793 73 -360 -386 -1149 -948 -930 -1000 -1156 -838 -495 195 449 1119 1385
2485 1385 1904 2596 3410 3477 3739 4454 4719 4954 5374 5266 5258 5195 4713 4476 4103 3828 3159 2780 2068 1421 1290
2506 1290 654 606 88 -286 -52 -596 -276 -121 139 864 1023 1514 2284 2504 3319 3795 4370 4805 5734 5614
2526 5614 5884 6317 6301 6149 6421 5908 5676 5242 4821 4224 3608 3246 2791 2422 1605 1466 820 326 -73 -218
2546 -218 -133 -202 -282 -375 -329 -376 -23 75 193 658 761 1252 1283 1828 2136 2070 2338 2463 2484 2921 2662 3224 2947
$$ packed form
2402h79q9J88Q5J10K09N75L89N36M65K63M08N98L76O58N26L61M6j8k9L1J96k42
2424D763j64p07l82n71l23m11l01m54m52m08n56j59k96l90R4l24K73j52M46K33
2444b41K89N89N22N83K25L71O47O77N07L55J77J51K45L20J54q3l50j16k46m43
2464D333m32o57q21M9o25o96l58p20m33k6p63K01J8p0j56L18L43O90K54O70K66
2485A385N19O92Q14O7K62P15K65K35M20j08qo3m82k37l73k75o69l79p12o47j31
2506A290o36m8n18l74K34n44L20J55K60P25J59M91P70K20Q15M76N75M35R29j20
2526E614K70M33j6j52K72n13k32m34m21n97o16l62m55l69q17j39o46m94l99j45
2546b18Q5o9q0r3M6m7L53R8J18M65J03M91L1N45L08o6K68J25K1M37k59N62k77
$$ plain form
2569 2947 3415 3182 3546 3485 3493 3357 3385 3035 2831 2707 2643 2303 2338 2297 2047 1940 1534 1253 1095 1236 1101 1180
2591 1180 1097 1403 1424 1796 1953 2024 2418 2542 2845 3344 4156 4294 4613 5007 5129 5582 5044 5205 5073 4877 4517
2612 4517 3758 3179 2420 1721 673 176 -563 -1782 -2339 -3059 -3922 -4468 -4978 -5004 -5140 -4883 -4691 -4049 -3668
2631 -3668 -3105 -2360 -1602 -922 75 1089 1886 2843 3496 4058 4103 4583 4786 4515 4463 3874 3540 2915 2142 1127
2651 1127 656 -30 -597 -1652 -1783 -2404 -2715 -2377 -2732 -2174 -2327 -1808 -680 -364 442 1399 2170 3112 3825
2670 3825 4664 5535 5742 6104 6443 6466 6436 5745 5378 5083 4163 3316 2208 1158 104 -445 -1909 -2536 -3018
2689 -3018 -3841 -4588 -4349 -4821 -4898 -4588 -4426 -4298 -3892 -3136 -2671 -2082 -1550 -962 -596 -39 391 520 871 1024
2709 1024 783 798 496 435 395 -290 -446 -885 -1296 -1616 -1654 -1913 -2124 -2584 -2024 -2278 -1890 -1538 -1790 -1024 -655
$$ packed form
2569B947M68k33L64o1Qj36K8l50k04j24o4l40L5m1k50j07m06k81j58J41j35P9
2591A180q3L06K1L72J57P1L94J24L03M99Q12J38L19L94J22M53n38J61j32j96l60
2612D517p59n79p59o99j048m97p39j219n57p20q63n46n10k6j36K57J92O42L81
2631c668N63P45P58O80R97J014P97R57O53N62M5M80K03k71n2n89l34o25p73j015
2651A127m71o86n67j055j31o21l11L38l55N58j53N19J128L16Q06R57P71R42P13
2670C825Q39Q71K07L62L39K3l0o91l67k95r20q47j108j050j054n49j464o27m82
2689c018q23p47K39m72p7L10J62J28M06P56M65N89N32N88L66N57M30J29L51J53
2709A024k41J5l02o1m0o85j56m39m11l20l8k59k11m60N60k54L88L52k52P66L69
$$ plain form
2730 -655 -647 184 323 645 1054 1175 1533 1390 1394 1390 1508 1324 1097 903 901 666 631 220 -86 -217 16 -185 -260
2753 -260 -286 -510 -528 -727 -649 -575 -432 -566 -569 -698 -673 -945 -1017 -1078 -1769 -1707 -2199 -2317 -2327 -2820 -2772 -2888 -3210 -3283
2777 -3283 -3292 -3436 -3051 -3102 -2629 -2530 -2385 -1914 -1555 -1133 -918 -828 -339 275 391 434 677 802 824 831 605 773 296
2800 296 173 -47 -180 -358 -576 -886 -751 -1370 -1150 -1084 -1180 -1293 -1287 -919 -691 -828 -209 -242 -110 196 504 959
2822 959 868 1014 1234 1085 840 1223 761 687 635 319 -10 -88 -337 -665 -865 -1186 -1133 -1626 -1664 -1828 -1741 -1800 -1474
2845 -1474 -1627 -1598 -1478 -1701 -1449 -1005 -876 -712 -566 -409 -258 -307 48 120 376 264 166 194 330 230 409
2866 409 201 578 443 37 546 165 108 205 233 156 189 -47 12 -216 111 -100 -402 -477 -436 -541 -609 -666 -636 -867
2890 -867 -567 -969 -708 -817 -822 -828 -677 -801 -492 -138 -377 -431 67 360 462 674 535 615 366 518 405 867
$$ packed form
2730f55QQ31J39L22M09J21L58j43MmJ18j84k27j94kk35l5m11l06j31K33k01p5
2753b60k6k24j8j99P8P4J43j34lj29K5k72p2o1o91O2m92j18j0m93M8j16l22p3
2777c283rj44L85n1M73R9J45M71L59M22K15R0M89O14J16M3K43J25K2Pk26J68m77
2800B96j23k20j33j78k18l10J35o19K20O6r6j13OL68K28j37O19l3J32L06L08M55
2822I59r1J46K20j49k45L83m62p4n2l16l29p8k49l28k00l21N3m93l8j64Q7n9L26
2845a474j53K9J20k23K52M44J29J64J46J57J51m9L55P2K56j12r8K8J36j00J79
2866D09k08L77j35m06N09l81n7R7K8p7L3k36N9k28L27k11l02p5M1j05o8n7L0k31
2890h67L00m02K61j09noJ51j24L09L54k39n4M98K93J02K12j39Q0k49J52j13M62
$$ plain form
2912 867 628 673 575 545 532 614 614 557 701 761 716 640 623 541 1024 1200 1051 1212 998 1261 1409 1496 1381 1721 1768
2937 1768 1655 1669 1824 1600 1516 1638 1576 1789 1696 1559 1408 1500 1497 1277 1308 1118 1346 823 985 1133 976 797
2959 797 806 607 602 395 229 48 -207 -634 -353 -487 -745 -888 -832 -1079 -757 -633 -586 -614 -533 -84 173 154 456
2982 456 1197 1205 1679 2023 2481 2343 2557 2964 2994 3007 3054 2782 2983 2396 2369 2057 1471 1153 902 569 266 -209
3004 -209 13 -321 -282 -321 -219 -17 -129 224 455 681 1512 1777 2070 2451 2765 3335 3056 3430 3261 3535 3598
3025 3598 3392 3086 2625 2173 1811 1241 737 223 -745 -897 -1511 -1831 -2129 -2666 -2656 -2482 -2551 -2429 -2454 -1976 -1762
3046 -1762 -1200 -864 29 653 1133 1337 1715 2260 2484 3128 3018 3297 3616 3506 3323 3024 2744 2854 2320 1897
3066 1897 1629 1081 1018 338 -189 -570 -385 -928 -1173 -813 -792 -794 -624 -308 66 238 507 556 974 1316 1372 2176
$$ packed form
2912H67k39M5r8l0j3Q2%n7J44O0m5p6j7q2M83J76j49J61k14K63J48Q7j15L40M7
2937A768j13J4J55k24q4J22o2K13r3j37j51R2lk20L1j90K28n23J62J48j57j79
2959G97Rj99nk07j66j81k55m27K81j34k58j43N6k47L22J24M7k8Q1M49K57j9L02
2982D56P41QM74L44M58j38K14M07L0J3M7k72K01n87k7l12n86l18k51l33l03m75
3004b09K22l34L9l9J02K02j12L53K31K26Q31K65K93L81L14N70k79L74j69K74O3
3025C598k06l06m61m52l62n70n04n14r68j52o14l20k98n37J0J74o9J22k5M78K14
3046a762N62L36Q93O24M80K04L78N45K24O44j10K79L19j10j83k99k80J10n34m23
3066A897k68n48o3o80n27l81J85n43k45L60K1kJ70L16L74J72K69M9M18L42N6Q04
$$ plain form
3088 2176 2195 2422 2531 2626 2793 2422 2323 2581 2130 1759 1521 1398 1048 565 431 -405 -615 -751 -1231 -1698 -1464
3109 -1464 -1802 -2311 -2077 -2133 -2012 -2153 -1853 -1873 -1506 -1621 -1454 -1141 -706 -344 -146 69 704 973 956 1358 1382
3130 1382 1409 1368 1524 1448 1370 1129 1068 842 403 25 -145 -579 -1051 -1188 -1710 -1762 -1838 -2326 -2507 -2649 -2544 -2779
3152 -2779 -2558 -2340 -2099 -1681 -1480 -1561 -1143 -684 -568 -91 121 278 598 668 832 852 604 692 743 464 124
3173 124 -77 -18 -608 -1020 -1045 -1388 -1636 -1931 -2427 -2411 -2289 -2661 -2359 -2207 -2075 -2326 -1920 -1693 -1392 -1066 -876
3194 -876 -665 -606 -104 11 317 526 931 627 1042 798 898 376 578 454 49 28 -444 -676 -1062 -1168 -1423
3215 -1423 -1391 -1666 -2344 -2596 -2516 -3135 -3119 -3370 -3100 -3197 -3279 -3380 -3253 -3185 -3210 -2980 -2982 -2833 -2757 -2460 -2067 -2084 -1596
3238 -1596 -1668 -1477 -1178 -1035 -551 -969 -567 -397 -325 -557 -142 -755 -462 -757 -753 -930 -1446 -1643 -1882 -2298 -2440
$$ packed form
3088B176J9K27J09R5J67l71r9K58m51l71k38j23l50m83j34q36k10j36m80m67K34
3109a464l38n09K34n6J21j41L00k0L67j15J67L13M35L62J98K15O35K69j7M02K4
3130A382K7m1J56p6p8k41o1k26m39l78j70m34m72j37n22n2p6m88j81j42J05k35
3152b779K21K18K41M18K01q1M18M59J16M77K12J57L20P0J64K0k48Q8N1k79l40
3173A24k01N9n90m12k5l43k48k95m96J6J22l72L02J52J32k51M06K27L01L26J90
3194h76K11N9N02J15L06K09M05l04M15k44J00n22K02j24m05k1m72k32l86j06k55
3215a423L2k75o78k52Q0o19J6k51K70r7q2j01J27O8k5K30kJ49P6K97L93j7M88
3238a596p2J91K99J43M84m18M02J70P2k32M15o13K93k95Mj77n16j97k39m16j42
$$ plain form
3259 -2440 -2536 -2638 -2609 -2848 -2704 -2823 -2707 -2566 -2252 -1898 -1867 -1336 -572 -547 -355 169 427 941 981 1022 958 953 1030
3282 1030 883 556 -88 -112 -771 -1282 -1551 -2375 -2952 -3395 -3612 -4464 -4529 -4786 -5106 -5099 -5265 -4941 -4822 -4180 -4168
3303 -4168 -3476 -3364 -2889 -2176 -1869 -1351 -804 -425 -450 387 686 841 742 315 479 202 368 -397 -468 -1094 -1493
3324 -1493 -1854 -2035 -2577 -2533 -2843 -2604 -3080 -2707 -2570 -2023 -1841 -1811 -1439 -663 -297 265 742 954 1047 1240 1619
3345 1619 1777 1835 1392 1555 1291 995 626 497 -59 57 -915 -943 -1665 -1664 -2266 -2252 -2363 -3010 -3062 -2752 -2755 -2935
3367 -2935 -2665 -2676 -2561 -1929 -1891 -1830 -1501 -1420 -1465 -1148 -1164 -1089 -1175 -894 -1214 -1179 -1213 -1087 -1230 -1587 -1455 -1259 -1465
3390 -1465 -1675 -1527 -1522 -1284 -752 -812 -1089 -579 -723 -144 -619 -95 -451 -130 121 380 395 322 112 122 219 -165
3412 -165 7 -29 -36 -308 -364 -406 -359 -349 -415 -224 -129 -316 -59 172 -78 -76 -285 54 388 106 84 -54 251 -241
$$ packed form
3259b440r6j02K9k39J44j19J16J41L14L54L1N31P64K5J92N24K58N14M0M1o4nP7
3282A030j47l27o44k4o59n11k69q24n77m43k17q52o5k57l20Pj66L24J19O42J2
3303d168O92J12M75P13L07N18N47L79k5Q37K99J55r9m27J64k77J66p65p1o26l99
3324a493l61j81n42M4l10K39m76L73J37N47J82L0L72P76L66N62M77K12R3J93L79
3345A619J58N8m43J63k64k96l69j29n56J16r72k8p22Jo02J4j11o47n2L10lj80
3367b935K70j1J15O32L8O1L29Q1m5L17j6P5q6K81l20L5l4J26j43l57J32J96k06
3390a465k10J48NK38N32o0k77N10j44N79m75N24l56L21K51K59J5p3k10J0R7l84
3412a65J72l6pk72n6m2M7J0o6J91R5j87K57K31k50Kk09L39L34k82k2j38L05m92
$$ plain form
3436 -241 -192 -285 -127 -421 -815 -710 -767 -858 -1131 -944 -911 -861 -1026 -1015 -1257 -915 -942 -908 -455 -450 -600 -187 178 -9
3460 -9 248 334 166 623 528 593 730 645 658 862 630 377 426 606 454 265 158 196 233 -331 64 11 89 -35
3484 -35 -163 -40 11 -122 -432 -391 -113 -429 22 -19 85 -75 -241 -117 -267 -19 155 -81 -260 5 309
3505 309 216 7 -122 62 329 -17 -50 264 147 194 230 134 323 144 -166 -153 27 -303 -216 56 -224 -214 -60
3528 -60 -527 -168 -152 40 360 39 413 430 534 543 616 505 897 1073 522 1001 786 698 715 691 438 244 377
3551 377 233 -134 -284 -472 -674 -678 -806 -1004 -863 -870 -974 -983 -1080 -1181 -933 -987 -857 -691 -847 -586 -321 -235 -544
3574 -544 -337 -166 -130 -320 -118 -78 -219 -27 -123 3 -313 143 -77 42 70 217 81 146 65 263 266 282 406
3597 406 400 455 525 838 795 507 313 342 224 369 295 157 -33 49 153 -131 26 150 -191 -166 -550 -400 -287
$$ packed form
3436b41M9r3J58k94l94J05n7r1k73J87L3N0j65J1k42L42k7L4M53Nj50M13L65j87
3460iK57Q6j68M57r5O5J37q5J3K04k32k53M9J80j52j89j07L8L7n64L95n3P8j24
3484c5j28J23N1j33l10M1K78l16M51m1J04j60j66J24j50K48J74k36j79K65L04
3505C09r3k09j29J84K67l46l3L14j17M7L6r6J89j79l10J3J80l30Q7K72k80J0J54
3528f0m67L59J6J92L20l21L74J7J04RP3j11L92J76n51M79k15q8J7k4k53j94J33
3551C77j44l67j50j88k02mj28j98J41pj04rr7j01K48n4J30J66j56K61K65Q6l09
3574e44K07J71L6j90K02M0j41J92r6J26l16M56k20J19K8J47j36O5q1J98LJ6J24
3597D06oN5P0L13m3k88j94K9j18J45p4j38j90Q2J04k84J57J24l41K5l84J50J13
$$ plain form
3620 -287 -377 -249 -301 -258 -34 -344 -266 -80 -186 -176 -390 -520 -678 -594 -847 -1230 -1285 -1692 -1880 -1816 -1820 -1876 -2505 -2471
3644 -2471 -2436 -2578 -2185 -2497 -2161 -2362 -1805 -1802 -1349 -984 -905 -624 -438 -145 615 637 668 945 989 720 686 785 797
3667 797 280 164 130 -52 -482 -1115 -682 -1176 -1405 -1464 -1629 -1532 -1677 -1581 -1379 -1459 -999 -743 -924 -508 -46 71
3689 71 352 260 783 748 808 735 945 442 566 235 -205 -390 -853 -974 -1512 -1876 -1908 -2264 -2403 -2797 -3084 -3222
3711 -3222 -3109 -2953 -3033 -3134 -3065 -2595 -2377 -2032 -1827 -1506 -1338 -1098 -910 -493 -48 -143 115 102 212 78 203
3732 203 78 53 125 -171 -246 -492 -935 -951 -1037 -1111 -1154 -1230 -1525 -1363 -1577 -1489 -1413 -1455 -1300 -1212 -1034 -1308 -834 -774
3756 -774 -653 -575 -679 -249 -171 -276 -234 -194 -370 -260 -551 -522 -445 -484 -538 -734 -703 -1127 -966 -1132 -1327 -1472 -1542
3779 -1542 -1479 -1572 -1699 -1533 -1887 -2106 -1816 -1878 -1771 -1681 -2000 -1723 -1659 -1592 -1515 -1830 -992 -846 -802 -294 -802 -709 -561
$$ packed form
3620b87r0J28n2M3K24l10P8J86j06J0k14j30j58Q4k53l83n5m07j88O4mn6o29L4
3644b471L5j42L93l12L36k01N57LM53L65P9K81J86K93P60K2L1K77M4k69l4R9J2
3667G97n17j16l4j82m30o33M33m94k29n9j65R7j45R6K02q0M60K56j81M16M62J17
3689G1K81r2N23l5O0p3K10n03J24l31m40j85m63j21n38l64l2l56j39l94k87j38
3711c222J13J56q0j01O9M70K18L45K05L21J68K40J88M17M45r5K58j3J10j34J25
3732B03j25k5P2k96p5k46m43j6q6p4m3p6k95J62k14Q8P6m2J55Q8J78k74M74O0
3756g74J21P8j04M30P8j05M2M0j76J10k91K9P7l9n4j96L1m24J61j66j95j45p0
3779a542O3r3j27J66l54k19K90o2J07R0l19K77O4O7P7l15Q38J46M4N08n08R3J48
$$ plain form
3802 -561 -219 -73 -26 -358 -112 -94 -112 84 -20 -550 -463 -312 -574 -999 -874 -1348 -1039 -1323 -1194 -1292 -1349 -1587
3824 -1587 -1524 -1436 -1400 -1165 -1258 -1053 -862 -795 -563 -195 -399 -528 -182 -20 7 112 221 189 207 129 180 -178 -37
3847 -37 -209 -269 -577 -454 -721 -953 -1015 -940 -884 -715 -946 -815 -1019 -945 -759 -989 -773 -673 -351 -171 -220 -323
3869 -323 -322 -154 226 -176 257 314 309 239 446 518 521 252 33 320 35 121 -8 -427 -384 -505 -758 -527 -485 -995
3893 -995 -808 -716 -1395 -1123 -1087 -1194 -1095 -1118 -1101 -895 -1018 -773 -762 -857 -726 -225 -355 -410 -161 -97 234 197 452
3916 452 591 378 437 620 511 459 372 396 218 -296 -231 -47 -119 -114 -383 -451 -492 -541 -798 -390 -337 -434 -365 44 -11
3941 -11 219 437 294 821 728 911 943 764 1031 1436 907 1043 1053 973 628 629 560 418 40 78 -243 -633 -713
3964 -713 -604 -912 -725 -786 -1065 -1025 -775 -678 -699 -501 -670 -309 -113 65 51 379 -5 380 596 812 791 511
$$ packed form
3802e61L42J46M7l32K46J8j8J96j04n30Q7J51k62m25J25m74L09k84J29r8n7k38
3824a587O3Q8L6K35r3K05J91O7K32L68k04j29L46J62K7J05J09l2J8p8N1l58J41
3847c7j72o0l08J23k67k32o2P5N6J69k31J31k04P4J86k30K16J00L22J80m9j03
3869c23JJ68L80m02M33N7np0K07P2Lk69k19K87k85Q6j29m19M3j21k53K31M2n10
3893i95J87R2o79K72L6j07R9k3J7K06j23K45J1r5J31N01j30n5K49O4L31l7K55
3916D52J39k13N9J83j09n2q7K4j78n14O5J84p2Nk69o8m1m9k57M08N3r7O9M09n5
3941a1K30K18j43N27r3J83L2j79K67M05n29J36J0q0l45Jo9j42l78L8l21l90q0
3964g13J09l08J87o1k79M0K50R7k1J98j69L61J96J78j4L28l84L85K16K16k1k80
$$ plain form
3986 511 815 384 937 596 563 409 -12 -113 404 -35 189 27 66 41 -102 -367 -220 118 -5 31 222
4007 222 360 559 359 553 789 682 755 704 922 784 897 943 577 959 651 560 414 334 509 403 171 -52
4029 -52 51 -148 99 -162 -201 -353 -23 45 113 255 40 -147 -149 27 124 36 194 62 111 111 -214 190 9 -51
4053 -51 50 -3 59 -103 -80 -23 93 -29 35 390 285 187 -39 293 435 451 533 424 630 449 527 731 344
4076 344 213 308 83 315 117 131 244 433 205 141 185 231 37 239 -4 -182 372 84 -24 270 209 201 186
4099 186 -88 39 207 247 133 72 146 49 124 84 139 -8 63 -207 -205 322 -21 -210 134 76 -14 -221 -25 -80
4123 -80 12 389 17 132 381 172 -231 -139 174 310 253 -94 153 -34 37 -56 -78 241 -105 121 209 114 91
4146 91 216 125 174 85 50 -246 -162 236 -186 -350 198 -359 -420 -335 -360 -587 -492 -392 -389 -409 -690 -476 -513 -438 -595
$$ packed form
3986E11L04m31N53l41l3j54m21j01N17m39K24j62L9k5j43k65J47L38j23L6J91
4007B22J38J99k00J94K36j07P3n1K18j38J13M6l66L82l08r1j46q0J75j06k32k23
4029e2J03j99K47k61l9j52L30O8O8J42k15j87kJ76R7q8J58j32M9%l25M04j81o0
4053e1J01n3O2j62K3N7J16j22O4L55j05r8k26L32J42J6Q2j09K06j81P8K04l87
4076C44j31R5k25K32j98J4J13J89k28o4M4M6j94K02k43j78N54k88j08K94o1qj5
4099A86k74J27J68M0j14o1P4r7P5m0N5j47P1k70KN27l43j89L44n8r0k07J96n5
4123h0R2L77l72J15K49k09m03R2L13J36n7l47K47j87P1r3k2L19l46K26Q8r5k3
4146I1J25r1M9q9l5k96Q4L98m22j64N48n57o1Q5k5k27R5J00Lk0k81K14l7P5j57
$$ plain form
4171 -595 -649 -423 -163 -597 -337 -445 -65 -145 77 8 -135 66 431 -168 184 90 303 89 167 -149 1 179
4193 179 31 -44 -205 -470 -96 123 -133 -152 -99 -106 -215 -125 48 207 18 29 223 213 344 397 351 701 257
4216 257 236 316 97 -239 218 -90 -267 -81 -560 -318 -731 -540 -494 -657 -501 -356 -304 -541 -704 -598 -517 -266
4238 -266 -439 -275 -508 -553 -403 -541 -628 -433 -290 -260 -102 -35 -513 -211 -332 -762 -187 -318 -486 -30 -69 -27
4260 -27 -4 -43 154 -128 156 329 54 373 337 286 440 282 615 148 220 257 167 177 454 144 -108 -7 -200
4283 -200 -38 -408 -390 -217 -345 -181 155 -163 -355 -132 -19 110 -84 -160 -216 -61 35 -158 -103 -85 -183 -277 -149
4306 -149 -387 -630 -345 -644 -893 -1072 -1039 -961 -1163 -816 -751 -886 -724 -853 -649 -299 -551 -456 -470 -16 2 119
4328 119 235 364 555 452 612 760 273 527 516 761 879 175 351 98 23 300 134 -188 232 -223 -139
$$ packed form
4171e95n4K26K60m34K60j08L80q0K22o9j43K01L65n99L52r4K13k14P8l16J50J78
4193A79j48p5j61k65L74K19k56j9N3pj09R0J73J59j89J1J94j0J31N3m6L50m44
4216B57k1Q0k19l36M57l08j77J86m79K42m13J91M6j63J56J45N2k37j63J06Q1K51
4238b66j73J64k33m5J50j38q7J95J43L0J58O7m78L02j21m30N75j31j68M56l9M2
4260b7K3l9J97k82K84J73k75L19l6n1J54j58L33m67P2L7r0J0K77l10k52J01j93
4283b00J62l70J8J73j28J64L36l18j92K23J13J29j94p6n6J55R6j93N5J8r8r4J28
4306a49k38k43K85k99k49j79L3P8k02L47O5j35J62j29K04L50k52R5j4M54J8J17
4328A19J16J29J91j03J60J48m87K54j1K45J18p04J76k53p5K77j66l22M20m55Q4
$$ plain form
4349 -139 151 -55 -40 -233 -134 76 -67 85 131 318 361 692 680 577 891 715 735 442 370 527 294 209 109
4372 109 11 -90 -262 -320 -117 -495 -265 -648 -448 -300 -386 -311 -493 -480 -659 -334 -567 -26 -350 297 -84 357
4394 357 -86 65 143 241 336 411 415 239 496 415 289 268 478 223 312 81 363 166 144 213 445 317 204 174
4418 174 147 182 113 268 296 314 299 195 483 575 253 182 245 214 388 151 384 567 143 378 260 324 336 -187
4442 -187 299 176 190 137 153 154 419 122 409 170 -105 -53 56 150 174 -155 115 339 220 -122 24 157 101
4465 101 220 273 26 158 361 565 226 382 216 371 597 365 496 617 419 580 313 514 482 255 203
4486 203 584 512 196 401 310 412 361 224 242 368 298 179 28 225 48 311 385 505 360 406 473 335 445
4509 445 410 357 685 429 577 182 450 494 293 186 7 231 289 167 214 152 223 166 289 76 349 194 104
$$ packed form
4349a39K90k06J5j93R9K10j43J52M6J87M3L31j2j03L14j76K0k93p2J57k33q5j00
4372A09r8j01j72n8K03l78K30l83K00J48q6P5j82J3j79L25k33N41l24O47l81M41
4394C57m43J51P8R8R5P5Mj76K57q1j26k1K10k55Q9k31K82j97k2O9K32j28j13l0
4418A74k7L5o9J55K8J8j5j04K88R2l22p1O3l1J74k37K33J83m24K35j18O4J2n23
4442a87M86j23J4n3J6JK65k97K87k39k75N2J09R4K4l29K70K24j19l42J46J33n6
4465A01J19N3k47J32K03K04l39J56j66J55K26k32J31J21j98J61k67K01l2k27n2
4486B03L81p2l16K05r1J02n1j37J8J26p0j19j51J97j77K63P4J20j45M6O7j38J10
4509D45l5n3L28k56J48l95K68M4k01j07j79K24N8j22M7o2P1n7J23k13K73j55r0
$$ plain form
4532 104 59 21 38 95 181 217 263 123 51 258 -27 402 236 398 84 146 304 53 527 357 -15 222 28
4555 28 210 223 178 351 134 94 22 -83 -343 70 100 267 -175 205 39 161 -137 140 -44 32 131 -42 65
4578 65 265 118 52 259 254 90 578 568 140 585 543 422 246 273 276 356 330 343 151 353 104 191 -48 -153
4602 -153 446 -66 71 165 92 201 -66 34 546 271 216 449 101 394 188 59 180 458 339 285 317 -82
4624 -82 314 238 -4 109 350 149 -16 -6 99 199 232 -135 -125 -281 -135 -50 -183 -90 125 158 -25 -116 -93
4647 -93 35 348 2 131 67 54 604 40 406 92 139 -107 92 271 49 54 -118 -176 -18 15 96 -123 51
4670 51 207 -187 174 135 103 -115 -47 170 91 -13 51 -67 189 -199 50 -31 -575 196 -87 21 159 240 50
4693 50 37 -54 -67 52 -225 166 -62 -123 208 185 182 -2 -131 118 6 149 -151 46 246 195 -72 -58 33 -50
$$ packed form
4532A04m5l8J7N7Q6L6M6j40p2K07k85M29j66J62l14O2J58k51M74j70l72K37j94
4555B8J82J3m5J73k17m0p2j05k60M13L0J67m42L80j66J22k98K77j84P6R9j73J07
4578F5K00j47o6K07nj64M88j0m28M45m2j21j76K7LQ0k6J3j92K02k49Q7k39j05
4602a53N99n12J37R4p3J09k67J00N12k75n5K33l48K93k06j29J21K78j19n4L2l99
4624h2L96p6k42J13K41k01j65J0J05J00L3l67J0j56J46Q5j33R3K15L3j83r1K3
4647i3J28L13l46J29o4j3N50n64L66l14M7k46J99J79k22Nj72n8J58L3Q1k19J74
4670E1J56l94L61l9l2k18O8K17p9j04O4j18K56l88K49q1n44P71k83J08J38Q1j90
4693E0j3r1j3J19k77L91k28o1L31k3lj84j29K49j12J43l00J97K00n1k67J4R1q3
$$ plain form
4717 -50 -109 -66 76 179 20 84 -95 135 -203 -144 23 -116 35 36 125 248 253 -306 32 17 204 77 74 -300
4741 -300 -121 142 198 95 -14 -29 17 168 18 515 78 -243 80 256 -183 15 132 63 -175 -91 -330 -379
4763 -379 249 -82 -142 -145 9 -167 108 -192 43 215 106 -91 87 120 223 181 -73 -204 -145 -116 33 -29 84
4786 84 83 104 82 -20 -78 284 332 246 -210 99 -159 -72 215 239 107 22 31 127 52 270 85 -18 -37 40 165 -213
4812 -213 2 160 58 115 217 -17 202 -163 33 79 120 4 224 90 81 103 -70 -277 -174 147 223 -111
4834 -111 -109 -16 18 -44 115 -45 -158 8 95 -188 28 -368 135 -227 -42 66 220 237 -53 99 -98 143
4856 143 131 287 52 209 63 97 95 292 224 -31 -19 -40 302 132 238 225 69 244 121 105 375 331 55
4879 55 448 268 161 39 -12 49 -195 295 -96 53 199 -12 146 61 17 -241 -240 149 154 -75 -128 -256 -257 80
$$ packed form
4717e0n9M3J42J03j59O4j79K30l38N9J67j39J51JQ9J23Nn59L38j5J87j27ll74
4741c00J79K63N6j03j09j5M6J51j50M97m37l21L23J76m39J98J17o9k38Q4k39m9
4763c79O28l31o0lJ54j76K75l00K35J72j09j97J78L3J03m2k54j31N9K9J49o2J13
4786H4jK1k2j02n8L62M8q6m56L09k58Q7K87K4j32q5RR6p5K18j85j03j9P7J25l78
4812b13K15J58j02N7J02k34K19l65J96M6M1j16K20j34rK2j73k07J03L21P6l34
4834a11KR3L4o2J59j60j13J66Q7k83K16l96N03l62J85J08J54J7k90J52j97K41
4856A43j2J56k35J57j46L4kJ97o8k55J2k1L42j70J06j3j56J75j23j6K70m4k76
4879E5L93j80j07j22n1O1k44M90l91J49J46k11J58q5m4k58JL89Nk29n3j28jL37
$$ plain form
4903 80 -32 -197 -285 -124 -55 -141 84 62 -277 96 52 -63 200 93 119 -111 85 -63 -67 72 -279 40 76
4926 76 65 416 -106 258 388 178 -173 -99 -11 -38 149 48 128 280 -257 236 186 14 196 86 177 -41 -49
4949 -49 442 298 152 -46 81 235 -111 273 271 -39 167 -79 1 23 171 133 194 -86 19 -12 61 59 -85 -25
4973 -25 -167 -131 -115 222 358 187 -240 42 22 345 9 -157 -16 205 45 -26 57 -15 43 -4 259 55 23
4996 23 -44 32 -133 -27 -79 3 -7 -133 8 170 112 -108 186 465 125 443 284 197 390 94 42 167 -98
5019 -98 107 426 -55 229 -76 197 151 388 -160 -20 109 -259 81 -258 232 23 -27 2 -142 -147 -541 -79
5041 -79 -56 102 50 -25 -28 -178 150 10 -11 -114 -143 107 -83 166 79 -50 18 -281 -334 -169 -89 -26 13 -47 -204
5066 -204 9 -186 112 -307 155 2 115 165 -213 136 163 66 -44 -120 185 -6 48 265 -18 31 -59 14 -148
$$ packed form
4903H0j12j65q8J61O9q6K25k2l39L73m4j15K63j07K6k30J96j48mJ39l51L19L6
4926G6j1L51n22L64J30k10l51P4Q8k7J87j01Q0J52n37M93n0j72J82j10R1k18q
4949d9M91j44j46j98J27J54l46L84kl10K06k46Q0K2J48l8O1k80J05l1P3kj44O0
4973b5j42L6J6L37J36j71m27K82k0L23l36j66J41K21j60p1Q3p2N8m7K63k04l2
4996B3o7P6j65J06n2Q2j0j26J41J62n8k20K94K79l40L18j59q7J93k96n2J25k65
5019i8K05L19m81K84l05K73m6K37n48J40J29l68L40l39M90k09n0K9j44nl94M62
5041g9K3J58n2p5lj50L28j40k1j03k9K50j90K49q7j29O8k99n3J65Q0O3L9o0j57
5066b04K13j95K98m19M62j53J13N0l78L49K7r7j10p6L05j91N4K17k83M9r0P3j62
$$ plain form
5089 -148 20 101 -154 3 -76 83 -264 129 212 17 121 120 206 -6 73 299 -43 -172 124 12 -112 -149 -62
5112 -62 179 76 -57 -28 101 27 -33 130 -132 212 -545 -63 -198 -120 121 -224 3 -65 51 -25 -100 6 -137
5135 -137 8 -53 -11 112 -73 -149 -64 89 -260 86 15 -189 14 -274 -61 -438 97 -109 6 168 -167 -35
5157 -35 165 26 -141 -36 47 44 -263 1 153 -126 133 -178 -222 -70 93 101 9 54 -17 -249 -110 46 -199
5180 -199 -216 -6 -80 -256 247 -144 75 43 -134 -320 -10 124 -25 -41 193 86 -109 13 -269 53 27 191
5202 191 110 -111 -352 184 193 61 -6 81 -276 125 -170 275 121 245 91 -4 276 -48 -199 142 -11 30
5224 30 20 -242 35 -226 -206 -167 96 121 40 145 370 -73 57 76 258 167 251 42 117 45 296 -78 0 -32
5248 -32 -78 -104 91 153 363 398 -90 -35 -101 265 -112 52 60 25 33 2 153 -282 69 62 151 62 177 23 -40 64
$$ packed form
5089a48J68Q1k55J57p9J59l47L93Q3j95J04jQ6k12P9K26l42j29K96j12j24l7Q7
5112f2K41j03j33K9J29p4o0J63k62L44p57M82j35P8K41l45K27o8J16p6p5J06j43
5135a37J45o1M2J23j85p6Q5J53l49L46p1k04K03k88K13l77N35k06J15J62l35J32
5157c5K00j39j67J05Q3ll07K64J52k79K59l11m4J52J63Qr2M5p1k32J39J56k45
5180a99j7K10p4j76N03l91K19l2j77j86L10J34j49j6K34j07j95J22k82L22k6J64
5202A91q1k21k41N36Rj32o7Q7l57M01k95M45j54J24j54r5K80l24j51L41j53M1
5224C0j0k62K77k61K0L9K63K5q1J05K25m43J30J9J82r1Q4k09P5p2K51l74P8l2
5248c2m6k6J95O2K10L5m88N5o6L66l77J64Ql5Ql1J51m35L51pQ9q9J15j54o3J04
$$ plain form
5274 64 -75 -9 -108 81 -107 142 99 -94 46 44 -125 169 1 -49 101 -139 -217 -234 -57 105 -100 191 113
5297 113 -152 -217 52 238 -34 120 190 -219 -64 78 93 -208 -153 -38 -116 -46 23 87 -94 354 211 58 -164
5320 -164 47 163 28 57 -28 105 -36 -46 -144 41 407 -164 63 -46 -155 -49 -218 115 211 -110 293 298
5342 298 -9 -210 -258 -92 183 89 69 -286 62 354 4 -92 -25 94 127 -106 -107 78 162 36 -64 39 -228
5365 -228 113 -146 146 140 189 -91 199 76 -223 -205 52 73 -157 266 -100 343 -27 -32 -120 29 148 -299 -123
5388 -123 64 -57 -216 263 -132 46 -172 -87 5 -188 332 -135 -93 -96 41 -39 -179 84 -44 -60 -228 209
5410 209 158 50 -58 132 -131 211 81 -184 -296 -195 104 -76 -73 -92 -58 -119 -71 109 -425 -452 -78 -2 151
5433 151 -59 -120 104 -218 162 257 -41 163 -11 342 395 -64 -224 -177 211 -159 -281 -10 -366 -215 -275 -73
$$ packed form
5274F4j39O6r9J89j88K49m3j93J40kj69K94j68n0J50k40p8j7J77J62k05K91p8
5297A13k65o5K69J86k72J54P0m09J55J42J5l01N5J15p8P0O9O4j81M48j43j53k22
5320a64K11J16j35K9q5J33j41j0r8J85L66n71K27j09j09J06j69L33R6l21M03N
5342B98l07k01m8J66K75r4k0l55L48K92l50r6O7J19L3k33jJ85Q4j26j00J03k67
5365b28L41k59K92oM9k80K90j23k99J8K57K1k30M23l66M43l70nq8J49J19m47J76
5388a23J87j21j59M79l95J78k18Q5R2j93N20m67M2lJ37q0j40K63j28j6j68M37
5410B09n1j08j08J90k63L42j30k65j12J01K99j80Lj9L4o1M8J80n34k7L74P6J53
5433A51k10o1K24l22L80R5k98K04j74L53N3m59j60M7L88l70j22K71l56J51o0K02
$$ plain form
5455 -73 -127 -98 -133 -388 -197 -120 -285 -112 -207 -129 173 14 33 1 -67 106 146 9 112 -272 -24 -63 76 94
5479 94 -10 212 -264 -86 29 -152 79 54 -135 29 -384 -99 -221 -37 137 64 148 100 134 -12 126 301
5501 301 111 219 247 145 384 -19 262 270 208 -39 267 45 79 103 -1 65 -139 14 -215 -273 -181 -238 46
5524 46 -240 -244 113 -366 20 126 -52 106 -181 165 53 143 -78 -74 43 -247 -138 19 -26 -365 148 -149
5546 -149 -179 -100 -328 26 -224 34 -13 148 -66 -226 -25 276 77 253 144 35 -87 -173 218 405 35
5567 35 513 -87 -58 25 2 -42 -64 67 -47 -74 175 46 -108 32 85 213 216 529 466 206 98 369 95 310
5591 310 237 334 285 62 302 70 -138 87 -396 -297 -248 -441 -334 -169 -378 -533 -319 -228 -533 -166 68 -32
5613 -32 -195 -137 -197 91 260 170 256 443 409 266 407 362 166 346 356 101 66 39 228 220 92 -414 139 -201
$$ packed form
5455g3n4K9l5k55J91P7j65J73r5P8L02j59J9l2o8J73M0j37J03l84K48l9J39J8
5479I4j04K22m76J78J15j81K31k5j89J64m13K85j22J84J74p3Q4m8L4j46J38J75
5501C01j90J08K8j02K39m03K81Qo2k47L06k22L4K4j04O6k04J53k29n8R2n7K84
5524D6k86mL57m79L86J06j78J58k87L46j12R0k21MJ17k90J09J57m5l39N13k97
5546a49l0P9k28L54k50K58m7J61k14j60K01L01j99J76j09j09j22q6L91J87l70
5567C5M78o00K9Q3k3m4k2J31j14k7K49j29j54J40N3J28LL13o3k60j08K71k74K15
5591C10p3R7m9k23K40k32k08K25m83R9M9j93J07J65k09j55K14R1l05L67K34j00
5613c2j63N8o0K88J69r0Q6J87l4j43J41m5j96J80J0k55l5k7J89qj28n06N53l40
$$ plain form
5637 -201 -442 -362 62 19 -62 108 22 18 227 132 94 -10 279 325 455 421 418 448 410 361 399 566 102 520 -115
5662 -115 57 88 -50 -170 -12 -114 -144 -254 -471 -322 -214 -312 -168 -486 -102 -199 -162 -24 23 -174 337 232
5684 232 196 -113 33 105 7 126 223 26 260 -14 178 -117 -150 -407 -145 -2 -211 -111 -191 199 -395 -47
5706 -47 -91 -155 103 118 108 -80 133 5 214 450 411 339 516 363 330 234 104 -99 442 198 47 295 276
5729 276 -27 3 -80 201 95 290 93 263 48 132 176 34 19 87 238 122 136 -28 87 -127 193 -17
5751 -17 -156 -123 -83 -130 -77 105 -128 75 74 -172 -167 -171 -264 197 166 40 -28 -31 297 64 409 260 -43 291 -66
5776 -66 296 411 101 217 137 -46 316 -130 154 62 49 23 321 -101 -231 245 -182 277 -204 241 162 168 -241
5799 -241 314 141 267 -75 223 169 63 4 70 201 364 257 -25 -137 63 229 -66 -113 42 -85 -282
$$ packed form
5637b01k41Q0M24m3q1J70q6mK09r5l8j04K89M6J30l4lL0l8m9L8J67m64M18o35
5662a15J72L1j38j20J58j02l0j10k17J49J08r8J44l18L84r7L7J38M7j97N11j05
5684B32l6l09J46P2r8J19R7j97K34k74J92k95l3k57K62J43k09J00q0L90n94L48
5706d7m4o4K58J5j0j88K13j28K09K36l9p2J77j53l3r6j30k03N41k44j51K48j9
5729B76l03L0q3K81j06J95j97J70k15Q4M4j42j5O8J51j16J4j64J15k14L20k10
5751a7j39L3M0m7N3J82k33K03jk46Nmr3M61l1j26o8lL28k33L45j49l03L34l57
5776f6L62J15l10J16q0j83L62m46K84r2j3k6K98m22j30M76m27M59m81M45p9Om09
5799b41N55j73J26l42K98n4j06n9O6J31J63j07k82j12K00J66k95m7J55j27j97
$$ plain form
5820 -282 -75 -107 -307 -42 161 -217 -184 156 -249 -13 -192 154 54 19 51 107 286 146 123 294 215 -54
5842 -54 174 92 137 -65 30 193 -219 -94 -110 188 -189 -128 128 -194 -140 -70 25 56 179 23 70 82 -44 -26
5866 -26 171 114 167 28 7 445 189 99 179 203 171 200 -1 -20 319 327 -114 -14 57 -173 -59 -98 138 -249 -36
5891 -36 246 -94 -96 -99 -22 197 -39 -48 22 -65 -38 83 85 97 62 -118 346 5 329 -226 -257 273 159 -40 55 204
5917 204 287 -205 157 -96 272 -20 93 -3 -71 -72 511 183 -292 -70 -222 202 76 -287 3 17 15 -226 -44
5940 -44 79 -35 -98 -36 -53 50 -213 302 -61 -188 2 106 -200 -166 -302 -20 87 53 168 -88 160 -4
5962 -4 -56 37 -221 -28 -50 89 19 -76 82 152 -103 -306 104 -15 -493 -111 156 72 217 73 116 -32 417
5985 417 177 105 300 31 -111 3 69 16 29 15 -226 3 -60 36 103 52 19 176 91 -194 -57 -4 124 -106
$$ packed form
5820b82K07l2k00K65K03l78L3L40m05K36j79L46j00l5L2N6J79j40k3J71p9k69
5842e4K28q2M5k02R5J63m12J25j6K98l77O1K56l22N4P0R5L1J23j56M7J2j26J8
5866b6J97n7N3j39k1M38k56r0Q0K4l2K9k01j9L39Qm41J00P1k30J14l9K36l87K13
5891c6K82l40klP7K19k36rP0q7K7J21KJ2l5j80M64l41L24n55l1N30j14j99R5J49
5917B04Q3m92L62k53L68k92J13r6o8jN83l28m75K22j52M24j26l63K90J4kk41J82
5940d4J23j14o3O2j7J03k63N15l63j27J90J04l06L4j36K82J07l4J15k56K48j64
5962dn2R3k58J93k2J39p0r5J58P0k55k03M10j19m78L82K67q4J45j44M3j48M49
5985D17k40p2J95k69j42J14O6n3J3j4k41K29o3R6O7n1l3J57q5k85J37N3J28k30
$$ plain form
6009 -106 -91 -292 151 -67 187 37 -217 -22 -63 -234 114 59 -199 79 157 351 343 -70 -232 2 -28 17 137
6032 137 170 172 -221 127 -127 270 18 32 -245 290 47 -210 250 117 -22 69 -289 304 141 -192 -1 -376
6054 -376 -169 -86 -127 -18 -279 53 -4 -75 -122 -54 -103 -263 -23 160 10 -89 178 16 9 -161 -1 -102 61
6077 61 250 123 -22 221 41 104 -227 98 190 -242 23 -79 5 -199 67 -367 33 247 -91 112 215
6098 215 138 7 390 105 373 260 91 163 381 312 510 256 284 246 429 306 -15 -162 463 -46 8 154
6120 154 -270 -207 -46 -239 -384 -96 22 -132 -269 -139 -359 -122 -264 177 -50 -146 98 86 259 221 309 143
6142 143 141 80 234 182 165 -46 -38 -8 158 99 44 121 -201 -8 154 -194 -110 151 -9 119 -113 376 90 305
6166 305 208 62 46 234 509 54 664 499 -195 600 415 461 363 284 418 323 28 -28 126 -24 132 -32
$$ packed form
6009a06J5k01M43k18K54j50k54J95m1j71L48n5k58K78P8J94qm13j62K34l0M5J20
6032A37L3Kl93L48k54L97k52J4k77N35k43k57M60j33j39R1l58N93j63l33J91l75
6054c76K07Q3m1J09k61L32n7p1m7O8m9j60K40J83j50r9K67j62pj70J60j01J63
6077F1J89j27j45K43j80O3l31L25R2m32K65j02Q4k04K66m34M00K14l38K03J03
6098B15p7j31L83k85K68j13j69P2K18o9J98k54K8l8J83j23l21j47O25n09N4J46
6120A54m24O3J61j93j45K88J18j54j37J30k20K37j42M41k27r6K44j2J73l8Q8j66
6142A43ko1J54n2j7k11QL0J66n9n5P7l22J93J62l48Q4K61j60J28k32M89k86K15
6166C05r7j46j6J88K75m55O10j65o94P95j85M6r8p9J34r5k95n6J54j50J56j64
$$ plain form
6188 -32 -11 -62 -312 -157 49 26 12 -166 -33 58 -114 -135 -204 37 -62 -10 -57 80 -415 -258 -77 -412 -407 -288
6212 -288 -190 -474 -254 -355 -402 -244 -338 -168 3 19 -102 395 -14 50 161 250 422 615 489 482 604 288 460
6235 460 43 170 260 -70 -12 -148 -27 198 -50 22 27 175 14 -64 98 -124 254 308 384 433 394 264 512
6258 512 465 360 321 436 257 265 238 230 52 -19 21 -214 -327 53 -204 -247 -451 -202 -525 -509 -445 -335 -300 -368 -345
6283 -345 -342 59 -136 33 -188 106 162 457 259 322 59 231 238 -37 112 143 112 -10 61 -81 141 -140 -27
6306 -27 126 -293 -29 -214 -307 -102 -38 127 236 278 114 277 449 324 330 235 483 195 551 366 576 465
6328 465 360 220 86 196 156 -220 -68 -344 -183 -467 -188 -325 -476 -313 -122 -303 -354 -208 -323 -104 -203
6349 -203 52 27 -108 160 -164 -95 -80 -95 150 -81 -242 43 -69 -326 -520 -26 -351 47 -93 -393 -330 -116
$$ packed form
6188c2K1n1k50J55K06k3j4j78J33R1j72k1o9K41r9N2m7J37m95J57J81l35NJ19
6212b88R8k84K20j01m7J58r4J70J71J6j21M97m09O4J11Q9J72J93j26pJ22l16J72
6235D60m17J27R0l30N8j36J21K25k48P2NJ48j61p8J62k22L78N4P6M9l9j30K48
6258E12m7j05l9J15j79Qk7qj78p1M0k35j13L80k57m3k04K49l23J6O4J10L5o8K3
6283c45LM01j95J69k21K94N6K95j98O3k63J72Pk75J49L1l1j22P1j42K22k81J13
6306b7J53m19K64j85r3K05O4J65J09M2j64J63J72j25Or5K48k88L56j85K10j11
6328D65j05j40j34J10m0l76J52k76J61k84K79j37j51J63J91j81n1J46j15K19r9
6349b03K55k5j35K68l24O9J5j5K45k31j61K85j12k57j94M94l25L98j40l00O3K14
$$ plain form
6371 -116 65 -62 -292 19 -105 -214 81 27 215 338 253 300 290 82 119 436 275 186 -48 -35 35 -42 -73
6394 -73 89 241 437 284 -60 -46 221 148 27 -76 -41 -257 -134 111 93 54 -84 114 231 262 402 -13
6416 -13 -77 -34 -24 -285 -243 -44 -298 -404 -47 -393 -484 -223 -345 -288 -387 -359 -350 -227 -146 -164 -60 172 1 90 -177
6441 -177 -6 169 -132 198 58 -64 97 261 -349 12 -76 -315 -349 -237 -9 -60 -316 -57 -123 -75 -164 -197
6463 -197 -137 50 319 -38 69 149 141 -175 -99 552 141 223 335 2 88 76 -131 142 -325 -139 -88 197 -54
6486 -54 -395 100 -275 -419 -234 -355 -260 -219 -336 -167 45 -14 -9 -116 -114 -164 66 -61 42 -177 -104 70 -127
6509 -127 135 -131 -123 -130 -36 108 -68 -54 62 -180 -34 -301 235 -189 11 226 -38 86 193 -194 176 -388
6531 -388 6 135 92 -9 38 -123 315 -44 60 63 8 -92 -1 91 -289 365 -238 5 111 -39 -77 -180 118
$$ packed form
6371a16J81j27k30L11j24j09K95n4J88J23q5M7j0k08L7L17j61q9k34J3P0p7l1
6394g3J62J52J96j53l44J4K67p3j21j03L5k16J23K45j8l9j38J98J17L1J40m15
6416a3o4M3J0k61M2J99k54j06L57l46r1K61j22N7r9K8RJ23Q1j8J04K32j71Q9k67
6441a77J71J75l01L30j40j22J61J64o10L61q8k39l4J12K28n1k56K59o6M8q9l3
6463a97O0J87K69l57J07Q0ql16P6O51m11Q2J12l33Q6j2k07K73m67J86N1K85k51
6486e4l41M95l75j44J85j21R5M1j17J69K12n9Nj07Kn0K30j27J03k19P3J74j97
6509a27K62k66QpR4J44j76J4J16k42J46k67N36m24K00K15k64J24J07l87L70n64
6531c88L94J29m3j01M7j61M38l59J04Ln5j00R1R2l80O54o03K43J06j50l8j03K98
$$ plain form
6554 118 226 -183 90 143 2 -144 -220 58 62 -114 -198 -190 222 48 5 -131 -50 34 -14 -174 -207 245 -274 -50
6578 -50 118 144 76 -77 65 -163 45 4 213 -79 -62 -162 4 -154 78 28 -147 36 -170 -31 156 203
6600 203 150 -89 73 -86 -289 -26 -161 -105 176 78 46 181 250 -29 2 35 -160 178 -6 308 -111 -60 -173
6623 -173 -185 50 -45 63 -55 -16 -37 -401 293 46 11 -196 42 -56 76 207 -14 -196 239 60 -194 -125
6645 -125 -100 144 132 21 101 239 -422 62 207 86 167 83 335 112 -78 141 132 197 29 -279 24 -63 79
6668 79 47 -95 5 93 -42 157 199 -269 25 21 93 -134 -209 317 87 136 139 37 305 134 -326 -94 284 69
6692 69 -3 64 -58 172 -55 125 92 -211 -133 -10 46 -114 197 247 -49 0 -50 -131 83 -63 -95 -76 -27 52 99
6717 99 200 183 -131 -180 115 219 91 -116 -161 -189 -305 -310 -440 -100 -192 -78 80 -206 22 -317 -339 -439 -72
$$ packed form
6554A18J08m09K73N3j41j46p6K78Mj76q4QM12j74m3j36Q1Q4m8j60l3M52n19K24
6578e0J68K6o8j53J42k28K08m1K09k92J7j00J66j58K32n0j75J83k06J39J87M7
6600B03n3k39J62j59k03K63j35N6K81r8l2J35O9k79L1L3j95L38j84L14m19N1j13
6623a73j2K35r5J08j18L9k1l64O94k47l5k07K38r8J32J31k21j82M35j79k54O9
6645a25K5K44j2j11Q0J38o61M84J45j21Q1q4K52k23j90K19rO5j68l08L03q7J42
6668G9l2j42J00Q8j35J99M2m68K94mP2k27p5N26k30M9Lj02K68j71m60K32L78k15
6692F9p2O7j22K30k27J80l3l03P8J23N6j60L11N0k96M9n0q1K14j46l2J9M9P9M7
6717I9J01j7l14m9K95J04j28k07m5k8j16nj30L40r2J14J58k86K28l39k2j00L67
$$ plain form
6740 -72 161 134 -228 196 -61 211 83 243 387 340 164 228 -13 31 -78 -85 -52 -15 17 -27 -352 269 -257 -78
6764 -78 -99 -73 -113 -281 74 -322 197 487 122 -41 -17 99 213 178 376 119 364 -20 166 -107 188 -92
6786 -92 153 80 -47 57 -401 -111 -363 -26 -348 -305 -253 -58 -293 -159 -458 -110 -338 -276 -127 -266 -265 -56
6808 -56 135 -53 -96 114 -139 216 -275 129 203 -23 89 -92 46 -176 -18 -46 -286 52 -60 81 44 -47
6830 -47 -166 -91 108 161 228 -63 563 -56 148 252 464 389 91 67 180 -162 83 113 -72 -181 -26 6 -72
6853 -72 185 -17 -133 -378 212 -85 -71 -389 -159 -70 -429 -319 -307 -210 -102 -137 154 -153 -8 -150 -26 -154
6875 -154 -373 -59 -306 -197 -437 -444 -339 -647 -61 -335 -652 -316 -171 -348 101 -333 -206 -428 104 -213 82
6896 82 180 -1 428 100 213 536 169 16 168 70 180 -109 -7 6 -208 14 -344 -137 -256 -125 -266
$$ packed form
6740g2K33k7l62M24k57K72j28J60J44m7j76O4k41M4j09pL3L7L2m4l25O21n26J79
6764g8k1K6m0j68L55l96N19K90l65j63K4J16J14l5J98k57K45l84J86k73K95k80
6786i2K45p3j27J04m58K90k52L37l22M3N2J95k35J34k99L48k28O2J49j39JK09
6808e6J91j88m3K10k53L55m91M04P4k26J12j81J38k22J58k8k40L38j12J41l7r1
6830d7j19P5J99N3O7k91O26o19K04J04K12p5k98k4J13l42K45L0j85j09J55L2p8
6853g2K57k02j16k45N90k97J4l18K30Q9l59J10J2R7J08l5K91l07J45j42J24j28
6875a54k19L14k47J09k40pJ05l08N86k74l17L36J45j77M49m34J27k22N32l17K95
6896H2R8j81M29l28J13L23l67j53J52r8J10k89J02J3k14K22l58K07j19J31j41
$$ plain form
6917 -266 65 -97 -297 -22 236 -25 102 -96 275 36 76 281 66 180 388 337 -120 223 22 140 -479
6938 -479 182 -383 -418 -297 -442 -565 -491 -632 -499 -461 -309 -415 -470 -433 -285 -379 -181 107 -75 80 -49 47
6960 47 240 192 -150 125 146 128 -142 315 -69 -24 18 -91 -139 -200 177 -280 -120 32 -364 327 114 -43 99
6983 99 -28 165 326 506 390 75 366 195 308 71 352 -34 59 385 215 10 163 338 0 -53 -306
7004 -306 54 -235 -164 -136 -215 -270 -201 -124 59 -16 -42 21 -6 10 -210 -50 -379 -213 -243 26 -33 -159 89 -40
7028 -40 -129 2 -18 111 -344 -354 -194 -26 -243 -346 -62 33 -127 -226 -165 -272 72 -69 258 238 220 59 -144
7051 -144 275 342 373 55 272 94 261 167 61 12 167 430 96 52 -156 -7 -104 -213 75 -285 -318 92
7073 92 -17 29 220 186 31 -150 142 -84 -9 -13 43 -134 -131 45 -292 -175 -350 -149 -233 -183 -217 -4 -243 -119
$$ packed form
6917b66L31j62k00K75K58k61J27j98L71k39M0K05k15J14K08n1m57L43k01J18o19
6938d79O61n65l5J21j45j23P4j41J33L8J52j06n5L7J48r4J98K88j82J55j29R6
6960D7J93m8l42K75K1j8k70M57l84M5M2j09m8o1L77m57J60J52l96O91k13j57J42
6983I9j27J93J61J80j16l15K91j71J13k37K81l86R3L26j70k05J53J75l38n3k53
7004c06L60k89P1K8p9n5O9P7J83p5k6O3k7J6k20J60l29J66l0K69n9j26K48j29
7028d0q9J31k0J29m55j0J60J68k17j03K84R5j60r9O1j07L44j41L27k0j8j61k03
7051a44M19O7L1l18K17j78J67r4j06m9J55K63l34m4k08J49r7j09K88l60l3M10
7073I2j09M6J91l4j55j81K92k26P5mN6j77LJ76l37J17j75K01q4N0l4K13k39J24
$$ plain form
7097 -119 -14 -113 -256 -62 29 -106 -126 -37 26 -120 -193 -26 -320 97 -48 203 359 233 -309 232 257 -282
7119 -282 79 24 -175 183 267 -9 -41 138 -391 -233 -13 -16 -1 15 -87 30 163 112 238 21 -111 20 210
7142 210 118 -248 -135 160 199 302 -43 19 -364 116 123 64 -3 56 -12 -63 -408 -82 -119 -133 9 -437 356 30
7166 30 45 -131 71 -40 -172 204 325 77 -49 -99 -63 283 -273 137 31 46 95 154 -186 -10 -53 67 43
7189 43 159 42 -143 -95 -1 112 -117 257 279 -116 -61 -45 626 -65 -129 311 -38 -65 -82 10 27 -70 76 128
7213 128 35 187 90 -186 176 173 -115 160 -274 -19 -51 191 -75 71 8 59 -28 -95 92 15 178 -9 -79 82
7237 82 45 23 61 -147 -14 28 54 -111 -232 53 -224 -25 12 -275 -85 -40 -81 -259 -22 -97 -213 -132 372 28
7261 28 -57 8 37 -137 -99 -218 0 -141 276 28 82 -182 -288 323 -104 -7 288 -128 6 -259 29 -34 29
$$ packed form
7097a19J05r9j43J94R1j35k0Q9O3j46p3J67k94M17j45K51J56j26n42N41K5n39
7119b82L61n5j99L58Q4k76l2J79n29J58K20lJ5J6j02J17J33n1J26k17j32J31J90
7142B10r2l66J13K95L9J03l45O2l83M80Pn9o7N9o8n1l45L26l7j4J42m46P93l26
7166C0J5j76K02j11j32L76J21k48j26n0L6L46n56M10j06J5M9N9l40J76m3J20k4
7189D3J16j17j85M8R4J13k29L74K2l95N5J6O71o91o4M40l49k7j7R2J7r7J46N2
7213A28r3J52r7k76L62lk88K75m34K55l2K42k66J46o3N1q7o7J87p7J63j87p0J61
7237H2l7k2L8k08J33M2K6j65j21K85k77J99L7k87J90M5m1j78K37p5j16Q1N04l44
7261B8q5O5K9j74L8j19K18j41M17k48N4k64j06O11m27R7K95m16J34k65K88o3O3
$$ plain form
7284 29 237 -32 73 92 54 1 98 79 171 105 -262 50 214 143 70 -158 -139 -41 241 39 24 -77 -144 -31 -48
7309 -48 -13 -11 -94 -45 286 -254 0 172 -197 -123 123 -6 -11 -199 -204 35 11 -227 193 -170 -278 -104 8 139
7333 139 12 184 -229 90 -190 166 98 -91 88 243 -107 274 -293 37 -102 26 -10 -56 85 156 342
7354 342 418 -63 -37 387 -97 204 190 222 63 -188 169 215 -41 -38 -5 -32 -146 -120 -202 92 253 89 -133 113
7378 113 340 273 -326 -121 -162 -34 -66 -119 -18 34 37 -77 162 -153 83 -25 -139 -274 -58 -224 -154 13 -281
7401 -281 2 -236 -136 64 121 -83 -209 210 283 20 -227 -74 85 255 242 -137 94 73 -19 124 -75 -101
7423 -101 -139 -24 13 -392 12 42 -3 -110 139 74 -192 29 75 6 -63 62 23 506 171 132 59 157 320 212
7447 212 272 16 41 245 85 -20 27 -55 -65 239 -134 141 139 -67 28 -63 -23 -258 33 -49 68 -4 -454 -201
$$ packed form
7284B9K08k69J05J9l8n3R7j9R2o6l67L12J64p1p3k28J9R8K82k02j5j01o7J13j7
7309d8L5Kq3M9L31n40K54J72l69P4K46j29nj88nK39k4k38M20l63j08J74J12J31
7333A39j27J72m13L19k80L56o8j89J79J55l50L81n67L30j39J28l6m6J41P1J86
7354C42P6m81K6M24m84L01j4L2j59k51L57M6k56LL3k7j14K6q2K94J61j64k22K46
7378A13K27o7n99K05m1J28l2n3J01N2Lj14K39l15K36j08j14j35K16j66P0J67k94
7401b81K83k38J00K00N7k04j26M19P3k63k47J53J59J70j3l79K31k1r2J43j99k6
7423a01l8J15L7m05M04L0m5j07K49o5k66K21M6o9o9J25l9M83l35l9p3R8J63j08
7447B12O0k56K5K04j60j05M7q2j0L04l73K75kk06R5r1M0k35K91q2J17p2m50K53
$$ plain form
7471 -201 -391 -62 -157 68 30 -169 -283 266 -351 239 90 -58 -57 -444 -66 -28 43 -102 -85 205 -163 251
7493 251 -140 -242 -228 63 40 181 39 -161 192 173 -45 441 155 -66 -13 104 -89 356 377 230 -161 51
7515 51 340 -13 94 172 -9 -177 64 -97 124 -160 26 41 -218 -50 -13 -30 206 -41 123 -330 -81 -176
7537 -176 -25 5 -143 -69 -304 141 68 -114 -60 -239 -21 -137 -357 47 -121 -361 -202 -237 -181 6 12 -91 14
7560 14 -56 206 65 283 -138 142 155 181 249 351 39 -83 265 116 6 243 72 279 88 169 -245 -99
7582 -99 358 -38 269 -165 47 16 0 71 -70 102 197 16 48 -133 78 53 180 274 61 79 88 120 -262 -303
7606 -303 -53 130 -131 -41 -198 -249 -210 -73 -108 -155 -105 -258 126 -181 -394 -75 -116 -151 -144 -325 77 261 82
7629 82 33 293 -45 18 154 374 -36 26 -209 -211 60 121 -407 44 157 -162 -88 -89 -18 14 258 137 299 127
$$ packed form
7471b01j90L29r5K25l8j99j14N49o17N90j49j48Jl87L78L8P1j45J7K90l68M14
7493B51l91j02J4K91k3J41j42k00L53j9k18M86k86k21N3J17j93M45K1j47l91K12
7515E1K89l53J07P8j81j68K41j61K21k84J86J5k59J68L7j7K36k47J64m53K49r5
7537a76J51L0j48P4k35M45p3j82N4j79K18j16k20M04j68k40J59l5N6J87Oj03J05
7560A4p0K62j41K18m21K80J3K6O8J02l12j22L48j49j10K37j71K07j91Q1m14J46
7582i9M57l96L07m34K12l1j6P1j41J72R5j81L2j81K11k5J27R4k13J8RL2l82m1
7606c03K50J83k61R0j57n1L9J37l5m7N0j53L84l07k13L19m1l5Pj81M02J84j79
7629H2m9K60l38O3J36K20m10O2k35kK71O1n28M51J13l19P4jP1L2K44j21J62j72
$$ plain form
7653 127 155 -15 285 -2 107 76 67 71 -30 -31 219 295 36 301 273 -37 62 145 71 61 -147 90 16 -168 10
7678 10 64 101 -231 270 -253 -236 97 -120 -299 -53 -366 -153 5 77 -67 -147 2 -45 173 73 4 204 -77
7701 -77 -106 32 -1 238 4 72 90 4 68 136 241 -79 377 35 394 -64 124 157 146 -167 -26 74 55 36
7725 36 10 -42 176 171 8 -23 138 -187 -7 58 -203 86 94 -72 -26 -152 68 119 141 61 258 132 -22 -303
7749 -303 82 66 -42 167 20 16 -3 -14 -57 285 60 -100 -180 74 1 -91 -139 -182 36 26 165 74 85 330 -178
7774 -178 -53 -186 -35 99 -39 191 118 56 372 183 178 50 29 -178 -2 -131 -5 126 73 291 57 211
7796 211 101 58 -26 -205 103 -9 -62 328 77 166 269 -29 -174 -17 215 94 -82 353 86 -77 116
7817 116 -64 -328 44 79 -67 -66 50 9 149 -99 -104 -48 256 288 -101 -3 -288 32 -282 -34 -64 -40 -44 131
$$ packed form
7653A27K8j70L00k87J09l1rMj01jK50P6k59K65k8l10R9Q3p4j0k08K37p4j84J78
7678A0N4L7l32N01n23J7L33k17j79K46l13K13J58P2j44q0J49m7K18j00o9K00k81
7701g7k9J38l3K39k34O8J8q6O4O8J05l20M56l42L59m58J88L3j1l13J41J00j9j9
7725C6k6n2K18nj63l1J61l25J80O5k61K89Qj66M6j26K20N1K2q0J97j26j54k81
7749c03L85j6j08K09j47mj9j1m3L42k25j60q0K54p3r2m8m3K18j0J39r1J1K45n08
7774a78J25j33J51J34j38K30p3o2L16j89nj28k1k07J76j29J26J31n3K18k34J54
7796B11j10m3q4j79L08j12n3L90k51Q9J03k98j45J57K32j21j76M35k67j63J93
7817A16j80k64L72L5j46JJ16m1J40k48nN6L04L2l89R8k85L20l14K48l0K4mJ75
$$ plain form
7841 131 -167 282 -87 189 -138 -302 -269 39 177 271 -309 -211 -184 -45 -65 58 -104 -145 201 -33 425 40
7863 40 15 233 219 134 -175 -187 84 16 -122 -75 -163 -91 -171 134 321 70 237 -64 19 14 -19 89 -55 12 -141
7888 -141 27 -35 71 -111 -25 51 -166 -30 106 -132 -15 202 -135 -240 -131 -54 -47 -141 195 116 186 10 118
7911 118 5 -138 -200 61 146 8 -276 193 -77 -81 77 142 91 0 -155 -170 21 65 -70 119 -119 283 -199
7934 -199 -6 23 -333 252 -285 -213 -278 170 -1 266 228 -22 -16 134 -253 -41 -166 -130 -126 56 -70 114 179
7957 179 18 -18 102 -303 93 13 287 -309 -186 109 165 -26 148 106 68 103 -184 -332 118 53 -248 131
7979 131 -150 -320 -86 -26 -56 52 -356 -169 -241 128 -9 20 126 128 418 -210 71 -153 124 67 -94 11
8001 11 -147 -81 -50 -226 124 -33 78 157 202 156 -57 65 13 31 475 80 -226 18 -153 -83 -113 -4 -151
$$ packed form
7841A31k98M49l69K76l27j64L3L08J38R4n80R8K7J39k0J23j62m1L46k34M58l85
7863D0k5K18j4q5l09j2K71o8j38M7q8P2q0L05J87k51J67l01Q3nl3J08j44O7j53
7888a41J68o2J06j82Q6P6k17J36J36k38J17K17l37j05J09P7Pr4L36p9P0j76J08
7911A18j13j43o2K61Q5j38k84M69k70mJ58O5n1r1j55j5J91M4j35J89k38M02m82
7934a99J93K9l56N85n37P2o5M48j71K67l8k50OJ50l87K12j25L6MJ82j26J84O5
7957A79j61l6J20m05L96q0K74n96J23K95N6j91J74m2l8L5k87j48M50o5l01L79
7979A31k81j70K34O0l0J08m08J87p2L69j37K9J06KK90o28K81k24K77n7j61J05
8001A1j58O6L1j76L50j57J11P9M5m6k13J22n2J8M44l95l06K44j71P0l0J09j47
$$ plain form
8024 -151 167 -123 -23 15 -60 97 169 195 117 122 52 -201 -11 115 245 149 92 206 -1 -71 64 11 -154 -46
8048 -46 44 57 164 -25 7 -241 -235 113 -135 -208 -59 -98 191 -36 194 -7 77 235 -200 -140 -42 412 -104 80
8072 80 -33 64 313 -78 -39 -193 14 217 76 77 19 217 313 -75 111 40 312 128 91 70 99 -110 32 -24
8096 -24 -323 25 82 -20 116 22 -246 104 -7 -92 -154 2 74 8 147 -463 296 -138 117 339 77 -145
8118 -145 -232 79 -113 212 -51 -36 85 -9 -87 -160 132 -53 20 156 -19 -49 12 -62 -178 -23 -226 268 165
8141 165 -94 -15 -419 -69 -51 -413 -22 -179 -111 170 -327 166 -295 -284 35 -57 241 -31 53 109 -46 -207
8163 -207 -53 8 63 92 -31 -15 -89 -235 140 104 -23 -85 113 -147 37 107 250 -190 -90 -214 -338 65 -249
8186 -249 -289 -54 -243 -37 -17
$$ packed form
8024a51L18k90J00L8p5J57P2K6p8Np0k53J90J26J30r6n7J14k07p0J35n3j65J08
8048d6R0J3J07j89L2k48OL48k48p3J49l9K89k27K30k01Q4J58m35O0R8M54n16J84
8072H0j13R7K49l91L9j54K07K03j41Jn8J98R6l88J86p1K72j84l7k1K9k09J42n6
8096b4k99L48N7j02J36r4k68L50j11q5o2J56P2o6J39o10P59m34K55K22k62k22
8118a45q7L11j92L25k63J5J21r4p8p3K92j85P3J36j75l0O1p4j16J55k03M94j03
8141A65k59P9m04L50J8l62L91j57O8K81m97M93m61J1L19r2K98k72Q4N6j55j61
8163b07J54O1N5K9j23J6p4j46L75l6j27o2J98k60J84P0J43m40J00j24j24M03l14
8186b49m0K35j89K06K0
8191a7
$$ Imaginary data points
##PAGE= N=2
##DATA TABLE= (X++(I..I)), XYDATA
$$ plain form
0 0 0 0 0 -3 5 0 8 -8 11 -16 19 -24 32 -34 48 -56 65 -80 93 -108 129 -149 172 -201 228 -262 299 -341 384
29 384 -434 489 -552 617 -691 771 -857 954 -1059 1176 -1301 1445 -1595 1771 -1959 2171
45 2171 -2410 2677 -2981 3334 -3742 4225 -4805 5517 -6422 7606 -9235 11635 -15532 22976
59 22976 -42489 207002 516348 345471 233976 121448 172969 276052 401993 399160 292192
70 292192 105767 -17414 -37636 60863 163003 194523 100697 -51394 -179543 -188124 -87863
81 -87863 53581 126675 93134 -23933 -125565 -133235 -25059 126211 229587 220062 119190
92 119190 5463 -27591 44486 172899 265009 254761 141777 3154 -70522 -38943 61307
103 61307 146604 142832 39497 -100338 -185967 -167431 -66397 39047 70057 3899 -108468
$$ packed form
0@%%%lQnQj6J9k7L5m3N6o6Q2j04J21j45J73k01K37k78L21l73M29m90N61o40P25
29C84q18R23j041J169j308J462j628J811k013K235k477K746l040L366l730M130
45B171m581N087n658O315p076P967r030J0322j1939J4028j6841K0870k7167L8508
59B2976o5465K49491L09346j70877j11495j12528N1521J03083J25941k833j06968
70B92192j86425j23181k0222R8499J02140L1520r3826j52091j28149q581J00261
81h7863J41444P3094l3541j17067j01632p670J08176J51270J03376r525j00872
92A19190j13727l3054P2077J28413R2110j0248j12984j38623p3676L1579J00250
103F1307Q5297l772j03335j39835q5629J8536J01034J05444L1010o6158j12367
$$ plain form
114 -108468 -182912 -161035 -50411 79285 144194 110198 17281 -56582 -47476 50760 177896
125 177896 250866 226721 132360 39354 18559 87074 195961 265451 246245 150188 42624
136 42624 -2500 44105 142503 217832 213947 130538 23952 -31443 1744 95549 180660 196205
148 196205 129073 25595 -39619 -22631 60542 148715 176056 119707 17997 -58586 -60477 8649
160 8649 96669 136062 94254 -578 -81632 -94893 -33044 59180 115041 93882 14877 -64246
172 -64246 -85424 -30438 63582 131059 126306 57052 -25193 -60971 -23147 60893 128326 130437
184 130437 64344 -24881 -77749 -59254 12294 80780 93779 39064 -46810 -104767 -93591 -22882
196 -22882 56529 91209 59587 -11363 -64522 -55144 15906 104852 156599 142221 79796 22181
$$ packed form
114a08468p4444K1877J10624J29696O4909l3996r2917p3863R106R8236J27136
125A77896P2970k4145r4361r3006k0795O8515J08887O9490j9206r6057j07564
136D2624m5124M6605R8398P5329l885q3409j06586n5395L3187R3805Q5111J5545
148A96205o7132j03478o5214J6988Q3173Q8173K7341n6349j01710p6583j891O9126
160H649Q8020L9393m1808r4832q1054j3261O1849R2224N5861k1159p9005p9123
172f4246k1178N4986R4020O7477m753o9254q2245l5778L7824Q4040O7433K111
184A30437o6093q9225n2868J8495P1548O8486J2999n4715q5874n7957J1176P0709
196b2882P9411L4680l1622p0950n3159R378P1050Q8946N1747j4378o2425n7615
$$ plain form
208 22181 17795 73823 154412 205931 192321 124653 51021 21160 50926 114729 159728 145340
220 145340 74776 -8648 -54929 -40133 16732 67660 67303 11601 -63223 -108559 -93916 -30184
232 -30184 36053 58995 26286 -34444 -76588 -63461 380 73085 108369 86737 27795 -22762
244 -22762 -25404 22717 86768 120468 99113 34779 -29767 -51177 -20528 34182 69005 54243
256 54243 -6709 -73266 -101881 -77429 -21054 25640 27675 -16971 -74757 -102281 -77970 -17053
268 -17053 41623 59395 28086 -23126 -53722 -37079 19273 79285 102981 75964 22927 -18399
280 -18399 -17507 26243 80936 104711 80552 24715 -26210 -38081 -5221 44886 73026 56791
292 56791 4887 -48301 -67073 -39209 11692 47714 43466 743 -50320 -72071 -48875 2167
$$ packed form
208B2181m386N6028Q0589N1519j3610o7668p3632k9861K9766O3803M4999j4388
220A45340p0564q3424m6281J4796N6865N0928l57n5702p4824m5336J4643O3732
232c0184O6237K2942l2709o0730m2144J3127O3841P2705L5284k1632n8942n0557
244b2762k642M8121O4051L3700k1355o4334o4546k1410L0649N4710L4823j4762
256E4243o0952o6557k8615K4452N6375M6694K035m4646n7786k7524K4311O0917
268a7053N8676J7772l1309n1212l0596J6643N6352O0012K3696k7017n3037m1326
280a8399Q92M3750N4693K3775k4159n5837n0925j1871L2860N0107K8140j6235
292E6791n1904n3188j8772K7864N0901L6022m248m2723n1063k1751K3196N1042
$$ plain form
304 2167 45343 51629 16978 -32153 -58955 -43135 3632 49968 63570 34278 -14597 -47289
316 -47289 -41051 -461 45870 64605 41194 -6824 -45175 -47408 -13236 32943 56980 40235
328 40235 -4492 -45564 -55759 -27039 18591 47374 38422 -828 -43555 -59550 -36351 8680
340 8680 41895 41057 7475 -34897 -56061 -39272 3643 40589 47162 18990 -23343 -48878 -38266
353 -38266 -52 38601 51241 28731 -13133 -43234 -39606 -6346 32673 49991 32783 -7414
365 -7414 -41117 -44385 -16712 22257 44652 32919 -4218 -39949 -49530 -27057 11261 38035 32401
378 32401 -595 -37104 -52016 -34969 2280 32512 32900 5109 -31244 -50548 -38406 -3174
390 -3174 29745 36975 14585 -20704 -43688 -36745 -3855 30424 43204 26108 -7467 -33733 -32278
$$ packed form
304B167M3176O286l4651m9131k6802J5820M6767M6336J3602k9292m8875l2692
316d7289O238M0590M6331J8735k3411m8018l8351k233L4172M6179K4037j6745
328D0235m4727m1072j0195K8720M5630K8783q952l9250m2727j5995K3199M5031
340H680L3215q38l3582m2372k1164J6789M2915L6946O573k8172m2333k5535J0612
353c8266L8214L8653J2640k2510m1864l0101L628L3260L9019J7318j7208m0197
365g414l3703l268K7673L8969K2395j1733l7137l5731r581K2473L8318K6774n634
378C2401l2996l6509j4912J7047L7249L0232L88k7791l6353j9304J2142L5232
390c174L2919P230k2390l5289k2984O943L2890L4279J2780j7096l3575k6266J455
$$ plain form
403 -32278 -3910 30446 47599 35297 2446 -27548 -32175 -9326 23701 43435 35525 3854
415 3854 -28257 -38320 -21405 10036 33152 30210 2501 -29624 -43818 -30652 231 27257
427 27257 30392 8460 -21890 -38324 -28599 1901 32261 41445 25021 -3965 -22898 -17719 10497
440 10497 41492 53989 41009 13112 -9888 -11342 11767 40940 56035 45443 17133 -9998
452 -9998 -16802 -153 27349 43679 37450 10918 -18700 -29915 -16421 9839 29885 28996 6978
465 6978 -21212 -34246 -23131 4194 28773 34127 17762 -7738 -21170 -12704 13310 40638 51304
478 51304 38352 13850 -3223 -60 21754 47359 58805 46937 20790 -1845 -7012 8011
490 8011 31258 41951 31600 5109 -20580 -30670 -18772 4352 19825 15308 -5188 -27920
$$ packed form
403c2278K8368L4356J7153j2302l2851k9994m627K2849L3027J9734p910l1671
415C854l2111j0063J6915L1441K3116k942k7709l2125j4194J3166L0883K7026
427B7257L135k1932l0350j6434R725L0500L0360R184j6424k8986j8933N179K8216
440A0497L0995J2497j2980k7897k3000j454K3109K9173J5095j0592k8310k7131
452i998o804J6649K7502J6330o229k6532k9618j1215J3494K6260K0046q89k2018
465F978k8190j3034J1115K7325K4579N354j6365k5500j3432Q466K6014K7328J0666
478E1304j2952k4502j7073L163K1814K5605J1446j1868k6147k2635n167J5023
490H011K3247J0693j0351k6491k5689j0090J1898K3124J5473m517k0496k2732
$$ plain form
502 -27920 -36705 -22964 3755 26441 31712 19763 1060 -6187 7368 35203 60915 70992 60781
515 60781 41053 28372 34700 55289 76528 83755 70004 43705 22480 17944 29675 45810 50532
528 50532 36268 9120 -15620 -23627 -13661 4467 15644 8828 -10837 -29905 -34737 -20819 3842
541 3842 24497 27435 15617 644 -3422 10115 34904 56239 61014 49095 29826 17953 22870
554 22870 39877 55194 56538 40783 15690 -3756 -6796 4629 18642 21476 8775 -13594 -31635
567 -31635 -33694 -19363 552 12981 10565 -4088 -15736 -13752 3679 28376 47487 50841 40542
580 40542 28451 27622 41243 62259 79347 81475 68022 49928 40869 44859 60077 73072 72187
593 72187 56866 35921 21703 21318 33814 47761 49621 38149 19305 5171 4573 17803 33869
$$ packed form
502b7920q785J3741K6719K2686N271j1949j8703p247J3555K7835K5712J0077j0211
515F0781j9728j2681O328K0589K1239P227j3751k6299k1225m536J1731J6135M722
528E0532j4264k7148k4740q007R966J8128J1177o816j9665j9068m832J3918K4661
541C842K0655K938j1818j4973m066J3537K4789K1335M775j1919j9269j1873M917
554B2870J7007J5317J344j5755k5093j9446l040J1425J4013K834j2701k2369j8041
567c1635k059J4331J9915J2429k416j4653j1648J984J7431K4697J9111L354j0299
580D0542j2091q29J3621K1016J7088K128j3453j8094r059L990J5218J2995q85
593G2187j5321k0945j4218l85J2496J3947J860j1472j8844j4134n98J3230J6066
$$ plain form
606 33869 40577 33566 17036 2360 64 11522 26915 35764 30557 14347 -2008 -7543 639
619 639 15357 24783 22460 8098 -8177 -14987 -7923 7641 20821 22723 11485 -2610 -9724 -3590
633 -3590 11420 26375 30779 21557 6141 -3440 -1752 10033 23448 27435 18573 1800 -10805
646 -10805 -12741 -2845 11074 17336 12146 -668 -11758 -11972 306 18801 31883 33633 27488 20047
660 20047 21479 35185 55470 71198 75381 68817 58271 54220 60452 73098 82000 80592 66757
673 66757 47105 32192 28526 31763 35063 30187 13683 -7883 -24439 -29370 -24209 -15592 -13082 -20183
687 -20183 -32703 -40996 -38826 -25723 -7755 5130 7401 2214 -2395 1366 14242 30967 43163
700 43163 43488 34460 22255 16446 18838 27036 30891 24250 8879 -9821 -23422 -26174 -21547 -17499
$$ packed form
606C3869O708p011j6530j4676k296J1458J5393Q849n207j6210j6355n535Q182
619F39J4718R426k323j4362j6275o810P064J5564J3180J902j1238j4095p114O134
633c590J5010J4955M404r222j5416r581J688J1785J3415L987q862j6773j2605
646a0805j936R896J3919O262n190j2814j1090k14J2278J8495J3082J750o145p441
660B0047J432J3706K0285J5728M183o564j0546m051O232J2646Q902j408j3835
673F6757j9652j4913l666L237L300m876j6504k1566j6556m931N161Q617K510p101
687b0183j2520q293K170J3103J7968J2885K271n187m609L761J2876J6725J2196
700D3163L25r028j2205n809K392Q198L855o641j5371j8700j3601k752M627M048
$$ plain form
714 -17499 -20481 -31217 -45349 -53584 -50592 -37904 -23410 -14551 -14113 -17655 -18118 -8103 9699 29570
728 29570 43897 47501 44001 40809 44960 55813 68476 75816 72126 59653 46048 38500 38870 42834
742 42834 43457 35086 18764 1630 -9116 -10402 -5508 -1110 -3766 -13365 -24597 -30293 -26763 -15500
756 -15500 -3902 737 -2175 -8660 -12241 -7996 3323 15262 19950 16374 6957 -1530 -2793 2801
770 2801 9467 10929 4605 -7925 -20339 -25744 -22599 -16843 -13807 -17985 -27796 -38401 -41072 -36012
784 -36012 -26420 -18535 -16728 -21924 -28651 -29234 -23089 -11849 -1185 2528 -1536 -7739 -10617 -7046 1926
799 1926 11772 15010 10593 2284 -2903 -1626 5411 14198 18795 15070 7276 1469 1022 7691 17203
814 17203 21892 19821 12998 5877 3359 8217 15632 19765 17140 8926 -920 -6347 -4544 514 3918
$$ packed form
714a7499k982j0736j4132q235K992J2688J4494Q859M38l542m63J0015J7802J9871
728B9570J4327L604l500l192M151J0853J2663P340l690j2473j3605p548L70L964
742D2834O23q371j6322j7134j0746j286M894M398k656r599j1232n696L530J1263
756a5500J1598M639k912o485l581M245J1319J1939M688l576r417q487j263N594
770B801O666J462o324j2530j2414n405L145N756L036m178r811j0605k671N060
784c6012R592P885J807n196o727n83O145J1240J0664L713m064o203k878L571Q972
799A926R846L238m417q309n187J277P037Q787M597l725p794n807m47O669R512
814A7203M689k071o823p121k518M858P415M133k625q214r846n427J803N058L404
$$ plain form
829 3918 1302 -7449 -18087 -24062 -23020 -17486 -12097 -11443 -16737 -24535 -28790 -25626 -18072 -9388 -4829
844 -4829 -6768 -12736 -16047 -13577 -6319 2269 6516 4027 -3042 -8938 -10589 -7347 -1694 821 -3408
859 -3408 -11931 -20873 -24846 -23420 -18023 -14510 -16609 -22651 -29382 -31666 -27820 -19126 -11791 -8651 -10712
874 -10712 -13959 -14654 -8929 939 9740 14064 12904 8498 5490 8130 14211 20241 22209 17805 9766
889 9766 2612 695 2527 5913 6017 904 -8025 -16094 -19353 -17366 -12920 -10137 -12347 -18247 -23630
904 -23630 -24753 -21418 -13977 -7927 -6703 -9777 -13625 -14743 -11009 -3714 2867 3871 930 -4174 -7728
919 -7728 -6443 -1409 3350 3669 -597 -7274 -12651 -13252 -9257 -5324 -4090 -7389 -13401 -18612 -18994 -14595
935 -14595 -9536 -6312 -6778 -11244 -15554 -15236 -10696 -4639 476 992 -2395 -6536 -7040 -3734 1846 6887
$$ packed form
829C918k616q751j0638n975J042N534N389O54n294p798m255L164P554Q684M559
844d829j939n968l311K470P258Q588M247k489p069n896j651L242N653K515m229
859c408q523q942l973J426N397L513k099o042o731k284L846Q694P335L140k061
874a0712l247o95N725R868Q801M324j160m406l008K640O081O030J968m404q039
889I766p154j917J832L386J04n113q929q069l259J987M446K783k210n900n383
904b3630j123L335P441O050J224l074l848j118L734P295O581J004k941n104l554
919g728J285N034M759L19m266o677n377o01L995L933J234l299o012n211l82M399
935a4595N059L224m66m466m310L18M540O057N115N16l387m141n04L306N580N041
$$ plain form
951 6887 7561 3675 -1219 -3548 -1528 2966 7251 8175 3930 -1326 -4445 -4250 -11 4190 5329 2328
967 2328 -2729 -6739 -7122 -3085 1597 3341 1289 -3174 -7245 -7998 -4310 583 3081 1721 -1878 -6066
983 -6066 -7513 -4142 379 3700 3842 122 -4217 -5553 -3080 1335 5076 5887 2376 -1800 -3701 -2088
999 -2088 1810 5738 6918 4089 111 -2915 -2295 1477 5275 7080 4617 441 -2890 -3080 60 3798
1015 3798 6024 3911 -16 -3270 -4795 -1712 2182 4603 3301 -408 -3843 -5242 -3079 1037 3709
1030 3709 3567 701 -2797 -4989 -2627 1460 4844 5520 3083 -426 -1845 -754 2986 6406 7889
1045 7889 5641 1935 -850 -229 2840 6185 7687 5386 1412 -1955 -2059 -28 3063 4751 3357
1060 3357 -502 -3747 -4331 -2345 1267 4271 3202 1130 -1767 -2331 44 4201 7495 7940 5936 3646
$$ packed form
951F887O74l886m894k329K020M494M285R24m245n256l119J95M239M201J139l001
967B328n057m010l83M037M682J744k052m463m071p53L688M893K498j360l599m188
983f066j447L371M521L321J42l720m339j336K473M415L741Q11l511m176j901J613
999b088L898L928J180k829l978l026O20L772L798J805k463m176l331j90L140L738
1015C798K226k113l927l254j525L083L894K421j302l709l435j399K163M116K672
1030C709j42k866l498k192K362M087L384O76k437l509j419J091L740L420J483
1045G889k248l706k785O21L069L345J502k301l974l367j04K031L091J688j394
1060C357l859l245n84J986L612L004j069k072k897n64K375M157L294M45k004k290
$$ plain form
1076 3646 2714 4679 8203 11423 12073 9995 6690 4863 4821 7858 10359 10406 8109 4513 1027 950 2664
1093 2664 4901 5485 3426 102 -3570 -3761 -1484 1227 3155 2700 5 -2760 -2525 303 3909 6689
1109 6689 7194 5336 3405 3321 5488 8758 12242 13165 10846 8217 6978 7928 10180 12390 12379 9935 6160
1126 6160 3393 2769 4255 6007 5715 3341 -628 -3945 -4713 -3081 -928 -147 -1555 -3772 -6243 -6808
1142 -6808 -3947 -803 1573 1944 516 -937 -869 1743 5188 7399 8559 6876 4860 3938 5190 6912
1158 6912 8526 8413 5539 1991 -652 -1349 -347 385 -161 -3545 -6947 -9230 -10075 -8435 -6601 -5804
1174 -5804 -6827 -8471 -9367 -8437 -5308 -1409 1041 2254 1964 1850 2947 6494 9977 12711 13267 12258
1190 12258 10356 9550 10316 12349 13027 12049 8907 5233 1867 1054 1255 1024 -273 -2912 -6551 -9310
$$ packed form
1076C646r32J965L524L220O50k078l305j827m2L037K501M7k297l596l486p7J714
1093B664K237N84k059l324l672j91K277K711J928m55k695k765K35K828L606K780
1109F689N05j858j931q4K167L270L484R23k319k629j239R50K252K210j1k444l775
1126F160k767o24J486J752k92k374l969l317p68J632K153P81j408k217k471n65
1142f808K861L144K376L71j428j453O8K612L445K211J160j683k016r22J252J722
1158F912J614j13k874l548k643o97J002P32n46l384l402k283q45J640J834P97
1174e804j023j644q96R30L129L899K450J213k90j14J097L547L483K734N56j009
1190A2258j902q06P66K033O78r78l142l674l366q13K01k31j297k639l639k759
$$ plain form
1206 -9310 -9654 -8096 -6523 -5918 -6800 -8897 -9280 -7876 -5135 -2149 55 487 -997 -968 -393 1812 4006
1223 4006 5593 4925 2866 1161 -412 -82 660 1323 -336 -3291 -5992 -7908 -8283 -7352 -6473 -7221 -8772
1240 -8772 -10688 -11826 -10929 -8408 -6204 -5229 -5074 -5911 -6102 -4698 -1588 840 2569 2994 1704 1186 1978
1257 1978 3520 5731 7049 6413 4131 2817 2249 3188 4183 5225 4219 1819 220 -693 -541 642
1273 642 1678 986 -1124 -2906 -3969 -4127 -3224 -2185 -2959 -4737 -6778 -8265 -8582 -7926 -6898 -7458 -8860
1290 -8860 -10721 -12046 -12285 -10844 -9264 -8602 -9286 -10166 -11305 -10953 -8861 -6650 -5515 -5427 -6312 -7143 -6982
1307 -6982 -6234 -4887 -3968 -4283 -5996 -8242 -8744 -8546 -8055 -7498 -7961 -10035 -11927 -12538 -12371 -10758 -9513
1324 -9513 -8323 -9164 -9611 -9054 -7693 -5280 -1968 -16 906 1292 1702 3184 5561 8289 9486 9225 8009
$$ packed form
1206i310l44J558J573O05q82k097l83J404K741K986K204M32j484K9N75K205K194
1223D006J587o68k059j705j573L30P42O63j659k955k701j916l75R31Q79p48j551
1240h772j916j138Q97K521K204R75J55q37j91J404L110K428J729M25j290n18P92
1257A978J542K211J318o36k282j314n68R39R95J042j006k400j599r13J52J183
1273F42J036o92k110j782j063j58R03J039p74j778k041j487l17O56J028n60j402
1290h860j861j325k39J441J580O62o84q80j139L52K092K211J135Q8q85q31J61
1307f982P48J347R19l15j713k246n02J98M91N57m63k074j892o11J67J613J245
1324i513J190q41m47N57J361K413L312J952R22L86M10J482K377K728J197k61j216
$$ plain form
1341 8009 6883 6354 6557 6574 6016 4155 1705 -1347 -3410 -4040 -4952 -5884 -7152 -9457 -11825 -12967 -12615
1358 -12615 -11603 -10773 -10320 -9830 -10715 -10570 -8716 -6525 -4316 -2775 -2500 -3454 -2758 -2311 -908 202 903
1375 903 -527 -2192 -3843 -4653 -4918 -5199 -5780 -7501 -9940 -11614 -12945 -12898 -12030 -11990 -12063 -12940 -13462 -13012 -11498
1394 -11498 -8871 -7053 -5840 -5284 -4375 -3557 -1884 895 2588 3669 3798 3288 3081 3406 4343 4979 4359
1411 4359 3559 1616 -69 -866 -927 -934 -1071 -2181 -4211 -5827 -5753 -5872 -4950 -4540 -4894 -5691 -6534 -6140 -5460
1430 -5460 -4047 -3080 -2920 -3678 -4320 -4140 -3797 -2694 -1882 -1995 -3051 -4068 -4895 -4710 -4309 -3719 -3987 -5295
1448 -5295 -6356 -7210 -7254 -6056 -5410 -5270 -5562 -6326 -6688 -6646 -5424 -4469 -3809 -3740 -4382 -4726 -4415 -3226 -2377
1467 -2377 -1458 -1361 -1922 -2865 -2373 -1478 -497 218 488 -178 -1120 -785 -11 842 1924 2165 1268 937 773 1197
$$ packed form
1341H009j126n29K03J7n58j861k450l052k063o30r12r32j268k305k368j142L52
1358a2615J012Q30M53M90q85J45J854K191K209J541K75r54O96M47J403J110P01
1375I03j430j665j651q10k65k81n81j721k439j674j331M7Q68M0p3q77n22M50J514
1394a1498K627J818J213N56R09Q18J673K779J693J081J29n10k07L25R37O36o20
1411D359q00j943j685p97o1pj37j110k030j616P4j19R22M10l54p97q43L94O80
1430e460J413R67J60p58o42J80L43J103Q12j13j056j017q27J85M01N90k68j308
1448e295j061q54m4J198O46J40k92p64l62M2J222R55O60O9o42l44L11J189Q49
1467b377R19R7n61r43M92Q95R81P15K70o66r42L35P74Q53J082K41q97l31j64M24
$$ plain form
1487 1197 1689 2827 2903 2338 1541 825 925 848 1893 1699 876 -116 -1016 -1042 -943 -251 -607 -1209 -1773 -2837
1507 -2837 -2897 -2437 -1679 -1542 -1359 -2083 -2382 -2751 -1664 -781 -394 -188 -520 -1263 -1288 -951 -185 181 54 -618
1527 -618 -1229 -1837 -1580 -1199 -1047 -563 -1717 -2504 -2853 -3200 -2553 -2161 -1457 -1523 -2723 -2438 -2537 -1850 -909 -275
1547 -275 50 -919 -681 -877 -291 932 1166 1053 888 431 -158 234 848 1085 1089 472 -44 -744 -676 -320 240
1568 240 -181 -629 -1516 -1878 -1534 -1220 -616 -500 -632 -1615 -2092 -1298 -782 -98 30 76 -492 -1225 -379 -141
1588 -141 382 1319 852 52 81 -66 275 951 1170 1197 646 111 -160 -26 584 975 810 220 170 -281 -292
1609 -292 650 1033 950 549 323 -178 -190 803 993 1166 771 519 -29 247 954 1371 1674 1647 933 374 372 909
1631 909 1023 1467 1239 891 424 84 243 597 976 804 -46 -548 -505 -538 43 396 306 -405 -692 -1229 -1187
$$ packed form
1487A197M92J138P6n65p97p16J00p7J045j94q23r92r00k6R9O92l56o02n64j064
1507b837o0M60P58J37J83p24k99l69J087Q83L87K06l32p43k5L37P66L66j27o72
1527f18o11o08K57L81J52M84j154p87l49l47O47L92P04o6j200K85r9O87R41O34
1547b75L25r69K38j96N86J223K34j13j65m57n89L92O14K37Mo17n16p00O8L56N60
1568B40m21m48q87l62L44L14O04J16j32r83m77P94N16O84J28M6n68p33Q46K38
1588a41N23R37m67q00K9j47L41O76K19K7n51n35k71J34O10L91j65n90n0m51j1
1609b92R42L83q3m01k26n01j2R93J90J73l95k52n48K76P07M17L03k7p14n59kN37
1631I09J14M44k28l48m67l40J59L54L79j72q50n02M3l3N81L53r0p11k87n37M2
$$ plain form
1652 -1187 -421 387 72 -188 -694 -932 -1034 -404 386 185 471 22 -711 -207 -42 456 550 133 229 -578
1672 -578 -767 -221 -170 313 -271 -415 -570 -1302 -887 -447 -661 -733 -1025 -1297 -1395 -1309 -1237 -542 -466 -794 -1117 -941
1694 -941 -1007 -977 -307 214 -322 -641 -804 -568 -420 91 347 -8 -356 -309 -582 -331 220 101 -78 -782 -916
1715 -916 -1074 -1024 -315 -606 -168 -637 -1188 -1424 -864 -762 -539 -339 -428 -765 -896 -314 103 582 808 805 287
1736 287 300 90 942 1087 1372 1087 812 604 445 648 942 778 562 160 226 -306 -240 298 615 -98 -398
1757 -398 -615 -772 -446 107 336 205 -51 -331 -444 -318 389 398 641 813 433 80 799 776 1009 1162 1207
1778 1207 753 111 426 520 634 827 51 -383 -457 -531 -616 -876 -464 -843 -1167 -1659 -1488 -1882 -1504 -1237 -1282
1799 -1282 -1441 -1464 -1518 -967 -334 -22 283 318 30 158 563 936 1096 1200 940 839 686 569 676 764 391
$$ packed form
1652a187P66Q08l15k60n06k38j02O30P90k01K86m49p33N04J65M98R4m17R6q07
1672e78j89N46N1M83n84j44j55p32M15M40k14p2k92k72r8Q6P2O95P6l28l23J76
1694i41o6L0O70N21n36l19j63K36J48N11K56l55l48M7k73K51N51j19j79p04j34
1715i16j58N0P09k91M38m69n51k36N60J02K23K00q9l37j31N82M17M79K26ln18
1736B87J3k10Q52J45K85k85k75k08j59K03K94j64k16m02O6n32O6N38L17p13l00
1757c98k17j57L26N53K29j31k56k80j13J26P07RK43J72l80l53P19k3K33J53M5
1778A207m54o42L15R4J14J93p76m34p4p4q5k60M12l79l24m92J71l94L78K67m5
1799a282j59k3n4N51O33L12L05L5k88J28M05L73J60J04k60j01j53j17J07Q8l73
$$ plain form
1820 391 281 65 -372 -716 -635 -473 -914 -826 -1209 -1570 -1484 -1402 -1053 -971 -527 -726 -843 -525 -10 695 760 1238
1842 1238 1424 1229 1416 1717 1785 2281 2153 1881 1365 1563 1517 1070 1179 1245 564 23 -251 -555 -494 -168 -395
1863 -395 -548 -705 -899 -902 -523 -277 -90 235 135 244 618 1002 1494 1741 1894 2155 2033 1884 2513 2372 2401
1884 2401 2566 2415 2192 2019 2311 2179 2153 2118 1743 1386 1535 1428 1204 1011 1437 1140 819 644 985 792
1904 792 849 988 1210 679 535 701 874 874 1288 806 854 488 655 823 1172 1440 1684 1468 1436 1163 1128 1458
1926 1458 1567 1519 1489 1156 727 747 685 494 401 -31 -938 -1049 -1386 -1581 -1660 -1726 -1958 -2407 -2671 -2567 -2166 -1950
1948 -1950 -1395 -1420 -1203 -1298 -202 463 1028 1696 2204 2508 2829 3424 3729 4333 4292 4489 4054 3801 3484 3060
1968 3060 2704 2318 1708 1067 683 95 -559 -852 -960 -1412 -1610 -1803 -1930 -1574 -1121 -700 -182 846 942 1407
$$ packed form
1820C91j10k16m37l44Q1J62m41Q8l83l61Q6Q2L49Q2M44j99j17L18N15P05O5M78
1842A238J86j95J87L01O8M96j28k72n16J98m6m47J09O6o81n41k74l04O1L26k27
1863c95j53j57j94lL79K46J87L25j00J09L74L84M92K47J53K61j22j49O29j41K9
1884B401J65j51k23j73K92j32k6l5l75l57J49j07k24j93M26k97l21j75L41j93
1904G92N7J39K22n31j44J66J73%M14m82M8l66J67J68L49K68K44k16l2k73l5L30
1926A458J09m8l0l33m29K0o2j91r3m32r07j11l37j95p9o6k32m49k64J04M01K16
1948a950N55k5K17r5J096O65N65O68N08L04L21N95L05O04m1J97m35k53l17m24
1968C060l56l86o10o41l84n88o54k93j08m52j98j93j27L56M53M21N18J028R6M65
$$ plain form
1988 1407 2046 2965 3547 3945 4684 4688 4544 4515 5043 4494 4178 3503 2769 2111 1486 305 -286 -930 -1625 -2952
2008 -2952 -3356 -3837 -4113 -4259 -4278 -3931 -4052 -3807 -3117 -2695 -1778 -904 -130 602 1151 1818 2638 3640 4039 4282
2028 4282 4326 3925 3921 3648 3498 3582 2707 2260 1543 565 283 -341 -591 -872 -1178 -1678 -1711 -1653 -1555 -1399 -1036 -659
2050 -659 -618 -113 334 778 1439 1716 2048 2424 2461 2621 2157 2207 2417 1916 1614 1111 560 26 -51 -688 -1037
2071 -1037 -1798 -2062 -2310 -2818 -2881 -2958 -2794 -3135 -2743 -3088 -3020 -2707 -2186 -2123 -1926 -2097 -1605 -1880 -1594 -1578 -1435
2092 -1435 -1429 -1239 -1533 -1596 -1681 -1287 -1278 -1278 -1010 -1198 -1001 -743 -668 -280 -58 454 211 308 927 1124 1355 1859 1754
2115 1754 1692 1559 1772 1510 1286 1227 873 594 209 -108 -366 -325 -627 -943 -1039 -1225 -1157 -1347 -877 -781 -550 -395
2137 -395 -253 -47 -12 682 1147 876 1281 1116 902 1224 1196 887 583 475 -372 -619 -961 -1314 -1783 -2303 -2537
$$ packed form
1988A407O39R19N82L98P39Mj44k9N28n49l16o75p34o58o25j181n91o44o95j327
2008b952m04m81k76j46j9L47j21K45O90M22R17Q74P74P32N49O67Q20J002L99K43
2028D282M4m01mk73j50Q4q75m47p17r78k82o24k50k81l06n00l3N8R8J56L63L77
2050f59M1N05M47M44O61K77L32L76L7J60m64N0K10n01l02n03n51n34p7o37l49
2071a037p61k64k48n08o3p7J64l41L92l45O8L13N21O3J97j71M92k75K86J6J43
2092a435OJ90k94o3q5L94R%K68j88J97K58P5L88K22N12k43R7O19J97K31N04j05
2115A754o2j33K13k62k24n9l54k79l85l17k58M1l02l16r6j86O8j90M70R6K31J55
2137c95J42K06L5O94M65k71M05j65k14L22k8l09l04j08q47k47l42l53m69n20k34
$$ plain form
2158 -2537 -3164 -3552 -3539 -3425 -3563 -3637 -3366 -3364 -3211 -2909 -2338 -1896 -1452 -752 -489 -97 116 518 735 1271 1355
2179 1355 1094 1213 1292 635 895 901 368 204 8 -812 -952 -1316 -1114 -1511 -1760 -1887 -1806 -2128 -1950 -1869 -1769
2200 -1769 -1471 -1373 -1211 -1063 -1069 -825 -218 -15 -169 -51 -10 -445 27 -56 70 -79 -370 -474 -427 -448 -671 -453
2222 -453 -882 -1133 -817 -996 -874 -1144 -950 -1115 -817 -893 -810 -609 -653 -470 -299 -304 -438 -349 -227 -23 132 175
2244 175 279 362 -220 299 335 446 370 475 613 681 517 739 1129 961 970 660 812 913 746 645 1022 786
2266 786 585 744 387 682 656 641 341 174 96 -61 -92 -350 -93 205 -365 -813 -84 -505 -297 65 -379
2287 -379 -4 61 -16 125 358 577 384 421 580 622 869 1356 806 1189 1291 1462 1501 1453 1657 1627 1546 1895 1662
2310 1662 1651 1352 1420 1436 960 837 1153 565 319 497 219 94 -206 -97 -477 -370 -470 -332 -80 -131 -132 333
$$ packed form
2158b537o27l88J3J14j38p4K71KJ53L02N71M42M44P00K63L92K13M02K17N36Q4
2179A355k61J19P9o57K60On33j64j96q20j40l64K02l97k49j27Q1l22J78Q1J00
2200a769K98R8J62J48oK44O07K03j54J18M1m35M72q3J26j49k91j04M7k1k23K18
2222d53m29k51L16j79J22k70J94j65K98p6Q3K01m4J83J71nj34Q9J22K04J55M3
2244A75J04Q3n82N19L6J11p6J05J38O8j64K22L90j68Rl10J52J01j67j01L77k36
2266G86k01J59l57K95k6j5l00j67p8j57l1k58K57K98n70m48P29m21K08L62m44
2287c79L75O5p7J41K33K19j93L7J59M2K47M87n50L83J02J71L9m8K04l0q1L49k33
2310A662j1k99O8J6m76j23L16n88k46J78k78j25l00J09l80J07j00J38K52n1jM65
$$ plain form
2332 333 544 865 682 1026 1288 1577 2096 1910 2282 2096 2401 2011 1889 1790 1432 1089 659 395 371 -281 -381
2353 -381 -906 -1235 -1396 -1737 -1793 -1647 -1971 -1954 -1583 -1392 -1048 -656 54 440 815 1451 1929 2495 3075 3828 3939
2374 3939 4286 4559 4587 4627 4510 4734 4117 3945 3410 2803 2505 2104 1627 1090 184 -56 -676 -703 -984 -1102 -1183
2395 -1183 -1024 -853 -868 -844 -169 239 575 1115 1661 2064 2876 2934 3107 3643 3708 3794 3626 3909 3628 3266 3161
2416 3161 2842 2321 1693 1609 964 508 271 -306 -944 -1261 -1866 -1883 -2350 -2265 -2341 -2057 -2274 -1954 -1638 -953 -754
2437 -754 -123 5 663 1328 1595 2197 2666 2715 2860 3644 3187 3429 3531 3613 3233 3013 2262 1822 1517 985 654
2458 654 234 -869 -1035 -1868 -1864 -2009 -2689 -2705 -2972 -3064 -2864 -2925 -2633 -2118 -2110 -1507 -987 -737 -416 719 828 1622
2480 1622 2107 2228 2530 3006 2805 2969 2977 2967 2831 2222 2202 1184 1101 522 369 -614 -1002 -1753 -2177 -2557 -2642
$$ packed form
2332C33K11L21j83L44K62K89N19j86L72j86L05l90j22r9l58l43m30k64k4o52j00
2353c81n25l29j61l41n6J46l24J7L71J91L44L92P10L86L75O36M78N66N80P53J11
2374C939L47K73K8M0j17K24o17j72n35o07k98m01m77n37r06k40o20k7k81j18q1
2395a183J59J71j5K4O75M08L36N40N46M03Q12N8J73N36O5Q6j68K83k81l62j05
2416C161l19n21o28q4o45m56k37n77o38l17o05j7m67Q5p6K84k17L20L16O85J99
2437g54O31J28O58O65K67O02M69M9J45P84m57K42J02Q2l80k20p51m40l05n32l31
2458F54m20j103j66q33Mj45o80j6k67r2K00o1K92N15QO03N20K50L21J135J09P94
2480A622M85J21L02M76k01J64Qj0j36o09k0j018q3n79j53r83l88p51m24l80q5
$$ plain form
2501 -2642 -2608 -3198 -3001 -2911 -2798 -2375 -1976 -1275 -1103 -514 -116 503 1021 1456 1866 2079 2544 2530 2233 2640 2571
2522 2571 2609 1789 1847 1050 478 59 -891 -1147 -1738 -2336 -3044 -3436 -3820 -4228 -4157 -4382 -4428 -4438 -4400 -4026 -3913 -3843
2544 -3843 -3394 -3052 -2539 -2486 -1770 -1458 -1034 -812 -673 -263 -347 128 277 337 444 393 470 113 465 9 -254
2565 -254 266 -169 -188 -598 -772 -860 -1050 -1293 -1345 -1404 -1967 -1940 -2026 -2090 -2252 -2358 -2570 -2694 -2757 -2480 -2519 -2406 -2048
2588 -2048 -1919 -2102 -1708 -997 -1083 -769 -486 -813 -334 -471 65 -305 -189 -794 -1012 -1325 -1663 -2172 -2997 -3156
2608 -3156 -4012 -4631 -5277 -6234 -6387 -7272 -7231 -7569 -7573 -7853 -7553 -7333 -7332 -6266 -5502 -5104 -4119 -3122 -2197 -1313 -238
2629 -238 529 1305 2162 2516 2901 2919 3220 3226 2599 2490 1674 858 428 -349 -1319 -2039 -2510 -3617 -4231 -4521 -4947
2650 -4947 -5126 -4801 -5103 -4697 -4388 -3797 -3100 -2330 -1190 -881 197 729 1274 1916 2340 2550 2664 2365 2400
$$ packed form
2501b642L4n90J97R0J13M23L99P01J72N89L98O19N18M35M10K13M65j4k97M07o9
2522B571L8q20N8p97n72m19r50k56n91n98p08l92l84m08P1k25m6j0L8L74J13P0
2544c843M49L42N13N3P16L12M24K22J39M10q4M75J49O0J07n1P7l57L52m56k63
2565b54N20m35j9m10j74q8j90k43n2n9n63K7q6o4j62j06k12j24o3K77l9J13L58
2588b048J29j83L94P11q6L14K83l27M79j37N36l70J16o05k18l13l38n09q25j59
2608c156q56o19o46r57j53q85M1l38mk80L00K20JJ066P64L98R85R97R25Q84J075
2629b38P67P76Q57L54L85J8L01Oo27j09q16q16m30p77r70p20m71j107o14k90m26
2650d947j79L25l02M06L09N91O97P70J140L09J078N32N45O42M24K10J14k99L5
$$ plain form
2669 2400 1876 1294 799 -67 -1160 -1849 -2963 -4033 -5135 -5803 -6476 -7326 -7688 -8196 -8499 -8274 -8180 -8142 -7607
2688 -7607 -6906 -6125 -5539 -4892 -3796 -3200 -2378 -1838 -891 -196 -76 551 398 796 911 370 251 -63 -525
2707 -525 -976 -1062 -1427 -1902 -2227 -2703 -2783 -2864 -2808 -2681 -2989 -2291 -2568 -2229 -1706 -1363 -1010 -868 -370 -78 384
2728 384 413 676 608 519 570 248 77 -63 -254 -760 -897 -1524 -1733 -1892 -2340 -2148 -2280 -2505 -2442 -2372 -2572 -2638
2750 -2638 -2694 -2332 -2446 -2234 -2590 -2351 -2275 -2202 -2339 -2313 -2405 -2343 -2586 -2540 -3063 -2744 -2665 -3023 -2655 -2934 -2599 -2375
2772 -2375 -2396 -2018 -1889 -1699 -1038 -676 -433 -53 390 629 1165 1192 1376 1685 1462 1594 1804 1592 1090 1378
2792 1378 901 561 216 -47 -438 -758 -899 -978 -1307 -1202 -1598 -1358 -1157 -960 -903 -965 -779 -533 -137 234 251
2813 251 436 380 858 914 594 927 597 310 535 155 336 -386 -406 -732 -979 -1459 -1443 -1607 -1835 -1843 -2484 -1846
$$ packed form
2669B400n24n82m95q66j093o89j114j070j102o68o73q50l62n08l03K25R4L8N35
2688g607P01P81N86O47J096N96Q22N40R47O95J20O27j53L98J15n41j19l14m62
2707e25m51q6l65m75l25m76q0q1N6J27l08O98k77L39N23L43L53J42M98K92M62
2728C84K9K63o8q9N1l22j71j40j91n06j37o27k09j59m48J92j32k25O3P0k00o6
2750b638n6L62j14K12l56K39P6P3j37K6r2O2k43M6n23L19P9l58L68k79L35K24
2772b375k1L78J29J90O61L62K43L80M43K39N36K7J84L09k23J32K10k12n02K88
2792A378m77l40l45k63l91l20j41p9l29J05l96K40K01J97N7o2J86K46L96L71J7
2813B51J85n6M78N6l20L33l30k87K25l80J81p22k0l26k47m80J6j64k28qo41O38
$$ plain form
2835 -1846 -1660 -1732 -1864 -1552 -1390 -1225 -621 -625 -567 -351 -66 124 320 427 770 426 604 748 760 787 577 671
2857 671 548 395 558 311 425 555 94 43 152 73 -147 -308 40 -155 -242 -165 -424 -284 -503 -238 -698
2878 -698 -686 -768 -281 -720 -554 -265 -615 -578 -468 -78 -358 -22 104 153 394 780 515 856 784 1022 1030 1018 992
2901 992 644 1173 897 1237 816 909 857 563 763 508 322 264 540 205 316 227 365 265 422 473 462 532
2923 532 515 942 869 817 812 665 570 668 770 532 420 423 372 371 -54 67 -386 -137 -427 -630 -736 -638 -724 -701 -857
2948 -857 -1107 -941 -1287 -1098 -951 -1453 -1289 -1597 -1343 -1011 -1567 -1595 -1388 -1391 -1560 -1466 -1686 -1221 -1433 -1148 -1395
2969 -1395 -849 -689 -391 -203 -184 559 506 703 1107 1234 1213 1588 1661 1456 1569 1475 1198 828 960 538 490 -48
2991 -48 -306 -857 -1230 -1367 -1718 -2078 -2415 -2265 -2182 -2368 -2068 -2024 -2066 -1724 -1430 -1024 -667 -335 -136 165 160 243
$$ packed form
2835a846J86p2j32L12J62J65O04mN8K16K85J90J96J07L43l44J78J44J2K7k10R4
2857F71j23j53J63k47J14J30m61n1J09p9k20j61L48j95q7P7k59J40k19K65m60
2878f98J2q2M87m39J66K89l50L7J10L90k80L36J26M9K41L86k65L41p2K38Qj2k6
2901I92l48N29k76L40m21R3n2k94K00k55j86n8K76l35J11q9J38j00J57N1j1P0
2923E32j7M27p3n2nj47r5R8J02k38j12Ln1jm25J21m53K49k90k03j06R8q6K3j56
2948h57k50J66l46J89J47n02J64l08K54L32n56k8K07lj69R4k20M65k12K85k47
2969a395N46J60K98J88J9P43n3J97M04J27k1L75P3k05J13r4k77l70J32m22m8n38
2991d8k58n51l73j37l51l60l37J50Q3j86L00M4m2L42K94M06L57L32J99L01nQ3
$$ plain form
3013 243 529 743 654 544 304 53 -289 -478 -1117 -1773 -1772 -2431 -2747 -3272 -3630 -3940 -4499 -4534 -4505 -4460 -4110 -4026
3035 -4026 -4099 -3842 -3023 -2295 -2337 -1429 -1000 -188 129 844 1144 1177 1738 1738 1744 1774 2103 1393 1390 1212 443 41 -252
3058 -252 -651 -1435 -1640 -2003 -2263 -2816 -3138 -3603 -3146 -3459 -3394 -3372 -3038 -2888 -2321 -2325 -1738 -1605 -1490 -1111 -1000
3079 -1000 -721 -410 -312 -195 -63 -108 -252 -218 -548 -1011 -1122 -1261 -1689 -1894 -2606 -2660 -2981 -3288 -3798 -4330 -4404
3100 -4404 -4434 -4199 -4216 -4466 -4443 -4115 -4312 -3744 -3579 -3053 -2792 -2654 -2329 -2096 -1461 -1227 -1083 -852 -702 -339 -92
3121 -92 -326 -121 -36 31 -93 -167 -508 -767 -1241 -1491 -1922 -2352 -2324 -2738 -2907 -3270 -3471 -3697 -3875 -3999 -3682 -3775
3143 -3775 -3542 -3322 -3568 -3357 -3088 -2339 -2438 -1725 -1484 -1129 -1013 -626 -501 -228 104 56 -146 159 -249 -310 -477
3164 -477 -637 -992 -1268 -1614 -1829 -2076 -2469 -2921 -2583 -3085 -2883 -3260 -2851 -3123 -3322 -2910 -2668 -2684 -2380 -1832
$$ packed form
3013B43K86K14q9j10k40k51l42j89o39o56Jo59l16n25l58l10n59l5K9M5L50Q4
3035d026p3K57Q19P28m2R08M29Q12L17P15L00L3N61%OL0L29p10lj78p69m02k93
3058b52l99p84k05l63k60n53l22m65M57l13O5K2L34J50N67mN87J33J15L79J11
3079a000K79L11R8J17J32m5j44L4l30m63j11j39m28k05p12n4l21l07n10n32p4
3100d404l0K35j7k50K3L28j97N68J65N26K61J38L25K33O35K34J44K31J50L63K47
3121i2k34K05Q5O7j24p4l41k59m74k50m31m30K8m14j69l63k01k26j78j24L17r3
3143c775K33K20k46K11K69P49r9P13K41L55J16L87J25K73L32m8k02L05m08o1j67
3164d77j60l55k76l46k15k47l93m52L38n02K02l77M09k72j99M12K42j6L04N48
$$ plain form
3184 -1832 -1448 -1326 -794 -769 -245 -448 -243 7 -91 -104 127 4 -277 -148 -480 -748 -1056 -1230 -1425 -1781 -2043
3205 -2043 -2276 -2442 -3001 -2975 -3264 -3190 -3583 -3490 -3481 -3545 -3289 -3571 -3235 -2984 -2559 -2301 -2417 -2348 -1785 -1632 -1451 -1120
3227 -1120 -976 -795 -310 -341 13 93 276 160 402 588 565 448 531 449 182 336 -225 -233 -121 -795 -684 -1177
3249 -1177 -998 -1275 -1668 -1798 -1530 -2039 -1995 -1991 -1684 -1609 -1442 -1123 -1116 -800 -172 -187 326 438 507 901 936 1202 1248
3272 1248 1215 881 833 666 265 28 -471 -1061 -1545 -1986 -2299 -2527 -3239 -3355 -3635 -3393 -3905 -3528 -3548 -3330 -3019
3293 -3019 -2511 -2275 -1849 -1062 -430 -247 732 1297 1627 2051 2345 2761 2813 2822 2825 2939 2732 2325 1977 1739 1466
3314 1466 920 504 -72 -221 -643 -776 -1269 -1315 -1008 -1466 -705 -739 -720 -366 49 144 680 1180 1287 1786 2313
3335 2313 2453 2379 2257 2577 2777 2165 2005 1826 1528 798 342 -161 -441 -890 -1254 -1652 -1698 -1970 -2350 -2319 -2575
$$ packed form
3184a832L84J22N32K5N24k03K05K50r8j3K31j23k81J29l32k68l08j74j95l56k62
3205b043k33j66n59K6k89P4l93R3Ro4K56k82L36K51M25K58j16O9N63J53J81L31
3227a120J44J81M85l1L54Q0J83j16K42J86k3j17Q3q2k67J54n61qJ12o74J11m93
3249a177J79k77l93j30K68n09M4ML07P5J67L19PL16O28j5N13J12O9L94L5K66M6
3272A248l3l34m8j67m01k37m99n90m84m41l13k28p12j16k80K42n12L77k0K18L11
3293c019N08K36M26P87O32J83R79N65L30M24K94M16N2RLJ14k07m07l48k38k73
3314A466n46m16n76j49m22j33m93m6L07m58P61l4J9L54M15R5N36N00J07M99N27
3335B313J40p4j22L20K00o12j60j79k98p30m56n03k80m49l64l98m6k72l80L1k56
$$ plain form
3356 -2575 -2244 -1921 -1865 -1772 -1459 -1147 -1065 -646 -119 -497 300 537 769 955 735 827 826 1268 1155 1282 998 1163
3378 1163 860 949 848 531 358 446 576 612 701 839 940 1108 732 997 1204 1199 1241 1573 1752 1736 1474 1327
3400 1327 1555 1372 1405 1062 1269 829 1136 846 578 550 511 460 199 471 348 205 389 302 431 393 400 810
3422 810 91 340 647 538 652 748 484 514 204 230 252 288 -59 -111 -352 -498 -433 -326 -391 -262 -333 22 133
3445 133 13 212 212 446 517 597 1086 1245 1129 1290 1196 1298 1464 1025 1286 1235 1223 1187 969 971 519 533 419 224
3469 224 -4 152 -224 -110 -466 -157 -351 -222 -182 -135 -346 -126 -101 -157 -303 -125 84 -157 0 121 -136
3490 -136 325 -96 162 179 195 64 -112 158 172 -9 3 98 51 92 155 311 42 76 100 -121 -177 75 -141 -344
3514 -344 -51 -169 -223 -113 -191 -494 -274 72 -414 -132 -214 228 45 -106 516 251 -5 369 395 595 289
$$ packed form
3356b575L31L23N6R3L13L12Q2M19N27l78P97K37K32J86k20R2jM42j13J27k84J65
3378A163l03Q9j01l17j73Q8J30L6Q9J38J01J68l76K65K07nM2L32J79j6k62j47
3400A327K28j83L3l43K07m40L07k90k68k8l9n1k61K72j23j43J84q7J29l8PM10
3422H10p19K49L07j09J14R6k64L0l10K6K2L6l47n2k41j46O5J07o5J29p1L55J11
3445A33j20J99%K34P1Q0M89J59j16J61r4J02J66m39K61n1j2l6k18Km52J4j14j95
3469B24k28J56l76J14l56L09j94J29M0M7k11K20K5n6j46J78K09k41J57J21k57
3490a36M61m21K58J7J6j31j76K70J4j81J2R5m7M1O3J56k69L4K4k21n6K52k16k03
3514c44K93j18n4J10p8l03K20L46m86K82q2M42j83j51O22k65k56L74K6K00l06
$$ plain form
3535 289 327 106 424 21 -165 -44 -23 -477 -425 -791 -699 -823 -1004 -1016 -1340 -1339 -1325 -1320 -1306 -1412 -1399 -1069 -994 -1035 -842
3560 -842 -321 -906 -564 -352 -193 170 -75 255 -112 73 646 378 319 103 264 331 207 51 -95 97 -32
3581 -32 33 -192 -20 128 -21 -37 -49 -97 -93 23 -104 19 -41 -29 42 -50 112 -332 -613 -473 -665 -694 -705 -929
3605 -929 -944 -926 -968 -984 -1094 -1033 -1026 -1019 -1125 -1063 -1178 -1002 -988 -902 -841 -960 -1095 -937 -1095 -911 -1161 -1255 -932 -1365 -1317
3630 -1317 -1794 -1915 -1606 -2073 -1796 -1558 -1750 -1794 -1778 -1282 -1394 -1184 -829 -721 -687 -314 123 488 602 1113 1230
3651 1230 1147 1430 1467 1558 1775 1588 1044 999 932 663 319 147 -81 -866 -678 -908 -1049 -1199 -1240 -1670 -1663 -1395
3673 -1395 -1339 -1351 -1180 -588 -630 -451 199 -77 570 379 447 848 824 592 746 534 677 238 208 -231 -791 -870
3695 -870 -1020 -1610 -1698 -1880 -1919 -2368 -2562 -2310 -2338 -2256 -2078 -2098 -1833 -1459 -1326 -566 -641 -276 38 381 875 1163
$$ packed form
3535B89L8k21L18m03j86J21K1m54N2l66R2j24j81j2l24JJ4NJ4j06J3L30P5m1J93
3560h42N21n85L42K12J59L63k45L30l67J85N73k68n9k16J61O7j24j56j46J92j29
3581c2O5k25J72J48j49j6j2m8MJ16j27J23o0J2P1r2J62m44k81J40j92k9j1k24
3605i29j5J8m2j6j10O1PPj06O2j15J76J4Q6O1j19j35J58j58J84k50r4L23m33M8
3630a317m77j21L09m67K77K38j92m4J6M96j12K10L55J08L4L73M37L65J14N11J17
3651A230q3K83L7R1K17j87n44m5o7k69l44j72k28p85J88k30j41j50m1m30PK68
3673a395N6j2J71N92m2J79O50k76O47j91O8M01k4k32J54k12J43m39l0m39n60p9
3695h70j50n90q8j82l9m49j94K52k8Q2J78k0K65L74J33P60p5L65L14L43M94K88
$$ plain form
3717 1163 1211 1313 1390 1557 1630 1664 1635 1463 1104 1214 720 689 392 220 62 -148 -264 -255 -476 -698 -927 -873 -407
3740 -407 -658 -602 -113 -270 -406 -90 -105 177 -82 383 563 504 678 568 665 732 620 544 583 516 415 391 175
3763 175 192 -130 -25 -340 -252 -471 -202 -395 -539 -634 -685 -767 -664 -330 -387 -782 -466 -194 -291 -222 118 330 519
3786 519 372 654 985 1055 936 1109 1186 1270 1344 1357 1657 1415 1380 1315 1144 1154 1119 985 1036 638 608 399 531 569
3810 569 121 87 -70 202 300 -259 -43 90 -195 174 299 345 440 782 786 601 1152 1180 1065 1412 1522 1220
3832 1220 1243 1450 1362 1408 1036 1131 857 875 820 674 804 421 687 52 228 130 118 248 -15 -19 96 210 486
3855 486 541 597 541 748 982 1056 1113 897 1243 1240 1075 1044 1377 1267 1270 1297 1204 1311 1152 818 616 778 729 658 411
3880 411 791 378 141 -123 116 -94 108 81 -186 -191 -158 -21 298 327 152 167 513 462 468 929 980 1143 880
$$ packed form
3717A163M8J02P7J67P3L4k9j72l59J10m94l1k97j72j58k10j16Rk21k22k29N4M66
3740d07k51N6M89j57j36L16j5K82k59M65J80n9J74j10R7O7j12p6L9o7j01k4k16
3763A75J7l22J05l15Q8k19K69j93j44r5n1q2J03L34n7l95L16K72r7O9L40K12J89
3786E19j47K82L31P0j19J73P7Q4P4J3L00k42l5o5j71J0l5j34N1l98l0k09J32L8
3810E69m48l4j57K72R8n59K16J33k85L69J25M6R5L42Mj85N51K8j15L47J10l02
3832A220K3K07q8M6l72R5k74J8n5j46J30l83K66o35J76r8j2J30k63mJ15J14K76
3855D86N5N6n6K07K34P4N7k16L46lj65l1L33j10LK7r3J07j59l34k02J62m9p1k47
3880D11L80m13k37k64K39k10K02k7k67nL3J37L19K9j75J5L46n1OM61N1J63k63
$$ plain form
3903 880 1220 1404 1558 1437 1520 1480 1591 1724 1387 1298 1340 1451 1338 1371 1065 899 705 737 739 282 487 332 385
3926 385 577 437 367 139 309 510 779 733 668 646 1163 1206 1044 1461 1192 1502 1313 1359 1375 1121 894 1216
3948 1216 1029 523 433 496 132 -44 -183 -389 -469 -306 -218 -800 -694 -620 -552 -279 5 -286 22 31 482 674
3970 674 552 1137 1226 1273 1185 1229 1310 1367 1482 1156 958 1041 859 893 1091 606 630 312 365 461 296 163 140 157
3994 157 -203 -44 16 312 331 674 428 658 765 690 674 879 931 818 1044 497 865 540 517 636 634 93 38
4017 38 400 283 -132 -250 -526 -400 -593 -341 -321 -318 -500 -23 -150 -284 73 -291 -24 -210 54 132 -97 128
4039 128 210 164 258 222 219 370 180 393 239 217 49 6 335 152 373 246 277 571 441 475 389 517 235 432
4063 432 201 138 409 538 585 546 239 304 195 235 98 111 -4 177 76 82 151 0 -226 -250 -148 -31 -79 171
$$ packed form
3903H80L40J84J54j21Q3m0J11J33l37q9M2J11j13L3l06j66j94L2Km57K05j55N3
3926C85J92j40p0k28J70K01K69m6o5k2N17M3j62M17k69L10j89M6J6k54k27L22
3948A216j87n06r0O3l64j76j39k06q0J63Q8n82J06P4O8K73K84k91L08RM51J92
3970F74j22N85Q9M7q8M4Q1N7J15l26j98Q3j82L4J98m85K4l18N3R6j65j33k3J7
3994A57l60J59O0K96J9L43k46K30J07p5j6K05N2j13K26n47L68l25k3J19kn41n5
4017C8L62j17m15j18k76J26j93K52K0Lj82M77j27j34L57l64K67j86K64P8k29K25
4039A28Q2m6R4l6lJ51j90K13j54k2j68m3L29j83K21j27L1K94j30L4q6J28k82J97
4063D32k31o3K71J29M7l9l07O5j09M0j37J3j15J81j01OO9j51k26k4J02J17m8K50
$$ plain form
4087 171 -27 -40 -119 -63 282 -155 154 -44 1 240 -42 243 76 66 -62 46 -168 -176 55 -178 -190 -110 -126
4110 -126 -197 -5 -113 -47 -157 22 -296 -137 35 -46 88 166 16 -148 -77 -186 -139 45 9 175 185 266 -144
4133 -144 -214 -139 -129 -188 -100 -46 13 -6 -124 -204 -274 -179 -23 -236 -410 -252 -279 -416 -562 -250 -353 -351 -298 -421 -243
4158 -243 -136 -531 -251 -437 -299 -254 -276 -108 326 261 114 -33 139 406 385 515 307 362 733 254 356 475
4180 475 489 308 318 136 101 119 200 354 42 87 261 257 0 243 56 117 425 143 444 324 179 316 104
4203 104 295 509 628 228 372 251 62 295 105 -25 -212 -71 -248 -250 -343 -434 -189 -467 -254 -643 -315
4224 -315 -282 -273 -239 -68 -230 -190 -24 -158 -67 72 120 -32 132 309 102 5 191 415 216 740 343 435 397
4247 397 359 319 466 428 127 519 521 426 373 487 476 453 555 499 1124 456 668 722 352 819 762 552 336 169
$$ packed form
4087A71j98j3p9N6L45m37L09j98M5K39k82K85j67j0j28J08k14qK31k33j2Q0j6
4110a26p1J92j08O6j10J79l18J59J72q1J34P8j50j64P1j09M7J84l6J66J0Q1m10
4133a44p0P5J0n9Q8N4N9j9j18q0p0R5J56k13j74J58k7j37j46L12j03KN3j23J78
4158b43J07l95K80j86J38M5k2J68M34o5j47j47J72K67k1J30k08N5L71m79J02J19
4180D75J4j81J0j82l5J8Q1J54l12M5J74mk57K43j87O1L08k82L01j20j45J37k12
4203A04J91K14J19m00J44j21j89K33j90j30j87J41j77kr3r1K45k78K13l89L28
4224c15L3RL4J71j62M0J66j34R1J39M8j52J64J77k07r7J86K24j99N24l97R2l8
4247C97l8m0J47l8l01L92Kr5n3J14j1k3J02n6O25o68K12N4l70M67n7k10k16j67
$$ plain form
4271 169 338 220 120 -98 -162 -57 198 100 -295 -29 -79 -90 -100 142 114 -12 248 303 -93 287 236 346 271
4294 271 382 425 -133 100 -179 13 -163 44 46 -489 -132 -495 -191 4 -191 -145 156 -128 70 480 108
4315 108 484 809 874 599 679 1051 1011 1170 1132 1300 1250 1116 1333 1368 911 1003 1035 985 664 539 426 465 275
4338 275 359 190 94 270 321 118 264 100 591 279 163 541 345 563 473 607 494 644 481 701 693 412
4360 412 402 334 306 164 68 -212 42 -188 -259 -418 -389 -292 -96 -239 -296 -534 -255 -180 -66 -30 -100 293 104 69
4384 69 323 410 247 581 493 699 786 966 824 593 752 659 490 818 697 763 630 602 434 331 403 251 284
4407 284 255 402 326 227 407 211 430 156 589 404 523 219 385 240 402 318 397 124 238 281 438 453
4429 453 209 186 463 344 171 562 -44 162 212 193 -148 425 202 -171 144 196 164 238 261 184 286 298 195
$$ packed form
4271A69J69j18j00k18o4J05K55r8l95K66n0j1j0K42k8j26K60N5l96L80n1J10p5
4294B71J11M3n58K33k79J92j76K07Kn35L57l63L04J95j95M6L01k84J98M10l72
4315A08L76L25O5k75Q0L72m0J59l8J68n0j34K17L5m57R2L2n0l21j25j13L9j90
4338B75Q4j69r6J76N1k03J46j64M91l12j16L78j96K18r0J34j13J50j63K20qk81
4360D12j0o8k8j42r6k80K54k30p1j59K9R7J96j43n7k38K79P5J14L6p0L93j89l5
4384F9K54Q7j63L34q8K06Q7J80j42k31J59r3j69L28j21O6j33k8j68j03P2j52L3
4407B84k9J47p6r9J80j96K19k74M33j85J19l04J66j45J62q4P9k73J14M3J57J5
4429D53k44k3K77j19j73L91o06K06N0j9l41N73k23l73L15N2l2P4K3p7J02J2j03
$$ plain form
4452 195 12 21 175 107 544 285 -114 148 155 276 298 431 458 176 277 648 548 616 378 174 492 288 328
4475 328 444 421 436 141 77 217 42 14 402 -229 -6 -204 -15 -203 -121 31 -88 -115 33 -148 -48 -73
4497 -73 189 5 -69 -73 -31 -10 373 158 209 329 5 48 22 167 75 84 -205 92 -111 -215 83 -55 240 -1
4521 -1 -126 -91 -295 8 -409 -169 -77 -302 -48 -223 -83 -8 278 286 -165 101 135 132 131 -148 -139 -161 323 111 -77
4546 -77 205 282 -247 37 -259 -127 -228 -268 22 -1 -155 302 -60 8 -168 -248 118 -168 -262 -129 -81 -53 -176
4569 -176 -77 -65 -54 -55 -37 215 247 118 9 -29 202 117 282 64 311 -72 -121 160 123 12 -61 170 168 8 -111
4594 -111 -217 57 1 -321 -140 -257 -5 -295 71 -170 -52 -148 -33 16 -203 34 67 -74 -122 -131 84 39 -103
4617 -103 -304 -4 152 -278 -292 -354 -272 57 -427 -164 -344 -505 -92 -136 -401 -358 -179 -230 -195 -306 -207 -321 98
$$ packed form
4452A95j83RJ54o8M37k59l99K62PJ21K2J33K7k82J01L71j00O8k38k04L18k04M0
4475C28J16k3J5k95o4J40j75k8L88o31K23j98J89j88Q2J52j19k7J48j81J00k5
4497g3K62j84p4mM2K1L83k15N1J20l24M3k6J45r2Rk89K97k03j04K98j38K95k41
4521aj25L5k04L03m17K40R2k25K54j75J40P5K86Qm51K66L4ljk79Rk2M84k12j88
4546g7K82P7n29K84k96J32j01m0K90k3j54M57l62O8j76q0L66k86r4J33M8K8j23
4569a76R9J2J1jJ8K52L2j29j09l8K31q5J65k18K47l83m9K81l7j11p3K31kj60j19
4594a11j06K74n6l22J81j17K52k90L66k41J18r6J15M9k19K37L3j41m8rK15m5j42
4617a03k01L00J56m30j4o2Q2L29m84K63j80j61M13m4k65M3J79n1L5j11R9j14M19
$$ plain form
4640 98 -127 -187 93 -140 81 20 55 -46 -127 27 -95 -40 237 100 -53 63 139 -104 -121 -105 26 -21 -131
4663 -131 156 -34 22 -126 -195 -148 126 -43 -111 -41 -81 59 -271 -310 13 -294 -92 73 16 41 -116 62 -246
4686 -246 3 -111 97 -233 -139 -100 -80 -199 -107 -42 -134 -93 224 119 -80 150 118 -116 -15 -80 -228 -135 -160 -23
4710 -23 -33 -232 -235 281 70 181 -16 142 49 67 77 141 32 272 -345 -20 -199 -146 296 29 178 180 113 -217
4734 -217 158 255 53 47 104 -53 58 -314 73 259 -220 -50 -241 -128 -342 -130 45 -92 -2 71 -59 37
4756 37 -59 141 -161 204 113 -61 211 -124 -93 -20 -115 -33 75 33 -58 78 -242 211 -13 -392 94 -156 31
4779 31 78 348 -106 -141 -26 -53 229 179 -18 -142 106 209 -113 -104 -115 268 -20 -84 47 -81 58 291 -27
4802 -27 21 301 283 -128 -353 61 57 141 186 -277 65 12 -144 -23 -61 -29 -123 -5 12 27 70 -38 -190 -104 -106 172
$$ packed form
4640I8k25o0K80k33K21o1L5j01q1J54j22N5K77j37j53J16P6k43j7J6J31m7j10
4663a31K87j90N6j48o9M7K74j69o8P0m0J40l30l9L23l07K02J65n7K5j57J78l08
4686b46K49j14K08l30R4L9K0j19R2O5r2M1L17j05j99K30l2k34J01o5j48R3k5J37
4710b3j0j99lN16k11J11j97J58r3J8J0O4j09K40o17L25j79N3M42k67J49Ko7l30
4734b17L75R7k02oN7j57J11l72L87J86m79J70j91J13k14K12J75j37R0P3j30R6
4756C7r6K00l02L65r1j74K72l35L1P3r5Q2J08m2r1J36l20M53k24l79M86k50J87
4779C1M7K70m54l5J15k7K82n0j97j24K48J03l22Rj1L83k88o4J31j28J39K33l18
4802b7M8K80j8m11k25M14mQ4M5m63L42n3j56J21l8L2r4J18J7J5M3j08j52Q6kK78
$$ plain form
4828 172 3 -6 -43 108 -95 385 -88 -291 69 -92 -83 208 385 58 190 130 184 57 226 44 290 92
4850 92 -63 -9 181 114 -100 329 -111 -4 164 -26 169 -162 -149 129 266 -5 -152 27 -132 199 58
4871 58 190 37 71 193 194 184 19 -2 -70 114 -263 -7 17 410 -162 -104 34 -152 -16 -263 -84 -173 -8
4894 -8 -120 -86 -326 -43 151 -196 -32 -14 -165 -410 194 -115 -40 25 14 21 -6 -28 131 143 113 -33 -90 -29 21
4919 21 211 9 13 399 -64 131 110 -101 153 -103 119 333 -58 41 128 67 180 324 48 198 -197 125
4941 125 121 -20 54 -40 11 149 2 425 -2 74 -207 -252 -223 13 -437 -246 -160 -301 -115 -191 -207 43 -197 -236
4965 -236 27 -52 -226 1 198 50 85 211 -239 -45 166 196 3 160 -92 134 36 -136 215 -50 128
4986 128 -92 26 363 99 21 8 -302 -290 -107 8 -97 -48 298 11 -212 58 57 447 189 -207 227 256
$$ packed form
4828A72j69rl7J51k03M80m73k03L60j61RK91J77l27J32o0N4j27J69j82K46j98
4850I2j55N4J90o7k14M29m40J07J68j90J95l31J3K78J37k71j47J79j59L31j41
4871E8J32j53L4J22Jj0j65k1o8J84l77K56K4L93n72N8J38j86J36k47J79q9J65
4894hj12L4k40K83J94l47J64J8j51k45O04l09P5O5j1Pk7k2J59J2l0j46n7O1N0
4919B1J90k02ML86m63J95k1k11K54k56K22K14l91R9Q7o1J13J44k76J50l95L22
4941A25mj41P4r4N1J38j47M23m27P6k81m5K9K36m50J91Q6j41J86p6j6K50k40l9
4965b36K63p9j74K27J97j48L5J26m50J94K11L0j93J57k52K26r8j72L51k65J78
4986A28k20J18L37k64p8j3l10J2J83J15j05M9L46k87k23K70jL90k58l96M34K9
$$ plain form
5008 256 13 31 -37 292 19 -120 238 47 168 -398 113 -66 -393 -167 -121 -219 -158 81 -34 -407 65 -466
5030 -466 -610 -425 -254 -160 -229 -3 -186 -191 -146 -189 -176 -288 -75 -46 -170 88 251 23 -135 190 -198 15 105
5053 105 -84 -106 -256 101 -86 219 8 21 105 247 338 -227 176 134 -88 231 -104 -25 48 72 50 -10 98
5076 98 226 186 247 -46 -132 244 -76 6 187 -9 116 92 148 -306 -18 74 243 23 262 -170 266 320 386
5099 386 -317 -62 151 -202 -28 -156 -269 -173 -16 13 -226 -360 -3 -256 -156 3 -160 177 -79 -33 90
5120 90 182 131 -379 43 185 -18 18 102 51 193 202 18 -258 -39 72 102 -20 -371 -135 -227 -241 -26 -91 -166
5144 -166 37 154 -323 -57 19 59 136 -98 6 107 -111 -300 -67 189 16 83 15 71 -8 -80 -176 67 112
5167 112 -296 149 217 -88 198 -71 -55 43 -357 -123 -3 -32 -46 -18 -243 -7 -227 135 38 -27 430 183 293
$$ packed form
5008B56k43J8o8L29k73j39L58j91J21n66N11j79l27K26M6r8O1K39j15l73M72n31
5030d66j44J85J71R4o9K26j83nM5m3J3j12K13K9j24K58J63k28j58L25l88K13R0
5053A05j89k2j50L57j87L05k11J3Q4J42R1n65M03m2k22L19l35P9P3K4k2o0J08
5076I8J28m0O1k93q6L76l20Q2J81j96J25k4N6m54K88R2J69k20K39m32M36N4O6
5099C86p03K55K13l53J74j28j13R6J57K9k39j34L57k53J00J59j63L37k56M6J23
5120I0R2n1n10M22J42k03L6Q4n1J42Rj84k76K19J11L0j22l51K36r2j4K15o5p5
5144a66K03J17m77K66P6M0P7k34J04J01k18j89K33K56j73O7o8N6p9p2r6K43M5
5167A12m08M45O8l05K86k69J6R8m00K34J20k9j4K8k25K36k20L62r7o5M57k47J10
$$ plain form
5190 293 85 -60 -9 208 -87 45 254 7 -20 -83 -40 -74 378 261 194 -33 24 139 190 -104 -122 -92 43
5213 43 -183 -318 195 125 -147 -132 95 -363 344 67 -39 176 283 188 228 267 268 147 264 -81 104 161 248
5236 248 244 -191 151 -284 39 121 -211 232 -114 37 -20 -54 124 -99 1 78 -214 -21 -59 -402 -84 -219
5258 -219 -23 -256 -39 -288 276 -192 -5 -186 96 -9 -114 32 86 289 -103 -169 -2 -30 68 158 -58 -91
5280 -91 49 -8 51 -121 23 -84 -61 28 3 55 298 127 -112 -94 -86 -99 -276 177 -9 -56 -83 -117 136 -292 -126
$$ packed form
5190B93k08j45N1K17k95J32K09k47k7o3M3l4M52j17o7k27N7J15N1k94j8L0J35
5213D3k26j35N13p0k72J5K27m58P07k77j06K15J07r5M0L9Jj21J17l45J85N7Q7
5236B48mm35L42m35L23Q2l32M43l46J51n7l4J78k23J00P7k92J93l8l43L18j35
5258b19J96k33K17k49N64m68J87j81K82j05j05J46N4K03l92o6J67k8R8R0k16l3
5280i1J40n7N9j72J44j07K3Q9k5N2K43j71k39J8Qj3j77M53j86m7k7l4K53m28J66
$$ [...]
8191b09
##END NTUPLES=NMR FID
##END=
