##TITLE=1H_Pr new CDCl3
 CDCl3,8 sc, 
 24.9.2021
##JCAMPDX= 6.0         $$ Bruker NMR JCAMP-DX V2.0
##DATA TYPE= NMR FID
##DATA CLASS= NTUPLES
##ORIGIN= UXNMR, Bruker Analytische Messtechnik GmbH
##OWNER= root
$$ XWIN-NMR		Version 3.5
$$ Fri Sep 24 11:05:15 2021 Russian Standard Time (UT+4h)  she@DPX200
##.OBSERVE FREQUENCY= 200.1314
##.OBSERVE NUCLEUS= ^1H
##.DELAY= (6, 6)
##.ACQUISITION MODE= SIMULTANEOUS
##.ACQUISITION SCHEME= undefined
##.AVERAGES= 8
##.DIGITISER RES= 18
##SPECTROMETER/DATA SYSTEM= spect
##.PULSE SEQUENCE= zg30
##.SOLVENT NAME= CDCl3
##.SHIFT REFERENCE= (INTERNAL, CDCl3, 0, 15.7039)
##AUDIT TRAIL= $$ (NUMBER, WHEN, WHO, WHERE, WHAT)
$$ ##TITLE= Audit trail, XWIN-NMR		Version 3.5
$$ ##JCAMPDX= 5.01
$$ ##ORIGIN= Bruker BioSpin GmbH
$$ ##OWNER= she
$$ F:/spectra/data/she/nmr/H-F/1/audita.txt
$$ ##AUDIT TRAIL=  $$ (NUMBER, WHEN, WHO, WHERE, WHAT)
(   1,<2021-09-24 11:02:49.34 +0400>,<she>,<DPX200>,
      <created by zg, POWCHK disabled, PULCHK disabled
       configuration hash MD5:
       00 E9 B6 7A A2 85 ED C7 34 08 36 98 17 FE 4E 26
       data hash MD5: 16K
       79 BF D7 D3 AF 33 5D 54 74 BE 18 88 0A 56 38 EF>)
$$ ##END=
$$ 
$$ hash MD5
$$ A8 27 7D 3C 3A F0 85 25 60 E7 2B A7 4B 17 7C 6A
##$RELAX= 
##$RELAX= 
##$RELAX= 
##$RELAX= 
##$RELAX= 
##$RELAX= 
$$ Bruker specific parameters
$$ --------------------------
##$DU= <F:/spectra>
##$EXPNO= 1
##$NAME= <H-F>
##$PROCNO= 1
##$TYPE= <nmr>
##$USER= <she>
##$AMP= (0..31)
100 100 100 100 100 100 100 100 100 100 100 100 100 100 100 100 100 100 
100 100 100 100 100 100 100 100 100 100 100 100 100 100 
##$AQSEQ= 0
##$AQ_mod= 1
##$AUNM= <au_zg>
##$AUTOPOS= <>
##$BF1= 200.13
##$BF2= 200.13
##$BF3= 200.13
##$BF4= 200.13
##$BF5= 200.13
##$BF6= 200.13
##$BF7= 200.13
##$BF8= 200.13
##$BYTORDA= 1
##$CFDGTYP= 0
##$CFRGTYP= 5
##$CHEMSTR= <none>
##$CNST= (0..31)
1 1 145 1 1 1 1 1 1 1 1 1 1 1 1 1 1 1 1 1 1 1 1 1 1 1 1 1 1 1 1 1 
##$CPDPRG= <>
##$CPDPRG1= <>
##$CPDPRG2= <>
##$CPDPRG3= <>
##$CPDPRG4= <mlev>
##$CPDPRG5= <mlev>
##$CPDPRG6= <mlev>
##$CPDPRG7= <mlev>
##$CPDPRG8= <mlev>
##$CPDPRGB= <>
##$CPDPRGT= <>
##$D= (0..31)
0 1.2 0 0 0 0 0 0 0 0.06 0 0.03 0 0 0 0 0.0002 0 0 0 0 0 0 0 0 0 0 0 0 
0 0 0 
##$DATE= 1632466968
##$DBL= (0..7)
120 120 120 120 120 120 120 120 
##$DBP= (0..7)
150 150 150 150 150 150 150 150 
##$DBP07= 0
##$DBPNAM0= <>
##$DBPNAM1= <>
##$DBPNAM2= <>
##$DBPNAM3= <>
##$DBPNAM4= <>
##$DBPNAM5= <>
##$DBPNAM6= <>
##$DBPNAM7= <>
##$DBPOAL= (0..7)
0.5 0.5 0.5 0.5 0.5 0.5 0.5 0.5 
##$DBPOFFS= (0..7)
0 0 0 0 0 0 0 0 
##$DE= 6
##$DECBNUC= <off>
##$DECIM= 32
##$DECNUC= <off>
##$DECSTAT= 4
##$DIGMOD= 1
##$DIGTYP= 9
##$DL= (0..7)
0 120 120 120 120 120 120 120 
##$DP= (0..7)
150 150 150 150 150 150 150 150 
##$DP07= 0
##$DPNAME0= <>
##$DPNAME1= <>
##$DPNAME2= <>
##$DPNAME3= <>
##$DPNAME4= <>
##$DPNAME5= <>
##$DPNAME6= <>
##$DPNAME7= <>
##$DPOAL= (0..7)
0.5 0.5 0.5 0.5 0.5 0.5 0.5 0.5 
##$DPOFFS= (0..7)
0 0 0 0 0 0 0 0 
##$DQDMODE= 0
##$DR= 18
##$DS= 0
##$DSLIST= <SSSSSSSSSSSSSSS>
$$ [...]
##$SUBNAM2= <"">
##$SUBNAM3= <"">
##$SUBNAM4= <"">
##$SUBNAM5= <"">
##$SUBNAM6= <"">
##$SUBNAM7= <"">
##$SUBNAM8= <"">
##$SUBNAM9= <"">
##$SW= 20.0188988654967
##$SWIBOX= (0..15)
0 0 2 0 0 0 0 0 0 0 0 0 0 0 0 0 
##$SW_h= 4006.41025641026
##$TD= 16384
##$TD0= 1
##$TE= 0
##$TE2= 300
##$TE3= 300
##$TEG= 300
##$TL= (0..7)
0 120 120 120 120 120 120 120 
##$TP= (0..7)
150 150 150 150 150 150 150 150 
##$TP07= 0
##$TPNAME0= <>
##$TPNAME1= <>
##$TPNAME2= <>
##$TPNAME3= <>
##$TPNAME4= <>
##$TPNAME5= <>
##$TPNAME6= <>
##$TPNAME7= <>
##$TPOAL= (0..7)
0.5 0.5 0.5 0.5 0.5 0.5 0.5 0.5 
##$TPOFFS= (0..7)
0 0 0 0 0 0 0 0 
##$TUNHIN= 0
##$TUNHOUT= 0
##$TUNXOUT= 0
##$USERA1= <user>
##$USERA2= <user>
##$USERA3= <user>
##$USERA4= <user>
##$USERA5= <user>
##$V9= 5
##$VALIST= <valist>
##$VCLIST= <CCCCCCCCCCCCCCC>
##$VD= 0
##$VDLIST= <DDDDDDDDDDDDDDD>
##$VPLIST= <PPPPPPPPPPPPPPP>
##$VTLIST= <TTTTTTTTTTTTTTT>
##$WBST= 1024
##$WBSW= 4
##$XGAIN= (0..3)
0 0 0 0 
##$XL= 0
##$YL= 0
##$YMAX_a= 14506
##$YMIN_a= -8170
##$ZGOPTNS= <>
##$ZL1= 120
##$ZL2= 120
##$ZL3= 120
##$ZL4= 120
##$ABSF1= 10
##$ABSF2= 0
##$ABSG= 5
##$ABSL= 3
##$ALPHA= 0
##$AQORDER= 0
##$ASSFAC= 0
##$ASSFACI= 0
##$ASSFACX= 0
##$ASSWID= 0
##$AUNMP= <proc_1d>
##$AZFE= 0.1
##$AZFW= 0.1
##$BCFW= 1
##$BC_mod= 2
##$BYTORDP= 1
##$COROFFS= 0
##$CY= 11.3945322036743
##$DATMOD= 1
##$DC= 2
##$DFILT= <>
##$DTYPP= 0
##$F1P= 2.36226072786647
##$F2P= -0.459571619588291
##$FCOR= 0.5
##$FTSIZE= 0
##$FT_mod= 4
##$GAMMA= 1
##$GB= 0.15
##$INTBC= 1
##$INTSCL= 1
##$ISEN= 128
##$LB= 0.24
##$LEV0= 0
##$LPBIN= 0
##$MAXI= 10000
##$MC2= 0
##$MEAN= 0
##$ME_mod= 0
##$MI= 1.114404
##$NCOEF= 0
##$NC_proc= 0
##$NLEV= 6
##$NOISF1= 3.799351
##$NOISF2= 2.8
##$NSP= 1
##$NTH_PI= 0
##$NZP= 0
##$OFFSET= 15.70392
##$PC= 1
##$PHC0= -14069.03
##$PHC1= -2.999121
##$PH_mod= 1
##$PKNL= yes
##$PPARMOD= 0
##$PSCAL= 0
##$PSIGN= 0
##$REVERSE= no
##$SF= 200.130013532006
##$SI= 16384
##$SIGF1= 3
##$SIGF2= 2
##$SINO= 400
##$SIOLD= 16384
##$SREGLST= <1H.CDCl3>
##$SSB= 0
##$STSI= 0
##$STSR= 0
##$SW_p= 3612.71676300578
##$SYMM= 0
##$S_DEV= 0
##$TDeff= 0
##$TDoff= 0
##$TI= <>
##$TILT= no
##$TM1= 0
##$TM2= 0
##$TOPLEV= 0
##$USERP1= <user>
##$USERP2= <user>
##$USERP3= <user>
##$USERP4= <user>
##$USERP5= <user>
##$WDW= 1
##$XDIM= 8192
##$YMAX_p= 0
##$YMIN_p= 0
$$ End of Bruker specific parameters
$$ ---------------------------------
##NTUPLES= NMR FID
##VAR_NAME=  TIME,          FID/REAL,        FID/IMAG
##SYMBOL=    X,             R,               I
##VAR_TYPE=  INDEPENDENT,   DEPENDENT,       DEPENDENT
##VAR_FORM=  AFFN,          ASDF,            ASDF
##VAR_DIM=   8192,          8192,            8192
##UNITS=     SECONDS,       ARBITRARY UNITS, ARBITRARY UNITS
##FACTOR=    0.0002496,     1,               1
##FIRST=     0,             0,               0
##LAST=      2.0444736,     0,               0
##MIN=       0,             -8170,           0
##MAX=       2.0444736,     14506,           0
$$ Real data points
##PAGE= N=1
##DATA TABLE= (X++(R..R)), XYDATA
$$ [...]
1984A53j13M7r4K63l04r2O0K07k55j90J84ok11q8K74j68j29K93q4k4j12J97K33
2007D1l19M4J26K49l51K61m6j46l1q0K97J6M5L45l26k52J27L15l4j95O0J02P1
2030C19j47M52l93l32L72N8l35L9J52K62m43P8J85K53k98j1j2l70J43J67k74M1
2052i4ml46M44l33K89P4j60k40P1J03J17j32j5J55m71J5L71j05k50K82L02k48
2074a75Q9r5J99m87L58r1K37l24M76j59q2R9J64O8j17k34K95K2m69J64J91K88
2096D17j91J7J42nKj17L18n65J04L07j80j54M5j00N0J52k25J98k95j68J21l2n9
2119b18J54K30m7n41L97J9k56JK87N5k53K4j42N4j83K71j81K38k05J4m8Q7J53
2142i0J95j33k33K88j8j65K25j19L87m59j10L68J62l18m9M41n0J43j86Rm25J53
$$ y = [153, 40, 87, -7, 256, -48, -140, -80, 127, -128, -318, -134, -140, -351, -439, -165, -333, -462, -169, -253, -277, -389, -192, 41, -278, -234, -108, 141, -210, 51, 5, -141, -172, -252, 45, 61, 106, 451, 125, -127, 0, 315, 281, 86, 146, 248, 319, 172, 624, 231, -101, 271, 329, -6, 33, 185, 447, 4, 82, 267, 520, 222, 211, 199, -171, -28, 139, -135, -94, -98, -444, 0, -333, -44, 30, -130, -370, -299, -196, -79, -211, -226, -71, -542, -527, -156, -261, -511, -229, 73, -175, -86, -181, 18, -469, -111, -202, 35, -289, 187, 28, -54, 45, 209, 277, 160, -74, 221, 243, -226, -62, 129, 417, 226, 243, 385, 380, 382, 265, 583, 18, 122, 429, 249, 95, 140, 40, 90, 242, 17, 215, -80, -248, -127, -159, -218, -64, 166, 119, -422, -25, -6, -262, -261, 26, 81, -172, -148, -290, -236, -419, -148, -329, -91, -296, -282, -330, -243, -90, 105, -28, -261, 27, 9, -156, 69, -50, 337, -122, -232, 136, 298, -20, -69, 372, 322, 465, 279, 288, -137, 16]
2164A6M45k96K9o2K49k09m2K7K69k58j38K93Ml79J35K07m06P7k10M11k24j74K18
2187a8K11n26M5K96%l27L39j57L0k36j02L53M4k88m9K14K27n44M44J99n38J36
2209b47K30J26m20K25L1kP8J79q1l93N09k3N9l21K59j50P3l8J96Q0l29J04J6J86
2233C47m12J76O2j8J04O1n9q2j60M49l56p0J21p2J23l46J55R0j53j08J92k48m04
2256f08M06L1J75l56k04M68j00j53L27j05j21n3J86j20J61Q3j37r2p0M8J74J16
2278E6n0L65j21m29L42J26pm39n3L56j56n1N28O7n88J05L06p5j70R7nK12m74R1
2302C3l5J49j28L46k93j50j79N13j65m36L88j67J61j00K27l8n33K20M08k16l13
2323c08R7J03l01J38N5J07j95J48K45k50Q0k87J61K5j83M17p8j29P8P7J26l28
$$ y = [16, 461, 165, 194, 132, 381, 172, 130, 157, 426, 168, 30, 323, 327, -52, 83, 290, -116, -39, -249, 162, -62, -236, -18, 193, -333, -288, 8, 8, -319, 20, -137, -107, -343, -445, -92, -48, -336, -385, -171, 56, -488, -44, 155, -383, -247, -17, 109, -311, -86, -55, -57, 21, 200, 119, -274, 235, 212, 271, -50, 209, 59, 132, 94, 290, 370, 41, 145, 161, 347, -65, 111, 173, 155, 259, 320, 261, 179, 19, 468, 112, 42, 163, 91, 214, -132, 23, 113, -40, -148, 44, -204, -608, -202, -171, 4, -352, -556, -88, -188, -341, -14, -119, -240, -293, -107, -227, -66, 17, -120, -212, -282, -234, -60, 56, 6, 371, 250, -179, 163, 289, 282, -157, -210, 146, -10, -61, 467, 534, -54, 51, 357, 282, 112, 209, 204, 416, -58, 33, -2, 147, 19, 365, 72, -78, -257, 256, 91, -345, 43, -124, 37, -63, 164, 126, -407, -187, 221, 5, -308, -211, -108, -409, -271, -216, -109, -304, -156, 89, -161, -81, -368, -207, -182, -365, 52, -26, -155, -77, 0, 126, -202]
2345b02L22K19l57J71n9j7o7J91j33J90k16J52L9j38N6o1J39k60M0K51r7j87k
2368b6J95j9n6J70j2n4l59L2P6K1K44p9K2q6j41L29k39k95J31N4j93r5M42k06
2392a44j05j1O0j83J71K67k01j11Q3J36J46m04J18J28k2MK43j97k67M6J35K35
2414A27ro0K38j57o2k18J80J97k97L49j17j16K5l4J87k01q5J54q5O0k5K81l49
2437a7PN1M6J51k74J24j30j84P0N28l93k32oM5J56k97L54R6l73J12j13j26R4q8
2461c99N8K47N4k46J57l25L33Q8k16J48q0N4P5j21K79k77K04J87k85L17j27J4
2483A39R0J27m52K98k8J9K1n4%o2J41K18m17J26PJ1k47J25J73J71m94K2M1N7J20
2508A52k66K34k53K8L7K14j31j16Knk51J91K5j33O1K83j21j27k57M90j1k58J46
$$ y = [-202, 120, 339, -18, 153, 94, 77, 10, 201, 68, 258, 42, 194, 233, 95, 151, 90, 229, -31, 9, 260, 163, -24, -26, 169, 150, 94, 264, 252, 198, -161, -129, -53, -32, 212, 133, 155, 69, -72, 257, 18, -277, -146, -92, -285, -380, 62, -144, -249, -260, -200, -383, -212, 55, -146, -257, -174, -38, 108, -296, -178, -50, -72, -68, 175, -22, -289, -243, -108, 127, 118, 58, 296, 139, 77, -141, 39, 236, -61, 288, 171, 55, 80, 46, 233, 32, -53, 101, 16, 76, 51, 332, -17, -10, 41, 87, 238, -36, 88, -42, -226, -156, 372, -21, -253, -259, -214, -58, -355, -1, 95, -278, -166, -279, -405, -311, -399, -341, -94, -40, -286, -129, -454, -121, -33, -249, -101, -181, -127, -52, -173, 106, -171, 33, 220, -65, 252, 125, 139, 229, 356, -96, 202, 174, 193, 214, 160, 160, 98, 239, 457, 40, 166, 173, 184, -63, 62, 235, 406, -88, -66, -25, 32, 152, -114, 120, -133, -105, -68, 146, 15, -101, -99, -104, -355, -164, -139, -272, -211, 72, -49, -176, -433, 57, 46, -212, -66]
2531f6k8P1l05K76p0l6j76K8M79j17N4m2j01J91j11L16k18j97J91J14r9J33l02
2554a5K20j35k31M81k97Q7j71N30l42k33K95j71k08O06l15L7j62p9L33k99o2J02
2576b9L1j22K62j64N8j34nJ97j06k33o3K30j84o4K30j37O4M48n4k75l25J76L42
2599A43j19k81K35pj89K66k6j40l5L39qk53j12L74k30J69p0L61k38K5R0k18n1
2622B5K76j45J51P8n77O71l75L6L0j40o2j38J87K99k81K5N2K47l59KK04j3k29
2645c6K71l77J09k41J06n1r6K94n8J66n12L15p7q8J04%K26JL1k55m0O5J4l5O2
2670a02k36M42m1k2P5L3K56l53O5J10J8k02k1J70o9j55J58J53n1j62j0J70n8o7
2694A01J54j12k13J45J11k40K59o3k68L50j23l6J18l00j01L71j15J2k16L79l89
$$ y = [-66, -94, -23, -328, -52, -122, -158, -334, -306, 173, 56, 110, 68, -33, 158, 47, 363, 145, -52, 139, 253, 154, 287, -15, 205, 70, -161, 320, 23, 110, -61, 469, 127, -106, 189, 18, -190, 416, 101, 138, -24, -103, 230, -69, -131, -29, 2, -120, 142, -22, 36, -98, -103, 94, -12, -245, -308, -78, -262, -326, -96, -233, -169, 279, 225, -50, -375, -199, 143, 24, -257, -22, -29, -218, 48, 22, -118, -153, 186, 178, -75, -187, 187, -43, 126, 56, 417, 179, 204, 294, 76, 25, 301, 156, 307, 385, -192, 479, 104, 140, 170, 30, -32, -170, 17, 316, 35, 60, 112, 359, 0, 2, 206, 193, -36, 235, -142, -33, -274, -168, -219, -315, -21, -79, 87, -425, -110, -187, -275, -171, -171, 55, 56, 87, -168, -208, -143, -129, -164, -102, -338, 104, 63, 41, 116, 149, 405, 52, 117, 227, 245, 43, 22, 192, 123, -32, 126, 279, 228, 66, 56, 226, 168, 101, 255, 143, -70, 75, 186, -54, 205, 142, -126, 224, 101, 65, 183, -117, -218, 153, 38, 50, -166, 213, -176]
2715a76j7L00k18O9j95K65k82J19n1K4J54m5R1k40l8L18l0j59n2L91j28J72o19
2738c47M80P4l56R3K30m4j5o1R8j42RJ61j58J05j24K32k38M3L07k35J50m89N03
2761B76k32J53k41K3K81k95J9j64L86l10j18K44J97k13J63n0k01mM0k33L33l23
2783b69N3K85k18lL12j65O9j39K3k88J87L77j82j31k4J43L6o3j68O3J70k26L78
2806B20j20j06J75l7j64p7L12Lj27q1J77Q9J1k53J95J0k28J03J25k10o0J6J00
2829G3Nr3L60j3n32L22J46m29M01j71l1j02k22K23n0n2o9L01l47K11L6J16k78
2852a95J53k06mK06n0J35j86J73j16K23K7k00m0m5J88j02L19j72j64j66M10m17
2874b29J89L6K2r2K02o6P8l0J13j69J0L9K28m24N4n1K02M7k36J82j10L13m73J79
$$ y = [-176, -193, 107, -111, -42, -237, 28, -254, -135, -186, -162, -8, -53, 38, -202, -240, 78, 48, -111, -163, 228, 100, 272, -347, 133, 207, -149, -56, 174, 130, 115, 54, 152, 10, 19, 180, 22, 127, 3, 235, -3, 40, 347, 112, 262, -227, 276, 44, 197, -44, -21, 260, -35, -16, -180, 206, -104, -222, 22, 219, 6, 169, 119, -82, -86, -46, -279, 54, -269, -216, 69, -149, -152, 160, -5, 64, -75, -52, -340, -153, 224, 42, -89, -113, 30, 66, 3, -165, -102, 68, -158, 220, 100, -6, 169, 132, -32, -109, 203, 206, 79, -2, 175, 264, 275, 22, 217, 227, -1, 102, 227, 17, -43, -27, 73, 78, -15, 345, 332, -200, 122, 268, -161, 240, 69, 38, -64, -286, -63, -113, -165, -234, 67, -280, -69, -33, 83, -195, -42, -248, -252, -46, -96, 39, -147, 26, -90, 133, 160, -40, -80, -125, 63, -39, 280, 108, -56, -222, 188, -229, -40, -4, 18, -74, 128, 62, 140, 110, 223, 54, 64, 103, 331, -93, -39, -90, 112, 159, -77, 105, -5, 308, -165, 14]
2898A4J32j47j51K33r5L6J24k05k14K83k08Q3j13J61L4j54j84J16K09P1m91L59
2920a07l6P5k71K83rj36K44r3K18k94J40n0M8q3k1K52l43K42J92k36j62L20Lj36
2944D0OM0J24o2j96J70J83k18K16l52J93p7R7J3j58NR3M73m44j68j2L5n6K52l13
2969a16K93l39L22j00j00k40L76r6p9j36J85J3m8j17J47O6l5j43o9J42j34J18
2991i0O3j93M17l05J39j3l9M7j23K07N9l08L58k75L79j74l26L05K29j82p9m4J91
3014B43O6k74R9Nm4J23j09l53K06k59K06L1J49J7mr7lj58J30o9%J31j68R0j23
3039a65L25ml18k9p1j01K78J38l56M65j82P1o4L9K48m86m9J60Q8J61m31M48k80
3062a15p1L38k32L3K33l85M32j1l62J70L00k40m39N81l41k1K23J40j36j40K36
$$ y = [14, 146, -1, -152, 81, -14, 22, 146, -59, -273, 10, -198, -115, -228, -67, -33, -187, -371, -255, -46, 25, -466, -107, -143, -68, -339, -56, -65, -201, 43, -50, 168, -126, 14, -36, 12, -71, -92, 160, -183, 59, 251, 15, -147, 173, 176, 40, 46, 86, 210, 148, -48, 122, 305, 87, 303, -49, 144, 67, 164, 177, 19, 24, 117, 590, 146, -22, -34, 1, -55, 197, -116, 177, -162, 160, 60, -40, -280, 96, 0, -79, -215, -30, -17, -65, -182, -35, 31, -4, -147, -216, -74, -208, -90, -27, -220, 197, -108, 31, 18, -21, 26, -97, 110, 169, -139, 219, -56, 323, 149, -177, 128, 357, 175, 96, 52, 243, 309, 35, 134, 139, 95, 218, 109, -244, -38, -297, -91, -60, 89, 106, 102, 5, 2, -156, -26, -95, -95, 36, -132, -42, -165, 160, 156, -162, -191, -262, -363, -85, 53, -303, 162, -20, 51, -13, 26, 274, -212, -261, -101, -13, 148, -283, 165, -115, -186, 152, -80, -47, 186, -199, 233, 222, -140, 30, 330, 90, -349, 232, -109, -130, 93, 233, 97, -43, 193]
3083A93l25L89l82K43j02j0J03j48j19K02L7O4j71m0L44k65j23K4j00l1K26j25
3105a16J67l30J11J76P6j87J68l53J46J8q3L14k2n1j34O6j74k3K56j86K02K9%
3128G0lj53J61j30J18j54J72K07l29J99Mj17l23J52j43M42j86L73j69j21K80k85
3150F5K35l56J24M3n9j10J79qj15J10J86l04j69J44j51J77j66q5M86m39J64j80
3172b29n8M21k34J1J63r8k33L03k17J35P2R5lr0q3j4N8m19O62l04J88j49N7J7
3196E1O5J95l01J6j43M52m67P6J37j53K72q1k10L49k86J6K66k13J80k89K57k05
3218a6N7p6J5J97Q3j88j40K13l15M26k85j11j70L07j24P4j82K98J25l85J78lm0
3241f2m3K17k1k04N2J04j03J16k69K22j35L4J00O1k28J26J08pj04K13N5m46R3
$$ y = [193, -132, 257, -125, 118, 16, 6, 109, -39, -158, 44, 81, 145, -26, -66, 278, 13, -110, -86, -186, -217, 9, -116, 51, -279, -168, 8, 84, -103, 65, -288, -142, -124, -207, 107, 85, 34, -100, -34, -208, -231, 25, -161, 41, 70, 70, 67, -86, 75, -55, 63, -91, 81, 288, -41, 158, 162, 45, -278, -126, -269, 173, -13, 360, 191, 70, 350, 65, 300, -56, 68, 111, 52, -58, 121, 113, -2, 108, 294, -10, -179, -35, -186, -9, -175, -260, 226, -213, -49, -229, -287, 134, -100, -89, 74, -24, -257, 46, -171, -36, 36, 131, 128, 38, -45, -59, -1, -420, 242, -62, 126, -23, 34, 51, 116, 311, 10, 26, -117, 335, -132, -56, 81, -72, 200, 119, -91, 258, -28, -12, 254, 41, 221, -68, 189, -16, 41, -35, -20, 177, 260, 72, -68, 145, -170, 256, -29, -140, -310, -3, -127, -53, -235, 63, 188, -197, -19, -22, -62, -105, 112, 91, -113, -61, 43, -60, 56, -213, 9, -126, -92, 8, 69, -159, -33, 75, 68, -36, 177, 232, -214, -121]
3264a21j11K49QK0J62k23J74J04l52J13Mj04J40o2K34N1k5j37J29P9l32J63r5
3287F8j71J09M5J62m2l89L61j2n8q2k63L54j40j33J45O9j53J74J25j85L9P6k64
3310a65M0o5K33J10j59p8J23k4l9R6n1p0K58j31r2K12j28J0J98k53j16J27N9q5
3334A0K55k1j40l2j09J61k38L45k57m0mL17m9j48j19K56q1l6J9M1q0l97N43q5
3358A11k5l51K01Q9m3k81K49J86m00K35mj88J35l2N3K92k36q9P4j40j03J27L92
3381B52n02L14k02n9L14j98J40j6k84L59J4k38r3L05k30K8J46K21k71J3K61j04
3403A70k09l9K72Mj26j5j72J61J0J77p4Q0k87K55j16k32K18L3Kk11L90k32J39
3426A98j28l55J10J97l4K03m59L82l78J13J60m51N05j39j15P4Q8J29l45j61L08
$$ y = [-121, -232, 17, 25, 45, 207, -16, 158, 262, -90, 23, 27, -77, 63, 1, 235, 286, 261, 124, 253, 332, 0, 163, 68, -103, 6, 51, 213, 171, -218, 143, 131, 73, -9, -272, 82, -58, -191, -46, 23, -130, 44, 169, -16, 23, 99, -165, -125, -190, 43, 153, -6, -84, 39, 15, -24, 72, 21, -49, 209, 78, -14, 198, 70, 80, 278, 25, -91, 36, 95, 10, 265, 244, 104, 72, -37, 124, -114, 231, -26, -66, -70, 247, 198, 50, -69, 187, 106, 70, 89, 130, 50, -347, 196, 111, 86, -265, -64, 25, -18, -299, -50, 136, -264, -29, -33, -221, -86, -118, -65, 227, -9, -98, -24, -164, -267, -140, 252, -250, 64, -138, -197, 117, -81, 59, 43, -241, 118, 132, -106, -199, 106, -124, -96, 50, 271, 0, 13, 274, 170, -39, -78, 194, 198, 72, 57, -115, 46, 56, 233, 159, 239, -48, 207, 91, -141, 77, 110, 112, -99, 291, 59, 198, 70, -285, -175, 22, -12, 191, -268, 114, -264, -151, 9, -442, 63, -76, -191, -117, -29, 100, -245, -406, -98]
3447i8k3K90l68m2k10K16K6K09j12J06K17O5q6o1k4K9j65J9K26k68j58M3K62j50
3471e7R9J53j81N6k8N6k02K30J50j69K27j51k05Q7r0J26j74M2j52K19j74k09K06
3494a41O5m4p7J03j07K83k18N1J97l90M4J51J91Q8r4j85K00k05N1J57j07p8m6
3517a11J60k89K08Q5jj43K67q7n1j49OK2K21p9j12J34l82L46J41j79J18k59j22
3540b56K98j25pJ04K87r1j50J68l15M5L65m68n9O2J66k96M3K26j76j66N66k44
3562b3m5J16j19o3J72J3k5k16Q2M2L01j59r6l7J28K0o4j75mJ23J3j11k1K90j81
3587c9O8K18k43J40Mk19l5k5Q7P7k4o7Q5j66J08l0J37L4J88j99j19K22j8k29Q1
3612C6lon7N0k47L23j21J17j46O8KO8j01J21j52N9O9j80j02K32j79m5J87k57K45
$$ y = [-98, -121, 169, -199, -241, -451, -235, -209, 0, -112, -6, 211, 276, 190, 129, 105, 134, -31, -12, 214, -54, -212, -169, 93, -57, 42, 195, 14, 70, 42, 98, -104, 126, 276, 107, 334, 183, -22, 65, -25, 101, -73, -31, -183, 36, -138, -347, -141, -76, -120, -197, -94, -201, 82, -136, -85, 112, -278, -234, -83, 108, 196, 102, -83, 117, -88, -37, 120, 13, -65, -111, 49, -240, -32, 53, 52, -91, 176, 89, 38, -111, -105, -83, 138, 59, -53, 81, -301, 45, 186, 7, 125, -134, -256, 42, -83, -90, 14, 301, 210, 60, 228, -87, -42, 323, -145, -204, -142, 24, -272, -229, -3, -179, -345, 221, -23, -68, 48, -71, -134, 38, 51, 26, -190, -108, -66, 235, 76, -20, -57, 71, 91, 27, -148, -152, -29, -16, -127, -148, 142, -39, 29, 247, 4, 144, 148, -71, -106, -131, -44, 33, 9, -58, 27, -139, -31, -61, 76, 110, 298, 99, -20, 202, 184, -45, 36, 33, 27, -30, 20, -227, 96, -25, 92, -54, 14, 16, 84, -17, 104, -48, 11, 80, -100, -202, 30, -149, -194, -7, -264, -19]
3637a9k24J93rJ79j01K68j50l06N8J3J84K1p2k1l8O5j48K31k35J84J30o4k27n7
3661a45P2j36M67k70J97j14n3K87l94O7rJ74m7j05J00j70M51m98K43l6r5r5L00
3684A91K5k14J24l54J03L6L5k53K47j2r2K53%k82J82l61L71l19J69L90o26K16
3706a71J79J21k56p4L05k57L05j62k67K97Q8J8l75L21n0M8m2m4k1K64k04l29M01
3729I5n93M24m1Q5L79l28R1r8J23k2j1m14K24K73l41J76l3j43jL41j47p0k05J46
3753i0K23k61Nj68J97J29l13M9L75j26j71j1J04J11j5j52j09L13k31K1L29l23
3775a14K96j24r4J86j79q9Qp7K04l9k59L19J84m20J28J91q2O8J10k5j65J26K80
3798D33l56k9j76J60j36j8M8J79j54q6R1P7j26L9K12Q5j98p2J56k12O1J16p8m36
$$ y = [-19, -243, -50, -59, 120, 19, 287, 137, -169, -111, -98, 86, 107, 35, 14, -24, 41, -107, 124, -111, 73, 203, 139, -88, -145, -73, -209, 258, -12, 185, 71, 18, 305, -89, -22, -31, 143, 96, -9, 91, -79, 372, -126, 117, 81, -14, -109, 191, 216, 2, 126, -228, -125, -89, -54, -307, -60, -72, -164, 89, 89, -193, -11, -372, -1, -320, -151, 239, -387, -171, 8, 129, -127, -201, 104, -153, 152, -10, -277, 20, 108, 126, -249, 72, 22, 70, 28, -16, -37, 227, 23, -306, 95, -498, -74, -115, -30, 349, 21, 112, 14, 137, 115, 104, -310, -86, 187, -154, 22, -11, -154, -155, 186, 39, -31, -236, -90, 133, -128, -123, -291, -94, 35, -278, -229, 146, 20, -151, -162, -58, 53, 38, -114, -223, 90, -141, -120, 209, -114, 182, 58, -36, 150, -29, -118, -110, -187, 17, -22, -281, 38, 222, -198, -70, 121, 39, 107, 217, 192, 27, 153, 433, 77, 48, -128, 32, -104, -122, -74, 105, -49, -135, -44, 33, -93, -54, 158, 243, 45, -27, 129, -83, -22, 94, 16, -420]
3822d20K52K15j27n0J16k63K61r9K11j11J34k14l48P36n73L74j36%j82K67K8K6
3844I7l2m2k5j92K99j42J23q9J34Nj1k15L9O1n4j9K84K03m12j93K48J47k25Q2
3868G1J44j97Jj4J0j41N5l0K5K76m29J57J96l8o4N9rn55N66j0k74J06N3L8O7j38
3894g5K08l26K64j05nk35K76j86j31K60q9Q4J65l05M1O2L0R3k01j9L54j65j04
3917a09m8K12J3N4k17K37j13p7J39j36P4p7L80m06L14k49k18M14J6k93J04O7o6
3940A5O2n3L32k61j14J00J79k76l5N9k19J69K64P9m31K17k93K73k27j2j98K92
3962g8O0q0K1R7N7M4J6j78K82k23o4O7j07J78O8m51K15J45j66M22l22K49j4j24
3986A14k47N02m51k1K41K1n9L8P7J59k34m7K33l70O4K54m21K26R3j89oj13J53
$$ y = [-420, -168, 47, -80, -130, -14, -277, -16, -115, 96, -15, 119, -95, -443, 293, -280, 94, -42, -42, -224, 43, 71, 97, 65, 23, -2, -194, 105, -37, 86, -3, 131, 136, 125, -90, -51, 10, -44, -63, 221, 424, 12, -181, 67, 214, -11, 71, 215, 18, 19, 5, 15, -126, -71, -101, -76, 200, -229, -72, 124, 86, 22, 81, 72, -483, 83, 73, -201, -95, -42, -4, 63, -75, 133, -193, 71, -34, -39, -274, 2, -184, -315, -55, -144, -60, 105, -200, -159, -97, -67, 26, -175, -194, 160, -5, -109, -157, 55, 68, 122, -95, 142, 29, -48, 91, -45, 29, -48, 332, -74, 240, -9, -227, 187, 203, -90, 14, 81, 15, 77, 24, 356, 95, -19, 81, 260, -16, -51, 8, -211, -42, 222, 301, -130, 87, -206, 67, -160, -172, -370, -78, -18, -98, -77, 20, 77, 121, 137, -41, 241, 18, -46, 21, -86, 92, 160, -291, -76, 69, -97, 325, 3, 252, 238, 114, -133, 369, -82, -103, 138, 159, 100, 138, 215, 374, 140, 93, 326, -44, 20, 274, -147, 79, 172, -17, -23, -136, 17]
4009A7k82K04J36n0J13j38k00L04r5J02j95P1J20j30K61l02j58o5K33K78l03K37
4031A58k49J48n6j05R3l39K03Q9j28L1J61J30k90O0L74j11j93j11L15Q4k27j07
4053g0K88l25L10l42L66k79j87R9K28%J3J22r4r4l6J01j35kK6J24m38O38k05j71
4077f3q3r8K98R1o1k15R6l8R1j62p9O6M5O5q4oJ99O0r0k66L50k57L1J00J03q2
4103A1Lj71j0L60j64j41p0J94k51L46P4k8j00k10J81p7K01K24k24l2j89J04j90
4126a59j08L71k22K77o0J8jN7j12k81J92J10j52M35l43j6q2J03L7J0N4j18k5J42
4150A27j07j82L10j71KJ38j13J03j97m1K49l68J87p3M40l59K14O0k52p7J82j84
4172a12L82j83k02M34l52k42J51o5K45m6J20j37L00l00O3J01o2j83k55M37J92
$$ y = [17, -265, -61, 75, 25, 138, 0, -200, 104, 9, 111, -84, -13, 107, -23, 238, -64, -222, -287, -54, 224, -79, 158, -91, 57, 1, -104, -11, -350, -147, -58, -186, -155, 6, 136, -154, -94, 280, 169, -24, -135, 180, 264, 37, -70, 218, -107, 203, -139, 227, -52, -239, -140, 88, 88, 101, 223, 129, 35, -1, 100, -35, -37, -11, 113, -325, 313, 108, -63, -146, -244, 54, 145, 84, -131, -35, -73, 18, -144, -223, -157, -112, -47, -131, -137, 62, 122, 32, -234, 116, -141, -110, -10, 93, 11, 14, -157, -167, 193, 29, -112, -182, 12, -239, 107, 181, 153, 53, -157, 24, -53, 148, 372, 148, 116, -73, 31, -159, -267, 104, -118, 159, 99, 117, 116, 173, 61, -220, -28, 82, -70, 365, 22, 6, -76, 27, 64, 74, 128, 10, -15, 127, 20, -162, 148, -23, -21, 117, 4, 107, -90, -131, 118, -250, -63, -136, 304, -55, 159, 219, -33, -110, 72, -112, 270, 87, -115, 319, -33, -275, -124, -189, 56, 10, 130, -7, 293, -7, 56, 157, 95, -88, -343, 94, 286]
4193B86l8j57j58J52J04k68O0k17J76J49Q7l00P8J31J15k55M12l16J5r8L0J18
4215A06n2q8J21J30j33m1j54o7K36J73Jj18k22L1N0j29J60k01J35J29P4j69L96
4238C68k34m2R4N2k36j15L02j86K7K16k89K38q3p7J40j61K35p7k88J48J27k35
4260g6J39o6K1l0J87j06o1O2J51k02j90N0L51m08L98n6k35k3nL5P9Lj9J22l20
4285a99P4kj4k83O31l85J08Q9o1r7K09k57L77k89K43r4%L0n9P5n0L23l13j49J89
4310I6j63J98J1k55L98j22Lk05J00l29L31O9k42K34Q0k88J15K08k92n6Q8J76l2
4333A23j95QK86j22l53N30m50J51o4L57k35m41N28k26j62j55K40m0K87l5j28L32
4355B36k43N6q6j72J86kP9j99PK23o4M8l33K73j26J47K44j44j1R1j55j13j9nJ64
$$ y = [286, 248, 91, -67, 85, 189, -79, -19, -236, -60, 89, 176, -124, -46, 85, 200, -55, 357, 41, 56, -42, -12, 106, 54, -34, 87, 217, 84, 43, -111, -178, 58, 231, 232, 114, -108, -77, -27, -156, 4, -197, -62, 67, 141, -28, 368, 134, 92, 186, 238, 2, -113, 189, 3, 30, 246, -43, 195, 112, 35, 175, 14, 249, 172, -116, 32, 159, -76, 63, -3, 18, -12, 175, 69, 8, 70, 221, 19, -171, -121, 230, -178, 220, 164, -71, -94, -99, -64, 15, 18, -1, 121, -199, -125, -127, -141, -424, 207, -178, -70, 19, -42, -139, 70, -187, 190, -99, 144, 50, 50, 80, 21, 96, 46, 369, 56, -93, 96, -67, 131, 142, -113, 285, 163, 166, -39, 61, -268, 63, 132, -110, 124, 204, -84, 31, 239, -53, -109, -21, 155, 123, -72, -64, 222, 100, -253, 277, -173, -22, -86, 271, 36, -405, 123, -103, -265, -420, -180, -220, 67, 32, -96, 236, -7, 49, -37, -209, -23, -25, 54, -145, -138, 85, 21, 69, -264, 9, -117, 30, 274, 130, 119, 210, 55, -58, -77, -82, 82]
4380H2k91J06N12j57k29P6k10N6O6J80r4q0J53j25J9j34O3J69k23L34k42K08j59
4403H0j15J26J6m3j31K36j23K10n36L29m1k03J43P8j72k40J34L29j99j3K90k82
4425a27L3L00l93L5J98k5j31L18O2k83M5M4n8k1R6P4n1j50j20J90K47k60r2K96
4449B27p8k23j2K07k50K94J60k54j7j84j31O00j43j44mj17P4j14J53k0Pj42K66
4472A55j59L3J82j40M6k80J13k55J54O6q4R8l6j04J14J56Ok63K1P0J13k80L80
4495A06p8k49J25JN9J07P4l1j03J14j91K54k24k23K28j45L48j90K02l98L98k47
4517f3J94j52j67K75M0p5k08J71N9J11j51p9J13M7K5m18K37p3R0R3l9Q7Ok96O2
4542a11J18j61J59Lj14J14Q0k11P2J81j53pj2O6l9K74k96Q9k1l1k0k62L95l08
$$ y = [82, -209, -103, 409, 252, 23, 99, -111, -55, 11, 191, 97, 17, 170, 45, 64, -70, -7, 162, -61, 273, 31, 239, 80, -35, 91, 107, 64, -67, 169, 46, 256, -280, 49, 8, -195, -52, 26, -146, -386, -252, 77, -122, -135, 155, -127, -94, 206, -187, -152, 46, 21, -110, 208, 270, -13, 32, 76, 18, -3, 93, 167, 116, -34, -154, 36, 283, 23, -69, 227, 149, -74, -86, 121, -129, 165, 325, 71, 54, -130, -261, 339, 196, 52, 48, -69, 5, -109, 44, 24, 31, -111, 155, -4, 29, 211, 71, 117, -163, -50, -305, -151, -85, -169, -71, -107, -211, -97, 59, 65, -198, -177, -107, 6, -274, 106, 28, -221, -96, -95, -36, 71, 145, 114, 11, 125, -66, 188, -36, -259, -31, -176, 172, -18, 184, -214, 184, -63, 131, -21, -188, 87, 127, 52, -156, 15, 74, 185, 34, -45, 68, 115, 140, -278, -41, -114, -24, 69, 30, 117, 123, -173, -111, 7, -154, 5, 8, -106, 8, 88, -123, -51, 130, -23, -30, -42, 24, -15, 259, -37, 52, 31, 0, -20, -282, 113, -195]
4566a95J91J98l62K85m1J36j01qL5M3k35R8j09P8L04l76J60M0m2k36K36Q6k02
4589a7K47nk01j00P9M0L39n53J4Q4p0n0L06l08J89J51j76m04M13J55r5j83K81
4612A36k99K97r1l23J66l70K95Q9J38j3K1K17k92k11J14l9o2L45j28l20M16k36
4634a50O6m3Pm4L36j51J18l53J84L07k53J8J67k22O7k46M20k15N1m0p6N8K53l0
4658B29l54K25K3L6m0r1OJ57l04j19KJ74J22k11M7J32k06J90K43l92j5K51j46
4681d1J22j53J94O3k06q2L37l57M5N1m2p3K86k12M46l49M8R9j47k42J96p3j25
4704b15L24J81l29L0Mk55N15k15K6P9l8q8O2m50L26N9j0q7j54J93q1K14j19J13
4728H5j0kJ60n02M33j31M7k52Q9Rj26K33r4J27j48R5K5K13m54K69K3R8p0n00L82
$$ y = [-195, -4, 194, -168, 117, 76, 212, 111, 103, 138, 181, -54, 44, -65, 13, 317, -59, 101, 141, 99, -137, 99, 185, -17, 230, 225, 24, -76, 3, 43, 382, -171, -157, -73, -143, -193, 113, -195, -6, 145, -31, -435, -22, 133, 38, -145, 136, -163, 134, 43, -280, -114, -484, -189, -100, 38, 25, 46, 263, -29, -240, -126, -165, -227, 118, -10, -330, 86, -150, -84, -127, -120, -164, 172, 21, 139, -214, -30, 277, 24, 42, 209, -13, 54, -192, 228, 13, 64, 24, -52, 6, 259, 229, -125, 100, 123, 159, 119, 28, 34, 191, -113, -232, -230, -56, 66, -145, -98, 34, -172, 18, 261, -131, -146, 105, -41, 81, -72, 122, 185, -21, -103, 234, -123, -78, -27, -69, -142, 144, -68, 378, 29, 77, 176, 29, -213, -17, -90, -215, 109, 290, -39, -9, -5, -260, 255, 40, 66, 145, 107, 19, 81, -369, -43, 16, 6, -81, -235, -42, -123, 91, -28, 85, 75, 73, 233, -269, 164, 33, 80, -172, -83, -74, -200, 33, -61, 66, -82, 13, 38, 251, -203, 66, 89, 187, 117, -383, -1]
4753aM7k68J14J9J06n7r7j7r6L08p6J33j87K43l24L43j32o4j25P3k3K1O0L86n48
4778a62K36k63K59q5n4o6J77J07j66O8K13j64p7J85l15K61j83J85k21j03L7K35
4800A04n1p1j40k6K47K1j01K91m58J89K46l77L00j83k29j79L10J57K2l79M89j32
4822E0P6q0o2J61j46O6m9j21m8J84j34J4j00J95%K96l22j11J91K35l33Nk14K01
4846d6Q1j3K14l57J22k01J22qL99l15L07j89k20K87l16J14j69K86L52k25k79m9
4868a03O9LJ39M9P3n34L32j29J10j68J70l5j28M47m60J00o5K55N8k24J53k24l1
4891a43j39J61K92l13J60J97j86K06j56R3j34J63k99J22k0j47J27k0P4k27M35
4912B46l11J30j27M9K45k41RP1r7M4J12ll8j86Q7Q8p7j82K36K04l47R4O0J73l01
$$ y = [-1, 46, -222, -108, -89, 17, -40, -137, -154, -250, 58, -18, 115, -72, 171, -153, 190, 58, -6, -131, -58, -81, -60, 0, 386, -162, 74, -189, 70, -15, -69, -135, 42, 149, -17, 51, 264, 100, 23, 208, -107, 154, -29, 156, -65, -168, -131, 104, 53, -18, -158, -184, 63, 84, -17, 274, -184, 5, 251, -126, 174, -9, -238, -417, -107, 50, 72, -307, 182, 50, 126, 46, -16, 145, -1, 65, 16, -105, -153, 31, -103, -89, -189, 6, 6, 302, -20, -131, 60, 295, -38, -33, -247, -46, 35, 22, 236, -121, 1, -200, -78, -86, 313, -2, 305, 116, -104, 183, -133, -19, -188, 98, 450, 225, -54, -103, -34, -31, 108, 157, 230, -304, 28, -101, 9, -159, 11, -24, -152, 295, -165, -65, -130, 125, 183, -41, 112, -112, -143, -282, -121, 171, -142, 18, 215, 29, 235, 79, 172, 38, 201, -98, 24, 4, -143, -16, -36, 38, -189, 246, -65, 65, -62, -13, 232, -9, 0, 71, -26, 18, 130, 127, 89, -97, -10, 78, 1, -181, 55, 259, -88, 6, 66, 239, -62]
4937f2K3l6J51j09j70J64K4O7J16l05L54m15J57k58K37L4R1j90k8J91k25K08j2
4960GJ54jj12k20K19O0l27J43M1l2m7J31Op0L6o8k02J66n9K04j51N0J68J24k75
4985e5K07M8j87j15O1R2k22K36k8M1j61nj57M89k82j07J01J20j68K38k76M3J2
5008g5r9j4m5K20n3K4K44J18m56M6J18j29k0K0J39K64m52K46p2j07j9P7J40J89
5032C04j82J43k26P6j32j55J34J26k21M1m5L00j52j55L4Q1j14J9l9K32j27N1K52
5055B45m91M84j86N9o6j07RN2o4K07k95o6J85L15k69k01K83p9M3k88M85j56l37
5078b38J05J55J2j60J30J17o4m27M98lj1k40L38k3j85R0M2j92j36K82j39K07k73
5101a15J03j48M6M55l83K8J47p4J3l8L3K31l85K8j36M57k06k13J53K06r4j97O8
$$ y = [-62, -39, -75, 76, -33, -203, -39, -15, 52, 168, -137, 217, -198, -41, -299, -62, -28, 63, -127, -155, 36, -189, 19, 7, 161, 160, 48, -172, 47, 107, -220, -77, -36, -68, -115, 16, 22, -48, -12, -80, -282, -116, -175, 29, -122, -72, 96, 220, -55, 152, 200, 13, -102, -41, 51, -171, 65, 37, 78, -83, -88, -245, 244, -38, -145, -44, 76, -92, 146, -130, -87, -75, -174, -188, -233, -13, -66, -42, 202, 320, -136, -90, 28, -101, -121, -101, 38, 302, -150, 96, 24, -83, -102, -25, 115, 304, 122, 265, 39, 115, -17, -172, -38, 88, -133, -92, -137, 163, 11, -144, -110, -29, -143, -124, -163, 69, -58, -7, 245, -246, 238, 52, 111, 45, -62, -53, -1, -65, 142, -153, -219, -34, 281, 12, -189, 94, 15, 58, -230, 255, 99, -238, -133, 22, 34, -126, 4, 121, 57, -370, 128, 125, 114, -126, 212, 189, 4, 94, 136, -56, -192, 90, -49, 158, -115, -12, -160, -114, 341, -42, -14, 133, 59, 72, 34, 67, 298, -87, -59, -195, 262, 56, -157, -4, 202, 108, -89, -21]
5124b1k44R9L21l33O7Q0k71K87J11K7m53K57j52K26r5O5j86L26k55J72j65M7L2
5147e8o2J55j60J03r1J55k58J32j37L71O4o06L75j02Q7K14j23j23J23k16K38P5
5169A56j23j98J71K95k85k44k8K61j2q3N1q6J59k97m5M6R9K69J7j84Q6N6J60n41
5193c00L19k22K96l47L01K9Q0j86J82q7m8J26j85J00J21m42L91j18O5m2P2l8m7
5216B0J98R0l22jN5j80J09L9j60J05j32OM3P4K28j95Q8K00j32k93M11k89l5K01
5240A28j61J17l46L67k11R4n9r9j62L92j75K52m0n4j71NJ12l7M34n19J26K29j21
5263A01l00L63l13nK6K30k76j9L20k72J58P1q3Q0R4k57Q1M4K21j93M5j01q3q5
5287a53L07l21l0M54l10j65J28J1J10mm3j12J62n7j55J17j27J37k9J41J94j87
$$ y = [-21, -265, -166, 155, -178, -111, -31, -302, -15, 96, 123, -330, -73, -225, 1, -94, -29, -215, 111, -144, 28, -137, -90, -58, -120, 35, -125, -22, -113, 42, -216, -84, -221, 150, 214, -392, -17, -119, -32, 182, 59, -64, 59, -157, 81, 156, 33, -165, 6, 301, 16, -228, -256, 5, -7, -90, -39, -125, 34, -263, -308, -262, -163, 106, 123, -61, 25, 81, 241, -300, 19, -203, 93, -254, 47, 76, 156, -30, 152, 65, 17, 143, -42, 58, 179, -263, 128, 10, 75, 33, 105, 67, 20, 218, 308, -14, -15, 40, -140, -31, 8, -152, -47, -179, -173, -130, -56, 172, -23, 65, 265, 133, -160, 251, -38, -73, 128, -33, 84, -262, 105, -106, -12, -71, -170, -332, 60, -115, 137, 97, 43, -128, -123, -11, -48, 386, -133, -7, 222, 101, -199, 164, -149, -154, -128, 102, -174, -193, 127, -145, 13, 84, 1, 81, 175, -82, -1, 43, 264, 71, 116, 15, -68, -153, 154, -167, -197, 257, -53, -218, -90, -79, 31, 27, -16, -128, 34, -23, -178, -61, -188, -51, -80, 61, 255, 68]
5309F8J77k92mO8l17J59K7K37j24k11L70j01L40n16N3K19l76J75K53r9k97K54
5331F3l2mm3p0m3J46j71R7J03P8q8J28k3j7k81L26m2J01k44J03j26J81k23J60
5355G9j9o6J06k42N5L94l58j0o1l8M61k64j68J53M27l28p4n4p2o7K43J6k77L29
5379A65q3l27L82N7k57M5Q4j39L2j43k7J79O1k11J25J95k72%j85K38N6K32m28
5402b21m9K80N7k03J3k7K48L1j23O0L3K7k18l8K5kP2J3K25j14j45L92l27k75J16
5427a50kR6j0P2L0l18M49j11L6J46k44r4J1K15o8m6qJ91j20l1n4L18l27K9k47
5452b37K41K29k68k05J14k0J31J16l43K18j76L25k82J11K0k88L84o2o2j99L94
5473A41r5k4l31L75K7j52P8q8L05j70q4j37l0J24j34K32j77K78o4q6J99k98J35
$$ y = [68, 245, -47, -51, 17, -300, -141, -114, 123, -1, -212, 158, 57, 397, -119, -66, 153, -223, -48, 205, 106, -191, 63, 31, 27, -16, -86, -129, 17, -154, -57, 46, 124, 36, 164, 141, 124, -157, 169, 127, 228, -16, 87, -39, 142, -81, 79, 60, -6, 100, -142, -87, 307, -51, -61, -122, -160, 301, 37, -131, 22, 449, 121, 47, -7, -79, -146, 97, 113, -164, 165, 82, -245, 137, 194, -63, -18, 66, -73, -41, -184, -211, -32, 29, -182, -57, 138, -134, -134, -319, -81, -25, 207, -221, -270, 10, 67, -136, -123, -150, 98, 129, 6, 66, 99, 126, -92, -130, -105, -107, -35, -22, 203, 89, -56, 336, 9, -266, -150, -152, -56, -66, 6, 36, -282, 167, 56, 92, 238, -6, -100, -89, 126, 58, 12, 4, 195, 75, 44, -10, 308, -19, 10, -237, 4, 233, -35, -240, -126, -146, -15, 101, -242, -24, -200, 125, -157, -46, -26, -314, 70, 8, -54, -253, 141, 46, 22, -309, 66, 93, -59, 19, -69, 236, 66, -18, -155, -185, -61, -195, 37, -140, 138, 74, -12, 187, -111, 24]
5496B4J35m73M11o5k73K61N9j25K9j77Q6J14L8n4l6p2K02j76Q4Q4J41k56l94O08
5520A75k49n5J96q1K7m1r2LK18k87J77n0LJ01l6k59J71O6Q7k09M26j80k3J2j8
5545H2p3K61j83l36K94l4j32L34j04k22J5P8P9k43L24l17R4K8n9J8J90N6j76n6
5569h2K76k08r4j1J80J25k08J24p3j09k57J93K26j72Q6J37k05k21M42l50J26J88
5591A13k79K36j60J51m6K29j77J1M6L8p9j12J48q3J45m43P1k9J77r2J93j82j9
5614a43K22j84M01j54o3q8Lj63J10r2L26j75j02L26o0k51K54j89R0k44L22n6n9
5637C1N0r6P0k16L69j92j63m5R6L45m84L28k6j28k14L83j71L7R2N5K25j98NJ96
5661C49k15j8J03l34o3J11l1L58l12J62J7p2j72M7K04j05q9O7k41K42NL4J79k75
$$ y = [24, 159, -314, 97, 32, -241, 20, 79, -46, -17, -194, -108, 6, 44, -10, -46, -118, 84, -92, -8, 76, 217, -39, -433, 175, -74, -129, 67, -14, 13, -28, -120, -117, 101, -186, -9, -59, -56, 45, 9, -250, -79, -13, 74, -135, 291, 111, 88, 100, 82, 9, 270, 87, -249, 45, 11, -121, 213, 109, -113, -98, -20, 59, -184, 140, -177, -83, -55, -114, -96, 94, 150, -26, -82, 194, -14, -108, -119, 61, 186, -22, 102, 29, -80, -337, -144, 82, -90, -4, 133, -72, -293, 149, -201, -75, 113, -166, 70, -90, 61, 15, 244, 67, 78, 124, 162, 83, -29, 119, 36, 181, -262, -191, -220, -43, -135, 58, -124, -143, 79, -105, 296, 142, 79, -9, -6, -169, -59, -151, 175, 0, -102, 224, 164, -87, 167, -22, 68, -176, 146, 90, 31, 81, -15, 55, -161, 208, 16, -147, -192, -96, 249, -235, 93, 67, -61, -275, 108, -63, -26, 66, 121, 346, 148, 153, 349, 134, 116, 219, -115, -178, -67, -98, 260, -52, 110, 127, 55, -117, -70, 134, 29, -60, 7, -234, 8, 13, 47, 226, -49]
5685d9R6K9J49k78r9l4L50j81k4lM8j77Q0K12j21q7J5PJ50n1pok04J84j28J50
5711B1j32K19rj81J82m67M67j20l1K13j96j04k6J63o5m2j45J3K53j01nMK03k10
5735i6K04l58K18J39k31J68L1K27m76K89j46J7R3j34R1J46r9K9j49j53K38K44
5757B92k28k58l2L25j21K6M9J37J3k66j6M4L27l67J46j67K03k96PK60j84jP2N4
5781A9l2K14J17m97m2N4K77q7l9P8L2l8J13Nk38M05m96K34MO9k41p5k8L09n5K05
5807B67k24K8l57K00O1Po4J56o0j22J08k89N82l33J58q9K01l70L00k64J48R1p6
5830E9r8j83J99P8P5k95M4J92j2M5j78J86q6k12M23k69M4j08J59Nj39r0K98N3
5854A90l97Q9J58o9m8N5K7M4o4J71j96n9J02q9L2K01m41N29m0k30K16k36L9j08
$$ y = [-49, 47, 76, 225, -53, -152, -186, 164, -17, -41, -44, 4, -173, -93, 119, -2, -89, -74, -67, 83, 32, 25, 19, -185, -1, -129, 21, -111, 108, 99, -82, 100, -367, 100, -20, -51, 162, -34, -138, -164, -1, -66, -108, -253, -240, 13, -88, -93, -89, 114, -96, 108, -250, -32, 107, -124, 44, 75, 302, -174, 115, -31, -14, 79, -55, 36, 182, 83, 112, -37, -190, 48, 292, 64, -194, -226, 99, -22, 4, 53, 190, 203, -63, -79, -35, 292, -75, 71, -96, 107, -189, -182, 78, -106, -107, -35, 19, -13, 201, 318, -179, -221, -167, 110, 23, -16, 62, 94, 56, 169, 174, -64, 341, -155, 79, 83, 152, -89, -164, -192, 117, 62, 267, 43, 71, -286, -86, -25, -18, -82, 74, 14, -108, 0, -289, 293, -40, 118, 29, 230, -140, 160, -104, 44, 135, 59, -39, -222, -23, 55, 130, -165, -121, 71, 59, 104, -74, 112, 26, -186, 237, -32, 12, -96, 63, 68, -71, -161, 137, 190, -207, -118, 40, -29, -77, -22, 5, 49, -15, 156, -40, -99, 3, -86, -54, 147, -294, 235, 195, -35, 181, -55, -16, -124]
5878a24p5R7R0K27m87L45r7L6J5j50L6L28j34L25n28q3J74j22Q9K2kO6J0K26j05
5903A79j59n8L0l7l7K26j29J14j05R4k34P1O1j77J20J27j65J29J13N1l57Q8j41
5926a96J53J55j31l8l6J33j26j07K43jQ9k5Q0M4k52j4L5K5l8q5K82j30j39K13
5950A34l2j59K20q3J86k06j37K30l83%L05NKL9m9k55K70Q1l65M79k15k9P6k93
5974a79j27L81R6j49N5j0j98J76j67J63p7k45K17J59k20J24Q3M9J08k21j23K13
5996A08N9k47J40lj88J92J8j2k6R9k31J95j14J05JJ39j56j50L43k36LL7J5j18
6020b7J01k48K39j51K65q7j50J65Q2l54P2K87k4m20J02K60n5j42O5%J92l02J82
6043E2j5q4K5j7J71J3l43J02J5J19Q8k32J48O5k03lJ62L3o1J82j47J01l27K59
$$ y = [-124, -199, -102, -12, 215, -272, 73, -24, 12, 27, -123, -87, 241, 107, 432, -96, -179, -5, -127, -38, -16, -18, 48, 58, 284, 179, 20, -38, -8, -45, -82, 144, 15, 129, 24, 118, -116, -45, 16, -161, -41, 86, -79, 50, 163, 214, -143, -55, -196, -43, 112, -19, -57, -93, 40, -86, -193, 50, 49, 138, 113, 193, 237, -15, -29, 6, 31, -7, -92, 190, 60, -79, 134, 102, -57, 163, 80, 266, 60, -77, 153, -230, -230, 75, 80, 82, 121, 72, -183, 87, 168, -197, 282, 67, 38, 114, -179, -306, 75, 171, 22, 77, 67, -131, 45, -122, 41, -36, -281, -64, 95, -125, -1, 82, 131, 239, 18, -105, 108, 167, -80, 60, 57, -131, 61, 79, 67, 41, 140, -91, 104, -10, 95, 96, 235, 79, -71, 272, 36, 39, 76, 91, -27, 74, -174, 65, -86, 179, 92, -58, 107, 189, -165, -93, 194, 170, -250, -148, 112, 57, -85, -20, -20, 172, -130, 52, 37, -47, -22, -39, 132, 145, -198, -96, -81, 38, 126, -106, 42, 107, -96, -99, 63, 96, 35, 217, 70, 171, -156, 103]
6067A03M1m5j3j17j99K99q9k54K12J52k03j07L27j53j21J11K76j46M0m9J8l30
6089b47K68L5j96K22J30j06r0j4o5P2J49M9q5k71K41j22k62J34K12m2j41M9J28
6112D8k48K36K9k90M73l75K41j73L51k9rj57j93j83J22j49L44r6K01L5m39L21
6134F0j38J49p5L18l33k62K97j32p7j27L16J06k17P2j66J84M6P0P6j14o0J30l20
6157a97L59m1LL5j56L6l4Jk54L32m8J17k61K6R3Po4k7J27j28L8J10q5l20L35j69
6183a65R4J25k19R1R4r5j2J36l6k25K7K97R8j72j1j78q6N09l53j3J9J07o3K28
6207A97R9k55m16N58j41J03K0j6O0k24r9N1K82k12R5j0J2%J20k51j93p3J87K10
6231A04OP9k31J41j32q3M5J98j20j16J77l95K05K04j2j37j51J75O3j01K3m7J08
$$ y = [103, 144, 99, 86, -31, -230, 69, -20, -274, -62, 90, -113, -220, 107, -46, -167, -56, 220, 74, 114, 65, 83, -247, 21, 56, -140, 82, 212, 106, 16, 2, -63, 9, 158, 207, 122, -149, 92, -30, -292, -158, 54, 12, -129, -80, 48, -200, 36, 65, -225, 248, -127, 114, -59, 292, 263, 254, 97, -96, -279, -157, -306, 38, -58, 143, 178, -261, 60, -78, 71, -4, 314, -19, -281, 16, -116, -193, -320, -4, 102, -115, -43, -209, -25, 21, 91, 167, 53, -7, 123, -197, 162, 121, 124, 159, 3, 39, 5, 6, -248, 84, 36, 153, -108, -82, 11, 18, -46, -73, 54, -74, -36, 74, -11, -331, 4, -165, -71, 54, -165, -74, 20, -75, -87, 49, 13, -212, -185, 112, 210, 38, 27, -151, -237, 272, -81, -94, -75, 32, -31, 197, 296, 41, -375, 183, 42, 145, 165, 149, 209, -15, -114, -63, 219, 7, 102, 92, 104, 104, 224, -27, -220, -293, -106, 104, 110, 189, -42, 99, -33, -116, -71, 127, 7, -109, 68, -327, -122, 82, 70, -67, -218, -43, 20, -81, -58, -105, 3]
6254CJ15j96kj03L85k7k09J08L5j7o5l2J76l12J07k2K59q0j7j52L8J18O7j03L18
6279C92j76l85K43jr9l19N00m5on2r0qK57o0j2k45L02n9p9m0j1J64l01J98p9K2
6305A1l1m5K51j87M73n07K3j91J6J95j14j04K54j0O7nqJ4j83k63N93j79k1k75
6329b26K89J95l68j4Q9L39l85J70J29k01j19K92j1j46j67K01j40J99j77P5K00
6350B24k15j40K71m6l60n4M15o6l09L05n0j55O3Q6J19q3j75P3nn6L21O4l90K18
6374E5l4rK18l80R1K67m70J94P3j8J54p5j22p1J53K3q3K9L6q1m5R9K51n5j39Q4
6400A45j61j78p3L56Q9l15Q3k7J56n3J04k5j00K40l86J00J28l8J0L5k63L12L01
6423D40l09q9J45o9O4k22J40k90L03k66J13J84j77L78k87J27q1k51J83P9jk1o2
$$ y = [3, 118, -78, -80, -183, 202, 175, -34, 74, 109, 92, 27, -5, 171, -141, -34, -56, 203, 123, 106, -46, -8, 110, 177, 74, 392, 216, -169, 74, 73, -26, -345, 155, 110, 104, 52, -38, -46, 211, 151, 139, -106, 196, 137, 58, 18, 7, 171, -130, 68, -11, 11, -20, -65, 186, -1, 472, -35, -12, -203, -187, 8, -106, -210, 44, 34, 101, 96, 88, 102, -81, -344, 249, 70, 49, -226, 63, 258, -110, -124, -35, 304, -81, 89, 218, 17, -102, 190, 179, 33, -134, 67, -73, 126, -51, 24, 224, 9, -131, 140, 94, -266, -320, 95, 29, -280, 25, -25, -180, -117, -31, 88, 5, -170, -97, -102, -158, 163, 227, -163, 55, 21, 12, 230, -150, -59, 208, -262, -68, 5, -13, 141, 66, -56, -127, 26, 49, -34, -5, 31, -50, -95, 4, 255, 200, 61, 145, -16, -194, -267, 89, 178, -137, -54, -81, 75, 22, 126, 101, 1, 241, -145, -45, 83, 45, 55, 90, -173, 139, 440, 131, 42, 187, 118, 182, -40, 100, -190, 113, -153, -40, 144, -33, 345, 58, 185, 104, -147, 36, 115, 114, 93, 31]
6446C1j12P1j42J96Q7j82J07k51M57k11N3o1J47Q3j82p4Q3J05J19k94J36N7l13
6469i0K06j35K6J17j95K61l90QK77j20Q6K7k00J44K16l14rl7J55J26N1j90p9J96
6493A37k4O1o2J84k32J79j44j00l6J97K6l06J93k04J11p6o8o6J23J75j44O3J54
6516A41m6j50J15j97M7r9J32k4R1J7j07o6J3P4J8j00K45l5N6j62J30j64j69OL00
6541F6qR7k97J76j25K10o2j59J96j62O2k4j42K10k07L18j08l8J35m18L41Q0q4
6564E7j32j55J88j16L42j57k43k41K46O2n5l1R1k5M38k31j07m55Q72n82J56N3
6586b5J44J20j21q9j02J10j18j83M73k18p9j01L13j08J74Ok46L47k47N3Q0j77
6608Fj31k8J29K25j38LK04l57J68k31L09J9jk23J57k6j31J05j21J60L2K4k00k14
$$ y = [31, -81, -10, -152, 44, 131, -51, 56, -195, 262, 51, 104, 43, 190, 273, 91, 17, 100, 205, 324, 30, 166, 223, -90, 116, -19, 7, 124, -71, 190, -200, -192, 85, -35, 51, 78, -122, 22, 238, -76, -85, -122, 33, 159, 210, 20, -59, 137, 113, 174, 112, 296, 64, 243, 99, -1, -37, 160, 186, -120, 73, -131, -20, -96, -164, -230, -107, 68, -76, -13, 141, 95, -55, 60, -137, -90, -189, -57, -81, 10, 27, -80, -146, -133, -59, -41, -141, 104, 69, 125, -37, 93, -71, -240, -234, 66, 58, 155, -142, 34, -91, 119, 57, -102, 94, -68, -6, -30, -172, 38, -169, 149, 41, 3, 138, -280, 61, 141, 57, -75, -230, -42, -158, 184, 27, -216, -457, -211, -149, -204, -235, -144, -169, 269, 38, -69, -524, 348, -234, -78, -25, 119, 239, 118, 29, -73, 37, -81, -264, 209, -9, -88, -189, 124, 16, 190, 196, -50, 297, 50, 103, 183, 6, -125, -153, -24, 201, 63, 66, 270, -87, 81, -150, 159, 178, 177, -46, 111, 85, -46, 59, -62, 98, 130, 154, -46, -260]
6632b60L80r0k32J21j03J55J15j90q9K20j23K11R1o4r9j35q9K57R4j71l68K17
6654a52K32N3r7q8K08l12J47L48m17L06k40k83M10k09M5M5K1J5K80j00n1p5j21
6677c5J11l7j96L79k82K40k42J61j04K4J5j33K69k3k73L30l98J95k14Q6L57r3
6699A37j22k4k25J85K72j54n0K16k77K61k93J80j55k91N08l55j6L86k6j60%j78
6721a81L93l7n7l20j0N5J28l4J04RJ6p5k04O9L0r3M63l35K0J32j87N9N7K64k30
6746C6o5k4K3J86m8j86K23k80L16k30J20p3k04J58J45o3M3k13J37k5k7J57R2l69
6770a71R1K53k92K47P5j94jK25k08P8l51J20P6L92k30p0M16k65k78J0J95j59J15
6793G4o0q6J9j27J51J70o9J81j67Po7N7n7J14k84L00k73J23j10J90j77k29L12
$$ y = [-260, 120, 30, -202, -81, -184, -29, 86, -104, -193, 27, -96, 115, 206, 142, 43, -92, -181, 76, 170, -1, -369, -152, 80, 133, 36, -52, 156, -156, -9, 339, -78, 228, -12, -295, 115, -94, -49, -4, 17, 32, 312, 212, 161, 86, -35, 76, 39, -157, 222, -60, 180, -62, 99, -5, 19, 34, -99, 170, 147, -126, 204, -194, 1, -213, -127, 230, 137, 15, -9, -234, -49, 223, 69, 19, 235, -42, 219, -74, 106, -49, -340, 168, -187, -203, 183, 157, -3, -3, -181, 212, 175, 118, -202, -212, -157, -29, -63, 41, 50, 66, -9, -213, -144, -114, -207, 256, -79, -59, 73, -114, -55, 2, 266, 36, -29, -53, -30, 156, 108, -78, 145, -135, 181, -49, 71, -2, -206, -48, 97, 34, 77, -136, 1, -24, -51, 106, 198, -171, -80, 173, -119, 128, 203, 9, 8, 233, 25, 103, -248, -128, -52, 340, 110, 40, 456, 191, -87, -77, 118, -41, 74, 14, -72, -53, -180, -29, 141, 72, 253, 86, 93, 26, 83, 26, 140, -144, 156, -117, 6, -104, 86, -91, -320, -8]
6816hN6K98l78p9J40j71l4K27j9k35J02j38K54J05p38P89l19M8K15M0j03J62k07
6839GQ7l04K29j9k75K29K7k36J6J36M86n68K41r8M6j41K62j50J4l2K17k08L6J1
6863A3j54J44J05Pn6m4J9j08J3M2p8K55o8K5j50K52k47j27M16j48N4k74J47J61
6887A99l92L96j82R0j75j36L37k17K04j74j28J58k00q0R4N23j07n68N70j91j68
6908a47j30L18j68K24j03n3K82j61j48Jj11J43R7k27j0L98l47o0K79J45k55j0
6930d3K60j30l53L65j64J89k63j48M56j61j23M6O3m9Q7J27j92m8J81k11J97l5
6952E1j51j40M58k33k55O6L57j06P3j48J41j17j20J9P7K36l48o0L05j30R3l63
6974b95L88jk57R3J82k1J8k7j28K26l18k1M00m13M56k13Q0J38j50j67L3J64q4
$$ y = [-8, 48, 346, -32, -111, 29, -142, -176, 51, 32, -203, -101, -239, 15, 120, -618, 171, -148, -100, 115, 155, 52, 214, 7, 94, -210, 19, 0, -275, -46, -19, -255, -239, -103, 383, -185, 56, -42, 4, -137, 125, -25, -11, -43, 174, -34, 2, 13, -141, 3, 108, 115, 59, 15, 34, -74, -61, -19, -97, 158, 90, 115, -35, 217, -30, -157, 259, 111, 165, -109, 38, 199, -193, 203, 21, 111, -64, -200, 137, -80, 124, -50, -178, -20, -220, -300, -206, 317, 210, -358, 212, 21, -147, -277, 41, -127, 97, -6, -59, 223, 62, -86, -85, -196, -53, 44, -183, -193, 205, -142, -202, 77, 222, -33, -43, 217, 87, -266, 99, -65, 124, -139, -287, 169, 8, -115, -69, -6, -55, 32, 159, -33, -81, 100, -111, 86, 51, -100, -240, 218, -15, -270, -204, 153, 47, 120, -28, 113, -4, -124, -105, -28, 208, -140, -200, 105, -25, 68, -295, 93, 92, -165, -72, 110, 89, 107, 80, -48, 178, -140, -161, 239, -174, 282, 69, 149, 287, 137, -30, 3, 167, 83]
6997H3r7j14K59O9k23J19l5r4J79p4p2r2M00m80K96K23j85k33J94j31q6p6K97
7020A27j50j62M24r1j08j70j8K45l25Q6k6J0M8n5J54j95L69k8j46J90j83P2J41
7043B09j94p1l8r2L43J55n08K65k29J43J14n2L3Kk08o7O2k18L08M5J6J57N6j12
7067A19k81M37k86j20P2K70l34L0L06q0j82q1L88k44Q1k02L11k77mJ56j82J57
7089E4M0j78MJ47P7j74Q0k34K79p5j57j10O8K95l54K98l8j14J52K8R6j17J17k55
7113g1j62L09n8q0Q2J56k45r9M2J60k8Q5k9K7k57KJ43Q6k13N4N8NJ03K77l33K70
7139B84q2k69J19M16n36J33m5M3J73l23K32k58l7R4j07L10m1j59J95k36J84L48
7161D38m99J51j46J19J85l34K57k31j33J12R5Q9L6K09m51J01k78K24J58j73j1
$$ y = [83, -14, -128, 131, 200, -23, 96, 61, -33, 146, 72, 0, -92, 308, -172, 124, 347, 162, -71, 123, -8, -94, -170, 127, -23, -185, 239, 148, 40, -130, -148, 97, -228, -142, -168, -158, -110, -165, -11, -206, 163, 135, -11, 179, -4, 68, 209, 15, -56, -94, -186, 157, 312, -196, 69, -160, -17, 97, 45, 78, 80, -128, -195, -133, -351, -43, 2, 18, 175, 231, 119, -162, 275, -11, -131, -59, 211, -123, -93, 213, 133, -49, -130, 258, 14, 95, -107, 204, -73, -77, 79, -103, 54, 94, -84, -80, 67, 144, -30, 50, -184, 95, 20, -137, -247, -179, 116, -238, 60, 22, -92, 60, 88, 184, 67, 184, -71, -233, 76, 18, -62, 20, 176, -69, -168, -126, 34, 6, 91, 62, 89, -168, -166, -23, 63, -150, -96, -38, -33, 70, 347, 14, 284, 202, -67, 52, 468, -68, 65, 20, 63, 236, -87, 145, -113, -150, -56, -163, 147, 106, -53, 142, -94, 90, 438, -61, 90, -56, 63, 248, -86, 171, -60, -193, -81, 14, 103, 139, 348, -103, -2, -280, -56, 102, -71, -82]
7182h2J36j54J23l3J86k78J7K18m89K31r9N13k38K27q4j03mq5M9L9j52j18J2J87
7206A9M4j95R6o4L31j99M2j50O7J26m19L12j85m2j04M46j8k26k38K01K89j09j
7229B3q3q2K15J54k29lRK4j90J35lK06j81O5j87m1J54n5j11pK29j24L12m59J30
7254i9K28r5J15J9k97O9J39p5o2K34j18J59M7k49l8K8nj6K3R5j51N5n3J42n9n9
7280b3l4K5K92k65l05K43J58j24J07j46o3K02q6o0P6m0j0K08j30j97J63r0r3L40
7304A48k60J50PpL2J0J33k75P1L20j98j9L2j36j02J05K38l10K55r0k19J87r2J96
7328A76j97K45p3j24j94K13P0k63K65k51J7P6o1j3K39L7k29%K92p7k88j66L16
7351A0k87L72j59R4Q5k69K44o3r1j85J45K21k00P5J60k44R8o1K8J94k16Q6J2J75
$$ y = [-82, 54, -100, 23, -10, 176, -102, -85, 133, -356, -125, -224, 289, 51, 278, 194, 91, 87, 2, 51, 90, -62, -180, -168, 19, 63, -132, -36, -100, 231, 32, 74, -76, -9, 117, -302, 10, -175, -217, -321, 125, 107, -119, -357, -156, 133, 24, 23, -60, -142, 73, 227, -2, -5, 4, 28, -162, -27, -30, 176, -5, 60, -127, -168, -14, -69, -180, -187, 42, -82, 230, -229, -99, 129, 34, 149, 168, -129, -60, 79, 4, -58, 176, 58, 217, 264, 15, -23, 5, 0, -16, 7, 102, -49, 6, -47, 95, 36, -23, -57, -32, 260, -5, -310, -67, 91, -33, 74, -72, -135, 67, -19, -79, -3, -43, -53, 155, 25, -172, -9, -99, -192, 148, -112, 38, 45, 38, 70, 80, 213, -62, 9, 329, 131, 112, 144, 8, -94, 11, 249, -61, 194, 104, -115, 72, -20, 176, -21, 224, 151, 27, -167, 46, 116, -147, 118, -133, -116, -40, -101, -114, 125, 162, -67, -67, 225, 148, -140, -306, 10, -277, 95, -64, 30, 115, -154, 90, 27, -64, -249, -104, 117, -83, -8, 152, -92, 6, -55, -27, 167, -49, 37, 49, 224]
7375B24r1j95m0L8k8o8k9P4N3K8O1r4N0K42j90j38L21k47p0L70k70j53M9n8lJ68
7401Dj01j99J57O9L9J83k37L6L9j13P8j19J46j32K08R8m43K68k4l2J51k15J79
7424D0J77N0j51o7J12j27q7J25k17K47k2rj66qP3R0O2k06K74m09N18m7l76P7k08
7449b55K38K52k93R8P6n3j25K80k23O8k23J41J20j72j52pJ64K32j49j02K32M5
7471A92j57J04j98Q3J17l12j03N97m46oJ25j7jM8j00J54K06n36q1M41l0k6J14
7494A68l79K82K3m2n9L2J74j48j48kL8K95l89j5M5L88q8q0N2O7l09M7L47j28k11
7519d0np6O8pk8Q3r5J69J57j60k5J76k72j77L14L9o7k0J44Rk31M3J44o0r8l29
7545c44J87L07j88J10ok9o5m7k0j02K15mK14m95K00R9j29k7q3K73k11L8J7r1L98
$$ y = [224, 133, -62, -102, -64, -92, -160, -189, -115, -62, -34, 27, -67, -17, 225, 35, -103, 218, -29, -99, 271, 1, -152, -103, -161, -164, 4, -97, -296, -139, -70, -31, 152, -85, -49, -10, -123, -45, -164, -18, -150, 58, 156, -287, -19, -43, -75, 76, -139, 40, 217, 267, 116, 49, 161, 34, -53, 72, -145, 102, 80, 71, -95, -103, -30, 60, 122, -84, 190, -219, 299, 252, -124, -47, -255, -17, 235, -58, 40, 116, 63, -62, 218, -5, 63, -160, -19, 101, -71, -223, -230, -66, 166, 17, -85, 147, 192, 35, 139, -59, 24, 141, -171, -274, 323, -123, -129, -4, -21, -22, 26, -74, 80, 286, -250, -331, 110, 80, 54, 168, -211, 71, 94, 52, -7, 25, 199, 51, -97, -99, -61, 234, -155, -170, -125, 263, 175, 95, 147, 214, -95, -48, 299, 171, -40, -45, -121, -53, -60, -88, -5, -100, 69, 226, 66, 41, 217, -55, -232, 82, 121, 54, 34, 178, 187, -44, -1, 143, 83, -15, -344, -157, 150, -38, 72, 66, 37, -28, -75, -95, -197, 18, 14, 228, -267, -67, 32, -97, -124, -207, 66, -145, -107, -90, -181, 217]
7570B17l07r0K13L6j85j20J16K6K31j91O6q9K82J1j35j80K76r7O7k09j99K18l5
7593g8R3J16l40J5K82j65L31m24J71LO1nJ81k85Q1n8m4J42R1k9j63j62J94J00
7617A08j83K62k52Q4J28l66M78k85j97L40l72L51K33j60k83L48j23k97L72j43
7637D3j10j61K93j42J06j31J09q7L79l6n95N16m15K12K22j46kl0N0R4l2j60o2
7660h5K34k87M4j15K31J97j05R8l54L50l16J99O7K3j77o0M0O1J65j41j47o6L24
7683A80m49j56N08n8k18L03j17J34k60N5J03j05R2j67O7l6K60j15j7q9L6K3J48
7706A22Rj43N5Q1Q0k33k07K54j8l9L7N1J02p7nm7K29q4o4O4j23j18j6J46j58P9
7732b3q9J49l8Q2K7J23m19L82j27L6k21J81p5J2J45k99jJ18J38Q5k87k4J60k88
$$ y = [217, -90, -180, 33, 69, -116, -236, -120, -94, 137, -54, 12, -77, 205, 216, 81, -99, 177, 80, 147, -62, -261, -43, -78, 15, 131, -209, -194, 88, -77, 254, -170, 1, 4, 65, 60, 241, -44, 37, -21, -65, 77, 168, 139, -24, -186, 8, 108, -75, 187, -65, 19, 147, -219, 259, -26, -223, 117, -255, 96, 329, 169, -114, 234, 111, -186, 186, 43, -67, -228, 65, -77, 29, -102, 7, -80, 299, 263, -332, 184, -231, -19, 203, 57, 55, 25, 75, 169, 137, -23, -85, 149, -138, -94, -209, 22, 219, 114, 212, -142, 208, -108, 91, 158, 181, 4, -56, -16, 45, 210, 69, -78, -144, 180, -269, -425, 83, 25, -193, 110, -7, 127, -133, -78, 25, -80, 12, -155, -88, -124, 136, 21, 4, -85, -49, -26, 122, 131, -12, 43, 124, 204, -29, -236, 18, 0, -39, -2, 49, 151, 74, 69, 22, 251, 167, 103, 167, 44, -74, -90, 56, -102, -23, -112, 37, -1, 81, 108, 231, -188, 194, 67, 103, -118, 63, -12, 0, 145, -154, -155, -37, 101, 186, -101, -125, 35, -253]
7756b53L05j81L40k11K6Q3k92K18j03j61R0J65Q5K11l08k06J15l0p4K23k15j35
7778c08N17j91O9L7l2L7j65k52K14K39j70m9K30n0j28j0pM7Q7l33J29M0P2l1L2
7803B4j55M31n49L15Lk57J36M6J73j43r1J24P8k87o7K7K61N9j03m1J38j38k47
7826b63M02Qq5J7J6j00j84M61k66r2M70n28J26P2p8N7J34J38K9k57k19L54j15
7849I7LK45l95K53J2l14O6R9j64m9k0L32k56K25k51o2J41O0j4q5M4J91j30R7j57
7874c2k4J13m4J09k88J48P7p0M2o1LK5J7j75K22j1K63r53N86L27l02O2Q57l82
7898E09q16j66M96J24J40J54l57k05R6j11J30j3N4O8J11k88J46j28M8q7J26o9
7920c8o1L24j40m3L5J2m4K4k34J31RK30j92k06K7K29k11M92l65l1kJ17j37k4m9
$$ y = [-253, 52, -129, 211, 0, 26, 109, -183, 35, -68, -229, -139, 26, 111, 322, 14, -192, -77, -107, -181, 42, -173, -308, 209, 18, 87, 124, 92, 129, -36, -288, -74, 165, -5, -54, 176, 126, -2, -12, -19, 28, 115, -218, -89, -49, 23, -8, 24, -131, 300, -249, 66, 69, -188, -52, -6, 167, 24, -67, 57, 135, -152, -219, -192, 69, 128, 25, -16, 122, -16, -263, 139, 147, 62, 79, 95, -5, -189, 272, 6, -86, 384, -144, -18, 54, -24, 33, 167, 305, 334, 77, -142, 212, 97, 100, 345, -50, 203, 215, -99, -33, 66, -98, -147, -167, 165, -91, 134, -117, -179, -38, 22, 8, -77, -33, 158, 28, 125, -32, -56, 57, 13, 122, -166, -18, 59, -11, 31, -30, -27, -2, 15, -160, 62, 51, 314, -639, -53, 274, -28, 34, 891, 509, -307, -473, 23, 147, 287, 441, 84, -121, -25, -136, -6, -19, 35, 103, 214, -74, 72, -56, -8, -95, 31, -38, -99, 225, 85, 42, 77, 89, 45, 69, -165, -34, -25, 205, 13, -193, -166, 63, -148, 344, -21, -52, -54, 63, -74, -98, -147]
7945a47J43l4l0l4J58j08K71k85J83j38J41k21J32J65q7k27K73r2j83L8J00p6
7967e8J60Nk00L02j94L2l92M08j50J82J17j53lj51K57m04M45j91k44K46J30P6
7989B20m68M39j85n8J64k78r4L40J55k60j88L45k37K21o3o3l2m7J75J20l39Q2
8011e1R0j19L5rO4j67k8K56J00k70J22l02M52k39K7M4p7o1OJ92k1j30K63J35l28
8036a6K28l56L38j12p3q1j84M23k50Q6r7J28q9Q0K50k93j99J08m8J73q0j1K99
8059B24k19K64Q3k51O7k94J56K15m05J66J05j49r3K13k20K56j62J97j71N6n7J85
8081A66J05j78j05j23N6j15J13j34J53j13M03l53L48k62m0k1J69K1m1J14j83K51
8103B31j29k52P1K30L2m23L4n3R1J52K26l77J10k4J46O5j11k73M85l20M7J86J32
$$ y = [-147, -4, -38, -68, -102, 56, -52, 219, -66, 117, -21, 120, -101, 31, 196, 109, -118, 155, 63, -120, -82, 18, -58, 102, 107, -93, 209, 15, 47, -345, 63, -87, 95, 212, 59, 56, -95, 162, -242, 203, 12, -232, 14, 144, 220, -248, 191, 6, -52, 112, -166, -260, 80, 235, -25, -213, 132, -105, 116, 53, -10, -42, -89, 86, 206, -133, -51, 39, -80, -45, -54, 10, -157, -185, 71, 171, -99, 23, -279, 173, -66, -39, 5, -72, -133, -127, 65, 44, -86, 177, 312, -16, 212, -144, 194, 82, 9, -72, -256, 167, -83, 3, -94, 34, -55, 25, 275, -18, -217, -109, -157, 16, -64, -75, 224, 5, 269, 352, 101, 168, -126, 30, 245, -160, 6, 111, -38, -131, 82, -138, 118, -44, 153, -18, 38, -19, 166, 271, 93, -12, -135, -79, -194, -81, -215, -62, -175, 228, -125, 223, -39, -79, -100, 69, 90, 49, 163, -20, 231, 102, -150, -79, 151, 183, -240, -206, -259, -168, -16, 210, -167, -57, -81, 65, 130, 19, -254, 231, -89, -42, 144, 276]
8126B76k30J80j54m28R8J31L37j92j68O3n8J86J32r6J81k08o3j4J71k23R1Q9k8
8149G3k11L03M0o5k85l03K40M8l2L46l1j55K89l50q4L39l10J39jl1J13O0%Nq0
8174E7l19l7N80n58K43k86L47J82l9j61j78J75j59J24L29m55J40
$$ y = [276, 46, 226, 72, -356, -258, -127, 210, 18, -150, -87, -145, 41, 173, 77, 258, 50, -13, -27, 144, -79, 12, 101, 73, -138, 165, 205, 140, -145, -448, -208, -160, -192, 154, 123, -32, 257, -93, -177, 162, -148, -9, -10, -41, 72, 132, 132, 137, 57, -262, -299, 281, -277, -34, -320, 27, 209, 170, 9, -169, 6, -153, -29, 300, -155, -15]
8191a5
$$ Imaginary data points
##PAGE= N=2
##DATA TABLE= (X++(I..I)), XYDATA
0@%%%%%%%%%%%%%%%%%%%%%%%%%%JpJ2j4J6j6J6j6J7j9K4k8L0l3L8m3M7n3N9o3
46c2P0p8Q6r6J04j13J26j41J55j71J89k10K35k63K98l41L92m59N49o75Q69j218
68g24K038q611q73Q535N66k171q1L756j423j911K463K608k462j536K731J376k439
85A842L30K505m57k903K070J794j727j910K182J072k251q50K441p95k623M15K320
102C455j515k602J448J331k761p68J945M5k660k66K180j059k372R80J748j981
118b852j510K106Q34k370l59K414m16k086Q05K316j505j451K240J164j707n58
134b935K526J72k007R63K629j046j615K003J400j431m87K291J85j731N06K107
150C530o29k127J633J431j312j371J815R23k057k60K211o01k451Q82J240j010
$$ y = [0, 0, 0, 0, 0, 0, 0, 0, 0, 0, 0, 0, 0, 0, 0, 0, 0, 0, 0, 0, 0, 0, 0, 0, 0, 0, 0, 1, -6, 6, -8, 8, -8, 8, -8, 9, -10, 14, -14, 16, -17, 21, -22, 25, -28, 31, -32, 38, -40, 46, -50, 54, -59, 67, -74, 81, -90, 99, -111, 124, -139, 159, -182, 210, -249, 300, -375, 494, -724, 1314, -7297, -8170, 365, 931, -1240, -1321, 2435, 1012, -899, 1564, 4172, 1710, 174, 2905, 4281, 1842, 2172, 4677, 4220, 1317, 3387, 5181, 3454, 1544, 3726, 4798, 2547, 1697, 4138, 3343, 720, 1135, 3455, 1940, -662, 786, 2117, -644, -1412, 533, 578, -2082, -2348, -168, -1227, -3599, -2619, -871, -2852, -4362, -2256, -1422, -3792, -4151, -1737, -2153, -4239, -3434, -1118, -2623, -4074, -1834, -670, -2377, -2935, -409, -237, -2244, -1281, 1348, 302, -1313, 690, 2090, 659, 172, 2463, 2648, 917, 1423, 3530, 2901, 774, 2407, 3838, 2526, 1155, 2970, 3893, 1836, 1576, 3787, 3186, 735, 1617, 2857, 1847]
166A847k028J406R22j877o99J420qk233J47J560r04k131J154J092j675j327J713
183a621N33k243J91J779p13j804J173J733j311j389J721J161j615q8J595N14j769
200b153N50K145j144q66J495R64j124n21J923O27j642L03K142n74j193P29J481
217C142j352o77J533N31j729k02K124p84j718M48J609j336j218J223O54j710n64
234b6J544j66j882J67J302j169j386J043N25j438q97J412L44j775l1J396m31j729
252c197R95J245j179j177J856K56j336K8J423L9j387J261J149q36r47J708R48
269H49j291l91J734K44j395N10J497n41p45Q95J083r43o22J562J12j000j97J362
287B723n07j160R05R86j380r18J329L32j575j10J049m63j645O15J172j330j221
$$ y = [1847, -181, 1225, 2147, 270, -429, 991, 983, -1250, -1103, 457, -447, -2578, -1424, -332, -2007, -3334, -1621, -1088, -3331, -3140, -1361, -2074, -3878, -2705, -972, -2283, -3672, -1951, -790, -2405, -2493, -898, -384, -2153, -1603, 542, -602, -1468, 27, 991, -133, -654, 1269, 1896, 254, 557, 2699, 2125, 932, 1661, 3142, 1790, 1113, 2646, 3177, 1448, 1246, 3370, 2586, 868, 1316, 2925, 1589, 371, 1594, 2248, 538, -26, 1518, 1352, -530, -363, 939, -230, -1616, -573, -48, -1486, -2383, -971, -627, -2402, -2433, -1037, -1468, -3197, -2202, -957, -2136, -3313, -1457, -1201, -2537, -2509, -1086, -1047, -2434, -1173, -24, -860, -1807, -99, 849, -442, -833, 901, 1145, -250, 260, 1757, 1216, 471, 1366, 2449, 1506, 884, 2446, 2558, 1558, 1361, 2723, 2216, 1056, 1961, 2947, 1567, 649, 1978, 2310, 735, 625, 1674, 1211, -434, 181, 1353, 23, -1198]
304a198P95P11j466l64J073j82j273K77Q65o97j325J014J003j343o10J300L94
321a026j462K18J254k02j236O62J389p41p14J533P07j443k35J628L64j128J88
338b44J695q35o63J458O63r56q75J725N17j587M90J118p29q01O56J113j164p99
356G82J212J31j473k11J364l38j572L10J160p87j238P22N59j343k63Q37K17j818
374a749L96J204r35j215Q80Q38j090p51J028O27j504J09J238n17p52P79O79m76
392a211o86J191N48j085K2J510l16p64L47J451n16r94J534N26r17l66J617j55
410A736j034M56Q66n31p09P20Q58q97m69Q22J02r52k99J150n18r91L79Q11q63
429F37r52R06K23j107l60R17j57r41m03J187m77j299Q12M21r20l28R13q6q31l4
$$ y = [-1198, -403, 308, -1158, -1522, -449, -631, -1904, -1627, -762, -1459, -2784, -1770, -767, -2110, -2720, -1420, -1026, -2488, -2270, -1016, -1218, -2454, -1792, -403, -1144, -1858, -325, 382, -1061, -1296, 332, 696, -432, -244, 1451, 616, -47, 1411, 2074, 1118, 243, 1968, 2485, 898, 1388, 2506, 1777, 976, 1632, 2745, 1581, 782, 1994, 2125, 652, 441, 1805, 1467, -105, 205, 1365, 578, -660, 62, 621, -722, -985, -148, 69, -1749, -1353, -149, -1084, -2299, -1419, -581, -1671, -2422, -1394, -767, -2271, -2162, -924, -1441, -2193, -1414, -735, -1211, -1897, -706, -158, -1243, -1221, 289, -27, -791, -444, 1007, 491, -503, 1031, 1557, 640, 274, 1891, 1736, 702, 1158, 2024, 1493, 784, 1504, 2362, 1465, 996, 1818, 1920, 968, 669, 1819, 1301, 310, 689, 1500, 637, -315, 591, 814, -293, -653, 264, 107, -834, -1237, -50, -527, -1826, -1014, -593, -1513, -1841, -928, -1014, -1845, -1879]
449a879J086m88r16Q06Q04p71n41J360L52j072lJ244k25q47O12J018n87m52J008
468E09O20q64j03J178k06q95P63Q64l38j097J125R09j024o69P53M14j187K04R96
487A952n27j098O91Q21r99r55Q72M55j250j76P91m0j413K39P13k45j364Q72N18
506a43j138p81J244J17j000N7J160l21j313O32N23p32k09R07O82j264J40J320
524a19l29r56O86Q48k13n52L38P69n14j74J149J22q51L86P95l43p43Q96L29n98
544I26j68P30K08r20R4Q78k86j050P25P26q78p23N47M17j011j57P91k29j384N07
564b57O91m68q66N70N24j003m63Q46j50j079L65N30m39p98P69L55n65k06O31N56
584d57r52j3J010l67o44N68Q66n49l70O81N40o15k78J041n3q44O61R21k69n53
$$ y = [-1879, -793, -1281, -2197, -1391, -587, -1358, -1899, -539, -187, -1259, -1262, -18, -243, -1090, -478, 540, -47, -499, 509, 1129, 265, 162, 1340, 1134, 239, 1002, 1866, 1528, 431, 1556, 2465, 1441, 772, 1525, 1939, 752, 956, 1952, 1425, 327, 1018, 1839, 840, -115, 757, 1212, -38, -214, 577, 537, -876, -637, 76, -169, -1533, -661, -143, -1281, -2062, -818, -701, -1701, -1644, -484, -805, -2118, -1486, -963, -1695, -1904, -997, -315, -1579, -1439, -119, -448, -1404, -718, 130, -83, -635, -297, 472, -42, -216, 933, 1055, 204, 590, 1385, 1042, 299, 1195, 1524, 926, 758, 1488, 1696, 776, 870, 1748, 1462, 412, 1137, 1863, 985, 262, 809, 1226, 215, 58, 849, 620, -764, -257, 434, -34, -900, -330, 194, -809, -1272, -426, -576, -1655, -1290, -760, -1199, -1997, -1228, -873, -1438, -1644, -1013, -457, -1409, -1422, -412, -779, -1423, -855, 11, -538, -908, -227, 313, -302, -580, 461, 408, -436, 225, 1146, 877, 324]
604C24P33M97q07K9O87J06j214M92Q63j87j100R60L18q54l35N93J80j267M42P64
624A224n19r52N49L02p50m89K30P48j192j65P68o8j029J82Q93p06m96L44N00o05
644a231m80J120j77p21l24J379l31l70K76P94p40l80J044L89q33k02J410l46n53
663b76L40O87k47l48N61P13q11j14P05j5p37J84R01l30m48J13P00r47oN18J11
684A254o81l42Q72n20n41M94M66o32o18O21Q1q10j80O84l62p13L5R88r17p19P42
705g98L54q59J5Q34k18q87J47Q56k63p80P35N49o60k04O86J09n84O94M79k73k48
726c16L35M91n11j69R31q2l20j66Q39k71l93J53P11j95n68Q20R0n92j50N75J47
747A359q97O9Q34o80m47L31L11o95l60N46K59o87l70M78K28j177O23K67m92k50
$$ y = [324, 1057, 1554, 747, 776, 1463, 1569, 355, 847, 1710, 1523, 423, 1383, 1701, 847, 512, 1105, 1285, 18, 460, 1224, 705, -247, 302, 604, -146, -635, -405, 343, -849, -1014, -246, -314, -1343, -1161, -268, -974, -1470, -1126, -626, -1231, -1711, -591, -768, -1489, -1813, -434, -765, -1135, -859, -65, -805, -1185, -141, 248, -585, -787, 623, 277, -276, 64, 751, 504, 156, 717, 1430, 619, 505, 1210, 1195, 458, 642, 1543, 1213, 765, 878, 1578, 631, 625, 1143, 1254, 573, 231, 1103, 583, 42, 536, 1002, 370, -248, 373, 454, -356, -536, 148, -214, -927, -892, 96, -821, -1540, -798, -444, -1303, -1288, -454, -672, -1559, -1412, -556, -819, -1599, -864, -315, -975, -1179, -493, -384, -968, -274, 205, -68, -316, 19, 510, -1, -170, 761, 679, 359, 193, 1032, 761, 368, 521, 1232, 1037, 469, 1289, 1379, 787, 637, 1212, 1359, 462, 531, 1365, 685, 238, 569, 880, 185, -175, 371, 630, -57, -427, 51, 279, -898, -275, -8, -500, -750]
767g50L31l6n03n1J69K29n95J52M80l40n83N11O09m75m38R13M7o10L90M30j29
788b49n42M38O08n95l6M87L66l15J5Q72k53p36L84Q08n24n07N95O15o95k68P44
809A212o9m76NK70K8p62P20qn67p9J60L37o38l63P57j75q35M8N99o21l26M82K08
832i3o37l30M30nm16o9P57m77p33R55Q3l70l04P45%o48K00M26J23o73O33M41j73
855a35q9M06J86l57j27P47j87o03N72O34n53j34L24K89k98j18M04M3n50K39K08
876I01k25n26N62M43q85k7L58j70k48m2M22m21n81J63N21m48m54N41Ro83q4P08
898a66j75p79M26L04m59n0N01p5n00j36P69J14q28J33N42N1l71K48P02p40k50
919g39P00L12m71J17L55J46m29L55M23k20k65L94q8p2m07J005J64q32M44J29k17
$$ y = [-750, -419, -455, -958, -1009, -840, -611, -1206, -1054, -574, -914, -1497, -986, -377, -852, -1290, -377, -330, -940, -550, -120, -249, -791, -353, 255, -340, -376, 111, 477, 162, 177, 1049, 796, 60, 444, 1252, 728, 221, 816, 1431, 736, 468, 1212, 1143, 667, 672, 942, 970, 208, 928, 920, 353, 274, 434, 771, 133, -230, 527, 352, -483, -435, 164, -457, -783, -301, -93, -730, -1060, -630, -635, -1051, -1120, -363, -840, -1573, -618, -535, -905, -1209, -464, -464, -1112, -912, -486, -363, -1036, -403, 38, -135, -224, 182, 368, 11, -116, 631, 444, -159, 413, 1047, 494, 360, 684, 973, 675, 557, 961, 1004, 454, 693, 901, 676, 150, 712, 1155, 270, 243, 601, 431, 183, 141, 563, 142, -439, -276, 245, -203, -657, -116, -107, -790, -874, -166, -341, -1120, -694, -390, -849, -899, -398, -473, -973, -1109, -340, -226, -1054, -921, -379, -328, -699, -451, 251, -489, -739, -39, 273, -198, -81, 274, 420, -9, 346, 769, 549, 284, 678, 590, 518, 111, 1116, 1280, 448, 892, 1021, 804]
940H04o42M87M08o62P9L71l3q04M21M13k69m20J24J47m09j54LK97n33j05L26n2
962b03o44J10L55k00k93K76K92o15l69Q29Q1n71J22M29r4n29M78O7L4j5J78L26
984D4o40L81O64m36r9J49O21n76k39Q21J84p60r8P39K60p35K81K65l5n79N14M07
1006A133o52j34M84j57l53M1J56Q6o30Q2L85o86J75R7r0k85RK16J40p00M08J84
1028i1k22o91O54J29m57m15O75M7o69L10O13o60m87P33J57k33P7J08L25m59J84
1049c72L48m6m16M41M33o98K19M59J68j83l99Q35l06j57R6M26k16j79M67l8l07
1070E75o9K24r3m19K27J22j85j48L10K57o13n3P8J18n42RM12j57k99Q4J50l72
1092c84l43O48k02m99J37N63l81l05J27J97l41o0J33L78k83k66N56K70o86J38
$$ y = [804, 162, 649, 1057, 395, 474, 845, 812, 8, 429, 842, 573, 153, 277, 424, 15, -139, -136, 161, -372, -477, -151, -203, -847, -737, -382, -582, -875, -599, -307, -922, -1291, -462, -381, -952, -830, -401, -495, -1024, -546, -479, -445, -460, -282, 44, -596, -215, 449, 13, -86, 63, 684, 108, -131, 690, 874, 114, 16, 755, 1015, 280, 561, 826, 791, 212, 726, 1133, 481, 347, 831, 674, 321, 362, 518, 604, -26, 56, 441, -245, -70, 27, -63, -348, -339, -123, 17, -683, -275, -91, -313, -1004, -350, -221, -678, -1093, -418, -371, -1040, -730, -117, -777, -1264, -531, -374, -607, -530, -422, -97, -556, -372, -24, -70, -486, -45, 388, -310, -91, 368, 536, 353, -46, 789, 483, 326, 422, 848, 632, 453, 920, 882, 575, 506, 730, 637, 218, 445, 567, 382, 234, 544, 801, 188, 135, 213, 331, -211, -202, 210, 53, -246, -162, -12, -384, -727, -79, -281, -780, -643, -80, -461, -766, -639, -442, -783, -843, -710, -332, -615, -881, -325, -55, -741, -603]
1112f03N13o3l24K38L84k99k89M64L33m67K59J28Q2l72N20m1o6k79N90K20n78
1133C50o6N99m3n55K45K27k14n24P46m4l23pJ07k32k72J41j16K01n69L57J50k29
1155g1l84K78J28m20l39N90j62l30J15M15m24j51N7L75l06j58O25l69k50K61M21
1176i9l38k53L99M14m03m7K23J39l95L97N42m48l50L17N69n01K8K01K98j45j53
1197C95M95j03n05K80J89k09m42O75r9o35J06K88J66o28K55J94l68k12N46r7o70
1218c79J20K03lm94J91M19j24o51NL81k53j32M59o6n70M12J0K1l43J4P44o53j7
1241g06M95K69n56K61M03p3m74J92K26N9j11O6N47n95PK88L23m75J37L88l40o6
1263B65K20J07J75l32K06l38J04k38N05j07o17O12N0q6m35M8N13p92j39M93n6
$$ y = [-603, -90, -153, -477, -239, 145, -154, -443, 21, 354, -113, 146, 274, 356, -16, 504, 463, 397, 118, 708, 928, 350, 284, 883, 840, 285, 530, 757, 543, 19, 765, 721, 398, 391, 498, 266, -6, 135, 19, 220, -349, 8, 158, -71, -455, -177, -49, -469, -808, -218, -380, -710, -595, -180, -604, -755, -698, -323, -629, -787, -162, -531, -781, -520, -99, -437, -690, -291, 123, -280, -327, -104, 35, -360, 37, 579, 131, -219, 98, 667, 166, 194, 395, 693, 548, 395, 890, 787, 282, 562, 751, 542, 100, 775, 676, 41, 147, 435, 601, -27, 228, 422, 54, -158, 388, 291, -379, -259, -56, -59, -553, -362, 57, -67, -718, -713, -332, -585, -717, -258, -324, -894, -482, -472, -451, -794, -780, -36, -689, -706, -211, 58, -498, -237, 166, 93, -381, -189, 37, 96, -15, 51, 598, 3, 10, 298, 621, 146, 283, 671, 331, 265, 485, 592, 767, 435, 641, 303, 407, 169, 674, 567, -50, 562, 612, 526, 91, 139, 652, -140, -279, 214, 158]
1284A58n82L88J58j09o08K74J87n66J24R9Q0l85Q7J95L9j37j36N17l41j11L70
1305b99J99k67M8L77k91k40K07L88j22l65K80K42J2l76P30J09m55r8M37j14n82
1326a80Q91R8p48K63K79q5l5k08O11l51k39lK38n40J46M29k20l55j50M82j73l15
1348a65l3M81l38k36O5M15m79l42M47j55j77k12M09J39m49J13L67m20k00M81M6
1369b43m26p8N91l5j93L06R9l31R2L35l8j35L0N08r6m01m6O21k6m74J90K55j00
1392D05k51N25J65n98L2R0q8L2J93k3j8k41K03J51l92j96M86l07l95L78K20k00
1414A71l95K69k7l86L4L93j8l62N4J12k62k50P6M12n10K81o2J78Q2k13K64o9k91
1437e19J91L70j83n06N60Kj84K93j9J36p4j4K52j73k72L12K56j62k7R8k01O6j3
$$ y = [158, -424, -36, 122, 13, -595, -321, -134, -700, -576, -477, -397, -782, -695, -500, -461, -598, -734, -217, -558, -669, -299, -100, -367, -319, 58, -233, -473, -266, 122, 0, -365, -85, 157, 169, -207, 523, 632, 177, 79, 516, 402, -180, 711, 809, 61, 324, 603, 518, 483, 275, 886, 535, 296, 293, 531, -9, 137, 566, 346, -9, -159, 323, 150, -165, -198, 283, -55, -291, -226, 189, -290, -632, -185, -340, -517, -729, -320, -181, -630, -517, -150, -570, -770, -289, -243, -669, -747, -156, -191, -384, -78, 21, -310, -218, 117, 79, -56, -26, 482, 386, -15, -61, 560, 534, 60, 250, 505, 405, 154, 679, 844, 246, 278, 368, 280, 312, 505, 482, 464, 223, 426, 577, 185, -11, 475, 168, -227, 151, 371, 171, -224, 45, 18, -368, -334, 59, 41, -321, -267, -155, -417, -667, -591, -179, -689, -408, -470, -292, -210, -423, -159, -228, -519, -328, 42, -141, -647, -87, -85, -269, 24, 5, 141, 67, 53, 305, 132, -140, 172, 428, 266, 239, 337, 136, 202, 189]
1460A89L95k66p6M31j73l29K02K72m5o53K03M01j95k54N4K42p1o62M21J37n92
1481c69jL55k06l93K17K90k23m08M16K51n24p6K96n3kl9K83l98J77r2M53k79l3
1504c58K92j0m89J47L74k18j18L23L03k79j32L29J69j38k5K21K26n91M93Q2m60
1525A41J56Q6K59l19N5K5J63j99J40k3p8l22L5M09m44j98L50J95m51j93K35n3
1547c1l90J3K59n3j66R6K13n21R5M32q8k37k57L51j37j04rM90l51j05K19O8k76
1570d89M1N15J0m57K87J61j04m57O37J75k41J02K26l8m00J93M11n13j61L66L12
1591E76k4k22K76J33n64N4K83j63J2J58k04k27J1O97n24l92N3K85j19k76J8N49
1613C90o00NJ42m7j91j53K17J55m54QL90m13L6K38K79l53k43K45L54l01m1K35
$$ y = [189, 584, 318, 242, 673, 500, 171, 373, 645, 600, -53, 150, 551, 356, 102, 156, 398, 327, -335, 86, 223, -369, -370, -15, -221, -614, -397, -107, -330, -738, -322, -71, -595, -671, -375, -428, -430, -469, -186, -584, -407, -499, -46, -325, -358, -66, -76, -565, -418, -44, -262, -380, -57, 246, -33, -165, 164, 333, 195, 170, 391, 617, 26, 519, 601, 141, 297, 383, 642, 323, 378, 403, 566, 367, 507, 484, 406, 84, 119, 528, 84, -114, 236, 431, -20, -213, 22, -31, -421, -408, -149, -202, -368, -272, -59, -580, -485, -53, -141, -378, -635, -284, -421, -525, -534, -44, -395, -500, -281, -213, -489, -448, 67, 77, -380, -93, 68, -36, -493, 144, 319, 78, 180, 406, 368, -32, 161, 572, 59, -102, 264, 576, 552, 330, 606, 739, 175, 229, 512, 349, 361, 519, 315, 88, 99, 796, 272, -120, -67, 218, 99, -177, -159, 390, -210, -205, -63, -110, -301, -454, -237, -82, -536, -528, -138, -551, -515, -277, 2, -351, -594, -349, 5, -296, -337, -102]
1635a02j74k81J29M12k51Q0L05j2k15K07K43L2l13M9K23k14o7L38K14m15J71K5
1657C84Q6l51J14M98k60r7L3J58j59k37j15N21p36K71M88o37l24K51M46m54j05
1678b25N8R7j15k98M15k46j39l4M53l14m07L67K3j2l44L66Q7k40N2K57j80N7J12
1701b10K85n38J85M34j75p4M7L53j20M5j17j42Q8q7L67k00K03k18J99K8O3Q5o4
1724D37j84k44K73J64k78j92K68J02m57K61M41l84j37J1J29l13PJ38j18m7j23
1745b46K6O6j8j01K41k74j38J45K14n75K48K11r5j42K09jj48L6K73j71j38J85
1767a93K13L5j88n2M74l6n26L19L51l24j6K14N9l45j16P08m16j69L05K21j73m22
1789g7N49M2k41K5J6k0n6J07q3j53k30K81K19m18P5K16N1o26J46M89l85r9j89
$$ y = [-102, -276, -557, -428, -16, -267, -187, 118, 106, -109, 98, 341, 373, 60, 109, 332, 118, 51, 389, 603, 188, 359, 384, 470, 119, 233, 731, 471, 374, 407, 565, 406, 169, 54, 575, -161, 110, 598, -39, -363, -112, 334, -120, -225, -167, -70, -185, -483, -68, -314, -453, -487, -34, -348, -755, -388, -365, -377, -721, -355, -268, -508, -456, -199, -379, -322, -210, 75, -463, -278, 156, -19, -93, -46, 307, 187, 232, 115, -27, 61, -26, 341, 141, 344, 126, 325, 353, 416, 501, 437, 253, 9, 282, 446, 168, -24, 244, 346, -111, 150, 591, 207, 70, 81, 210, -103, -96, 42, -76, -123, -246, -220, -154, -172, -273, -32, -306, -444, -299, -85, -660, -412, -201, -296, -438, -229, -230, -378, -342, -69, -240, -378, -193, 20, 55, -133, -185, 289, 253, -273, 46, 397, 73, 57, 271, 330, -15, -131, 577, 161, -8, 297, 518, 345, -77, 472, 514, 273, 298, 314, 294, 238, 345, 262, 109, -121, 160, 379, -39, 36, 252, 303, -323, -177, 312, -73, -172, -361]
1812c61L18j82j48K72K0j51j01K76j05j34l6L4J28k90N9J88l11K16K03J64n74
1833e15K15J32N1k43L84oJ23l14K05K73k97J01L0K59o30M05L96j42l18O01j91
1854E19m20J00m6J55k58J61J56j16k28L58j49j09oJ60l23j1l0N6R7m06L25Q4M7
1877A16n59L53p6p3k43N36N3m02j45K95k07J03k18J62QN5K55j31l33K77K40l85
1899c19j02L59J55m66M57J94J3l51r8J32Nr5L28K69l55l98O13k3Ln2J14p0k88
1922B5J88J58J0l0k3K49o05K55Q6p7l31L16Q9k81l61K99p7J8l62L15n4j61J45
1945b09O4Nk93M11p4k34j25L47j04j97J3K18K2l61N46j80j48M2J93L52n14OL42
1968A22j16Q3pJ03o7l50L35J53j23l8J21J75l68L11R2Q9l99J60k00K08k22L0K70
$$ y = [-361, -43, -225, -373, -101, -81, -232, -333, -57, -162, -296, -332, -298, -170, -460, -401, -213, -524, -308, -105, 59, -515, -300, -168, -117, -360, 24, 18, 141, -173, 32, 305, 8, 109, 139, 398, -232, 173, 569, 427, 109, 710, 519, 99, 199, 153, 308, 50, 211, 367, 251, 23, 381, 232, 123, 117, 277, -46, -57, -87, -31, 66, -340, -15, 69, 116, -443, -90, -166, -239, -482, 54, 107, -295, -440, -145, -352, -249, -467, -305, -297, -242, 13, -118, -451, -174, 66, -319, -421, -62, 93, -373, 84, 278, 291, -60, -158, -26, -21, -116, 212, 481, 126, -272, 341, 318, 321, 269, 383, 313, 25, 213, 371, 381, 351, 328, 577, -28, 227, 313, 236, -95, 221, 310, 29, -332, -33, -110, -92, -454, -139, -193, -354, -209, -145, -140, -433, -22, -96, -330, -455, -108, -212, -409, -396, -178, -156, -517, 29, -151, -299, -257, -64, 288, -226, -220, 122, 6, 89, 82, 185, 118, -232, 103, 256, 133, 95, 216, 391, 23, 334, 426, 515, 116, 276, 76, 284, 62, 92, 362]
1991C62m07M44Ol82K34l2P5l20K6M8P8j15k28N17l50l87L75j23J09l86K01K59
2013Dm14P9j66O40n39RK0mk33L94K24j95M0k35O2J53r1M50k65k34K38L0mk48L66
2038H1K74k57k81M04J09l09L04J08m36q7K49L71m36n2L46k01R7N8k0p3n54P88
2060D83k77l68J64J61j50M6k30L79k54j84L13j69J09k87L24n1k47P4K7r2j30j75
2082e34N82j64l23J9L54m32L00Q8L6j03o0L03k03K5K10j68K9k61K60N9j49M0K73
2105A81m4o0l4L79j74m89M29L78l34j83K64n3j81l3K54m7m63N99oj45j14KL47
2128D73j96m57L92Qm03K88l1p5l78K71K43l72n9J59M29n39j67J04R4k21J56N7
2150b24N6q6J1J23j82O4K35k50J99J8K86k86l70N94k61k82L98QRj38K68J26k39
$$ y = [362, -45, 399, 405, 23, 257, 225, 300, -20, 6, 54, 132, 17, -211, 306, -44, -431, -56, -179, -70, -456, -255, 4, -410, -331, -497, 143, -396, -387, -367, -371, -604, -210, 14, -181, -141, -376, -314, -161, -252, 198, -67, -301, -63, -33, -37, -285, 81, 355, 98, -183, 221, 330, 21, 325, 433, -3, -90, 159, 530, 94, 42, 388, 187, 284, 342, 322, 249, -305, 483, 206, -162, 2, 163, 13, 59, -171, 208, -46, -230, 83, -86, 23, -264, 60, 9, -238, -164, -137, -229, -359, -534, 48, -116, -439, -420, -66, -498, -198, -110, -74, -177, -237, 66, -137, -112, 98, -70, -41, -302, -42, 17, -132, -92, 181, 137, 77, 43, 422, 248, -241, 188, 566, 232, 49, 313, 260, 79, 46, 300, 253, -210, 389, 383, 238, 124, 126, 473, 277, -180, 212, 220, -183, 105, 74, -1, -379, -108, 135, -237, -296, -137, 292, -247, -414, -310, -216, -437, -281, -224, -168, -254, -243, -120, -302, -238, -3, -253, -54, -36, 250, -36, -406, 188, -73, -355, 43, 51, 60, -78, 190, 316, 77]
2173G7n0L36N3k12q6K79N0m40K52n7k14L7J23j2rQ5J7n7M7k06J40R7k38K63j01
2198A74k31q2j14L06j18k43K82j40j78J01L70j94j18k67K99j17J67oo5P6k39L92
2220E5l02K9J32r8J28j53Q5K29l18J54j5J93r1J8L01l91J17q8K02j09K3K93l35
2243E9k37K05K40k42J03j0L42r1l44K89Oj15m3J33l68J31qJ19j21j47L19l65j44
2266b89J69J3Jl65L03K81j36l57K45k21o7L16r8J35j85J59J35m9k12k1k1K9K2
2289b13L15k60k23L44j33q6J31J63J22J5m25M71j9q4P8j91Q0K5K14J04k30k70
2311g2j11M46m75K93J57j30mk5K61j94j44l8L84k02j64N7n2j01Q6k5J15k81m1
2334b60N78l25l60J96J6J5o6J35L14m48J67q0nl6P5P3m8l23K30o7K6R4K0K03k42
$$ y = [77, 27, 363, 416, 204, 118, 397, 447, 7, 259, 202, -12, 25, 148, 136, 127, 212, 229, 172, 219, 13, 153, 250, 12, 275, 174, -57, -139, -253, 53, -65, -308, -26, -166, -344, -243, 127, -67, -185, -452, -153, -270, -103, -109, -174, -98, -337, 55, -247, -218, -86, -184, -56, -209, -124, 105, -213, -59, -74, 119, 28, 46, 347, -44, 73, -15, 187, 78, 101, 394, 59, -178, 27, 267, 25, 128, 118, 460, 369, 25, 314, 320, 205, 162, 295, -73, 58, 50, 169, 48, -99, 220, -145, -289, -120, -107, -106, -471, -168, 113, -23, -380, -135, -356, -423, -107, -205, -70, -255, -96, 39, -10, -222, -243, -264, -235, -213, 102, -158, -381, -37, -170, -256, -125, 38, 160, 175, -250, 221, 202, 118, 196, 5, 85, 110, 324, 428, 198, -72, -183, 263, -212, 81, 238, 108, 104, 79, 340, 146, 2, -36, 348, 146, -18, 39, -13, -114, -28, -53, 62, -219, -260, 318, -7, -367, -171, -155, -140, -206, -71, 243, -205, -38, -118, -123, -159, -84, -11, -59, -382, -152, -219, -193, -99, -79, 124, -118]
2359a18J60j81L7L5J85m6o3J57k70O37m28q6K69p3n7j1k62J19K13j33M0P5K19
2382D18k89K23k65J28j66Q9o9j00lL54l12o0j02K51l71L02r6j54K16J78l44j92
2404c64K52k86J23j64N00k45j37K73j4j21k02K05J68p3J2J3K51l14P7K2O6m6O8
2427F4L4l93L17P3j2j88P5l6K5J16J03J49m14O7R7l1J74r9J11L1k70K63k33k1
2451Bm5J05J56p9j95L67k89kj69L78l30k25M58J13l24k05N75n09J91k91M17l15
2473b16o5L01k54o6kJ34j0j09J92K66j16j70J90j30j2J8L72n01J50j83L48J44
2495B81l92n5K24P2nN8q2k4k5K41M1l41J01K38k30n6N6mn8j24J07J92r7j92M53
2520C79l83k9K50p9k93L0J93j13K40n35N94k04Kl5J86k93k06J74J06l02J3J01
$$ y = [-118, 42, -139, -102, -67, 118, 72, 9, 166, -104, 533, 105, 19, 288, 215, 158, 147, -115, 4, 217, 84, 124, 199, 418, 129, 352, 87, 215, 49, 138, 69, -31, -34, 320, 8, -52, -154, 97, -274, 28, -68, -222, -6, 172, -172, -364, -112, -398, -275, -439, 61, -184, -321, -48, -62, -183, -385, -180, -12, -85, -73, -60, 191, -123, -46, -24, 42, -4, 64, 98, -295, 22, 95, 83, -105, -30, -66, -41, 75, 178, 327, -87, -20, 77, 46, 220, 121, 232, 263, -7, 256, 23, 2, -43, 62, 218, 139, -56, 311, 22, 20, -149, 229, -101, -326, 132, 245, -79, -284, 291, -218, -27, -318, 99, -216, -281, 20, -234, -300, -302, -168, -178, -287, -95, 171, 55, -115, 75, -55, -67, -49, 323, -178, -28, -211, 137, 281, -111, -166, 58, 130, 125, 183, 101, 77, 52, 293, 334, -7, 94, 332, 102, 46, 102, 98, 40, -84, 23, 215, 118, -74, 379, -4, -33, 217, 138, -155, -125, 68, -45, 195, -340, 254, 50, 52, 17, 203, -90, -296, -122, -16, -318, -305, -204]
2542b04Q3j04N7J86Jk22K03r1J1n5o6L13k95q9M04j75O7P0M6n1j89R0K03l07L88
2567B74k03K94m72J60J94k18j08M82l05p2K78j68J23P1k16Rk20q5L56j43Qo7l7
2590f5J43K7l1n3j10q3M1j08K96k52Q3J16j89J97j57o6K7J03k11J93P9N9j11o2
2614a34P8k76K16J07J23L5K4n68M20O6j04pp8K95l40K02K19O0l09K79ok48J38
2637A92o6M2M4J65j71Kl4K03k79N7k22N8L13j70j25K5J56l52L09q2K0o6p6J45
2661H8k55k12M35j37l3N5K54l78k5J93j44N5q5J7J8L18j87l0o3m8L41P9m46J42
2685d8j4J01j82k1O1J91m7J2L26l29j09J96L22l01j26L39j2m93M9M01j24o9J02
2708B25k40K20J89r4j98Ll50M68j11l17K90l0M8oo8R0n85L79q9K34l27L77k25
$$ y = [-204, -121, -225, -168, 18, 19, -203, 0, -91, -80, -135, -201, 112, -183, -272, 132, -43, 24, 94, 140, 89, -100, -10, 193, -114, 274, 71, 365, -107, 53, 247, 29, -79, 403, 98, 26, 304, 136, 259, 330, 114, 123, -97, -182, 174, 31, 39, -28, -65, 78, 105, 74, 21, -89, -172, -131, -239, 57, -195, -112, 4, -185, 12, -145, -211, -184, -81, -292, -99, -20, 39, -72, -134, -56, -332, -116, -9, 114, 149, 173, -395, 25, 91, -13, -20, -98, 197, -143, 59, 278, 338, 29, 308, 302, 54, 192, 126, 168, 212, 377, 206, 208, 174, 377, 98, 155, -67, -9, 304, 134, 9, 34, 190, -162, 147, 65, 85, 19, -57, 88, -167, -379, 56, -81, -114, -59, 195, -183, -208, -15, -159, -104, -189, -172, -154, 164, -23, -53, -116, -164, 177, 256, -190, -48, -62, 39, -143, -164, -103, 88, 41, 53, 379, 50, -59, 137, 459, 158, 32, 371, 359, -134, -85, 316, 192, 123, 225, -15, 205, 394, 300, 102, 105, -245, 223, 112, -205, 85, 55, 103, 97, 29, 119, -466, -87, -176, 58, -269, 108, -117]
2731a17K12j22Oj02l5j55J52J16M9J9Q4j43l85L70J9L36m20J62j04l6K32k4j63
2754d9M4J17M6l43L13k8o0p4l1J26K27j05q2J41J78n27P7K07j32j66L32k47K46
2777B10k31J13J21l97J97J60j82J0K26q5j66J59j74n4J59k57K27l0J52j06l2j51
2799a31m3k0P7J37pj16O4l3l08N08l34M7K16j47j6r9K28j40Q8K24k45r1l4L84
2823B09J4j52j96J19L58j95p2j55J74M3J33j88k25K99N0rj36N2q5R0M0N3l3J09
2847B97m06K41J74m39L43m48N13l32K69k34o0R1l71L67p9k67K89L5o4qn1J99k42
2870a83Q1J64k29P7j87J33J60n6K61m48J11k94N32n8m6m2K53m10j42J86K76m82
2892c43L03L53j41k19K80qm29M35P9r7q2k40r1K08J89o4r5j19J14O9K42l14O4
$$ y = [-117, 95, -27, -21, -123, -158, -313, -161, -45, 4, 23, 107, -36, -421, -51, -32, 304, -116, 46, -58, -94, 138, 114, -49, -5, 112, 158, -185, 128, 100, 40, -34, -65, 61, 288, 183, 101, 242, 420, -107, -30, 177, 45, -121, 211, -36, 210, -21, 92, 213, -184, 13, 173, -9, 1, 227, 142, -24, 135, -39, -93, 66, -191, 36, 6, 158, 52, 20, -131, -174, -194, -117, 20, 13, -103, -39, -72, -380, 128, -206, -159, 57, -90, -106, -205, 23, -117, -29, 195, -50, -141, -175, 209, 223, 71, -125, -6, 352, 157, 85, -70, 104, 147, 280, 92, -133, 166, 216, 207, 71, 123, 38, 128, 168, 221, 188, 297, -109, 132, 306, -133, 210, -238, 275, -57, 212, -22, -82, 9, -362, 5, -74, -341, -52, -17, -81, -89, -140, 59, -183, -102, 62, -167, -90, -277, -144, 16, -40, 221, -227, -116, -410, 122, 64, 18, -24, 229, -181, -323, -137, 139, -343, -40, 313, 172, -47, 233, 225, -204, 231, 310, 213, 131, -109, -200, 8, 197, 133, 38, -81, 33, 102, 344, 30, 94]
2915I4J04q7jm47K01K82k49m4j04r5N28l35L49l63j79K30j8J13k34K71k31LR3
2938a19p4J99k00J12j34m7J12j16O3P4O6L7K54m29L14rk27l7L67N0M5N5l34J70
2962A92j86K36k85K61l2M4j07j42J68L3r0l11N35q9o6j43L2o4J60k48K97l50M8
2985a07N3L7p5k69M34q6j26j96J75R3k55oJ33j41j2j6L46j82r7L41p0j89M6J07
3009f2k2j16L23l77J95R3MJ02k20L49m76K97n79O28k35N35l03J6r4Q3n0J48l31
3032i2J73J62r1Q2k58K79m1m51J35J22n4k7J27P4K2k91N23l34l60L16o4K37k70
3055h1R4R0N0l15j80M73l95K43k00K44J18k24j19J73k87K04J89j34q1J26J19j91
3077h4Q9J0q8J28r2p2J4J24k5N6q2j42J36R1o5K11J35l28lR5j74J20P1M0J71%
$$ y = [94, 198, 111, 110, -337, -136, 146, -103, -147, -251, -346, 182, -153, 196, -167, -346, -116, -134, -21, -255, 16, -215, -212, -119, -193, 6, -194, -82, -216, -263, -151, -267, -204, -130, -64, -27, 227, -202, 112, 103, -124, -161, 206, 256, 301, 356, 22, 192, 6, 242, -43, 218, 186, 230, 123, -19, 149, 182, 92, -219, 316, 227, 161, 18, 50, -14, 146, -102, 195, -155, -107, -54, -17, -92, -361, 73, -13, -139, -335, -160, -67, -322, -328, -195, -336, -348, -364, -18, -200, -297, 44, -26, -215, -169, -62, -84, -200, 123, -254, -59, 34, 38, 140, -80, 269, -207, 90, -489, 139, -96, 439, 136, 152, 58, 141, 91, 239, -92, 81, 243, 152, 234, -24, 255, 214, -237, -102, 20, -34, -61, 66, 140, 162, -129, 394, 60, -300, 16, -48, 189, -81, 13, 103, 153, -162, -342, 131, -264, -21, -221, 23, 141, -83, -202, -29, -316, -112, 77, -57, -138, -12, 107, -84, 5, 15, -73, 55, -37, -109, -95, 29, 4, 60, -22, -164, -28, 63, -2, 209, 344, 16, 13, 108, -66, 54, 125, 165, 336, 336]
3103C36m44L71N6m66K43j50J18j62R6j25L69k41p2M14n29l7K46l4m1m5K20n9j74
3126a10Q9j30j59N45j87j37q3J70R8L5k52J0J1Mn7J66k92Q2L02l8j35O1Mn1J12
3151E8P2q9O9J7M9K7M7m9j05rJ15j31R3J58k78P7J2k28L33r7j19O2J66j7k15l37
3177c19M44J00l18k45J49L03j43j77L12l91J97j62J86J35Pl84J77k72K95Q8K3
3198Eq4J5N1K22m3l30j26K36J4J57p3j47j45K16L53j96j66O4J19k27K73K01l52
3221C7j17R7K52j92j70J27l7Pj22M31m62K38k2j53K7L4J26j48K60m10J46J55l57
3244b53J33K97M7k11Q5l6j01n6J04J17j43J55J46m31L5J71o3m3N4M7j43q9l6J32
3268h2j46L16p0R7p3j7Pk16L7l7J21K78m04j6J84P6k0P6m3k98R0L11J60n10K73
$$ y = [336, -108, 263, 319, -147, 96, -54, 64, -98, -2, -127, 242, 1, -71, 343, -186, -223, 23, -11, -52, -97, 123, 64, -110, -21, -151, -310, 235, 48, -89, -172, -2, 96, 131, -121, -111, -100, -96, -153, 13, -279, -197, 105, 67, -68, -7, -3, -54, 58, 130, 41, 110, 127, 176, 203, 250, 201, 96, 87, 202, 71, 164, 322, 44, 121, 133, -95, 238, 141, 22, 84, 250, 233, 18, -319, 125, 225, -93, -338, -189, 114, -29, -206, 106, -285, -88, -250, -64, 71, 78, -306, -129, -401, -106, -18, 5, -79, -64, -13, 209, 166, -164, -290, -54, -40, 117, 44, -103, -248, -32, 321, 125, -41, 23, 142, -85, 188, 389, 37, -80, 17, 269, 77, -93, 34, -3, 4, -118, 313, -149, 89, 67, -86, -59, -25, 101, -47, 213, -197, -51, 104, -253, -120, 177, 224, 13, 98, 62, -39, -95, 9, 126, -17, 138, 284, -147, -112, 59, -4, -47, 7, 54, -89, -178, -214, -82, -228, 88, 18, 115, 42, 25, 32, -184, -147, -184, -63, 215, -189, -205, -21, 55, 35, 111, 68, -230, -140, 171, 331, -179, 94]
3293I4J54R5j7j54j56o3J89J10r9K3k46J98N9j52j60L66l00L90l15o6j66K07n5
3316f4P3P5j2J5M4m55J73L44k49m7j41L91l43J39L96m30j42O8Q5j2j58J20J49
3339A9Jj17J82m8J85j6j15o4n1m8J23Pj86J94K5j35j38L60k46J65q1R5p9k9J57
3364A60n6J56n02N48m32Q3mL5K15j33k7J05j12Nj88K85k20p4J46P5j30Q9J51m71
3388b96J29nJ02R2j9j4j40P8j42J47O4o9J4K24l32K38j54jO4K5K43j63j1J09O0
3413B43k39K25Q7k40o8J58p4P2l54K45j43M27m82J51Q3p3j59Q1L71K5j98O4k28
3436b6Q4J13q6M3k41J68N5l89L5J38J83r3j64j3J99j57P7j5j07K3J46j67J55l09
3460c48M2K51j45O5J8R0r6Q5J02k15l5j0J98o5J68k13L06j85L54n48j0M51l40
$$ y = [94, 248, 343, 326, 172, 16, -47, 142, 252, 153, 176, -70, 128, 187, 35, -125, 241, -59, 331, 16, -50, -216, -9, -64, 9, 84, 72, 87, 131, -324, -151, 193, -56, -103, -244, 147, -196, -57, 339, -91, -233, -165, -80, -92, -250, -130, 19, 20, -97, 85, 37, 222, 206, 91, 27, -24, -72, 51, 58, -128, 66, 91, -44, -182, 178, -68, 97, 16, 111, 32, 3, 160, 104, 260, -242, 306, -126, -43, -47, -12, 203, 70, 43, 148, 36, 41, -147, 138, -82, -156, -10, 65, -65, 24, 175, -296, -167, -172, -70, 22, 3, -11, -151, -73, -215, -68, -4, -73, -59, 165, -167, 71, -83, -84, -20, 5, 248, 85, 74, 183, 243, 4, 229, 316, 76, 8, 166, 92, 164, -190, 55, -88, 339, -143, 8, 91, 18, -141, -60, 311, 336, 138, 202, -26, 58, 171, 85, 128, -113, 55, 110, -279, -244, -106, 77, -16, -180, -193, 6, -151, -74, -89, -196, -173, -27, -194, -39, -348, -306, -55, -200, -135, -117, -27, -123, -38, 64, -151, -186, -196, 2, -63, 105, -108, 198, 13, 367, -181, -191, 260, -80]
3483h0J01p1J82ll78L54k24L08r2j29J93k57K3M3K04j85J7P6k7J6K50l21l1K8
3507cOp4K5n9J21m2J08l23M7k1R0J48K21k06r3j92J77K11m33J27N0J20J33l02
3531a64K56o9j76J6K75J3k96K83n51N39O5k19r4K13q5O2m48M49j84J00K58j74
3553F9m3K8K0O2k12n4J11J65q1R8j02K06k29J62j73J1qQ0r2o6k77L85K21l02j43
3578a64N4J10L5k1MRj13J25j89Q8L5O7j88M68m51K71j37m8M2k70J49m7M14l32
3602h9j4K64r4l3j33Qm7J28K46K2K8k91J6K05j58j26J92m8P7j09p7J35J77o1J84
3627D02l99j6J51j79K47l87J10J47J98j73k0j0j40j25J70J57p1j75M2p0M0m3K48
3650A04j21j14R8mL9lQk8P7j82L08l78K64j70L29k22o1m0M9J8k20L78p8R3l07
$$ y = [-80, 21, -50, 132, 129, -249, 105, -119, 189, 97, -32, 161, -96, -73, -30, 174, -11, 6, 82, 55, 71, 321, 0, -31, -3, 3, -71, -46, -105, 16, -26, 82, -241, -194, -215, -125, 23, 244, 38, -55, -247, -70, 141, -292, -165, -115, 5, 138, -164, 92, 23, -153, -137, 138, 151, -145, 138, -413, 126, 191, -28, -122, 91, 6, 68, -380, 69, -115, -15, 243, 69, 26, 54, 74, 136, -76, -130, -19, 146, 65, 163, 61, 267, 38, 200, 27, 38, 30, 110, 18, -48, -325, 60, 281, -21, -164, -110, 0, 35, 14, 18, 27, -86, 39, -150, -62, -27, 40, -148, 320, -131, 140, 3, -45, -3, -273, -124, -171, 243, -89, -103, 161, 67, 34, -99, -91, -138, -10, 236, 258, 286, -5, 11, 216, 58, -68, 124, 76, 153, 44, -33, 102, 279, 218, 402, 3, -13, 138, -41, 206, -181, -71, 76, 274, 101, 81, 71, -69, -194, -24, 133, 62, -113, -71, -141, -101, -144, 104, -17, -131, -33, -37, 2, -1, 7, -21, 56, -126, 182, -196, 68, -102, 227, 5, -56, -96, -47, -29, -249, 129, 51, 144, -163]
3675a63P8L71k17L8J27l00K98j87k2j91J28K32P0l05J85k05J55k0k07J79m6N6
3697E4l5R1p07O08J27j22Oo8L57l82J93M7j81k06K32k7Mk16K35j8l43J90r2K24
3721b9j35Q0J4k21K22r8J69k77L52j97Q8k6j12J51J12qk20R1Q3J66j29k24K94
3744A46m08L36o7L23j62J54l55O0J6k19N7M02j10k92R2J93j99O9j45R1J6k1Kj12
3768a33R2j75K73J7k41J23j95N1K83j81rq1O8j13K40k22L09r9j98L21j80qK47
3791A89m32L32J49m05K65j56J42k07J47j87J91J20j35q7k8L96m01J78j1K1L3m4
3813G0J55j44J48P8l00n0Q5Q0L6k9j62k74L23N1q8k15J06K33l0r0l54N11j94j88
3837b42L6J79rj29j24L68q4k04M68ml52o4K29l1Lq6J82l27J23q7J54r2O4j10M1
$$ y = [-163, -85, 286, 69, 107, 234, -66, 232, 45, 23, -168, -40, 192, 262, -43, 142, -63, 92, 72, -135, 44, -2, 54, 19, 110, -597, 11, 138, 16, 22, -46, 311, -71, 122, 169, -12, -218, 14, -13, -9, -225, 10, -8, -351, -161, -253, -29, -164, -84, -70, -291, -69, -167, 2, -275, 77, -120, -32, -58, -170, -19, 93, 85, -135, -44, 39, 205, 76, -148, 146, -262, 74, 7, 330, 168, 322, -33, 27, 43, -176, -119, 283, 173, -119, -27, 166, -33, 36, -109, -18, -2, -23, -21, -133, -41, -216, 57, 74, -167, -44, -239, -188, 95, -86, -95, -176, -108, -221, 19, -203, 106, 7, -191, 130, -50, -58, 189, -243, 89, 238, -167, 98, -58, 84, -123, 24, -163, 28, 148, 13, -74, -102, 294, -107, 71, 60, 81, 114, 70, 225, 81, 229, 307, 7, -43, 42, 122, 158, 129, -33, -307, 16, 67, -21, -236, -130, 103, 73, -17, -371, 140, -54, -242, -206, -27, -36, -165, -289, 79, -5, -209, 259, 255, -97, -161, 68, 37, 40, -46, 136, -191, -68, -155, -1, -93, -29, -139, -98]
3862i8K26M6k00l15J68L10j86n5ML73m3k82J53K84l07K64j47m2p4r7K1P9k1K78
3886C39m20O2j3R7n9j00q0M5K47l27J64J28r7Q9j3N8k90J00K68k39K1n3l4N1j31
3911a87j8N3J00l3r5K00j68J85k6J22j68K4j6J14k11J89L2kk57K46j76k19K76
3934c5r1K60j83p0L08m68N49j62n1l79M78j2j56j3N3L7J42k99L51k52J04K03j56
3957A58k04m0K83m65M08N0l09K13Q5n22J22L67k58P2J13J8k3m31J82k15M80O4
3979A48l88L7K8L01j96p9P7o1M3K86l84J81O3QN8n4N2k04Q1K0N1j72O8J81j46
4004aN7j99r8M09J24k78O9Q3o1j30N8M7j83L6K18J02m43L98j21k04J92R6k04j22
4028a55J07J28r6j07J01j08M2j10j3l9m8J97l4J68j11n7M2J8j79M24n56N35j74
$$ y = [-98, 128, 174, -26, -341, -173, 137, -49, -104, -100, 273, 230, -52, 101, 385, 78, 342, 195, 153, 79, -18, 3, 82, 61, 339, -81, -19, -32, 65, 6, -94, -174, -129, 118, -209, -45, 83, -14, 75, 62, 120, -170, -70, 198, -41, -20, -73, -107, -56, -187, -205, -152, -52, -85, -180, 20, -148, 37, 11, 133, -35, -11, -27, 87, -124, 65, 97, 95, -162, 84, -92, -311, -35, -126, 134, -49, -119, 189, -279, 270, 108, 57, -322, 156, 144, -12, -25, 28, 65, 207, -92, 259, 7, 111, 314, 158, -46, -86, 197, -268, 140, 190, -119, 94, 179, -343, -221, 146, -112, -40, 73, 91, 68, -363, -181, -396, 84, 148, -240, -203, -175, 126, -70, -149, -72, -133, -90, 196, -188, -7, 56, 64, 122, 68, 120, -84, -3, 17, 68, -104, -36, 145, -1, 56, -143, -241, 168, 292, 14, 83, 166, 105, -25, 33, 80, -103, -67, 151, 253, -190, 208, 87, -117, 75, 171, -33, -155, -48, 80, -16, -123, -22, -130, -88, -198, -211, -250, -298, -101, -135, 33, -78, -135, -93, -75, -254, 170, -386, 149, -25]
4051b5p6N3J21p7J8nM3j15J61p1j08jK04J11K1k84K04r0oj38o8p4K32%J27k15
4077e8m1L35l89L51m06R8J8k6K52l16K84k13J31o4PK0R8J4j86j24J32M9Mn7P4
4102a3J26j1k28J66j17j76L54J9k09K38J90j36k48J86K0l84j7J53m0k1L0J91P8
4125A51j70o9r8J60J38j91J29K2j42J38J59j91K6j55K53k06J07K5m1k66J67Q3
4147B9j18K3K62k12k6L0J98k37O6l6l77N81j83L5K75k14n7m5K1r3o5M17j39m41
4171c06L17l9j06Pj9J64j22J34J04k08j16L99m3l36M8K0J28p3k1N4K11l37J80
4194D0j3k23L35l81L88j26J97L9p1k08K04Q8k52j7J8K10m04N7K8K09k02R0P9R8
4218A83k25J25q2j95J91K24l06k11L59j78j13K72K59m26J25Q4r1k09L6K00j42
$$ y = [-25, -101, -48, 73, -4, 14, 9, 52, -63, 98, 27, -81, -82, 122, 233, 254, -30, 174, 84, 78, -60, -128, -202, 30, 30, 157, -58, -99, 236, -153, 198, -208, -110, -92, -118, 134, -182, 102, -111, 20, -44, -37, -17, 81, 95, -91, -215, -83, -34, -30, -87, -13, 113, 102, -126, 40, -77, -253, 101, 120, -89, 149, 339, 203, -45, 141, 161, -223, -240, -87, -127, -148, -118, 73, 151, -19, -88, -186, -26, 112, -79, 50, 72, -70, 68, 227, 36, 62, -93, 160, -46, 61, 86, 45, -221, -54, 29, -89, -66, 196, -16, -42, -12, 186, -51, 15, -21, -398, 183, 0, 35, 310, 96, 39, -6, 15, -78, -143, 274, 135, -306, 11, -28, -134, -127, -146, 18, -104, 30, 134, -74, -190, 209, 166, -170, -122, -102, 26, -47, -68, -14, 197, -140, 40, 27, -196, 139, -242, 146, 20, 217, 256, 185, -23, 181, 269, 17, 0, 18, 228, -176, -119, -91, 118, -84, 6, 85, 183, -42, 83, 1, -194, -3, 221, -85, -296, 63, -115, -228, 44, 303, -123, 2, 86, -5, -214, -178, 22, -120]
4239a20n7R4n1l1q0R4J50j18n5RM08j85j36O8P2K3j00Jj53l7K77J53k16j02K58
4264A66j26j41J26n5K94k52r3J99k17K46m28M61k56J90j4l0p4n8J34MkR4r3r8
4288b3J23L6l39M40j07j40K45m28K24k38l6L62lj57l05L33K1j92K95k07p3q8L28
4311G1j07K01p12M16J56l5j77J62L09n45K59j80J62j68P0J13K23l16J25J44J0
4332A81r0p9l0j43M08J9j42K7k4l20L31P8j41K2j15llQ8j79J32J17l2k61L24m12
4357b47J35K37k26J18j96J32J35j27j60j40L39k63J55O1P8j51R7J66l4k3l24K78
4379D0K9q7n1j70J90Qj34L81k1r5K28k03q8M9R8j40j45M0K35k12J04K26m77L00
4403A05J90o4o5k46k47M60j27oP4j56P4j16P3J11j28j22J45j46J02K7l1k5J10
$$ y = [-120, -177, -83, -134, -165, -245, -151, -1, -119, -174, -165, 243, 58, -78, -10, 62, 85, -15, -14, -167, -204, 73, 226, 10, -92, 166, 40, -101, 25, -30, 264, 12, -81, 118, -99, 147, -281, 180, -76, 114, 100, 70, -4, -62, 72, 76, 74, 168, 75, -23, 100, 136, -203, 237, 130, -10, 235, -193, 31, -207, -243, 119, 116, -41, -346, -13, 8, -184, 111, -96, -169, -257, 71, -36, 165, -547, -131, 25, -10, -187, -25, 284, -261, -2, -182, -20, -188, -118, -5, 218, -98, 27, 171, 181, 91, 12, -18, -161, 247, 266, 124, 151, 127, -193, 138, 216, 75, 97, -18, -21, -24, 64, -115, 17, 134, 102, -159, 165, -247, -112, 125, -101, 17, -179, -47, 88, -39, -199, -339, 0, -263, -108, -47, 31, -120, -23, 143, 109, 86, -238, 40, 69, -18, -69, -239, -49, -41, -175, 206, 185, 90, 318, 115, 27, 76, 174, 34, -111, -71, 164, -48, 56, 282, -195, 105, 295, 231, 166, -80, -327, 133, 6, 0, 74, -82, -8, -124, -51, 60, -68, -190, -45, -191, -89, -62, -93, -118, -8]
4426hJ09j3l03Q9J1j51K92k7J24k81p7L56l14R2K7Q0O7j27J55k65j02J74K87l23
4450a28K6m4N7m4k8J92j56J63j17N5J91r4l70N53k54J85k98L04q9m9j00l8J16
4473C3j0K6j50K24k91J85j46k29L37J75q7n5k2R0p8k00K19r8O3K0j09p1l50Q55
4497C31k02j6j36p9R6kP2j54K42p0j59j09J98j07J32k20K07J53l2j67P0j86l34
4520d72L40L44R7k80L22k32mk87K81j17N7L11l29J82m21J79M8Mj4j04L35l02J07
4543D5m4J84k37j02J23r7Q8j31J29R6j56J51K18j99j58j15L02l3j54l1K04m8l5
4566@j24k33j8K01L17j40r3pJ1M24n65K76j62j5j00J26k8L14k06R2j5P4l18K73
4590H4k45K20j44J2m4n2N67o38Q7L06l64K68l02K14K1r6J41J57P7k14j11j23N4
$$ y = [-8, 101, 88, -215, -126, -115, -266, 26, -1, 123, -158, -235, 121, -193, -101, -74, 6, 73, -54, 101, -164, -266, -92, 195, -128, -102, -146, -89, -133, -161, 31, -125, 38, -79, -24, 167, 73, -297, 256, 2, 187, -111, 193, 104, 55, -45, -83, 33, 23, 49, -101, 123, -168, 17, -129, -358, -21, 154, 67, 12, -10, 80, 2, -198, 21, -77, -14, 6, -103, -174, -524, 331, 129, 113, -23, -102, -6, -8, 64, -90, 152, 82, -77, -186, 12, -95, 37, -183, 24, 177, 145, -22, 48, -138, -472, -132, 212, 309, 29, 351, 119, 115, -172, 109, -8, 49, 360, 31, 213, -208, -29, 19, 23, 9, -95, 240, -62, 45, 1, 185, -52, -154, -31, -128, -40, -171, -42, 54, -102, 49, 267, 68, -90, -205, 97, 64, -90, -121, 83, 35, 0, -124, -357, -375, -174, 143, 3, -90, -97, -86, 338, -227, 49, -113, -128, -228, -102, -130, 184, -22, 70, 55, 129, -189, 84, -161, 59, -85, -73, -117, -169, 398, -240, -153, 153, -211, 57, -245, -31, -10, -106, 35, 192, 269, 55, -56, -179, -125]
4613a25K32q2L00l55J1J09k69K88k21M3K08l20J78j58K57k25q1J81O0j20L3k8
4635h4L48n07K42j18n0K59l5j80Q9l6m1o0j3L0L12j56j51j31J69N06q41M00K87
4658B39k89J15p7j1l2J28j45J15KP1k50K43j84L7j32L21m09J28PK22j53J88j34
4681@j01J83k10R9o0L73j85Rj40j13l5j7K62L9r9M7J4j14j09M18k49j54K58r6
4705B0o0J74q8p1j05K68k47K55l8k11j28K02M4K7j53j15J22N4NJ27mj08J68l2
4729A06k45m7m0L22mj74J09m3k8j50J93Q8j7P8k15J46k70J95m5M48k85O5l31R3
4753e1R7RN8l51L72k72j19K74K43j32j83J23j07j34P3J9M2k29K98j92J23j37K32
4776E6k84O2L15j13J36k75J50j7J3lJ00l8j21j02J26Mj06K78p7%J65m19J48P5
$$ y = [-125, 107, 25, 325, -30, -19, 90, -179, 109, -112, -69, 139, -181, -3, -161, 96, -129, -210, -29, 31, -89, -56, -84, 264, -243, -1, -119, -169, 90, 55, -125, -36, -72, -113, -173, -186, -156, 156, 0, -151, -282, -113, 393, -448, -48, 239, -50, 65, -12, -23, -55, 73, -72, 43, 45, 116, -134, 109, -75, -38, -170, 151, -258, -130, -123, 99, -54, 134, 0, -101, 82, -128, -29, -89, 284, 99, 108, -32, -145, -180, -197, 65, 104, 5, 52, 66, -48, -157, 261, 12, -142, 116, 20, -40, 134, 46, -25, -130, 138, -109, 146, 108, -103, -231, -29, 15, 42, -111, -226, -104, -50, -45, 82, 78, -30, 138, 106, -139, -186, -226, 96, 92, -82, 27, -16, -44, -194, -1, 87, 70, 148, -67, 79, -191, 4, -41, 407, 122, 187, -144, -51, 46, 55, 113, -238, 134, -138, -257, 17, 260, 128, -55, 68, -39, -173, -100, -81, -39, -268, 30, -162, -39, -176, 56, -228, -166, 149, 36, 172, -103, 47, 30, 43, 40, 140, 102, -19, -121, 5, 9, -97, 181, 104, 104, 269, -150, -2, 73]
4800G3J0J3j05j15L87m32O1K92j23l14J76N7J14k34J40R2k74J76j30K95k18j1
4822g0o7J48k35k9L35q7j26k7J97j0M9M8j33P8r7O6O9m9l66L14N9k61j7K67j57
4847a01N4P6n8k23R4J45K6L5K7k67K85R1K1j69J07j17o9L55m07M0K6R2n0J29j51
4872iM5r1J12j73o7J93J08j92p5J18j20K51j99K23k00J22j33J66p5q3J54J8k14
4895a21Q7O3Kk03n5K40K9j70M2N2k6L32j90j04O5p3K96p2k86m7N2N8q5J38j5K70
4921B79k03k06P6N4p2K15K57m74J02r7L41k32j36J97j64M9L3j27m6J77L40l16
4943D7J38l87L62k96P5j01K02J95n16L89j67R1l31M43m01L17J51k48p6JJ32k38
4965b18J84l7M8K00k86J63k20J24O3J1J76j7k10L8L7k81J76j76K6O0K40o8N1N0
$$ y = [73, 83, 96, -9, -124, 263, -169, -108, 184, 61, -253, -77, -20, 94, -140, 0, 92, -182, -6, -136, 159, -59, -70, -137, 11, -224, -253, 82, -5, -131, -158, 39, 29, 78, 126, -7, 71, -26, 40, 109, 60, -306, 8, 67, -194, -211, 56, -101, -47, 29, -29, -252, -158, -13, 13, 48, 75, -192, 93, 184, 205, 36, 143, 26, -43, 312, -95, -55, -29, 63, 13, 142, -9, 36, -55, 57, -116, -183, 10, 118, -74, -149, -31, -151, 100, -99, 124, -76, 46, -87, 79, 4, -79, 75, 93, -121, -34, 29, 31, -172, -227, 13, 42, -128, -86, -34, -60, 272, 82, -22, 43, -30, 266, 194, -92, -139, -87, -29, -114, 24, 9, 279, 76, -130, -54, 0, -72, 143, 400, -74, 28, -69, 272, 40, -96, 101, -63, -14, 19, -108, -154, 23, 363, 47, 185, -202, 160, -136, -61, -162, 40, 235, -281, 108, -59, 32, -299, 144, -257, 60, 211, -37, -113, -112, 20, -218, -34, -71, -23, 177, -109, 54, -166, -42, 21, 32, 208, 191, -19, 19, 56, -225, -49, -225, -199, -139, 101, 33, 84, 134]
4989A34jk75K95k55Q2Q1MN6j33J15j19j5K12k71L26k11K02m03R5l2k40M35l5n5
5013hJ60R8m24J24N2k67L00N5l06p2K20K22q7j39P1R5j16j10N7J54J53l80K02
5036E4N3m4J31k15J97k97j89M2M27j59p2R1O1j47J94O9o3Rk68K45q4k2J35m93
5060c45M59Lm04K84lJ5L8K0J72l25j60K38Rk4l1J92O5l19QJ20p8J35j15J11J33
5085A98q5j11j07J28K56k81J87k49J15K07k25j16L41m62J67m8N6K3qM8p5j56J84
5108a3J3K37j69q8r7l6J26K49k77q3J06P1j25j8J4j46L5K18q4j20L35K9m1j09
5132B7N8j02o9K9j79K32o4LJ23p3L1k75L80j67r5Q9J25k24M7K0Q5J25k66J55L8
5157E3o9j53M34k13k64Q4R9J55j50k42M65k31P5K45k66J2L4l31K95m1q9J14l95
$$ y = [134, 133, -142, 153, -102, -20, 61, 65, 121, -12, 103, -16, -31, 181, -90, 236, 25, 227, -176, -81, -113, -353, 82, 47, -8, 152, 250, -174, -50, 2, -265, 35, 90, -216, -288, -68, 154, 67, -72, -1, 94, -22, -132, -75, 79, 232, -148, 54, 107, 63, 194, -21, 176, -121, -310, -268, 159, 0, -72, 19, 80, -67, 127, 196, 133, 142, -126, 119, 35, 13, 148, -345, 114, 117, -287, -3, -6, 9, 47, 67, 239, -86, -246, -8, 1, -23, -54, 138, 203, -116, -108, 12, -66, 69, -46, 65, 198, 113, 2, -105, 23, 279, -2, 185, -64, 51, 258, 33, -83, 258, -204, -37, -85, -29, -6, -14, 34, -41, -197, -13, 0, 237, 68, -20, -117, -153, -27, 222, -55, -138, -32, 39, -86, -104, -90, -236, -201, 17, -67, -187, 148, 177, 136, 27, 85, -17, -86, -57, -236, -4, -68, -65, 58, -15, 16, -259, 121, -46, -141, -52, 73, -151, -104, -84, 1, 126, -140, 15, 53, -16, -169, 265, 52, -212, -128, -29, 126, -24, -266, 199, -32, 43, 288, 22, 34, 68, -263, 32, -9, -98, 16, -379]
5180c79K06K82j57nM6j59L50k40m5p8L89k2k32K03j95N6j46J1R1j9L3q4K69j47
5204B8j60J3P2q3P8j99N8L13k51K85l04L42q5j34J8J87M8k83O8k03P1J10m2J01
5228D8j18K04kj03m6K83j37l3j32J68k92K64J75k82J69l34K67J81m73K15j83M5
5250a16m8J25J32l14K08J2L33l7l71j29L30l24K20k26M61m35L94m90K40j19K02
5271D8k15P7J92k02N4m9J24Mk11J18K18j44j94K4J37J45k33j75K64J64j1l11L14
5294A38N1k54L19k57J2K4P1j08n3J12J75j66l2q5J06O8k07L48l54R0P5q6Jj4J60
5319A34j84O9J12j70jk03M43l44Q2J52L5j92L5J22rJ34k39OL9J27n27M38J89o2
5343A86r4l84N58n45K89j19J78k33K44l39K29K02J9m5p7m42N35q6Q8p5l27K94
$$ y = [-379, -173, 109, -48, -53, -7, -166, 184, -56, -101, -179, 210, 188, -44, 159, -36, 20, -126, -115, -24, -43, -10, -94, 175, 28, -132, -119, -47, -130, -52, -251, -193, 120, -131, 154, -150, 192, 107, -27, -9, 178, 226, -57, 11, -192, -121, -11, -53, 48, -70, 134, 132, 29, -17, 266, 129, 96, -36, 132, -160, 104, 279, -3, 166, -168, 99, 280, -193, 22, -161, -116, -164, -39, 93, -221, -13, -1, 332, 295, -76, -205, 125, -199, 21, -205, 256, -179, 215, -275, -35, -154, 48, -167, -90, 102, -100, -46, -95, 29, 33, -178, -60, 158, 14, -180, -156, -19, 126, -107, -282, -18, 146, 135, -176, 138, 189, -65, 254, -3, 9, 33, 104, -4, -57, 55, 230, 64, 32, -53, 53, 121, -86, 262, -92, -2, 73, -13, -12, -26, 134, -50, 19, 131, -39, -40, -243, 200, -144, -62, 90, 125, -67, -32, 90, 81, 215, -24, -18, 21, 148, -379, 59, 248, 186, 92, -292, 266, -279, 10, -109, 69, -164, 80, -259, -30, 172, 191, 146, 69, -373, 162, 76, 164, 89, -238, 56]
5365E6P7j84r7J90m3j35L84k76K96o58M14L40l16M1k17K27J00k69L8Q3k08J15
5387d2n6K29J45l69O2p5M8l9J21j46J61O0J6j79J55l6k41j51L29J7J9jj45P9%
5412c9J0J15k49K51j95K23R4l59N8k66M73j72J09k8J17k54J50k93K88j54j2K26
5434I3l3N2j86R9m8Q9j05M1n6J39j21l4P5k04K19l8j21L4j70J40q3J55J9j77K27
5459FK64l88K83k65K8J8J07j46J74K58k51J32J0l22r2K9K45j55o5J20m01M64M2
5482I5q9J33k54K26p3j26K63n8r2J36l10J0J29l36N28j77j39J08K87k05l22K03
5504f3K72M9j95K4k93L72m1m5K16j26j41O7K9M4j96J73k19P2j26J25L5K9J40k16
5528a4j01K11r7n0J54q7N0J04k15P5k13o9O08n57N3K47j46K5j2k03J20K27k37
$$ y = [56, 133, -51, -148, 42, -1, -136, 248, -28, 268, -390, 24, 364, 48, 89, -128, 99, 199, -70, -32, 51, -157, -42, -98, 131, 276, -93, -31, -106, -58, -97, 24, -122, 39, 99, 115, -64, 91, 55, -186, -337, -8, 9, 28, 27, -118, -39, -39, -29, 86, -163, 88, -107, 116, 210, -149, -91, -357, 116, -56, 53, 25, 142, -112, 38, -255, 33, -121, -133, 93, 60, 112, -74, 25, -23, 66, -39, 2, -54, 85, -36, -70, 5, -199, 20, -18, -139, -105, -275, -135, -218, -63, -44, -221, 6, 270, -118, 165, -100, -72, -54, 53, -93, 81, 339, 88, 220, 230, -92, -184, -155, 90, -65, -130, -10, -411, 53, 95, 6, 139, -115, 111, 38, -88, 175, 117, 25, 161, -149, -139, -10, -346, 182, 5, -134, -26, 261, 56, -266, -63, 209, 258, 63, 87, -206, 166, 125, 80, 296, 170, 29, 96, 125, 169, -27, 146, -73, -1, -127, -2, 33, 62, 202, -14, -115, 96, -1, -51, 103, 16, 66, 170, -45, 30, -183, -252, 356, -201, -148, 99, -47, -22, -34, -237, -117, 110, -127]
5551a27J35p8q2J5J90j91J34J50l06K38J37l2j25j30j13J02L73n20J52K36l59
5572b01M10o4k35J12JO7j28j04K07k52J17M8R0L85k42Jk66m6K5r6K78N3k11j56
5596b07N4l7J35j23K54nL6K1j15j64Q1J50M2k91J62L7m12M72p5K23K9k10j63Q1
5620b5j78R6K50m9j87l7m9K0J11K13j84L9j75J74K54k1l66O0j08l3R0J78j83K71
5644A61j98N8m0k53K46J94l08J13J10q2j28J17j81J62J8r4J63j19R7j8p6k2L26
5667B46l19l3N4K37k66P5j89J46j19M02n24L00K46j13p6K47n02M34k0o9o7P5n2
5690A13k46M41j87j2q3l73M10J27r8k90J82O9m75M02O7j46K53l01J63K7o1Q5p3
5713fL9J70K58m04K07k31j0N3J10j69k9L3L6r3p4j31K46Q0Q0Jj36n8n3j21M04
$$ y = [-127, 8, -70, -152, -137, 53, -138, -4, 146, -160, 78, 215, 183, 58, -72, -185, -83, 290, -230, -78, 158, -201, 209, 145, -90, 22, 23, 90, -38, -142, 65, -187, -70, -22, 68, 453, 211, 212, -54, -100, -75, -171, 107, 160, -51, -207, -153, -190, -55, -178, 76, 71, 107, 128, 13, -151, -70, 80, 122, -169, -7, 30, -382, 90, 15, 238, 267, 57, -106, -25, -203, -107, 143, 94, -93, -130, -179, -159, -48, 165, -19, 20, -155, 19, 273, 252, -114, -54, -162, -195, -105, 73, -110, 161, -37, 21, -19, -272, -26, 168, -140, -27, 83, 1, -127, -10, -191, -29, -11, -105, 58, -61, 36, 18, -58, -80, 246, -73, -106, -52, 185, -81, -6, -195, -49, -168, 234, -290, 10, 256, 143, 67, 314, -188, 246, 226, 157, 90, 165, 113, -133, 308, 121, 109, 26, -347, 63, 190, 92, -198, -16, 53, -422, -20, 47, -99, 154, -147, 16, 43, -18, 67, -6, 33, 203, 461, 57, 264, 33, 23, 76, 186, 17, -12, 21, 57, -36, -110, -241, 5, 85, 165, 166, 30, -28, -81, -202, 202]
5738B02l35J29L6j0j15%J01J23k69P0j14K24J24j49Jr0j5Ql3J40R2l17R4N5n3
5763a01O3J21j29O7O5R8q8j24M7l00J93J59r2J89j71p9P8j36R2K12j06q2K87m14
5787a51J03M8l16O55m08NK61j70L2j62L45k08J97j83o8j94K55NK4j02J77l83M1
5810a97O8K38k0j63K33m07M20k12m2j14L66j0l49J89n8J12p7JK76l58On5J85K45
5834B77j94k62P6J25r1KJ65p7K97j44k25J85rj21k84M52M7k23J39k6k40J44j68
5857a55J8J52j43K11k77P1K23oN0J77m25K72J13n05L12k49L39l2k69J90M9j10
5879Fj2%N0N8m41L69RK49j15j98J54j07j59J16j00K26m1P0j66m1Q8O1j9k3k0k7
5905a3l9J05K16p4j69j25m2Q5j50L18m6Q9l27J51J2Jo6j95K51o3j5O0j6o7k07
$$ y = [202, -133, -4, 32, 22, -93, -93, 8, 131, -138, -68, -182, 42, 166, 17, 18, -72, -87, -79, -112, 28, 120, -197, -103, -48, -101, -38, 83, -46, 21, 86, 184, 96, -28, 19, -281, -88, 71, -21, 168, -3, -82, -4, -140, -48, 164, 58, -24, 263, -151, -48, 0, -316, 339, -69, -64, 197, 27, 59, -103, 242, 34, 231, 48, -20, -214, 41, 46, 70, -32, 145, -238, -197, -129, 109, 89, -74, 159, -248, 172, -40, -82, -196, 170, 160, -189, 0, -58, 54, -23, -22, 254, -104, -98, -153, 32, 277, 83, -179, -103, 22, -69, -67, 98, 21, 318, 174, -51, 134, 125, 4, -280, 172, 219, -4, 135, 109, -131, 13, -155, -137, 15, -128, 83, -194, -123, 100, 94, 144, 321, -104, 168, 281, -224, 88, -161, 178, 146, -123, 67, 116, 6, -6, -6, 44, 102, -339, 30, 39, 288, 173, -25, 129, 22, -137, -21, -121, 105, 64, 134, -32, -73, 15, 76, 57, 34, 14, -13, -52, 53, 269, 195, 26, -99, -141, -56, -206, 112, 66, 155, -172, -21, -9, -8, -74, -269, -18, -81, -96, -36, -52, -119, -326]
5930c26M00j18J9M2j5k03K21p4K97k22O1k6J39Pl07k01L37K1J12J51k85k18O36
5953D48o97J63J40P4q9J78j69l12K43K6p1j02Q6p9M57k83k8j99N12j34j6r2j7
5976C9k36L43j04j61R1J4R1j81J35k15J81N8R7j72k02J96K12j50J48L5k52J2J12
5999I1j97l4J60J98Kk31q7J17L9j47J97O2r8n6J15L0k56J22j15K25j85R9k22J14
6023e7J56p1l5j71L82l3J23l48j09L09P4n17M55J36l33MOR8J0l4K4N4j78J05q3
6048c3o4K93k14k91K71M7k30K49M7j60K89R1l76M3J64m8n7J8j17J09o9j19P9j73
6072b51P3J62q3J83Nm1K75o02J51K92j58K4j49m1J07MJ38K4n0j58p7K67k63J36
6096c2K37l08j06K92P8j09N3j06j00n3L31k41kJ07k4p9j40LK16p6o2k42L11Q9
$$ y = [-326, 74, -44, -25, 17, 2, -201, 20, -54, 243, 21, 82, 56, 195, 202, -105, -306, 31, 52, 164, 315, 30, -188, 448, -249, -86, 54, 128, 39, 217, 48, -264, -21, 5, -66, -168, -82, -161, 296, 13, -15, -214, 298, 164, 148, 56, 39, -197, 146, 42, -119, -28, -14, 77, -104, 31, -184, -3, 55, 152, -20, -222, -26, 186, 36, 184, 219, -33, -21, 91, -106, -140, 20, 218, 220, -11, -98, 19, 58, -89, 108, 170, 72, 16, 131, 161, -95, 27, -88, 137, -48, 51, -171, -57, 99, 28, -7, -178, 204, 171, 294, -54, -163, 146, 220, -297, 158, 294, -39, -35, -29, 69, 79, 45, 69, 123, -55, 50, -33, -97, 196, -18, -309, -38, 9, -221, 28, 75, -85, 204, 295, -81, -38, 126, 78, 21, 39, -78, 31, -38, -157, -78, -251, -178, -16, -99, 84, 89, 48, 323, -279, -128, 164, 6, 30, -119, -160, -53, -49, 89, 113, 63, -95, -172, 95, -168, -32, 205, -103, -209, 83, 161, 52, 105, -1, -101, -154, 177, -64, -66, 41, 17, -62, -202, -199, 17, -59, -121, -363, -52, 37]
6120C7m2k19L59l88K17KJ06j05p0K00j80m9j2J48P2k3j14J12%p6J00p9j64K71
6144A03n5K21m41m2L85m25J35L58k21n1J59K5r3N7q5R1j80K07l35J62k00nJ91
6167c9J68k26j95M68k16J6J16k72J73J40o9Q6J4k95J26p9R1L8K53Kl57L28l01
6190c0p0j28K17j78N44k66k12J03j25K80L0k49mrjq7j22L15o4N2p0PK94k56J29
6215A00R5k41J29j93l4J93M6o1r7J29L9K02j84k32K67p2QP1m29J70R7L4M7k27
6239a43L45K6j93l55L82j86O0K09l07J56j64K39k68J08j16M37m86K49j41L2K13
6260I7j07R1k18p3J35j10K47R8j50n3Q7j14J40r3J05M0k5k13J51K04l57K12l03
6283b09K4K18J2m5L0j84K45o1J3K55j67L0J4j16J47j76j32J52n2r5J42q5J36J41
$$ y = [37, -5, -224, 135, -253, -36, -34, 72, -33, -103, 97, -83, -132, -144, 4, 76, 53, -61, 51, 51, -25, 75, -4, -168, 103, 48, 269, -172, -214, 171, -254, -119, 239, 18, -33, 126, 151, 58, 115, 30, 121, -59, 148, -187, -25, -225, -230, -39, 129, -97, -292, 176, -40, -24, 92, -180, -7, 133, 64, 150, 164, -131, -5, -84, 7, 45, 298, 300, -57, 271, -30, -100, -228, -11, -189, 355, 89, -123, -20, -145, 135, 165, -84, -88, -97, -98, -185, -307, 8, -56, -4, -74, -67, 227, -29, 100, 195, -46, 83, -110, -144, 49, 95, 34, -63, 66, 105, 307, 123, -109, 158, 86, 94, 165, -264, -94, 3, 37, 84, -143, 202, 228, 35, -320, 62, -124, -64, 145, -162, -6, -170, 69, -199, -91, -207, 230, -256, -7, -148, -116, 97, -10, 81, -137, -210, -75, -185, 62, 160, 10, -43, 44, -70, 70, -23, 82, 122, 97, -116, 35, 239, -118, 94, -209, -185, 33, 45, 0, 30, -154, 91, 30, 43, 298, 131, 161, 175, 59, 206, 30, -102, 50, -2, -97, 45, -40, 96, 237]
6307B37j8k00L6l3O4n0j9L0K06k12j62K79j43j84L19nj84k51M20m81N38j28M8
6330A07q4J04K2j92j46J90J84k83K91l44M07l16J17k52Kq6N33m10K71j27K1L4
6352D3j8j47O5j19K07j61J95O1n5J69l85J99K5k81NN16l92J4p6J63q4n9P4k9L1
6377c9K74l27r0J66j58K06R3JJ3k25J03K5O7j21k87J90Q9j77K4J69m46K88O5N
6401i2J5N8L01j03Lm54K87L5J33Lk41J31J20k31L01r4j70R4q9r5J74j2o6o3P4
6426A9K28j04j18R2J52j96QO3k25J1R5kl10K76p2L34l13l6j58L39L43k86r4j67
6450a21PJ11Q1k19m7K50m71K01L1L29M7rP5j46N6qk76L14l15r4J39J58J83o35
$$ y = [237, 219, 19, 55, 22, 86, 36, 17, 47, 253, 41, -121, 158, 15, -169, 150, 145, -39, -290, 130, -351, 187, 59, 107, 23, 127, 149, -43, -189, 1, 185, -98, 193, -151, 256, -60, 57, -195, -193, -279, 254, -156, 115, -12, 9, 43, 25, -122, -57, -176, 31, -130, 65, 126, 71, 240, -145, 54, 79, -202, -197, 319, -73, -59, -135, 28, -56, -115, -41, -70, -39, 235, -92, -182, -16, -174, 32, 125, 126, 139, -86, 17, 42, 109, -12, -299, -109, -20, -197, -173, -4, -450, -162, -97, -92, -77, -19, 282, 179, 182, -272, 15, 50, 183, 186, -55, 76, 196, -35, 266, 172, 2, 96, 7, -88, 86, 74, 8, -55, 19, 247, 143, 25, 117, 269, 73, 81, 144, -81, -70, 25, 23, -287, -11, -83, 251, -62, -98, -256, 83, 426, 140, 46, -121, -114, -3, 78, -141, -188, 62, -409, -208, -177, 152, 199, 190, 265, 119, 175, 167, -109, 205, -110, -204, -65, 93, 276, -359]
$$ [...]
8191B05
##END NTUPLES=NMR FID
##END=
