##TITLE=1H_Pr nEth
 CDCl3
 8 sc, 
 17.11.2022
##JCAMPDX= 6.0         $$ Bruker NMR JCAMP-DX V2.0
##DATA TYPE= NMR FID
##DATA CLASS= NTUPLES
##ORIGIN= UXNMR, Bruker Analytische Messtechnik GmbH
##OWNER= root
$$ XWIN-NMR		Version 3.5
$$ Thu Nov 17 16:43:21 2022 Russian Standard Time (UT+4h)  she@DPX200
##.OBSERVE FREQUENCY= 200.1313499994
##.OBSERVE NUCLEUS= ^1H
##.DELAY= (6, 6)
##.ACQUISITION MODE= SIMULTANEOUS
##.ACQUISITION SCHEME= undefined
##.AVERAGES= 8
##.DIGITISER RES= 18
##SPECTROMETER/DATA SYSTEM= spect
##.PULSE SEQUENCE= zg30
##.SOLVENT NAME= CDCl3
##.SHIFT REFERENCE= (INTERNAL, CDCl3, 0, 15.7039)
##AUDIT TRAIL= $$ (NUMBER, WHEN, WHO, WHERE, WHAT)
$$ ##TITLE= Audit trail, XWIN-NMR		Version 3.5
$$ ##JCAMPDX= 5.01
$$ ##ORIGIN= Bruker BioSpin GmbH
$$ ##OWNER= she
$$ F:/spectra/data/she/nmr/H-F/1/audita.txt
$$ ##AUDIT TRAIL=  $$ (NUMBER, WHEN, WHO, WHERE, WHAT)
(   1,<2022-11-17 16:41:57.73 +0400>,<she>,<DPX200>,
      <created by zg, POWCHK disabled, PULCHK disabled
       configuration hash MD5:
       00 E9 B6 7A A2 85 ED C7 34 08 36 98 17 FE 4E 26
       data hash MD5: 16K
       D3 A6 51 F7 41 4B 05 10 A5 A4 B9 2A A1 1D 15 19>)
$$ ##END=
$$ 
$$ hash MD5
$$ 34 E6 E5 FA E3 96 B3 52 96 C6 76 71 40 53 FD 03
##$RELAX= 
##$RELAX= 
##$RELAX= 
##$RELAX= 
##$RELAX= 
##$RELAX= 
$$ Bruker specific parameters
$$ --------------------------
##$DU= <F:/spectra>
##$EXPNO= 1
##$NAME= <H-F>
##$PROCNO= 1
##$TYPE= <nmr>
##$USER= <she>
##$AMP= (0..31)
100 100 100 100 100 100 100 100 100 100 100 100 100 100 100 100 100 100 
100 100 100 100 100 100 100 100 100 100 100 100 100 100 
##$AQSEQ= 0
##$AQ_mod= 1
##$AUNM= <au_zg>
##$AUTOPOS= <>
##$BF1= 200.13
##$BF2= 200.13
##$BF3= 200.13
##$BF4= 200.13
##$BF5= 200.13
##$BF6= 200.13
##$BF7= 200.13
##$BF8= 200.13
##$BYTORDA= 1
##$CFDGTYP= 0
##$CFRGTYP= 5
##$CHEMSTR= <none>
##$CNST= (0..31)
1 1 145 1 1 1 1 1 1 1 1 1 1 1 1 1 1 1 1 1 1 1 1 1 1 1 1 1 1 1 1 1 
##$CPDPRG= <>
##$CPDPRG1= <>
##$CPDPRG2= <>
##$CPDPRG3= <>
##$CPDPRG4= <mlev>
##$CPDPRG5= <mlev>
##$CPDPRG6= <mlev>
##$CPDPRG7= <mlev>
##$CPDPRG8= <mlev>
##$CPDPRGB= <>
##$CPDPRGT= <>
##$D= (0..31)
0 1.2 0 0 0 0 0 0 0 0.06 0 0.03 0 0 0 0 0.0002 0 0 0 0 0 0 0 0 0 0 0 0 
0 0 0 
##$DATE= 1668688917
##$DBL= (0..7)
120 120 120 120 120 120 120 120 
##$DBP= (0..7)
150 150 150 150 150 150 150 150 
##$DBP07= 0
##$DBPNAM0= <>
##$DBPNAM1= <>
##$DBPNAM2= <>
##$DBPNAM3= <>
##$DBPNAM4= <>
##$DBPNAM5= <>
##$DBPNAM6= <>
##$DBPNAM7= <>
##$DBPOAL= (0..7)
0.5 0.5 0.5 0.5 0.5 0.5 0.5 0.5 
##$DBPOFFS= (0..7)
0 0 0 0 0 0 0 0 
##$DE= 6
##$DECBNUC= <off>
##$DECIM= 32
##$DECNUC= <off>
##$DECSTAT= 4
##$DIGMOD= 1
##$DIGTYP= 9
##$DL= (0..7)
0 120 120 120 120 120 120 120 
##$DP= (0..7)
150 150 150 150 150 150 150 150 
##$DP07= 0
##$DPNAME0= <>
##$DPNAME1= <>
##$DPNAME2= <>
##$DPNAME3= <>
##$DPNAME4= <>
##$DPNAME5= <>
##$DPNAME6= <>
##$DPNAME7= <>
##$DPOAL= (0..7)
0.5 0.5 0.5 0.5 0.5 0.5 0.5 0.5 
##$DPOFFS= (0..7)
0 0 0 0 0 0 0 0 
##$DQDMODE= 0
##$DR= 18
##$DS= 0
##$DSLIST= <SSSSSSSSSSSSSSS>
$$ [...]
##$SUBNAM2= <"">
##$SUBNAM3= <"">
##$SUBNAM4= <"">
##$SUBNAM5= <"">
##$SUBNAM6= <"">
##$SUBNAM7= <"">
##$SUBNAM8= <"">
##$SUBNAM9= <"">
##$SW= 18.0517283424941
##$SWIBOX= (0..15)
0 0 2 0 0 0 0 0 0 0 0 0 0 0 0 0 
##$SW_h= 3612.71676300578
##$TD= 16384
##$TD0= 1
##$TE= 0
##$TE2= 300
##$TE3= 300
##$TEG= 300
##$TL= (0..7)
0 120 120 120 120 120 120 120 
##$TP= (0..7)
150 150 150 150 150 150 150 150 
##$TP07= 0
##$TPNAME0= <>
##$TPNAME1= <>
##$TPNAME2= <>
##$TPNAME3= <>
##$TPNAME4= <>
##$TPNAME5= <>
##$TPNAME6= <>
##$TPNAME7= <>
##$TPOAL= (0..7)
0.5 0.5 0.5 0.5 0.5 0.5 0.5 0.5 
##$TPOFFS= (0..7)
0 0 0 0 0 0 0 0 
##$TUNHIN= 0
##$TUNHOUT= 0
##$TUNXOUT= 0
##$USERA1= <user>
##$USERA2= <user>
##$USERA3= <user>
##$USERA4= <user>
##$USERA5= <user>
##$V9= 5
##$VALIST= <valist>
##$VCLIST= <CCCCCCCCCCCCCCC>
##$VD= 0
##$VDLIST= <DDDDDDDDDDDDDDD>
##$VPLIST= <PPPPPPPPPPPPPPP>
##$VTLIST= <TTTTTTTTTTTTTTT>
##$WBST= 1024
##$WBSW= 4
##$XGAIN= (0..3)
0 0 0 0 
##$XL= 0
##$YL= 0
##$YMAX_a= 212408
##$YMIN_a= -409509
##$ZGOPTNS= <>
##$ZL1= 120
##$ZL2= 120
##$ZL3= 120
##$ZL4= 120
##$ABSF1= 10
##$ABSF2= 0
##$ABSG= 5
##$ABSL= 3
##$ALPHA= 0
##$AQORDER= 0
##$ASSFAC= 0
##$ASSFACI= 0
##$ASSFACX= 0
##$ASSWID= 0
##$AUNMP= <proc_1d>
##$AZFE= 0.1
##$AZFW= 0.1
##$BCFW= 1
##$BC_mod= 2
##$BYTORDP= 1
##$COROFFS= 0
##$CY= 11.3945322036743
##$DATMOD= 1
##$DC= 2
##$DFILT= <>
##$DTYPP= 0
##$F1P= 2.36226072786647
##$F2P= -0.459571619588291
##$FCOR= 0.5
##$FTSIZE= 0
##$FT_mod= 4
##$GAMMA= 1
##$GB= 0.15
##$INTBC= 1
##$INTSCL= 1
##$ISEN= 128
##$LB= 0.24
##$LEV0= 0
##$LPBIN= 0
##$MAXI= 10000
##$MC2= 0
##$MEAN= 0
##$ME_mod= 0
##$MI= 1.114404
##$NCOEF= 0
##$NC_proc= 0
##$NLEV= 6
##$NOISF1= 3.799351
##$NOISF2= 2.8
##$NSP= 1
##$NTH_PI= 0
##$NZP= 0
##$OFFSET= 15.70392
##$PC= 1
##$PHC0= -18025.53
##$PHC1= 5.0007
##$PH_mod= 1
##$PKNL= yes
##$PPARMOD= 0
##$PSCAL= 0
##$PSIGN= 0
##$REVERSE= no
##$SF= 200.130013532006
##$SI= 16384
##$SIGF1= 3
##$SIGF2= 2
##$SINO= 400
##$SIOLD= 16384
##$SREGLST= <1H.CDCl3>
##$SSB= 0
##$STSI= 0
##$STSR= 0
##$SW_p= 3612.71676300578
##$SYMM= 0
##$S_DEV= 0
##$TDeff= 0
##$TDoff= 0
##$TI= <>
##$TILT= no
##$TM1= 0
##$TM2= 0
##$TOPLEV= 0
##$USERP1= <user>
##$USERP2= <user>
##$USERP3= <user>
##$USERP4= <user>
##$USERP5= <user>
##$WDW= 1
##$XDIM= 8192
##$YMAX_p= 0
##$YMIN_p= 0
$$ End of Bruker specific parameters
$$ ---------------------------------
##NTUPLES= NMR FID
##VAR_NAME=  TIME,          FID/REAL,        FID/IMAG
##SYMBOL=    X,             R,               I
##VAR_TYPE=  INDEPENDENT,   DEPENDENT,       DEPENDENT
##VAR_FORM=  AFFN,          ASDF,            ASDF
##VAR_DIM=   8192,          8192,            8192
##UNITS=     SECONDS,       ARBITRARY UNITS, ARBITRARY UNITS
##FACTOR=    0.0002768,     1,               1
##FIRST=     0,             0,               0
##LAST=      2.2672688,     0,               0
##MIN=       0,             -409509,         0
##MAX=       2.2672688,     212408,          0
$$ Real data points
##PAGE= N=1
##DATA TABLE= (X++(R..R)), XYDATA
$$ [...]
1219dK5j67M7K8J40j23J73J7m1l1k05K26o3J62j23J41N5l03Mkj27j64K40K40k89
$$ -4 21 -146 -99 -71 69 -54 119 136 95 64 -141 85 22 184 61 202 257 -46 -42 -44 -171 -335 -95 145 -144
1244a44J80k57J87O8M0j2p2o7K2Jk1J43p5Q6J28k10J94o8j4R6j93N1M2J53k97
$$ -144 36 -221 -34 34 74 62 -10 -77 -55 -54 -75 68 -7 79 207 -3 191 123 109 205 12 63 105 258 -39
1269c9L3j59J72n0p8N2k9J4M7j77J24OJ94j99J90j1j23K22r3k38L45j67j54K75
$$ -39 -6 -165 7 -43 -121 -69 -98 -84 -37 -214 -90 -84 110 -89 101 90 -33 189 96 -142 203 36 -118 157
1293A57l5N3j32j1J19r9j38Mk1J40k34N0J41p3q2r6K07op8r0K40J1K3P1j95L5
$$ 157 122 175 43 32 151 52 -86 -82 -103 37 -197 -147 -6 -79 -161 -257 -50 -56 -134 -224 16 27 50 121 -74 -39
1319c9P8j30R4J32j54P3q2J5m7N2r1K22r6k8L9k37M9J39J22j83k2J1q4J30J04
$$ -39 39 -91 3 135 -19 54 -28 -13 -60 -8 -99 123 27 -1 38 -199 -150 -11 111 -72 -94 -83 -167 -37 67
1344F7m5L2j44J85j65J20j3J42j88J21j31J04o1K3rJ13M6l31Q2j5l8Q8jp3P5l5
$$ 67 22 54 -90 95 -70 50 37 179 -9 112 -19 85 24 47 38 151 197 -134 -52 -67 -105 -17 -18 -91 -16 -51
1370e1j15R1k3L8KO0k3j3m1K29j5k24K69j84j9JN0j07K0o3J27p4MO7k27K55O4
$$ -51 -166 -75 -98 -60 -58 2 -21 -34 -75 154 139 -85 184 0 -19 -18 32 -75 -55 -118 9 -65 -61 6 -221 34 98
1397I8m1N2j7p8K8l7j56J47k7K17l05m3L8J3K03o9j33J33o5N3j7J50J9o0j09J21
$$ 98 57 109 92 14 42 5 -151 -4 -31 186 -119 -162 -124 -111 92 23 -110 23 -42 11 -6 144 163 103 -6 115
1423A15p0j08R9k44K96j58R0p2M5j17Q7j34K07Q2k22R9J5j34J71O8j10N3l6l2
$$ 115 45 -63 36 -208 88 -70 20 -52 -7 -124 -37 -171 36 118 -104 -5 10 -124 47 115 5 58 22 -10
1447a0p2O1k8J73m2J38l29J19L5K0n1j91K12J8n6N3k19J24K9j36L04j07N9j20
$$ -10 -82 -21 -49 124 82 220 -109 10 45 65 14 -177 35 53 -3 50 -169 -45 -16 -152 152 45 104 -16
1471a6j2J15k00Q3R1o8n2R0q1R8l5J69l59J37l7J47j01n2J56j20Mr0J67o5P0p9
$$ -16 -28 87 -113 -30 61 -7 -59 31 -50 48 13 182 -177 -40 -77 70 -31 -83 73 -47 -43 -133 34 -31 39 -40
1497d0O2m6l8j41J54N5j8p8J69R6k08o9Q4l6K6k1N0O1j8mkj13J68m4m7q2J43j57
$$ -40 22 -24 -62 -203 -49 6 -12 -90 79 175 -33 -102 -18 -54 -28 -49 1 62 44 40 38 -75 93 49 2 -80 63 -94
1525i4j72L01p6J6J76k37J04j14J14l3qJ89j84J38j17r6L5K53l03J91n0Q1j53
$$ -94 -266 35 -41 -25 151 -86 18 -96 18 -15 -23 166 -18 120 3 -93 -58 195 -108 83 33 114 -39
1548c9p2K26j53N9N1l5j47J8Q3K2j87P5J7K88l43J16K2J0M1j41q3K74m7j45J40
$$ -39 -111 115 -38 21 72 37 -110 -92 -9 13 -174 -99 -82 206 -137 -21 1 11 52 -89 -172 102 55 -90 50
1573E0p3l8J58n9j20n2L1K43j67J35j36QJ32j26N3Po0o4J74j30J3J03q7O6p8K7
$$ 50 -23 -61 97 38 -82 -134 -103 140 -27 108 -28 -20 112 -14 39 46 -14 -78 96 -34 -21 82 -5 61 -17 10
1599A0j14k6J47j23K2J9M6P1j05j8K4P4MN5o4l8L1l2J55j03K6k36K31k9m6K5k8
$$ 10 -104 -130 17 -106 -84 -65 -19 52 -53 -71 -47 27 31 86 22 -16 15 -17 138 35 61 -175 56 27 -19 6 -22
1626b2K1k36L46j04j18O5J52j71J07p8l3O0L8L6O5k74J01k8J20L0M5r5l8KOK05
$$ -22 -1 -237 109 5 -113 -48 104 -67 40 -38 -71 -11 27 63 128 -146 -45 -73 47 77 122 27 -11 -9 -3 202
1652B02k56P5j33K27j68P0j86Q4L1J89j80L5K0l5J6l5P3j43R1l8J19n9J0R6p8
$$ 202 -54 21 -112 115 -53 17 -169 -85 -54 135 -45 -10 10 -25 -9 -44 29 -114 -23 -61 58 -1 9 105 27
1677B7J7Nj50L7J76p5j40K27k30J4L35k31J52k42m9Q2M3qO9l9q4R5j06J65j96
$$ 27 44 49 -101 -64 112 37 -103 124 -106 -92 243 12 164 -78 -127 -45 -2 -10 59 20 -64 31 -75 90 -106
1702a06J74Q2p9q3n5J15p2J96j77J2N3km5pk0j62J75n4O9j3j70o0jL10k57J32
$$ -106 68 150 71 -12 -67 48 -24 172 -5 7 60 58 13 6 -14 -176 -1 -55 14 1 -169 -229 -230 80 -177 -45
1728d5R0k7Nl5O5l3J58j6j15p2J25l8pn8K1j09J8P7p2J6p5J43K8j7o4J07Q6j82
$$ -45 45 18 23 -12 53 20 178 162 47 -25 100 62 55 -3 18 -91 -73 4 -68 -52 -127 16 44 27 -37 70 156 -26
1756b6O7r2J39k15N2P2j44K20k0K2n4L5q1l6J80j1j32J50k68J90n2j05J27o7N7
$$ -26 41 -51 88 -127 -75 -3 -147 73 53 75 21 56 -25 -61 119 108 -24 126 -142 48 -4 -109 18 -49 8
1781HQ4o4p9K27j24j24q7K33j33J9K2J2o2L0J28j23J4M8n0k1K6j26J29K7N6o7
$$ 8 92 28 -51 176 52 -72 -159 74 -59 -40 -18 -6 -68 -38 90 -33 -19 29 -21 -42 -16 -142 -13 14 70 3
1807CR6m4j30R4L7r4r3J19mJ7j0M3j20M8q0nJ27l9J7k1Q6r9K3n7J08j7j3k5J08
$$ 3 99 55 -75 19 56 -38 -131 -12 -16 1 -9 34 -86 -38 -118 -123 4 -35 -18 -39 47 -52 -29 -86 22 5 -8 -33 75
1836G5K3j99J5MJ2J40p4j17J42N8q5n7l7M7J1j9R6p2J26j68JO0o0J8oJ17j53R7
$$ 75 98 -101 -86 -82 -70 70 -4 -121 21 79 -6 -63 -100 -53 -42 -61 35 -37 89 -79 -78 -18 -78 -60 -66 51 -102 -5
1864ePl0o5l4M9O1K21m19L05j22m7J3J23r3m9j1Q3P8j8m7%r0J30k0o0J31q9l9
$$ -5 2 -28 -93 -127 -78 -17 204 -215 90 -32 -79 -66 57 -36 -85 -96 -13 65 47 0 0 -90 40 20 -40 91 2 -37
1892c7K2O7J1K0q7o2M7N8n8p7P8J47k20OJ59j4j24Jo6nJ84j03j7J17Oj76J79l7
$$ -37 -15 52 63 83 -4 -66 -19 39 -19 -96 -18 129 -91 -85 74 60 -64 -63 -129 -134 50 -53 -70 47 53 -123 56 19
1920A9q0j13J85O6M4j48K7k9J13j71J41l0q7K66l53J57j53K89j19J49k40J23j65
$$ 19 -61 -174 11 77 121 -27 0 -29 84 -87 54 24 -63 203 -150 7 -146 143 24 173 -67 56 -109
1943a09J19K7j0j50J19j27J76K9o7o6J0lj00J34P0j21K24j19p0O6r6j0Q1j49J93
$$ -109 10 37 27 -123 -4 -131 45 74 7 -59 -49 -52 -152 -18 52 -69 155 36 -34 32 -64 -74 7 -142 51
1968E1j76J12j09O5J0N4j02J3j6n6K08j42K5j2m5pJ38np2j5R5r3J14q1j24K26
$$ 51 -125 -13 -122 -57 -47 7 -95 -82 -98 -154 54 -88 -63 -75 -120 -127 11 6 -66 -81 14 -79 35 -46 -170 56
1994E6j43Mk1J88m9j05K6R4r4O7j13O6J16M1j39O0j03Q7j3j46Nm7K63k40O3Q8
$$ 56 -87 -83 -104 84 35 -70 -44 50 -44 23 -90 -24 92 133 -6 54 -49 38 25 -121 -116 -163 100 -140 -77 11
2020A1K9j48J90k2j17o4L29l11J52kk08QJ87j8J0o4r2K56j53Q7q3nJ84j94J2m3
$$ 11 40 -108 82 60 -57 -121 208 -103 49 47 -161 -153 34 16 26 -38 -130 126 -27 60 -23 -28 156 -38 -26 -69
2046f9L3%J26o0rj20Q9J07j64J10jj08N7M3n6m9K07k02M8q4J25p6J29o0j51J64
$$ -69 -36 -36 90 30 21 -99 -10 97 -67 43 42 -66 -9 34 -22 -71 136 -66 -18 -102 23 -53 76 16 -135 29
2072B9o7j7j17Q7J50q2J67k23J25p3P3p7K03j99J06j64Q1J47k44J48j04j2K2k
$$ 29 -38 -55 -172 -85 65 -17 150 -73 52 -21 52 -25 178 -21 85 -79 2 149 -95 53 -51 -63 -41 -43
2096d3Q9J63l66J95R4j10j00m5K13j77l4R2M2k7J3J19K9j98J89q0p1O0N5n6j92
$$ -43 46 209 -157 38 132 22 -78 -123 90 -87 -121 -29 13 -14 -1 118 147 -51 138 58 -13 47 102 46 -146
2121a46l8J31J24O8j32M6Nj81P2l5K8L3J72j18J6%J2m7NJ30r7m9nj11K85j86p
$$ -146 -184 -53 71 139 7 53 58 -123 -51 -86 -58 -25 147 29 45 45 57 10 15 145 48 -1 -6 -117 168 -18 -25
2148b5O6j5k8j04Q0q0P3K8L9P1k32J58j21o6J27m9J34pj59K71j69k6J34j8j55
$$ -25 41 26 -2 -106 -26 -106 -33 -5 34 105 -127 31 -90 -156 -29 -78 56 49 -110 161 -8 -34 100 82 -73
2173g3K5P0P2o0j7J29j03l8j13R0J1n4Q7Q1j02J4j01L3J80j71Kj03J85kj4j14
$$ -73 -48 22 94 34 17 146 43 5 -108 -18 -7 -61 26 107 5 19 -82 -49 131 -40 -38 -141 44 42 28 -86
2199h6L1m6K1J26m2P5j61J38M2j55R2k26K17r9O0p9J45L7j34m0O8P8j85J05n7
$$ -86 -55 -101 -80 46 4 79 -82 56 98 -57 35 -191 26 -73 -13 -92 53 90 -44 -84 -16 62 -123 -18 -75
2224g5l7J30l8J51r2r0J98K8k75J90j19%q3R3L8m3mrJ85j35L6n3lJ08k56M3K2
$$ -75 -112 18 -20 131 39 -51 147 175 -100 90 -29 -29 -112 -19 19 -24 -28 -37 148 13 49 -4 -7 101 -155 -112 -90
2251i0K11k0r7k8J49k23p8J40K28k10N4j30k7J62JM2P1k75P2J11j56n9L5K04j46
$$ -90 121 101 4 -24 125 -98 -176 -36 192 -18 36 -94 -121 41 42 84 155 -120 -48 63 -93 -152 -117 87 -59
2276e9L2O7o1rJ04r1qm8J29l8J0j60J72Pr2J48j16q1M0K42l11P2J27j6Q4m4j34
$$ -59 -27 40 -21 -30 74 -17 -25 -73 56 18 28 -132 40 47 -45 103 -13 -94 -54 188 -123 -51 76 60 144 100 -34
2303c4q4J54L7KK5m5j05J92l02J47j6R0k46Q9R1K2j18J64K4q5M5j52q4Q6L3PJ27
$$ -34 -118 36 73 75 100 55 -50 142 -160 -13 -29 61 -185 -96 -5 17 -101 63 87 2 47 -105 -189 -103 -70 -63 64
2330F4J6j3j25p9O7R1m9r5J65q8K9K4m0r8Q5O9j42J47q7J49ooj02p8m4J09L1l2
$$ 64 80 67 -58 -137 -70 21 -28 -123 42 -46 -17 7 -33 -131 -46 23 -119 28 -59 90 84 78 -24 -102 -146 -37 -6 -38
2358c8l0R8K7p9l1L3j9J01p7l9j17O2L9O4q5J20J42K5j58r9R6j10L7j1j30J83
$$ -38 -68 30 57 -22 -53 -20 -39 62 -15 -54 -171 -109 -70 -6 -91 29 171 196 38 -61 35 -75 -38 -49 -179 4
2384Dj44K5N2j04K98j02o0J83k01k4OJ1p3P8Q2l8o1q4j03J88j3J42j76L7J61o0
$$ 4 -140 -115 -63 -167 131 29 -31 152 -49 -73 -67 -56 -129 -51 31 -7 -68 -152 -255 -67 -80 62 -114 -77 84 24
2410B4j02n8K19k75R4J67L2L1k10L3Q6kJ08j52O9N9r8j57J57K7q6K9J20r8K8o9
$$ 24 -78 -136 83 -192 -98 69 101 132 -78 -45 41 39 147 -5 64 123 25 -132 25 52 -34 -5 115 17 45 -24
2436b4J37r6Nn9P6Q9j26J5m2N6l7L1j28M7J16j0j24J35r0L5p3O5O6J2j40M1J6
$$ -24 113 17 22 -37 39 128 2 17 -25 31 -6 25 -103 -56 60 50 -74 61 -29 6 -67 -2 64 76 -64 -23 -7
2463gNj7J33n3Q4j10l1l2k01K72j17N9m8n8N1M4KO9j21K08P9k92J16q8n3J09R4
$$ -7 -2 -19 114 61 145 35 4 -28 -229 43 -74 -15 -63 -121 -70 -26 -24 45 -76 132 211 -81 35 -53 -106 3 97
2490I7j08O6K2M6j76K12q7p2j38O9LJ17k4l8J5n7J17j33N0p5m7K79k40N3R2j15
$$ 97 -11 55 77 123 -53 159 72 0 -138 -69 -66 51 27 -11 4 -53 64 -69 -19 -94 -141 138 -102 -49 43 -72
2516g2J61j12j00O6jqJ0J20m6J17l0j34J06p8j7j10K05p7m5J12k0P9j62Q7J03
$$ -72 89 -23 -123 -57 -58 -66 -56 64 18 135 105 -29 77 -1 -18 -128 77 0 -45 67 47 126 -36 51 154
2541A54k6Rj94J1J41NJ5j38l2R2J9o1r9R7j48K10j33J54k14J14J19j69Q9o2p7
$$ 154 128 137 -57 -46 95 100 115 -23 -55 37 56 -5 -104 -7 -155 55 -78 76 -138 -24 95 -74 15 -47 -124
2566a24K58m2j15j5j00K67m2KJ0k65J72J63j04q6K2j71J71O7N2k2M4q7ok0p8R0
$$ -124 134 92 -23 -38 -138 129 87 89 99 -166 6 169 65 -21 1 -170 1 68 120 98 142 55 49 29 -49 41
2592D1j66Q3L7l0Q6Lq6J62o0k1R7j57m1p0P8K02j24l3K6L3n2J63j26j5m2L0M4
$$ 41 -125 -42 -5 -35 51 54 -32 130 70 49 146 -11 -52 -122 -44 158 34 1 27 60 8 171 45 30 -12 18 62
2619F2n3k01J98j57J60N9M0r0j07O6%J20j18N3l8N5k8n2kJ6J30j8M7j08k63J17
$$ 62 9 -192 6 -151 9 68 108 18 -89 -23 -23 97 -21 32 -6 49 21 -31 -33 -17 113 95 142 34 -229 -112
2645a12K47k44L38k31lP2l6j7mP0Mk47K52n4j27K38k97K53j88m2L4K21n2j29M1
$$ -112 135 -109 229 -2 -5 67 31 14 10 80 84 -163 89 35 -92 146 -151 102 -86 -128 -94 127 75 -54 -13
2670a3l5J03j47J66j20o2J17j81K52j8q6J8j28J40K1O3k0p8J90j80J05%r9m0N
$$ -13 -48 55 -92 74 -46 -108 9 -172 80 62 -24 -6 -134 6 27 90 70 -8 182 2 107 107 8 -32 -27
2695b7M6k1%n4M4m8k5O5J93k65n1J58L7j6J1m1Q1q2J8j52J12Oj2K4l11M10r5O5
$$ -27 19 -2 -2 -56 -12 -60 -85 -20 173 -92 -143 15 52 36 47 6 87 5 23 -129 -17 -11 -23 1 -310 100 5 70
2723G0k04m8K31j9j13K14n3o6kJ9n9N0j06J92k1n8rk54K59k6q5m3P6J02k8j06
$$ 70 -134 -182 49 30 -83 131 78 12 10 29 -30 20 -86 106 85 27 18 -236 23 -3 -88 -131 -55 47 19 -87
2749h7J03m1r1J17L1J3j06NJ18N9q1k94L06J60k29j58K02L3J63k63J1n2P6m8J04
$$ -87 16 -25 -116 1 32 45 -61 -56 62 121 40 -254 52 212 -17 -175 27 60 223 -40 -29 -81 -5 -53 51
2774E1J71l04K07j11M6r9l2J11j27qJ21N6k35J98M6m2j91K55lj36o0J47r4K4O3
$$ 51 222 -82 125 14 60 -39 -71 40 -87 -95 26 82 -153 45 91 49 -142 113 110 -26 -86 61 -33 -9 54
2799E4j36K11k10K00j56O5j09l8J44M3m8J9j07O3JQK0Nk23J84K7Q7j04KJ45j02
$$ 54 -82 129 -81 119 -37 28 -81 -119 25 68 20 39 -68 -5 -4 4 24 29 -194 -10 17 104 0 2 147 45
2825D5O1j36m5R9j61J70K4m2k6J38j59O8r1m8K95m6j15RK5m1r1J19P4j13j33N6
$$ 45 106 -30 -75 24 -137 33 57 15 -11 127 -32 36 -55 -103 192 146 31 40 65 24 -67 52 126 13 -120 -64
2851f4K4JM7j03n8J64J99k26R7K2r4qN2p9K8m9P9j40J59n8J16K5l22K95k0j61
$$ -64 -40 -39 8 -95 -153 11 210 -16 81 103 9 1 53 -26 2 -47 32 -108 51 -7 109 134 -188 107 87 -74
2877g4O9M2o5J54j66n2J89o2p8l1Q2p5j6PO2J30j36j8Q0Oo5J7L8nl1M3K4r1j30
$$ -74 -5 37 -28 126 -40 -92 97 35 -43 -74 8 -67 -83 -76 -14 116 -20 -38 42 48 -17 0 38 33 2 45 69 -22 -152
2906a52K27J08k79RJ80k65J54J5N1pm0n0P1q9J9QJ3M5M9j31j1J41Q0l2m2j25J55
$$ -152 75 183 -96 -87 93 -172 -18 -3 48 41 1 -49 22 -67 -48 -40 -27 18 67 -64 -75 66 146 114 72 -53 102
2933A02P4j17q6j39K64N1k46N7K4K4J61jj49m9Q6k3j51J98j35r5J13j5J21jp7
$$ 102 176 59 -27 -166 98 149 -97 -40 -16 8 169 168 19 -30 56 33 -118 80 -55 -150 -37 -52 69 68 -9
2958iJ23p7n6L2k24K64L1l2O0j79J41j58m2L9k2J22j12J56kJ7k2R7j16P5j86J45
$$ -9 114 37 -19 13 -211 53 84 52 112 -67 74 -84 -126 -87 -109 13 -99 57 55 72 50 147 31 106 -80 65
2984F5k36L69j92l4R4j6K5j38J1Q2k1k7p1J42K1j76Q2J41k1j19Rrk4k07J45J52
$$ 65 -171 198 6 -28 66 50 75 -63 -52 30 9 -18 -89 53 74 -102 -20 121 100 -19 -10 -19 -43 -250 -105 47
3010D7J01k9j61J42M5j31O9K3m4j74NJ64j33Qj4J46O0j13J53L1j40o5J20j25j0
$$ 47 148 119 -42 100 145 14 83 106 62 -112 -107 57 -76 -68 -82 64 124 11 164 195 55 -10 110 -15 -25
3035b5Q4j99K60j95N0k7J18m8Ro7n3J35K8l3j02O8K4o5l9J53j42R9q8J83j53M1
$$ -25 59 -140 120 -75 -25 -52 66 18 27 -40 -93 42 70 37 -65 3 27 -38 -77 76 -66 33 -55 128 -25 16
3061A6m9qJ13j35J3n8K36jj13j5m8J26L9q4j05R5j01J31l4k2Q1j28J03m8p7R3
$$ 16 -33 -41 72 -63 -50 -108 128 127 14 -1 -49 77 116 32 -73 22 -79 52 18 -4 77 -51 52 4 -73 20
3087B0J23j57n2K51l18K57l11J55J61j74M9r4R1K8j09N7M5PJ24k31jO0n5J04o5
$$ 20 143 -14 -66 185 -133 124 -187 -32 129 -45 4 -90 1 29 -80 -23 22 29 153 -78 -79 -19 -74 30 -35
3112c5kk7K7J14n7J6r9J19p6q3N7J20q1k6J59k35J78pp7j50j0K31j30R0o2N4L4
$$ -35 -37 -64 -37 77 20 36 -63 56 -20 -103 -46 74 -7 -33 126 -109 69 62 -15 -165 -175 56 -74 16 -46 8 42
3139D2kj31L1q4J50lk12J42J45K6j23L4O7M7j52J86j16o0J06p0q6J95k22J49j09
$$ 42 40 -91 -60 -144 6 3 -209 -67 78 104 -19 15 82 129 -23 163 47 -13 93 23 -63 132 -90 59 -50
3164e0N7P7n5j21K06j73M1J01k80K44J2pj19N9K5kP7j52J25J34j63j72j5K05q
$$ -50 7 84 29 -92 114 -59 -18 83 -197 47 59 52 -67 -8 17 15 92 -60 65 199 36 -136 -151 54 46
3189D6m5r2K99j20k6j9j35n7K20q1P3j88J98l3j0o2O8j65J63j86K17k8J02p4p6
$$ 46 1 -91 208 88 62 43 -92 -149 71 -10 63 -125 73 40 30 -32 36 -129 34 -152 65 37 139 65 -11
3214a1Q2j60N1J51j85J83p1j34J04j5p7J65k70K58m6Q3j59o5n2L17k27Q1k55J08
$$ -11 71 -89 -38 113 -72 111 40 -94 10 -5 -82 83 -187 71 25 108 -51 -116 -168 149 -78 3 -252 -144
3238a44J65M5p8j6Km0J8J25k4j8Q3j00j2qm1J26l0j55J25o8K11k04N9rQ7m3j52
$$ -144 21 66 -12 -28 -26 -66 -48 77 53 35 118 18 6 -2 -43 83 53 -102 23 -45 166 -38 21 12 99 56 -96
3265i6O8o7K3M8J30k36K38n5J36k25k8R0r0m6J53l9l0o7o4j0K33j5k4L8r1o5l9
$$ -96 -28 -95 -72 -24 106 -130 108 53 189 -36 -64 26 -64 -110 43 4 -26 -93 -157 -167 66 51 27 65 -26 -91 -130
3292a30J35R6oj3l7k7r5R6L1j00Q2r9J43r4j08K07j47K00q5j29L7J23j07J32k02
$$ -130 5 101 95 82 45 18 -77 19 50 -50 32 -67 76 -18 -126 81 -66 134 49 -80 -43 80 -27 105 -97
3317i7OJ09O0q0j43L21l12o3K15P6j56J54j22QJ03k42K78K0r7m7j5j04K58r4r6
$$ -97 -91 18 78 -2 -145 176 -136 -199 16 92 -64 90 -32 -24 79 -163 115 135 38 -9 -24 -128 130 36 -60
3342f0J50%M1p4p4J27p4L5r0q6N8M0m1J88j74m7J18j43O7L3QJ85k61N2l3M8J14
$$ -60 90 90 131 57 -17 110 36 71 -19 -105 -47 -7 -48 140 -34 -81 37 -106 -39 -6 2 187 -74 -22 -55 -7 107
3369A07J31k05j26l4J94j81k8K03j05R1L0j40N5k7j5N7l6J67j91J70r2P0j20K2
$$ 107 238 33 -93 -127 67 -114 -142 61 -44 47 77 -63 -8 -35 -50 7 -29 138 -53 117 25 95 -25 -3
3393cj5j38J81n7P9P3j13r3J13q8Q1j7p4n0N2J7m7J86k38J76q2K2L6m2m7O9m3
$$ -3 -18 -156 25 -32 47 120 7 -86 27 -61 20 3 -71 -121 -69 -52 -99 87 -151 25 -57 -35 1 -41 -88 -19 -62
3420f2P8j55J71J7J01k33N6p3J43q0j18J82k34L34j86R0l4Q4K7p0o3jP8R1o0p4
$$ -62 16 -139 32 49 150 -83 -27 -100 43 -37 -155 27 -207 127 -59 31 -3 81 108 38 -25 -26 52 143 83 9
3446IJ55Rk96l3K09Nk11NK05p9m2J48j81K62j10j6j43J01n5K3RMn4m5J11L3j21
$$ 9 164 173 -123 -156 53 58 -153 -148 57 -22 -64 84 -97 165 55 39 -104 -3 -58 -35 -26 -22 -76 -121 -10 23 -98
3473i8rK54q3q6J14j06J0l7j2P3p3P8j58N6%K38j09mk80L06j64MN8NN4K1j34N3
$$ -98 -107 147 64 -22 92 -14 -4 -41 -53 20 -53 25 -133 -77 -77 161 52 48 -232 74 -90 -86 -28 -23 31 52 -82 -29
3501b9l1J32J13k20o6q7K19L5j79R6o4L38k96J53k28J26j80J50m3j14K66m9R4
$$ -29 -60 72 185 -35 -101 -188 31 66 -113 -17 -81 257 -39 114 -114 12 -168 -18 -61 -175 91 42 136
3524A36j39J55j98L7j07O6N1j6J73j35lJ5Q8j81j8Q3n4Q5RO4K6j00j68K16M3n4
$$ 136 -3 152 -46 -9 -116 -50 1 -15 158 23 20 35 123 -58 -76 7 -47 38 47 111 137 37 -131 85 128 74
3550G4n3o3O2oj93J25k2J09J8k26P1P7l1J21Kj43J66r1P5j04Q5j61L1m1nj4k1
$$ 74 21 -42 20 14 -179 -54 -76 33 51 -175 -104 -27 -58 63 65 -78 88 -3 72 -32 53 -108 -77 -118 -123 -137 -158
3577a58K87j96J08P9j85O1q4P4Q4j74J38j71%J85L5k40K54L9o6q1J61j11r9m6
$$ -158 129 -67 41 120 -65 -4 -88 -14 70 -104 34 -137 -137 48 83 -157 97 136 70 -11 150 39 -60 -106
3601a06l8J42J98k70K29k63O5M0P6n8o3J33j15O5QL8o9rp2J28n4N2Q4k75O5R4
$$ -106 -144 -2 196 -74 155 -108 -43 -3 73 15 -48 85 -30 35 43 81 12 3 -69 59 5 57 141 -134 -69 25
3627B5N1m6p8m4L3J18N2j94N4j5L8p0J41kj85J58q2L8J23j51m9O9K00j73l9j86
$$ 25 76 30 -48 -92 -59 59 111 -83 -29 -44 -6 -76 65 63 -122 36 -46 -8 115 -36 -85 -16 184 11 -28 -214
3653b14J81j4J8l3l8J97j44m6J24L5L8p8l8J2J32j30k6l7NJ66q4m0j34J76J0J2
$$ -214 -33 -47 -29 -62 -100 97 -47 -93 31 66 104 26 -12 0 132 2 -24 -61 -56 110 26 -14 -148 28 38 50
3679E0mr3K80k93J87j77J9R8l2j56J57r0J31PQ6k41K08j6j34p5J2L52j91p9j40
$$ 50 46 -47 233 -60 127 -50 -31 67 35 -121 36 -54 77 84 170 -71 137 121 -13 -88 -76 276 85 6 -134
3704a34J90n5K8o4JP4q3m9L5J58j61J49l6j8n2l1j9J55j13J5J00r5j52K14j20
$$ -134 56 1 29 -35 -34 40 -43 -92 -57 101 -60 89 53 35 -17 -48 -67 88 -25 -10 90 -5 -157 57 -63
3729f3J58l8j72K14p9j87K39j19P5n5J8Q4p6k2Q3q0k2Q7j20J84k99J96Q3No4R
$$ -63 95 57 -115 99 20 -167 72 -47 28 -27 -9 75 -1 -23 60 -20 -42 45 -75 109 -190 6 89 94 30 39
3755C9K6j25J12M1jj41l5N5J40j19q3J68J3Nr2P0j03J51o7j26J21j08OQ4Njj43
$$ 39 65 -60 52 93 92 -49 -84 -29 111 -8 -91 77 90 95 3 73 -30 121 54 -72 49 -59 -53 31 36 35 -108
3782a08L1J09k2j23N6M6J6m1J31K5j56P2L3j3j11J64n2Q0k03J47j87K16k27J84
$$ -108 -77 32 10 -113 -57 -11 5 -36 95 120 -36 36 69 56 -55 109 57 137 -66 81 -106 110 -117 67
3806F7jp2P0n0J46k09O9q9K9J26n7r3o3J24M5L6q3j5j9J33j94P9P0j18O5J51j13
$$ 67 66 -6 64 14 160 -49 20 -69 -40 86 29 -64 -127 -3 42 78 -5 -20 -39 94 -100 -21 49 -69 -4 147 34
3833C4k6j01J5P0N0M1m9Kp0k2J65q3r5J56k5j40RjJ10K3J8p8J96l43O2K6J19k49
$$ 34 8 -93 -78 -8 42 83 34 36 -34 -56 109 26 -69 87 62 -78 -69 -70 40 63 81 3 199 -144 -82 -56 63 -186
3861a86J30N2N9k2q0J07k08J12K5L3Q8K3K1J0P2k56P2m5j59Q8J56j74J73j34k2
$$ -186 -56 -4 55 33 -47 60 -148 -36 -11 22 110 133 154 164 236 -20 52 7 -152 -64 92 -82 91 -43 -65
3886f5Q0r8J51q4M5o7J73j05j39J2L5K7J63j76j65J24N2J90k05O9m5knJ23l5p5
$$ -65 15 -83 68 -16 29 -38 135 30 -109 -97 -62 -35 128 -48 -213 -89 -37 153 -52 17 -28 -30 -35 88 53 -22
3912b2K2J62k63Q2O9K3nK3j04R1k33K06J13j14n2j45J88l0j93K9Q7j8J06j02R8
$$ -22 0 162 -101 -19 50 73 68 91 -13 78 -155 51 164 50 -2 -147 41 11 -182 -153 -66 -84 22 -80 18
3937A8j58K43o1k6j3J59l22R2M5P9n7p1J89k06Q4K7mj99J32J31j00qJ14p1K6L2
$$ 18 -140 103 42 16 3 162 -160 -68 -23 56 -1 -72 117 -89 -5 22 18 -181 -49 82 -18 -26 88 17 43 75
3963G5k33Q3P6J22J1j79J24m0J6j56J71K5Mj54N3LJ0n9O8J4n3p4K21j97K28j75
$$ 75 -158 -75 1 123 134 -45 79 39 55 -101 70 95 99 -55 -2 1 11 -48 20 34 -19 -93 128 -69 159 -16
3989a6M5j34K17j85L1J00n2j07J34Q9j45J13j52J12kL8l4O6k14J52k35J88O7m8
$$ -16 29 -105 112 -73 -42 58 6 -101 33 122 -23 90 -62 50 48 86 52 118 -96 56 -179 9 76 28
4013B8M4n0j34K79j92K5o4R2p9LJ45j07k0n5K80j65j2j33O4Q4oq9K25n4j71J89
$$ 28 72 22 -112 167 -25 0 -64 28 -51 -48 97 -10 -30 -85 195 30 18 -115 -51 33 27 -62 163 109 -62 127
4039A27q9l1N0j9j00M5K08k56P5P1q2O3q3j3Q5k58K14Q5k0J15j01m4R5o1k09L25
$$ 127 38 7 57 38 -62 -17 191 -65 10 81 -1 62 -21 -34 51 -207 7 92 72 187 86 42 137 76 -133 192
4065A92j06J2m1m7J0J19k81J06j7O8J04j05j57m9J98J40m0k32J41J8r1o6L1l9
$$ 192 86 98 57 10 20 139 -142 -36 -53 15 119 14 -143 -192 6 146 106 -126 15 33 -58 -124 -93 -132
4089a32M5L4N6O7r3o6l2J44O6j24J12n6j0P3k31P9J12k15J22Q6k7j02K52j68q9
$$ -132 -87 -53 3 70 -23 -89 -121 23 89 -35 77 21 11 84 -147 -68 44 -171 -49 37 10 -92 160 -8 -97
4114i7K6Q7N7p6J22j91L5jJ67j63l3K0O6jJ7r1P4O8j74J50q8J16j8l10K28L4K8
$$ -97 -71 16 73 -3 119 -72 -37 -38 129 -34 -67 -47 19 18 35 -56 18 86 -88 62 -26 90 72 -238 -10 24 52
4141E2M7k4j3j27J71K3r1LL4j18M5j38J68p5J65O3k04nJ04q3L2j5r1OR2m9R9j69
$$ 52 99 75 62 -65 106 129 38 41 75 -43 2 -136 32 -43 122 185 -19 -24 80 -3 29 14 -77 -71 21 -28 71 -98
4169i8J43p7j1j25J46Q5k55j8J83j9o7J71k67J75m4k3R4PK2k7p2j54K65J12j29
$$ -98 45 -32 -43 -168 -22 63 -192 -210 -27 -46 -113 58 -209 -34 -78 -101 -7 0 22 -5 -77 -231 34 146 17
4194A7j03K8J01J43q7r5N8O9k12M6J27j10M7o9k9L0K04j80p2P2pJ49q3j24J76
$$ 17 -86 -58 43 186 99 4 62 131 -81 -35 92 -18 29 -40 -69 -39 165 -15 -87 -15 -22 127 44 -80 96
4219I6l2J03m6r6k6P1N8j31j8J43k94j0J02o1L9J21k4Q4j55O0L5l7J36l94L17
$$ 96 64 167 121 25 -1 70 128 -3 -21 122 -172 -182 -80 -141 -102 19 -5 79 -76 -16 19 -18 118 -276 41
4244D1K9K9j72J44n6j95L60k19K7L8j27l8J83K5l8k28K78Rp0k32J86k3J16k2j11
$$ 41 70 99 -73 71 15 -180 180 -39 -12 26 -101 -139 44 69 31 -197 81 90 20 -212 -26 -49 67 45 -66
4269f6Q3q2n0K05q4J2o8J19j06o2J29k01J01qR6p0j9p1Q4p4Q0K30j76j93L57r4
$$ -66 17 -65 -115 90 6 18 -50 69 -37 -99 30 -171 -70 -78 18 -52 -71 -142 -58 -132 -52 178 2 -191 166 72
4295G2p2n4J43j25M8L9q4l0N5K28q7q4m0m1m8K05j81J67j51J07n3o6J12k24K04
$$ 72 0 -54 89 -36 12 51 -33 -63 -8 220 133 49 9 -32 -80 125 -56 111 -40 67 14 -52 60 -164 40
4320D0K7r8L1o7J02q8O1j9kn0q1J93LJ1j08J53q4o5P3nq6P2O8n1j38J14j15J83
$$ 40 67 -31 0 -67 35 -53 8 -11 -13 -63 -144 49 52 63 -45 108 24 -41 32 27 -59 13 81 30 -108 6 -109 74
4348G4j84J28j02Q7k4J6m7Q8m7O8j27J21P0j92j33K92k58K40j36M26n08J76J11
$$ 74 -110 18 -84 3 -21 -5 -52 36 -11 57 -70 51 121 -71 -204 88 -170 70 -66 360 -148 28 139
4371A39o0L3k67J32J53k69J23j24R9N0j60K99k00l7K20O5j61J23j84J7r0L16k51
$$ 139 79 112 -155 -23 130 -139 -16 -140 -41 9 -151 148 -52 -89 131 196 35 158 -26 -9 -99 217 -34
4394c4J05k04J78p9pJ98j69p0RJ55j40K6J11l7j0k4l7q3J16n4J31j18l2l5J85
$$ -34 71 -133 45 -34 -41 157 -12 -82 -73 82 -58 -32 79 42 32 8 -29 -112 4 -50 81 -37 -69 -104 81
4419H1k34L75j22k24J43P5mj44M2O6k57J61l3K07j75m0L4l1R1J5J47l20R4rqM8
$$ 81 -153 222 100 -124 19 94 90 -54 -12 54 -203 -42 -75 132 -43 -83 -49 -80 11 26 173 -147 -53 -62 -70 -22
4445b2N3J8j18M2J23n5Q0j23O3n3o6K5oO5l2j96J83q8K01o2j1m6M5r3k4K29k72
$$ -22 31 49 -69 -27 96 41 121 -2 61 8 -58 -33 -39 26 -6 -202 -19 -107 94 32 21 -25 20 -73 -97 132 -140
4472a40K07p5j37J61R7k11M7k2P3j02O5J21m9o0k2Nq1J63l6%K27l16Q7M2j35J90
$$ -140 67 -8 -145 16 113 -98 -51 -73 0 -102 -37 84 35 -25 -47 -42 -123 40 4 4 231 -85 2 44 -91 99
4498I9r2m9m6l7J96r8J17m2r6m8L7K63j81O8q9J3pLl8Q8L2j13J72j48J7j12J32
$$ 99 7 -42 -88 -125 71 -27 90 48 -48 -96 -59 204 23 91 2 15 8 11 -27 61 93 -20 152 4 21 -91 41
4525D1m8M8l6j9N4j16L4J26oj36Q9m0O5j3j15m2O4J44k09O8J24j0j85M7J30Q1
$$ 41 -7 41 5 -14 40 -76 -42 84 78 -58 31 -9 56 43 -72 -114 -50 94 -115 -47 77 67 -118 -71 59 140
4551A40k13J91j10j41J47oQ8Mj74L1J03JK0j47N3o1M2lJ54j12L1M5o9j8K6N3j72
$$ 140 -73 118 8 -133 14 8 96 100 -74 -43 60 61 81 -66 -13 -74 -32 -35 119 7 38 83 14 -4 22 75 -97
4578i7P7j0k2M4K02k50J70r4J8m6O1K8o5Mq8J15j07Q4K5k03K08p4l6J96j31J0
$$ -97 -20 -30 -52 -8 194 -56 114 20 38 -8 53 81 16 20 -68 47 -60 24 49 -154 54 -20 -56 140 9 19
4604A9m3Q0j70J47M7j36J60j36K4P0q6M4O8m6o2q9%K19j2j69J00L6j79Q4o9R3
$$ 19 -24 56 -114 33 80 -56 104 -32 -8 62 -24 20 88 42 -20 -109 -109 110 98 -71 29 65 -114 -30 -99 -6
4630fm6N9L4kk13J02J28j0K9j50O3o7P6K06k33nj05J38PN2mm3l5R0j11J24n6J22
$$ -6 -52 7 41 39 -174 -72 56 46 75 -75 -12 -79 -3 203 -30 -35 -140 -2 5 57 53 10 -25 65 -46 78 22 144
4658A44p7Q4m6j06Q7p5Q0k04J00J14o9p7J44j43m5N3J39J42l24J90k37L8M1J96
$$ 144 67 151 105 -1 86 11 91 -113 -13 101 32 -45 99 -44 -89 -36 103 245 -79 111 -126 -88 -47 149
4682A49q3L0O4L5j59j03j13pJ49R9M5l11J15K79k98J39q0J00j32l0J42k7Q1p3
$$ 149 66 96 160 195 36 -67 -180 -187 -38 61 106 -205 -90 189 -109 30 -50 50 -82 -112 30 3 84 11
4706A1n9N1n4N6K0j27O6J48j94O4n3J07O1N5k08J16m1O3K9j87Rk9K1qJ15k0Lj10
$$ 11 -48 3 -51 5 25 -102 -36 112 -82 -18 -71 36 97 152 -56 60 19 82 111 -76 -67 -96 -75 -83 32 12 15 -95
4734i5M3J16p9J57j81J71j38j08M1k5P6L7N5J3Jj41J62k51K92Rr3Rj28j1L7K3
$$ -95 -52 64 -15 142 -39 132 -6 -114 -73 -98 -22 15 70 83 84 -57 105 -146 146 155 62 71 -57 -68 -31 -8
4760hL6n8M4j06J83j31n1J09M6j48R3KLj18k3J92k12K50k82J38M1k2J21j82LR9
$$ -8 28 -30 14 -92 91 -40 -91 18 64 -84 9 11 14 -104 -127 65 -147 103 -179 -41 0 -22 99 -83 -80 19
4786A9p0k17L10k0k12J23J02J31j18j28J60P8k50J53j08Q9J8k45J16J39q3P2r8
$$ 19 -51 -268 42 22 -190 -67 35 166 48 -80 80 158 -92 61 -47 42 60 -185 -69 70 -13 59 -39
4809c9O4j08P8rM2j55kJ79j85O2LO5P1m1P1j0q6K1q4J07pQj32K60j45j4j48R2
$$ -39 25 -83 -5 -14 28 -127 -129 50 -135 -73 -70 -5 66 25 96 86 0 21 -63 44 37 45 -87 173 28 14 -134 -42
4837d2lN9J10o1q7L00k57k3m3o7R3P5j07l0O0lL8Q9j55J05L8k27J13J1p7J66O
$$ -42 -45 14 124 63 -24 276 19 -4 -47 -114 -21 54 -53 -83 -23 -26 12 101 -54 51 89 -138 -25 -14 -91 75 81
4864H1p4j8o3p8p5K39J34r0p5P0J03k15J18j47J66o4J1l2J07J4q4J2J3j04J95
$$ 81 7 -11 -74 -152 -227 12 146 56 -19 51 154 -61 57 -90 76 12 23 -9 98 112 28 40 53 -51 144
4889A44j44L5j24R9L3j73K09j67O4l3J38o1Mm2N2mJ8j04O1M0p6O5p5O6l2Q5P0
$$ 144 0 35 -89 10 43 -130 79 -88 -24 -57 81 20 24 -18 34 30 48 -56 5 45 -31 34 -41 25 -7 78 148
4916A48k24Q5L6k7Q1j38L0K2l1j6LP5kL5q3O4J20k48k0J09j67J21p4Q7RO8o1J26
$$ 148 -76 9 45 18 99 -39 -9 13 -18 -34 -31 44 42 77 -6 58 178 -70 -90 19 -148 -27 -101 -14 -5 63 2 128
4944A28q5r1k0J30N2n7J16k7j76J87j72K6L7Pl4RN8q7L7k9N2q7o0P3q0Q5L9J9
$$ 128 43 -48 -68 62 114 57 173 146 -30 157 -15 11 48 55 21 30 88 1 38 9 61 -26 -86 -13 -93 -8 31 50
4972E0n1J3R1J3l9j09j12K03k1N4Lk04L30l14J59j28J11j23N9P7m5j11J54Ll8
$$ 50 -1 12 103 116 77 -32 -144 59 38 92 95 -109 221 -93 66 -62 49 -74 -15 62 17 -94 60 63 25
4997B5p1P8k5l1L1r5J72k53K21L9p7m8M4j2k5nR5Mk70J73K13j30j04J09o5j44
$$ 25 -46 32 7 -24 7 -88 84 -169 52 91 14 -34 10 -2 -27 -32 63 67 -203 -30 183 53 -51 58 -7 -151
5023a51J56l1j39J26J0l4J39j01Q1k4j1l9j16%P6K1J19J5j78N4k5p8R4j5o0J23
$$ -151 5 -26 -165 -39 -29 -63 76 -25 56 32 21 -18 -134 -134 -58 -37 82 97 -81 -27 -52 -130 -36 -51 -111 12
5049A2P0j25O7L7j95J38k1M7J9n6k0P7m2L8J17k80J36p7j38K58p2N4m1j94J96
$$ 12 82 -43 24 61 -134 4 -17 30 49 -7 -27 50 8 46 163 -117 19 -58 -196 62 -10 44 3 -191 5
5074Eq5K56M9k14pj24J62q5n1J59m3oM1j0L6o7o3M4lo0J53j25Q2L7q6Lj4R0r0
$$ 5 -80 176 225 11 4 -120 42 -43 -94 65 22 16 57 47 83 16 -47 -3 -6 -66 87 -38 44 81 -5 -2 -16 74 -16
5103a6L9j62K7J96n9M6P8q2q5r2J62j73J19J24j79Q4jj2N0J37q3o1K1j5j24P7
$$ -16 23 -139 -112 84 25 71 149 67 -18 -110 52 -121 -2 122 -57 27 26 14 64 201 118 57 78 63 -61 16
5129A6j3l6J60k84P0J15p9m0J37L6k08Q7Q6k9j54J16p0N4J35o0r4J3q9P0J7M6
$$ 16 3 -33 127 -157 -87 28 -51 -91 46 82 -126 -39 47 18 -136 -20 -90 -36 99 39 -55 -42 -131 -61 -44 2
5155Bj79K07j34J18j40L5R8O7m8rJ67j67R8j01P7N1j67j12J99o2k6o8j3J17q7
$$ 2 -177 30 -104 14 -126 -91 7 74 26 17 184 17 115 14 91 142 -25 -137 62 0 -26 -94 -107 10 -77
5180g7%M3n8L0P7K06j31j01o2Q1L8k8j26R7j36R7J40r7J55m5r3J3Q0m4k7r2J84
$$ -77 -77 -34 -92 -62 15 221 90 -11 -73 8 46 18 -108 -11 -147 -50 90 -7 148 103 10 23 103 59 32 -60 124
5207A24j81J17o5j02J11M6k28J16R5n7P3r4R8o3K9p3O9k3KJ0k1R7j58R5j28J74
$$ 124 -57 60 -5 -107 4 50 -178 -62 33 -24 49 -45 53 -10 19 -54 15 -8 -6 4 -17 80 -78 17 -111 63
5233F3M5j95M0P8J3j52N6j11K09o8M6J1q0R6p8O7m6L0M1l5l1o7L0N7rM2j5k5m9
$$ 63 108 -87 -47 31 44 -108 -52 -163 46 -22 24 35 -45 51 -27 40 -6 24 65 30 -1 -68 -38 19 10 52 37 12 -37
5262c7J8kj07P9K13j18l1r1k1K06j86J00m4N0K0j8k61J89J7q4J1Q1j05Jq1J14
$$ -37 -19 -21 -128 -49 164 46 15 -76 -97 109 -77 23 -21 29 49 31 -230 -41 -24 -108 -97 -16 -121 -120 -201 -87
5288h7M8P5j6N7l2l4M7k3j29J3J4K1m5M0N7J14L4j60J84k15n3K29m7k59J97O1
$$ -87 -39 36 20 77 45 11 58 35 -94 -81 -67 -46 -91 -51 6 120 154 -6 178 -37 -90 139 92 -167 30 91
5314I1k14J77j64P1m3M2k5jJ12j46q3J89KL8n8k7j4J5K86j46j78K4K1L2l9Jr5
$$ 91 -123 54 -110 -39 -82 -40 -65 -66 46 -100 -183 6 8 46 -12 -39 -53 -38 248 102 -76 -52 -31 1 -38 -37 -132
5341a32L4J24O7j20r3K55j25K3M5j45J53j14k8p6P5P5j6Jj6L2pM2j3J7j29L7J18
$$ -132 -98 26 93 -27 -120 135 10 33 78 -67 86 -28 -56 -132 -57 18 2 3 -13 19 12 54 41 58 -71 -34 84
5368H4j73K43j05j59J73P4l40J38n2J93m0ok2r6J37j77P0m4J16k4J83j74j08r
$$ 84 -89 154 49 -110 63 137 -203 -65 -117 76 36 30 8 -88 49 -128 -58 -102 14 -10 173 -1 -109 -118
5392a18J04M9m2J85k06j22K52J0k51J05J5j4K0M1nJ07k02J6K09j75k4mR6n7j6
$$ -118 -14 35 -7 178 -28 -150 102 112 -139 -34 -19 -33 -13 28 23 130 -72 -56 153 -22 -46 -50 46 -11 -27
5417b7j3N5Q7j23O9M7m1j76J47%j25J09k0J9J59j86k7j08J26Kj1Q3m9K9p0P6j02
$$ -27 -40 15 102 -21 48 95 54 -122 25 25 -100 9 -11 8 167 -19 -46 -154 -28 -26 -37 46 -3 26 -44 32 -70
5444g0K84k50lK3J57j52J27m3j85J31j6M4j91P3O3P0o1L2m2p6P0M2k2m6J10L5
$$ -70 214 -36 -39 -16 141 -11 116 73 -112 19 3 47 -144 -71 -8 62 1 33 -9 -85 -15 27 5 -41 69 104
5470A04j95K1r2nK44k62K60k2j70K44k03J5K9J31p3J0q3Rk0M2j4K04k00j53J62
$$ 104 -91 -70 -162 -167 77 -185 75 53 -117 127 -76 -61 -32 99 26 36 -47 -38 -58 -16 -30 174 -26 -179 -17
5495a7J29j10j31L12m8j76j10J37K6n2o0J49oj11l3P9P7kn9P1j55Q9J65j17j62
$$ -17 112 2 -129 183 135 -41 -151 -14 12 -40 -100 49 43 -68 -101 -22 55 53 -6 65 -90 -1 164 47 -115
5520a15N6R1L2n5r4L5R4m2J1KJ8j6M2j6j85J81rL0l2NM3q1Q7Jj06OJ7n8J3K04
$$ -115 -59 32 64 9 -85 -50 44 2 13 15 33 17 59 43 -142 39 30 60 28 33 76 -5 82 83 -23 -17 0 -58 -45 159
5550A59k3q2o5j8J61j27J00j07M1J5p0O8o5L8R6j07mM3P9p2r5K24j97k3pm7N1
$$ 159 136 54 -11 -29 132 5 105 -2 39 54 -16 52 -13 25 121 14 10 53 132 60 -35 189 -8 -31 -38 -85 -34
5577c4l2J73p2j25j8K21k37P7N3J0J11j68M3o4M8J85j11q3J59j29J11j79J34N1
$$ -34 -66 107 35 -90 -108 113 -124 -47 6 16 127 -41 2 -62 -14 171 60 -23 136 7 118 -61 73 124
5601A24j44q6P7J10p9O4j14QJ27j09N9m2Pp2K01k10j2J47m7P1j18j06rO0P5M4
$$ 124 -20 -106 -29 81 2 66 -48 -40 87 -22 37 -5 2 -70 131 -79 -91 56 9 80 -38 -144 -153 -93 -18 26
5627B6l1j02L19r7l8oJ77j63o3J26j47n3Q6r9O9k4o0k6Q5M7j18J01N1j25J09j3
$$ 26 -5 -107 212 115 77 71 248 85 22 148 1 -52 34 -65 4 -20 -80 -106 -21 26 -92 9 60 -65 44 31
5653C1k15K64Q9j39k05J79p6MJ2k9j8K4j9J83o8L9K7j33J32j0k03J73k4j2Q6r0
$$ 31 -184 80 169 30 -175 4 -72 -68 -56 -85 -103 -79 -98 85 17 56 83 -50 82 72 -131 42 18 6 92 2
5679BK1L9K1r6J02j11p9J0J19L5j48O8o3J04o7k1M9J17n8L9k1l3m0j01Q6k3J50
$$ 2 23 62 83 -13 89 -22 -101 -91 28 63 -85 -17 -80 24 -43 -64 -15 102 44 83 62 29 -11 -112 -26 -49 101
5706A01r2n1J88j71K39o2k03J52j97N2j4K04r0j18Q4q1J63k02J7K02l4j04LR4
$$ 101 9 -42 146 -25 214 152 -51 101 -96 -44 -58 146 56 -62 22 -59 104 -98 -81 121 87 -17 -14 80
5730H0Om3J04j86Q9j15m1qR7J03J64m33K51k6l0M3j07O4M7M7k16J11m5J53j0m9
$$ 80 86 43 147 -39 50 -65 -106 -114 -17 86 250 -183 68 42 12 55 -52 12 59 106 -110 1 -44 109 99 50
5756E0l7j13Q0N6j36R3O1j55J63o5N6q0K12k45q4Q1J10K3j40K55k85J46q3J86
$$ 50 13 -100 -20 36 -100 -7 54 -101 62 -3 53 -27 185 -60 -144 -63 47 70 -70 185 -100 46 -37 149
5780A49k08p3J69K1j2L0j89P7j26J05N1r6R6l5J30j15J4Oj18P9N5j42R2O3Ql8
$$ 149 -59 -132 37 58 46 76 -113 -36 -162 -57 -6 -102 -6 -41 89 -26 -12 -6 -124 -45 10 -132 -40 23 31 -7
5806gl0n8l9M9J25q5M2l0J60o2j73J38%j42J31N0r8L1J17P0r7j16O4P2j76J01
$$ -7 -37 -95 -134 -85 40 -45 -3 -33 127 65 -108 30 30 -112 19 69 -29 2 119 189 92 -24 40 112 -64 37
5832C7j8l2L5Q4m1o5O2j23J33j0q8r3Q1R1or9R6K6M5j20P1J2k25J95o8R3J6p6
$$ 37 19 -13 22 106 65 0 62 -61 72 62 -26 -119 -38 53 47 -52 44 70 115 -5 66 78 -147 48 -20 73 89 13
5860A3r8L0J00Q6j26J16j91K12j58O1q9P9K45k01j36P6O0j55J69k03N2J88j04
$$ 13 -85 -55 45 131 5 121 -70 142 -16 45 -44 35 280 79 -57 19 79 -76 93 -110 -58 130 26
5883B6pp0K46j48Mj07K89j82oL6j09O3k41K04j5j41J18K32l55K14n7J6O4p0l0
$$ 26 19 -51 195 47 51 -56 233 51 45 81 -28 35 -206 -2 -17 -158 -40 192 -163 51 -6 10 74 4 -26
5908b6J18j81n1J52j36rJ80Lo3P4O4q0r0J44j06o4k9K06k18RRK16q2m8J06j53
$$ -26 92 -89 -140 12 -124 -133 47 50 -13 61 125 45 -45 99 -7 -71 -100 106 -112 -103 -94 122 40 -8 98 -55
5934e5J73j44K1o1J32q6P1j12K6m9K3M3R9Ro5Lo2r8K61j89Q6K5r6j7M4L3p2J23
$$ -55 118 -26 -5 -66 66 -20 51 -61 -35 -84 -61 -18 81 90 25 28 -34 -132 129 -60 26 51 -45 -62 -18 15 -57 66
5962F6j27J76j20j11Q6N5M6o4j9m4J5J0J94j48j14J05K7k7p5J53j03j85L58o2
$$ 66 -61 115 -5 -116 -30 25 71 7 -12 -56 -41 -31 163 15 -99 6 33 6 -69 84 -19 -204 154 92
5986I2l1j20k0%J04J09k26K8m5Q0J40j24n8L7n6K7r6J8J33J08n2j01j3q8J42J57
$$ 92 61 -59 -79 -79 25 134 -92 -64 -109 -29 111 -13 -71 -34 -90 -63 -159 -141 -8 100 48 -53 -66 -154 -12 145
6012A45j58J35r8P2j35J11o2p9K85k38N2K0m2n3L1J15J05j45l38K82n8J71k91
$$ 145 -13 122 24 96 -39 72 10 -69 216 -22 30 50 8 -45 -14 101 206 61 -277 5 -53 118 -173
6035a73J62j9J99k19l2O0P0q1N7j87Q8K3R5M3m4j32J98J34k17L7j7n6N9j81K22
$$ -173 -11 -30 169 -50 -82 -22 48 -33 24 -163 -75 -52 43 86 42 -90 108 242 25 62 45 -11 48 -133 89
6060H9l1j0p1o3K15j26j8o9R8QK5m5K6r7pJ54l6Kk42J09J29p9J49j57K8k8j11
$$ 89 58 48 -23 -86 129 3 -15 -84 14 22 47 2 28 -69 -76 78 42 44 -198 -89 40 -39 110 -47 -19 -47 -158
6087a58J88n7J03l9o7Q6Qo3k2pl0P9J74j28j56j10J43J44%j62k0J4O7P3m5oO9
$$ -158 30 -27 76 37 -30 56 64 1 -21 -28 -58 21 195 67 -89 -199 -56 88 88 -74 -94 -80 -13 60 15 9 78
6114G8j82J52J69k05O3j18mO2P7j2R2k03M6K7n7J04j18R6Mm5l4pM9k98K63j87
$$ 78 -104 48 217 12 75 -43 -47 15 92 80 172 -31 15 42 -15 89 -29 67 71 26 -8 -15 34 -264 -1 -188
6140a88J88j5l1k5J1M3N6K9N2K1j46o5L0mK45l38Q8p4O2Q0J00m3m8kl0J12j00
$$ -188 0 -15 -46 -71 -60 -17 39 68 120 141 -5 -70 -40 -44 201 -137 -49 -123 -61 19 119 76 28 26 -4 108 8
6167HM9J42k86J55j56J9J48k75Q4J60j29M3J56p2K9q3P4p3M2k5kq5J3M3k1O0M2
$$ 8 57 199 -87 68 -88 -69 79 -196 -112 48 -81 -38 118 46 75 -8 66 -7 35 10 8 -77 -64 -21 -42 18 60
6194F0j22J68N3k59J42o5q8N6J74j60j2K41k79Q3o7J37Q3j34O5j61K18Qk52K05
$$ 60 -62 106 159 -100 42 -23 -111 -55 119 -41 -53 188 -91 -8 -75 62 145 11 76 -85 133 141 -111 94
6218I4J16k15m1M5m8Q4j43K25J6l10J97l1Q0L6ok15J40M4j77K90l76J34J37j07
$$ 94 210 -5 -46 -1 -49 35 -108 117 133 -177 20 -11 69 105 99 -116 24 68 -109 181 -195 -61 76 -31
6242c1J27j36J2r1M6kJ73l2p6p5o4R9J46k28J75O4j23J61k08k0J75J6j70o1K31
$$ -31 96 -40 -28 -119 -73 -75 98 66 -10 -85 -149 -50 96 -132 43 107 -16 145 -63 -83 92 108 -62 -123 108
6267A08j13m6j4R4l9RL0n7n1R8q6L7mQ0p9l8J7R1j71J80m9L7j39P7J37k26R4q0
$$ 108 -5 -51 -65 29 -10 -1 29 -28 -79 19 -67 -30 -34 46 -33 -71 -54 37 -134 46 -3 34 -105 -28 109 -117 -23 -103
6295a03O2j30J64J21j38q7J22K1P5r3j81N2Q9m0PJ11J17j83M5p8N6O7k38O9R0
$$ -103 -41 -171 -7 114 -24 -111 11 32 107 14 -167 -115 -26 -66 -59 52 169 -14 31 -47 9 76 -162 -93 -3
6320cJ16j75n8J15L3j5m0J55l0K5j36L4L1j89K51j70P1j21j7N6M0N0L5o0J15P
$$ -3 113 -62 -120 -5 28 13 -27 128 98 123 -13 21 52 -137 114 -56 15 -106 -123 -67 -27 23 58 -2 113 120
6346A20ok32K19R7l41K74k6k13J80j7RJ5k8m5j15J01M9m3l9J08j68O9K9N3r6p0
$$ 120 114 -118 101 198 -143 131 105 -108 72 55 64 79 51 6 -109 -8 41 -2 -41 67 -101 -32 -3 50 -46 -116
6372a16R6lm7P1K0l2%j48J22P7j74J95j53J34j02J10Oj00O2j02Ql8J51q1%R6j20
$$ -116 -20 -23 -70 1 21 -11 -11 -159 -37 40 -134 61 -92 42 -60 50 56 -44 18 -84 -76 -114 37 -44 -44 52 -68
6399f8l8J31j51P9p5O3J05K3j01K3K19k11N4k5j15K03j13p9J68rr4k3k4J54K1
$$ -68 -106 25 -126 -47 -122 -59 46 69 -32 -9 210 -1 53 28 -87 116 3 -76 92 83 -11 -34 -58 96 117
6424A17l27J78M1J4J2p8l0O5r3kJ31j78K82j53O8p6p7J48k08J55r9R1j06R5J16
$$ 117 -210 -32 9 23 35 -43 -73 -8 -101 -103 28 -150 132 -21 47 -29 -106 42 -166 -11 -110 -19 -125 -30 86
6449H6M5j61j09K17m0r5J84j19jp4J09k04qJ48M6l7m0r8O8P3k4J16k14J51l2P4
$$ 86 131 -30 -139 78 38 -57 127 8 7 -67 42 -162 -170 -22 24 -13 -53 -151 -83 -10 -34 82 -132 19 -13 61
6475F1j1j47p2K56l1r4Q6m2LL1k0j29J73j08O9N1m2M5j94J35k9N3P7l04J36PM8
$$ 61 50 -97 -169 87 56 -38 48 6 9 40 20 -109 64 -44 25 76 34 79 -115 20 -9 44 121 -183 -47 -40 8
6502Hm5J5jj26K56j73R4Q3j26m3Q0Q6j09m4J44p6kK4N8j72j12J50J24j28J09k5
$$ 8 -37 -22 -23 -149 107 -66 28 111 -15 -58 22 108 -1 -45 99 23 21 45 103 -69 -181 -31 93 -35 74 49
6528D9l7M5p0N9Q4l2j73J44m0r7j13K16k07K10P7j82L1N5j42pP8K21j17J51k73
$$ 49 12 57 -13 46 130 98 -75 69 29 -68 -181 35 -172 38 115 -67 -36 19 -123 -130 -52 169 52 203 -70
6553g0J25j82J13Q3k02J78j7L6j6j79J78O9p8o5m9J36J0k5Q7j2J7j21O5r0o2l4
$$ -70 55 -127 -14 69 -133 45 28 64 48 -131 47 116 38 -27 -76 60 70 45 132 120 137 16 81 -9 -71 -105
6579a05R2P4m0r1R1J66k22p4J18K9k2m6J7k9K1J2M3M4j33J78J3k81K10M0o7j31
$$ -105 -13 61 21 -70 21 187 -35 -109 9 38 16 -30 -13 -42 -21 -9 34 78 -55 123 136 -145 65 105 38 -93
6605i3M0J02J2j15P9j00K17p7k40L36k96loR1LJ01mnJ9o9J70k88J15K4L0n3L5
$$ -93 -53 49 61 -54 25 -75 142 65 -175 161 -135 -138 -144 -53 -50 51 47 42 61 -8 162 -126 -11 13 43 -10 25
6632B5m4j19P7M2p4R4J0R3o3q0L5l3L5R8K2j6p4j03J78j07j29J43M3j13J35P4
$$ 25 -19 -138 -61 -19 -93 1 11 104 41 -39 -4 -37 -2 96 118 102 28 -75 103 -4 -133 10 53 -60 75 149
6658A49p1k03J55m6Rj94J32J33r3O8Q2j23k0J05j40P0Qq3J87j46N9n3P3p3O4j21
$$ 149 78 -125 30 -16 -7 -201 -69 64 -29 39 121 -2 -22 83 -57 13 21 -62 125 -21 38 -15 58 -15 49 -72
6684g2J62j62J58j00j83L35j97J63K4R5k04o7N2M1j21J82j60J80J9k32j2k8O8
$$ -72 90 -72 86 -14 -197 138 -59 104 128 223 19 -48 4 45 -76 106 -54 126 145 -87 -99 -127 -59
6707e9P1m4k0K31j59mL3R0k21J11M6%j95O7N0j21J90j07J72o9k5M1Rk13J76P6
$$ -59 12 -32 -52 179 20 16 49 139 -82 29 75 75 -120 -53 -3 -124 66 -41 131 62 37 78 87 -126 50 126
6733A26k07J84k18O7r8M5K04n0j06K4R0j28j08J5K25k5O2j34O0j40J92p0m8Pk5
$$ 126 -81 103 -115 -48 -146 -101 103 53 -53 -29 61 -67 -175 -160 65 40 102 -32 28 -112 80 10 -38 -31 -56
6758e6q5J78l4j58K28k17R0K00j76K7m6R0j93K8Q1K0QJj35J41n6J35j55NM6J07
$$ -56 -141 37 3 -155 73 -144 -54 146 -30 -3 -49 41 -152 -124 -43 -23 -15 -14 -149 -8 -64 71 -84 -79 -33 74
6784G4m4p5J05j19K0J6J14q0J21j05N4j31K7kM7LJ13j23P6q2J3R6j42JJ00j3n1
$$ 74 30 -45 60 -59 -39 -23 91 11 132 27 81 -50 -23 -25 22 25 138 15 91 9 22 118 -24 -23 77 64 13
6811A3n0j53J73n9R6K6L4j40J90j17P0n7J4j12M7rJ05j42k1J29PJ29j03j42j31
$$ 13 -37 -190 -17 -76 20 46 80 -60 130 13 83 26 40 -72 -25 -34 71 -71 -92 37 44 173 70 -72 -203
6836b03J25J25N5r3j02K06j15l9J58j89m9qJ17p9J67r6k1j2J7J50p9j57Kj1Q9
$$ -203 -78 47 102 9 -93 113 -2 -41 117 -72 -121 -129 -12 -91 76 -20 -41 -53 -36 114 35 -122 -120 -131 -42
6861d2K06j75M1m1J01o0J10p6k4o1J05j34j2m0K7J52Q7k24OM5P3J1n5m5k8N0J27
$$ -42 164 -11 30 -11 90 30 140 64 40 -21 84 -50 -62 -102 -75 77 164 -60 -54 -9 64 75 20 -25 -53 -3 124
6888A24j33J95k70K2j5J23N9j63J29j3j1kP6k04K61p8j16j87L31j34MR5l1p2k69
$$ 124 -9 186 -84 -62 -77 46 105 -58 71 58 47 45 121 -83 178 100 -16 -203 128 -6 -2 93 62 -10 -279
6913b79J32J99l0r6K49l08R7k6j47N8K00n8o8J9J33J63j57l5Mj28R5m8l0N9m8
$$ -279 -147 52 22 -74 175 -133 -36 -62 -209 -151 49 -9 -77 -58 75 238 81 46 50 -78 17 -31 -61 -2 -50
6938e0K35j38j3J33k81P7P7O5r9O1P6j31o0K61k50K65k84p3J33qn0L2K1L4j27
$$ -50 185 47 34 167 -114 -37 40 105 6 67 143 12 -48 213 -37 228 -56 -129 4 -4 -54 -22 -1 33 -94
6963i4P8J0k5M7j18O1J06K7j71N8J09j9j23L4n6R9l5j57K46j26l6J22r6K33j72
$$ -94 -16 -6 -31 16 -102 -41 65 92 -79 -21 88 69 -54 -20 -76 23 -12 -169 77 -49 -85 37 -59 174 2
6988BL5N5j33j33P9O5J21K9j06j31LJ20J50j36p5J5J40j82K89l35J35O9j31o4
$$ 2 37 92 -41 -174 -95 -30 91 120 14 -117 -114 6 156 20 -55 -40 100 -82 207 -128 7 76 -55 -119
7012a19K23r6j00O3L6j2Lr4M6J00K8j07j21j1J67m2P1q9M1j9O5J01k28N4M2k2
$$ -119 104 8 -92 -29 7 -5 -2 -96 -50 50 78 -29 -150 -161 6 -36 35 -54 -13 -32 33 134 -94 -40 2 -20
7038b0J65j34rl9R3p7J46j82O5J2J54o0p0j17J74L1q7n5k3MK8nJ58l0r4p5J08
$$ -20 145 11 2 -37 56 -21 125 -57 8 20 174 114 44 -73 101 132 45 -10 -33 -29 -1 -6 152 122 28 -47 61
7065F1j64N6K00k40j3K35j30K03l08mO3R6r5j07R8J46k8j26JR9j26k7J68M5Q5
$$ 61 -103 -47 153 -87 -100 135 5 208 -100 -104 -41 55 -40 -147 -49 97 69 -57 -56 43 -83 -110 58 103 188
7090A88j78j08J08Ql0M4q3J66r3k0P6R7j43n7J00j19R8q5n5J17j3j5k20K0J29
$$ 188 10 -98 10 18 -12 32 -51 115 22 2 78 175 32 -25 75 -44 54 -31 -86 31 18 3 -217 -197 -68
7115f8P1J04R0l37J00M5K8M%j24J4M3J51j30O0j13N9M2j1n2P1J44q7qj02k38K33
$$ -68 3 107 197 -140 -40 5 33 37 37 -87 -73 -30 121 -9 51 -62 -3 39 28 -24 47 191 104 96 -6 -244 -11
7142a1j6P4j43l1J45J92j78M1k1j03J31j55LJ45k10Q0Q8pp7Q8Q9J6j74P3o3J6
$$ -11 -27 47 -96 -127 18 210 32 73 52 -51 80 -75 -72 73 -137 -57 31 24 -53 35 124 140 -34 39 -24 -8
7168hj36O2J52j27K7J24k76J61J1j03J40%K8k3q2MQ2nNj8om9K02j39p6P4j5J7
$$ -8 -144 -82 70 -57 -30 94 -182 -21 -10 -113 27 27 55 32 -50 -46 36 31 36 18 12 -37 165 26 -50 24 9 26
7196B6j9j4p1J48L4j45r6J53j70K00j2P5L1k38Q7k8N0N5o9qj38J45N7q1L7m2m
$$ 26 7 -7 -78 70 104 -41 -137 16 -154 46 34 109 140 -98 -11 -39 11 66 -3 -11 -149 -4 53 -28 9 -33 -37
7223c7J48n4r6OK03k68O6m1N9p8L5J77j44K05k27J02M7j36Q8n0J54l89K01Q5J12
$$ -37 111 57 -39 -33 170 -98 -32 -73 -14 -92 -57 120 -24 181 -46 56 103 -33 55 5 159 -230 -29 56 168
7248A68j30p5m1Kn6M0J03L2J15n8j11KK4rj25J40J18l26K06m9Q3k04J01R5q9k0
$$ 168 38 -37 -78 -76 -132 -92 11 43 158 100 -11 -9 15 6 -119 21 139 -187 19 -30 53 -151 -50 45 -44 -64
7274f4j7J35K3j16K2j30J76M1l23K51P4j62k2K38k84Q6J45q6j5n8L2P5r1j69K43
$$ -64 -81 54 77 -39 -17 -147 29 70 -253 -2 72 -90 -112 126 -158 -72 73 -13 -28 -86 -54 21 -70 -239 4
7299DJ13k56L25k96M3K65j28J28k50nm3N0P3L5Jk7j64K12o7L9l1R5q5J2p2Q3j51
$$ 4 117 -139 186 -110 -67 198 70 198 -52 -57 -100 -50 23 58 59 32 -132 80 13 52 21 116 31 43 -29 54 -97
7326i7K56k20p3J36Nm7L0n5M7P0r3n5K22k6j26O4l0J68j09q2K39r4p2j58K23j5
$$ -97 159 -61 -134 2 7 -40 -10 -65 -18 52 -41 -96 126 100 -26 38 8 176 67 -15 224 130 58 -100 123 108
7352A08q9q2J11p9P2o0o8J2J32oQ7j54j03L2K09k8J5j62J68J1q2k7j12J69j27
$$ 108 19 -63 48 -31 41 -19 -87 -75 57 51 138 -16 -119 -87 122 94 109 -53 115 126 44 17 -95 74 -53
7377e3K39j64l9J28j52J86k13J58l6j05Q4L5k01J33R0j43K05l3J5j26R3N9k23
$$ -53 186 22 -17 111 -41 145 -68 90 54 -51 33 68 -133 0 90 -53 152 119 134 8 101 160 -63
7400f3R7n7L3k2J44k19m3J21L7L9j49J81j23ok3P7j13J33n6n4L8J7K05j52j41
$$ -63 34 -23 10 -12 132 -87 -130 -9 28 67 -82 99 -24 -30 -53 24 -89 44 -12 -66 -28 -11 194 42 -99
7425i9J79m1m5J11j64J25J10j89M9M4q2j76J84p6k2P6J00q4J2o9J1O0k2J7M0o1
$$ -99 80 39 -6 105 -59 66 176 -13 36 80 -2 -178 6 -70 -92 -16 84 0 12 -57 -46 14 -8 9 49 -12
7451a2MJ9m0N0K3r1lR0k1k5J22j27J01j49n9J74N3j43r1L8J12j9RO5L0o7O8k7
$$ -12 -8 11 -29 21 44 -47 -50 40 19 -6 116 -11 90 -59 -118 56 109 -34 -125 -87 25 6 15 80 110 43 111 84
7479H4j33M0n5Q1j05J92K7k07L5P3p4j41Q1J24J4j32J10K02l03K53k28J27L2J
$$ 84 -49 -9 -64 17 -88 104 131 -76 -41 32 -42 -183 -102 22 36 -96 14 216 -87 166 -62 65 97 98
7503I8k26J62o8J37l4M0l6NPj44J95k61J38J17L2k10K05j67R2n2P8oO5m00J57
$$ 98 -128 34 -34 103 69 109 73 78 85 -59 136 -125 13 130 162 -48 157 -10 82 30 108 102 167 -233 -76
7528g6J3k0J23O6r0M1j41P6l3r7K38J5k58kK13O0j74m2K59p6l4n2Om0L2ML2j4
$$ -76 -63 -83 40 106 16 57 -84 -8 -41 -138 100 115 -143 -145 68 128 -46 -88 171 95 61 9 15 -25 7 11 43 29
7556B9n4J5Q2Jj03Nm2n5K20M9k20J57j81K53n9p1k7O3n1o2J12j4r5L8q0M7L7p9
$$ 29 -25 -10 72 73 -30 -25 -67 -122 98 147 -73 84 -97 156 97 26 -1 62 11 -51 61 47 -48 -10 -90 -43 -6 -85
7584h5N2K7O3M%k59R6J81j02p1J33m1K6N6j47J03j22J27r5N7r7R0K02k64O8q6
$$ -85 -33 -6 57 61 61 -198 -102 79 -23 -94 39 -2 24 80 -67 36 -86 41 -54 3 -94 -4 198 -66 2 -84
7610h4J51n9j43J06R2j38J49p3J73k94K21j19p4MJ29J51k74N7k7L5N3Q7j82K17
$$ -84 67 8 -135 -29 63 -75 74 1 174 -120 101 -18 -92 -88 41 192 -82 -25 -52 -17 36 123 -59 158
7634A58l93K48M4Pj0m9l1KQ4k5J42k59NQ7L3M1j53K22j0k97K67j0j88P1O2k0j51
$$ 158 -235 13 57 64 54 5 -26 -24 60 35 177 -82 -77 10 43 84 -69 153 143 -154 113 103 -85 -14 48 28 -123
7661a23P2Q1j07J2K04k72K15n3L0j02r7J16j47K04M6j32q6K16j66qo1R4oJ92k77
$$ -123 -51 30 -77 -65 139 -133 82 29 59 -43 -140 -24 -171 33 79 -53 -139 77 -89 -97 -158 -64 -70 122 -155
7686a55J20J02L4n8L9J4o0M2k1j14N1n7o8J62j31J46l3L6j78J30k2q9P2l4Q7J53
$$ -155 -35 67 101 43 82 96 36 78 57 -57 -6 -63 -131 31 -100 46 13 49 -129 1 -21 -110 -38 -72 15 168
7712A68k31l0J16p2J49j04n2Q5j07M3M3j22K58j92N6j32K4J23n4Oj53K96k01Q3
$$ 168 -63 -93 23 -49 100 -4 -56 29 -78 -35 8 -114 144 -48 8 -124 -100 23 -31 -25 -178 118 -83 0
7736@k18J19J16j3P1j02J56r3N7j23J49q9J1k3k0J8o0N4J53k79J43r7Q2j26J94
$$ 0 -218 -99 17 4 75 -27 129 36 93 -30 119 30 41 18 -2 16 -44 10 163 -116 27 -70 12 -114 80
7761H0j32n3K75k18J16j09M6j81K54m1QL6j59n7K90j08j70o9J78m9J57J4J14k49
$$ 80 -52 -105 170 -48 68 -41 5 -176 78 37 45 81 -78 -135 155 47 -123 -192 -14 -63 94 108 222 -27
7785b7K0OJ14j63J45o9p1J97mj62J43L9k54R6o4Q6j81p2K37m0j8k9n1J33J31k38
$$ -27 -7 -1 113 -50 95 26 -45 152 148 -14 129 168 -86 10 -54 32 -149 -221 16 -24 -42 -71 -122 11 142 -96
7811i6Q8j39J00K53j65J89j30j75J83j60m4J76r5O4M8P1j29k6L6l8o5oM8J5K21
$$ -96 -8 -147 -47 206 41 230 100 -75 108 -52 -96 80 -15 49 97 168 39 13 49 11 -54 -60 -12 3 224
7836B24l50K11K3j80J27k5o0k9J14n5J4j67O5O1K2m5Q5q6K7k7J24On3p5m6Q3J63
$$ 224 -126 85 108 -72 55 30 -30 -59 55 0 14 -153 -88 -27 -5 -50 35 -51 -24 -51 73 79 26 -49 -95 -12 151
7863A51j43J07k09M2J05j80K60j42J1Qj17J53k6J35j85M3M8l3k9o6M3j00K39k43
$$ 151 8 115 -94 -52 53 -127 133 -9 2 10 -107 46 20 155 -30 13 61 28 -1 -67 -24 -124 115 -128
7887a28J3R2P6l3N2r8J38k85J68PQ0j07O7p7k3O2%L4O8j30J10o7oJ60j09j7L4
$$ -128 -115 -23 53 20 72 -26 112 -173 -5 2 82 -25 42 -35 -58 4 4 38 106 -24 86 19 13 173 64 47 81
7914H1j00P8j28K9l3j3P5o3R6r2J07J48k52k5R8N5J36k48JJ59q9l8J8NM8p6r3
$$ 81 -19 59 -69 -40 -73 -86 -11 -74 22 -70 37 185 -67 -92 6 61 197 -51 -50 109 20 -18 0 5 53 -23 -116
7941a16J13Q0k0j81J69j10J9K01l04K37k9K8n3j15q0J71K1j58N8m7K94k4j17J3
$$ -116 -3 77 57 -124 45 -65 -46 155 -149 88 59 87 34 -81 -161 10 31 -127 -69 -116 178 154 37 50
7965E0L0m8LJ2K1q8J4M9L2j32M1l0K41j61o9n5Q1J2k2p4J52j22M7J03j08J54l6
$$ 50 80 32 35 47 68 -20 -6 43 75 -57 -16 -46 195 34 -35 -90 -9 3 -19 -93 59 -63 -16 87 -21 133 97
7992I7l0j12n6j1LJ69j96J37q5J21j64J46Q0j20M8l9N0r2J38m4j83K25q0k5j20
$$ 97 67 -45 -101 -112 -109 60 -136 1 -84 37 -127 19 99 -21 27 -12 38 -54 84 40 -143 82 2 -23 -143
8017a43L2K1j9K62j32j1j1J94k12J03K6k03lJ1J37j26J38k52J50J1K10j44j39
$$ -143 -111 -90 -109 153 21 10 -1 193 -19 84 110 -93 -96 -85 52 -74 64 -188 -38 -27 183 39 -100
8040a00J01J33m5kj29n5O1j04L73k93Q0j03J20q0J55o7O7m0j41K7O9o8n2j1L5
$$ -100 1 134 89 87 -42 -97 -36 -140 233 -60 20 -83 37 -43 112 45 112 72 -69 -42 27 -41 -93 -104 -69
8065f9K24j28L7q8J33j40L0Q5k16M3J11o0J13rq7oO3q9n3K50l41K94r3N7l5n3
$$ -69 155 27 64 -24 109 -31 -1 84 -132 -89 22 -38 75 66 -21 -27 36 -53 -106 144 -197 97 4 61 26 -27
8091b7J14j81Q2j20Q7M5rJ72p6J06k54J4P5K6l5K3kr3m9K09lJ35k23j17O0J41
$$ -27 87 -94 -12 -132 -45 0 -9 163 87 193 -61 -47 28 54 19 42 40 -53 -102 107 104 239 16 -101 -41 100
8117A00q8j31L6N7J34k82M2K97j11j49K84k58Q1Jj9p7j4J52J66l03J00j33J83
$$ 100 12 -119 -83 -26 108 -174 -132 165 54 -95 189 -69 12 13 -6 -83 -97 55 221 -82 18 -115 68
8140F8o6o4k1K52j96p5J39M2Lk25K82m9P2j01P1k80Q8O6j07K31K2j75k0m1p1J14
$$ 68 2 -62 -83 169 -27 -102 37 79 82 -143 139 90 162 61 132 -148 -60 6 -101 130 152 -23 -43 -84 -155 -41
8166d1J45q6q5O6l2n6K0J05m5k5Q8j10J91j26P4j68J28N7l5k4o4j23m8K57j1
$$ -41 104 18 -67 -1 -33 -89 -69 36 -9 -34 54 -56 135 9 83 -85 43 100 65 41 -23 -146 -194 63 52
8191E2
$$ Imaginary data points
##PAGE= N=2
##DATA TABLE= (X++(I..I)), XYDATA
0@%%%%%%%%%%%%Qj6J6j6J6k4L2l2M0m8N6o7P5q8J04j20J36j56J80k04K32k64K96
$$ 0 0 0 0 0 0 0 0 0 0 0 0 0 8 -8 8 -8 8 -16 16 -16 24 -24 32 -35 40 -48 56 -64 72 -84 96 -108 124 -140 156
35A56l31L71m16M65n18N75o37P08p85Q66r54J053j161J280j410J550j709J885
$$ 156 -175 196 -220 245 -273 302 -335 373 -412 454 -500 553 -608 672 -738 812 -897 988
53I88k080K301k550K835l168L554m009M563n251O128p291Q909j1305J5215k2625
$$ 988 -1092 1209 -1341 1494 -1674 1880 -2129 2434 -2817 3311 -3980 4929 -6376 8839 -13786
68a3786M1210j66744k70189N11952J09965l45189M2985J67368j48010N4160J69495
$$ -13786 27424 -139320 -409509 102443 212408 -132781 -89796 77572 -70438 -16278 153217
79A53217j81476j10184K51967R924k25950N5524J43018o4389k8822n100p5674
$$ 153217 -28259 -138443 113524 123448 -102502 -46978 96040 31651 2829 -2271 -77945
90g7945Q4243J28218j59759j34049J61139O8818j23276J7583M2784q2698N0620
$$ -77945 6298 134516 -25243 -159292 1847 70665 -52611 -35028 7756 -74942 -24322
101b4322J10709r9976n3198J29864j2582r7849Q9923M7817j21338J4032R4490
$$ -24322 86387 -13589 -66787 63077 50495 -47354 42569 90386 -30952 -16920 77570
112G7570q5885n4611J02805j0382r0164L8512K9859l6192L8167J3521p1915K5785
$$ 77570 -8315 -62926 39879 29497 -60667 -22155 7704 -28488 9679 23200 -48715 -22930
124b2930O8316m8381j7843N0753n5888k6578J17065k2081j40233P9994J19371
$$ -22930 45386 -2995 -20838 29915 -25973 -52551 64514 42433 -97800 -17806 101565
135A01565j15897n6933J32680m179j05288N5633M8890q2704J2848O7560p5384
$$ 101565 -14332 -71265 61415 57236 -48052 7581 56471 -26233 -13385 54175 -21209
146b1209m4481Q7194J008o9069K8864K5932l4874K6330L0797m8803L034N5151
$$ -21209 -65690 21504 22512 -46557 -17693 8239 -26635 -305 30492 -18311 -15277 39874
158C9874l5307l2618N8369l798n9906L0247L1501m2708O799L2347m2604p157O1109
$$ 39874 4567 -28051 30318 26520 -33386 -3139 28362 -14346 -7547 24800 -17804 -24961 36148
171C6148k0257n1981M4988K1307n8372J3015M7974m1785k4278M6075r481l3008
$$ 36148 15891 -36090 8898 30205 -28167 -15152 32822 -8963 -33241 12834 3353 -29655
183b9655L8890J4920m5253J0871L8949k3601j1044K7146j8734j7807L3148n923
$$ -29655 9235 24155 -21098 -10227 28722 5121 -5923 21223 2489 -15318 17830 11907
195A1907l5999K1595J5975l4318O847L2864k6858j8283M0059o6l3308K2716J8034
$$ 11907 -24092 -2497 13478 -20840 -13993 18871 -7987 -26270 13789 13723 -19585 3131 21165
208B1165l1161K192K5520j8646r445K4427j0806k2663K4367J3176k5914K620J7191
$$ 21165 -9996 -7804 17716 -930 -10375 14052 3246 -19417 4950 18126 -7788 -5168 12023
221A2023j4875r44J7601j6370j2710K2894k453k2982J2770J2419j9178K223J8624
$$ 12023 -2852 -3796 13805 -2565 -15275 7619 5166 -17816 -5046 7373 -11805 -9582 9042
234I042j2447n626K1358p959j5919K3309O170k6941O003J9563j6915q721J9280
$$ 9042 -3405 -9031 12327 4368 -11551 11758 17928 -9013 -3010 16553 -362 -9083 10197
247A0197o155j6114J4699L634j7874J1232J2424k0947l183K0702o201j2656J1235
$$ 10197 4042 -12072 2627 6261 -11613 -381 12043 -8904 -12087 8615 2414 -10242 993
260I93K52j0833J1168M831j7210O326J8309j4091r209J8542q56j3315J0097L552
$$ 993 1245 -9588 1580 6411 -10799 -4473 13836 -255 -9464 9078 8222 -5093 5004 8556
274H556j3698O835J0297j6921n356J8949m086j5623J0225M981j2257N736P731
$$ 8556 -5142 1693 11990 -4931 -10287 8662 4576 -11047 -822 4159 -8098 -2362 5369
287E369j1313O38J2200q435p712J3096J286j1583O320N723j0650L550J0703j0509
$$ 5369 -5944 -5306 6894 -1541 -9253 3843 5129 -6454 -134 5589 -5061 -1511 9192 -1317
301a317l486J2912m483j0178J0624M046j3002K959R763j0216l647J1693n012q977
$$ -1317 -4803 8109 3626 -6552 4072 8118 -4884 -1925 7838 -2378 -6025 5668 656 -8321
315h321J0255J708j1101N405P182r297j185J0219m442o360Q379J22p815P075M127
$$ -8321 1934 3642 -7459 -2054 5128 -4169 -5354 4865 423 -5937 2442 2564 -5251 1824 5951
330E951r963J925Q504p018l343R229k108p711O333K989q678L263P362q584l146
$$ 5951 -4012 -2087 6417 -601 -3944 5285 3177 -4534 1799 4788 -3890 -627 6735 -1849 -4995
345d995R054k677o592O531J419p964K960N692o313j602P596l051m991O795L09
$$ -4995 4059 1382 -5210 1321 2740 -5224 -2264 3428 -2885 -4487 3109 58 -4933 1862 2171
360B171o014M992L548o839O72O352m299l117N873p20n264M971J523p120K377N749
$$ 2171 -3843 1149 4697 -2142 -1470 4882 583 -2534 3339 2619 -2645 2326 3849 -3271 -894 4855
376D855n495k468N745k344m218M318J232n568K178L623n503p26O404k033l591
$$ 4855 -640 -3108 2637 293 -3925 393 1625 -3943 -1765 1858 -3645 -4371 2033 0 -3591
391c591M930M37m432L975K795m384J58M177l554k274N184r72n282L528K631n046
$$ -3591 1339 1776 -2656 1319 4114 -270 -112 4065 511 -1763 3421 2449 -2833 695 3326 -1720
407a720N72L330l116o48L385k573l369M199J340m983J018L716k845k46L093l121
$$ -1720 -1148 2182 -934 -1582 1803 -770 -4139 60 1400 -3583 -2565 1151 -1694 -1940 1153 -1968
423a968m79N741m61n009J933M141j856j720J758j392m19K385k679k923M293J144
$$ -1968 -2447 3294 2833 -2176 -243 3898 2042 322 2080 688 269 2654 -25 -2948 1345 2489
439B489m610k20K415j253O24K361l394k396M811J289m845M5L651j225l55R01j336
$$ 2489 -2121 -2341 74 -1179 -555 1806 -1588 -3984 827 2116 -2729 -2684 967 -258 -613 288 -1048
456a048O25L102j167k623K630J491l076J91K298k755p58L337j548l867K089K845
$$ -1048 -423 2679 1512 -1111 1519 3010 -66 125 2423 -332 -1090 2247 699 -3168 -1079 1766
472A766k028j103Q52m51M73J382j331j277K025m02j348J656k63j646K398J728
$$ 1766 -262 -1365 -513 -964 -491 891 -440 -1717 308 -94 -1442 214 -49 -1695 703 2431
488B431l722j259M494J082l530j49J683l94L12j5j900J023J566k141j209K147
$$ 2431 -1291 -2550 1944 3026 -504 -653 1030 636 948 933 -967 56 1622 -519 -1728 419
504D19J79k071J158J219k032N89K544k243k396K960J745k636j349J621M47l03
$$ 419 598 -1473 -315 904 -1128 -539 2005 -238 -2634 326 2071 -565 -1914 -293 154 -149
520a49j73K36N34J67j592L19L666j173m106J656L090j723j872J194J04q32J184
$$ -149 -322 -86 448 615 -977 -658 3008 1835 -2271 -615 2475 752 -1120 74 178 -654 530
537E30L15k394K64K922o50k418M16J735M14j741j907J608L209j376m017M00M898
$$ 530 845 -1549 -1285 1637 987 -1431 -1015 720 1134 -607 -2514 -906 2303 927 -3090 -2690 2208
554B208M36l643q69J717J563N20j616j502Q23K590q82k613L10J991O3j035j188
$$ 2208 2644 -999 -1868 -151 1412 1932 316 -1186 -363 2227 1345 -1268 -958 1033 1096 61 -1127
571a127m95K480J177l672j465M189J456l906j785L215J183j348j30k98r06J385
$$ -1127 -1622 858 2035 -1637 -3102 1087 2543 -1363 -3148 67 1250 -98 -228 -526 -1432 -47
587d7J559j037j135N73J047J97o62m74N50J103r34j848J197J180k015m59J636
$$ -47 1512 475 -660 -87 960 1157 495 21 571 1674 740 -1108 89 1269 -746 -1205 431
604D31l99j313R46N42j519K95J753n04j630O13O59K17N20n93j075J244J100j275
$$ 431 32 -1281 -335 207 -1312 -1017 736 232 -1398 -785 -126 91 611 18 -1057 187 1287 12
622A2j47J142n1j023O67M62j265P42K79j299J53P52q22k90M85k20p66J245k45
$$ 12 -135 1007 956 -67 600 1062 -203 539 818 -481 -328 424 -398 -688 -203 -423 -1189 56 -189
641a89j348J128J424j653p38K173k09j478R67Q17j053Q6J221j016p56J262K76
$$ -189 -1537 -409 1015 -638 -1376 797 588 -890 77 894 -159 -73 1148 132 -624 638 914
658I14r72M61po63P71lj014J47Q91j062o89J156M28j014J10O15r91N29J075r35
$$ 914 -58 403 396 -267 504 501 -513 -366 525 -537 -1226 -70 358 -656 -546 69 -922 -393 682 -253
678b53o20J117L98q54J57M60n83L61Q12r89n76J201O7j150P02N34o32j42Q5j99
$$ -253 -873 244 642 -212 -55 405 -178 183 995 6 -570 631 698 -452 250 784 152 10 95 -104
698a04J67M94q03r46Q55P40q08j2K01l93L05O61o93m7O28K20p91J78O15j83k19
$$ -104 63 557 -246 -1192 -337 403 -405 -417 -216 -609 -304 357 -336 -383 245 465 -326 -148 467 284 65
719F5K79k11J1K65m76j71N41J48m34l59L37r3o5J17j63j38K09j96k44M13J40l37
$$ 65 344 133 144 409 -67 -238 303 451 17 -342 -5 -98 -163 -46 -209 -347 -138 -334 -578 -165 -25 -362
741c62k18L34J61q4l0N95n9N3k14k02M48K45k73k99l3P9R3j85j9p6J42j78l67
$$ -362 -580 -246 -85 -169 -199 396 337 390 176 -26 422 667 394 95 62 141 234 49 30 -46 96 -82 -449
764d49OO27j13p07P7L47o6j5j77N1K35J87n3p6J54L75j57J81o0r4J71j50k18J84
$$ -449 -443 184 71 -636 -559 -212 -278 -293 -470 -419 -184 3 -50 -126 28 403 246 427 367 273 444 294 76 260
788B60J58l56j55j83M18k17Kj96Q0R4j41J8K19j02j5M7j57J19n8J64O7O5j01J82
$$ 260 418 62 -93 -276 142 -75 -73 -269 -189 -95 -236 -218 1 -101 -116 -69 -226 -107 -165 -1 66 131 30 212
812B12L1n5K51k82m3J18J36l39k04K88o8l03K52q2l10L78j00j07K20J5k18o8J96
$$ 212 243 188 439 157 114 232 368 29 -175 113 45 -258 -6 -88 -398 -20 -120 -227 -7 8 -210 -278 -82
835h2P2L6p7j15j79L73K33l80K20J49k40N5M27k39l6O7l7l38M9K96l37j9K49l57
$$ -82 -10 26 -51 -166 -345 28 261 -119 101 250 10 65 492 253 217 284 247 -91 -42 254 -83 -102 147 -210
859b10q4K23J74k29j7L64n36J10K70j51k82L91R0n08Q3L26j16M6J68j07J82o2
$$ -210 -294 -71 103 -126 -143 221 -315 -205 65 -86 -368 23 113 -395 -312 14 -102 -56 112 5 187 125
881A25o3k9J66L5j9k25J19j48n2O8K6j89J86j12m0R2j7Q0j9j42rk5L30m5m15L87
$$ 125 62 33 199 234 215 -10 109 -39 -91 -23 3 -186 0 -112 -152 -60 -77 3 -16 -158 -167 -192 138 93 -322 65
907F5N7k99Q4M68n7j43O9J64k26J8Ql20K86K2k25k47K90R5j89k29J88j84J58K40
$$ 65 122 -177 -93 375 318 175 244 408 182 200 208 -112 174 196 -29 -276 14 109 -80 -309 -121 -305 -147 93
931I3k45j94M05p4j83p2N66k37r5K45l66R4L88j43j19J69j15j14Q3J24l31K31
$$ 93 -152 -346 59 -15 -198 -270 296 59 -36 209 -157 -63 325 182 63 232 117 3 86 210 -121 110
953A10J00l66j26J88J77k51N7l6j26j0L53k74n0L05j3j34K20o2j10K25J57k51
$$ 110 210 -156 -282 -94 83 -168 -111 -147 -273 -283 70 -204 -254 51 38 -96 124 62 -48 177 334 83
975H3r8J82l0k80K36J34j82n1P6r4K12r5m6l54K55P4j85K59j93j40R5K53l19l15
$$ 83 -15 167 137 -143 93 227 45 -6 70 -24 188 93 47 -307 -52 22 -163 96 -97 -237 -142 111 -208 -523
999e23O61J7j35K7K53n22K83K71l39M0K20k30k8K01J51m34K30j10k10K77N6j45
$$ -523 138 155 20 47 300 -222 61 332 -7 33 253 23 -5 196 347 -87 143 33 -177 100 156 11
1021A1k93M02j28k12K22K8l12J24k8o5K16J68k57Q4K59k63K3L31o2l33J86J37
$$ 11 -282 120 -8 -220 2 30 -282 -158 -186 -251 -35 133 -124 -40 219 -44 -21 310 248 -85 101 238
1043B38j74k05M34k52l50M37O3j93J79j4l83J25K17k20j94M88l48l22N04k5l91
$$ 238 64 -141 293 41 -309 128 191 -2 177 163 -220 -95 122 -98 -292 196 -152 -474 30 5 -386
1064c86K15K50k58M9L78j29k24K61R1j7l1r0k52J62J48j18k49L44k5m01L93p4
$$ -386 -171 79 -179 -130 248 119 -105 156 247 230 199 109 -143 19 167 49 -200 144 119 -282 111 37
1086C7q3p7K02j92j1J11r7j53K7K35q5j9J6N5J39K51nk52J66j42j89J58K43m33
$$ 37 -46 -123 79 -113 -124 -13 -110 -263 -236 -1 -86 -105 -89 -34 105 356 351 99 265 123 -66 92 335 -98
1110i8N0R3O5l65O8J80j84K96j94r9J43Q5p6j56K12k4k31J66J48r9P6K00k55M0
$$ -98 -48 45 110 -255 -187 -7 -191 105 -89 -188 -45 40 -36 -192 20 -4 -235 -69 79 -20 56 256 1 41
1134D1K19r3j29J53L1Rq4m3j02k45K56L2k81J49M6q8O6Q0r1P0o1m1n5K73J43k95
$$ 41 260 167 38 191 222 231 147 104 2 -243 13 45 -236 -87 -41 -129 -63 17 -74 -4 -65 -106 -161 112 255 -40
1160d0p2R9j9R0J8J00j90J85N4k57N5K3P9j18k3p8j78J87J35j72K06j75jJ50J77
$$ -40 -112 -13 -32 58 76 176 -14 171 225 -32 23 46 125 7 -16 -94 -272 -85 50 -122 84 -91 -92 58 235
1185B35j47l2j88K25j07J6J80l16J40j36K43q9n2R0j5O6r0O3j05l2K38j24j4n2
$$ 235 88 56 -132 93 -14 2 182 -134 6 -130 113 24 -28 62 47 113 23 86 -19 -51 187 63 49 -3
1209co3p4J04K55j46r1O5j41K33kq8r2q2J78j07J33j75NO0N5L6j90K42k60J19
$$ -3 -66 -140 -36 219 73 -18 47 -94 139 137 49 -43 -125 53 -54 79 -96 -91 -31 24 60 -130 112 -148 -29
1234b9J38l3K1j3j01j2J84o5j46J5n4P3LM0j07k9K3J47K3j88J19j27J41n8m2j07
$$ -29 109 76 97 84 -17 -29 155 90 -56 -41 -95 -22 -19 21 -86 -115 -92 55 78 -110 9 -118 23 -35 -77 -184
1260a84K35j78J52N4OK7m6J16j01j48J89j62J30R9k57Q8j0J34Nk69%J30kJ48k55
$$ -184 51 -127 25 79 85 112 66 182 81 -67 122 -40 90 189 -68 20 10 144 149 -120 -120 10 8 156 -99
1285i9R4n6J5rj4L4L15l51O5L6j36K65j95J7J05p0P3K1j5J08q6j59j17J35K0j98
$$ -99 -5 -61 -46 -55 -69 -35 280 -71 -6 30 -106 159 -36 -19 86 16 89 110 95 203 117 -42 -159 -24 -4 -202
1311b02K7j10K23KJ00j51r5K90rp8M6j4K2j31%K08m9K0O2k68L16p2j64O9P2p5
$$ -202 -175 -285 -62 -60 40 -111 -206 84 75 -3 43 29 51 -80 -80 128 79 99 161 -107 209 137 -27 42 114 39
1337C9j26O6MJ5k21J97j73O0J57j53P2J4L1P9j98K07l0j99K70Nj30k6K67j79N2
$$ 39 -87 -21 -17 -2 -223 -26 -199 -139 18 -135 -63 -49 -18 61 -137 70 40 -159 111 116 -14 -40 227 48 100
1362A00J12k63m6J46L4PK3o4Rj17K17k63M2Q7j31R7q6k5k6K55o5m7J01K9j51L4
$$ 100 212 -51 -97 49 83 90 113 49 58 -59 158 -105 -63 24 -107 -10 -96 -121 -147 108 43 -4 97 126 -25 9
1388In2L2oK7J63q8l8J44Mk32Q6j5o8J7K18j15j02j7J28p2N0Q0j39K2P8l7J54
$$ 9 -43 -11 -17 10 173 85 47 191 195 -37 49 34 -34 -17 201 86 -16 -33 95 23 73 153 14 36 114 77 231
1415B31j96l9J40j48P3j69K03M3k42J77L9m6m7m4L4m7j05J89k24K42j44J24k3
$$ 231 35 -4 136 -12 61 -108 95 138 -104 73 112 66 19 -25 9 -38 -143 46 -178 64 -80 44 21
1438B1q7J01j01J38j68M3R7n4K8j26J35k5j61J2P1p3K47j59O5O9L2o9j7O7Lk8
$$ 21 -66 35 -66 72 -96 -53 44 -10 18 -108 27 2 -159 -147 -76 -149 98 -61 4 73 105 36 19 86 89 61
1464F1j41q7J19O7nnj3LJ17k39N6nJ06j06R2m2p2J19l5J5k5O6J6j4l5M2j41k1
$$ 61 -80 -167 -48 19 14 9 -4 -1 116 -123 -67 -72 34 -72 20 -22 -94 25 -10 5 -20 46 62 48 13 55 -86 -107
1492a07K35j63J29j62R9J9q0q9O5M8Rk1j71K56j41O2l6M1J37j61KP0j03p9K34
$$ -107 128 -35 94 -68 31 50 -30 -119 -54 -6 3 -18 -189 67 -74 -12 -48 -7 130 -31 -29 41 -62 -141 93
1517I3j69J31J33l26K65m2Lkl4N0k15J24j05L11k50M0J51k84R1Rr1J52l0J6%j2
$$ 93 -76 55 188 -138 127 85 88 86 52 102 -113 11 -94 217 -33 7 158 -126 -35 -26 -117 35 5 21 21 9
1543Ij74Q2J05n4J29P4m13L34o1j92J96l0M4k4M2K1q9J68n8M6k08qo0O4R8m3Q7
$$ 9 -165 -83 22 -32 97 171 -242 92 31 -161 35 5 49 25 67 88 -1 167 109 155 -53 -61 -121 -57 41 -2 85
1570H5Op5j13P6R1j28j4oL3P9Kq9J41j94J27j02K44m3r9l1O4j01J71j66PJ91k26
$$ 85 91 16 -97 -21 70 -58 -72 -78 -45 34 36 -53 88 -106 21 -81 163 120 21 -10 54 -47 124 -42 -35 156 -70
1597g0K16j30j3J17q9j76Q3J61k13K2N1k2M4m7J04j59K10j83L3O0J07M8k62L01
$$ -70 146 16 3 120 31 -145 -62 99 -114 -92 -41 -63 -19 -66 38 -121 89 -94 -61 -1 106 154 -108 193
1621A93j84L4jJ57j28q3J19j63r4J08J0Po2J62j27M2L8Q3k78L1J12k82L65k20
$$ 193 9 43 42 199 71 -12 107 -56 -150 -42 -32 -25 -87 75 -52 -10 28 111 -167 -136 -24 -306 59 -161
1645a61K43j60nJ67q4j34N0o4P2J07k2K70j30k88L1J73q0o9j7K9J20n6l4O1j05
$$ -161 82 -78 -83 84 0 -134 -84 -148 -76 31 9 279 149 -139 -108 65 -15 -84 -101 -72 48 -8 -42 19 -86
1670h6K18n5j68l1M8L9j7l9J54k4j04l4J52q6M5P9J9O6j21n5Q8R6j89O0P6n4k03
$$ -86 132 77 -91 -122 -74 -35 -52 -91 63 39 -65 -99 53 -33 12 91 110 176 55 0 88 184 -5 55 131 77 -126
1697a26J33m7j2O5m0QK13n6o2Q9k44J21mn2l8R1j42J40q0j24K24J8j50J05jq2
$$ -126 7 -40 -52 13 -27 -19 194 138 76 165 -79 42 38 -14 -52 39 -103 37 -43 -167 57 75 -75 30 29 -53
1723e3J80j30J8M6r5N7j66J88L7m9Rj89K29j17J03q3K4N3l7j19J5J00L0M6r7j4
$$ -53 127 -3 15 61 -34 23 -143 45 82 33 42 -147 82 -35 68 -15 9 62 25 -94 -79 21 51 97 0 -14
1749a4o1J15L5m2j26R6k11K43k4j1KMJ59j53J50l78J80RK7L5J02j37j51K51j68
$$ -14 -75 40 75 33 -93 3 -208 35 11 0 2 6 165 12 162 -216 -36 -27 0 35 137 0 -151 100 -68
1774f8K26j63m3J28k00J37o8Q9j13J11N4m2Q1r4j74J69J4j38K11k33j0J38J1j13
$$ -68 158 -5 -48 80 -120 17 -51 38 -75 36 90 48 129 35 -139 30 44 -94 117 -116 -126 12 23 -90
1798i0j22L55j34j38J1J68Q2j07l8p6o1J02j02N8J55p7l4Q8j40J43P1j83L8r5
$$ -90 -212 143 9 -129 -118 50 132 25 -13 -89 -150 -48 -150 -92 63 -14 -48 40 -100 43 114 -69 -31 -126
1822a26J36j04J89l0k5j7O2j09O6m9K1k2k01J16O6L5No5r4J53N1Q2l6k03R6n5
$$ -126 10 -94 95 65 40 23 85 -24 42 -7 14 -8 -209 -93 -27 8 13 -52 -146 7 58 140 104 -99 -3 -58
1848e8J93k17J17O1R0k01O4l9J04k86Q4J66j70kK02N1j43j62J63R5j46K0OL9N1
$$ -58 135 -82 35 96 186 -15 49 10 114 -172 -88 78 -92 -94 108 159 16 -146 17 112 -34 -14 -8 31 82
1873H2q8j5mP9J8j3m4j7P1j32MK43j22k20R1Q5K04l35J09k0J66q9j81K50j04J05
$$ 82 -6 -21 -25 54 72 59 15 -2 69 -63 -59 184 62 -158 -67 18 222 -113 -4 -24 142 53 -128 122 18 123
1899A23l7o4j84O0P4j0qjj15J77J9K0r9N5K1q1r0J67k03K48jk29N0pJ38J33j61
$$ 123 86 22 -162 -102 -28 -38 -46 -47 -162 15 34 54 -45 10 31 -50 -140 27 -176 72 71 -158 -108 -115 23 156 -5
1926eK7j57R6K99j80j94J2rJ5K40k13k2p3J34N8L1j6o2o3J08j54L05l9q0j41J43
$$ -5 22 -135 -39 260 80 -114 -102 -111 -96 144 -69 -91 -164 -30 28 59 43 -19 -82 26 -128 177 138 58 -83 60
1952F0Jl00K68jJ2j79L03k18L2J1k95L30m4Q8J64k00m5l5K3M9o0j8j09J95RM3
$$ 60 61 -239 29 28 40 -139 164 -54 -22 -11 -306 24 -20 68 232 32 -13 -48 -25 24 -36 -54 -163 32 41 84
1978H4j33J37k02p1J98J37j74j13R3k3J32o6l8LJ74j80l4M6J09J24k35J44k20
$$ 84 -49 88 -114 -185 13 150 -24 -137 -44 -67 65 -1 -39 -36 138 -42 -76 -30 79 203 -32 112 -108
2001a08R4l2P6Q5Q1k73P9m0N0r6O6K3p4nOO3j4M3j2J4o9L1L08k94j62R2P4q2K25
$$ -108 -14 -46 30 115 196 -77 2 -38 12 -84 -18 5 -69 -74 -68 -5 -19 24 12 26 -43 -12 296 2 -160 -68 6 -76 149
2030A49k23o9J97j04O0q6J60j36L8M8Q9j41j09J45L0o3J58k17R4j07N7J5k2M7
$$ 149 -74 -143 54 -50 10 -76 84 -52 -14 34 123 -18 -127 18 48 -15 143 -74 20 -87 -30 -15 -37 10
2054A0J09j56j6J38j20nk4J62%k77K4J49Q8O4r3q4J11m0j12K20j94J82k50M6k8
$$ 10 119 -37 -53 85 -35 -40 -64 98 98 -179 -155 -6 82 146 53 -31 80 40 -72 148 -46 136 -114 -68 -96
2079i6J07kM5p7O8N1m8R8Mj53J1J6n3k6J3J09j18P0m9K10jl28J19l8N6L0r1M5
$$ -96 11 9 54 -23 45 96 48 146 150 -3 8 24 -29 -55 -42 67 -51 19 -30 180 179 -149 -30 -68 -12 18 -73 -28
2107b8K56j74J1n0Ol6L4j12m7L42k36q1J48k54K67j94J21M6m9K57k18J6M1j47
$$ -28 228 54 65 15 21 -15 19 -93 -140 202 -34 -115 33 -221 46 -148 -27 19 -30 227 9 25 66 -81
2131h1L1O9lP1j84N4N5j22J06n0l9P6j06J30j2P1q1j8M0mq5J21m4Q2M3p0M1j36
$$ -81 -50 19 16 87 -97 -43 12 -110 -4 -54 -93 -17 -123 7 -5 66 -15 -33 7 3 -82 39 -5 77 120 50 91 -45
2159d5K05k28J90j61j9N8k14O7O1K03j94J58lj21P1m1j4N7P1q4M8J10j74J03p6
$$ -45 160 -68 122 -39 -58 0 -214 -147 -86 117 -77 81 78 -43 28 -13 -27 30 101 17 65 175 1 104 28
2184B8m3J64j47R2k1rn8n9J30p9k01L32k72M2O0J31p9n2Rm7J44qj86K26j14Qj63
$$ 28 -15 149 2 94 73 64 6 -53 77 -2 -203 129 -143 -101 -41 90 11 -41 -32 -79 65 57 -129 97 -17 -9 -172
2211a72K61r1r9jJ07Q5j53J06n0L4K3j05k4l3K40k76K91k28NP7l6O6J07o7o1k3
$$ -172 89 -2 -101 -102 5 90 -63 43 -7 27 50 -55 -79 -112 128 -148 143 -85 -80 -3 -39 27 134 67 6 -17
2237a7l16J73J75j1m8qJ45j01p1R3Jj4M0q6l2J5L5n9l8J30N3J3j27l2K07k06K18
$$ -17 -333 -160 15 4 -44 -52 93 -8 -79 14 15 1 41 -45 -77 -62 -27 -86 -124 6 59 72 -55 -87 120 -86 132
2264A32j65k0L8j17J84N6p8j15O3q4K08o7M7r7QR7k61K46lj61J12oj42K41m9o8
$$ 132 -33 -53 -15 -132 52 108 30 -85 -22 -106 102 35 82 -15 -7 90 -171 75 72 -89 23 17 -125 116 67 -1
2290aJ00j23j00K04j36N1N0j68R1k2Q4J55j41j82K03q0K0J5R2j66J9j19K35j04
$$ -1 99 -24 -124 80 -56 -5 45 -123 -32 -54 30 185 44 -138 65 -15 5 20 112 -54 -35 -154 81 -23
2314b3o0J38k6P0r0j9k0Q3r1j46J33M0j71J09j1J01K0m5Mp9J96r8K27j69j05R5
$$ -23 -83 55 29 99 9 -10 -30 53 -38 -184 -51 -11 -182 -73 -84 17 37 -8 -4 -83 113 15 242 73 -32 63
2340F3q5J64k67K50K5j15r3K6R8j17l2J24l7j25J66j10J24r0m3J6q2J71j44P6
$$ 63 -22 142 -125 125 150 35 -58 -32 66 -51 -83 41 4 -121 45 -65 59 -31 -74 -58 -140 31 -113 -37
2364c7J58k98K36j50m7K27j01Qj71K45j67J75p1%J9j36R6k3K17l72K58k15R3P1
$$ -37 121 -177 59 -91 -138 89 -12 -4 -175 70 -97 78 7 7 26 -110 -14 -37 180 -192 66 -149 -56 15
2388A5j6r5K34l33P8K08j50r8K10j30L2K18j62J8r9PN6N2j41J51j18L5j4Q3L2
$$ 15 -1 -96 138 -195 -117 91 -59 -157 53 -77 -45 173 11 29 -70 -63 -7 45 -96 55 -63 -28 -42 41 73
2413G3j1q1J35j43N4l3o1J13rK4L%p9q4P2Q6j17PJ58j6l0l8k12L68k88Q4k7N4
$$ 73 62 -19 116 -27 27 -6 -67 46 37 61 64 64 -15 -99 -27 59 -58 -51 107 91 61 23 -189 179 -109 -25 -52 2
2441BJ46k16o8l6J29M5lOJ49j36l0J5m2jnJ00n9M9o1p4J98k13J41r5N8J39p9j67
$$ 2 148 -68 -136 -172 -43 2 -1 5 154 18 -12 3 -39 -40 -45 55 -4 45 -16 -90 108 -105 36 -59 -1 138 59 -108
2469a08J18q2K22l6j48J07Nj82J25l3j0j75J60J05k8n9j7RN5o9k6P2R4r3M2K2
$$ -108 10 -72 150 114 -34 73 78 -104 21 -12 -22 -197 -37 68 40 -19 -36 -27 28 -41 -67 5 99 6 48 70
2495G0j08QJ26j39N5M2k4n3q7N2J35j9j91P6J26p6j5J54j17j56J35l5M7j49J19
$$ 70 -38 -30 96 -43 12 54 30 -23 -110 -58 77 58 -133 -57 69 -7 -22 132 15 -141 -6 -41 6 -143 -24
2520b4q5nJ41J21j8j19o3J74K9o8m7j0j08J03l6o6K78j9j67rj07J70j97P4M4P8
$$ -24 -109 -114 27 148 130 11 -52 122 151 83 36 26 -82 21 -15 -81 197 178 11 2 -105 65 -132 -58 -14 64
2546F4J27k48L2j34L01j69J51J6k96K16n4J47j95K20p2q2J2o1L8K3j07m4J37o2
$$ 64 191 -57 -25 -159 142 -27 124 140 -156 60 6 153 -42 178 106 24 36 -25 13 36 -71 -115 22 -40
2570d0J92j59kM3Qj27J18K9O9Pk25J28r4M0M4r5Q8m3m4P8j23J25P0l3j15R7j39
$$ -40 152 -7 -9 34 42 -85 33 62 131 138 -87 41 -53 -13 31 -64 24 -19 -63 15 -108 17 87 54 -61 36 -103
2597a03J82k13J28L6j11J2Q1l6P0r7l7J82k8j07K34j93P9L0k8L9nj02p1L9L8j03
$$ -103 79 -134 -6 30 -81 -69 12 -24 46 -51 -88 94 66 -41 193 0 79 109 81 120 115 13 -58 -19 19 -84
2623h4J64L5o9n4o4R8J10o0Lj49R9j04M5J05j24k7J87Mj46O5p5n9J04J69j19j80
$$ -84 80 115 46 -8 -72 26 136 76 79 -70 29 -75 -30 75 -49 -76 111 115 -31 34 -41 -100 4 173 54 -126
2649a26N2J52j68J93j79O4n5m3j4R5j15P9K5J03q4M1M2o6n2J54j06J94l4p4O2
$$ -126 -74 78 -90 103 -76 -12 -67 -110 -124 -29 -144 -65 -40 63 -21 20 62 -4 -56 98 -8 186 152 78 140
2674A40p7o8J3m5j2J57k73K65R6r8j37M6O5K3j87M1l3J57j8j86K00q9k9J1J34
$$ 140 63 -5 8 -37 -49 108 -165 100 196 98 -39 7 72 95 -92 -51 -84 73 55 -131 69 -20 -49 -38 96
2699I6r0Pj40K40j02Ro2nL3J13q5k01K18p1N4K6N3k41R3o1L3J24o2j04Q6N6q0
$$ 96 6 13 -127 113 11 20 -42 -47 -14 99 14 -187 31 -40 14 40 93 -148 -55 -116 -83 41 -21 -125 -39 17 -63
2726f3nN5o3KR3q2j7M1m9M7J94k32J71j33O2k4o5O2J0O3j82O8K2k4J7P9j04J65
$$ -63 -68 -13 -76 -74 19 -63 -80 -39 -88 -41 153 -79 92 -41 21 -3 -68 -6 4 67 -115 -47 -25 -49 -32 47 -57 108
2754A08k88J29%O9K9m7K01r5j86J33nN4j05P0Q6n0j01K53j53n1l4J3j35J04m0
$$ 108 -180 -51 -51 18 47 0 201 106 -80 53 48 102 -3 67 153 103 2 255 102 51 17 30 -105 -1 -41
2779d1R6l9J15p4j07K9J68j5j13lj54K29j60J80j50l4n8K14n0L9P3j20J48k02
$$ -41 55 16 131 57 -50 -21 147 132 19 16 -138 91 -69 111 -39 -73 -131 83 33 72 145 25 173 -29
2803b9k01L65k01J26Q5j19L8j46J38l8K3m8J5l8p1j8O0Q6J4ooRj81j34K54J16
$$ -29 -230 135 -66 60 145 26 64 -82 56 18 41 -7 8 -30 -101 -119 -59 27 41 35 29 38 -143 -277 -23 93
2829I3r3q3K33j42q8qJ86J08k32lP0K8j10R2O9j35n7O1J3J6k9N8m0J39L1r1j88
$$ 93 0 -83 150 8 -80 -88 98 206 -26 -29 41 69 -41 51 120 -15 -72 -11 2 18 -11 47 7 146 177 86 -102
2856a02L5J27k05MJ03K03k24J24j47q8J16P8L7Lm1k8j42P8J8j33Q9J84k3j02N2
$$ -102 -67 60 -145 -141 -38 165 -59 65 -82 -170 -54 24 61 64 23 -5 -147 -69 -51 -184 -95 89 66 -36 16
2881A6M0m1K7j2l0m7kn5J00J33K3l29J02K7P5qj47J75l6J7P6n5Oj25M7l5L0L3
$$ 16 56 15 42 30 0 -47 -49 -104 -4 129 152 -177 -75 -48 27 19 -128 47 11 28 104 49 55 -70 -23 -58 -28 5
2909Ej39J24j8l5O4N1j52K24j11L0m4m2l5R5m3l1J01K3p5k8m5k5m9J78j38J50
$$ 5 -134 -10 -28 -63 1 52 -100 124 13 43 -1 -43 -78 17 -26 -57 44 67 -8 -36 -81 -106 -155 23 -115 35
2935C5p0k3J65l7l5k33K27LLk4Pq5J56L0j83J16q5o5J25n4p1J44j46J28l8Q8j4
$$ 35 -35 -58 107 70 35 -198 29 32 35 11 18 -67 89 119 -64 52 -33 -98 27 -27 -98 46 -100 28 -10 78 64
2962F4l0j58O1J65j07J33k0k12KJ14J59j94R3j47n9jL1p0L6QP1J95k35j3L20j87
$$ 64 34 -124 -63 102 -5 128 108 -104 -102 12 171 -23 70 -77 -136 -137 -106 -176 -140 -132 -61 134 -101 -114 206 19
2988A9j53J35o4Q3j21K20p8j7Qj35J01k80M01l5k2p7K6l6j16J41n8k3J35L1o1
$$ 19 -134 1 -63 20 -101 119 41 24 32 -103 -2 -282 119 84 62 -15 11 -25 -141 0 -58 -81 54 85 24
3013B4P2j38J30k4J5q5N0qj03J17l9Jr0M4m4J92k50l6K92r9J07n5j31J05k9O1
$$ 24 96 -42 88 64 79 -6 44 36 -67 50 11 12 -78 -34 -78 114 -136 -172 120 21 128 73 -58 47 18 79
3039G9L4n2Jj34N4n7O0Q1J37k60PP7j65J81j32OK48k18pJ28q5l4J01l4M0J8k3
$$ 79 113 61 62 -72 -18 -75 -15 66 203 -57 -50 27 -138 43 -89 -83 165 -53 -60 68 -17 -51 50 16 56 74 51
3066E1j22J40p6l0r4P7R9j04p4K20m1n2R4l3m1j50m8J55k4J4L3Q9p9o4K06j57
$$ 51 -71 69 -7 -37 -131 -54 45 -59 -133 87 46 -6 88 55 14 -136 -184 -29 -53 -39 -6 83 4 -60 146 -11
3092a1j11J67k7n4J00k8m9j59K7K50j47L7l0J15j25L2o0R6J63j0k04J10j49qJ07
$$ -11 -122 45 18 -36 64 36 -13 -172 -145 105 -42 -5 -35 80 -45 -13 -73 23 186 176 -28 82 -67 -75 32
3117C2j75J45j11R5p6N4N0O2rP5j81L9j7j93K12L5j37J65j50J46j32R6j96J05
$$ 32 -143 2 -109 -14 -90 -36 14 76 67 142 -39 0 -17 -210 2 37 -100 65 -85 61 -71 25 -171 -66
3141f6J67p4rN6j48L1p6P6K9Q0n7o9R6j98K14K4L5j05RL6q4L9j09J01J4j08J80
$$ -66 101 27 18 74 -74 -43 -119 -43 -14 66 9 -60 36 -162 52 76 111 6 15 51 -33 6 -103 -2 12 -96 84
3168H4k2k1k8o0l8L46k92m6j0J57j11J27K6k08K76p9j9j20P4r8J44j21K1j52J6
$$ 84 62 41 13 -47 -85 261 -31 -77 -87 70 -41 86 112 -96 180 101 82 -38 36 -62 82 -39 -18 -170 -154
3193a54K72j04J32k10J30L1j54J44n4R5j93J68m8M1%m2L4j01J00j78QmK14j54
$$ -154 118 14 146 -64 66 97 -57 87 33 128 -65 103 55 96 96 54 88 -13 87 -91 -83 -87 127 -27
3217b7j04j7K94k21J63n6j28K17j70M7J9p3R9q6O4K2o5q6J18j89L16r5q5P4j76
$$ -27 -131 -148 146 -75 88 32 -96 121 -49 -2 17 -56 43 -43 21 43 -22 -108 10 -179 137 42 -43 31 -145
3242a45J65j00j9L9J81r5Q6l00J57O8o2J18Jk41J99q8m4L1o4K80k0j08j91J21
$$ -145 20 -80 -99 -60 121 26 112 -188 -31 37 -25 93 94 -147 52 -36 -80 -49 -113 167 147 39 -152 -31
3266c1J87j93J01Q4k56Q0J89j36m4R7o9j32J66o9k15K70J83l09L28r8k10O1j43
$$ -31 156 -37 64 148 -108 -28 161 25 -19 78 9 -123 43 -26 -241 29 212 -97 231 133 -77 -16 -159
3289a59J30Pn0Q7N8k37P0R9K7j5j42M0J00M9L9r8M2n4r0q1K66k05j0J77j48l2
$$ -159 -29 -22 -72 15 73 -164 -94 5 32 17 -125 -85 15 64 103 5 47 -7 -97 -178 88 -117 -127 50 -98 -130
3315a30J47j27J74L6j85N6l7J27J3L3n4k25M4J72N9n1j11K39j70L7j4q0m2K5J27
$$ -130 17 -110 64 100 -85 -29 -66 61 74 107 53 -172 -128 44 103 52 -59 180 10 47 33 -47 -89 -64 63
3340F3nq0J4K4N3j6j1N6o0j39J13j38N3J15j6P3k06M4L0r1L04k87j1J28j29J87
$$ 63 58 -22 -8 16 69 53 42 98 38 -101 12 -126 -73 42 26 99 -107 -63 -33 -124 180 -107 -118 10 -119 68
3366F8r4Q1j64J28R7j67P4J3M3Lj26L3K7j1K2l7J06r1r5O9j4J4J11j77J39p3J93
$$ 68 -26 55 -109 19 116 -51 23 36 79 82 -44 -11 16 5 27 -10 96 5 -90 -21 -35 -21 90 -87 52 -21 172
3393A72k00j8N2j16p1J88j09O9M1L4Q4p5j11r3J21pJ46l3j2p0J22j15K20k44N6
$$ 172 -28 -46 6 -110 -181 7 -102 -33 8 42 126 51 -60 -153 -32 -39 107 74 62 -8 114 -1 219 -25 31
3418C1o3j8R6k0k3o0Q2m8K07j26L4k36R8J11l1K7N7o6Q4o6l5L6j37n6J53l9r1
$$ 31 -32 -50 46 26 3 -57 25 -23 184 58 92 -144 -46 65 34 61 118 52 136 70 35 71 -66 -122 31 -8 -99
3445i9l1J94L5j55P4j52K85n8j13J59mo5j08Ll7K22p8j53J75k12P6O9j18O7o1
$$ -99 -130 64 99 -56 18 -134 151 93 -20 139 135 70 -38 -35 -72 150 72 -81 94 -118 -42 27 -91 -24 -85
3470h5J46k47J89J56k28JR8l9J24r5J7p6j19M2L3q4J89O3j77J7J11R4m2j11m2
$$ -85 61 -186 3 159 -69 -68 30 -9 115 20 37 -39 -158 -116 -83 -167 22 85 -92 -75 36 130 88 -23 -65
3495f5Q4Nj79J77r7J91j23m6N2P8o3j09J59j2r0J26j17Kj5J62j81J20J11q6k4
$$ -65 19 24 -155 22 -75 116 -7 -53 -1 77 14 -95 64 52 -38 88 -29 -27 -42 120 -61 59 170 84 60
3520F0j05J07j62J09k3K30j97J19j51O3J55j33k14L09j08p3o5k6L7j0J22J31k20
$$ 60 -45 62 -100 9 -14 216 19 138 -13 50 205 72 -142 167 59 -14 -79 -105 -68 -78 44 175 -45
3543d5m8j00K10q4m6J05J34k6l7j44J55m0q2J83j97J28L6Ok08J04N0J01j09o3
$$ -45 -93 -193 17 -67 -113 -8 126 100 63 -81 74 34 -48 135 -62 66 102 108 -100 4 54 155 46 -17
3567a7KJ70r2pp9j9p7L41l18N3K8n6J8J6Q0j54K37r9R8j38l6M2j11J07k11K59
$$ -17 -15 155 63 56 -23 -42 -119 222 -96 -43 -15 -71 -53 -37 43 -111 126 27 125 -13 -49 -7 -118 -11 -222 37
3593C7p3P2j40Q1k9J03r5J65j72j17K54q1N2j65J11Jq2K6O8J05j84n0O6pj35R8
$$ 37 -36 36 -104 -23 -52 51 -44 121 -51 -168 86 5 57 -108 3 4 -78 -52 16 121 -63 -113 -47 -54 -189 -91
3619i1N3J69j37j60J01j4O0O1P4p5N5j68r0L68k68J98p0J48k57Q8J1j9J8m4l8
$$ -91 -38 131 -6 -166 -65 -79 -19 42 116 41 96 -72 -162 206 -62 136 66 214 -43 45 56 37 55 11 -27
3644b7J02Jj04l0K6J6n8J71k03N9k9k6P2Q4k5l8N4J9Mj11N5O6J16j87K3L0j03
$$ -27 75 76 -28 -58 -32 -16 -74 97 -106 -47 -76 -102 -30 54 29 -9 45 64 68 -43 12 78 194 7 30 60 -43
3671d3M3Q2M8j58M2l5R4J09j50J26q5q4m2R0m0J43k68J57j40P1n2K43j73J35j10
$$ -43 0 82 130 -28 14 -21 73 182 32 158 73 -11 -53 37 -3 140 -128 29 -111 -40 -92 151 -22 113 3
3696CJ15j26n8k4L31k02qJ32j49j2J20j40Q9j72k1J20J7j20O6Q8r7J31l8m1j50
$$ 3 118 -8 -66 -90 241 39 31 163 14 2 122 -18 71 -101 -122 -2 15 -105 -39 49 -48 83 45 4 -146
3721a46P0P3kMJ97k53R5rj46k9J65J31k84O5q1J88j71K9j3J10q9K15j07m1r7N7
$$ -146 -76 -3 -5 -1 196 -57 38 29 -117 -146 19 150 -134 -69 -150 38 -133 -104 -117 -7 -96 119 12 -29 -126 -69
3747f9J53o2k2r7%R1K0R3k64K48j33J04M5j22J7J70k67J46k70M56l44J56j13m2
$$ -69 84 22 0 -97 -97 -6 14 107 -157 91 -42 62 107 -15 2 172 -95 51 -219 237 -107 49 -64 -106
3771a06J16p3J41j11p4Q9J35n2K8n5R7k24K1n5K40j92K05l18K70j06J15Q5j42
$$ -106 10 -63 78 -33 -107 -18 117 65 93 38 135 -89 -68 -123 117 -75 130 -188 82 -24 91 176 34
3794C4J00j45k7K3j73J33%Q8k03K39L1j31k4M6Q7j9j13K93k05pr0L3RP7pp4j7
$$ 34 134 -11 -38 -15 -188 -55 -55 33 -170 69 100 -31 -55 -9 78 59 -54 239 34 27 -63 -30 -21 56 49 -25 -42
3821d2m7K28r5O3j46j34J85J1p5R4j13J93j59k9L0J23Qk01J68o3r2K83k56N9l7
$$ -42 -89 139 44 107 -39 -173 12 23 -52 42 -71 122 -37 -66 -36 87 95 -106 62 -1 -93 190 -66 -7 -44
3846d4K2k7pL3O6J17k05J47j48l5P1j6k2M9L4j68K01p3j11O4J25rp8m6M2O6j4
$$ -44 -22 -49 -56 -23 43 160 -45 102 -46 -81 -10 -26 -48 1 35 -133 68 -5 -116 -52 73 64 -14 -60 -18 48 34
3873C4k1nj0N7r8N5Rk2jq0J09j36J63o9L9m6j01J87P5j0j49oJ54k09J73j6r5j29
$$ 34 13 8 -2 55 -43 12 21 -1 -2 -82 27 -109 54 -15 24 -22 -123 64 139 129 -20 -26 128 -81 92 76 -19 -148
3901a48J33J69j23L7k13J55R8J6J8k99J53P6j89K4K1o5J05q8K6L6R8K1M4j07o0
$$ -148 -15 154 31 68 -145 10 108 124 142 -157 -4 72 -117 -93 -72 -137 -32 -120 -94 -58 40 61 105 -2 -62
3926f2K6J17j8j28pK05j48K23p0k2k10J14JJ45q1o3p7L2j9j12K21M3j65J02J22
$$ -62 -36 81 63 -65 -72 133 -15 208 138 116 -94 20 21 166 85 22 -55 -23 -42 -154 67 110 -55 47 169
3951A69j86K5m0j56L11k94O5K46j76N0K5l2j01K36n0q0o1nK1P4j79J40O3o2p6
$$ 169 -17 8 -32 -188 123 -171 -106 140 -36 14 39 7 -94 142 92 12 -49 -54 -33 41 -138 2 65 3 -73
3976g3J19J1j0l6j97R3J41j10PM5M4k6K60l15K2J89k00N5J3j13N5J23k0j02J56
$$ -73 46 57 47 11 -186 -93 48 -62 -55 -10 34 8 268 -47 -25 164 -36 19 32 -81 -26 97 77 -25 131
4001A31n6j41R0N2j9q5M0O6J29k50K1LkJ4J75k77J07kJ7J93j93r6jn9J61O9j68
$$ 131 75 -66 24 76 57 -28 12 78 207 -43 -22 -19 -21 -7 168 -109 -2 -4 13 206 13 -83 -84 -143 18 87 -81
4028h1J9J37o1P9q2j28R5J45N9k27J76o3Mn4J69k07k2P9%j15J44Nj11J7n9OJ33
$$ -81 -62 75 14 93 11 -117 -22 123 182 -45 131 68 72 18 187 -20 -42 37 37 -78 66 71 -40 -23 -82 -76 57
4055E7l4j19nK10j24O9j14Q6p6R3L5j90J29p3k4Q8Q8J4k83K20M5l1p1M3j54L4
$$ 57 23 -96 -101 109 -15 54 -60 26 -50 43 78 -112 17 -56 -80 8 96 110 -173 47 92 61 -10 33 -121 -87
4081h7KM5J83j86J61K3q4k54J76k7k8Q7O0j40n4R5K3o6K8J84j73R9K8l7N0r6r0
$$ -87 -85 -40 143 -43 118 141 57 -197 -21 -48 -76 11 71 -69 -123 -28 -5 -71 -43 141 -32 67 95 58 108 12 -78
4108g8J1N7O4j54K19j33L0k8J0J1l9k9J2L3O6l1R6r5j7M0n1lM8N9m0j34k9J55
$$ -78 -67 -10 54 -100 119 -14 16 -12 -2 9 -30 -59 -47 -14 52 21 117 22 5 45 -6 -9 39 98 58 -76 -105 50
4136E0P2K1j37L2m3J74m96J93P2%R0Rn2M0p1L5Q2K4k09L3K18l08K21j00M0Rj6
$$ 50 122 143 6 38 -5 169 -327 -134 -62 -62 28 37 -15 25 -46 -11 71 95 -114 -81 137 -171 50 -50 -10 -1 -17
4163a7J69p0j08J4j15J28m5n9M5J21r0j15J42P8n2j54J25p9K03J05k54J0Q8m2
$$ -17 152 82 -26 -12 -127 1 -44 -103 -58 63 -27 -142 0 78 26 -128 -3 -82 121 226 -28 -18 70 28
4187B8L9n7k38J62O7LP4j69R1J7m4q4Q5J24j39P7R5rj20m0J02q6K4j69K49n5l3
$$ 28 67 10 -228 -66 1 4 78 -91 0 17 -27 -111 -26 98 -41 36 131 122 2 -38 64 -22 2 -167 82 27 -6
4214fJ6J10J8nr0l0j14Q7N3O5k35K9p2J88J21j98R6Qj40K3J67kk18J12L2j17J57
$$ -6 10 120 138 133 43 13 -101 -14 39 104 -131 -102 -174 14 135 -63 33 41 -99 -76 91 89 -129 -17 15 -102 55
4241E5m0q8P4j68J30k4L7o5O5ll1P6k1J06j61J08j9N5p8R6j73L1J43j17n3J90
$$ 55 15 -73 1 -167 -37 -61 -24 -89 -24 -27 -58 18 -3 103 -58 50 31 86 8 104 -69 -38 105 -12 -65 125
4267A25k44k0J12nnK06j92j4K1n8O6J12k11J85J30l03J08m5P0J2l6o3O7J86j22
$$ 125 -119 -139 -27 -32 -37 169 -23 -37 -16 -74 -8 104 -107 78 208 -95 13 -32 38 50 14 -49 18 204 82
4292H2l8k7j05P3M2k58K59j7k00K15n2M0q4K6J21j05p7R3j32N8j5L8M1J01J6l32
$$ 82 44 17 -88 -15 27 -231 28 11 -189 26 -26 14 -70 -44 77 -28 -105 -12 -144 -86 -101 -63 -22 79 95 -237
4318b37J99L1o9O1j18J84j6Q6j27m3J31j44j6J50j29j4l6M6N2j6q2l9Q1M4P2j72
$$ -237 -38 -7 -76 -15 -133 51 35 121 -6 -49 82 -62 -78 72 -57 -71 -107 -61 -9 -25 -107 -146 -65 -21 51 -121
4344a21K6Q4J02j3N4q1j80K78j40R3m7%j42R0l9mJ43o7r6j01K99p3o9M8nl1l4
$$ -121 -95 -11 91 78 132 51 -129 149 9 102 55 55 -87 3 -36 -40 103 36 -60 -161 138 65 -4 44 39 8 -26
4371b6Nl7J62k4q4R6j90K07j54J44k1l6J4p8N2m4k2l4R8j73J76m0qOj4j9m4N8
$$ -26 -21 -58 104 80 -4 92 -98 109 -45 99 78 42 56 -22 30 -14 -36 -70 28 -145 31 -9 -17 -11 -25 -44 -88 -30
4399c0J12j01J73k8j98J80l23K89L2j71J89l9rj49J29O0j15J2LR1n0k1p3J46l3
$$ -30 82 -19 154 126 -72 108 -215 74 106 -65 124 85 76 -73 56 116 1 13 16 107 57 36 -37 109 76
4424G6n2j88N2J02j7kJ02q9M5j9R0j46J17P5p1q8o8o2L24r7r9J59k61jK8K64k60
$$ 76 24 -164 -112 -10 -27 -29 73 -16 29 10 100 -46 71 146 75 -13 -81 -143 181 84 -15 144 -117 -118 -90 174 -86
4451h6k2J55j19p4P3J25J1p3M8p3P3ql3P1Rj28l9KJ4K20k33J13r7k4Q0%k6oK8
$$ -86 -108 47 -72 -146 -73 52 63 -10 38 -35 38 30 -3 68 77 -51 -90 -88 -74 146 -87 26 -71 -95 -15 -15 -41 -47 -19
4480a9p6M8kj50K18O3k17Q8l6O3J1K9l8O9K0p5j10R6J4r9J68n4K2k7j1j2K9k2
$$ -19 -95 -47 -49 -199 19 82 -135 -47 -83 -20 -9 20 -18 51 71 -4 -114 -18 -4 -103 65 11 33 6 -5 -17 12 -10
4508a0J0N9r6L5j58L23j30N9j24J71j09J28j95O1mPP1j88M4O4M8j22rN1P1o8k6
$$ -10 0 59 -37 -2 -160 163 33 92 -32 139 30 158 -37 24 20 27 98 -90 -46 18 66 -56 -65 -14 57 -11 -37
4535c7N5l4p8J50n2OJ65k78J51o1R6j9j82J49K0j28K19k25J45K3M2j1m0j08P4
$$ -37 18 -16 -94 56 4 10 175 -103 48 -13 83 64 -118 31 51 -77 142 -83 62 85 127 116 76 -32 42
4560D2j64M3N6Q7j99K62r2p5J06N2j01pj41J9K3K4J87j54p2MJ46j12LK44j65r9
$$ 42 -122 -79 -23 64 -135 127 35 -40 66 118 17 10 -131 -112 -89 -65 122 -32 -104 -100 46 -66 -63 181 16 -83
4586h3%M9R0P5j33k6O1O3J00j27o0q2q3O4M3J7O7PL9n6j8j9ml5J57j29K9Kj21
$$ -83 -83 -34 56 131 -2 -28 33 96 196 69 9 -73 -156 -92 -49 -32 35 42 81 25 7 -12 -16 -51 106 -23 6 8 -113
4615a13J45pp3R8j15K15m2n3r4J57n7j5Qp7J83k12R6J98l40L6p6Q9J23n4k20K03
$$ -113 32 25 -48 50 -65 150 108 55 -39 118 61 46 54 -23 160 -52 44 242 -98 -62 -138 -49 74 20 -200 3
4641Cn6P9P3l2l5n6l4J11P7j58jr7J11m0P2p8Q3o5J72j10K3K5j77M8L9J03k02
$$ 3 -53 26 99 67 32 -24 -58 53 130 -28 -29 -126 -15 -55 17 -61 22 -43 129 19 42 67 -110 -62 -23 80 -122
4668a22L12r0k05K5k9M8J23j29J02P1q1N4Q4j20k0j84K28j2L7k13J32m3K01k64
$$ -122 190 100 -105 -80 -109 -61 62 -67 35 106 25 79 163 43 23 -161 67 55 92 -121 11 -32 169 -95
4692i5j7r3K80q1O7j24J40j32m2J68l5%l0P3j28Q1J02j15J75L4j15j62J05j45
$$ -95 -112 -205 75 -6 61 -63 77 -55 -97 71 36 36 6 79 -49 32 134 19 194 228 113 -49 56 -89
4716h9P7j4M2N4j69J12K9M0q6J0j13J01o5J78r9RJ7n5L3k8L7q8k5R4M2K5j91J59
$$ -89 -12 -26 16 70 -99 13 42 82 -4 6 -107 -6 -71 107 8 17 34 -21 12 -16 21 -67 -92 2 44 69 -122 37
4744C7J84k65P5J7J35j69n8Q4j09N4O3q2J01k9O7q6N1l5n0Q6l8J51q2k33J9P2
$$ 37 221 -44 31 48 183 14 -44 40 -69 -15 48 -34 67 38 105 19 70 35 -15 71 33 184 102 -131 -112 -40
4770d0J10j15O4j15M5J58p0n1J7J58k64J38Onj27q7J15kJ05mj75N9lJ56j7o8j7
$$ -40 70 -45 19 -96 -51 107 37 -14 3 161 -103 35 41 36 -91 -178 -63 -65 40 36 -139 -80 -83 73 56 -12 -29
4797b9J89l47J41Q4mj94J03J04O8k74J60J2l09J76J24J32o6p1PQj82J3J70j07
$$ -29 160 -187 -46 38 34 -160 -57 47 115 -159 1 13 -296 -120 4 136 70 -1 6 14 -168 -155 15 -92
4821i2L0J54j49Q3K8J6j67RP6K33k16O6j1j04o3J36L3N4l65K35N9%K3j4q2K1J90
$$ -92 -62 92 -57 26 54 70 -97 -88 -12 221 5 71 60 -44 -107 29 62 116 -249 -14 45 45 68 54 -28 -7 183
4848A83j94MM8n4Nn2OJ00p9R2j23o6l2L25k03jnO8N1o9M9k25O6J49j38O7J04j17
$$ 183 -11 -7 41 -13 -8 -60 -54 46 -33 59 -64 -130 -162 163 -40 -41 -46 22 73 4 53 -172 -106 43 -95 -28 76 -41
4876d1j0L2P3k18J70r4J20q7L7J15j34J33j18Q0m0l7N1m5j21K04M8n0k9j7On1
$$ -41 -51 -19 54 -164 6 -88 32 -55 -18 97 -37 96 -22 58 18 -19 32 -13 -134 70 118 68 39 22 28 -23
4902b3L1j29J47p0Q7p5m3K18r8k9j63J71N2j22Mj05K45k57K74n6j42J63r3p6J71
$$ -23 8 -121 26 -44 43 -32 -75 143 45 16 -147 24 76 -46 -42 -147 98 -159 115 59 -83 80 -13 -89 82
4927H2M2k16K80l03J34J2Qj04k7j08L16n6O3j71J5k3q7J20K2o0R4j84L9N6k2r4
$$ 82 124 -92 188 -115 19 31 39 -65 -92 -200 116 60 123 -48 -33 -56 -143 -23 -1 -61 33 -151 -112 -56 -78 -172
4953a72J89J33j65R3l7j9k1J4K4j01J19j14pJ16r5Q7j01J95j42Ko8j5J93K3j84
$$ -172 17 150 -15 78 41 22 1 15 39 -62 57 -57 -64 52 -43 44 -57 138 -4 -2 -70 -85 108 131 -53
4978e3k8R8O5j48O8Nk3K8M5j74J74L3j35K03j48Or8r6J57O7nj07J56j59J36p8
$$ -53 -81 17 82 -66 2 7 -16 12 57 -117 57 90 -45 158 10 16 -82 -178 -21 46 41 -66 90 -69 67 -11
5004a1K3n8p1J37rj24J85j4OJ18r0r2J09k52K62j2j27P4p0J20j31Lr9K12k80L04
$$ -11 12 -46 -117 20 11 -113 72 58 64 182 92 0 109 -143 119 107 -20 54 -16 104 -27 -24 -123 89 -191 113
5030A13p9o8J27k73R7Qr4J02L9J02J7j34J06j2n7L7Q0m8k5J11j19k13K16j7j20
$$ 113 34 -34 93 -180 -83 -75 -169 -67 -28 74 91 -43 63 51 -6 31 111 63 38 149 30 -183 33 16 -104
5055a04J31o8Ko3K3K70l91K68l8N9j51m3R8n1J44j83J61j30P3j09K30k21J54%
$$ -104 27 -41 -39 -102 -79 191 -200 68 30 89 -62 -105 -7 -58 86 -97 64 -66 7 -102 128 -93 61 61
5079F1M1mj43l3J48rl4r9J85j68p3L23l29M7N3N4R9j10k9N6l6Rj09J06QK6m7o2
$$ 61 102 98 -45 -78 70 61 27 -72 113 -55 -128 195 -134 -87 -34 20 119 9 -20 36 0 9 -100 6 14 40 -7 -69
5107f9J22n3Q2j15j44J03P4R3j29j05R4P2N0j38nR1m6J23j09j39J73j41K63k42
$$ -69 53 0 82 -33 -177 -74 0 93 -36 -141 -47 25 75 -63 -68 23 -23 100 -9 -148 25 -116 147 -95
5131i5Q6k4Q3J34j07M1j19k0r6K67j92R2n3J70q3n2M5K4j8q0j52J62N0N9m9r4
$$ -95 -9 -33 50 184 77 118 -1 -21 -117 150 -42 50 -3 167 84 32 77 101 83 3 -149 13 63 122 73 -21
5157b1J82lk11l5J64j74q5J83q1J29r8Q5j7j05P4L1m8Q7r5J3J74j49n1j2K62k03
$$ -21 161 158 -53 -88 76 -98 -183 0 -81 48 -50 35 18 -87 -13 18 -30 57 -38 -25 149 0 -51 -63 199 -4
5183do3k4R2ok4M3j15J07Nkm0J3r4k1J73M3k05Q0J84p2r1K9m5m4j0OJ12Jr3J28
$$ -4 -67 -91 1 -5 -29 14 -101 6 11 9 -31 -18 -112 -133 40 83 -122 -42 142 70 -21 8 -37 -81 -91 -85 27 28 -65 63
5213F3r1j2Q8K7o5l2r5K28k66J42j1P1O0r1j05Q8K06k49J34k94J92M7j77J95o0
$$ 63 -28 -40 48 75 10 -22 -117 111 -155 -13 -24 47 107 16 -89 -1 205 -44 90 -204 -12 35 -142 53 -7
5238gJ4j58M4J33O0k6j12P9p3N2j8P9l32M86k31L1n5K02j70k09L07J29k23n4K2
$$ -7 7 -151 -107 26 86 60 -52 27 -46 6 -12 67 -265 221 -10 21 -34 168 -2 -211 96 225 2 -52 -30
5263c0j40O8k3O5J45n2q1Q1kK8m8J76k32M3o5J40j2j21NP7O2j6o0j41Q0Q8J07
$$ -30 -170 -102 -125 -60 85 33 -48 33 31 59 11 187 -45 -2 -67 73 61 -60 -55 22 84 68 8 -133 -53 35 142
5290A42j58n9J08K4j24k1LQ7l4p5p7J10M4j2kMo9J58j6n9Np2J48k7j64K17j66
$$ 142 -16 -75 33 57 -67 -88 -85 2 -32 -107 -184 -74 -30 -42 -44 -40 -109 49 33 -26 -21 -93 55 28 -136 81 -85
5317h5K9K5O3r1j1k3J45l07J64J4o9n0J65K3q1J98q1j38NM4N6P5j54K6Qj01K12
$$ -85 -56 -31 32 -59 -70 -93 52 -255 -91 -77 -146 -196 -31 -8 -89 109 28 -110 -105 -61 -5 70 -84 -58 -50 -151 61
5344F1K2j78J66j2n3m6J34L1j13k3l4O9q0K09j53l0o7m4K49j24J29o6l13J22J42
$$ 61 83 -95 71 59 6 -40 94 125 12 -11 -45 24 -56 153 0 -30 -97 -141 108 -16 113 47 -266 -144 -2
5369bL6j13L2M8l2O5q5J8j54K48j06j0N4K9L5k29K21mm4O5j34j06K36p2Q2r9m6
$$ -2 34 -79 -47 1 -31 34 -51 -33 -187 61 -45 -55 -1 28 63 -166 55 51 7 72 -62 -168 68 -4 78 -21 -67
5396f7J18l7p0L4J71k16J92M8k33R5r9N5m4kJ64j17L2j56P1q6J24j6NJ3j30K05
$$ -67 51 14 -56 -22 149 -67 125 173 -60 35 -64 -9 -53 -55 109 -8 24 -132 -61 -147 -23 -39 -34 -21 -151 54
5422E4Nj53J94M7j6j03q5J33r9j08J63j36J11pLK07j59j54rJ6J10O5j15p8J88
$$ 54 59 -94 100 147 131 28 -57 76 -23 -131 32 -104 7 0 3 210 51 -103 -112 -96 14 79 -36 -114 74
5447G4r6q3R0q2J44j25N4J8k28L22j71M3O6m3o3K32j52o0L11k40R9p3p4Q2p6L1
$$ 74 -22 -105 -15 -97 47 -78 -24 -6 -234 88 -83 -40 26 -17 -80 152 0 -60 251 11 110 37 -37 45 -31 0
5473@J5K3j81J23o6J11r0K7J62p5j3r7j3O2J31j25j69J19K24q9r1o6N5J37j38
$$ 0 15 38 -143 -20 -86 25 -65 -38 124 49 36 -61 -74 -12 119 -6 -175 -56 168 79 -12 -78 -23 114 -24
5498b4RN9j33M1M2jp8J42Pm7j46K47M6j16j92L38j61r3O4P2j04n2Q1o1J5J09j42
$$ -24 -15 44 -89 -48 -6 -7 -85 57 64 17 -129 118 164 48 -144 194 33 -60 4 76 -28 -80 1 -60 -45 64 -78
5525g8n9j2N7K81l01K54j09Q6l01P8J6J05m3N1L1J1j88J58Lo3Q8j02K8p8L9L8
$$ -78 -137 -149 -92 189 -112 142 33 119 -182 -104 -88 17 -26 25 56 67 -121 37 40 -23 65 -37 -9 -87 -48 -10
5551a0%QJ25p8J75k03mQ9n0n9J4j43L0K19j69k4J27q8Q0oJ0Qj67J49j02j0K25
$$ -10 -10 -2 123 45 220 17 13 102 52 -7 7 -136 -106 113 -56 -80 47 -41 39 33 43 51 -116 33 -69 -79 146
5578A46p7j15P2m9J2J63j50N1r8J32Rj10J17j70J64j65l2j1K18j44Q2j32J01M
$$ 146 69 -46 26 -23 -11 152 2 53 -45 87 96 -14 103 -67 97 -68 -100 -111 107 -37 45 -87 14 18
5602A8l4p7J41J5L3j53M9K50j36K1k22L0N0n5J19q3PM1j11J55j65K12k52R2J55
$$ 18 -16 -93 48 63 96 -57 -8 242 106 127 -95 -65 -15 -70 49 -34 -27 14 -97 58 -107 105 -147 -55 100
5627A00j52Q8r5j8j60J74J45j32O6j42P8J01j60K7K6LO0J43k33P5J90k70k0K05
$$ 100 -52 36 -59 -77 -237 -63 82 -50 16 -126 -48 53 -107 -80 -54 -51 9 152 -81 -6 184 -86 -106 99
5651I9j6j2k6q6R1l1M0P1k1j32N6j17j1l6P0O4m8J98l00K74m6k0p5j19J29Q0j40
$$ 99 83 71 45 -41 50 19 59 130 109 -23 33 -84 -95 -131 -61 3 -45 153 -147 127 81 61 -14 -133 -4 76 -64
5678f4J1J13J0j06K0J10j78J3K3J76o2M5k14%K32n1j0j87K65m6k26J29K39l03
$$ -64 -53 60 70 -36 -16 94 -84 -71 -48 128 66 111 -103 -103 129 78 68 -119 146 100 -126 3 242 -61
5702f1K40j99J19q1M6j2k29J76Jm6k9J11L0J4N0q3n5P0n6j25J33L6L7j55J77k58
$$ -61 179 -20 99 18 64 52 -177 -1 0 -46 -75 36 66 80 130 47 -8 62 6 -119 14 50 87 -68 109 -149
5728a49K39k1k34R9M1K64l26J73j01L4k21J42J09j0j11j1K21k37N6M1J25k51K25
$$ -149 90 69 -165 -66 -25 239 -87 86 -15 19 -202 -60 49 39 -72 -83 138 -99 -43 -2 123 -128 97
5751I7j52J49j33n5j2r0K88j74Q9q7K7J14k46J40L0J18j10r1OK39k76M0J21m2
$$ 97 -55 94 -39 -94 -106 -196 92 -82 7 -80 -53 61 -185 -45 -15 103 -7 -98 -92 147 -129 -89 32 -10
5775a0j01L3J24r2o8J62n3l6j09J49OP7J2k08J28lj78J04qQ9k7P3o0J02j38J44
$$ -10 -111 -78 46 -46 -114 48 -5 -41 -150 -1 5 82 94 -114 14 11 -167 -63 -71 18 -9 64 4 106 -32 112
5801A12p4j03K5J63o8K9k1m8j68K54L9k64R2O6n3O9M2k33J6Q6J61j49L2m7J67
$$ 112 38 -65 -40 123 55 84 63 15 -153 101 140 -124 -32 34 -19 50 92 -141 -125 -39 122 -27 5 -42 125
5826A25j38l9J05lN8r8o0N8O2r1P9o3K1k2P1j30r6J07O6J8j89Q9O6q1KN2pp1L9
$$ 125 -13 -52 53 50 108 10 -50 8 70 -21 58 -5 16 -6 65 -65 -161 -54 12 30 -159 -70 -4 -85 -83 -31 -38 -109 -70
5855g0Ro2K33n4o6K7q2Q8j50J22M4l2J97k20O2j29m1K12Rj8l3R5j36j7Q0p6j1
$$ -70 -61 -123 110 56 -10 17 -65 23 -127 -5 39 7 204 -16 46 -83 -124 88 97 79 46 141 5 -12 68 -8 -19
5882a9L0k7J0n4K0R3J4M9j47J44j50RL4j01J9M9J7J1M1PNj37L9P1j15l1J9O5L7
$$ -19 11 -16 -6 -60 -40 53 67 116 -31 113 -37 -28 6 -95 -76 -27 -10 1 42 49 54 -83 -44 27 -88 -119 -100 -35 2
5911Bj4R2l5j16N9L8P2o2l4J16j69j3k8P2P0J2l2q5j44l1K41j26J07L7j51K31
$$ 2 -12 80 45 -71 -12 26 98 36 2 118 -51 -64 -92 -20 50 62 30 -55 -199 -230 11 -115 -8 29 -122 109
5937A09Rj0j05j68J54N3P1k81J2K39j55L84l92J94j11J02j23K0q0L8Q7O1j22J96
$$ 109 118 108 3 -165 -11 42 113 -168 -156 83 -72 312 -80 114 3 105 -18 2 -78 -40 47 108 -14 182
5961A82j13j38K26j44L4p6P2r6M9M0l1n6l5P7Q9j31Rk0m7J64p7j9nM4M4p9O7O3
$$ 182 69 -69 157 13 47 -29 43 -53 -4 36 5 -51 -86 -9 80 -51 -42 -62 -109 55 -22 -41 -46 -2 42 -37 30 93
5989I3q3j54J83k4q3O3j31LJ85N6n6Q5l9q7L6j05l4J06r4J38n2pl0L0J39k28J20
$$ 93 10 -144 39 15 -68 -5 -136 -133 52 108 52 137 98 11 47 -58 -92 14 -80 58 6 -1 -31 -1 138 -90 30
6016C0M2m3m1OJM4n6N3o7k2J34k00K15j34l7n3K76r2p1P4p4j16J9J49M2n5j12
$$ 30 72 29 -12 -6 -5 39 -17 36 -31 -53 81 -119 96 -38 -75 -128 148 56 -15 59 -15 -131 -112 37 79 24 -88
6043h8J31j00n2K9J54j40L1L5J0j40J28p5J40n4p4J00l8N5rk2j2O1k19n2K8K76
$$ -88 43 -57 -109 -80 74 -66 -35 0 10 -130 -2 -77 63 9 -65 35 -3 52 43 21 9 70 -149 -201 -173 103
6069A03j49K47k57n4K86j37j61K32n0J9o8k18K81J6N5r3L5j84J13J06n9l06L23
$$ 103 -46 201 -56 -110 176 39 -122 110 60 79 11 -207 74 90 145 52 87 -97 16 122 63 -243 80
6092H0q4J5j80J89N6j39J26j52R4n1J59j00J02j27P0m1q1K20k11O0Q6k0O6k20
$$ 80 -4 11 -169 20 76 -63 63 -89 5 -46 113 13 115 -12 58 17 -64 156 -55 5 91 71 137 -83
6116h3K38q8n1R5k06J83j10q1J50j37J56JO4j37m2L7J10n0M6L9j75J0j1O5Rj11
$$ -83 155 67 16 111 -95 88 -22 -103 47 -90 66 67 131 -6 -48 -11 99 49 95 134 -41 -31 -42 23 32 -79
6142g9J7K30K2j63J34j74J2m5R1l9K0p9J44j85J00n0P1k7N0k9q3o7J46J70j23
$$ -79 -62 168 190 27 161 -13 -1 -46 45 6 26 -53 91 -94 6 -44 27 0 50 21 -62 -129 17 187 64
6167F4j01J49p5M1o3Q5j54J77j87J07L1r4J43j74j5J43N0j64k5K5L3j74K00o4
$$ 64 -37 112 37 78 15 100 -54 123 -64 43 74 -20 123 -51 -66 77 127 -37 -62 -37 -4 -178 22 -42
6191d2O2l7r5J45j46J47r8K4n0L2R8j42J64M0j53P2N8oQk2j8n1J3KM6j09%J62
$$ -42 20 -17 -112 33 -113 34 -64 -40 -90 -58 40 -102 62 102 -51 21 79 73 81 59 41 -10 3 5 51 -58 -58 104
6219A04k09J50j01J66k51J22R9J16k37n4J54L9j53J06j0m0M3j01m3M7N5N0j24
$$ 104 -105 45 -56 110 -141 -19 80 196 -41 -95 59 98 -55 51 41 1 44 -57 -100 -53 2 52 -72
6242g2l5K50q8j48K45L2r0k2j1j26k6K27n6J7k16P4J06j23R6k5pM1k3r5O0M4j42
$$ -72 -107 143 55 -93 152 184 94 72 61 -65 -91 136 80 97 -119 -45 61 -62 34 9 2 43 20 -75 -15 29 -113
6269a13K09l5o0j15R4j24K49q2m8K01j83l8m5M7o1J15m7n6J70n1j00R7J74j29
$$ -113 96 61 1 -114 -20 -144 105 23 -25 176 -7 -45 -90 -43 -104 11 -36 -92 78 27 -73 24 198 69
6293F9k39Q4mJ10L1j11j13K00j10J71o2pL4j70J75lJ6k5O5p4j6L1Lj40K02j13
$$ 69 -170 -86 -90 20 51 -60 -173 27 -83 88 26 19 53 -117 58 55 71 46 111 37 21 52 55 -85 117 4
6319Dn2P4n1o0j1J16j33J54j63J23o3J24r6J50k8K0j91K9J80n0j06k3l0n1K03
$$ 4 -48 26 -25 -85 -96 20 -113 41 -122 1 -62 62 -34 116 88 108 -83 -54 126 76 -30 -53 -83 -134 69
6344F9n7L6m3O3q9k4K10j87L9J33k36J09M2j2l2n3r8P3K27k93N1J86k40N9J58
$$ 69 12 48 5 68 -21 -45 165 -22 17 150 -86 23 65 53 21 -32 -130 -57 170 -123 -72 114 -126 -67 91
6369I1j91J11J40j91K00j94J6l4j53J97M9j2j30RL6R7N6j98j1J29J38k07J5O2
$$ 91 -100 11 151 -40 160 -34 -18 -52 -205 -8 41 29 -101 -92 -56 41 97 -101 -112 17 155 -52 -37 25
6393B5j02KN9p9J20k1J2j06K7L7j03J10Q9O4j39j28L06k18J5RJ12k23J29P2j27
$$ 25 -77 -75 -16 -95 25 4 16 -90 -63 -26 -129 -19 70 134 -5 -133 173 -45 -30 -21 91 -132 -3 69 -58
6418e8k1J46j71J38P9k4j76k5K40l05J92j10J5K56l72J05K5J70K7j91j9L5j1n6
$$ -58 -79 67 -104 34 113 89 -87 -112 128 -177 15 -95 -80 176 -196 -91 -66 104 131 -60 -79 -44 -55 -111
6442a11M1J42q0k0M4j48L68j91o2Kk7rJ56j38M2p4o8J25J91j34q0k6j48K18M2
$$ -111 -70 72 -8 -28 16 -132 236 45 -17 -15 -42 -51 105 -33 9 -65 -133 -8 183 49 -31 -57 -205 13 55
6467E5k9r7m2K64k09j2K5Nl4O5m7J37j53L1P6mQ0j45o2R5J02j30M6n6M5j38O0
$$ 55 26 -71 -113 151 -58 -70 -45 -40 -74 -9 -56 81 -72 -41 35 31 111 -34 -96 -1 101 -29 17 -39 6 -132 -72
6494g2j2N4n0N3nn2Q3J07k4j73q8J15MJ36N2k05J16J25rj62n9j5J33J6N8j44J8
$$ -72 -84 -30 -80 -27 -32 -84 -1 106 82 -91 -179 -64 -60 76 128 -77 39 164 155 -7 -66 -81 52 68 126 -18 0
6521@q5J3R2RJ2jj76J53O1j97j2n3K14j46P9L7k5J67j27KL1n9J09j14K3l5k8Q3
$$ 0 -85 -72 20 29 41 40 -136 17 78 -119 -131 -184 30 -116 -37 0 -25 142 15 17 48 -11 98 -16 7 -28 -56 27
6549B7l1lK6p5R4J1N2o2l6P8j42pJ55N0j47j55J19l7K18j84J37j69J17k73K29
$$ 27 -4 -7 19 -56 38 49 101 39 3 81 -61 -68 87 137 -10 -165 -46 -83 135 -49 88 -81 36 -237 -8
6574hl7k9L2l7K13r9q2Q8N0j73J00M5k06Q2K28l68J63JJ15j07L9j6m6j24J90m5
$$ -8 -45 -74 -42 -79 134 35 -47 41 91 -82 18 63 -143 -61 167 -201 -38 -37 78 -29 10 -6 -52 -176 14 -31
6600c1O5K7mN2j32n2K08k36J99k20N0j0R3l6j54J89j16q2J69J5J99j39k59L42
$$ -31 34 61 57 109 -23 -75 133 -103 96 -124 -74 -84 9 -27 -181 8 -108 -190 -21 -6 193 54 -205 137
6624A37q1j59J59r4O7p8K16j15l5j0M6j08o7K05r2O1n3j30Q5K3l9J9L52k80m0
$$ 137 56 -103 56 -38 29 -49 167 52 17 7 53 -55 -122 83 -9 52 -1 -131 -46 -23 -62 -43 309 29 -11
6649a1J9nq2Q6P8K0J6j12Q5P7J3q4j03kL6k44J43L1j79K03M6m0n6J55j51J6M0
$$ -11 8 3 -79 7 85 105 121 9 94 171 184 100 -3 -5 31 -213 -70 -39 -218 -15 31 -9 -65 90 -61 -45 -5
6676eJ05j78P6O5j3Q6j56K1k4P6r6J4j32J09j24J53M2J96l39K0J06NQ5j16J10
$$ -5 100 -78 -2 63 50 136 -20 1 -23 53 -43 -29 -161 -52 -176 -23 19 215 -124 -104 2 7 92 -24 86
6701H6l6K6J70k24L9n7N7O4j27K6J07R0k61J72j11K6j05K28j38K9J39k07m3J00
$$ 86 50 76 246 22 61 4 61 125 -2 24 131 221 -40 132 21 47 -58 170 32 61 200 -7 -50 50
6725E0M7k14Q8Rn7J75j15j5K24k10K33j60j61J09Q6m6l3J20k03O4N6m2M7J2l4
$$ 50 97 -117 -29 -20 -77 98 -17 -32 192 -18 215 55 -106 3 89 43 10 130 -73 -9 47 5 52 64 30
6750C0l7j07m6K21R3K2j10m8j5L2Q5k07Q9J08l8p2l4RQ3J8q7K4Q7L2j52o2J48
$$ 30 -7 -114 -160 61 154 176 66 18 3 35 120 -87 2 110 72 0 -34 -25 58 76 -11 13 100 132 -20 -82 66
$$ [...]
8191a18
##END NTUPLES=NMR FID
##END=
