##TITLE=1H_Pr n-Eth5007
 CDCl3
 8 sc, 
 14.12.2021
##JCAMPDX= 6.0         $$ Bruker NMR JCAMP-DX V2.0
##DATA TYPE= NMR FID
##DATA CLASS= NTUPLES
##ORIGIN= UXNMR, Bruker Analytische Messtechnik GmbH
##OWNER= root
$$ XWIN-NMR		Version 3.5
$$ Tue Dec 14 11:33:28 2021 Russian Standard Time (UT+4h)  she@DPX200
##.OBSERVE FREQUENCY= 200.131346
##.OBSERVE NUCLEUS= ^1H
##.DELAY= (6, 6)
##.ACQUISITION MODE= SIMULTANEOUS
##.ACQUISITION SCHEME= undefined
##.AVERAGES= 8
##.DIGITISER RES= 18
##SPECTROMETER/DATA SYSTEM= spect
##.PULSE SEQUENCE= zg30
##.SOLVENT NAME= CDCl3
##.SHIFT REFERENCE= (INTERNAL, CDCl3, 0, 15.7039)
##AUDIT TRAIL= $$ (NUMBER, WHEN, WHO, WHERE, WHAT)
$$ ##TITLE= Audit trail, XWIN-NMR		Version 3.5
$$ ##JCAMPDX= 5.01
$$ ##ORIGIN= Bruker BioSpin GmbH
$$ ##OWNER= she
$$ F:/spectra/data/she/nmr/H-F/1/audita.txt
$$ ##AUDIT TRAIL=  $$ (NUMBER, WHEN, WHO, WHERE, WHAT)
(   1,<2021-12-14 11:31:52.71 +0400>,<she>,<DPX200>,
      <created by zg, POWCHK disabled, PULCHK disabled
       configuration hash MD5:
       00 E9 B6 7A A2 85 ED C7 34 08 36 98 17 FE 4E 26
       data hash MD5: 16K
       1C D2 D8 1A 88 5F A1 6C 7D 42 D3 10 0A CE F5 24>)
$$ ##END=
$$ 
$$ hash MD5
$$ 42 17 62 3B 80 18 02 BD F9 CF 1D 01 DB 3E 02 E2
##$RELAX= 
##$RELAX= 
##$RELAX= 
##$RELAX= 
##$RELAX= 
##$RELAX= 
$$ Bruker specific parameters
$$ --------------------------
##$DU= <F:/spectra>
##$EXPNO= 1
##$NAME= <H-F>
##$PROCNO= 1
##$TYPE= <nmr>
##$USER= <she>
##$AMP= (0..31)
100 100 100 100 100 100 100 100 100 100 100 100 100 100 100 100 100 100 
100 100 100 100 100 100 100 100 100 100 100 100 100 100 
##$AQSEQ= 0
##$AQ_mod= 1
##$AUNM= <au_zg>
##$AUTOPOS= <>
##$BF1= 200.13
##$BF2= 200.13
##$BF3= 200.13
##$BF4= 200.13
##$BF5= 200.13
##$BF6= 200.13
##$BF7= 200.13
##$BF8= 200.13
##$BYTORDA= 1
##$CFDGTYP= 0
##$CFRGTYP= 5
##$CHEMSTR= <none>
##$CNST= (0..31)
1 1 145 1 1 1 1 1 1 1 1 1 1 1 1 1 1 1 1 1 1 1 1 1 1 1 1 1 1 1 1 1 
##$CPDPRG= <>
##$CPDPRG1= <>
##$CPDPRG2= <>
##$CPDPRG3= <>
##$CPDPRG4= <mlev>
##$CPDPRG5= <mlev>
##$CPDPRG6= <mlev>
##$CPDPRG7= <mlev>
##$CPDPRG8= <mlev>
##$CPDPRGB= <>
##$CPDPRGT= <>
##$D= (0..31)
0 1.2 0 0 0 0 0 0 0 0.06 0 0.03 0 0 0 0 0.0002 0 0 0 0 0 0 0 0 0 0 0 0 
0 0 0 
##$DATE= 1639467112
##$DBL= (0..7)
120 120 120 120 120 120 120 120 
##$DBP= (0..7)
150 150 150 150 150 150 150 150 
##$DBP07= 0
##$DBPNAM0= <>
##$DBPNAM1= <>
##$DBPNAM2= <>
##$DBPNAM3= <>
##$DBPNAM4= <>
##$DBPNAM5= <>
##$DBPNAM6= <>
##$DBPNAM7= <>
##$DBPOAL= (0..7)
0.5 0.5 0.5 0.5 0.5 0.5 0.5 0.5 
##$DBPOFFS= (0..7)
0 0 0 0 0 0 0 0 
##$DE= 6
##$DECBNUC= <off>
##$DECIM= 32
##$DECNUC= <off>
##$DECSTAT= 4
##$DIGMOD= 1
##$DIGTYP= 9
##$DL= (0..7)
0 120 120 120 120 120 120 120 
##$DP= (0..7)
150 150 150 150 150 150 150 150 
##$DP07= 0
##$DPNAME0= <>
##$DPNAME1= <>
##$DPNAME2= <>
##$DPNAME3= <>
##$DPNAME4= <>
##$DPNAME5= <>
##$DPNAME6= <>
##$DPNAME7= <>
##$DPOAL= (0..7)
0.5 0.5 0.5 0.5 0.5 0.5 0.5 0.5 
##$DPOFFS= (0..7)
0 0 0 0 0 0 0 0 
##$DQDMODE= 0
##$DR= 18
##$DS= 0
##$DSLIST= <SSSSSSSSSSSSSSS>
$$ [...]
##$SUBNAM2= <"">
##$SUBNAM3= <"">
##$SUBNAM4= <"">
##$SUBNAM5= <"">
##$SUBNAM6= <"">
##$SUBNAM7= <"">
##$SUBNAM8= <"">
##$SUBNAM9= <"">
##$SW= 18.0517287032376
##$SWIBOX= (0..15)
0 0 2 0 0 0 0 0 0 0 0 0 0 0 0 0 
##$SW_h= 3612.71676300578
##$TD= 16384
##$TD0= 1
##$TE= 0
##$TE2= 300
##$TE3= 300
##$TEG= 300
##$TL= (0..7)
0 120 120 120 120 120 120 120 
##$TP= (0..7)
150 150 150 150 150 150 150 150 
##$TP07= 0
##$TPNAME0= <>
##$TPNAME1= <>
##$TPNAME2= <>
##$TPNAME3= <>
##$TPNAME4= <>
##$TPNAME5= <>
##$TPNAME6= <>
##$TPNAME7= <>
##$TPOAL= (0..7)
0.5 0.5 0.5 0.5 0.5 0.5 0.5 0.5 
##$TPOFFS= (0..7)
0 0 0 0 0 0 0 0 
##$TUNHIN= 0
##$TUNHOUT= 0
##$TUNXOUT= 0
##$USERA1= <user>
##$USERA2= <user>
##$USERA3= <user>
##$USERA4= <user>
##$USERA5= <user>
##$V9= 5
##$VALIST= <valist>
##$VCLIST= <CCCCCCCCCCCCCCC>
##$VD= 0
##$VDLIST= <DDDDDDDDDDDDDDD>
##$VPLIST= <PPPPPPPPPPPPPPP>
##$VTLIST= <TTTTTTTTTTTTTTT>
##$WBST= 1024
##$WBSW= 4
##$XGAIN= (0..3)
0 0 0 0 
##$XL= 0
##$YL= 0
##$YMAX_a= 284932
##$YMIN_a= -402031
##$ZGOPTNS= <>
##$ZL1= 120
##$ZL2= 120
##$ZL3= 120
##$ZL4= 120
##$ABSF1= 10
##$ABSF2= 0
##$ABSG= 5
##$ABSL= 3
##$ALPHA= 0
##$AQORDER= 0
##$ASSFAC= 0
##$ASSFACI= 0
##$ASSFACX= 0
##$ASSWID= 0
##$AUNMP= <proc_1d>
##$AZFE= 0.1
##$AZFW= 0.1
##$BCFW= 1
##$BC_mod= 2
##$BYTORDP= 1
##$COROFFS= 0
##$CY= 11.3945322036743
##$DATMOD= 1
##$DC= 2
##$DFILT= <>
##$DTYPP= 0
##$F1P= 2.36226072786647
##$F2P= -0.459571619588291
##$FCOR= 0.5
##$FTSIZE= 0
##$FT_mod= 4
##$GAMMA= 1
##$GB= 0.15
##$INTBC= 1
##$INTSCL= 1
##$ISEN= 128
##$LB= 0.24
##$LEV0= 0
##$LPBIN= 0
##$MAXI= 10000
##$MC2= 0
##$MEAN= 0
##$ME_mod= 0
##$MI= 1.114404
##$NCOEF= 0
##$NC_proc= 0
##$NLEV= 6
##$NOISF1= 3.799351
##$NOISF2= 2.8
##$NSP= 1
##$NTH_PI= 0
##$NZP= 0
##$OFFSET= 15.70392
##$PC= 1
##$PHC0= -15876.14
##$PHC1= 17.2008
##$PH_mod= 1
##$PKNL= yes
##$PPARMOD= 0
##$PSCAL= 0
##$PSIGN= 0
##$REVERSE= no
##$SF= 200.130013532006
##$SI= 16384
##$SIGF1= 3
##$SIGF2= 2
##$SINO= 400
##$SIOLD= 16384
##$SREGLST= <1H.CDCl3>
##$SSB= 0
##$STSI= 0
##$STSR= 0
##$SW_p= 3612.71676300578
##$SYMM= 0
##$S_DEV= 0
##$TDeff= 0
##$TDoff= 0
##$TI= <>
##$TILT= no
##$TM1= 0
##$TM2= 0
##$TOPLEV= 0
##$USERP1= <user>
##$USERP2= <user>
##$USERP3= <user>
##$USERP4= <user>
##$USERP5= <user>
##$WDW= 1
##$XDIM= 8192
##$YMAX_p= 0
##$YMIN_p= 0
$$ End of Bruker specific parameters
$$ ---------------------------------
##NTUPLES= NMR FID
##VAR_NAME=  TIME,          FID/REAL,        FID/IMAG
##SYMBOL=    X,             R,               I
##VAR_TYPE=  INDEPENDENT,   DEPENDENT,       DEPENDENT
##VAR_FORM=  AFFN,          ASDF,            ASDF
##VAR_DIM=   8192,          8192,            8192
##UNITS=     SECONDS,       ARBITRARY UNITS, ARBITRARY UNITS
##FACTOR=    0.0002768,     1,               1
##FIRST=     0,             0,               0
##LAST=      2.2672688,     0,               0
##MIN=       0,             -402031,         0
##MAX=       2.2672688,     284932,          0
$$ Real data points
##PAGE= N=1
##DATA TABLE= (X++(R..R)), XYDATA
$$ plain form
0 0 0 0 0 0 0 0 0 0 0 0 -8 8 -8 8 -16 16 -24 24 -32 40 -48 56 -64 80 -92 105 -124 144 -168 192 -217 249
32 249 -281 321 -361 409 -457 513 -575 641 -713 793 -879 974 -1078 1191 -1314 1450 -1598
49 -1598 1762 -1940 2138 -2357 2599 -2871 3177 -3526 3926 -4388 4934 -5588 6388 -7389 8692
64 8692 -10457 13003 -17004 24245 -41494 173040 -24557 -383151 42390 266566 22683
75 22683 -242272 -83559 66219 49173 29019 10282 -91195 147 172560 107433 -151318
86 -151318 -149995 103014 124777 -122057 -150289 15832 77937 22323 -5035 -5836 -8804 49737
98 49737 111431 -21497 -136780 -4410 101214 -20034 -116317 -19790 75886 13387 -11130
109 -11130 49136 8741 -27058 53968 49788 -73113 -89635 41847 53144 -96875 -72475 93934
$$ packed form
0@%%%%%%%%%%qJ6j6J6k4L2m0M8n6P2q8J04j20J44j72J97k29K68l12L60m09M66
32B49n30O02o82P70q66R70j088J216j354J506j672J853k052K269k505K764l048
49a598L360l702M078m495M956n470O048o703P452q314R322j0522J1976j3777J6081
64H692j9149K3460l0007M1249o5739K14534j97597l58594M25541K24176k43883
75B2683k64955J58713J49778j7046k0154j8737j01477R1342J72413o5127k58751
86a51318J323K53009K1763k46834k8232J66121O2105n5614k7358q01k968N8541
98D9737O1694j32928j15283J32370J05624j21248r6283R6527R5676o2499k4517
109a1130O0266m0395l5799Q1026m180j22901j6522J31482J1297j50019K4400J66409
$$ plain form
121 93934 51129 -77627 -471 120765 18837 -116048 6056 118127 -45726 -141534 16509
132 16509 97430 -24437 -81363 37300 86440 -6358 -14244 36902 -2283 -28153 9018 3727
144 3727 -52790 -43107 38167 24712 -48153 -1035 63059 15718 -26673 8328 31655 -21874
156 -21874 -46723 11769 8127 -45795 -11055 35898 8890 -12433 24399 43122 -8822 -18634
168 -18634 32713 1986 -51105 -11988 22520 -14499 -36529 15702 43889 -16037 -17596 51430
180 51430 23116 -47322 -19355 39271 1713 -71313 -24577 54512 6642 -45042 5618 48298
192 48298 20012 -14846 2834 16253 -11460 -6589 4738 -26607 -22167 19084 17740 -15201 -11409
205 -11409 35138 29190 -22395 -7819 21790 -7100 -29255 -10316 7019 -13604 -24465 16122
$$ packed form
121I3934m2805j28756P7156J21236j01928j34885J22104J12071j63853r5808J58043
132A6509Q0921j21867n6926J18663M9140r2798p886N1146l9185k5870L7171n291
144C727n6517R683Q1274j3455p2865M7118O4094m7341m2391L5001K3327n3529
156b1874k4849N8492l642n3922L4740M6953k7008k1323L6832J8723n1944r812
168a8634N1347l0727n3091L9117L4508l7019k2030N2231K8187n9926j559O9026
180E1430k8314p0438K7967N8626l7558p3026M6736P9089m7870n1684N0660M2680
192D8298k8286l4858J7680J3419k7713M871J1327l1345M440M1251j344l2941L792
205a1409M6547n948n1585J4576K9609k8890k2155J8939J7335k0623j0861M0587
$$ plain form
217 16122 23288 -11377 445 25456 11796 -10270 -7228 7330 -9070 -20740 5492 1282 -16428
230 -16428 7832 24384 5837 -9110 11005 28144 -9616 -28068 7860 7110 -23907 -20167 6914
243 6914 11978 -10866 -4025 24217 7977 -8327 6498 6379 -7999 -13667 -2840 2024 -14518
256 -14518 -3975 15561 1087 -529 16327 12986 -1684 -5292 10027 3277 -24628 -10464 11762
269 11762 -4949 -15539 -595 16380 9075 -8571 5032 12626 -5462 -6497 -2153 -8168 -8924
282 -8924 -4213 3533 -2587 -6693 15022 14469 -3974 2685 11510 3970 -9098 -8252 5513 -5393
296 -5393 -15373 4224 7649 -2995 344 8517 10580 -2138 -5890 5970 -3869 -12848 -3627 -3478
310 -3478 -5994 -3476 2787 8260 -877 2903 14345 1160 -4915 2841 1328 -5320 -9507 -556 5536
$$ packed form
217A6122P166l4665J1822K5011j3660k2066L042J4558j6400j1670K6232m210j7710
230a6428K4260J6552j8547j4947K0115J7139l7760j8452L5928p50l1017L740K7081
243F914N064k2844O841K8242j6240j6304J4825j19j4378n668J0827M864j6542
256a4518J0543J9536j4474j616J6856l341j4670l608J5319o750k7905J4164K2226
269A1762j6711j0590J4944J6975p305j7646J3603P594j8088j035M344o015p56
282h924M711P746o120m106K1715n53j8443O659Q825p540j3068Q46J3765j0906
296e393r980J9597L425j0644L339Q173K063j2718l752J1860r839q979R221J49
310c478k516K518O263N473r137L780J1442j3185o075P756j513o648m187Q951O092
$$ plain form
325 5536 -6234 -450 11405 4295 1117 3159 4178 973 -8796 -3705 -163 -9731 -5591 80 -1592
340 -1592 1446 2226 5588 4610 -2058 5370 3508 -8210 -3967 475 -893 -4037 -4794 7136 7207 -831
356 -831 5267 5275 1765 2632 -2154 -3328 -4828 -5587 847 -3978 -6808 3173 3966 2981 972 -743 4596
373 4596 22 -4032 59 -5649 -5229 1434 357 -225 -1330 3289 10952 2291 -1174 3673 1298 1027
389 1027 -2683 -6558 -1830 -1951 202 1578 -3797 2195 5710 928 977 -1934 -1603 57 -4498 -2564
405 -2564 -2097 -5624 1397 3457 1436 1935 817 6460 5695 -3104 -522 -579 -2068 836 -2739 -2542 -120
422 -120 1421 6451 1094 -3964 3398 3688 436 -4104 -7573 445 822 -5069 -2799 -1788 2529 5142
438 5142 80 1283 1433 959 4421 -1713 -5485 -535 255 2128 -945 -3801 4301 6228 2237 -956
$$ packed form
325E536j1770N784J1855p110l178K042J019l205r769N091L542r568M140N671j672
340a592L038P80L362r78o668P428j862j1718M243M442j368l144p57J1930P1q038
356h31O098Ql510Q67m786j174j500p59O434m825k830R981P93r85k009j715N339
373D596m574m054M091n708M20O663j077n82j105M619P663q661l465M847k375k71
389A027l710l875M728j21K153J376n375N992L515m782M9k911L31J660m555J934
405b564M67l527P021K060k021M99j118N643p65q799K582n7j489K904l575J97K422
422a20J541N030n357n058P362K90l252m540l469Q018L77n891K270J011M317K613
438E142n062J203J50m74L462o134l772M950P90J873l073k856Q102J927l991l193
$$ plain form
454 -956 -2548 4613 3491 -7424 -5384 39 1061 -1945 -6530 819 6127 -165 -591 736 1753
469 1753 2754 -2042 -2107 -1677 -2992 3402 1974 -5133 -289 6380 7215 -457 -6009 3955 7270 -2748
485 -2748 -6202 -4426 1640 3440 -4028 -3565 236 1587 5258 64 -4542 -935 1775 3779 -3401
500 -3401 -9721 -352 5715 2063 -3161 -4350 5496 9666 -497 -3832 -506 4029 2945 -4789 -2978
515 -2978 1074 -1846 738 2180 -634 -1212 -1386 4427 4235 -6188 -5523 1244 2359 -915 -6604 -1976
531 -1976 3953 1447 2172 968 -2897 2072 5356 2896 -4258 -7568 3544 7982 -2501 -6658 -2084
546 -2084 6378 7896 -2828 -5634 -43 4076 5260 -4373 -10204 -2383 5415 5219 -5140 -11204 2663
561 2663 11577 3647 -6642 -8268 5312 12086 -1750 -11468 -4888 7757 9599 -4771 -8690 2244
$$ packed form
454i56j592P161j122j0915K040N423J022l006m585P349N308o292m26J327J017
469A753J001m796o5M30j315O394j428p107M844O669Q35p672n552R964L315j0018
485b748l454J776O066J800p468M63L801J351L671n194m606L607K710K004p180
500c401o320R369O067l652n224j189R846M170j0163l335L326M535j084p734J811
515b978M052k920K584J442k814n78j74N813j92j0423O65O767J115l274n689M628
531a976N929k506P25j204l865M969L284k460p154l310J1112M438j0483m157M574
546b084Q462J518j0724k806N591M119J184r633n831P821P798j96j0359o064J3867
561B663Q914p930j0289j626J3580O774j3836r718O580J2645J842j4370l919J0934
$$ plain form
575 2244 8153 6306 -3409 -7305 1222 5548 2515 -4638 -9539 -12 7905 1868 -5944 -6437 3943
590 3943 9321 -1368 -7265 -2695 3185 5349 -2442 -6575 -917 3688 5294 -2 -5098 1332 5733
605 5733 3079 -1691 -5034 254 3945 -702 -2608 -2255 -537 2908 344 -646 -819 -1709 2257 1878
621 1878 -2673 -2985 -2145 1414 3094 -2815 -2823 546 3936 4107 -2343 -3164 3085 3474 906 -3311 -3306 2949
639 2949 2598 -1272 -1723 -1994 2477 3352 -1287 -2017 -1742 1210 2709 -2735 -4152 -468 1524 2423 -1960
656 -1960 -3483 2356 3691 1241 -1666 -2646 2742 3138 -1520 -2151 -1549 2569 3495 -2278 -1816 1745 2527
673 2527 1098 -3069 -1621 2127 -319 -1756 -1872 -977 1542 -419 -1240 516 -105 1271 561 -1651
689 -1651 433 269 -66 299 -1119 76 1058 36 1583 504 -390 1709 403 -41 -586 -1379 1008
$$ packed form
575B244N909j847r715l896Q527M326l033p153m901R527P917o037p812m93J0380
590C943N378j0689n897M570N880K164p791m133N658M605J606n296n096O430M401
605E733k654m770l343N288L691m647j906L53J718L445k564r90j73q90L966l79
621A878m551l12Q40L559J680n909qL369L390J71o450q21O249L89k568m217NO255
639B949l51l870m51k71M471Q75m639p30K75K952J499n444j417L684J992Q99m383
656a960j523N839J335k450k907r80N388L96m658o31O02M118R26n773M62L561P82
673B527j429m167J448L748k446j437j16Q95K519j961q21J756o21J376p10k212
689a651K084j64l35L65j418J195R82j022J547j079q94K099j306m44n45p93K387
$$ plain form
706 1008 -294 -2253 6 207 369 61 -1516 770 669 -955 116 -828 -548 512 -1115 169 368
723 368 -143 1571 296 245 1618 -319 497 730 -274 362 -934 -111 1647 -896 -886 695 366 840
741 840 -1129 -758 1370 -582 -986 -600 -1165 652 175 -1191 377 384 1361 934 -1213 1193 1374 -497
759 -497 -120 -386 540 667 -1010 319 695 -152 904 -159 -229 247 -675 176 -573 -2068 504 -139 -847
778 -847 41 -632 423 499 -514 323 -115 -33 946 -778 -461 777 195 884 -355 -223 1665 399 -213
797 -213 -44 -380 759 -528 -1455 172 -444 -21 202 -1168 379 365 -445 141 -522 129 524 -1055 -33
816 -33 428 -206 933 -97 216 1275 -151 639 626 -587 816 -291 -463 535 -784 188 305 -746
834 -746 184 -473 -135 586 -730 -400 -6 -801 561 -524 -946 763 -74 452 494 -638 916 725 -77
$$ packed form
706A008j302j959K259K01J62l08j577K286j01j624J071r44K80J060j627J284J99
723C68n11J714j275n1J373j937Q16K33j004O36j296Q23J758k543J0J581l29M74
741H40j969L71K128j952m04L86n65J817m77j366J568PR77m27k147K406J81j871
759d97L77k66R26J27j677J329L76q47J056j063p0M76r22Q51p49j495K572o43p08
778h47Q88o73J055P6j013Q37m38Q2R79j724L17J238n82O89j239J32J888j266o12
797b13J69l36J139j287r27J627o16M23K23j370J547j4q10N86o63O51L95j579J022
816c3M61o34J139j030L13J059j426P90j3j213J403j107j72R98j319R72J17j051
834g46R30o57L38P21j316L30L94p95J362j085m22J709q37N26M2j132J554j91q02
$$ plain form
853 -77 727 -418 162 982 -707 157 -173 -383 970 -296 -782 -44 -211 717 -323 -1482 155 158 -112
872 -112 -114 -1271 410 899 -268 -13 -431 180 1453 -379 -686 -90 544 1383 -221 -763 847 276 524
891 524 215 -935 292 359 -81 45 -1474 -457 973 -302 -283 -685 -23 1044 -412 -659 391 -450
909 -450 530 463 -367 2 -193 941 907 -907 242 1017 292 384 -458 -293 656 -234 -120 -344 -874 479
929 479 213 -208 -413 -801 554 731 -1197 -429 -373 443 504 -907 -314 451 491 499 -587 -84 1376 116
949 116 -255 242 -356 299 58 -202 62 -740 -69 1169 -938 -1068 268 541 -47 -1930 -130 1495
967 1495 -632 -1023 82 387 396 -566 205 930 -874 121 1059 -579 -241 14 637 532 -1155 243 1230
986 1230 -357 -541 -55 411 486 -957 -545 370 -306 -25 -741 -352 639 -114 88 75 -171 180 -126 134
$$ packed form
853g7Q04j145N80Q20j689Q64l30k10J353j266m86P38j67R28j040j159J637Lk70
872a12kj157J681M89j167K55m18O11J273j832l07N96O34Q39j604n42J610n71K48
891E24l09j150J227O7m40J26j519J017J430j275J9m02O62J067j456k47J050q41
909d50R80o7q30L69j95J134l4j814J149P75p25R2q42J65R49q90J14k24n30J353
929D79k66m21k05l88J355J77j928P68N6Q16O1j411N93P65M0Qj086N03J460j260
949A16l71M97n98O55k41k60K64q02O71J238k107j30J336K73n88j883J800J625
967A495k127l91J105L05Rr62P71P25j804R95R38j638L38K55O23j05j687J398R87
986A230j587j84M86M66P5j443M12R15o76K81p16L89R91p53K02j3k46L51l06K60
$$ plain form
1006 134 523 -789 -366 1387 -8 -583 -115 674 1095 -791 -540 991 -173 -794 -44 485 176 -1227
1024 -1227 94 1152 -819 -1140 703 821 -270 -1437 291 1561 -854 -500 670 48 46 86 714
1041 714 133 -990 392 1349 -377 -915 -101 616 780 -1085 -392 374 198 159 -796 -729 885 -101 -430
1060 -430 -342 -273 460 71 -451 86 -271 138 1083 -160 -760 -71 879 1191 -1251 -978 1322 842 -719
1079 -719 -713 187 678 -582 -336 537 -633 -653 573 62 -738 -983 338 997 -1067 -795 742 441 -51
1098 -51 12 241 741 -263 64 454 -506 78 525 -45 33 -476 256 397 -459 103 -1 -557 534 118
1118 118 -425 -126 132 174 -493 -635 448 -72 -198 520 -288 -68 -149 240 1049 -343 -332 1227 515 -362
1138 -362 42 313 728 -559 -234 633 -391 -382 177 -171 -182 -328 159 693 -734 -499 766 -118 -365 -243
$$ packed form
1006A34L89j312M23J753j395n75M68P89M21j886K51J531j164o21P50N29l09j403
1024a227J321J058j971l21J843J18j091j167J728J270k415L54J170o22kM0O28
1041G14n81j123J382R57j726n38Q14P17J64j865O93P66j76l9r55O7J614r86l29
1060d30Q8O9P33l89n22N37l57M09R45j243o00O89R50L12k442K73K300m80j561
1079g19OR00M91j260K46Q73j170k0J226n11q00k45J321O59k064K72J537l01m92
1098e1O3K29N00j004L27L90r60N84M47n70P8n09P32J41q56N62j04n56J091m16
1118A18n43K99K58M2o67j42J083n20j26P18q08K20q1L89Q09j392J1J559p12q77
1138c62M04K71M15j287L25Q67j024RN59l48j1j46M87N34j427K35J265q84k47J22
$$ plain form
1158 -243 90 386 -138 294 598 -471 137 651 -55 -40 -66 343 297 -659 380 660 -307 -33 -131 -296 -65
1179 -65 -371 165 -130 -606 270 113 -336 -167 39 311 41 -528 302 296 -167 381 88 -66 189 -26 610
1200 610 -187 -47 985 -5 -413 469 -64 -159 -167 -166 310 -731 -135 375 -675 -303 176 45 240 -584 -21
1221 -21 605 -361 118 201 -226 -81 -111 357 192 -465 407 527 -331 -32 112 14 14 -206 247 -30 -569 130
1243 130 22 -351 114 -190 180 -97 -323 320 -53 -359 304 3 -12 298 151 362 -25 -57 459 -8 -204
1264 -204 324 14 17 34 -189 369 -425 -215 80 -192 -259 142 -132 -118 -412 -210 486 -571 -223 365 -259
1285 -259 14 67 301 438 -381 382 639 -333 72 90 25 291 -116 142 249 -408 180 -138 -214 -116 -118 -36 -74
1308 -74 -313 196 55 -430 229 -67 -280 121 -153 256 -311 -53 527 -148 -43 293 -188 147 36 114 193
$$ packed form
1158b43L33K96n24M32L04j069O08N14p06J5k6M09m6r56J039K80r67K74r8j65K31
1179f5l06N36k95m76Q76j57m49J69K06K72k70n69Q30om63N48k93j54K55k15O36
1200F10p97J40J032r90m08Q82n33r5qJM76j041N96N10j050L72M79j31J95q24N63
1221b1O26r66M79Q3m27J45l0M68j65o57Q72J20q58K99J44r8%k20M53k77n39O99
1243A30j08l73M65l04L70k77k26O43l73l06O63l01j5L10j47K11l87l2N16m67j96
1264b04N28l10LJ7k23N58p94K10K95k72o7M01k74J4k94K02O96j057L48N88o24
1285b59K73N3K34J37q19P63K57r72M05J8o5K66m07K58J07o57N88l18p6R8kQ2l8
1308g4k39N09j41m85O59k96k13M01k74M09n67K58N80o75J05L36m81L35j11P8P9
$$ plain form
1329 193 -162 -94 371 -450 -287 29 -192 50 -243 -199 165 -498 -44 278 -309 -158 -32 -207 194 -74 127
1350 127 156 -84 2 175 -229 217 -289 98 354 -365 134 106 -118 101 -238 -122 28 -102 178 -47 -446
1371 -446 168 -175 -411 315 -92 -1 55 -238 1 -437 52 463 -305 -58 293 -25 508 -73 -395 380 -83
1392 -83 117 -70 -124 225 -40 -108 79 -277 -139 164 -310 -65 -110 -383 230 -222 -253 -103 6 493 -3 -275
1414 -275 262 77 -36 158 -28 170 16 -376 130 -92 -401 82 74 -222 -225 -342 425 -104 -367 -124 47
1435 47 -108 -326 -408 368 -101 -290 170 -238 -130 331 -48 315 72 -403 197 72 17 -28 -154 417 3
1456 3 -209 223 36 -232 -119 -213 66 -9 -351 73 -174 -252 -103 -276 33 51 -376 546 137 -142 -39 21
1478 21 186 228 -176 135 266 -305 36 -24 4 190 -178 308 240 -367 7 83 -309 6 -495 227 113 -539
$$ packed form
1329A93l55O8M65q21J63L16k21K42k93M4L64o63M54L22n87J51J26j75M01k68K01
1350A27K9k40Q6J73m04M46n06L87K56p19M99k8k24K19l39J16J50j30K80k25l99
1371d46O14l43k36P26m07R1N6k93K39m38M89M11p68K47L51l18N33n81l22P75m63
1392h3K00j87n4L49k65o8J87l56J38L03m74K45m5k73O13m52l1J50J09M87m96k72
1414b75N37j85j13J94j86J98j54l92N06k22l09M83qk96lj17P67n29k63K43J71
1435D7j55k18q2P76m69j89M60m08J08M61l79L63k43m75O00j25n5m5j26N71m14
1456Ck12M32j87k68J13r4K79p5l42M24k47p8J49j73L09J8m27R22m09k79J03O0
1478B1J65M2m04L11J31n71L41o0K8J86l68M86o8o07L74P6l92L15n01P22j14o52
$$ plain form
1500 -539 -34 -194 19 163 -231 341 289 -208 360 -78 74 -133 -120 421 60 -501 243 210 -26 7 135
1521 135 196 -25 -499 56 79 -252 -89 121 390 -27 -446 47 -90 -277 47 -153 187 72 -11 484 314
1542 314 -80 24 127 234 -143 -182 9 174 113 26 -168 144 23 127 -36 -136 -361 75 -150 -15 14
1563 14 -387 74 93 -188 -18 99 -85 98 -350 343 166 -135 362 22 -41 127 116 145 162 -362 55 -68
1585 -68 -126 -84 -67 89 -79 -358 174 117 -372 407 19 -222 -143 -123 320 -162 -140 339 117 66 300 87 120
1608 120 201 80 412 193 -59 92 31 -106 -116 -162 33 -302 -62 172 -404 -360 127 -90 31 -26 141 224
1630 224 -204 64 80 -234 -131 195 168 115 -50 16 231 -394 154 256 -12 -63 142 57 -65 -69 253 41 -156
1653 -156 293 -190 39 133 -308 150 87 -443 262 -140 58 372 -151 217 91 -233 81 25 0 308 -117
$$ packed form
1500e39N05j60K13J44l94N72n2m97N68m38J52k07J3N41l61n61P44l3k36L3J28
1521A35O1k21m74N55K3l31J63K10K69m17m19M93j37j87L24k00L40j15q3M95j70
1542C14l94J04J03J07l77l9J91J65o1q7j94L12j21J04j63j00k25M36k25J35K9
1563A4m01M61J9k81J70J17j84J83m48O93j77l01M97l40o3J68j1K9J7n24M17j23
1585f8n8M2J7J56j68k79N32n7m89P79l88k41P9K0M43m82K2M79k22n1K34k13L3
1608A20Q1j21L32k19k52J51o1j37j0m6J95l35K40K34n76M4M87k17J21n7J67Q3
1630B24m28K68J6l14J03L26k7n3j65O6K15o25N48J02k68n1K05q5j22mL22k12j97
1653a56M49m83K29R4m41M58o3n30P05m02J98L14n23L68j26l24L14n6k5L08m25
$$ plain form
1674 -117 27 53 -131 295 -241 -291 311 -186 -72 156 -211 -79 74 3 220 -181 -102 89 -235 2 -88 -49
1696 -49 118 109 253 178 -107 259 332 -72 165 -262 0 67 58 95 114 -280 -13 3 -30 89 -221 149 -154 -306
1720 -306 21 56 -280 218 -78 213 104 -105 124 -105 148 531 77 216 217 -262 345 -375 -69 304 -232
1741 -232 -7 183 -31 -97 -127 -100 128 -260 60 210 -264 196 -76 -154 -52 -103 8 83 -206 238 165 -93
1763 -93 320 -21 39 35 -72 50 164 -222 -14 186 26 53 -220 -62 36 -242 6 -7 -294 127 -243 46
1785 46 -185 -88 340 279 -4 4 -139 -56 56 -114 219 -17 -148 340 38 65 292 -97 -168 -189 -166 183 -104
1808 -104 -95 -13 -219 -98 72 -13 48 -21 -19 94 -193 -151 -13 -22 216 -38 -49 76 -147 175 367 -141 248 -73
1832 -73 -32 32 185 13 218 -259 11 60 -262 -263 -111 154 -46 -355 97 43 -245 98 -47 -114 162 -103 86
$$ packed form
1674a17J44K6j84M26n36n0O02m97J14K28l67J32J53p1K17m01P9J91l24K37r0L9
1696d9J67rJ44p5k85L66P3m04K37m27K62O7rL7J9l94K67J6l3J19l10L70l03j52
1720c06L27L5l36M98k96K91j09k09K29k29K53L83m54J39Jm79O07p20L06L73n36
1741b32K25J90k14o6l0K7K28l88L20J50m74M60k72p8J02n1J11P5k89M44p3k58
1763i3M13l41O0mj07J22J14l86K08K00j60K7k73J58R8k78K48j3k87M21l70K89
1785D6k31R7M28o1k83Qj43Q3J12j70L33k36j31M88l02K7K27l89p1k1K3L49k87
1808a04RQ2k06J21J70q5O1o9KJ13k87M2J38rK38k54j1J25k23L22J92n08L89l21
1832g3M1O4J53j72K05m77K70M9l22jJ52K65k00l09M52n4k88L43j45o7K76k65J89
$$ plain form
1855 86 156 -32 224 77 38 -52 -227 32 -61 -148 306 54 -205 -1 57 -164 3 -114 -62 -20 -29 375 -115 -110
1879 -110 366 32 44 114 -26 262 -105 49 109 -119 178 190 -292 -92 28 119 66 -125 62 174 166 89 -191
1902 -191 -191 6 -143 305 -167 -85 -35 26 -37 146 -152 -160 -111 -279 91 57 -3 110 -137 100 284 -284 112 45
1926 45 -86 146 -452 -1 21 27 -79 -155 -42 69 -102 23 51 -45 34 187 -76 191 -187 124 70 -53 -77
1949 -77 14 14 171 118 332 -38 -106 38 157 -29 49 -275 74 -120 -7 70 80 -390 10 -16 -221 -133 -218 -111
1973 -111 55 -84 107 -144 -70 198 171 101 142 -44 46 78 67 239 51 109 229 -98 -277 5 -72 -35 -57 -29
1997 -29 118 -187 -23 71 -277 59 -247 -78 -94 -397 95 5 -210 32 -79 202 -8 -189 -4 298 138
2018 138 84 46 70 36 -29 42 104 -105 118 -41 -66 35 -27 37 46 -120 -9 -369 -157 124 -98 91 232 -35
$$ packed form
1855H6P0j88K56j47l9r0j75K59r3q7M54k52k59K04N8k21J67j17N2M2rM04m90N
1879a10M76l34J2P0j40K88l67J54O0k28K97J2m82K00J20R1n3j91J87J12qp7k80
1902a91%J97j49M48m72Q2N0O1o3J83k98qM9j68L70l4o0J13k47K37J84n68L96o7
1926D5j31K32n98M51K2Oj06p6J13J11j71J25K8r6P9J53k63K67l78L11n4j23k4
1949g7R1%J57n3K14l70o8J44J19j86P8l24L49j94J13P7J0m70M00k6k05Q8q5J07
1973a11J66j39J91k51P4K68k7p0M1j86R0L2j1J72j88N8J20l27j79K82p7L7k2K8
1997b9J47l05J64R4l48L36l06J69j6l03M92r0k15K42j11K81k10j81J85L02j60
2018A38n4l8K4l4o5P1O2k09K23j59k5J01o2O4Rj66J11l60K12K81k22J89J41k67
$$ plain form
2042 -35 -5 155 -107 41 122 -61 200 -165 228 180 -159 -11 -73 92 99 -199 14 28 -11 -29 -77 -41 -8 -107 -55
2067 -55 -35 -246 -123 66 72 89 123 96 -120 -30 161 8 -153 408 -93 -78 195 -165 -239 43 38 240 -31 -119
2091 -119 309 -42 23 -44 66 338 23 -156 9 -12 61 199 4 -42 10 -22 422 -32 -71 130 26 44 -28
2114 -28 -75 105 -220 163 127 -77 96 20 -268 165 -220 139 125 -9 192 -223 11 -27 -284 120 60 -187
2136 -187 139 -61 -8 192 34 36 -68 -235 254 -221 -58 144 -23 -4 11 -131 16 66 -345 165 -77 41
2158 41 362 109 11 186 -81 149 -204 -99 191 120 129 44 -16 -116 -135 25 210 -9 -136 141 -10 76 142
2181 142 -260 102 -56 -78 158 -275 58 121 -52 24 -4 -179 75 -205 41 -93 90 309 8 5 234 221
2203 221 207 61 23 304 53 -115 231 81 328 40 -42 203 -153 -105 256 -179 253 193 -149 87 -149 -225
$$ packed form
2042c5L0J60k62J48Q1j83K61l65L93m8l39J48o2J65Pk98K13J4l9j8m8L6L3r9N2
2067e5K0k11J23J89OJ7L4k7k16R0J91j53j61N61n01J5K73l60p4K82nK02k71q8
2091a19M28l51O5o7J10K72l15j79J65k1P3J38j95m6N2l2M44m54l9K01j04J8p2
2114b8m7J80l25L83l6k04J73p6k88M33l85L59j4j34K01m15K34l8k57M04o0k47
2136a87L26k00N3K00j58Kj04j67M89m75J63K02j67J9J5j42J47N0m11N10k42J18
2158D1L21k53r8J75k67K30l53J05K90p1Rq5o0j00j9J60J85k19j27K77j51Q6O6
2181A42m02L62j58k2K36m33L33O3j73P6k8j75K54k80K46j34J83K19l01lK29j3
2203B21j4j46l8K81k51j68L46j50K47k88q2K45l56M8L61m35M32o0l42K36k36p6
$$ plain form
2225 -225 -89 -117 -386 206 23 -59 96 -9 104 -187 149 -179 -71 306 -4 -117 73 6 -89 79 -166
2246 -166 186 -45 -92 150 -58 -83 -168 -132 111 167 -70 339 -19 2 25 -31 -148 164 57 119 47 91 6 -59
2270 -59 14 -396 -162 108 -155 -36 -74 -114 -57 -100 -132 169 99 -110 -93 -94 60 152 -53 351 204 177 140 79 -55
2295 -55 194 -118 82 114 -119 -20 -160 -4 39 -392 -316 -202 -53 49 -84 -67 109 20 -135 -126 -140 -212 -35 25
2319 25 70 93 -8 -66 114 97 -38 -188 126 -29 -110 43 -414 48 -82 31 -29 20 148 -61 -69 -222 232
2342 232 3 -205 10 18 -66 -54 -174 -50 -9 -54 -8 83 113 20 -97 -42 220 203 204 -50 24 -159 44 102 -118
2367 -118 152 -253 -114 36 -208 -87 -52 -30 -64 -168 -80 67 -220 56 2 -235 159 139 -113 -50 -26 215 88
2390 88 -7 -33 -78 25 -69 257 24 230 -165 -85 -212 -61 140 -29 -16 200 -183 -38 -144 -264 51 -73
$$ packed form
2225b25J36k8k69N92j83q2J55j05J13k91L36l28J08L77l10j13J90o7r5J68k45
2246a66L52k31m7K42k08k5q5L6K43N6k37M09l58K1K3n6j17L12j07O2p2M4q5o5
2270e9P3m10K34K70k63J19l8m0N7m3l2L01p0k09J7jJ54R2k05M04j47k7l7o1j34
2295e5K49l12K00L2k33R9j40J56M3m31P6J14J49J02j33J7J76q9j55Rj4p2J77O0
2319B5M5K3j01n8J80j7j35j50L14j55q1J53m57M62j30J13o0M9J28k09qj53M54
2342B32k29k08K15Qq4J2j20J24M1m5M6R1L0r3j17N5K62j7Jk54P4j83K03N8k20
2367a18K70m05J39J50k44J21L5K2l4j04Q8J47k87K76n4k37L94k0k52O3K4K41j27
2390H8r5k6m5J03r4L26k33K06l95Q0j27J51K01j69J3K16l83J45j06j20L15j24
$$ plain form
2412 -73 -185 -24 -206 81 -110 24 -77 -148 50 -110 219 -22 5 -153 -65 39 1 -109 -28 -318 -14 -206
2434 -206 32 -19 -92 -204 133 -33 115 -72 -5 164 -71 208 -11 -105 156 -26 252 -44 -49 44 74 -7 210
2457 210 -122 -173 162 -111 149 -25 342 78 286 -18 21 -132 28 -94 -1 55 -367 -44 -112 -111 165 -52
2479 -52 23 -31 155 -130 32 64 40 155 22 236 -210 36 199 -15 -107 -24 -70 202 9 -3 297 2 81
2502 81 -195 -1 -87 1 -85 91 53 100 -121 344 -12 203 -267 38 92 -172 346 263 47 -123 157 231 -132
2525 -132 222 2 41 213 -48 -103 11 -220 -24 5 -8 96 28 120 -89 190 -125 131 -119 138 -3 -153
2547 -153 87 36 58 -72 -32 -36 20 -64 175 16 -92 27 -289 64 -207 -69 139 -140 -74 83 29 -64 51
2570 51 -118 40 -101 -246 257 77 -80 30 -114 187 -182 -108 135 196 -63 155 -26 146 -141 -33 -179
$$ packed form
2412g3j12J61j82K87j91J34j01p1J98j60L29k41K7j58Q8J04l8j10Q1k90L04j92
2434b06K38n1p3j12L37j66J48j87O7J69k35K79k19r4K61j82K78k96nR3L0q1K17
2457B10l32n1L35k73K60j74L67k64K08l04L9j53J60j22R3N6m22L23o8JK76k17
2479e2P5n4J86k85J62L2k4J15j33K14m46K46J63k14r2Q3m6K72j93j2L00k95P9
2502H1k76J94q6Q8q6J76l8M7k21M65l56K15m70L05N4k64N18q3k16j70K80P4l63
2525a32L54k20L9J72k61n5J14k31J96K9j3J04o8R2k09K79l15K56k50K57j41j50
2547a53K40n1K2j30M0mN6q4K39j59j08J19l16L53k71J38K08k79O6J57n4r3J15
2570E1j69J58j41j45N03j80j57J10j44L01l69P4K43O1k59K18j81J72k87J08j46
$$ plain form
2591 -179 -146 7 -123 74 123 -46 12 142 -126 -301 -66 -216 23 66 -112 5 -77 119 148 191 43 -114
2613 -114 -159 -107 42 -2 -83 -124 -165 12 -88 227 20 -76 125 -16 27 69 -287 156 -41 105 69 -259 -55
2636 -55 126 -292 19 -150 147 179 -16 91 124 -169 -18 220 40 55 -162 -216 152 -216 213 108 -222 -37
2658 -37 -35 27 -45 270 119 190 -122 121 -107 -43 -81 120 3 -108 224 171 -79 -129 143 -109 313 42 87 -25
2682 -25 20 87 169 55 -97 88 -125 180 -82 -122 29 -95 214 127 -70 25 106 -226 126 29 116 -169 -51
2705 -51 317 -76 -7 -41 10 222 220 13 56 -105 75 -76 44 -87 -80 -314 167 328 159 42 -231 -321 -132
2728 -132 35 164 265 -100 14 370 165 220 -86 -46 164 -208 134 -171 -101 130 -188 262 69 5 -141
2749 -141 -62 -142 -8 89 -168 -79 164 -166 185 -27 141 -149 -78 -27 -106 -22 57 -11 -158 -14 -5 276 -133 70
$$ packed form
2591a79L3J53j30J97M9j69N8J30k68j75K35j50K39M3j78J17q2J96K9M3j48j57
2613a14m5N2J49m4q1m1m1J77j00L15k07r6K01j41M3M2l56M43j97J46l6l28K04
2636e5J81m18L11j69K97L2j95J07L3k93J51K38j80J5k17n4L68l68M29j05l30J85
2658c7KO2p2L15j51P1l12K43k28O4l8K01j17j11L32n3k50n0K72k52M22k71M5j12
2682b5M5O7Q2j14j52J85k13L05k62m0J51j24L09q7j97R5Q1l32L52r7Q7k85J18
2705e1L68l93O9l4N1K12kk07M3j61J80j51J20j31Pk34M81J61j69j17k73r0J89
2728a32J67J29J01l65J14L56k05N5l06M0K10l72L42l05P0K31l18M50j93o4j46
2749a41P9q0J34R7k57Q9K43l30L51k12J68k90P1N1p9Q4P9o8j47J44RK81m09K03
$$ plain form
2773 70 203 -42 62 -161 5 -133 -56 -79 100 5 74 -180 -60 -84 -99 -26 28 -67 -87 125 -50 212 15 91
2797 91 -28 84 59 -14 -55 22 -23 -49 262 89 37 114 -125 146 -211 159 75 -179 -133 -84 -100 181 -129 71
2821 71 229 64 149 -42 54 -13 110 -72 -57 -15 -27 -95 -116 142 -78 214 -104 -8 51 125 71 -64 188 -54
2845 -54 -70 -138 151 61 -159 48 11 -142 92 135 -62 58 80 272 20 -5 104 -328 97 -53 -126 -125 -140 -215
2869 -215 -137 144 -57 -12 83 212 -1 15 348 -26 65 158 -111 -115 -92 -187 98 -267 -57 174 5 36 43 -236
2893 -236 -11 -64 113 250 11 29 16 -215 218 -41 84 227 -80 -3 120 -288 -55 -29 -104 188 47 1
2915 1 -66 -65 101 -71 -35 53 -207 61 41 -25 -62 39 -88 -187 -34 99 271 89 29 6 78 38 -93 -91 107 33
2941 33 -27 253 147 -8 129 -8 20 -61 147 -97 -64 56 75 60 154 192 36 208 -103 181 9 4 35 121
$$ packed form
2773G0J33k45J04k23J66j38P7k3J79r5O9k54J20k4j5P3N4r5k0K12j75K62j97P6
2797I1j19J12k5p3m1P7m5k6L11j73n2P7k39K71l57L70q4k54M6M9j6K81l10K00
2821G1J58j65Q5j91R6o7J23j82J5M2j2o8k1K58k20K92l18R6N9P4n4j35K52k42
2845e4j6o8K89r0k20K07l7j53K34M3j97J20K2J92k52k5J09m32M25j50p3Jj5p5
2869b15P8K81k01M5R5J29k13J6L33l74R1R3k69mK3r5K85l65K10K31j69L1Pk79
2893b36K25n3J77J37k39J8j3k31M33k59J25J43l07P7J23m08K33K6p5K92j41m6
2915Ao7JJ66j72L6Q8k60K68k0o6l7J01j27r9J53J33J72j82o0k3P2m0j31KJ98p4
2941C3o0K80j06j55J37j37K8q1K08k44L3J20J9j5R4L8j56J72l11K84j72nL1Q6
$$ plain form
2965 121 66 -176 -96 -77 -104 137 -272 95 330 -28 148 -137 -101 -86 -25 -144 124 -112 -33 154 -146 -108 156
2988 156 35 -16 -152 -63 -99 -26 133 49 -223 -245 -127 -108 -26 61 -114 76 72 -46 248 -94 -5 30 -256 -130
3012 -130 -12 68 138 74 -61 -57 -121 377 35 33 64 -129 323 109 113 -83 29 -106 -13 -130 -28 -152 -54 -10 81
3037 81 -114 68 -31 -240 -99 19 245 84 -147 22 112 -16 35 -88 146 29 -40 58 0 -45 76 45 196
3060 196 -65 -5 114 -200 -127 125 -137 -197 15 2 -195 8 -163 -80 -14 80 214 21 -142 -7 -13 123 -272
3083 -272 136 47 -14 88 144 46 297 -14 -83 260 5 42 25 87 -304 -3 -53 7 -73 -99 45 -112 -40 -176
3107 -176 228 102 -90 149 216 -53 74 40 -12 162 -145 104 16 65 114 160 -51 10 52 -25 -114 78 17 -66
3131 -66 2 -82 -220 -88 10 -59 52 37 -139 76 -66 -24 -44 -109 255 377 -4 79 -123 255 -41 -19 22 11
$$ packed form
2965A21n5k42Q0J9k7K41m09L67K35l58J76k85L6J5O1j19K68k36P9J87l00L8K64
2988A56j21n1j36Q9l6P3J59q4k72k2J18J9Q2Q7j75J90mj18K94l42Q9L5k86J26
3012a30J18Q0P0o4j35Mo4M98l42kL1j93M52k14Mj96J12j35R3j17J02j24R8M4R1
3037H1j95J82r9k09J41J18K26j61k31J69R0j28N1j23K34j17o9R8n8m5J21l1J51
3060A96k61O0J19l14P3K52k62o0K12j3j97K03j71Q3O6R4J34j93j63J35oJ36l95
3083b72M08q9o1J02N6r8K51l11o9L43k55L7j7O2l91L01n0O0q0k6J44j57P2j36
3107a76M04j26j92K39O7k69J27l4n2J74l07K49q8M9M9M6k11O1M2p7q9J92o1q3
3131f6O8q4j38J32R8o9J11j5j76K15j42M2k0o5L64J22l81Q3k02L78k96K2M1j1
$$ plain form
3155 11 -21 -133 -76 103 231 50 161 -90 77 -143 -173 -8 -90 27 120 314 -335 -178 -33 -116 -119 91 -117
3178 -117 -98 145 -91 -75 -97 35 -148 -105 98 -35 252 -335 -68 -92 -99 -128 -124 72 -196 -27 -117 19 -160 95
3202 95 22 -144 70 -45 159 81 -199 -329 43 -236 -44 114 21 221 -51 131 -27 9 -175 117 -127 -150
3224 -150 41 -319 -20 -2 -181 25 64 194 76 181 -4 63 58 210 52 69 -8 29 -118 -102 -22 -52 64 61
3248 61 -239 209 -95 -55 -42 -160 -149 -92 -58 -62 232 -39 -77 26 -112 23 26 -171 103 215 8 158 18 -193
3272 -193 50 125 155 -8 -76 84 39 7 -30 109 29 -37 113 -26 87 -173 -5 -115 94 -8 -132 117 53
3295 53 86 23 131 36 -139 -335 40 203 48 153 -259 -50 -138 214 -132 114 71 26 146 -135 -66 -38 -238
3318 -238 -330 -127 163 -94 40 -35 -152 102 77 -18 -103 -44 -112 95 8 62 12 258 97 26 -58 252 -76 20
$$ packed form
3155A1l2j12N7J79J28j81J11k51J67k20l0J65q2J17R3J94o49J57J45q3lK10k08
3178a17J9K43k36J6k2J32j83M3K03j33K87n87K67k4pk9MJ96k68J69r0J36j79K55
3202I5p3j66K14j15K04p8k80j30L72k79J92J58r3K00k72J82j58L6j84K92k44k3
3224a50J91l60K99J8j79K06L9J30j18J05j85O7nJ52j58J7p7L7j47J6Q0l0J16l
3248F1l00M48l04M0J3j18J1N7L4mK94k71l8J03j38J35Lj97K74J12k07J50j40k11
3272a93K43P5L0j63o8J60m5l2l7J39q0o6J50j39J13k60J68j10K09j02j24K49o4
3295E3L3o3J08r5j75j96L75J63j55J05m12K09q8L52l46K46m3m5J20k81O9K8k00
3318b38r2K03K90k57J34p5j17K54k5r5q5N9o8K07q7N4n0K46j61p1q4L10l28R6
$$ plain form
3342 20 164 -199 6 121 6 132 40 -213 127 26 21 -61 -70 -2 37 87 218 -14 195 -173 -134 126 -111 81
3366 81 -46 -141 -38 -279 -56 -72 87 -75 165 -54 161 128 -196 -46 167 -95 -181 -63 -343 -209 15 -80
3388 -80 -33 -273 336 128 -181 150 -134 -123 -49 -51 33 63 -18 -120 118 -2 179 -328 61 -101 3 76 221
3411 221 -220 -73 287 3 65 -135 98 -185 -27 -56 198 -83 -159 179 92 -56 -163 46 -88 83 -294
3432 -294 6 -53 32 60 -74 23 199 167 72 141 35 -2 107 -51 -96 -503 -15 -125 -65 -22 141 161 -98 146
3456 146 -178 90 -168 -73 75 -159 -1 -135 -194 -39 -145 101 -31 41 -195 1 97 60 -203 -106 -201 -50
3478 -50 -96 10 128 129 26 -126 183 -394 71 -58 53 123 80 59 -116 -187 254 -32 53 -106 156 -10 252
3501 252 135 -92 70 -220 140 -87 22 183 -170 -82 80 72 -5 118 -3 -147 -144 -212 -63 43 74 -25 94
$$ packed form
3342B0J44l63K05J15j15J26r2k53L40j01nq2rO8L9N0J31k32K09l68L9K60k37J92
3366H1j27r5J03k41K23j6J59j62K40k19K15l3l24J50K13k62q6J18k80J34K24r5
3388h0M7k40O09k08l09L31k84J1P4kQ4L0q1j02K38j20J81n07L89j62J04P3J45
3411B21m41J47L60k84O2k00K33k83J58k9K54k81p6L38q7j48j07K09j34J71l77
3432b94L00n9Q5K8j34R7J76l2r5O9j06l7J09j58m5m07M88j10O0M3J63K0k59K44
3456A46l24K68k58R5J48k34J58j34n9J55j06K46j32P2k36J96R6l7k63R7r5J51
3478e0m6J06J18Jj03j52L09n77M65j29J11P0m3k1j75p1M41k86Q5j59K62j66K62
3501B52j17k27J62k90L60k27J09J61l53Q8J62qp7J23j21j44Lo8J49J06L1r9J19
$$ plain form
3524 94 -88 21 7 -110 -9 88 -15 250 95 -121 -269 -156 -39 151 -197 -90 -1 348 -122 363 -63
3545 -63 34 -30 -22 221 -18 -34 195 -13 208 125 -170 206 -10 -315 -81 -85 -97 -93 -81 -129 57 145 -20 -87 129
3570 129 91 -55 92 226 -68 93 -98 -141 116 59 -123 135 -12 28 467 -228 130 9 146 -49 -63 59
3592 59 -190 -31 -50 -136 -281 -116 -213 149 -114 -94 -76 3 113 -63 12 24 35 112 14 10 26 149 -46 148 42
3617 42 -106 -20 103 1 49 218 -74 8 -24 -160 -23 -77 26 -4 -90 259 -32 15 -133 -71 78 125 -59 -47
3641 -47 -4 106 270 14 171 107 61 273 23 19 96 -94 127 -156 -37 -42 114 -192 -58 33 35 3 -49 -94 -299
3666 -299 89 8 -57 80 72 -147 -71 13 -70 91 -201 -196 109 -74 215 60 114 -24 -188 0 21 -119 -27 -7
3690 -7 48 -114 136 86 114 -174 180 -28 -70 -187 1 68 25 -323 68 -79 -179 98 -8 199 24 138 -224
$$ packed form
3524I4j82J09j4j17J01R7j03K65j55k16j48J13J17J90l48J07Q9L49m70M85m26
3545f3R7o4QK43k39j6K29k08K21q3k95L76k16l05K34mj2MJ2m8J86Q8j65o7K16
3570A29l8j46J47J34k94J61j91m3K57n7j82K58j47M0M39o95L58j21J37j95j4J22
3592E9k49J59j9q6j45J65r7L62k63K0J8P9J10j76P5J2J1P7r8mJ6J23j95J94j06
3617D2j48Q6J23j02M8J69k92Q2l2j36J37n4J03l0q6L49k91M7j48O2J49M7j84J2
3641d7M3J10J64k56J57o4m6K12k50mP7j90K21k83J19nJ56l06J34R1Kl2n2m5k05
3666b99L88q1o5J37qk19P6Q4q3J61k92NL05j83K89j55N4j38j64J88K1j40R2K0
3690gN5j62K50n0K8k88L54k08m2j17J88O7m3l48L91j47j00K77j06K07j75J14l62
$$ plain form
3713 -224 92 174 138 87 176 95 -93 34 -91 -50 53 99 248 -112 -133 247 88 9 -123 -66 -27 -3 72 -145
3737 -145 121 -180 117 49 178 -107 -55 264 -136 133 114 160 -129 -119 -151 43 44 -84 -188 198 51 72 57
3760 57 40 134 27 30 33 18 -23 -85 -10 21 -15 7 108 -155 -6 84 -9 -220 -247 71 0 222 165 119 63 223 -85
3787 -85 -54 -94 121 -128 -78 24 219 -31 201 128 36 149 46 106 -247 25 170 -115 -79 39 -135 -6 -114
3810 -114 -186 64 -30 51 100 99 19 -110 20 -154 76 -13 64 -114 -7 -96 -196 -41 -237 37 -27 -176 -91 -91 80
3835 80 256 175 -99 -62 175 387 114 -70 83 153 78 -7 16 153 17 -126 33 166 -166 -30 205 38
3857 38 -26 153 22 -66 -67 16 -115 -111 145 -14 -34 -82 -68 -35 69 -103 -41 15 93 248 -200 -29 -17 53 55 -49
3883 -49 -282 -209 -274 -55 -7 101 22 -44 34 -95 185 -52 -85 -400 31 -50 -15 62 -52 -76 -36 32 -62 -284 45
$$ packed form
3713b24L16Q2l6n1Q9q1j88J27j25M1J03M6J49l60k1L80j59p9j32N7L9K4P5k17
3737a45K66l01K97o8J29k85N2L19m00K69j9M6k89J0l2J94Jj28j04L86j47K1j5
3760E7j7R4j07LLj5m1o2P5L1l6K2J01k63J49R0r3k11k7L18p1K22n7m6n6J60l08
3787h5L1m0K15k49N0J02J95k50K32p3r2J13j03O0l53K72J45k85L6J18j74J29j08
3810a14p2K50r4Q1M9jq0j29J30j74K30q9P7j78J07q9j00J55j96K74o4j49Q5%J71
3835H0J76q1k74L7K37K12k73j84J53P0p5q5K3J37j36j43J59J33l32J36K35j67
3857C8o4J79j31q8jQ3j31MK56j59k0m8J4L3J04j72O2N6P8J55m48J71J2P0Kj04
3883d9k33P3o5K19M8J08p9o6P8j29K80k37l3l15M31q1L5P7j14k4M0O8r4k22L29
$$ plain form
3908 45 -145 87 -180 122 -176 -20 -111 93 -17 -41 -65 76 37 7 -130 -211 307 -164 47 -199 32 427
3930 427 -156 -56 85 51 177 -16 -212 16 -217 1 117 -243 -215 25 -197 196 -231 12 26 -97 -29
3951 -29 -97 -84 -107 282 -250 -28 -52 0 -40 20 123 41 156 -69 141 -7 5 -144 -71 -1 -141 -258 59 -41
3975 -41 60 15 27 52 15 -110 -66 52 144 -145 -16 -69 -37 10 -118 -5 55 -31 -239 316 -139 -30 65 -101
3999 -101 270 91 -203 109 114 58 243 -24 35 -53 -67 -69 99 -98 134 -152 179 199 -72 -93 -163 19 -41 106
4023 106 101 183 -9 -182 -55 32 -155 36 8 -105 85 74 93 229 -2 2 9 174 42 -95 6 362 77 -154
4047 -154 30 127 191 5 36 -49 -74 14 116 160 -13 47 -70 150 -41 -148 -214 19 232 1 107 64 229
4070 229 -213 -35 -109 -205 84 -15 -68 99 -255 77 -239 -167 287 -129 -38 66 8 -117 -120 103 139 2 52 -35
$$ packed form
3908D5j90K32k67L02k98J56r1K04j10k4k4J41l9l0j37q1N18m71K11k46K31L95
3930D27n83J00J41l4J26j93j96K28k33K18J16l60K8K40k22L93m27K43J4j23O8
3951b9o8J3k3L89n32K22k4N2m0O0J03q2J15k25K10j48J2j49P3P0j40j17L17j00
3975d1J01m5J2K5l7j25M4J18R2k89J29n3L2M7j28J13O0q6k08N55m55J09R5j66
3999a01L71j79k94L12Nn6J85k67N9q8j4kJ68j97K32k86L31K0k71k1p0J82o0J47
4023A06nQ2j92j73J27Q7j87J91k8j13J90j1J9J36k31MPJ65j32j37J01L56k85k31
4047a54J84R7O4j86L1q5k5Q8J02M4j73O0j17K20j91j07o6K33K13k31J06m3J65
4070B29m42J78p4r6K89r9n3J67l54L32l16P2M54m16R1J04n8j25lK23L6j37N0q7
$$ plain form
4094 -35 23 94 4 -50 -12 -109 -159 60 94 134 -7 129 -44 82 38 -1 -27 -27 -72 -53 -91 236 -110 70 225 -111
4120 -111 -44 43 -121 50 22 -95 176 46 90 28 -86 46 -1 189 -160 -162 -11 11 -37 79 -54 42 154 -40
4144 -40 -124 -42 81 65 -33 -128 73 20 135 30 -195 -73 -45 -170 71 -25 73 -147 37 55 -5 -152 -78 45
4168 45 52 23 -107 -102 -201 58 192 143 88 72 -105 171 12 99 96 -5 -123 -121 164 115 73 -47 72 -97 -112 -155
4194 -155 92 -7 -38 36 -125 -438 -140 -106 107 -219 -115 -172 114 20 209 72 -171 17 -243 -239 -114 54 -42
4217 -42 -5 132 147 -23 -108 143 39 7 -73 154 -185 106 36 111 48 -82 29 -101 77 -133 35 7 153
4240 153 -146 -177 50 97 132 56 164 268 89 33 -87 -167 -92 96 -89 -72 42 102 -72 27 -32 -36 124 123 -75
4265 -75 115 -144 39 19 31 3 62 -116 -201 -89 -308 76 119 177 128 -153 69 149 -213 18 -28 33 -217 88
$$ packed form
4094c5N8P1r0n4L8r7n0K19L4M0j41J36j73J26m4l9k6%m5J9l8L27l46J80J55l36
4120a11O7Q7j64J71k8j17K71j30M4o2j14J32m7J90l49kJ51K2m8J16j33R6J12j94
4144d0q4Q2J23j6r8r5K01n3J15j05k25J22K8j25K41r6R8k20J84J8o0j47P4J23
4168D5Pk9j30Nr9K59J34m9n5j6j77K76j59Q7lj01j18KK85m9m2j20J19j69j5m3
4194a55K47r9l1P4j61l13K98L4K13l26J04n7K86r4J89j37k43J88k60MJ25J68r6
4217d2L7J37J5j70q5K51j04l2q0K27l39K91p0P5o3j30J11j30J78k10J68k8J46
4240A53k99l1K27M7L5p6J08J04j79n6j20q0P5J88j85J7J14O0j74R9n9mJ60jj98
4265g5J90k59J83k0J2k8N9j78q5J12k19L84M3N8m9k81K22Q0l62K31m6O1k50L05
$$ plain form
4289 88 89 69 255 168 -19 -223 106 -132 170 -30 201 106 132 232 33 -37 141 -112 36 211 -19 123 -155
4312 -155 -6 -4 9 54 -124 36 -70 -9 -80 148 -50 -69 -163 -143 74 31 170 95 127 -98 -22 204 193 38 117
4337 117 117 -23 -73 -23 -149 21 -203 7 -263 -76 -197 133 101 -101 23 48 -43 94 32 81 -227 -78 340
4360 340 -36 -79 30 -181 -74 -281 73 -45 7 -77 -185 -104 176 136 157 8 -84 -54 -8 308 86 -79 210
4383 210 -38 138 110 146 -246 60 -154 93 -122 -124 -139 54 -85 -165 -188 -1 -85 -93 -12 17 86 -132 -101 -26 369
4408 369 -3 -40 127 154 -108 93 183 121 69 57 -32 -9 -176 66 -121 20 -1 87 -2 180 -229 111 36 -222
4432 -222 176 4 126 65 -55 -1 68 146 266 -176 -42 -103 -241 160 -43 52 -190 26 -20 -144 -34 -40 -13
4455 -13 8 -130 -173 -17 9 -30 64 115 36 113 41 -71 -231 -324 -32 79 16 155 -10 -362 -181 -122 -78 -149 43
$$ packed form
4289H8Jk0J86q7j87k04L29k38L02k00K31r5K6J00j99p0J78k53J48J75k30J42k78
4312a55J49KJ3M5j78J60j06O1p1K28j98j9r4K0K17m3J39p5L2k25P6K26j1j55P9
4337A17%j40n0N0j26J70k24K10k70J87j21L30l2k02J24K5r1J37o2M9l08J49M18
4360C40l76m3J09k11J07k07L54j18N2q4j08Q1K80m0K1j49r2L0M6L16k22j65K89
4383B10k48J76k8L6l92L06k14K47k15kj5J93j39q0k3J87q4qQ1K9O9k18L1P5L95
4408C69l72l7J67K7k62K01R0o2n2j2q9K3j67K42j87J41k1Q8q9J82m09L40p5k58
4432b22L98j72J22o1j20N4O9P8J20m42J34o1j38M01k03R5k42K16m6j24J10oK7
4455a3K1j38m3J56K6l9R4N1p9P7p2j12j60r3K92J11o3J39j65l52J81N9M4p1J92
$$ plain form
4480 43 -80 -10 -104 23 -36 151 -10 274 -14 6 1 -123 -178 144 163 -83 196 4 -145 44 8 -4 -64 15
4504 15 16 -87 -43 15 195 -99 -250 85 63 -156 68 159 130 126 -98 -196 -12 184 152 48 -51 -6 54 -116 249
4529 249 -89 -46 6 -36 -59 74 -15 88 -75 -123 69 -8 149 -79 0 -114 78 57 152 -99 49 -104 9
4552 9 127 -33 -40 -48 23 -4 -66 75 238 150 -171 -91 -16 -79 -248 -155 -97 -60 86 -6 -31 56 -36 152 -84 72 -55
4579 -55 143 203 -115 -121 285 -9 -161 214 208 80 56 -44 -65 -20 17 126 -168 51 59 -148 73 -186 -221 168
4603 168 -213 266 -321 27 23 -161 109 -60 11 88 -44 382 182 62 -246 29 18 20 -49 -115 -218 -120 -168 -93
4627 -93 -12 1 -48 -54 152 297 -141 -136 41 12 -227 78 -156 -307 -94 95 34 -8 -49 70 44 -149 -47 -25 166
4652 166 130 -47 -18 9 -121 88 -73 5 101 38 74 -84 -76 -22 -35 248 -83 188 -18 140 0 18 71 -68
$$ packed form
4480D3j23P0r4J27n9J87j61K84k88K0nj24n5L22J9k46K79j92j49J89l6j2o0P9
4504A5Jj03M4N8J80k94j51L35k2k19K24R1k9mk24r8J84J96l2j04r9M5O0j70L65
4529B49l38M3N2m2k3J33q9J03j63m8J92p7J57k28P9j14J92k1R5k51J48j53J13
4552IJ18j60pqP1k7o2J41J63q8l21Q0P5o3j69R3N8L7J46r2k5Q7r2J88k36J56j27
4579e5J98O0l18oM06k94j52L75oj28k4j00k1M5L7J09k94K19Qk07K21k59l5L89
4603A68l81M79n87L48mj84K70j69P1P7j32M26k00j20l08K75j1Ko9o6j03R8m8P5
4627i3Q1J3m9oK06J45m38NJ77k9k39L05k34j51K13J89o1m2m1J19k6j93J02K2J91
4652A66l6j77K9K7j30K09j61P8R6o3L6j58QN4j3K83l31K71k06J58j40J8N3j39
$$ plain form
4676 -68 5 -127 169 1 -204 -25 -107 -42 19 228 -122 -114 -34 -197 24 268 -81 -27 -215 83 218 194 -104
4699 -104 -47 310 279 -257 -61 35 -64 58 127 260 -117 126 -32 -253 75 135 112 22 -105 -147 -221 8 -28 -121
4723 -121 -28 138 56 -17 20 -99 5 48 -78 98 215 31 156 178 22 -171 -103 -183 53 9 101 97 38 -2 58
4748 58 119 -215 210 241 -53 259 143 105 -151 -358 -86 -26 -53 207 -129 37 139 -2 52 62 139 -75 102
4771 102 -38 73 -71 -5 -83 -49 -143 -43 -85 -93 237 71 136 124 -168 -2 117 71 167 -41 50 7 -96 -33 -205
4796 -205 93 124 -87 -223 33 -159 187 -133 145 59 -87 129 -79 226 -181 -52 53 -63 2 220 6
4817 6 -26 119 -56 -29 32 31 -159 17 25 64 -56 72 25 86 -125 38 80 -141 -195 -311 -27 101 65 8 50 8
4843 8 193 171 -62 95 42 57 -137 -156 186 61 -45 -103 87 49 96 21 11 132 34 18 -54 101 -89 -102 -95 10
$$ packed form
4676f8P3j32K96j68k05J79q2O5O1K09l50QQ0j63K21K44l49N4j88K98J35k4k98
4699a04N7L57l1n36J96R6r9J22O9J33l77K43j58k21L28O0k3r0j27m2p4K29l6r3
4723a21R3J66q2p3L7j19J04M3j26J76J17j84J25K2j56j93O8q0K36m4R2mn9m0O0
4748E8O1l34M25L1k94L12j16l8k56k07K72O0k7K60l36J66J02j41N4J0P7k14J77
4771A02j40J11j44O6p8L4r4J00m2qL30j66O5j2k92J66J19m6R6k08R1m3j03O3j72
4796b05K98L1k11j36K56j92L46l20K78q6j46K16k08L05m07J29J05j16O5K18k14
4817Fl2J45j75K7O1jj90J76QL9j20J28m7O1k11J63M2k21n4j16K84J28l6n7M2m2
4843HJ85k2k33J57n3J5j94j9L42j25j06n8J90l8M7p5j0J21r8j6p2J55j90j3PJ05
$$ plain form
4869 10 -19 -101 -97 -84 8 -24 -122 18 5 -27 -36 -190 -124 4 -187 39 22 -74 104 89 129 56 63 -83 346 -29 -1
4896 -1 -164 53 278 15 -43 32 36 127 102 84 -77 16 -23 -159 -65 -228 14 -48 23 -176 -75 3 -172 83 -57
4921 -57 142 -66 259 -13 -213 6 19 66 187 43 207 159 -117 -63 -19 91 -90 171 -67 9 212 116 33
4944 33 -90 -117 40 -167 -147 -124 -189 -118 24 -22 17 42 101 -83 35 -78 -3 123 -275 -28 -32 -95 110 -82 -27
4969 -27 -71 115 232 -204 64 314 -208 54 150 49 -56 -26 18 -134 62 -32 138 -5 -233 148 10 70
4991 70 69 -139 -34 -56 -87 104 28 -40 -11 -200 112 1 21 243 21 -182 -133 50 -189 -146 -68 26 -60 -146 101
5016 101 233 -233 40 -173 110 -218 101 -61 70 -62 199 281 -116 -92 197 -60 21 -111 -281 90 108
5037 108 -31 -65 324 -109 93 106 -87 -77 -117 97 189 -21 62 -59 -71 -158 -123 -117 27 171 227 98 -88 51
$$ packed form
4869A0k9q2MJ3R2l2r8J40j3l2rj54O6J28j91K26j7r6J78j5M0p3Pj46M29l75K8
4896aj63K17K25k63n8P5MR1k5j8j61R3l9j36R4j63K42o2P1j99J01P8j75K55j40
4921e7J99k08L25k72k00K19J3M7J21j44J64m8k76N4M4J10j81K61k38P6K03r6q3
4944C3j23k7J57k07K0K3o5P1J42m6L9K5N9j84J18j13P5J26l98K47mo3K05j92N5
4969b7m4J86J17m36K68K50n22K62R6j01j05L0M4j52J96r4J70j43k28L81j38O0
4991G0jk08J05k2l1J91p6o8K9j89L12j11K0K22k22k03M9J83k39M3P8R4q6q6K47
5016A01J32m66K73k13K83l28L19j62J31j32K61Q2l97K4K89k57Q1j32j70L71J8
5037A08j39l4L89m33K02J3j93J0m0K14R2k10Q3j21j2q7L5OJ44J44N6j29j86J39
$$ plain form
5061 51 -120 83 -134 -225 -158 -189 4 49 195 -104 -133 -88 -110 -179 -155 123 1 -127 68 -84 20 -238 -10
5084 -10 -40 -3 190 73 -106 240 -59 -12 -105 -107 -29 69 -21 -136 101 57 130 -113 142 77 59 22 195 87 -284
5109 -284 -211 184 -6 -40 29 -123 141 -101 -28 35 341 -116 245 -196 9 75 252 -169 249 60 -119 384
5131 384 -217 -3 -62 -8 144 -223 -159 3 -75 -157 58 69 -23 -49 -47 22 -97 -23 95 -57 -67 190 -101 184
5155 184 -138 92 64 -80 -45 -66 25 -46 262 102 -109 -12 49 -393 20 -140 19 -76 -116 -69 12 33 -168 -165 129
5180 129 145 3 -217 -27 90 -25 -2 222 -184 -86 -188 -7 97 -11 181 -170 -252 13 -127 -96 -87 59
5202 59 129 128 -76 158 45 -34 274 -202 24 -180 177 -154 -65 62 44 -178 119 -5 39 -25 -48 132 86 -382
5226 -382 96 73 28 -67 -263 -45 -89 -53 -88 -19 43 51 -127 -19 -64 34 -183 -138 314 -109 -41 -10 -49 147 271
$$ packed form
5061E1j71K03k17r1O7l1J93M5J46k99k9M5k2o9K4K78j22j28J95j52J04k58K28
5084a0l0L7J93j17j79L46k99M7r3kP8R8r0j15K37m4P3k43K55o5j8l7J73j08l71
5109b84P3L95j90l4O9j52K64k42P3O3L06m57L61m41K05O6J77m21M18j89j79N03
5131C84o01K14n9N4J52l67O4J62p8q2K15J1r2k6KO9j19P4J18j52j0K57k91K85
5155A84l22K30k8j44L5k1R1p1L08j60k11R7O1m42M13j60J59r5m0M7Q1K1k01LK94
5180A29J6j42k20J90J17j15K3K24m06R8j02J81J04j08J92l51q2K65j40L1RJ46
5202E9P0jk04K34j13p9L08m76K26k04L57l31Q9J27j8k22K97j24M4o4k3J80m6m68
5226c82M78k3m5r5j96K18m4L6l5O9O2Qj78J08m5R8k17M5M52m23O8L1l9J96J24
$$ plain form
5251 271 -133 58 -195 109 91 -179 -263 154 -179 49 20 -232 101 12 -55 112 -144 -18 14 -177 102 53
5273 53 -186 -39 232 -129 -49 98 -140 44 -325 160 89 -78 -53 70 97 89 68 -253 85 -38 -59 -51 84 -219
5297 -219 309 -172 -74 -66 177 -299 -73 26 -67 -79 48 -7 14 -87 44 16 -138 201 176 105 419 -71 -85 -7
5321 -7 -78 -27 19 -334 115 -99 167 -13 -103 112 -33 0 -51 -117 25 -32 -2 7 -80 -2 -134 518 -56 -47 -14 9
5347 9 130 -8 -24 92 -237 65 -69 -30 116 94 -28 -6 65 114 17 225 221 56 -91 70 -142 -144 143 146 64
5372 64 -128 233 155 94 -167 45 -38 275 88 -15 33 -77 35 -105 23 227 -149 55 35 -255 54 93
5394 93 -59 87 -152 -222 8 171 -9 -43 -110 -92 -121 -164 148 67 -148 10 -253 57 -345 183 -85 -74 -209
5417 -209 -96 135 139 130 -48 67 179 -234 121 -85 30 -117 -97 -106 255 25 -135 -47 281 172 40 -9 -101
$$ packed form
5251B71m04J91k53L04j8k70q4M17l33K28k9k52L33q9o7J67k56J26L2j91K79m9
5273E3k39J47K71l61Q0J47k38J84l69M85p1j67K5J23K7qk1l21L38j23k1QJ35l03
5297b19N28m81R8QK43m76K26R9r3j2J27n5K1j01J31k8j54L39k5p1L14m90j4P8
5321gp1N1M6l53M49k14K66j80r0K15j45L3n1o6J42n7L0Rq7P8j32O52n74RL3K3
5347IJ21j38j6J16l29L02j34L9J46k2j22K2P1M9r7K08mj65j47J61k12kK87Lq2
5372F4j92L61p8o1k61K12q3L13j87j03M8j10J12j40J28K04l76K04k0k90L09L9
5394I3j52J46k39p0K30J63j80l4o7J8k9m3L12q1k15J58k63L10m02N28k68J1j35
5417b09J13K31Mrj78J15J12m13L55k06J15j47K0rL61k30j60Q8L28j09j32m9r2
$$ plain form
5440 -101 -38 30 64 141 -166 -79 -63 68 -22 -75 -172 10 224 -147 61 74 218 -84 -116 -202 163 -131 -212 -238 -88
5465 -88 -9 -181 146 -97 123 251 6 -175 -203 71 -178 -100 -38 47 -131 -63 42 -108 -183 -35 -92 -58 6 -46
5489 -46 11 -102 120 96 19 -51 6 -62 42 -237 6 -183 -9 -13 -42 138 -87 7 -13 104 -40 -248 63 228
5513 228 -19 -39 -72 10 97 -161 87 5 65 206 -38 -148 -63 69 44 -118 182 238 -160 157 148 66 -17 40 164
5538 164 107 192 62 99 6 92 60 -49 113 46 -143 -234 -60 -84 -2 92 168 -87 -48 -111 -192 -36 21 164 47
5563 47 -90 74 -81 21 67 -126 7 190 -71 70 67 91 -220 -35 17 5 -31 159 178 -39 -26 -11 3 60
5587 60 0 20 -37 -126 25 146 -76 112 145 -67 54 -85 68 61 77 -184 -186 16 -122 180 -227 -106 -115 38
5611 38 46 121 -108 98 -71 13 163 70 12 65 92 128 -143 213 -64 -43 113 77 -101 -30 0 10 -155 102 -180
$$ packed form
5440a01O3O8L4P7l07Q7J6J31r0n3r7J82K14l71K08J3J44l02l2q6L65k94q1k6J50
5465h8P9j72L27k43K20J28k45j81k8K74k49P8O2Q5j78O8J05j50p5J48n7L4O4n2
5489d6N7j13K22k4p7p0N7o8J04k79K43j89J74mk9J80k25R4k0J17j44k08L11J65
5513B28k47k0l3Q2Q7k58K48q2O0J41k44j10Q5J32k5j62L00N6l98L17rq2q3N7J24
5538A64n7Q5j30L7r3Q6l2j09J62o7j89r1J74k4Q2R4P6k55L9o3q1J56N7J43j17
5563D7j37J64j55J02M6j93J33J83k61J41lK4l11J85N2j2l6J90J9k17J3J5J4N7
5587F0o0K0n7q9J51J21k22J88L3k12J21j39J53pJ6k61kK02j38L02m07J21rJ53
5611C8QP5k29K06j69Q4J50r3n8N3K7L6k71L56k77K1J56l6j78P1L0J0j65K57k82
$$ plain form
5636 -180 165 89 43 -14 -28 287 -87 0 117 -278 -136 -5 32 -48 -4 204 -138 396 -16 72 -168 123 88
5659 88 -80 18 18 -18 92 133 -159 -124 -38 -6 69 12 -162 12 -8 43 -48 87 -11 -195 203 -30 29 166 -48
5684 -48 75 -52 139 90 -20 -87 7 -23 -150 -12 88 -178 -63 9 10 235 -124 -146 203 -100 66 147 187 -50
5708 -50 176 -85 -34 -20 11 13 -74 -23 1 19 36 -31 45 100 84 1 18 104 137 89 51 102 185 -112 -122 -53 -195 108
5736 108 -46 -4 96 -202 -115 -192 -55 -83 -86 160 -125 -66 -86 -38 112 129 146 99 -13 188 -22 257 103 252
5760 252 155 -148 23 -16 44 -52 -107 -201 33 14 8 10 73 202 -106 -114 174 -174 59 99 -159 -23 72 148 -242 139
5786 139 -45 102 -144 -154 85 187 -21 67 118 54 155 156 -132 -145 69 -23 105 70 54 -97 137 -59 145
5809 145 59 -34 -152 87 -148 1 19 46 -28 -95 -131 37 -274 -44 -116 -61 51 145 47 -32 -64 -91 -171 115 11
$$ packed form
5636a80L45p6m6n7j4L15l74Q7J17l95J42J31L7q0M4K08l42N34m12Q8k40K91l5
5659H8j68R8%l6J10M1k92L5Q6L2P5n7j74J74k0N1r1J35r8j84L98k33N9J37k14
5684d8J23j27J91m9j10o7R4l0j27J38J00k66J15P2JK25l59k2L49l03J66Q1M0k37
5708e0K26k61N1J4L1Kq7N1K4J8J7o7P6N5j6q3J7Q6L3m8l8N1Q3k97j0O9j42L03
5736A08j54M2J00k98Q7p7J37k8lK46k85N9k0M8J50J7J7m7j12K01k10K79j54J49
5760B52r7l03J71l9O0r6n5r4K34j9oKO3J29l08qK88l48K33M0k58J36R5P6l90L81
5786A39j84J47k46j0K39J02k08Q8N1o4J01Jk88j3K14r2J28l5j6j51K34j96K04
5809A45q6r3j18K39k35J49J8K7p4o7l6J68l11K30p2N5J12R4r8p9l2k7q0K86j04
$$ plain form
5834 11 -87 -45 -41 320 -123 29 -17 -24 -11 157 -143 100 -144 0 222 -207 48 171 -12 139 102 268 71
5857 71 -47 -43 -6 -152 -209 35 85 246 -221 -82 -153 158 -57 178 28 -1 -117 14 122 -79 -26 203 -183
5880 -183 244 46 63 41 -12 178 -56 -145 18 33 -21 26 -135 -141 116 -112 -7 71 82 216 -84 -10 -168 195
5904 195 109 -199 17 218 18 -267 -133 -106 80 222 -119 -96 -36 -17 -6 -17 -103 -1 -52 -66 196 -89 -100 -115
5928 -115 158 -68 45 110 167 -103 -114 6 -173 72 174 -168 -158 37 86 118 -118 88 147 -90 -83 59 116
5951 116 197 -149 215 9 58 -129 121 63 151 -47 -17 106 -250 -117 -238 -67 -55 246 -16 -136 -78 126
5973 126 -93 115 49 -4 -1 67 -9 142 -55 42 153 196 70 331 -10 96 -60 -30 253 -4 -4 263 -218 -143
5997 -143 -79 62 -95 -86 323 120 -130 -40 56 156 66 -55 -216 -13 -281 26 -23 -222 -20 181 136 -219 -143
$$ packed form
5834A1r8M2ML61m43J52m6pJ3J68l00K43k44J44K22m29K55J23j83J51l7J66j97
5857G1j18ML7j46n7K44N0J61m67J39p1L11k15K35j50k9j16J31J08k01N3K29l86
5880a83M27j98J7k2n3J90k34q9J63J5n4M7j61oK57k28J05P8J1J34l00P4j58L63
5904A95q6l08K16K01k00k85J34K7J86J42l41K3O0J9J1j1q6J02n1j4K62k85j1j5
5928a15K73k26J13O5N7k70j1J20j79K45J02l42J0J95M9L2k36K06N9k37PJ42N7
5951A16Q1l46L64k06M9j87K50n8Q8j98L0J23l56J33j21J71J2L01k62j20N8K04
5973A26k19K08o6n3LO8p6J51j97R7J11M3j26K61l41J06j56L0K83k57%K67m81P5
5997a43O4J41j57RM09k03k50R0R6J00r0j21j61K03k68L07m9j99K02K01m5l55P6
$$ plain form
6020 -143 202 -130 -18 10 203 -190 194 -12 48 -89 -82 -184 40 64 2 -46 -246 -63 55 -3 -23 50 -106
6043 -106 100 -41 -9 -184 -123 -15 -59 -94 -144 -22 -136 321 -104 91 51 -162 203 303 -191 60 -267 -25
6065 -25 153 -48 -104 -157 48 -8 -234 -34 -28 -27 27 66 -115 -77 -156 53 47 -147 -139 -23 0 -154 -43 -141 -260 -29
6091 -29 -42 -213 35 -12 -21 -228 -186 100 46 -13 -189 -130 -128 -280 -150 -2 198 -20 -128 -64 165 -80 94 -13
6115 -13 -270 -101 -49 -126 -83 -32 -185 -14 47 -91 -150 36 -24 -126 246 -37 -192 294 -53 -46 172 36 -18 -81
6139 -81 12 55 -88 170 22 -142 -110 -53 -42 -73 -32 48 93 -5 -149 -75 -19 -74 -55 134 157 197 -60 49 -172 134
6165 134 90 -49 -126 1 26 219 -15 28 302 116 20 51 -196 -22 -45 35 -58 45 -95 -112 -46 -51 -204 107
6189 107 -67 67 80 -154 -46 -31 -86 -103 -27 56 162 80 11 -81 109 -44 99 85 87 163 -21 207 197 -24 178
$$ packed form
6020a43L45l32J12K8J93l93L84k06O0j37Pj02K24K4o2m8k00J83J18n8k0P3j56
6043a06K06j41L2j75O1J08m4l5n0J22j14M57m25J95m0k13L65J00m94K51l27K42
6065b5J78k01n6n3K05n6k26K00OJN4L9j81L8p9K09oj94QJ16K3j54J11r8j19K31
6091b9j3j71K48m7rk07M2K86n4n9j76N9Kj52J30J48K00k18j08O4K29k45J74j07
6115a3k57J69N2p7M3N1j53J71O1j38n9J86o0j02L72k83j55M86l47PK18j36n4o3
6139h1R3M3j43K58j48j64L2N7J1l1M1Q0M5r8j44P4N6n5J9J89K3M0k57J09k21L06
6165A34m4j39p7J27K5J93k34M3K74j86r6L1k47J74k3Q0r3J03j40j7O6nj53L11
6189A07j74J34J3k34J08J5n5j7P6Q3J06q2o9r2J90j53J43j4KP6j84K28j0k21K02
$$ plain form
6214 178 -45 -170 52 143 -2 145 138 65 -21 113 82 -230 -106 83 416 32 -120 -46 -158 120 -174 248
6236 248 73 109 206 153 119 196 146 47 46 56 -276 -134 -121 55 -29 62 9 -154 60 61 60 44 188 -30 95 -58
6262 -58 -23 -18 67 48 208 -18 102 198 239 -103 172 166 -215 101 52 77 41 -127 157 94 -69 205 43 61 -128
6287 -128 -7 54 174 35 53 -262 35 72 -28 156 58 204 -156 -96 146 111 -49 -41 -88 130 93 3 -68 -83
6311 -83 83 4 -35 -311 124 50 -95 55 -90 25 103 54 109 -62 -45 -75 8 43 -70 113 -53 -55 210 61
6335 61 202 -58 -15 337 -207 -183 67 45 -146 -57 46 68 147 170 -64 10 -191 64 18 -22 100 113 -23 234
6359 234 -33 121 74 -189 -207 169 -84 -56 187 -36 -97 -22 -104 -34 -3 70 -342 112 -82 161 63 -197 126
6382 126 35 -35 -163 -17 25 178 43 63 -120 -94 37 62 -170 148 -155 -142 -20 -73 -210 -3 -175 181 -173
$$ packed form
6214A78k23j25K22R1j45J47pp3q6J34l1l12J24J89L33l84j52P4j12K78k94M22
6236B48j75L6R7n3l4P7n0r9jJ0l32J42J3J76q4R1n3j63K14Jjj6J44k18J25j53
6262e8L5NQ5j9J60k26J20R6M1l42K75ol81L16m9K5l6j68K84o3j63K74j62J8j89
6287a28J21O1J20j39J8l15K97L7j00J84r8J46l60O0K42l5j60Qm7K18l7r0p1j5
6311h3J66p9l9k76M35p4j45J50j45J15P8m9N5j71J7l0Q3L5j13J83j66kK65j49
6335F1J41k60M3L52n44K4K50k2j91Q9J03K2P9K3k34P4k01K55m6m0J22J3j36K57
6359B34k67J54m7k63j8L76k53K8K43k23o1P5q2P0L1P3m12M54j94K43r8k60L23
6382A26r1p0j28J46M2J53j35K0j83K6J31K5k32L18l03J3J22n3j37K07j72L56l54
$$ plain form
6405 -173 98 -9 -53 178 -106 27 -206 148 193 47 99 173 -153 21 -61 -127 -309 -199 86 -15 39 59 -89
6428 -89 14 20 100 -16 18 -140 25 -113 -17 79 0 -85 59 -116 -62 -1 -141 92 106 63 -30 98 38 247 -141
6453 -141 -104 4 37 192 150 -50 31 -72 112 -182 -72 57 -83 124 -264 -37 -203 32 -12 -150 19 35
6475 35 -72 46 153 -18 -146 135 178 -137 -9 338 89 236 -84 -221 94 -179 82 225 -81 -195 48
6496 48 -116 133 -53 -10 236 89 174 -47 -24 183 49 254 236 -198 74 -6 -178 68 87 30 -91 -228 163
6519 163 -29 90 17 -121 69 99 16 -15 210 141 94 142 -237 -24 -106 87 58 78 -75 -64 -76 -51 -34 103 89
6544 89 62 -85 -243 175 79 83 30 -207 -213 -168 61 88 -215 -140 -159 49 108 -34 71 35 44 106 44 -18 -236 5
6570 5 -33 -29 -52 27 -163 -18 -46 -5 -40 225 385 56 -167 -54 109 153 144 -48 -64 -248 -125 68 -269 -5 -122
$$ packed form
6405a73K71j07m4K31k84J33k33L54M5j46N2P4l26J74q2o6j82J10K85j01N4K0j48
6428h9J03OQ0j16L4j58J65j38R6R6p9q5J44j75N4O1j40K33J4m3r3J28o0K09l88
6453a41L7J08L3J55m2k00Q1j03J84k94J10J29j40K07l88K27j66K35m4j38J69J6
6475C5j07J18J07j71j28K81M3l15J28L47k49J47l20j37L15k73K61J43l06j14K43
6496D8j64K49j86M3K46j47Q5k21K3K07j34K05j8m34K72q0j72K46J9n7j21j37L91
6519A63j92J19p3j38J90L0q3l1K25o9m7M8l79K13q2J93k9K0j53J1j2K5J7J37j4
6544H9k7j47j58M18r6Mn3k37oM5K29K7l03P5j9K08N9j42J05l6RO2o2o2k18K41
6570El8Mk3P9j90J45k8M1l5K65J60l29k23J13J63M4rj92j6j84J23J93l37K64j17
$$ plain form
6595 -122 -112 -67 26 -148 -94 -146 114 194 85 -65 97 155 -124 -70 -73 -119 25 58 -105 -161 161 95 -58 -38 6
6620 6 -66 146 -256 31 -57 -7 129 -156 -88 307 -15 202 19 -73 68 -93 84 135 -17 -34 216 -206 153
6643 153 -14 75 224 -14 169 105 294 -45 -322 -302 46 -176 -123 -52 -125 -104 44 -193 -132 56 -15 -189 -94
6666 -94 98 -38 -69 -19 183 39 -27 210 -5 91 62 189 37 -240 -29 -196 87 219 94 94 78 -161 -83
6689 -83 -59 -81 76 -31 -63 -105 -128 102 150 220 109 -356 145 178 -68 -14 7 -65 58 -49 -43 -6 -23 -171 -185 -112
6715 -112 -102 110 124 237 -96 113 -132 -118 250 31 59 232 245 -52 119 -9 83 -15 -156 78 89 -208 -65
6738 -65 133 94 -69 -193 88 -100 -75 152 -111 2 -26 -25 -146 -36 2 128 -112 -186 -95 39 60 -5 151 116
6762 116 163 -73 -170 89 132 169 34 -117 -12 -195 116 94 -9 15 27 53 -45 58 92 47 -57 -46 -82 -70 -79
$$ packed form
6595a22J0M5R3j74N4n2K60Q0j09j50J62N8k79N4lm6J44L3j63n6L22o6j53K0M4
6620Fp2K12m02K87q8N0J36k85O8L95l22K17j83r2J41j61J77N1j52j7K50m22L59
6643A53j67Q9J49k38J83o4J89l39k77K0L48k22N3P1p3K1J48k37O1J88p1j74R5
6666i4J92j36l1N0K02j44o6K37k15R6k9J27j52k77K11j67K83J32j25%j6k39P8
6689h3K4k2J57j07l2m2k3K30M8P0j11m65N01L3k46N4K1p2J23j07OL7j7j48j4P3
6715a12J0K12J4J13l33K09k45J4L68k19K8J73J3k97J71j28R2r8j41K34J1k97J43
6738f5J98l9j63j24K81j88K5K27k63J13k8Jj21J10L8J26k40p4R1J34K1o5J56l5
6762A16M7k36r7K59M3L7j35j51J05j83L11k2j03K4J2K6r8J03L4m5j04J1l6J2r
$$ plain form
6787 -79 -142 -3 30 148 38 69 128 -231 -87 23 -39 168 -165 69 169 -34 112 -9 -8 115 116 12 -94
6810 -94 191 -90 77 -111 -59 -35 -106 127 20 69 215 176 47 -107 91 -114 -198 11 135 -6 -20 0 136
6833 136 86 84 -103 1 165 -101 -223 138 35 20 -106 -189 -77 -14 21 -110 71 -20 -105 116 199 170 210 225
6857 225 3 206 18 -62 -96 35 68 -50 59 -43 66 -12 -45 266 33 79 248 -151 51 177 118 -113
6879 -113 126 170 97 63 238 -48 305 11 164 159 234 -17 -14 -97 -26 104 -29 27 172 -115 -269 -112 159 -209
6903 -209 -20 -165 108 300 -25 135 -240 125 202 -89 -11 -51 -85 -49 91 207 -23 40 50 36 41 16 -48 -64
6927 -64 21 47 31 189 -22 42 58 88 309 -127 -158 -143 -200 27 157 -138 -79 -17 147 173 -103 202 -44 96
6951 96 -134 27 -45 -61 247 23 -33 -59 -145 43 -259 82 60 -186 195 -51 229 128 24 154 39 -17 -55
$$ packed form
6787g9o3J39L3J18j10L1N9l59J44J10o2K07l33K34J00k03J46j21JJ23Jj04j06
6810i4K85k81J67j88N2K4p1K33j07M9J46l9j29j54J98k05q4K09J24j41j4K0J36
6833A36n0kj87J04J64k66j22L61j03j5j26q3J12O3L5j31J81r1q5K21Q3k9M0J5
6857B25k22K03j88q0l4J31L3j18J09j02J09p8l3L11k33M6J69l99K02J26n9k31
6879a13K39M4p3l4J75k86L53k94J53nP5k51Lq3P1J30j33N6J45k87j54J57K71l68
6903b09J89j45K73J92l25J60l75L65P7k91P8m0l4L6J40J16k30O3J0j4Nk5o4j6
6927f4Q5K6j6J58k11O4J6L0K21m36l1J5n7K27J30k95N9O2J64K6k76L05k46J40
6951I6k30J61p2j6L08k24n6k6q6J88l02L41k2k46L81k46K80j01j04J30j15n6l8
$$ plain form
6974 -55 80 -95 -48 100 -7 159 108 298 132 230 -203 -10 165 -15 125 17 19 -168 -13 -50 -149 -18 76
6997 76 146 1 -112 -26 -173 -143 59 -21 -1 61 74 -45 -54 197 48 -53 36 -11 -151 86 -167 152 -445 236
7021 236 -56 -316 -118 -156 40 89 4 -1 164 143 70 153 -98 38 112 -123 196 -107 35 141 -122 217 259
7044 259 -8 61 -85 -167 -198 -196 14 64 -89 124 -4 -99 -65 -193 162 -10 -5 -73 -27 -96 -188 -93 153 -137 -73
7069 -73 189 -239 64 -67 244 -133 195 -75 10 35 -32 157 -55 -271 -73 -193 -3 -4 -43 -49 51 -177 138
7092 138 -278 127 -71 -147 181 -65 -160 178 19 150 -133 75 -248 73 -147 89 191 92 -97 -35 -106 -23
7114 -23 -248 21 117 -98 -22 130 181 240 194 99 163 -122 -41 -162 87 -55 47 -61 48 64 -9 19 -117 81
7138 81 308 72 199 -146 -11 130 134 70 -314 -31 68 132 -246 109 -133 98 240 132 58 -78 459 12
$$ packed form
6974e5J35j75M7J48j07J66n1J90j66R8m33J93J75j80J40j08Kj87J55l7r9J31R4
6997G6P0j45j13Q6j47L0K02q0K0O2J3j19rK51j49j01Q9m7j40K37k53L19n97O81
7021B36k92k60J98l8J96M9q5nJ65k1p3Q3k51J36P4k35L19l03J42J06k63L39M2
7044B59k67O9j46q2l1KK10N0j53K13j28r5L4j28L55j72No8M6o9r2R5K46k90O4
7069g3K62m28L03j31L11l77L28k70Q5K5o7J89k12k16J98j20J90jl9oJ00k28L15
7092A38m16M05j98p6L28k46r5L38j59J31k83K08l23L21k20K36J02r9j89O2p1Q3
7114b3k25K69R6k15P6J52N1N9m6r5O4k85Q1j21K49j42J02j08J09J6p3K8j36J98
7138H1K27k36J27l45J35J41Mo4l84K83R9O4l78L55k42K31J42j08p4j36N37m47
$$ plain form
7160 12 -8 116 66 -165 82 -114 17 121 -92 25 96 195 219 -201 -138 6 78 -305 -41 173 14 10 -18 81
7184 81 -80 -142 -83 -170 -563 -15 11 -114 -132 -199 61 148 57 63 82 35 53 243 129 54 77 -142 272 -167 178
7209 178 -14 -101 -39 81 206 -22 -15 -72 34 133 -181 -248 89 3 59 -147 53 -67 -36 -44 14 -129 -46 -79 228
7234 228 79 -152 107 24 -37 2 -202 -47 -80 151 -85 -162 133 -54 108 152 282 -3 -56 80 34 110 -294
7257 -294 -85 252 123 -82 -44 116 -196 135 -3 12 -70 185 104 104 80 -283 121 109 22 -110 35 35 -10 0
7281 0 46 138 280 -136 90 253 175 -20 28 48 -46 -199 -98 -322 -93 19 -149 -88 141 -189 108 -134 127
7304 127 -338 246 107 -130 -147 -179 -21 -19 -104 -129 157 91 -152 135 131 -13 37 -5 27 -220 93 98 -72 -26 110
7329 110 28 -73 66 -25 119 1 -277 -42 16 187 -45 -33 36 -109 89 -65 -33 78 133 -126 -18 -39 165
$$ packed form
7160A2k0J24n0k31K47j96J31J04k13J17P1R9K4m20O3J44P2l83K64K14j59mk8R9
7184H1j61o2N9q7l93N48K6j25j8o7K60Q7r1OJ9m7J8J90j14p5K3k19M14m39L45
7209A78j92q7O2J20J25k28Pn7J06R9l14o7L37q6N6k06K00j20L1qN8j43Q3l3L07
7234B28j49k31K59q3o1L9k04J55l3K31k36p7K95j87J62M4J30k85n3J36m6P6m04
7257b94K09L37j29k05L8J60l12L31j38J5q2K55q1%k4l63M04j2q7j32J45%m5J0
7281@M6R2J42m16K26J63p8j95M8K0r4j53J01k24K29J12j68O1K29l30K97k42K61
7304A27m65N84j39k37j7l2J58Kq5k5K86o6k43K87mj44N0m2L2k47L13Nj70M6J36
7329A10q2j01J39r1J44j18k78K35N8J71k32J2O9j45J98j54L2J11N5k59J08k1K04
$$ plain form
7352 165 223 181 218 81 -136 25 95 -20 -19 -162 -7 -125 106 42 71 -17 12 -155 32 -102 4 -54 -7 -86
7376 -86 106 -16 -45 69 7 -49 417 -145 58 23 265 -164 212 -51 66 -1 288 -3 -116 167 -73 -143
7398 -143 -102 37 56 57 173 -10 -172 206 -3 -158 -32 148 -18 143 -58 104 52 36 -37 149 -7 -43 70
7421 70 30 74 23 -153 -114 279 -126 -7 -7 15 77 64 99 49 136 5 -218 125 60 -108 -144 56 185 96 143 75
7447 75 -63 -6 75 49 27 23 189 -39 -9 143 110 -198 497 -207 63 78 157 61 12 15 18 -147 64 165 -180 -165
7473 -165 106 323 -226 -102 -220 20 60 7 71 -238 -61 -47 -135 87 64 12 -121 -143 184 160 119 -146 -29
7496 -29 102 -195 -13 -161 -67 -277 -181 -175 140 -35 77 -79 -207 57 18 39 -21 -146 -250 338 -44 -80 264
7519 264 31 -50 -33 -191 -2 109 -13 160 38 176 122 -77 91 113 -49 86 -346 77 39 -193 32 -8
$$ packed form
7352A65N8m2L7j37k17J61P0j15Jj43J55j18K31o4K9q8K9j67J87j34J06n8M7p9
7376h6J92j22k9J14o2n6M66n62K03l5K42m29L76k63J17o7K89k91j13K83k40p0
7398a43M1J39J9JJ16j83j62L78k09j55J26J80j66J61k01J62n2j6p3J86j56l6J13
7421G0m0M4n1j76L9L93m05J19%K2O2j3L5n0Q7j31k23L43o5j68l6K00J29q9M7o8
7447G5j38N7Q1k6k2mJ66k28L0J52l3l08O95p04K70J5P9r6m9LLj65K11J01l45J5
7473a65K71K17n49J24j18K40M0n3O4l09J77J4q8K22k3n2j33k2L27k4m1k65J17
7496b9J31k97J82j48R4k10R6OL15j75J12j56j28K64l9K1o0j25j04N88l82l6L44
7519B64k33q1J7j58J89J11j22J73j22J38n4j99J68K2j62J35m32M23l8k32K25m0
$$ plain form
7541 -8 206 -69 20 129 316 -133 -285 191 84 98 -63 20 50 -50 -70 32 119 -163 -158 -125 75 -69 -372 -160
7565 -160 -86 85 377 27 20 34 43 34 27 102 96 37 -239 -45 101 -59 -24 -94 55 -125 -51 50 167 -37 50 -218
7591 -218 78 -163 51 192 159 -48 -72 -158 -82 200 369 56 161 -59 -129 -208 50 42 -252 200 -260 277 65
7614 65 -100 84 -66 129 -130 -68 -80 -200 -227 -257 -210 82 94 -159 140 -3 -104 311 -173 76 -90 143
7636 143 49 -26 -56 -85 -125 -24 17 95 134 -228 -35 45 43 17 -212 99 67 -39 -16 145 49 -13 187 98 148 -3
7662 -3 -16 223 -101 118 -71 151 208 -97 -16 101 -117 99 228 98 -147 69 -61 76 -89 -19 2 2 173
7685 173 -12 118 -190 104 205 -282 -172 94 -54 -214 -148 79 91 102 145 88 -81 -54 47 122 -39 53 -73
7708 -73 38 143 -86 94 -51 -81 19 172 -134 -190 -31 -46 8 11 -53 -49 68 -230 -181 -161 -129 -137 200 -47 -55 -158
$$ packed form
7541hK14k75Q9J09J87m49j52M76j07J4j61Q3L0j00k0J02Q7k82NL3K00j44l03K12
7565a60P4J71K92l50pJ4RrpP5on9k76J94J46j60L5p0J49j80P4J01J17k04Q7k68
7591b18K96k41K14J41l3k07k4q6P6K82J69l13J05k20p0p9K58qk94M52m60N37k12
7614F5j65J84j50J95k59O2j2j20k7l0M7K92J2k53K99j43j01M15m84K49j66K33
7636A43r4p5l0k9m0J01M1P8L9l62J93Q0kk6k29L11l2j06K3J61r6o2K00q9N0j51
7662cj3K39l24K19j89K22N7l05Q1J17k18K16J29j30k45K16j30J37j65P0K1%J71
7685A73j85J30l08K94J01m87J10K66j48j60O6K27J2J1M3n7j69K7J01P5j61R2j26
7708g3J11J05k29J80j45l0J00J53l06n6J59j5N4Lo4MJ17k98M9K0L2qL37k47qj03
$$ plain form
7734 -158 -72 11 127 122 190 149 33 -35 269 -109 -133 -30 -106 -28 -68 -99 -227 -55 -74 -126 -139 -246 -93 371 174
7759 174 -238 -6 124 146 -55 106 71 13 -90 -104 -25 100 -105 -49 -66 121 93 -17 -63 71 3 50 -84 -103
7783 -103 -39 28 22 153 -56 -249 -212 -24 -221 99 99 -138 4 -144 110 -10 -95 99 -191 -70 -104 163 -208
7806 -208 -155 225 315 143 -18 15 -172 44 -19 -11 45 -149 2 90 53 77 44 13 111 -86 -78 129 37 173 128 -57
7832 -57 -26 -149 119 112 -31 -82 151 63 -27 -49 -162 42 -106 32 121 -221 19 181 -74 211 -133 8 -92
7855 -92 -131 -27 -129 -5 -33 -79 108 111 -197 107 -122 -19 20 146 379 71 110 -101 135 -11 115 -61 -168
7878 -168 -24 111 -91 -112 66 -110 -95 -31 32 -128 -56 -106 -387 229 -54 102 31 -157 90 70 7 176 -175
7901 -175 -37 64 -7 80 66 -232 -23 -63 17 38 95 -150 -61 -94 -64 253 4 141 -11 13 -54 57 -270 -19
$$ packed form
7734a58Q6Q3J16nO8m1j16o8L04l78k4J03p6P8m0l1j28J72j9n2j3j07J53M64j97
7759A74m12K32J30K2k01J61l5n8j03j4P9J25k05N6j7J87k8j10m6J34o8M7j34j9
7783a03O4O7oJ31k09j93L7J88j97L20%k37J42j48K54j20q5J94k90J21l4K67l71
7806b08N3L80R0j72j61L3j87K16o3QN6j94J51Q8l7K4l3l1R8j97QK07r2J36m5j85
7832e7L1j23K68pj43n1K33q8r0k2j13K04j48J38Q9l42K40J62k55K85l44J41j00
7855i2l9J04j02J24k8m6J87Ll08L04k29J03L9J26K33l08L9k11K36j46J26j76j07
7878a68J44J35k02k1J78j76J5O4O3j60P2n0k81O16k83J56p1j88K47k0o3J69l51
7901a75J38J01p1Q7j4k98K09m0Q0K1N7k45Q9l3L0L17k49J37j52K4o7J11l27K51
$$ plain form
7925 -19 76 55 153 29 90 -116 31 28 -207 -50 -101 -199 -21 -74 -204 -121 55 91 -170 46 10 -48 3 -19 201
7950 201 -58 94 -84 -128 9 49 -49 -219 2 -26 -176 169 -72 -129 112 71 71 31 2 -40 -115 143 -56 -107
7974 -107 -25 -105 -184 30 107 -63 36 -118 -233 227 4 79 199 81 15 -124 325 47 106 47 16 -128 56
7997 56 -91 -100 50 -86 62 17 -41 261 -151 -39 -115 35 147 -65 -70 261 249 143 41 -53 -113 -61 103 43
8021 43 -30 -114 -20 -237 -9 8 399 -137 2 -102 -19 48 -32 -319 19 -47 -32 18 44 -133 110 -94 93 -124
8045 -124 -131 -31 194 155 -136 -93 -171 82 -185 53 17 -11 -53 -12 10 152 108 183 -172 262 108 184 -140 155
8069 155 289 8 22 -131 125 158 -112 253 -134 -157 99 144 -47 14 -53 36 -22 -161 230 -41 48 -158 -178
8092 -178 -14 190 -176 158 1 -7 152 19 0 167 218 -39 81 68 -90 47 236 138 -236 98 -36 62
$$ packed form
7925a9R5k1R8j24O1k06J47lk35J57n1r8J78n3j30Q3J76L6k61K16l6n8N1k2K20
7950B01k59J52j78m4J37M0r8j70K21k8j50L45k41n7K41m1%m0k9m2p5K58j99n1
7974a07Q2q0p9K14P7j70R9j54j15M60k23P5J20j18o6j39M49k78N9n9l1j44J84
7997E6j47rJ50j36J48m5n8L02m12J12p6J50J12k12nL31j2j06j02r4o0N2J64o0
8021D3p3q4R4k17K28J7L91n36J39j04Q3O7q0k87L38o6J5N0K6j77K43k04J87k17
8045a24pJ00K25l9k91M3p8K53k67K38l6k8m2M1K2J42m4P5l55M34j54P6l24K95
8069A55J34k81J4j53K56L3k70L65l87k3K56M5j91O1o7Q9n8j39L91k71Q9k06k0
8092a78J64K04l66L34j57qJ59j33j9J67N1k57J20j3j58J37J89r8l74L34j34R8
$$ plain form
8114 62 50 -22 59 123 85 32 164 31 -10 -88 -117 62 16 -192 173 39 26 -8 112 0 -37 30 95 3 -194 -129
8140 -129 -188 195 198 -57 60 -88 27 -6 -101 -63 -162 185 -222 11 132 -62 -40 -63 -186 13 217 -3 27
8163 27 61 -243 -199 92 85 123 -27 200 89 -112 -69 230 -165 -47 96 39 -69 -18 275 -43 105 -232 -41
8186 -41 9 109 121 -16 -5
$$ packed form
8114F2j2p2Q1O4l8n3J32j33m1p8k9J79m6k08L65j34j3l4J20j12l7O7O5r2j97O5
8140a29n9L83Lk55J17j48J15l3r5L8r9L47m07K33J21j94K2k3j23J99K04k20L0
8163B7L4l04M4K91pL8j50K27j11k01M3K99l95J18J43n7j08N1K93l18J48l37J91
8186d1N0J00J2j37J1
8191e
$$ Imaginary data points
##PAGE= N=2
##DATA TABLE= (X++(I..I)), XYDATA
$$ plain form
0 0 0 0 0 0 0 0 0 0 0 0 0 0 0 -8 8 -8 8 -15 16 -16 24 -24 32 -34 40 -48 56 -64 72 -85 96 -110 123 -140 158
35 158 -176 199 -223 247 -274 305 -338 374 -415 458 -505 558 -615 677 -745 823 -907 998
53 998 -1103 1222 -1355 1508 -1684 1894 -2141 2444 -2825 3312 -3966 4889 -6290 8660 -13383
68 -13383 26376 -134756 -402031 56563 284932 -33961 -261106 -29258 163522 69691 -5677
79 -5677 20030 -39690 -4683 123956 56016 -162210 -148105 96990 129622 -108285 -133612 64863
91 64863 117225 25630 -19465 -14900 -11368 22693 61433 -48645 -154290 -11472 119639 -4238
103 -4238 -109880 -560 112551 42749 -29502 21088 10957 -35099 24079 25589 -81504 -76778
115 -76778 57791 73666 -68641 -57968 111941 76101 -81005 -24842 97588 6229 -129964
$$ packed form
0@%%%%%%%%%%%%%qJ6j6J6k3L1l2M0m8N6o6P4q8J04j20J36j57J81k06K33k63K98
35A58l34L75m22M70n21N79o43P12p89Q73r63J063j173J292j422J568j730J905
53I98k101K325k577K863l192L578m035M585n269O137p278Q855j1179J4950k2043
68a3383L9759j61132k67275M58594K28369l18893k27145K31848J92780r3831p5368
79e677K5707n9720L5007J28639o7940k18226J4105K45095L2632k37907k5327J98475
91F4863N2362r1595m5095M565L532L4061L8740j10078j05645J42818J31111j23877
103d238j05642J09320J13111o9802p2251N0590j0131m6056N9178J510j07093M726
115g6778J34569J5875j42307J0673J69909l5840j57106N6163J22430r1359j36193
$$ plain form
126 -129964 -25231 104555 -34272 -136637 29638 121063 -10820 -75825 39332 91038
136 91038 -17190 -48493 19972 -4187 -41890 2210 12526 -32558 -21958 52952 48059 -33630
148 -33630 -6388 62075 9871 -46268 -11673 16546 -24841 -48424 9866 24168 -30340 -4092
160 -4092 49315 15109 -18514 11067 28726 -18791 -38948 13987 5229 -47600 -8221 38423
172 38423 4227 -19401 23489 48697 -8068 -27212 35107 16288 -56947 -27133 36150 4314
184 4314 -58914 -14743 66740 20040 -46642 4679 49452 7662 -33615 -15748 9440 -13039
196 -13039 -18007 5407 -11472 -10599 30253 26554 -9270 -7190 30203 23977 -30160 -22193 18919
209 18919 -5251 -29475 -3874 17133 1219 -12487 18699 29099 -12003 -10854 17107 265
$$ packed form
126a29964J04733J29786j38827j02365J66275R1425j31883o5005J15157N1706
136I1038j08228l1303O8465k4159l7703M4100J0316m5084J0600P4910m893q1689
148c3630K7242O8463n2204n6139L4595K8219m1387k3583N8290J4302n4508K6248
160d092N3407l4206l3623K9581J7659m7517k0157N2935q758n2829L9379M6644
172C8423l4196k3628M2890K5208n6765j9144O2319j8819p3235K9814O3283l1836
184D314o3228M4171Q1483m6700o6682N1321M4773m1790m1277J7867K5188k2479
196a3039m968K3414j6879Q73M0852l699l5824K080L7393o226n4137P967M1112
209A8919k4170k4224K5601K1007j5914j3706L1186J0400m1102J149K7961j6842
$$ plain form
221 265 -23572 -16469 1766 -5011 -17570 7743 14395 -7321 9859 26501 3184 -13391 2688
234 2688 17306 -12319 -32350 6652 16151 -16260 -10612 18620 20502 -3552 -5147 19948 5910
247 5910 -19848 -4414 1296 -13704 -14672 -1988 6753 -5128 -1698 19524 5974 -5170 10247
260 10247 6771 -10045 -10991 2169 2360 -19099 -7230 20765 5222 -9041 7808 19831 8999
273 8999 -11365 -3079 9044 -9678 -14148 -2272 -5379 -5246 1540 6690 3468 -3647 10704 12496
287 12496 -10474 -7075 5213 -3436 -12878 -8596 6348 2802 -8688 9026 16252 285 1108 8070
301 8070 6003 -4996 -10886 1460 -1674 -12919 -1070 3909 -1077 2058 5344 7455 -410 -3624
315 -3624 6916 -3645 -13456 -2014 -680 -6300 -5800 1910 10282 370 168 13453 5029 -3135 969
$$ packed form
221B65k3837P103J8235o777j2559K5313O652k1716J7180J6642k3317j6575J6079
234B688J4618k9625k0031L9002R499l2411N648K9232J882k4054j595K5095j4038
247E910k5758J5434N710j5000r68J2684Q741j1881L430K1222j3550j1144J5417
260A0247l476j6816r46J3160J91k1459J1869K7995j5543j4263J6849J2023j0832
273H999k0364Q286J2123j8722m470J1876l107J33O786N150l222p115J4351J792
287A2496k2970L399J2288q649r442M282J4944l546j1490J7714P226j5967Q23O962
301H070k067j0999n890J2346l134j1245J1849M979m986L135L286K111p865l214
315c624J0540j0561r811J1442J334n620N00P710Q372r912k02J3285q424q164M104
$$ plain form
330 969 370 -2023 -7976 -4623 4050 -3584 -1729 7073 3267 2690 3155 1891 969 -6115 -2996 -258
346 -258 -10734 -6151 2699 225 -1427 -532 7514 9160 -2390 564 4328 -2144 -1190 -3098 -4256
361 -4256 -1168 -1255 4215 3299 -2226 6287 7612 887 -596 -2938 -219 -1723 -7684 -2651 -3259 -4708
377 -4708 3655 2709 -257 668 2325 7510 -256 -7237 366 -346 -2480 -1967 -4287 1170 4105 2976
393 2976 5047 394 2424 6734 -215 -2606 -2843 -3897 -402 -3726 -3265 529 -2028 2256 5546 -77
409 -77 -156 -508 1275 1518 -6882 -4733 282 -1924 898 364 -574 3955 4391 5654 2194 -4372 1956
426 1956 3519 -2718 -4655 -5270 1399 4366 -2960 -1277 2357 2738 4101 -1790 -2850 -400 -2380 -347
442 -347 -2930 -6991 125 2540 1788 993 -2089 4573 7279 -12 -2451 -2256 2587 3370 -6574 -4366
$$ packed form
330I69n99k393n953L353Q673p634J855Q802l806n77M65j264r22p084L119K738
346b58j0476M583Q850k474j652Q95Q046J646j1550K954L764o472R54j908j158
361d256L088q7N470r16n525Q513J325o725j483k342K719j504n961N033o08j449
377d708Q363r46k966R25J657N185p766o981P603p12k134N13k320N457K935j129
393B976K071m653K030M310o949k391k37j054L495l324M61L794k557M284L290n623
409g7p9l52J783K43q400K149N015k206K822n34r38M529M36J263l460o566O328
426A956J563o237j937o15O669K967p326J683L634L81J363n891j060K450j980K033
442c47k583m061P116K415p52p95l082O662K706p291k439J95M843P83r944K208
$$ plain form
458 -4366 4352 3246 116 -2691 1808 7286 -585 -3674 -456 -1016 -376 -3590 -4649 -700 -1587 2100
474 2100 3057 -4466 111 7161 4061 -2611 -6859 2343 7066 -4081 -6651 -801 4220 5586 -2026
489 -2026 -2117 3933 3338 3322 -990 -5967 -1385 1747 607 -3803 -8403 909 7679 325 -4087 -3052
505 -3052 4275 7602 -3527 -7139 -305 2997 1605 -4332 -2951 4254 1874 1554 3808 31 -279
520 -279 423 2956 2833 -6106 -5697 3155 2889 -1801 -4833 -1209 5703 1362 -1637 -421 -3461 259
536 259 3352 -1071 -5464 -5939 3576 8414 -2799 -6292 1536 7751 6615 -3894 -6636 2206 5158
551 5158 2720 -4303 -8409 1582 8047 3734 -5182 -8362 3869 11619 -262 -9990 -7240 4701
565 4701 9830 -4584 -12924 -1889 9374 8251 -5985 -9036 4703 9263 2538 -5272 -6955 2823
$$ packed form
458d366Q718j106l130k807M499N478p871l089L218n60O40l214j059L949q87L687
474B100R57p523M577P050l100o672m248R202M723j1147k570N850N021J366p612
489b026r1O050n95j6m312m977M582L132j140m410m600R312O770p354m412J035
505c052P327L327j1129l612O834L302j392n937J381P205k380l20K254l777l10
520b79P02K533j23q939M09Q852k66m690l032L624O912m341k999J216l040L720
536B59L093m423m393m75R515M838j1213l493P828O215j136j0509k742Q842K952
551E158k438p023m106R991O465m313q916l180J2231P750j1881r728K750J1941
565D701N129j4414q340J1035J1263j123j4236l051J3739M560o725p810j683R778
$$ plain form
579 2823 7153 593 -4578 -5813 2880 10174 1141 -6662 -3870 4722 8257 -3372 -9786 -1418 4075
594 4075 2900 -3395 -6983 779 5069 3186 -1356 -5315 692 6047 559 -3409 -4159 876 4909
609 4909 -93 -2704 163 1792 3815 1223 -1841 -310 -832 1538 1626 -3415 -2878 -329 1652 2783
625 2783 -2761 -3440 2048 3515 1674 -3588 -4375 2699 3105 -1791 -3469 -2343 3652 3817 -1383 -1284 226
642 226 2585 3714 -1889 -2502 -130 1222 2384 -2338 -3965 1284 2731 1074 -1751 -3160 2207 3068
658 3068 -1310 -3230 -3100 1829 2793 -2707 -2780 455 2710 3225 -2081 -2146 2959 2457 195 -2234 -1549
675 -1549 2785 815 -1729 -515 349 2150 906 -1462 600 298 -147 11 -2584 -704 571 -1038
691 -1038 -9 -858 -236 1423 -335 776 612 -1092 1200 754 -992 -67 -363 1261 1281 -1441 657
$$ packed form
579B823M330o560n171j235Q693P294r033p803K792Q592L535j1629o414Q368N493
594D075j175o295l588P762M290j883m542l959O007N355n488l968p50N035M033
609D909n002k611K867J629K023k592l064J531n22K370Q8n041N37K549J981J131
625B783n544o79N488J467j841n262p87P074M06m896j678J126N995J65n200R9J510
642B26K359J129n603o13K372J352J162m722j627N249J447j657k825j409N367Q61
658C068m378j920J30M929R64n500p3L235K255N15n306o5N105n02k262k429O85
675a549M334j970k544J214Q64J801j244k368K062l02m45J58k595J880J275j609
691a038J029q49O22J659j758J111j64j704K292m46j746R25k96J624K0k722K098
$$ plain form
708 657 1691 519 582 -941 121 913 -1704 -519 -482 -1209 418 -908 -775 709 -388 714 302
725 302 -1040 692 -288 -737 510 -411 177 92 -132 1881 441 -716 1727 968 286 -425 -1334 1223
743 1223 -135 -1476 -328 -673 343 247 -1488 206 431 341 116 -1847 -412 1158 -1214 -881 -176
760 -176 327 1381 -421 -18 1484 -393 731 560 -536 586 -289 154 -52 -945 676 981 -853
777 -853 67 -390 -6 747 -922 -642 -139 -857 412 -990 -1199 921 335 298 119 -445 1577 559 -1025
796 -1025 359 47 571 170 -956 911 651 -156 630 -358 241 932 -735 -31 -223 -541 162 -1060
814 -1060 -760 403 -615 111 -51 -477 690 -162 -40 345 -666 191 426 -349 666 12 -13 1105
832 1105 -86 320 694 -382 678 -119 -844 153 -403 404 -8 -873 561 225 -507 108 -708 -87 488
$$ packed form
708F57J034j172O3j523J062P92k617J185L7p27J627j326J33J484j097J102m12
725C02j342J732r80m49J247r21N88q5k24K013j440j157K443p59o82p11r09K557
743A223j358j341J148l45J016r6j735J694K25r0k25j963J435J570k372L33P05
760a76N03J054j802M03J502j877J124j71j096J122q75M43k06q93J621L05j834
777h53R20m57L84P53j669K80N03p18J269j402k09K120n86l7j79n64K022j018j584
796a025J384l12N24m01j126J867k60q07P86r88N99O91j667P04j92l18P03j222
814a060L00J163j018P26j62m26J167q52J22L85j011Q57K35p75J015o54k5J118
832A105j191M06L74j076J060p97p25R97n56Q07m12q65J434l36p32O15q16O21N75
$$ plain form
851 488 -1116 4 -403 -256 1047 -108 -301 628 150 989 426 -708 483 325 249 47 -1333 404
869 404 805 -344 -233 -646 -33 1058 -481 -967 -465 -237 882 -332 -1334 -1 293 811 -176 -995
887 -995 1034 783 -103 410 -713 8 973 44 187 -524 -66 1286 -40 -601 54 -23 515 -416 -1089
906 -1089 287 -416 -108 278 -989 -288 115 9 622 -821 -377 1494 155 -130 -210 -302 998 39 5
925 5 407 -416 586 878 -294 -182 -379 101 826 -956 -962 281 -84 293 -807 -1104 584 440 -134 -389
945 -389 -687 1091 367 -704 124 32 356 656 -255 83 16 120 1303 -520 -890 639 759 86 -1395
964 -1395 -579 1354 -499 -1321 279 447 -81 -661 -473 716 -632 -142 903 -467 -483 600 399 432
982 432 -554 -87 1466 -278 -558 223 660 752 -797 -761 1151 126 -151 -145 -478 559 128 -672 -10 -170
$$ packed form
851D88j604J120m07J47J303j155j93R29m78Q39n63j134J191j58p6k02j380J737
869D04M01j149J11m13O13J091j539m86N02K28J119j214j002J333K94N18r87q19
887i95K029k51q86N13j123P21R65r29J43p11M58J352j326n61O55p7N38r31o73
906a089J376p03L08L86j267P01M03j06O13j443M44J871j339k85q0r2J300r59l4
925EM02q23J002K92j172J12j97M80P25j782oJ243l65L77j100k97J688j44n74k55
945c89k98J778p24j071Q28r2L24L00r11L38o7J04J183j823l70J529J20o73j481
964a395Q16J933j853q22J600J68n28n80J88J189j348M90J045j370j6J083k01L3
982D32r86M67J553j744k80P81M37R2j549L6J912j025k77Ol33J037m31q00O62j60
$$ plain form
1002 -170 -200 -176 -385 222 -525 -805 1024 -97 -728 176 715 702 -737 -727 1369 223 -901 311 692
1021 692 472 -795 167 1691 -218 -1295 685 557 -323 -1006 101 1272 -843 -1084 466 -2 -470
1038 -470 106 0 -19 -812 116 1120 -411 -1050 399 699 710 -816 -415 927 551 15 -238 -586 779
1057 779 438 -884 -228 57 389 -31 -689 -173 -412 -352 670 -814 -1249 -166 597 845 -931 -965 1636
1076 1636 1022 -765 -296 612 920 -173 -496 795 70 -427 936 104 -664 -466 266 943 -714 -1272
1094 -1272 842 327 -815 -445 -91 322 -325 -503 412 -448 -220 753 -75 -120 -487 273 717 -507 87
1113 87 341 -305 298 424 -569 -34 23 -10 111 -618 413 272 -739 22 30 -666 -86 2 280 -265 -811
1134 -811 696 303 -635 -223 348 426 -1 -192 864 164 -282 610 159 -322 13 237 347 -372 -553 916
$$ packed form
1002a70l0K4k09O07p47k80J829j121o31R04N39j3j439J0K096j146j124J212L81
1021F92k20j267R62J524j909j077J980j28q80o83J107J171k115k41J550m68m68
1038d70N76j06j9p93R28J004j531o39J449L00J1j526M01J342l76n36k53l48J365
1057G79l41j322O56K85L32m20o58N16k39O0J022j484m35J083P63K48j776l4K601
1076A636o14j787M69R08L08j093l23J291p25m97J363q32p68J98P32O77j657n58
1094a272K114n15j142L70L54M13o47j78R15q60K28R73q28m5l67P60M44j224N94
1113H7K54o46O03J26r93N35N7l3J21p29J031j41j011P61Qo96N80Q8K78n45n46
1134h11J507l93r38M12N71P8m27j91J056p00m46Q92m51m81L35K24J10p19j81J469
$$ plain form
1154 916 -190 -697 235 -154 239 -397 -339 480 -467 -510 426 -281 -297 62 469 149 -435 198 670 -325 -151
1175 -151 528 -40 263 20 283 316 -389 119 416 -282 -164 25 -49 -48 -538 362 194 -583 98 18 -485 -41
1197 -41 114 110 -15 -281 628 189 -303 655 276 20 -3 -20 251 59 -265 682 -100 -415 229 -32 55 -476
1219 -476 -220 466 -511 -518 357 -289 -216 2 -4 100 -258 -237 352 -373 -130 282 -233 155 -277 -50 263 -386
1241 -386 231 159 -165 66 98 -202 182 -417 142 -26 -529 153 199 -317 319 -198 49 -46 -476 392 150
1262 150 -160 468 -11 147 49 -203 452 121 -452 617 144 -495 233 -141 338 -197 -316 366 -11 -285
1282 -285 231 -220 -62 -74 -172 134 -538 60 295 -353 -132 493 -60 117 -105 2 450 -260 150 408 -346
1303 -346 40 179 -155 168 -483 54 220 -662 -205 21 -359 194 -183 3 401 -343 304 -110 -276 243
$$ packed form
1154I16j106n07R32l89L93o36N8Q19r47m3R36p07j6L59M07l20n84O33M72r95J74
1175a51O79n68L03k43K63L3p05N08K97o98J18J89p4Jm90R00j68p77O81q0n03M44
1197d1J55mj25k66R09m39m92R58l79k56k3j7K71j92l24R47p82l15O44k61Q7n31
1219d76K56O86r77pQ75o46P3K18oJ04l58K1N89p25K43M12n15L88m32K27L13o49
1241c86O17p2l24K31L2l00L84n99N59j68n03O82M6n16O36n17K47r5m30Q68k42
1262A50l10O28m79J58r8k52O55l31n73J069m73o39P28l74M79n35j19O82l77k74
1282b85N16m51J58j2r8L06o72N98K35o48K21O25n53J77k22J07M48p10M10K58p54
1303c46L86J39l34L23o51N37J66q82M57K26l80N53l77J86L98p44O47m14j66N19
$$ plain form
1323 243 -108 -139 -19 -349 159 99 -127 291 -130 -67 283 86 -70 161 12 464 -215 -330 484 -239 -282
1344 -282 -189 -193 330 3 -603 255 -332 -40 293 -147 -59 0 111 471 -35 -286 242 -112 36 92 -133 150
1366 150 110 174 169 -371 182 123 -164 77 -64 27 -15 -314 -118 115 -321 232 -166 -379 124 -329 -94 -15 -146
1389 -146 454 -47 -168 303 -111 441 339 -48 416 -116 -150 218 81 -145 242 -183 118 -142 -420 113
1409 113 -102 -77 11 -326 146 71 -258 212 103 111 143 -166 169 121 -255 340 111 -93 112 75 482 306 -333
1432 -333 189 98 -32 108 -171 138 31 -385 206 115 -387 194 -231 -351 113 -274 358 -28 -308 -75 -131
1453 -131 311 361 -434 93 437 -78 13 -130 86 97 -331 303 108 -275 60 -42 -19 -8 -434 268 186 -380
1475 -380 -320 6 129 -2 -373 149 326 -403 41 92 41 475 -82 -23 211 -235 395 107 -209 137 -102
$$ packed form
1323B43l51l1J20l30N08o0k26M18m21O3L50j97j56K31j49M52o79j15Q14p23m3
1344b82R3mN23l27o06Q58n87K92L33m40Q8N9J11L60n06k51N28l54J48N6k25K83
1366A50m0O4nn40N53n9k87K41j41R1m2k99J96K33m36N53l98k13N03m53K35P9j31
1389a46O00n01j21M71m14N52j02l87M64n32l4L68j37k26L87m25L01k60k78N33
1409A13k15K5Q8l37M72p5l29M70j09QL2l09L35m8l76N95k29k04K05l7M07j76o39
1432c33N22r1j30J40k79L09j07m16N91r1n02N81m25j20M64l87O32l86k80K33n6
1453a31M42N0p95N27L44n15R1j43K16J1m28O34j95l83L35j02K3J1m26P02q2n66
1475c80O0L26J23j31l71N22J77p29M44N1n1M34n57N9K34m46O30k88l16L46k39
$$ plain form
1496 -102 68 228 -264 -65 -2 -1 -75 -204 43 253 -225 -96 92 -127 -49 -316 -12 214 -542 183 313 -69
1518 -69 -37 -93 159 313 -173 51 191 50 83 -1 88 208 -235 92 168 -149 -50 -244 -214 62 -198 133 257
1541 257 -529 128 151 323 43 -270 14 493 -180 64 162 38 268 -46 122 281 173 169 186 -190 104 -249
1563 -249 -56 280 -505 -82 33 -58 -7 -222 116 399 -323 -129 -7 -1 74 86 -66 237 -388 169 332 -211
1585 -211 -146 77 156 270 -259 108 192 -157 85 -157 4 199 -129 218 129 -182 103 21 -249 111 74 64
1607 64 244 -268 104 203 -43 202 -113 -75 143 -155 107 121 -192 60 -77 -458 206 -175 -106 -26 -254 174
1629 174 -94 220 235 -217 -140 -113 -71 -70 -67 -105 261 -128 81 101 30 168 385 178 47 -264 331 463 -141 -110
1653 -110 181 4 144 -128 88 -6 -349 150 -138 -374 90 -259 -64 269 -24 195 -243 -177 305 191 -108
$$ packed form
1496a02J70J60m92J99O3Jp4j29K47K10m78J29J88k19P8k67L04K26p56P25J30l82
1518f9L2n6K52J54m86K24J40j41L3q4Q9J20m43L27P6l17R9j94L0K76k60L31J24
1541B57p86O57K3J72k80l13K84M79o73K44R8j24K30l14J68J59j08mJ7l76K94l53
1563b49J93L36p85M23J15r1N1k15L38K83p22J94J22OP5J2j52L03o25N57J63n43
1585b11O5K23P9J14n29L67Q4l49K42k42J61J95l28L47q9l11K85q2k70L60l7j0
1607F4J80n12L72R9k46K45l15L8K18k98K62J4l13K52j37l81O64l81O9Q0k28M28
1629A74k68L14J5m52P7K7M2JLl8L66l89K09K0p1J38K17k07j31l11N95J32o04L1
1653a10K91j77J40k72K16r4l43M99k88k36M64l49J95L33k93K19m38O6M82j14k99
$$ plain form
1674 -108 178 80 -67 -155 -150 322 209 74 289 -91 -116 425 -265 100 -65 70 360 -107 -61 189 -14 -160
1696 -160 -123 30 -81 -282 63 124 -123 36 77 -38 289 -73 -40 203 -230 -21 -17 -72 80 73 -29 -103 -58 48
1720 48 172 -497 257 -289 29 -63 20 68 -92 -178 127 24 -226 317 140 67 55 -74 281 155 -89 270
1742 270 -187 175 136 -204 23 -81 -237 99 -62 154 109 -247 165 -310 -225 161 -271 -271 45 -33 -31 220 -28
1765 -28 313 133 127 289 -207 -7 225 -6 137 123 53 158 -192 -65 98 -202 57 -187 -228 127 20 -202
1787 -202 140 -371 -159 -250 -80 -40 -82 168 93 -124 -59 17 -212 219 84 104 52 48 151 172 -196 169 221 -65
1811 -65 26 -90 55 -18 -136 -22 -490 -142 177 -389 21 -41 -98 -26 31 115 266 52 65 150 -64 323 -109
1834 -109 -117 165 -76 13 293 -48 132 -103 -208 -98 -88 110 26 -164 -110 74 -357 -3 -54 314 263 -307 27
$$ packed form
1674a08K86r8j47q8NM72j13j35K15l80k5N41o90L65j65J35K90m67M6K50k03j46
1696a60L7J53j11k01L45O1k47J59M1j15L27l62L3K43m33K09Mn5J52pj02p4M5J06
1720D8J24o69P54n46L18r2Q3M8j60q6L05j03k50N43j77p3j2j29L55j26k44L59
1742B70m57L62l9l40K27j04j56L36j61K16m5l56M12m75Q5L86m32%L16p8KK51k48
1765b8L41j80oJ62m96K00K32k31J43j4p0J05l50J27J63l00K59k44m1L55j07k22
1787b02L42n11K12r1J70M0m2K50p5k17O5P6k29M31j35K0n2mJ03K1l68L65N2k86
1811f5R1j16J45p3j18J14m68L48L19n66M10o2n7P2N7Q4J51k14J3Q5k14L87m32
1834a09qK82k41Q9K80l41J80k35j05J10J0J98q4j90N4J84m31L54n1L68n1n70L34
$$ plain form
1857 27 -24 -92 203 -124 75 222 51 309 3 -316 449 180 -176 276 -113 188 -109 -112 -78 37 -29 15 -319
1880 -319 -221 -199 -183 64 -145 -62 115 -76 123 -215 229 -33 -121 280 202 31 31 123 -76 -77 -9 -25 -118 13 73
1905 73 326 -145 83 91 -303 159 -129 -79 24 -503 8 72 -214 185 -142 65 -138 -66 29 272 83 173 -140
1928 -140 25 456 -21 160 12 -117 142 200 -35 -87 -26 -215 264 -236 -8 37 180 90 -27 -150 170 -98
1950 -98 -68 65 161 12 -59 -96 68 14 -100 3 43 104 65 -14 70 -252 -124 13 -47 113 -97 -128 66 -266
1974 -266 10 35 -307 176 83 -65 87 -95 182 169 -71 222 141 -57 175 228 -36 160 114 119 -130 14 279
1997 279 -273 -20 40 -301 89 -16 -262 247 -407 -171 -62 -279 75 -69 120 153 -36 -3 216 -170 -137
2018 -137 276 -112 162 51 49 238 -118 206 -29 -80 113 -225 75 195 -58 -250 37 -222 50 -22 29 188
$$ packed form
1857B7n1o8K95l27J99J47j71K58l06l19P65k69l56M52l89L01k97lL4J15o6M4l34
1880c19R8K2J6K47k09Q3J77j91J99l38M44k62q8M01p8j71%R2j99jO8j6r3J31O0
1905G3K53m71K28Ql94M62k88N0J03n27N11O4k86L99l27K07k03P2R5K43j89R0l13
1928a40J65M31m77J81j48j29K59N8k35n2O1j89M79n00K28M5J43r0j17j23L20k68
1950i8L0J33R6j49p1l7J64n4j14J03M0O1l9p9Q4l22J28J37o0J60k10l1J94l32
1974b66K76K5l42M83r3j48J52j82K77j3k40K93q1j98K32N3k64J96m6Nk49J44K65
1997B79n52K53O0l41L90j05k46N09o54K36J09k17L54j44J89L3j89L3K19l86L3
2018a37M13l88K74j11kJ89l56L24k35n1J93l38L00J20k53j92K87k59K72p2N1J59
$$ plain form
2040 188 193 10 -94 -72 -183 -179 -188 210 159 -197 407 148 57 63 159 105 70 -90 190 35 129 28 80 47 -106 70
2066 70 83 -447 -20 326 -364 118 -66 -21 246 -130 -31 30 -73 110 85 -142 227 56 87 122 -196 149 148
2089 148 -76 213 329 -129 40 -124 86 -85 -105 71 -83 -187 597 -216 -67 44 -62 86 156 -171 219
2110 219 81 -64 -14 -92 -10 203 26 173 -20 299 366 -34 191 -125 75 -50 -88 -52 -146 -88 112 48 -113
2133 -113 -74 18 -19 15 -95 66 -51 -97 -179 -321 131 -29 -76 214 -88 87 136 213 -244 -85 -128 137 -213
2156 -213 61 6 -79 -235 17 61 -385 9 -66 -148 -173 -39 0 -192 99 203 -78 22 -31 74 157 23 33
2179 33 161 -47 69 -12 53 319 24 -69 139 28 -149 -115 -48 175 156 116 -89 -319 -132 142 -190 25 -86
2202 -86 -24 46 -174 252 -28 -65 81 -8 -37 131 254 58 70 -32 175 -195 -89 91 -176 143 61 -37 -119
$$ packed form
2040A88Nj83j04K2j11MrL98n1l56O04k59r1OR6n4l5j60K80j55R4j01N2l3j53J76
2066G0J3n30M27L46o90M82j84M5K67l76R9O1j03J83k5k27L69j71L1L5l18L45j
2089A48k24K89J16m58J69j64K10j71k0J76j54j04P84q13J49J11j06J48P0l27L90
2110B19j38j45N0p8Q2K13j77J47j93L19O7m00K25l16K00j25l8L6r4N8K00o4j61
2133a13L9R2l7L4j10J61j17m6q2j42M52j60m7K90l02J75M9P7m57J59m3K65l50
2156b13K74n5q5j56K52M4m46L94p5q2k5J34L9j92K91J04k81J00n3J05Q3j34J0
2179C3J28k08J16q1O5K66k95r3K08j11j77L4O7K23j9m0k05k30J87K74l32K15j11
2202h6O2P0k20M26k80l7J46q9k9J68J23j96J2j02K07l70J06J80k67L19q2r8q2
$$ plain form
2225 -119 18 -130 -119 -147 13 -91 36 102 268 83 342 -78 -4 269 6 -18 3 86 162 -108 -118 190 -98
2248 -98 -2 57 -208 -63 -212 179 -135 -87 4 220 95 -153 168 115 -45 -109 66 95 181 -108 184 -104 286
2271 286 64 -61 -1 -129 115 -77 135 245 -65 44 77 -251 124 -65 -126 259 -60 241 -1 -29 159
2292 159 -200 -85 134 -70 -46 20 18 168 225 -79 46 53 -160 28 71 84 37 -265 -57 -160 -43 0 60 132
2316 132 36 -231 -3 -368 -265 168 -458 52 -137 -4 -40 -184 39 -127 206 -33 -3 131 17 238 -32
2337 -32 283 -46 126 188 214 -105 -176 -124 -103 -125 -124 64 -287 119 -4 -85 26 -293 -144 20 -486 -149 132
2360 132 -169 219 -52 104 211 -298 -271 -245 -62 157 -133 354 175 -17 -59 207 42 -111 -253 -29 102
2381 102 -90 -106 42 41 -20 -46 23 -7 -82 -65 79 137 -147 200 -73 139 79 177 67 -231 -4 -94 97 172 163
$$ packed form
2225a19J37j48J1k8J60j04J27O6J66j85K59m20P4K73k63k4K1Q3P6k70j0L08k88
2248i8R6N9k65J45j49L91l14M8R1K16j25k48L21n3j60o4J75K9Q6k89K92k88L90
2271B86k22j25O0j28K44j92K12J10l10J09L3l28L75j89o1L85l19L01k42k8J88
2292A59l59J15K19k04K4O6kJ50N7l04J25Pk13J88M3J3m7l02K08j03J17M3O0P2
2316A32r6k67K28l65J03M33o26N10j89J33l6j44K23j66L33k39L0J34j14K21k70
2337c2L15l29J72O2K6l19p1N2K1k2JJ88l51M06j23q1J11l19J49J64n06L37K81
2360A32l01L88k71J56J07n09K7K6J83K19k90M87j79j92m2K66j65j53j42K24J31
2381A02j92j6J48jo1k6O9l0p5J7J44N8k84L47k73K12o0R8j10k98K27r0J91P5r
$$ plain form
2406 163 -63 -140 -306 36 -80 135 194 -210 -31 192 45 147 -45 -114 10 -62 -49 -43 0 -110 -245 -111 115
2429 115 -201 -96 418 50 126 -22 -30 247 31 -276 54 46 -328 25 -163 -58 -109 -251 3 -94 -130 -198 -160
2452 -160 -163 181 -103 283 87 19 -131 19 108 71 26 17 -92 -42 31 44 -46 7 -173 -9 -90 -186 263 -55 25
2477 25 -90 69 137 -174 -1 132 14 -15 -168 39 -17 -14 64 276 63 -55 -24 131 -253 -63 -389 84 60
2500 60 143 170 -68 273 86 -81 165 -60 47 -186 60 121 32 -262 222 -92 79 -114 62 137 172 48
2522 48 -111 329 -233 253 -181 41 148 -115 -93 68 -181 -65 64 108 -135 -106 -231 -132 -250 -154 -259 -78
2544 -78 112 5 333 129 -107 28 18 -169 126 -90 169 -105 -74 138 61 -18 109 218 169 -156 125 -238
2566 -238 -169 -4 -34 -119 216 -68 47 -165 45 83 -63 38 22 257 -239 -51 36 145 -77 -293 -77 -60
$$ packed form
2406A63k26p7j66L42j16K15N9m04J79K23j47J02j92o9J24p2J3OM3j10j35J34K26
2429A15l16J05N14l68P6j48qK77k16l07L30ql74L53j88J05n1j42K54r7l6o8L8
2452a60lL44k84L86j96o8j50J50Q9l7m5rj09N0P3J3r0N3j80J64q1r6M49l18Q0
2477B5j15J59O8l11J73J33j18k9j53K07n6LP8K12k13j18L1J55l84J90l26M73k4
2500F0Q3K7k38L41j87j67K46k25J07k33K46O1q9k94M84l14J71j93J76P5L5j24
2522D8j59M40n62M86m34K22J07k63K2J61k49J16J29M4k43K9j25R9j18R6j05J81
2544g8J90j07L28k04k36J35j0j87K95k16K59k74L1K12p7p9J27J09m9l25K81l63
2566b38O9J65l0q5L35k84J15k12K10L8j46J01j6K35m96J88Q7J09k22k16K16J7
$$ plain form
2588 -60 108 64 -84 203 6 -265 -111 56 -65 133 -26 52 86 -13 64 -24 16 172 213 -33 -56 -3 -33 -203
2612 -203 76 26 137 134 213 88 20 109 105 -54 22 -212 -32 -32 124 -50 -152 17 -42 -120 81 -335 -290 47 -15
2637 -15 -151 -71 -31 -20 -68 -304 -48 -153 -14 117 29 184 110 177 81 94 -64 42 -205 -115 75 -196 58 -24
2661 -24 41 155 -111 200 170 10 -150 3 49 44 -195 -165 31 -163 161 -45 -58 77 -14 140 191 -120 6
2684 6 62 72 -91 14 40 -112 12 47 -140 -61 -101 16 -164 26 -167 -152 -68 -199 -32 33 45 -151 -63 39
2708 39 66 -69 43 -246 -69 122 -124 -175 190 -390 171 58 -5 -4 6 107 212 -312 -32 65 -50 28 -103
2731 -103 200 -217 -292 130 -275 -171 117 -62 -66 29 -274 98 -314 213 -60 -132 -72 182 -39 36 -35 80 230
2754 230 -4 -51 78 -82 -183 -29 56 137 54 169 123 -75 -26 5 156 263 6 -46 76 -216 -22 165 -173
$$ packed form
2588f0J68m4j48K87j97k71J54J67j21J98j59P8L4r9P7q8M0J56M1k46k3N3l0j70
2612b03K79n0J11lP9j25o8Q9mj59P6k34J80%J56j74j02J69n9p8K01m16M5L37o2
2637a5j36Q0M0J1m8k36K56j05J39J31q8J55p4O7r6J3j58J06k47R0J90k71K54q2
2661b4O5J14k66L11l0j60j60J53M6nk39L0J96j94L24k06j3J35r1J54N1l11J26
2684FN6J0j63J05K6j52J24L5j87P9m0J17j80J90j93J5Q4j31J67O5J2j96Q8J02
2708C9K7j35J12k89J77J91k46n1L65n80N61j13o3JJ0J01J05n24K80R7j15P8j31
2731a03L03m17p5M22m05J04K88j79mR5l03L72m12N27k73p2O0K54k21P5p1J15J50
2754B30k34m7J29j60j01J54Q5Q1q3J15m6j98M9L1J51J07k57n2J22k92J94J87l38
$$ plain form
2777 -173 287 -77 -241 77 -266 176 117 -136 -71 -17 -232 58 -58 -37 78 -205 25 111 111 75 -237 -100 -31
2800 -31 -214 -109 75 -173 225 53 12 -130 74 350 109 -22 227 35 -60 153 84 107 43 -5 -116 -119 -199
2823 -199 108 83 49 210 -47 -78 -51 112 -277 13 -95 26 98 106 145 39 93 -137 -40 -132 88 264 127 -57
2847 -57 264 42 86 55 -195 -35 -94 -103 -129 -96 171 -15 -38 97 -81 -174 183 35 167 0 19 73 165 46
2871 46 115 171 129 220 -26 220 -45 -214 272 125 -132 51 19 -142 -25 89 -123 16 127 -81 -113 -97 -55
2894 -55 -26 194 128 -282 78 153 -30 232 81 -118 205 18 -67 -61 175 64 -211 -14 148 -99 273 -136
2916 -136 39 248 113 92 -84 -132 96 99 207 12 -65 -73 180 -137 -35 213 -64 154 -156 11 -153 7
2938 7 337 27 109 7 62 90 26 -265 206 69 72 255 79 -229 7 35 92 38 24 133 -146 12 -2 95 -42
$$ packed form
2777a73M60l64j64L18l43M42n9k53O5N4k15K90j16K1J15k83K30Q6%l6l12J37O9
2800c1j83J05J84k48L98j72m1j42K04K76k41j31K49j92r5K13o9K3o4m8j11lq0
2823a99L07k5l4J61k57l1K7J63l89K90j08J21P2QL9j06N4k30R7r2K20J76j37j84
2847e7L21k22M4l1k50J60n9rk6L3K67j86k3J35j78r3L57j48J32j67J9N4R2j19
2871D6O9N6m2R1k46K46k65j69M86j47k57J83l2j61J17J14k12J39J11k08l2J6M2
2894e5K9K20o6m10L60P5j83K62j51j99L23j87q5OK36j11k75J97J62k47L72m09
2916a36J75K09j35k1j76m8K28LJ08j95p7qK53l17J02K48k77K18l10J67j64J60
2938GL30l10Q2j02N5K8o4k91M71j37LJ83j76l08K36K8N7n4j4J09k79J58j4R7j37
$$ plain form
2963 -42 -15 50 -47 -98 31 81 65 -32 -107 158 13 -129 -97 24 -62 17 246 48 -59 261 -69 12 -27 -15 180
2988 180 -193 -5 97 -155 126 130 97 73 -124 -65 -169 -195 10 -203 238 -43 75 154 -27 -32 -203 -129 60
3011 60 -40 -203 -162 -47 113 185 -113 39 63 -39 284 44 2 1 -97 155 33 118 -237 30 299 220 153 -107
3035 -107 25 -27 -1 -134 5 -64 9 -79 13 -35 -108 -123 197 21 82 -11 39 2 11 40 146 86 171 20 -29 19 190
3062 190 59 -83 153 21 272 -10 -38 -59 180 -14 -250 -89 -30 -120 -13 -74 185 57 46 46 -100 69 46
3085 46 62 238 -41 -114 110 -256 69 107 -189 87 -20 -16 322 -14 -48 -303 -127 168 154 -8 -59 -269 203
3108 203 -133 -6 -122 -99 75 30 -143 36 -112 -182 144 73 59 -110 57 29 -147 -175 -106 82 -251 -149 19
3131 19 -265 224 -83 288 -7 -47 62 175 -93 -64 101 -69 -115 114 43 -41 106 108 -14 -257 -120 50 141
$$ packed form
2963d2K7O5r7n1J29N0j6r7p5K65j45j42L2J21q6P9K29j98j07L20l30Q1l9J2J95
2988A80l73J88J02k52K81Ml3k4j97N9j04k6K05k13M41k81J18P9j81nj71P4J89
3011F0j00j63M1J15J60P2k98J52K4j02L23k40m2jr8K52j22Q5l55K67K69p9o7k60
3035a07J32n2K6j33J39o9P3q8R2m8p3j5L20j76O1r3N0l7RK9J06o0Q5j51m9M8J71
3062A90j31j42K36j32K51k82k8k1K39j94k36J61N9r0J07o1K59j28j1%j46J69k3
3085D6J6J76k79p3K24l66L25L8k96K76j07ML38l36l4k55J76K95j4j62n1k10M72
3108B03l36J27j16K3J74m5j73J79j48p0L26p1j4j69J67k8j76k8O9J88l33J02J68
3131A9k84M89l07L71k95m0J09J13k68K9J65j70m6K29p1q4J47Kj22k43J37J70R1
$$ plain form
3154 141 -141 166 -4 -173 -133 113 -33 -50 -94 -73 -110 -146 -105 -56 65 192 -101 9 -76 25 144 53 -9 322
3178 322 -8 204 -10 -16 185 -79 -121 210 65 280 -107 -204 -36 -49 -273 28 102 -189 5 -31 -54 204 140
3201 140 30 143 -176 68 81 194 131 -147 296 158 179 -45 -270 -51 -149 -106 85 -126 101 38 -22 -49 151
3224 151 -235 -9 55 -57 132 46 -169 -161 66 74 25 -169 110 -84 -31 1 24 14 32 84 47 61 4 -189 55
3249 55 -191 -63 -96 23 -133 203 174 -218 -195 208 -210 31 205 -24 -33 -220 131 86 -166 -135 78 -13 -26
3272 -26 -17 -236 40 -129 -317 -112 40 146 -85 -85 -77 -169 -76 -114 -143 1 165 67 -53 -153 -90 13 4 191 56
3297 56 129 114 9 68 79 22 -91 22 -120 80 -281 -14 69 -128 34 -78 -108 130 144 -33 164 -46 4
3320 4 -120 47 19 88 -26 -166 -203 69 -61 58 112 131 178 -70 23 46 52 37 -4 110 -63 -25 -43 -259 24
$$ packed form
3154A41k82L07j70j69M0K46j46j7m4K1l7l6M1M9J21J27k93J10q5J01J19r1o2L31
3178C22l30K12k14oK01k64m2L31j45K15l87r7J68j3k24L01P4k91J94l6k3K58o4
3201A40j10J13l19K44J3J13o3k78M43j38K1k24k25K19r8M3J91k11K27o3o0k7K00
3224A51l86K26O4j12J89q6k15QK27Qm9j94K79j94N3L2K3j0J8N2l7J4n7j93K44
3249E5k46J28l3J19j56L36k9l92K3M03m18K41J74k29rj87L51m5k52L1K13r1j3
3272b6Rk19K76j69j88K05J52J06k31%Qr2R3l8k9J44J64r8j20j00O3J03rJ87j35
3297E6P3j5j05N9J1n7j13J13j42K00l61K67Q3j97J62j12l0K38J4j77J97k10N0
3320Dj24J67k8O9j14j40l7K72j30J19N4J9M7k48R3K3Oj5m1J14j73L8j8k16K83
$$ plain form
3345 24 -129 -3 -164 12 222 -97 31 247 -88 -106 -100 -55 -167 -46 9 45 -105 35 107 -243 5 47 30
3368 30 9 -82 -76 -91 54 -163 -237 -15 298 -26 -54 -85 4 102 -70 117 221 -265 -108 -125 122 -92 -10 -156
3392 -156 -119 115 -177 -79 -278 159 -152 -87 128 191 -60 138 41 -142 123 -92 -45 -153 -124 183 94 212 16
3415 16 -101 172 21 -45 111 -174 -142 43 -47 -130 90 -16 204 -103 -124 50 -105 -180 -107 -150 30 -43 -24 33
3439 33 -125 216 221 -46 30 -232 -152 100 -95 155 229 92 -107 20 -141 -171 87 31 251 -83 206 92 -81
3462 -81 -44 -74 -200 -154 36 35 -119 15 95 -164 245 25 102 -112 103 -26 248 258 -26 184 -44 -50 18 -198
3486 -198 220 79 -264 96 -12 -106 -82 -29 130 -6 9 -61 0 85 -136 40 -90 -156 -92 93 -23 -93 113
3509 113 199 170 -6 27 -21 -241 -39 37 2 -98 107 -76 63 55 -184 250 33 -95 -94 66 -118 -189 -65 -118
$$ packed form
3345B4j53J26j61J76K10l19J28K16l35j8OM5j12J21N5L6j50J40P2l50K48M2j7
3368C0k1r1Oj5J45k17p4K22L13l24k8l1Q9R8j72J87J04m86J57j7K47k14Q2j46
3392a56L7K34k92R8j99M37l11O5K15O3k51J98r7j83K65k15M7j08K9L07q9J18j96
3415A6j17K73j51o6J56k85L2J85r0q3K20j06K20l07k1J74j55p5P3m3J80p3J9N7
3439C3j58L41Nk67P6k62Q0K52j95K50P4j37j99J27j61l0K58n6K20l34K89j14j73
3462h1L7l0j26M6J90jj54J34Q0k59M09k20P7k14K15j29K74J0k84K10k28oO8k16
3486a98M18j41l43L60j08r4K4N3J59j36J5p0O1Q5k21J76j30o6O4J85j16p0K06
3509A13Q6k9j76L3m8k20K02P6l5j00K05j83J39qk39M34k17j28JJ60j84p1J24n3
$$ plain form
3533 -118 90 -178 -78 -47 -9 133 -29 -157 -472 39 -101 147 -215 -247 -82 27 78 68 -42 -146 101 -147
3555 -147 -32 0 -98 38 182 -57 181 94 -18 72 4 -43 57 32 90 57 5 72 -73 17 -15 -271 46 117 -261
3580 -261 -29 327 -84 -91 91 -115 -12 -32 -110 116 -196 -51 116 52 124 1 277 89 -131 10 -12 -61 15
3603 15 24 143 -44 -58 157 -221 -77 17 202 143 85 66 -58 127 321 171 238 -190 -47 4 -374 70 168 -69
3627 -69 295 233 -58 -55 113 -93 -109 -69 -202 -47 -44 -2 -137 -43 58 15 -218 46 93 122 206 8 13 -246 88
3652 88 -163 25 -154 -136 245 98 -89 30 -69 146 -23 -31 40 -43 285 188 10 -241 -99 36 -8 94 106
3675 106 -100 241 -20 67 -50 -192 -97 159 -56 -40 10 -155 248 160 10 -5 -199 9 -123 25 -82 -72
3697 -72 106 113 -110 13 158 -162 51 -97 -130 121 133 -48 67 83 -29 88 -127 -12 -178 -3 203 152
$$ packed form
3533a18K08k68J00L1L8J42j62j28l15N11j40K48l62l2J65J09N1j0j10j04K47k48
3555a47J15L2r8J36J44k39K38q7j12R0o8m7J00k5N8l3n2O7j45R0l2k56L17P1l78
3580b61K32L56m11pJ82k06J03k0p8K26l12J45J67o4P2j23K76j88k20J41k2m9P6
3603A5RJ19j87j4K15l78J44R4J85n9n8j9j24J85J94j50O7m28J43N1l78M44R8k37
3627f9L64o2k91LJ68k06j6M0j33J55LM2j35R4J01m3k33K64M7K9Q4j98Nk59L34
3652H8k51J88j79J8L81j47j87J19r9K15j69qP1q3L28r7j78k51J42J35m4J02J2
3675A06k06L41k61Q7j17j42R5K56k15J6N0j65M03q8j50j5j94K08j32J48j07J0
3697g2J78Pk23J23J45l20K13j48l3K51J2j81J15J6j12J17k15J15j66J75K06n1
$$ plain form
3719 152 53 182 -38 87 7 209 102 -134 148 -117 104 82 101 -24 -105 24 26 -164 -83 31 188 -129 -137
3742 -137 39 -82 164 -75 182 -54 -41 153 96 50 -131 -150 144 105 -204 47 -6 43 -62 -66 12 -163 -219 193
3766 193 44 -57 4 -126 23 334 -230 111 76 -112 -33 -245 -7 -45 -178 -160 67 -72 215 -91 215 -26
3788 -26 90 -59 343 -221 141 -131 31 -134 9 -56 -44 211 21 -11 92 22 -262 -85 257 43 -37 -68
3810 -68 77 -164 -69 -73 -74 16 -150 -113 7 236 69 23 17 -133 -113 74 3 -123 221 22 46 86 135 127 -23 18
3836 18 153 13 -12 -195 -94 116 -87 17 -110 25 -10 -15 75 247 -246 -146 -24 207 170 -110 6 -27 13
3859 13 119 -118 -11 -130 -49 -143 -61 56 93 -172 -240 70 -104 6 -180 -78 11 68 3 -91 71 105 -42 -320
3883 -320 -198 137 22 -66 164 14 -19 29 -40 -91 121 -44 145 -128 -154 -111 -130 -205 44 -144 117 -2 100
$$ packed form
3719A52r9J29k20J25q0K02j07k36K82k65K21k2J9j25q1J29Kj90Q1J14J57l17q
3742a37J76j21K46k39K57k36J3J94n7m6j81j9K94l9l09K51n3M9j05mP8j75n6M12
3766A93j49j01O1j30J49L11n64L41l5j88P9k12K38l8j33J8K27j39K87l06L06k41
3788b6J16j49M02n64L62k72J62j65J43o5J2K55j90l2J03p0k84J77L42k14q0l1
3810f8J45k41R5mjR0j66L7J20K29j67m6oj50K0J87p1j26L44j99K4M0M9qj50M1
3836A8J35j40k5j83J01K10k03J04j27J35l5nR0J72m93J00J22K31l7k80J16l3M0
3859A3J06k37J07j19Q1r4Q2J17L7k65o8L10j74J10j86J02Q9N7o5r4J62L4j47k78
3883c20J22L35j15q8K30j50l3M8o9n1K12j65J89k73k6M3j9p5K49j88K61j19J02
$$ plain form
3906 100 -59 132 16 -37 -120 263 37 56 -1 -43 -51 -232 89 82 -95 -99 -128 41 99 147 -57 -109 184 -24 4
3931 4 -254 252 -55 -43 10 -89 -188 -207 22 -53 48 -15 -50 -135 -59 46 -38 -14 -235 -220 157 63 9 -203 172 74
3957 74 160 46 -109 85 51 -134 82 62 113 152 -50 4 -51 3 -108 -172 42 -70 -155 270 -42 298 132 65
$$ packed form
3906A00j59J91j16n3q3L83k26J9n7m2qj81L21pj77mk9J69N8M8k04n2K93k08K8
3931Dk58N06l07J2N3r9r9j9K29p5J01o3l5q5P6J05q4K4k21J5L77r4n4k12L75r8
3957G4Q6j14j55J94l4j85K16k0N1L9k02N4n5N4j11o4K14j12q5M25l12L40j66o7
$$ [...]
8191f3
##END NTUPLES=NMR FID
##END=
