##TITLE=1H_Pr n-Eth
 CDCl3
 8 sc, 
 13.12.2021
##JCAMPDX= 6.0         $$ Bruker NMR JCAMP-DX V2.0
##DATA TYPE= NMR FID
##DATA CLASS= NTUPLES
##ORIGIN= UXNMR, Bruker Analytische Messtechnik GmbH
##OWNER= root
$$ XWIN-NMR		Version 3.5
$$ Mon Dec 13 12:09:10 2021 Russian Standard Time (UT+4h)  she@DPX200
##.OBSERVE FREQUENCY= 200.131346
##.OBSERVE NUCLEUS= ^1H
##.DELAY= (6, 6)
##.ACQUISITION MODE= SIMULTANEOUS
##.ACQUISITION SCHEME= undefined
##.AVERAGES= 8
##.DIGITISER RES= 18
##SPECTROMETER/DATA SYSTEM= spect
##.PULSE SEQUENCE= zg30
##.SOLVENT NAME= CDCl3
##.SHIFT REFERENCE= (INTERNAL, CDCl3, 0, 15.7039)
##AUDIT TRAIL= $$ (NUMBER, WHEN, WHO, WHERE, WHAT)
$$ ##TITLE= Audit trail, XWIN-NMR		Version 3.5
$$ ##JCAMPDX= 5.01
$$ ##ORIGIN= Bruker BioSpin GmbH
$$ ##OWNER= she
$$ F:/spectra/data/she/nmr/H-F/1/audita.txt
$$ ##AUDIT TRAIL=  $$ (NUMBER, WHEN, WHO, WHERE, WHAT)
(   1,<2021-12-13 12:07:41.76 +0400>,<she>,<DPX200>,
      <created by zg, POWCHK disabled, PULCHK disabled
       configuration hash MD5:
       00 E9 B6 7A A2 85 ED C7 34 08 36 98 17 FE 4E 26
       data hash MD5: 16K
       A2 F3 1B 6A C1 CB DC 72 96 47 68 8F 31 6A 3E 9A>)
$$ ##END=
$$ 
$$ hash MD5
$$ 08 F6 A3 68 40 2B 94 E3 A2 FD 2D 9A C9 94 BD C2
##$RELAX= 
##$RELAX= 
##$RELAX= 
##$RELAX= 
##$RELAX= 
##$RELAX= 
$$ Bruker specific parameters
$$ --------------------------
##$DU= <F:/spectra>
##$EXPNO= 1
##$NAME= <H-F>
##$PROCNO= 1
##$TYPE= <nmr>
##$USER= <she>
##$AMP= (0..31)
100 100 100 100 100 100 100 100 100 100 100 100 100 100 100 100 100 100 
100 100 100 100 100 100 100 100 100 100 100 100 100 100 
##$AQSEQ= 0
##$AQ_mod= 1
##$AUNM= <au_zg>
##$AUTOPOS= <>
##$BF1= 200.13
##$BF2= 200.13
##$BF3= 200.13
##$BF4= 200.13
##$BF5= 200.13
##$BF6= 200.13
##$BF7= 200.13
##$BF8= 200.13
##$BYTORDA= 1
##$CFDGTYP= 0
##$CFRGTYP= 5
##$CHEMSTR= <none>
##$CNST= (0..31)
1 1 145 1 1 1 1 1 1 1 1 1 1 1 1 1 1 1 1 1 1 1 1 1 1 1 1 1 1 1 1 1 
##$CPDPRG= <>
##$CPDPRG1= <>
##$CPDPRG2= <>
##$CPDPRG3= <>
##$CPDPRG4= <mlev>
##$CPDPRG5= <mlev>
##$CPDPRG6= <mlev>
##$CPDPRG7= <mlev>
##$CPDPRG8= <mlev>
##$CPDPRGB= <>
##$CPDPRGT= <>
##$D= (0..31)
0 1.2 0 0 0 0 0 0 0 0.06 0 0.03 0 0 0 0 0.0002 0 0 0 0 0 0 0 0 0 0 0 0 
0 0 0 
##$DATE= 1639382861
##$DBL= (0..7)
120 120 120 120 120 120 120 120 
##$DBP= (0..7)
150 150 150 150 150 150 150 150 
##$DBP07= 0
##$DBPNAM0= <>
##$DBPNAM1= <>
##$DBPNAM2= <>
##$DBPNAM3= <>
##$DBPNAM4= <>
##$DBPNAM5= <>
##$DBPNAM6= <>
##$DBPNAM7= <>
##$DBPOAL= (0..7)
0.5 0.5 0.5 0.5 0.5 0.5 0.5 0.5 
##$DBPOFFS= (0..7)
0 0 0 0 0 0 0 0 
##$DE= 6
##$DECBNUC= <off>
##$DECIM= 32
##$DECNUC= <off>
##$DECSTAT= 4
##$DIGMOD= 1
##$DIGTYP= 9
##$DL= (0..7)
0 120 120 120 120 120 120 120 
##$DP= (0..7)
150 150 150 150 150 150 150 150 
##$DP07= 0
##$DPNAME0= <>
##$DPNAME1= <>
##$DPNAME2= <>
##$DPNAME3= <>
##$DPNAME4= <>
##$DPNAME5= <>
##$DPNAME6= <>
##$DPNAME7= <>
##$DPOAL= (0..7)
0.5 0.5 0.5 0.5 0.5 0.5 0.5 0.5 
##$DPOFFS= (0..7)
0 0 0 0 0 0 0 0 
##$DQDMODE= 0
##$DR= 18
##$DS= 0
##$DSLIST= <SSSSSSSSSSSSSSS>
$$ [...]
##$SUBNAM2= <"">
##$SUBNAM3= <"">
##$SUBNAM4= <"">
##$SUBNAM5= <"">
##$SUBNAM6= <"">
##$SUBNAM7= <"">
##$SUBNAM8= <"">
##$SUBNAM9= <"">
##$SW= 18.0517287032376
##$SWIBOX= (0..15)
0 0 2 0 0 0 0 0 0 0 0 0 0 0 0 0 
##$SW_h= 3612.71676300578
##$TD= 16384
##$TD0= 1
##$TE= 0
##$TE2= 300
##$TE3= 300
##$TEG= 300
##$TL= (0..7)
0 120 120 120 120 120 120 120 
##$TP= (0..7)
150 150 150 150 150 150 150 150 
##$TP07= 0
##$TPNAME0= <>
##$TPNAME1= <>
##$TPNAME2= <>
##$TPNAME3= <>
##$TPNAME4= <>
##$TPNAME5= <>
##$TPNAME6= <>
##$TPNAME7= <>
##$TPOAL= (0..7)
0.5 0.5 0.5 0.5 0.5 0.5 0.5 0.5 
##$TPOFFS= (0..7)
0 0 0 0 0 0 0 0 
##$TUNHIN= 0
##$TUNHOUT= 0
##$TUNXOUT= 0
##$USERA1= <user>
##$USERA2= <user>
##$USERA3= <user>
##$USERA4= <user>
##$USERA5= <user>
##$V9= 5
##$VALIST= <valist>
##$VCLIST= <CCCCCCCCCCCCCCC>
##$VD= 0
##$VDLIST= <DDDDDDDDDDDDDDD>
##$VPLIST= <PPPPPPPPPPPPPPP>
##$VTLIST= <TTTTTTTTTTTTTTT>
##$WBST= 1024
##$WBSW= 4
##$XGAIN= (0..3)
0 0 0 0 
##$XL= 0
##$YL= 0
##$YMAX_a= 154917
##$YMIN_a= -201661
##$ZGOPTNS= <>
##$ZL1= 120
##$ZL2= 120
##$ZL3= 120
##$ZL4= 120
##$ABSF1= 10
##$ABSF2= 0
##$ABSG= 5
##$ABSL= 3
##$ALPHA= 0
##$AQORDER= 0
##$ASSFAC= 0
##$ASSFACI= 0
##$ASSFACX= 0
##$ASSWID= 0
##$AUNMP= <proc_1d>
##$AZFE= 0.1
##$AZFW= 0.1
##$BCFW= 1
##$BC_mod= 2
##$BYTORDP= 1
##$COROFFS= 0
##$CY= 11.3945322036743
##$DATMOD= 1
##$DC= 2
##$DFILT= <>
##$DTYPP= 0
##$F1P= 2.36226072786647
##$F2P= -0.459571619588291
##$FCOR= 0.5
##$FTSIZE= 0
##$FT_mod= 4
##$GAMMA= 1
##$GB= 0.15
##$INTBC= 1
##$INTSCL= 1
##$ISEN= 128
##$LB= 0.24
##$LEV0= 0
##$LPBIN= 0
##$MAXI= 10000
##$MC2= 0
##$MEAN= 0
##$ME_mod= 0
##$MI= 1.114404
##$NCOEF= 0
##$NC_proc= 0
##$NLEV= 6
##$NOISF1= 3.799351
##$NOISF2= 2.8
##$NSP= 1
##$NTH_PI= 0
##$NZP= 0
##$OFFSET= 15.70392
##$PC= 1
##$PHC0= -15860.56
##$PHC1= -2.3992
##$PH_mod= 1
##$PKNL= yes
##$PPARMOD= 0
##$PSCAL= 0
##$PSIGN= 0
##$REVERSE= no
##$SF= 200.130013532006
##$SI= 16384
##$SIGF1= 3
##$SIGF2= 2
##$SINO= 400
##$SIOLD= 16384
##$SREGLST= <1H.CDCl3>
##$SSB= 0
##$STSI= 0
##$STSR= 0
##$SW_p= 3612.71676300578
##$SYMM= 0
##$S_DEV= 0
##$TDeff= 0
##$TDoff= 0
##$TI= <>
##$TILT= no
##$TM1= 0
##$TM2= 0
##$TOPLEV= 0
##$USERP1= <user>
##$USERP2= <user>
##$USERP3= <user>
##$USERP4= <user>
##$USERP5= <user>
##$WDW= 1
##$XDIM= 8192
##$YMAX_p= 0
##$YMIN_p= 0
$$ End of Bruker specific parameters
$$ ---------------------------------
##NTUPLES= NMR FID
##VAR_NAME=  TIME,          FID/REAL,        FID/IMAG
##SYMBOL=    X,             R,               I
##VAR_TYPE=  INDEPENDENT,   DEPENDENT,       DEPENDENT
##VAR_FORM=  AFFN,          ASDF,            ASDF
##VAR_DIM=   8192,          8192,            8192
##UNITS=     SECONDS,       ARBITRARY UNITS, ARBITRARY UNITS
##FACTOR=    0.0002768,     1,               1
##FIRST=     0,             0,               0
##LAST=      2.2672688,     0,               0
##MIN=       0,             -201661,         0
##MAX=       2.2672688,     154917,          0
$$ Real data points
##PAGE= N=1
##DATA TABLE= (X++(R..R)), XYDATA
$$ [...]
1636B06j71q8K52r1KL7q0j5k56K48J00n2k32Q9pN2l2L3q6N6J29l24J67J8j09J68
1662A4o0j07J30k71K32j14L40j02l28K19K81j35j57K42m69L87j99R5n4J24j22
1683e4l10K79L16k51p1K78k4K5J25m47K50j82J39O9m14N2J57nO4J81j64n0N2L0
1707D5k84P1J78R1k3j33j9q8K45l70K42r1K84k59J39L45j54k31J7K10n8l50N15
1730C22k56j37J86l6k92J46J66L4r9j11NO8j61J93ro2J77j30O1j64J02J4j92n0
1754b25R9N0J19k4q4J76J55l60k7R8K0J99l53K90l43l9M64K5k07R8k65L14k42
1777f2M7K68k00l3o7R9m0K20k20J33q5j02mK94M3m16P1pl9o8M07K4r3n9q5J91
1803B17k06q2K0L4P4k6j13j03K71j95L47k33P3k82J61jm4J81j26M8J02j71L73
$$ y = [206, 35, -53, 199, 108, 110, 147, 67, 52, -204, 44, 144, 92, -140, -51, -58, -6, -38, -5, -91, -35, 94, -230, -63, -45, -154, 14, -46, -153, -23, -294, -62, -176, 164, 62, -266, -47, 234, 99, -58, 184, -285, 102, -97, -2, -56, 68, -54, -364, -85, 231, -20, -91, 187, 163, 188, 313, -134, 116, -66, 73, 142, -272, -220, -63, -68, -4, 177, 13, -37, 15, 45, -239, -168, 10, 101, 78, -55, -74, -162, 83, -287, -45, -136, 148, -111, 28, 373, 219, -12, 5, 215, 157, -193, 322, 66, -71, 115, 79, -213, -67, 99, 133, 34, -77, -72, -4, -165, 28, 19, -43, 134, 4, 65, -99, 3, 17, -175, -225, -126, -76, 43, 19, -65, 111, 266, -94, -121, -23, -3, 196, -157, 133, -210, -249, 215, 240, 33, 131, -134, 180, -62, -15, 253, 53, 20, -47, 52, 12, 232, 12, 145, 60, -42, -46, 248, 291, -125, -54, -61, -100, -168, 239, 263, 170, 111, 26, 217, 11, -71, -51, -17, 57, 31, -82, -185, 86, -109, 238, 5, 78, -204, -43, -44, -88, 93, -33, 15, 117, -54, 319]
1826C19k31k26L8K03k00K57j66J7j08O7K04k58J64k65J61oJ24k10L06j09n6J5
1848D0j7P5j99L51j28k86L61k17qO0j7R0p0L2o1k7n8J13p1k05J98N9k8J17j04
1873@m0j5P3O1m9R5Mk42j6R4k2N5pK29j41j69L3L5K25j93oq4L76n25K86J10Or7
1901G6l08K39JJ85k41N3P4K2N6j15j80O9K70j46l04N00l34K37j99M4J41l06K62
1924I6o4j87Q8j18J04k51K10L6K37n1k45nR1Q4K69j17k03R3j14j0N6o2J61j49
1948e1J85k86L12J16o9r1j52j42K50Qk25L40k84j41L23r4J29j48K76k30J02J18
1970B46k37j19K33j59M4k19L14K9M0j82Q6P8q8k26J57L8J30j17J7N4k89K29R7
1993A56j14k34K67jp4j9J62l02J62Kj54J87P8l2J10lj54l19J35J60J71m19K36
$$ y = [319, 88, -138, -100, 103, -97, 160, -6, 11, -97, -30, 174, -84, 80, -185, -24, -30, 94, -116, 190, 81, 25, 40, 23, 98, -101, 250, 122, -164, 197, -20, -28, 32, 15, 105, 35, 67, 6, -21, -79, 34, -37, -242, -44, 15, -13, 104, 0, -40, -55, 18, 79, 30, 125, 129, -113, -129, -35, -57, -2, -9, 220, 79, -90, -57, -22, 203, 10, 4, -80, 296, -229, 57, 167, 173, 76, -232, 7, 8, 193, -48, 5, 79, 101, 157, 42, -138, -69, 201, 55, -249, 251, -83, 154, -45, -1, 140, -166, 96, 32, -155, -67, -185, -81, -332, -122, -86, 151, 100, -145, -150, -59, 25, 294, 177, -26, 67, -47, -57, -1, -63, 98, -51, 134, -152, 160, 276, 207, 116, -36, -178, 72, 80, -145, 195, -89, -230, 93, -1, 128, -20, 256, 26, 128, 246, 9, -110, 123, -36, 8, -211, 103, 132, 172, -10, 76, 154, 66, -160, -3, 35, 165, 48, 65, 119, -170, 59, 156, 42, -192, 75, 74, 0, -19, 143, -159, 3, 5, -149, 38, 116, 84, 194, 191, 37, -282, -147, 13, 184, -235, 1]
2016Aj8J75J21j91n5n4l3qL4J82k23J78j05l3J84j33J4Ro9J65k82P6J78k82J25
2041d4llj7N8j7j7O6O0j84J29j81L04k35J53qO2j51J77j49j31K05J54m10J94J52
2066A64p8m14J51L7P0J49Q8k55J54J01mN5k22r9M1J94l11J68L1r0J71l7j97K8
2090a05J29l2j24K51j56N3N5K2j22O2J15j95O8k8O1m4K8N2j73K43J61k77k58R4
2114a20J19R0o5j62K41p9q2J51j32L96k62o3P6l64L54q2q5k2r4N7J49m9J07r8
2138a9P3J9p3j83J17J42Pj85L36m59Q5O9K61j24p4mj97L39j39j26Q4N8J33M6j19
2163F7p3J06j18p0m8L78j12o5J00q8j00m8m0J89J9j69MJ20pK4lp6Q9L0j38M7j55
2190a37M10k99J16J5j27NR7j76L8j41K8q8L68k10J72o5O6rk15J0L9Lp4K41J1l2
$$ y = [1, -17, 158, 279, 88, 33, -21, -54, -62, -28, 154, -69, 109, 4, -29, 155, 22, 36, 45, -24, 141, -141, -65, 113, -169, -44, -47, -50, -67, -9, -26, -43, 23, 83, -101, 28, -153, 151, -84, 69, 61, 123, -28, 149, 0, -131, 74, 228, -182, 12, 164, 86, -328, -177, -140, -70, 79, 167, -88, 66, 167, 163, 218, -4, -103, -62, 132, -179, -11, 20, -70, 101, 64, -133, -105, 24, -8, -132, 119, -37, 16, 71, 93, -29, 33, 148, -47, 21, -7, 54, 10, 38, 90, -83, 160, 321, 44, -214, -120, -1, 89, 24, -138, 103, 24, -58, 93, -39, 357, 95, 32, 108, -256, 98, 16, -69, -91, -185, -128, 21, -28, 79, -19, 54, 73, 0, -183, -66, 76, 83, -102, 234, -225, -140, -71, 190, 66, -8, -12, -209, 130, -9, -135, -51, 7, 140, 186, 67, -6, 100, -18, -88, -136, 242, 130, 65, 165, 77, -23, -71, -111, 78, 97, -72, -68, 52, 45, 69, 66, -10, 79, 109, -29, 18, -137, 273, -26, 90, 105, -22, -17, 80, -96, -58, -199, -171, -259, 109, -101, 71, 6, 72, 63, -152, -142, -103, -100, -174, 67, 78, 46]
2216D6P0j67k6K61l66K10L25k59j77J30m25M73J33m24J17J70q4J13k45r4L27Q1
2238A89j86p4j39J37R6mJ15p8M8p9lM6P9j96J5K65l94K13P0J6N1j62j65K0k7K86
2264A39j33J75r0l08K92J86n20L53L7k20J57L3j84L45m58K55j49J27J8j30N9n3
2286f9j9K72j5k19j23j1Q4K20kq2j89K60j61J3J79k63K23l8J01j45J99n5l81K59
2310C8J9k04K91l50K47K7lK76k67m8r0p5J52J16j77jpJ00J57m20R4J23j46J77
2334B9k46L54n5j60qP4J13k68K67j25j33L9J3M7L2j02J03O5o9M2p0jJ30m4k0r5
2360h8K58m09K84J24j66q2J19j91J54j47R8J02q3p1l3K85j82J10j74K23k77K89
2382A43q4L0j76k3J47N0q7j64K8J49J85j61j45J98l5K8m5J82j62r5K44l26k2K63
$$ y = [46, 116, -51, -77, 184, -182, 28, 353, 94, -83, 47, -378, 95, 228, -196, -79, 91, 7, 120, -125, -219, 108, 189, 3, -71, -210, -73, 23, 19, 134, 56, 104, 25, 22, 68, 147, -49, -34, 231, -163, 50, 120, 136, 187, 25, -140, -120, -147, 139, 6, 181, 91, -217, 75, 261, -259, 94, 131, -89, 68, 101, -83, 262, -196, 59, -90, 37, 55, -75, -16, -69, -88, 184, 169, -50, -173, -184, -100, 120, 118, 36, -153, 107, -54, -41, 138, -125, 98, 60, 161, 16, 215, 160, -221, 38, 57, -147, 144, -206, 41, 68, 65, 341, 74, 26, -64, -139, 13, 129, -48, -49, -56, 44, 201, -219, -125, -2, -148, 29, -217, 137, 82, -78, -86, -12, 101, -167, 100, -25, -158, -119, -106, -59, -27, -129, -26, 39, -30, 12, -58, -59, 71, 27, 7, -88, 170, -239, 45, 169, 3, -79, 40, -151, 3, -144, -46, 56, -27, -98, -131, 154, -28, 82, -92, 131, -146, 143, 59, 89, -87, -110, 37, 87, 0, -164, -136, 13, 198, 37, -108, 90, 55, 83, 38, 220, 58, -37, 207, -119, -141, 122]
2406A22K69m51m4O8M4o3Q4O1q6M2j93j0K61j06kn6o1l1qm3K28Q2j19J80l34K60
2432I4m33M19k31K00j45J20n6l6j56J64J18R6l22j2K24q0K60l28J12q2q8M8J10
2455dp1J40k30K44j18J65k3n0O2jj50J09l33J44l5K6J98o2OL3P0k5j01N5J21l3
2481A37J06j62j99N1J70l27Q1J19L0k09L25o6q9K8J9k13M73l42J29J22n5l06J91
2504A3P8r6j52J80M7j1j52r3J53o9%KK9n2k30M96k11Q0n9j99J71J32Q9j83k30
2529b67L43j7k40J0J61J46l06O9K01L9j20Jo5mO0K4j50p0j06L13K0j05J26Jj85
2554a21J48J11k08M4J77k38J90q6n9k9l9j22K26J92j33n7J75k44N1R7L6Q7p4j96
2578g2k08K84l20N52l20Q0Q3mk27K04q3p2K42j42P9o2P5j26j77M0J16j93M27j64
$$ y = [122, 391, -60, -104, -36, 8, -55, 29, 90, 4, 46, -147, -157, 104, -2, -4, -60, -121, -152, -160, -203, 25, 107, -12, 168, -166, 94, -339, 80, -151, 49, -96, 24, -32, -68, -224, -60, 58, 154, -168, -180, 44, -36, 224, -104, 8, -74, -162, -114, -4, -75, 65, -165, 79, -39, 126, 103, 53, 115, 114, -36, 73, -260, -116, -151, -125, 73, 11, 17, 50, 120, 95, -6, 49, 170, 137, 243, 81, -118, -67, 103, -224, -143, -24, 6, -203, 122, 56, -33, -5, 14, -199, 274, -68, 61, 183, 128, -178, 13, 91, -5, -157, 23, 70, 59, -93, -186, -33, -102, -102, -100, -71, -123, -353, 143, -68, 12, -47, -246, -75, 57, 146, -37, -267, 76, 59, -181, -171, -10, 136, -170, -101, 100, 139, 19, 20, -45, -49, 11, 35, -115, -185, -291, 22, 42, -63, 63, 64, -121, 27, 138, -70, -26, 151, -87, 103, 17, -42, -71, -110, -232, -6, 186, 53, -4, 171, -73, -22, 75, 111, 198, 124, -72, -280, 4, -316, 236, -84, -4, 79, 75, -152, 52, -31, -103, 139, -3, 76, 14, 89, -37, -214, -174, -58, -251, 176, 12]
2602A2J8oN8j55J40j52m0Q5J86J12j66j57J41J8l32j16L42j86K46K1j84lJ85J58
2626B25k48m4K79k12j01J54o3J98J64k44m8l4l54K90K24m89M32k80K12L3Q7r7
2648H4L4K02n93K73J20k31K34J11k08m2r5K07j8k56J60L3p1K01M8m46J99m8R2
2671a0O8l37J58J27O4L8M9j25j27J92j18oJ00J98n2q3k19j9Q3j3J1n1K01m26Q1
2696b16L97k62j4Q3L4k54P9K38k66J20MO3J73k46k14L53k0o7M9K8P6M6j70J13
2720A27j89j1j43J62r8Q0Q3J92j75l6K5K7q5J17P3l92K34k21K89P2p3k7Q3r3J7
2745C8k04J47k07J54p2k7K46r4N4R5k16J54m7m0O0Q4N8r3lj32J49j04l24M31l60
2770b53J63j02R0M03j71j22J27o7j48Q8O3j11j37R3J2L58j13j22Q4J46j07k16
$$ y = [12, 30, 24, 82, -73, 67, -85, -125, -40, 146, 258, 92, -65, 76, 94, -238, -354, -12, -198, 48, 69, -115, -118, 67, 225, -23, -67, 212, 0, -101, 53, -10, 188, 352, 108, 60, 26, -328, -38, 186, -303, 129, -151, 61, 94, 181, 84, 118, 320, -273, 0, 120, -111, 123, 234, 26, -16, -111, 96, 78, -178, -18, 15, -56, 145, 193, -253, -54, -102, -10, 58, -279, -121, 6, 70, 108, 157, 32, -95, 97, -21, -27, 73, 271, 219, 136, -83, -102, -19, -32, -21, -72, 129, -297, -216, 181, -81, -95, -12, 22, -232, -153, 85, -181, -61, -57, 6, 179, -67, -281, 72, 52, -15, 34, 62, 138, 184, 14, 127, -62, -73, -216, -54, -152, -72, 11, 203, 28, -8, 17, 44, -41, 76, 149, -243, -9, -230, 59, 131, 58, 31, 114, 21, 38, -166, -19, -226, -72, -144, -171, 75, -19, 35, 130, -86, 68, 21, -19, 41, 125, 183, 90, 87, -45, 104, 0, -324, 107, -253, -90, -192, -102, 301, 130, 8, 135, 68, -80, 8, 71, -40, -177, -84, -72, 286, 173, 51, 135, 281, 174, -42]
2792d2N5j75J77P7L4n1j6k42JmL07l96L21P8R2m41L33N5P9m9k70J55l9J34k42
2817f9J85j27j42N7j03L27n5O3N9j49m2jpj84J50L4J07r4L9n2r8o7R9j8J50N7
2843A19J4k06K24k07J47j69J31k29j8L90j93j06p1K70J27j19nJ09j69n0R6P0k01
2866d6m4q0L12j45R2l24J88J11J79k51K57l29J22L8nm4O4j10J55k27J64j54J05
2889B8M8k17K76j01n8l5K2j76K27lq0K8J04k99J62j54L14N0l41L49j12N0k11J67
2913C8j72L42j52k6j07p5J62L1j07K09P6l17K2k50L91j8J62l23K18j65m6J05n
2936gQ2j34r3Q6j03J51K07k23L8q9p2J72Rk4m3q9L24l5L2m2k38J70n2m3J18k23
2962a21J80N4j31k2J69j88R1j53J78O3j87k2J03J68j91K0j8o8J94k00J40N6j86
$$ y = [-42, 13, -162, 15, 92, 126, 75, 59, -183, -182, -186, 121, -275, 46, 124, 216, -225, 108, 163, 242, 193, -77, 78, 39, 173, -69, 116, -11, -153, -96, -199, 128, 73, 136, 195, 46, 4, 3, -4, -188, -38, -4, 103, 9, 48, -4, -102, -169, -70, -88, 62, 119, 133, -73, 151, -56, 91, -78, 53, -176, -194, 196, 3, -103, -174, 96, 223, 104, 99, 208, 39, -11, 85, 155, -46, -90, -170, 142, -3, 89, -235, -47, 64, 243, -8, 249, -80, 42, 80, 75, 31, 95, -15, 140, -87, 77, -77, 28, 76, -141, 135, 34, -24, -59, -37, -213, 14, 11, -69, -41, 63, -236, -74, -228, 86, 136, -205, 144, 32, 82, -129, 38, -134, 208, 56, 30, -77, -152, 10, 41, -66, 143, 219, -98, -76, -326, 65, 47, 209, -114, 104, -61, -107, -2, -7, 75, -59, -152, -66, -169, -18, 189, -34, 4, -85, -157, 15, 24, 0, -43, -132, 192, 157, 189, 147, -91, 79, 27, -16, 102, -121, 59, 113, -18, -40, 129, -59, 32, -121, 57, 120, -67, -89, 14, 182, -9, 11, -7, -75, 119, -81, 59, 115, -71]
2985g1n3K61j72J76m0j42J3n3J41m6k6l09M00m0p5j74J52K2%M2j72J55K9j7J15
3010A16o8J7j52J22J16k0r5k29M21l36R2j05L1j61L95J5O7r7j56M8L7j33N2J01
3034G8j70J73r8k0k0N5R1j91j02N2Q8K46k89j1L09j98M0k98L42j26N6l4K32k66
3058f1j5l76L49K12k84oJ46j35K4L4j80J47k51M67n2j20K7L08j32j49M7J69j11
3081E8j78j1K33J66m10J45L24m57J98j92L9J31m7K82l92%k62M19r0J32o4j37J15
3104Bm0L48k60J0J24j08j73J68j08L4lj07J24j74k5j56K65j08K17j18j7J47k25
3127a83K14m5p2J86k1j06J24J38qk66q2L27J6j56j09k49L38J2j47k01J41K87j56
3150a8o2J68r9J26o6j41K44k53J58q0J91k09J20l4j8j15J96K1k12R7j8m7M8k32
$$ y = [-71, -124, 137, -35, 141, 101, -41, -28, -81, 60, 14, -12, -321, 79, 39, -36, -210, -58, -36, -36, 6, -166, -11, 18, 1, 116, 48, 65, -87, 35, 151, 131, 36, -193, 228, -108, -16, -121, -90, -251, 144, 159, 226, 129, -27, 21, 58, -75, -23, 78, -92, 81, -17, -37, -57, -2, 89, -102, -204, -152, -64, 182, -107, -118, 191, -7, 33, -265, 77, -49, 7, -27, 205, -61, -76, -452, -103, 109, -175, -181, -35, -170, -146, -112, -292, -145, -396, 71, 19, -101, -74, 234, 102, -47, 0, 169, 58, -120, -131, 102, 268, -142, 3, 327, -130, 68, -124, -85, 46, -1, 281, -111, -111, -373, 46, -44, 88, 24, -113, 2, -38, 310, 50, 60, 184, 76, -97, 71, -37, -3, -6, -113, 11, -163, -188, -344, -79, -187, 30, -88, -105, 42, -183, 31, -14, -86, 100, 79, -27, 97, 235, 227, -39, -121, 206, 222, 66, -43, -292, 46, 58, -89, -290, -149, 138, -18, -80, 88, -11, 115, 49, -92, 152, -101, 57, -23, 168, -41, 79, 45, 27, -88, 108, 129, -83, 14, -4, -51, -3, -235]
3174b35J47O7k0J28jL5J04k29K4j28K4J66j28K4q5k91L89J86k70Q7P6j14J19r
3198F6N6p6j26K54k39R5L7l51J25L64m36J46J47l16M22m4q2O9m8N2J5r8L2N9j58
3223c5N6j18R8J99L7m53J51J11L1j09J38P6l27Q0r6P5J15k8o5K48k60J1k62M64
3247A37q1j66J62j75M2J04N7o2j35K75n1J18k36P7j47J32P6o8O5N7k6k22L58l24
3271c3j06K30m1J8L8m1o5M1m2J19j83m7K14j66R7J94j49j28K3j11R3J4j22O0O7
3296b6K63k10m8J09m1m2j28J76l97M21P3k91K69j39J03J4j60J47k18Rp1L14k23
3319i6O2J14NJ86p9n7J16k50P6j16K24j45j00J63p0j34L50m0j93K45l80K1j38
3342b36j2K83K40j80O3J82m44j15L05k5j24J98l09K04N0p5J92j21j2m7j38J60
$$ y = [-235, -88, -21, -41, 87, 86, 121, 225, -4, 20, -108, -84, 82, -46, -22, -107, -398, -9, 177, -93, -6, 70, -44, 75, 66, 122, 46, -80, 174, -65, 30, 67, -284, -159, 205, -231, -85, 62, -254, 168, 124, 42, 111, 63, 115, 130, 32, 64, 123, -35, 21, -97, 1, 200, 237, -216, -65, 46, 77, -32, 106, 182, -145, -65, -161, -86, 29, 1, -64, 184, -76, -65, -327, 137, 56, -110, 52, -123, -81, 23, 80, 18, -117, 158, 107, 225, -11, 66, -81, 51, 127, 59, 124, 181, 155, -67, 291, -33, -139, 91, 50, 68, 106, 65, 0, 41, -1, 118, -65, -112, 102, -64, 33, 227, 78, -50, -27, -138, -45, -31, -153, -93, -26, 237, 27, -21, 88, 47, 5, -123, 53, -344, 77, 150, -141, 128, -11, 92, 106, -54, 93, -125, -116, -187, 127, -96, -34, 80, 85, 271, 192, 135, 251, 1, 77, -39, 185, 40, -60, 103, 33, -101, 249, 209, 16, 261, -119, -98, -236, -248, 35, 275, 95, 158, 340, -104, -219, 86, 61, -63, 135, -174, 30, 80, 5, 197, 76, 64, 17, -121, 39]
3364C9M6j72J77r3L0l65L80m7j26K0J98O0M1j82j18J54j42L30k76J17l39J13J23
3387c2J49j76J85Qk62J06j1R1l0j02q9j43J33M6NNQ7N2k55J71K19j83N8k06J87
3412A3m6J12j54l71K55J2oK06j03J72k50K2J32l6M5J25r5J45j93K35k52L6J66
3435A70n27M31j66N9m3K03rn2j26J13k02L31m84K55K72l90L1J70J32k18J61j55
3457d4J29j38K28k16m9j6o7L12k76L1O3Q9J0m1j27K03l12K46k6O9m6O6j7j33L30
3482B68k57RL6J33k94L4M0K46k81J31j21J73n1mJ25l84J36j72O9J24O8k4J72l6
3506A40r0j0j73J80J58m23L65j20K40m93L41k01Q6J19K8l55J78K11k38J41J14
3527A98o3k51Q6oJ05K6j54P2j80L67k00M9K04l27K44k30N3N2k30O5NM7L0R9Q9
$$ y = [39, 85, -87, 90, -3, 27, -338, 42, -5, -131, -111, 87, 147, 188, 6, -112, 42, -100, 230, -46, 71, -268, -155, -32, 117, -59, 126, 134, -128, -22, -33, 58, 28, -74, -163, -306, -173, -127, -122, -117, -30, 22, -233, -62, 157, -26, 32, -174, 13, -33, 79, -75, -446, -191, -179, -185, 21, -82, 90, -160, -138, -6, -42, 3, 128, 33, 178, -15, 220, -32, 4, 170, -357, 74, -92, -33, -76, 127, 118, 66, -60, 53, -149, 182, -302, -47, 225, -165, -134, 36, 168, -50, 111, -44, 85, -53, 175, -41, -90, -106, -173, 139, -137, -106, -43, 46, 56, 15, -112, 91, -221, 25, -1, 68, 22, 88, 71, -62, 268, 11, 20, 56, 189, -105, -71, -31, 215, -66, 65, -56, 117, 66, 62, 187, -197, -61, -233, -164, -40, 28, 4, 176, 140, 50, 40, -133, 47, 205, -218, 147, 27, 267, -226, 115, -86, 0, 119, 147, -208, -30, 181, -57, 84, 198, 135, -116, -30, -36, 69, 95, -59, 13, -167, 200, 0, 49, 253, -74, 170, -60, -7, 45, -185, -120, -115, -68, -38, 61, 150]
3552A50j04J0j74O4O6j21j8J05n0j10J34P8q6L45k13j22R5m4J06k33L23m32J64
3575f7p1J67K3j58J34M2J7m9j05L85M6l93Q2j59J13Nq0O0J83k29l0p6L02m03K19
3600d2O5j75K28J96j66J38k93mj21l9MJ57J76l42K37O6Ol9j24j00J53O8j00O4
3624A3M2J36r2p2l8L92l55P2k35r4K58q0k1K16j10J86j68k46J75J62k97J48J3
3647EK5K8l0j71L45k27J80l4j44j64R1J65j02q5M0mp8R9L8K17L0k95l42M62j45
3672i6O8K10k89R3J45q2m2J1J13m8l4K9o2l9Q0j13l1R5q8L8J10N5k64Qp6J2K21
3699B4K41m54L23k71J41L1P6j29P3J35p7J34k44r2J22K1mK8o0J12k65J72K8j66
3723a01J38L9P2j47P4j36K11n7l18K74k49K97M4j09o2O6r4M4rM5k7nN7n3J3p2
$$ y = [150, 46, 56, -118, -54, 12, -109, -127, -22, -72, -182, -48, 30, -56, 289, 76, -46, 49, 5, 111, -122, 201, -231, -67, -138, 29, 52, -106, 28, 70, 87, 38, -67, 318, 364, -29, 53, -106, 7, 12, -68, -8, 175, -54, -84, -160, 142, -261, -42, 23, -152, 76, 272, 106, 244, -49, -53, -174, -213, -209, -52, 124, -218, 19, 85, 91, 52, -72, -172, -19, 49, -51, 13, 55, 191, 99, 27, -11, 381, 26, 98, -137, -231, 27, -53, -74, 142, 32, 218, 50, -196, -21, 141, -156, -8, 5, 30, 58, 28, -143, 202, -25, 155, 121, -23, -187, -96, 69, -33, -118, -78, -82, -160, -61, -23, 194, 224, -71, -413, 49, -96, -28, 182, -107, -14, 131, 49, 7, 18, 131, 83, 49, 78, 16, -23, 57, -56, -87, 8, -80, -42, 68, 123, -141, -133, -209, -197, 24, 265, -189, 134, -137, 4, 35, 111, -18, 55, 190, 113, 247, 3, -89, 33, 54, 50, 78, 18, 130, -135, 37, 65, -101, 37, 76, 148, 1, 75, -61, 150, 93, -225, 49, -200, 97, 141, 32, -30, 36, -58, -14, -23, 22, -5, -10, 47, -6, 7, -65]
3749f5K85l46jj51N92m35K3J9l36M94J0m7k38Q0P2J93k04M84m41KL5Q0O0j68J72
3774A69k8j52L17l34J17n5p8K02m8j49K50k54J1j42K41O1o6R0k77L98l60K32j78
3797c3RjK53j98M4r0k2Lj03K95qk92J6K3J38j9N0j80j39L52j00r4o6K33K48j36
3823A83k31n0K09j43o4oL17l97K78J0k4j76P2jk92J84K20m6r1R6J3L3j87l4L70
3848B43l31J94j32j96L13j03K5Rr5O3r9pJ60K09l41K5K24O3k37p4l8M1J87L3j27
3873Ij21K09j47K0J08l00L72l0O7k66P2J56l20K32j36O5k59L40m5k3mj12K62l79
3897b30K76J74p7l13J81k59K76J85q9j6k31Q6l25N49k13k2k66N26l49J51q9K2
3919e3K29m66L66Rj51J1p8j2K87N6r4j19q4K44k07O7k93L37m5K46k22j48j83K8
$$ y = [-65, 220, -126, -127, -278, 314, -121, -98, -79, -415, 79, 89, 42, -196, -116, -44, 149, -55, 429, -12, -10, 25, 105, 165, -3, 169, 141, -11, 306, -28, 89, 34, -44, 158, 110, -39, 211, -43, -32, -174, 67, 128, 62, 152, -125, 273, -87, 145, -33, -24, -25, 228, 30, 74, -16, -38, -35, -138, 157, 149, -143, -127, -104, 34, 15, 65, -115, -254, 98, -2, -96, -162, 71, 319, 183, -48, -98, 111, -32, -96, -102, 215, -182, 96, 106, 82, -94, -22, -23, -315, -131, 89, 43, -48, 48, 61, 94, -93, -127, 243, -88, 106, -26, -222, 91, -12, 13, 22, -73, -10, -109, -116, 44, 253, -88, -63, 161, 224, -13, -87, -125, -84, 103, 136, 9, -112, 97, -50, -30, 78, -222, 150, 120, 187, -79, -7, 149, -171, 61, -75, -10, -269, 71, 26, 3, -1, -113, 149, -230, 46, 220, 143, -170, 11, -248, 28, 213, 124, 108, -123, -37, -362, 187, -26, -48, -314, 212, -137, 14, -75, -53, 176, -290, 76, 85, -66, -55, -133, -145, 142, 198, 104, -15, -99, 145, -62, 5, -288, 49, 4, 250, 28, -120, -303, -275]
3943b75N34l07J05L4L9k30K50j17k98J24K04J42k5m22J61P7o7r9K9k1J46j3J6
3966a3J90p1j94J3J4Rj5m0J30J35j87K94q2k72J68j10Q3n5P2l4J50l06K26m5K53
3991C13j37j47O9%j99N9R7j08J54r6K92m56K50k51K24j61J2J70N3j66k65J81J86
4014G4k63K38r3J98k51o4M37l09K40q1j15q3j0J51P8j20K2J85l26K00m4j1j02
4037d9P7k8N9l60L70q5j26K58p2j49O9N8J9Q7j47J36k41J78n6J61l55J64j32M51
4061B87m27L1K51j06M4j9J80k74Q6n9P1n0l6M9m9J01j56L24m7l12J92p4p1m4K28
4086A20n4k1M2M9p1o7J06l45J09K42n6N7l38K31k20L29k8j12M0k7j40k0N8J72
4110E6J39k11J5o6K09r8J26k16j17M52n02M04j44J17k28j33J23M9Q9k68R5pP0
$$ y = [-275, 259, -48, 57, 91, 130, -100, 150, 33, -265, -141, 63, 205, 180, -242, -81, -4, -71, -170, -141, -162, -16, -29, -13, 177, 106, -88, -75, -61, -52, -67, -107, 23, 158, -29, 265, 183, -89, 79, -31, 52, -3, 69, 35, 185, -121, 105, 60, 313, 176, 29, 98, 98, -101, -42, 55, -53, 101, 5, 297, -159, 91, -160, 64, -97, -85, 85, 138, -28, -293, -112, 74, -189, 49, -44, 154, -97, -161, 276, -33, 207, 126, 11, -72, -82, 69, 147, 27, 49, 234, -92, 108, 64, 53, -49, 28, 0, 59, -301, 69, -16, -142, 116, 44, -105, -36, 22, 41, 128, -19, 117, -124, 54, -2, 159, -196, -32, -164, 287, -140, -109, 142, 36, 80, 61, 241, -33, 53, -6, 65, 15, -21, 28, -21, 80, -76, 248, 201, -111, 81, 7, -64, -108, 120, 66, 45, 87, 136, 65, -2, 104, -241, -132, 110, 54, 111, -227, 4, -216, 113, 85, -27, 13, -14, -154, -174, -116, 56, 195, -16, -1, -67, 142, 44, 170, -46, -163, 289, -213, 191, 47, 164, -64, -197, -74, -25, 64, -204, -109, -116, -46]
4133d6K11j59L5n3j56O6j47J86L14k41J64O6k40J58k63o5j8K43N5j96J6Q9p7K51
4157A93k03j53K03P2r6K1j76J66j89K22q6k37K41l14L12K40l8k62o6J36Q5J89
4179B60k06j8p8K49k63O8M2n5J43l17Q6k7L14k21J51R1l73J50l0K25l38O5K21
4202A39l34r7L78Qj10QKM8N1J1N7j18J32o1m4l26L69j83J99o0J87k41J21j02o0
4227b6P9ok45K44J3J50J20m04l5R8m7k67K45n1J05J19k19J68Nk30K84k79M94l91
4251g6K1M5R3o1OJ49l8k8l57K94O5P5J12j83j33pK22k09J90n5p1p1l9m1R7k06
4277b06Q3J26J01Lq4K2J1j0N5J18l27J30J34M7k06N1o3p8j8P6J54k4j13J11j96
4302a03M7j25R2O5j33K50j71J0p1J19J4k1J35J09l55P1%j31o4L90k14K81k42J64
$$ y = [-46, 165, 6, 41, -12, -168, -102, -249, -63, 251, 10, 174, 240, 0, 158, -105, -170, -188, 55, 110, -86, -70, 19, -58, 193, -10, -163, 40, 112, 16, 37, -139, 27, -162, 60, -26, -263, -22, -336, -24, 216, 178, -84, -150, -14, 71, 260, 54, 36, -42, 207, -56, 12, 54, -1, 142, -175, -89, -116, 198, -23, 128, 219, -154, -4, -34, 191, -147, -82, 139, -195, -292, 86, 94, -16, -8, -6, 42, 93, 104, 161, 43, 175, 114, 70, -256, 113, -70, 129, 69, 256, 15, 136, 34, -26, 53, 47, -198, 46, 59, 209, 329, -75, -110, -12, -59, -326, -81, -132, -27, 92, -127, 41, 46, -184, 100, -179, 315, -76, -55, -10, 83, 22, 28, 177, 139, 111, -246, 48, 113, 188, 300, 117, -16, -23, 199, -10, 180, 125, 54, -17, -56, -97, 0, -206, -123, 3, 104, 107, 23, 45, 56, 46, 101, 219, -108, 22, 156, 203, -3, 48, -15, -93, -111, -35, 119, 95, -18, 93, -103, -56, -181, -89, -24, -157, 93, -78, -68, -139, -20, -6, -27, 108, 217, -138, -67, -67, -198, -262, 128, -86, 195, -47, 117]
4326A17o6j6J83l84OJ38Q7j00%kr4K6LK12k21Kl9K35o6J03l97K93J04k76J09O6
4352B3PK40k28j8J1j14J82j68J33K18k19J03j15j11K93j23O3l18K25nl1j40l6
4375a28K6N9K16j53J65j00j75J29Oj19M0k2R3q4M2oO3j3j61n1J57n7q7J26M8J06
4401A20j80j17N6M0k02L58p2J40q4m1k4R8r8p1j44J2L54n7l4j19K52l31M04j73
4425H7J19k46L2oj91J23J74K2l5m3r9K25j78R8q2O5M3l85K29K93k61N3J41j89
4449a1L5p5O2J11q6J7l01K20K35m22M2J72j16M9J7N1J6j55K60N5N6k62jJ22M4
4474A35j55J27j45q0R5j07R0l9M5J7j51K86j15r5J07K44k08j30o4K48o5o2j55
4497a77J63k02L36l1k02J18M1q4Q5j05J73j92J39N5R2j2j27j07Jq9J46L3j16K85
$$ y = [117, 51, 35, 218, -166, -160, -22, 65, -35, -35, -37, -131, -105, -102, 110, -111, -109, -148, 87, 21, 124, -273, 20, 124, -152, -43, 23, 30, 270, 42, 24, 35, -79, 103, -65, 68, 286, 67, 170, 55, -56, 237, 114, 177, -141, 84, 79, 48, -92, -128, -102, -43, 173, 20, 185, 85, -90, 39, 45, -74, -34, -56, 37, -47, -5, -11, 52, 39, -122, -173, -16, -73, -160, -34, 14, 120, -60, -177, -121, -81, -283, 75, 3, 143, 59, 18, -6, 92, -6, -77, -221, -209, 145, 88, 54, -65, 187, -144, 260, 87, 206, -40, -8, -14, -205, -82, 92, 114, 79, 36, -63, 162, -16, 82, 0, 65, 108, -277, -48, 245, -16, 37, 178, -11, 24, -51, 11, 122, 36, 53, -248, -28, 207, -215, -173, -1, -117, -68, -51, 0, 16, -139, 121, 176, 232, -30, -31, 91, 135, -20, 107, -38, -118, -23, -130, -40, -79, -34, -17, -168, 118, 3, -92, 15, 259, 51, -79, -143, 105, 40, -22, -177, -14, -216, 120, 89, -113, 5, 46, -38, 47, -58, 115, -77, 62, 117, 209, 197, 70, -37, -36, -125, 21, 54, -62, 223]
4521B23k65l5K01K4k34R0K6j71m3R3kl1K21l05K83k05L61j8k21N0K8k74P3j27
4545b58K05K19j42J7N5r3r1J52J06l51K42j37J30j21k73L99M6j75%O7o1L3J3J51
4569A33j43j95J88K02j87p2R5Q8l2q2N6l36J24R6j51M79l25k4K49q6N1j3l6J65
4593B44k66K46k60J65l05L00Oj58J0MJ8J55l00j69L84r8l8J15Lon1j06J27Q3j29
4618b6L0j09J35j02J05ro2l8K34l87L07J89k52l50M60j83j33L76r9k21J45Qk1
4641cJ18l4L0l8N3k07k5R6R4J50o4j82QK6j15R0J3j51P5M4K18j14J10k35J01l1
4667B7L6J0j54K44J82n06K99l17M60k97N8k68J01J51j95O4q0Q2L21Ll76Q8K26
4690A59j61R6o2j3j39Q7l7K99j12k61L3J30l8JN8j85J35K7j10Q6q0J77l9j67J21
$$ y = [223, -42, -77, 124, 148, -86, 4, 30, -141, -184, -91, -93, -124, 97, -208, 75, -130, 231, 213, -8, 42, 70, -204, -131, -258, -53, 166, 24, 41, 96, 3, -88, 64, 170, -181, 61, -76, 54, -67, -340, 59, 105, -70, -70, -3, -64, -31, -18, 133, -10, -205, -17, 185, -2, -74, 21, 109, 77, -5, 51, -285, -161, -65, -216, 263, -62, -86, 163, 77, 128, 115, 79, 244, -22, 224, -36, 129, -176, 124, 130, -28, -18, -14, 4, 159, -141, -310, 74, -24, -62, 53, 56, 50, -1, -107, 20, 103, -26, 4, -105, 30, -72, 33, 24, -38, -76, 158, -229, 78, 267, 15, -335, 125, -58, -191, 185, 86, -135, 10, 18, -3, 115, 81, 111, 73, 126, -81, -106, -10, 84, 234, 170, -12, -4, 22, -93, -3, 10, -141, -66, -22, 196, 82, 192, -43, 58, 27, 63, 73, -81, 163, 345, -161, 138, -179, 281, -16, 42, -226, -125, 26, -169, -105, -185, -103, 218, 221, -155, -67, 159, -2, 94, 32, 19, -120, -33, -70, 229, 117, -144, -111, 19, -19, -18, 40, -145, -10, 17, -93, -7, -87, 90, 51, -116, 5]
4715Ej7q7J00l3O3j19k01Q5L5P1k6K08k97L18j41j38L75p0k01J35R3k12K29k77
4739a02J77J02q2j90L46l10rl8J72J65j91j61J71l0P4M6p0J50l80P8K90j88j88
4762a68K54k17J63j73J01j38K63k66K08R5k35R2J01q1Q4Q8k77j50K63L8q5L9n
4785fj24pK30j7j55Qj1r4K34q9lQ1j68K5K99k4p9p4j9L10k31J05j38j25J01N7
4811H6mP0j46J8J14o8L0r2Q0k35K95k50J01J07k57K04J07p0qk7k1q5M2J8L4k44
4837b01J97J04m9j26Q3J41j25j50M0K82l6j15J40k22l7j53Q7K8R1M89o55K42J1
4860F6K57m88J28J89j22j88n4R0R1j77K50q2KL48n37J63k5K19j29Q1k70J92K6
4883C0j62J68k15K73j43M0p8n3K66r4M1p1L7lO6k3Pj96J29l5J07J68j90K56n46
$$ y = [5, -12, -99, 1, -32, 31, -88, -289, -204, -169, -98, -124, 84, -213, 105, -36, -174, 201, 131, -70, 65, 158, -54, 175, -102, 75, 177, 95, -95, 251, -59, -68, -106, 66, 231, 40, -121, 50, 20, 94, 140, 70, 220, -160, -82, 208, 20, -168, 86, -131, 32, -141, -40, -178, 85, -181, 27, 122, -113, -21, 80, -1, 83, 171, -106, -256, 7, 45, -40, -1, -6, -130, -137, 93, 76, -79, -71, -82, -176, 58, -31, -34, 47, -121, -96, 203, 179, 100, 26, 7, 317, 86, 191, 53, -72, 29, 86, 82, 152, 6, 24, 138, 70, 100, 8, 88, -147, 148, -102, -1, 106, -151, 53, 160, 90, 82, 55, 34, -51, -9, 9, 43, -201, -4, 100, 51, -75, 8, 149, 24, -126, -86, 196, 160, 45, 185, -37, -74, -227, -140, -112, -21, 468, -187, 55, 66, 323, -165, -37, 152, 30, -158, -212, -122, -31, -208, 42, -40, -38, 310, -227, -64, -89, 130, 1, 82, -188, 4, 30, -132, 36, -179, 94, -49, -9, -87, -140, 126, 32, 73, 2, 39, 36, 102, 79, 86, -110, 19, -16, 91, 259, 69, 325, -221]
4908b21J55J32j35J77j60Rm2j09J85N6J49o6j53j21J37J84k28j05P0J79j06j7
4930c0k23K68o3L35l93J99J44l82L14k4k23J04l8N5k82N42k46k90L40k11N2l0
4952h2NJ77J83n01L78m13M08r4k48K58p2r3J88j1j48O6n6k20K88p2O9j66KL33
4976A79j70l4k28J06K60k57K17j44j00L52R8j47j38l9K18l0j35p3K28k90M8o9
4998a48Q1M0n3M4j83K55M9l5k04L00J64k36J28k80K67k69K07q3k7n8J89r8j92
5021a42K01K48k89J25j82q7J88o4M7qj0j21j2Jj16K04J19j14q8LJ84k9O7j55n1
5046h1K62n8r2J43k56l9L1Q3N2P7k26K01p9k75J51J79j19j04K41j50Q3k74K89
5069C9j83q4N7K75O5j47j19q3N1K21k80J70J23j38o7K39k3j77q8OL37j23R1j00
$$ y = [-221, -66, 66, -69, 108, -52, -43, -85, -194, -9, 47, 196, 130, -23, -144, -7, 177, -51, -156, -86, 93, -13, -30, -253, 15, -48, 287, -106, 93, 237, -145, 169, 145, -78, 26, -12, 43, -239, 303, 57, -233, 107, -104, -52, -82, -77, 100, 283, -218, 160, -253, 155, 61, -187, 71, -1, -94, 94, 83, -65, 1, -55, -275, 13, -59, 10, -156, -154, 179, 9, -25, -253, -147, 113, -144, 73, -71, -171, 181, 279, 132, -6, -45, 173, 143, 8, -65, 163, -127, -79, -148, -67, -27, -80, -36, -219, 36, 85, 50, -154, 146, 310, 74, 202, -78, 189, -80, 127, 44, 17, -41, 148, 50, -142, 59, 307, 18, 143, -39, -126, 62, -2, 45, 37, 27, -94, -106, -105, -221, -17, 102, -12, -100, -97, 87, 58, 125, -30, -81, 181, 123, 31, 174, -82, -121, -90, -7, 45, 122, -104, 97, 18, -257, -106, 73, -46, -150, 91, -59, 24, -250, 39, -144, -228, -171, 104, 169, 22, -97, -180, -129, 92, -188, -18, 105, -33, -100, 139, 116, -61, -149, -143, 194, 71, 162, 62]
5093F2J73k41J5O9J01j70N0P4k65M5JK56j55J72k25J23J30l76O9K57j16j51K9
5116g3M4P1r2N3N7K6j60J88l0q9p4K48j99M4nm5J90P0j2j29k01O6o8L29k56J9
5142b8J09P8p5l19J19k07K54oJ59k39M86k22J89n1k74Rl90N85j59J38r0j83N8
5165e9k7K15j40j06n7K09J44n5ok04L49k53r2j42K02j66J18K54l02J43M3j37J73
5188A04j57N3L76k82K19m59Q7q2K64j39L9l7o6J64J0l0l03L11j77K09l12N5J6
5211a37K72q6J31j27q2J33K1r7J30n66M46l0K8l9r8R7j40J71m6Q1r6j59K35l2
5235A0K2K1k21K71q2J31o9p5rR5p7Q8k30J71j64J61j60o9K27QK00p3l35J6K25
5260H2j70J30jj38j14K50N4K11l48j73L09k05j39L29M1l08Q8K1J76n2j03L29l17
$$ y = [62, 235, -6, 9, 78, 179, 9, 59, 133, -132, -87, -86, 170, 15, 187, -38, 85, 215, -161, -92, 165, 49, -102, -73, -29, 42, -50, 3, 60, 86, -74, 114, 84, -5, -79, 169, -30, 14, 9, -36, 154, 224, 212, 83, -118, -52, -120, 209, -47, -28, 81, 159, 84, -235, -116, -323, -69, -75, 84, -155, 331, 109, 298, 247, -27, -18, -408, 177, 18, 156, 66, -117, -59, -86, 129, -11, -117, -174, 35, 179, 124, 118, -86, 263, 10, -82, -224, -22, -188, -70, 184, -118, 25, 68, -69, 104, -53, 0, 376, 94, 313, -146, -59, -141, 123, -16, 23, -14, -80, 84, 94, 64, -239, 72, -105, 104, -208, -153, -137, 135, 49, 180, 53, -29, 104, 125, 28, 158, -408, 38, 8, 36, -3, -101, -4, -144, 27, -19, 62, -34, -193, 42, 10, 32, 53, -168, 103, 21, 152, 83, 8, -1, 94, 17, 105, -125, 46, -118, 43, -117, -186, 41, 49, 249, 176, -159, -143, 82, -88, 42, 41, -97, -211, 39, 93, 304, -44, -217, 92, -113, -252, 77, 118, -190, -102, -81, 95, 43, -60, 269, -48]
5283d8PJ10kk32K48k2p7n9j06K57k99N6L05Oj50j3o7n8J62p9J09o1j16L07M6j5
5309B09k14j73K90j80J25L6j84O4NL5j27J11L3J82kl33j65M85O2k82J6L7j07J07
5333C0Kj78J4J67J0j18J91j19r5r9L81k27mJ58k43J81o2K68j47j79J9J11Q5k46
5357a00LJ39o4l6J09J1P9j18M0Q5k19l6J77o9J32j59j73R4R9J13k09j03O02m33
5381c6M5l69L43J02j58J32L6KJ58l51l0l7k7L60k59j9O4k19K50j15L18j30r8J35
5405I7J3j66O0O4J00j67J3M6j85K14k16J10J6K30q4j03j26Q4J26j10LN7l16M28
5429A88j98P0j33K73m34M5J54K02j14j01P6j53K6J10R4%l81K26J26n6J57j50o0
5452c3J13O0m08L86r8o9j31P0K57j31p6J05l06J17J93J52l98J44K05o1n1J12k07
$$ y = [-48, -41, 69, 67, -165, 83, 61, -16, -75, -181, 76, -223, -167, 138, 144, -6, -19, -86, -144, 18, -61, 48, -13, -129, 178, 224, 209, -5, -178, 112, -68, 57, 93, -91, -27, -22, 13, -114, -3, 30, 212, 210, -123, -288, 197, 259, -23, -7, 30, -77, 30, 32, -146, -132, 35, 45, -73, 118, -1, -96, -195, 186, -41, -45, 113, -130, 51, -11, 257, 110, -69, -50, 61, 146, -100, -97, 42, -22, -58, 51, 62, 141, 23, 63, 148, -71, -107, 70, 1, 133, -26, -199, -105, -6, 107, -102, -205, 397, -36, 9, -360, -17, 85, -73, 59, 95, 97, 255, -96, -126, -163, -190, 170, -89, -108, -44, -263, -13, -128, 190, 60, -38, 97, 110, -56, 4, 68, 168, 1, 14, 60, -125, 89, -127, -17, -1, 229, 145, 42, -84, 0, 126, 16, 19, 76, -240, 188, -10, 60, -73, 200, -234, -189, -35, 167, 53, -48, 28, -125, -99, 11, 105, 105, -276, -50, 76, 20, 177, 27, -33, 80, 140, -268, 118, 20, -49, -180, -110, 147, 16, -60, 45, -261, -144, 49, 201, -197, -53, 152, 91, 40, 152, -55]
5475e5Q9j8ol8K47j33j98K99j29o8j51P1L30j39l7k8p6N7k5k40K61K7Q3n6K4j00
5501iJ82l43K57M6j65J1j72K87J3l8j03N7j28J48j55oJ99j14K6O8k10P1n6J08
5525b6J00j35J94J0J87n22K26J62J10l79j28m3L32J41n4l3r9o1n0K0o2j3R9Q5
5549F1l51L72j10R5r2J75m68M71j05j74K09j59O9J61q1k32K69m4j12n6J56K08
5571B62k62R0j93k0R8J46j27J6K56l18M8J93l20L82k92K08m28K88o2R2p3r9J01
5594a4M3J27j45M8K53j58nr9j31J80o1k1r7m1K30j1K13l40pj45J80j98N63k92
5618G2p6K3J00r9R5n8j01J56k62NL72k25m5J48o6j24O1K46k26p6m8J5J80J26p8
5643A15Q7r1rj2Oj44K73k92j28M79j07Q8j91Ll54L7J22l1m9N1J02n9M6K05n5l2
$$ y = [-55, 34, 16, 10, -28, 219, 86, -112, 187, 58, -10, -161, -90, 240, 101, 64, 36, -40, 17, -8, -248, 13, 40, 123, 67, 91, -9, 173, -170, 87, 133, -32, -21, -193, 94, 107, 69, -34, 23, -105, 43, -112, -118, 81, -33, -7, 61, -149, -78, -134, -26, 74, -61, 133, 143, 330, -192, 34, 196, 306, -73, -201, -244, 88, 229, 175, 142, 43, -18, -68, -48, -110, -123, -24, 61, -290, 82, -28, 67, -25, 150, -318, 153, 48, -126, 83, -76, -7, 154, 73, -159, 110, 66, -46, -102, 54, 262, 0, 90, -103, -123, -25, 121, -6, 10, 266, -52, -4, 189, -131, 251, -41, 167, -261, 27, -35, 57, -16, -115, -14, 29, 156, 11, 59, 312, 154, 149, 50, -81, 99, 38, 17, -80, -121, 109, 98, 311, -29, -36, -181, -1, -199, 364, 72, -4, 19, 119, 20, 115, 57, -44, 112, -150, -145, 227, 2, -43, 105, 39, -85, -24, 222, -4, -80, -128, -113, 67, 193, 115, 202, 111, 102, 90, 96, -48, 225, -67, -195, 284, 177, 265, 74, 77, -277, -240, -118, -149, -198, -147, -45, -104, -58, 147, 92, 60]
5669F0k12k1J67J21k6l06K01J50k96r9M42k91J30l37M15mj7k08K88l4K8j53k13
5692b15L20k77J43R5l8k05n0J90K5j21K75n1k00P6J41j15l28J73J41K0R3J03m26
5715b31K05M2o2J6O4J46k34l5K01K53k18j77j33O2L56j86R0J66q0l49J87R7k60
5738h0L3R9L1j36j4J03p0N4k50J84k4R8k53K25j38J27L0r8L01L3j19j74L0j21
5762a29Q7j41N6J08K17j62q4J72j42J25j57l1j2J30m6O2j83J67p7K63k49O9K1
5785F4j38K08k65J52k24R4J40m7j1j8J60J1r4k5j86J73o6J72j22p6K3O6j58p4
5809b41K67Q7k4l7k11J19J11Q1n14N32r4n6J7R6Nj54L7Kj77J15j74J11J40p4j21
5834a57K18k3Q5j58j00j6J29K55O3k83Q5J53l79J23R2J83p37O26j45J0k05J42
$$ y = [60, -152, -173, -6, 115, 89, -217, -16, 134, -162, -261, 181, -110, 20, -317, 98, 94, 77, -131, 157, 123, 151, -2, -215, 105, -172, -29, 66, 28, -177, -227, -37, -12, -133, 142, 91, -109, -33, 108, -7, -335, -162, -21, -1, 92, 195, -231, -26, 16, -46, -30, 34, 180, -54, -89, 112, 365, 147, -30, -163, -101, 255, 69, 159, 325, 245, -104, 83, 180, -80, -47, 52, 83, -53, -67, 36, -34, 20, -230, -46, -70, 28, -225, 0, -138, -11, 19, -79, 222, 255, 136, -38, -8, -129, -42, -183, -127, -19, 198, 36, -48, 124, -18, 107, -50, -81, -93, 37, -9, 53, -130, 37, -40, 223, -26, 43, 64, -74, 134, -131, 21, -203, -109, 31, -16, -27, -45, 115, 126, 32, 7, -179, -6, -72, 100, -22, -98, -75, -9, -167, -241, 26, 113, 89, 52, -159, -40, 71, 152, -362, 170, 76, 20, 37, 133, 138, -16, 21, 23, -154, -39, -213, -102, 38, -36, -157, 61, 38, 123, -35, -135, -151, -22, 233, 296, 13, 98, 251, -128, -5, 87, 270, -467, 159, 14, 24, -181, -39]
5856c9J30J17J9k02j7k9O9k25K34l64L29j26O8L3M6j86N4J86Lp3j87J56P0J53
5880B19k8K8l28O2J4J28rn0R7q2o4J04j63J03J00j66m8K03l01J68J28j02J12j95
5904g0n9q1L36j55J03j29K2K10j07M0r1J47j46j42RK3o1j0L71k73J53j29q5J13
5928a1J11j67J32k1k09K2J22OO3l97L39Q8j01P8J24P1l49J20j74M1J26k63J58
5951i1l9J30J61j53K06j35j23J02j59O6LK14j29P9q5j73Q2K59l27J61n7J15j89
5974h2K12j52KPj81J50K0L16l51N7l2r6j10N2K29j28K2q5J18j20R4j74L01jP6
5999A44l26K80Q9l20K21K52l31p7J50jj14r3M48n08M39o7m1r2k31K57l2m4k03
6022b00P7K82l48K58n2o1J45k45n1L62j19O6p2j31J93j58J43J62k74R5r8l0K19
$$ y = [-39, 91, 208, 227, 25, 8, -21, 48, -177, 57, -307, 22, -104, -36, -3, 43, -143, -89, 97, 100, 27, -160, -4, 66, 219, 191, 219, -109, -47, -33, 95, 86, 36, 133, 51, -13, 91, -72, 31, 131, -35, -83, 120, -181, -13, 115, 13, 125, -70, -129, -210, 126, -29, 74, -55, -33, 177, 70, 110, 19, 166, 20, -122, -113, -90, -151, -161, 210, -63, 90, -39, -124, -11, 100, -67, 65, 44, -165, -143, -21, -15, 48, -349, -10, 78, -23, 55, 179, 250, -99, 21, -153, -112, 14, -249, -91, -130, 0, 161, 8, 214, 79, -44, 58, -101, -35, -32, 182, 53, 132, 47, -126, -44, 215, -112, 49, -8, 107, -82, 130, -22, -20, -13, -194, -44, -24, 292, -59, -2, -34, -130, -240, -188, 41, -87, -65, -150, -32, -152, -58, -232, 69, 68, 144, -182, 98, 187, -133, 88, 340, 9, -68, 82, 81, -33, -126, 322, -186, 253, 186, 145, 53, -178, 79, 47, 3, -200, -123, 159, -189, 69, 17, -44, 101, -144, -195, 167, 48, 114, 42, -89, 104, -54, 89, 251, -23, 72, -26, -56, 163]
6045A63no3q1O4j49J79j71J11L18k20l79K16j15J59j40q7n5L68k30L05k44J5J20
6068G9k01J51J06q4j64R6K00O4o5pl09M6K00j02l1J18k04J50j18K27N7k15K6p0
6092e0p4L2J5J34Q9l51J13L7J33l4j80k8R3J21Q1j65R1Q7R1l99M4o9K15n9J36
6117A03q5Jp6P0K70l5k62R9l26K08L6j30J97j54p5K09P9J88j26j76J37k2l22N2
6141a40K33j99K20j32p2R2q6P6J93J32Rk25J23l22L88m4r4j13O0r0r6J57K12j50
6165A32k28J75R7j68o6L77n21L36k92k4L04j81N2J31p5qJ3j25P1n5J4m2L2k3K59
6190A85l34O0N34n76J98p0J1Nj2l8K66N9k80p2m3j03K67Ml03l3L27k15N2J52j45
6215a04J17M9q5P5j06j09J83m3J13l8J33k41O0J73k87N7l6K3J93q1q1Q3p8K3K5
$$ y = [163, 158, 95, 14, 78, -71, 108, -63, 48, 366, 146, -233, -17, -132, 27, -113, -200, -255, 113, -117, 188, -56, -41, 79, -122, 29, 135, 51, -113, -17, 183, 247, 182, 175, -134, -88, 112, 10, -21, 97, -107, 43, -75, 152, 209, -6, 20, -50, -124, -92, -77, 57, 146, -205, -92, -55, 78, 44, -136, -164, -71, 50, 131, -34, 57, 144, 235, -164, -120, -189, 26, -33, 103, 18, 19, -57, 13, 283, 248, -14, 85, -241, -33, 3, -127, 70, -84, -159, 50, 129, 317, 191, 15, 152, 130, -192, -140, 93, -106, 114, -18, -90, 2, -84, -8, 185, 317, 326, 101, 224, -98, 290, 246, 152, 39, 99, 9, -87, 70, 282, 132, -96, 79, 176, 8, -58, 319, -202, 134, -158, -182, 122, -59, -7, 124, 49, 41, 54, -71, 0, -55, -41, -83, -51, -74, 185, -149, -89, 445, -131, 67, -3, 8, 13, 1, -37, 229, 288, 8, -64, -107, -210, 57, 61, -242, -275, 52, -163, -111, 41, -104, 13, 62, -23, 52, -54, -163, 20, -23, 90, 52, 185, -56, 4, 177, -110, -53, -89, -66, 127, 46, -35, 48, -30, -7, 18]
6240A8J5L2M4j4M8o0j24J54j54N0l26L5M51k44J73n2q0K1J29l2j15j27K96k93
6264a55L49r1l9J02k31m0J87j92K33l48K07O7j82J53O0j89J30M7J3k23M1P8j62
6287a85J58j16K7M9R4jk04K21J58k72k3J82jKj41o6Q3j09j10K42k8J79N1k88q9
6312a87J09J84j01R7j36P1j37J22P5k17K42k27O7n3K24j60j04L06k31K42k32Q2
6334C6Q5j28J6Q7J8j26j80J19Q0J38O1k78p1J47K16j80k46J84O7%p8J10L31m48
6358d0l3O3K2q4J18k00L36M8j83j29K55k85J77P4j42m3K03j94j12L12j83mQ1k0
6382C7k9M22o36K67j76J73k00L24J66m21qpJ27r3nJ89l34K45p4L60l49P5k12l4
6406a93L16J41l01O4o6%K92o6k28R4j51J37M8j82J97j81J48r9j5k26L02jJ0r7
$$ y = [18, 33, 65, 109, 95, 143, 83, -41, 113, -41, 9, -317, -282, 169, -75, 98, 46, -34, -13, 116, 84, -31, -158, 138, -155, 194, 103, 64, 166, -65, -105, 82, -110, 123, -225, -18, 49, -133, 20, 80, -109, 21, 68, 81, -142, -101, -23, -185, -27, -143, -116, -67, 27, 26, -178, 43, 201, -71, -94, 88, 87, 89, -52, -118, -35, -144, -254, -12, -40, 139, 190, -98, -187, -78, 106, 5, 102, -34, 37, -100, 22, 97, -120, 122, -105, -38, -91, 133, -27, -131, 175, -56, 186, -46, 36, 121, -7, 9, 96, 114, -12, -192, -73, 7, 145, 206, -72, -143, 4, 220, 40, -206, -22, 45, 45, -33, 77, 408, -40, -73, -10, 12, -72, 46, -154, 182, 230, 47, -82, 173, -112, 65, 139, -3, -46, 157, -37, -149, 163, -20, -24, 57, 37, 8, 430, -206, 61, -115, 58, -142, 182, 348, -73, -81, -88, 39, -54, -59, 130, -204, 41, -33, 327, -22, 53, -159, -193, 123, 264, -37, 27, -39, -39, 253, 187, -41, 53, -98, 39, 87, -95, 102, -79, 69, -30, -45, -271, 31, 30, 40, -57]
6430e7J9L2R7r0J00J53l01J16o8O3R1j37o2J11N5k32K44k78K11j05j91K50J08
6453A29M5k84L34Qm25K76J18n2k39K17r0j09K03N0j42j79J96j03p5J16o7J61k0
6476F8m0K16k75J24j85L40l66kK64l48K26j51K10j88K41K8j54O9N8p4l0j54M1
6499h2L9N2l3J65j54j24L2J19J49n4l6j16l9j14M9Q8j64N3J56J37j11kOM5j90
6524a29J7nJ28Kn5R3p2K33l51K53j35J54k89K20j53J50J36k91n1R2j30P9k5J45
6548A6J07j28J03r2m3n8J51k64K46P8p5m6r1J68J57j86K1l05K01R3O7k9k18n1
6572a78K55p4Nj03j11O7J55l9k16K87Ok07K05j14O1K17m9j00R3R4j65r8K77k23
6596D5p8O8J77q8j14LK2K24k48m4k30K47K7M1M16m71J11k02j7J86K0O9j20N0M5
$$ y = [-57, -38, -6, 91, 1, 101, 254, -47, 69, 1, 64, 155, 18, -44, 67, 122, -110, 134, -144, 67, -38, -229, 21, 129, 174, -110, 224, 232, -193, 83, 201, 149, -90, 127, 37, -72, 131, 181, 39, -140, 56, -47, -122, -6, -73, 88, 68, 28, 244, -31, 93, -92, 248, -118, -120, 144, -204, 22, -129, 81, -107, 134, 162, 8, 77, 135, 61, 31, -123, -82, -43, 9, -24, 141, -13, -137, -105, 14, 163, 109, 73, -43, -82, -196, -147, -59, -223, -170, -14, 123, 12, 10, 16, 61, -129, -112, -117, 11, 13, -42, 51, -21, 212, -139, 114, -21, 133, -156, 64, -89, 61, 197, -94, -145, -53, -183, -104, -129, 16, 123, -5, 98, 6, -37, -95, 56, -208, 38, 116, 41, -5, -96, 72, 229, 43, 64, -241, -40, 53, 120, 91, -127, -178, 77, 3, 8, -95, -206, -139, 16, -23, -239, 48, 54, -153, 52, -62, -1, 216, 167, 67, 160, 254, 89, -9, 268, 45, -33, 35, 212, 124, 10, 13, 35, 259, 11, -33, -263, -16, 11, 52, 468, -3, 108, -94, -111, 75, 95, 164, 44, 94, 139]
6621A39k19J40L9m0j29J23r2J56J15j5j57j31M5J6P4j10J37k72O0J0J96j01j26
6644a42K10K7q5J78j08l1N2m6j0m3pk3L13k13K35l19L4k6j42q7L06j60r6K28J3
6669E8m5R5K81o27l8Q2K57j5j08K99k21l5k39N07k20l07J11K57j37q6J79n1Q1
6692G8n5J93j60N3o8m2j7N2k0j88J43R0j14M2J84k49o6L02j05J4N8m01K98j41
6716a19J2J59j43L20l58k6K97k04O3L32l50K8J49l29L93k48K0j24M4L03m64K92
6738D7k16J30j55L57p2j01O5j66K52j30Jj9R9k16J32J5l03M08l3K8k40q0j33M01
6762G1Q5k15R6J09l23L21J29l46Q1j43J25J6M5J57j84R6J00k39j79K47k4j72K92
6785A45j20m5P7l99M68q9k8J18k67J90o5K50k43j9j53J35K7P1p0K7j75J08j56
$$ y = [139, -80, 60, 99, 59, -70, 53, -39, 117, 232, 217, 60, -71, -26, -10, 64, -46, 91, -181, -121, -111, 85, -16, -142, 68, 95, 10, 188, 80, 49, 101, 55, 45, 2, -5, -28, 285, 72, 307, -12, 22, -4, -146, -233, 73, -87, -183, 45, 58, 13, 108, 389, -238, -276, -194, 63, 48, -60, 239, 18, -17, -256, 251, 31, -276, -165, 92, -45, -131, 48, -3, 78, 23, 216, 56, 109, 41, -1, -18, 34, 14, -174, -31, 59, -55, -13, 171, -78, -144, 158, 53, 67, 125, -276, 22, -119, -107, 52, -91, 229, -129, -155, 142, -62, 1, 333, -17, 11, 160, -169, 224, -24, -4, -128, -84, 219, -245, 47, -169, -39, -194, 163, 91, -10, 55, -111, 141, 11, 12, -7, 92, -124, 8, 23, -280, 128, 95, 123, -117, -197, -330, 71, 156, -59, 37, 146, -177, 144, 273, -73, 8, -135, -10, 6, 51, 208, 24, 120, 220, -19, -198, 49, 25, -147, 145, 25, -20, 57, -342, 126, 37, 9, 127, -140, 50, -15, 235, -8, -27, -180, -45, -18, 53, -17, 10, -165, -57, -213]
6808b13J89J18j50L13n30K53k0o4L8k6Q0k7q2J39l1j68Q1J58k52P3J74J57k22
6831a2J89j88Q8k83K64J89k75P1J15l80K76Kp7J02j93L2J06j07J1R1J42o1k21
6854a19L6J43j05LP8K1j1l1k7k2K38l46K46k13O7K30k02n1O1r1K14n9K06j08p7
6879H1j56J22RL7m33M18k22R6L2L1O5j74J6K08k12R9Mn4M3J4j0J24j08J73m29
6904b26J51J66k33J43J8o9J16P6m9l5j89K58k38K28p2J10p5j2j71N0q6R5j28J31
6928d1K29k94J58K5j94J83J45k76LQ8j84N2J41K93j52l2k15L0p5K88m09J19J46
6951B8k5M6p4N7j33J06J20k08J87l5j27J25k2j87L13q3m8j82K88k6k17J20k26
6974b03K41j80J30N7k68M27m26K36J55J6j53j98J99J58j52j55R9j5j04r5K25n9
$$ y = [-213, -24, 94, -56, 257, -273, -20, -40, -104, -66, -92, -12, -39, -121, 18, -13, -181, -100, 58, -194, -121, 53, 210, -12, 177, -11, 77, -206, 58, 247, -28, 43, 158, -222, 54, 56, -21, 81, -112, -80, 26, -81, -70, 21, 163, 102, -119, -83, 60, -45, -42, 36, 57, 46, 15, -12, -34, 204, -142, 104, -109, -42, 188, -14, -65, -4, -95, 119, 60, 266, 158, 81, -75, 47, 56, 93, -340, 78, -144, -48, -16, 15, 80, -94, -78, 130, -82, 17, 21, -33, 10, 24, 14, 138, 30, 203, -226, -75, 91, -142, 1, 19, -50, 66, 142, 93, 58, -131, 127, -111, 117, 45, 155, 80, 68, -103, -53, -139, -44, -172, -41, 188, -106, 52, 77, -117, 66, 211, -65, -62, 26, -158, -106, 35, 328, 176, 144, -71, -41, -116, 172, -237, -118, 28, 3, 49, -25, 32, -101, 5, 125, -83, 104, 69, -58, 67, 45, -142, 171, 88, 40, -142, 146, 120, -97, 23, -203, 38, -142, -12, 45, -223, 204, -222, 14, 169, 185, 32, -166, 33, 191, 39, -116, -17, -32, -136, -231, -6, -65]
6996f5Nm4J48Oj62K66o7J05J67l16j08N5Q8p8J56k10J10J10j04l26M39j45Q7k94
7020a77R2J15o9K38k52p9R2Q5k49M62k84K7o8O7K04k90j2n4J16q6pO3J20O9j6
7045A07m1l65L56j04j76L25l26K84M2k64J01M08m90j87M04J7j41j91J13L70l65
7066a23J99j71K8J5p5L9K02n4k01rK59l43J58R9k25J55P4o9O1oM6l8m4j1O9K24
7092B59j08O5m55K31j45L68k89P4M8R0j56K2Q4n0p0J05P1KK7m7K1k32J98l5l30
7117b52KK89j48l3J81K3O1L9l63K60j22q3J18K05j54j8N9M1k31R3L80m50J18j
7141A4r6M9m7o4O7J50j77J29N8l11J73M3kk50K43J30k69L49k92J98l07L80k40
7164g2J11J0N8r4P6L5j34j04p0K47k00NQ6J10r2p6J05k0l3k01L79n7N3k8p6K30
$$ y = [-65, -60, -104, 44, 50, -112, 154, 87, 192, 359, 43, -65, -10, 78, 0, 156, -54, 56, 166, 62, -264, 175, 30, 117, -177, -85, 30, -39, 199, -53, -132, -40, 45, -204, 258, -26, 1, -67, 0, 204, -86, -98, -152, -36, -122, -129, -66, 54, 123, 107, 66, -299, 57, -47, -223, 102, -224, 60, 102, -162, -61, 347, -143, -330, 74, 91, -50, -241, -128, 242, -123, 76, -95, -67, -52, -127, -88, 114, 60, -141, -150, 109, -234, -76, 23, -202, -47, 27, -42, 19, 13, 59, 21, -23, -34, 35, 259, 151, 216, -239, -8, -153, 215, -74, 0, 48, 138, -18, 4, 88, 38, -32, 73, 144, 146, 173, 126, 147, -85, 113, 78, -252, -250, 39, -109, -142, 39, 62, 123, 162, -201, 59, -63, -146, -28, 177, 23, 5, 64, 105, -126, -33, 347, -103, 15, 14, -82, -33, -80, -144, -77, 73, -104, 25, 83, -228, -55, -12, -14, -264, -21, 109, -160, 189, -103, 95, -212, 168, -72, 39, 49, 107, 13, 89, 124, -10, -114, -184, 63, -137, -132, -46, 64, -28, -104, 1, -19, -52, -253, 126, 69, 122, 94, 18, 248]
7190B48l53J74J94k44J00l70J04K21J90l9K6j35j57K58j37k82K46n2J89l55K02
7211B8K01l60P7P7j9Rm1j51K17Nk16J02J6J6l7J45j79K27j02K8j5n5k48M11J40
7236B76p2l8k95K75k9m19K63N2p6J09J11k50K69m54J43Q1J0j13j34J93J22L16
7258C40l44j09M4N8l%l4k22K46J15j50J12J2jM6r7K48k65J26j51K0Q5j14r9J03
7283c4O8k6j2P5N1%r8O6J94l48K08k47q9K48j19j31L92o7K0j55j47QK88k99l6
7308a90J35K1O4K32l39O4j76R0M8J34M7n4mp3J20j80J79J7J48k57j47K56J84k15
7332A04l43J88L15rj66P1j92J13J21k22O1k5J00q0J4k4K6kj61K09j77J4K27k61
7356i9K73j58n9N1K06l69L45j89kON4q0k0p5k00K42k2q2J10jk31L16j8J34M8j75
$$ y = [248, -105, 69, 263, 19, 119, -251, -147, 74, 264, 225, 251, 116, -41, 217, 80, -202, 44, -8, 181, -174, 28, 229, -131, -54, 23, 4, 13, -28, -179, 38, 43, -173, -71, -55, -39, -76, 69, -110, 117, 15, 43, 28, -27, -275, 136, 276, 204, 166, -129, 146, 117, -302, -39, 13, -63, 46, 157, -93, 176, -278, -135, -54, -44, -157, -291, -98, 24, 340, -4, -113, -69, -11, -14, -14, -48, -270, -24, 91, -59, 53, 65, 64, 110, 13, 261, -4, 122, -29, -9, 76, -38, -137, -34, 34, 8, -4, 71, 122, 122, 24, 90, 284, -64, 144, -103, -192, 56, -63, -194, 198, 131, 151, -4, -151, -143, 145, -154, -190, -55, -34, 30, 262, -77, -13, -189, -99, -51, 83, 130, 76, 72, -1, 119, -61, 118, 135, 283, 26, -121, 135, 319, 104, -239, -51, 264, 255, 89, 160, -32, 81, 202, -20, 41, 16, 116, 36, 50, 26, 52, 50, -111, 98, -79, -65, 162, -99, 174, 16, -43, 8, 214, -155, 190, 1, -1, 5, 59, -21, -41, -116, -316, -74, -96, -178, -68, -69, -300, 16, -2, 132, 180, 5]
7382EK5nm0o2O2J29J36l28o7K50r3K13k00m0J98k03P9r4k1J03J42k16J74j50j0
7407a3J6j06J08p2J16l3j8N0o6j91K06P8k9k80K50K10n68J64L09k83J84J7j34
7430h5J76j11m4J23P1k40M9LMM16l00L9p8J10l98K00N5j74K20o4j41K52j17j9
7454e3J62R1k55k1q8J13j41K84j21j76M07k61q4n3L00O9l6k64K0O2K52k86J42
7477F3l5R1j68k48L77Kl46K84K56m17J2R8L99k67k6j31O8j77L92k72J5l7K64n3
7501A44j56J06r9L7kJ87k77j09L27l65M07om46M00o2o4P2l7%J26l26J06J52j39
7525b4M6k9J89k92L34m7j77L4k42J54n5K80l8k57pK7Rj26K01M8NK5j45rK56l59
7551a99K88j98K86j92Jj54K59Pl5k44K38r7k2J13k2mqo0k08L20n3m9Q6j17j46
$$ y = [5, 30, 25, -15, -77, -15, 114, 250, -78, -145, 105, 12, 225, 25, -15, 183, -20, 59, -35, -56, 47, 189, -27, 147, -3, -13, 3, -103, 5, -67, 49, 16, -2, 48, -18, -209, -3, 75, 46, -234, 16, 226, -342, -178, 131, -152, 32, 49, -85, 91, -20, -64, 59, 130, -110, -61, -58, -54, 362, 62, 101, 23, 133, -265, -65, -10, -184, 36, -28, -169, 83, -34, -53, 109, 200, -55, -76, -164, -51, -192, 92, -29, -205, 202, -59, -143, -196, 104, 173, 137, -127, -107, -45, 207, -79, 63, 28, 119, -49, -297, 80, 82, -264, 20, 276, -141, -129, -31, 368, 101, 75, -56, 12, -165, 227, -45, -30, -67, 197, 144, -12, 94, -5, 32, 30, 217, -60, -169, 158, -207, 200, 194, -252, 148, 86, 22, 94, 57, 57, 183, -143, -37, 115, -24, 22, -7, 182, -110, 224, 177, 0, 34, -208, -54, -109, 171, 133, -124, -131, -104, -95, -221, -20, 28, 33, 58, -87, -96, 160, -199, 89, -109, 177, -15, -14, -168, 91, 98, 63, -181, 57, -40, -62, 51, 29, 25, 17, -43, -251, 69, 16, -33, 53, -64, -210]
7576b10K95o3j45k50M96j37r5J08r1K68j78O7j56K06Pq7o2J10k8n0k14J95Jn2
7600f5R4n6M5j30J38n1K87m77K22M9o7r2K76l60P4R9J22J1J18m56K35k4L7M9o7
7625A1l7k07K47J76k2l94M05j70j00J87l15J77J26M2j65J75j91k8K40k03J60J1
7647A25q2P1m2P1j28K0k86M42j96r6J03J78m6l62J37J47j75K08K9J06l95n9J92
7670c8K8J95l40K86k61K12j9j56o3J41P5n6J7l6K22k58L3lJ05l66M25J17m46J26
7694f0N2J2J26k90K08p7K9j30j10M29l43L54j01j70k4K52l8j31J1P6J5j06m8K06
7718A42k37J73K02l30K01k92J70Rk32L26l40J82j92J71j71lm6L91J22k36q0j1
7740h1N2J15j66K28l21J15k4j22J06L02k96j26K82N0J3j09j81J31J00j40j3J3
$$ y = [-210, 85, 22, -123, -373, 123, -14, -109, -1, -92, 176, -2, 65, -91, 115, 122, 35, -27, 83, 55, 5, -209, -14, -13, -65, 29, -27, 18, -112, 26, -25, 262, -215, 7, 56, -11, -103, 173, -187, -113, -14, 108, 119, 237, -219, 16, -8, 29, 78, 11, -26, -233, 14, 190, 168, -226, 179, 9, -91, 96, -219, -42, 84, 126, -39, 136, -55, -83, 157, -46, 114, 125, 43, 114, 72, 143, 15, 35, -251, 191, -5, -101, 2, 180, 134, -228, -91, 56, -119, 89, 118, 224, -171, -230, -38, -10, 185, -155, 131, -130, 82, 63, -93, -156, -15, 60, 4, 21, -15, 207, -51, -18, -21, 84, -282, 143, 260, -186, -60, -8, 4, 130, -160, 48, -29, 0, -130, -240, 189, -154, 200, 99, -71, -95, 157, 119, -12, -1, 75, 90, -16, -64, 142, -95, 78, 280, -50, 151, -141, 29, 38, -194, 132, -208, -26, -218, -47, -218, -221, -267, 124, 246, 10, -70, -81, -29, 86, -80, 148, -173, -58, -82, -204, -98, 204, -92, -218, 64, 114, 127, 18, -163, -32, 68, -72, -85, -72]
7762g2J00n5M7p6P2J05M3k2l33L12j15j9Q1J3n1o4J34p8kj55N3m0J84R1q7o3r4
7789i1K55j55k3K53k22K0N7l2P7Lm3J15p4jj67P7q5j48K96p1l03L65jKj81K8j30
7816a79J21R9r2N4Q7k7rk53K60J22L5l48J47j47K47j47m7j17J64l1J19l2j96K79
7840A09j61l9R2J17m0j08J74j74J42K7k86J04Rp6K36M9n05N07N3j16j83J9k87
7863c37J64K60l48L28j2qQ1k39J82l3L7j00M5j76J97K2j21J82j74m7K28k42L08
7886A97rp8p8k24L57j71K18k73j43J24J87j62L8Kr1lK49k15K02k38J72k53J52
7909d0m5o7L68k54P7qk22R7K67j01J84l54M4J4M7j97J18r1O7J79j05o3J72r8k7
7934c8K91k61l3qK46k0n0J07j31r2j07O7p7J31j28J04N7L4ol22L87o0j97J75J45
$$ y = [-72, 28, -27, 20, -56, 16, 121, 164, 142, -191, 121, 6, -13, 68, 81, 30, -34, 100, 22, 20, -135, -82, -122, 62, 153, 66, 3, -91, 164, 9, -14, 239, 17, 37, 94, 62, 139, 142, 99, 214, 140, 139, -28, 49, -36, -184, 112, 41, -262, 103, 102, 104, -77, -49, -179, -58, 41, -51, 3, 90, 63, 54, -199, 61, 183, 218, -130, 17, -130, 117, -30, -77, -194, -30, -61, 58, 26, -170, 109, -52, -91, 1, 118, 78, -30, 144, -30, 112, 139, -147, -43, -34, -110, 126, 175, -330, 177, 230, 114, -69, -50, -337, -173, 87, -261, 67, 55, 47, 128, -111, 71, 38, 75, -25, 20, -156, 41, 63, -58, 124, -50, -97, 131, -111, 197, 188, 110, 32, -192, 165, -6, 212, -61, -204, -80, 107, -55, -17, -15, -106, -109, 140, -75, 127, -111, 61, -192, -40, -85, -152, 216, -38, 39, 31, -191, -94, 173, 72, 256, -98, -54, -40, 7, -190, -72, -163, -96, 83, -22, -85, 87, -11, -38, 253, -8, -41, -49, 197, 177, 127, 234, 103, 11, -96, -29, -106, 25, -103, 1, 58, 92, 86, -236, 151, 91, -106, 69, 214]
7959B14l48o9J90j88K14J11k86K10j4j16N4J5J74j19r1K24q3k43J66L2J0j2j49
7982a04L3L3L6O8k64K5j3K97r5O1l91M06k33K16kj38P3j99K86j1o7k4j0p1K64
8007A76j13n5r5nL6k3NR3j0r9%J18JQ9j90Q4J15j82J36M0R2k38p0Q9j80K06k42
8034b22j0L68k64oO3l0K2J40p4j37J75J37k60j2N3K5O1K23q3j54mQ4o6N1k6j22
8060f8K73l12j55J91K5K90j87l1J5J14k19k52M00K0j28K6j69J69J28j75O7J17
8082A39l62L42j07n0K21k21O6j56j80M92k94j65R9J40j48N10k95j00qO6n2k46
8104c09L81k30J30J00k48K96k25K87l22J64N8l6j5j31O7p6K10j92j31J87J86r5
8126E6k5K58l31K4P6P7k03j6J66o4q4K20J66j99l13J56J8J51O6j73L1J79m47K71
$$ y = [214, -134, -203, -13, -201, 13, 124, -162, 48, 34, -82, -28, -13, 161, 42, -49, 175, 92, -151, 15, 47, 57, 45, -104, -71, -38, -2, 66, -198, -173, -186, 111, 16, 77, -314, 92, -141, 75, 73, -65, 8, -191, 95, 84, 17, -7, -17, -88, 176, 63, 8, -87, -92, -56, -79, -74, 19, 9, -90, -90, 28, 29, 118, -72, 12, 127, -55, 81, 121, 213, -25, -95, -6, -186, 20, -222, -232, 136, -128, -134, -71, -101, -79, 61, -13, -150, 25, 162, -98, -110, -57, -32, 29, 252, 169, 15, 11, 95, 29, 80, 54, -68, 205, -107, -262, -71, -46, 244, 57, 26, 41, 155, -64, -316, 84, 104, -24, 2, -167, 2, 130, -45, 22, 139, -223, 119, 12, -38, 183, -38, 28, -128, -308, 184, -110, -275, -176, -36, -184, 326, 31, -69, -77, -11, -63, -309, 72, -158, -28, 72, -176, 120, -105, 182, -140, 24, 82, 46, 31, -100, -33, -109, 101, -91, -222, -35, 151, 56, 31, 289, -42, -18, 58, 135, -68, -84, 82, 18, -66, 154, 320, 121, -192, -36, -18, 133, 199, 26, 57, 236, -211, 60]
8150F0J60j8l12R6J10j61J51k8r8L1Q0kk88K48O4n1J30Ok42m4N1rRJ74L7J65l35
8177a6k9j32P0J93nk6j60n0J78p5K37j68m9J51
$$ y = [60, 220, 202, -110, -14, 96, -65, 86, 58, -40, -9, 71, 69, -219, 29, 93, 42, 172, 178, -64, -108, -57, -66, -57, 117, 154, 319, -16, -45, -177, -107, 86, 81, 55, -105, -155, 23, -52, 185, 17, -32, 119]
8191A19
$$ Imaginary data points
##PAGE= N=2
##DATA TABLE= (X++(I..I)), XYDATA
0@%%%%%%%%%%%%%%%oJ4j6J6j6J6k2L0l2L7m5M9n7O9p7Q8j02J15j30J47j64J81
37I5k04K28k54K86l17L51l88M29m75N22n75O35o99P69q47R34j033J142j262J402
57G39j565J755j979K243k572K993l544M304n420P226j0617J9109p9096j33573
71a99997K04222J50692j06805j37845M3684O8867q361J5038J6270r0807k4522
82f9564R7685N3675o9731p8897M4405O5344l8318j3445K5264k9983k0493L7480
94C422L0745l0878m6244M1098K4572m5896K0896L7618m6415l4887N2149N6771
106F2951o1471p0329P9656N8059q0211m0152O4097M3327o0683n1741O7129L4184
118D4816n7104q272K6879q285j2981K2166K2889n0352l2041P3367K6583o3731
$$ y = [0, 0, 0, 0, 0, 0, 0, 0, 0, 0, 0, 0, 0, 0, 0, 0, -6, 8, -8, 8, -8, 8, -14, 16, -16, 21, -24, 25, -32, 37, -40, 48, -54, 61, -69, 78, -86, 95, -109, 119, -135, 151, -166, 185, -203, 226, -249, 273, -302, 333, -366, 403, -444, 490, -543, 599, -663, 739, -826, 929, -1050, 1193, -1379, 1614, -1930, 2374, -3046, 4180, -6437, 12672, -66424, -199997, 4225, 154917, 48112, -89733, -46049, 22818, 14457, 29495, 45765, -45042, -69564, 28121, 81796, 12065, -66832, -22427, 42917, 4599, -8846, 16418, -13565, -34058, 3422, 34167, 3289, -42955, -1857, 22715, -23181, -2285, 35333, -11082, -45969, 6180, 62951, 1480, -68849, 10807, 68866, -11345, -51497, 12600, 55927, -4756, -56497, 10632, 44816, -12288, -20560, 6319, -1966, -14947, 7219, 30108, -20244, -52285, 21082, 47665, -16066]
130a6066k2343L6901K9257k2535k0326K1271p039q125K7734r546k6411J3743K4809
143B1324j0370m0282J9133N4706l5804n2932L2590M4938j4268m4740O165L4666
155A5126j5943n956K4435k1177k5978K2713L6365j0224n0065P337M6332r656k0302
168f993P217J126p338n66K4335M244m1288j916L4880K966j2552j0513m140M605
182e933Q185K0006j5397m2586J9477M3890q059l6021j0856L2183J4195k3088j2
195d016M125r793J1171J2539p262j9091o22L1012k604l0387R028J7257o025j0757
209e425J205J3421q164j2556J6012Q38j2986N160M252j419n700J898J1568j1349
223c245q110J8240J70j3045q28J0025Q514j4666o833J7252k170p560M019j064
$$ y = [-16066, -38409, -1508, 27749, 5214, -15112, 6159, -880, -9005, 18729, 9183, -17228, -3485, 21324, 10954, -29328, -10195, 44511, 8707, -44225, -11635, 33303, 19035, -25705, -19540, 15126, -817, -6773, 17662, -3515, -29493, -6780, 29585, 19361, -30704, -23367, 22965, 13309, -6993, 224, 1350, -5988, -6554, 17781, 22025, -19263, -21179, 13701, 16667, 4115, -6398, -10538, -5933, 2252, 22258, 6861, -35725, -16248, 27642, 19583, -16438, -27294, 4889, 19084, -4004, -4016, 109, -9684, 1487, 14026, 6764, -12327, -12949, 18063, 15459, -14928, -5900, 11357, 5332, -5425, -4220, 9201, 1037, -11519, 4493, 5331, -7655, -2495, 1757, 338, -5362, -3464, 8104, -3245, -11355, 6885, 7055, -5990, -6818, 3207, 11721, -2945, -9778, 7474, 5304, -2256, 1763, 699]
237F99o01j599M318M830j5260n7J7092n768r441O58O560L827j1526J996J0867
252F595r532k385P271l62j484l879M253L988r004N439O902j0829j525P294M329
267G071m215j1222Q379Q554r783n14J911j951K381o59J920l117o293J0160K638
282E260j0422J086L616K924j870n814P165Q32o455N178J060k908P73j131M316
297C610k059m432O626k467m333M800L5j134k876p51P471m236n426N481o82m62
313h35O34k068L044k454l01O086n124k293N063j39L91l116K44N590n389q02M807
330C338l128l63O29o30K347m220P52L447m367J398J859k774Q42q29J667J770n470
347c732K589L508l345J109r48K43L163l294J554P38l367L774N74l327J139j202
$$ y = [699, 98, -1501, 2817, 7647, -7613, -7670, 9422, 3654, -5787, -5129, 1431, 5258, -6268, -4272, 6595, -2937, -5322, 1949, 1587, 103, -3776, 477, 4465, -4539, 900, 7802, -3027, -4552, 2742, 7071, 2856, -8366, 13, 8567, -1216, -1730, 181, -1770, 611, -48, 1872, -1245, -7538, 2622, 5260, -5162, -4076, -460, 2464, 594, -5220, 1945, 2777, -3678, 1500, 2560, -348, 425, -706, 3610, 1551, -2881, 3745, 1278, -3055, 1745, 1780, 646, -2230, -2981, 4490, 254, -5172, 309, -373, -835, -201, -2269, 775, -1679, -1980, 4106, -1018, -3311, 1752, 1613, 2004, -1112, -868, 4722, -667, -1469, 3338, 210, -153, 476, -154, 2193, -2027, -1275, 2172, -2195, -797, 1062, -1712, -870, -1699, -32, 1738, -3732, -1143, 2365, -980, 129, -819, -576, 2587, -707, 847, 1585, -1782, 1992, 2566, -761, 378, -824]
363h24K602M47m597K551M76k276K587j699j59P21k182L039j8l383K941q37m46
380a057J990j684J898j175k328M439j06k397J233k037K431J072k517J311j990
395i17j18L476k052q43l08j572L214K1j753R82l002J844L003k482l13j021N50
412a291L936k357r20J452k084K398P26j941P33j803J332K613k623k71o1p10K396
429A525k129r01K750k026j21N44p58K746k058k032K362j66J387n02k772J918M89
446B56K79J750k652j144J229J110K596k814m345L353K292O53k066l874K748K480
462A851j234K59k172q97J975L50J729j837l502K563K201J41r95l188K431K462
478B137k188N05p91M36J037k099K117R36l269R97J50M14J108k632N45J428k158
$$ y = [-824, 1778, 2225, -2372, 179, 655, -1621, 966, -733, -892, -171, -2353, 686, 668, -2715, 226, -611, -1057, 933, -751, 1147, -28, -2356, 2083, 1977, -420, 813, -1224, 1207, 2279, -238, 1073, -917, -1035, 2441, 389, -454, -762, -2334, 880, 901, -852, 130, -2872, -1028, 1975, -507, -820, -1841, -1291, 2645, 288, -632, 820, -1264, 1134, 1860, -81, 652, -1151, 181, 2794, 171, -100, -161, -871, 1525, -604, -1505, 1245, -781, -902, -358, -1116, 1630, -428, -2460, -98, -264, 1123, 621, -2151, -233, 256, 535, 2285, -367, -1511, -282, 828, 3424, 610, -3735, -382, 1910, 2563, 497, -3377, -629, 1851, 617, 876, -1296, -2193, -218, 132, 1861, 24, -3478, -915, 1286, 1427, 432, -2756, -325, 2137, -51, 454, -337, 99, 1136, -963, 1154, 2090, -1179, -182, -32, 382, 1490, -1142, -597, 831, -1327]
495a327J127P88l70n15k892K876L641l242k191m51K760L243k940k460J363M45
511a45J783j43j470k32j581K039L427k904k942L40K385K864l352k839J878J412
527E20P91j376j546J904p41n66K240p05j207n36N52K778j560k074J800L84l7p23
545a02l65K573j160l141K032J513L01j479k363K445R80j239J62j248J27J069j37
562c2J380j252l006J937K864J31k300k738K402L172j629j107j109R11K017j518
578A23j3M13j647J121P97L43o98k520J542K102j252r94m6M20J029j685M58J538
596A031j481m22N28L05J102j728N9J392q55N44m2o40P61p81J40J678j286q01n68
615a064J029J827j581j896J239K25J032n38j537J167K19m01P88q50l54L47L98
$$ y = [-1327, -200, 588, 218, -297, -3189, -313, 3328, 86, -2105, -2556, 204, 3447, 507, -1953, -590, -145, 1638, 1495, 25, -207, -1788, 251, 3678, 774, -2168, -1828, 557, 3421, 69, -2770, -892, 520, 1311, -65, -1611, 293, -448, -1014, 1226, 521, -686, -1222, -670, 2108, 548, -1526, 274, 658, 621, -102, -467, 2106, 946, -2195, -163, 1350, 1651, 172, -2191, 254, 1234, -5, 157, -1091, -964, 105, -32, 1348, 96, -2910, -973, 1891, 2022, -278, -3016, -614, 2558, 929, -178, -1287, -376, 1641, 123, 110, 523, -1124, -3, 794, 1137, 439, -2081, -539, 1563, 311, -683, -729, -309, 720, -965, -507, 1031, -450, -872, -344, -39, 1063, -665, -606, 786, -69, 475, 433, -207, 554, -227, -87, 1591, 305, -496, -1064, -35, 1792, 211, -1685, -446, -221, 811, 273, -1264, -97, 122, -279, 509, -341, -695, -348, 50]
632E0J453j398j528J940P3P4o70n12J232l49o09P91m50l33N54o90O74r6o55P18
652B69o03k6Q29o35J3K57p80Q90l41M97O3j432P98P46p83L75j41j03P96o44M23
673D68j64q45N73N41n44n8p48N46Q36o84Mk31l00J246q10j50K07n10P10L2o45
694e26P11l15L04L67q79N33M7o37J047k42n75O24o29K44J63p64R86k90o22P65
714C12l18kLm63N78m35K9N45n93K94J82k16M31n73K20O95r70Q9P25p35M09O3l94
737a24O16n89j0N90p56L49j9j31M39p80L18M60r09M08K90m27K64j71J86M59q72
758d09N40L36o60N01l2q5K53m70J27K37k10OR5k36J73m34M25L2n37L13l3k92M06
781D6k07q7N23o31N13j94l84P19k70l32O91m11L34k05m20O75j50j70J86l17L15
$$ y = [50, 1503, 105, -1423, 517, 590, 664, -6, -518, 714, 365, -244, 547, 97, -236, 318, -372, 302, 206, -449, 269, -334, -360, 469, -166, -153, 104, -676, 214, -127, 370, 433, -999, -201, 545, -238, 137, -4, -107, 689, 45, 468, 304, -541, 32, 573, 29, -29, -777, -231, 605, -79, -75, -306, -606, 640, -170, -320, -113, -623, 87, 119, -526, 185, -130, 174, 541, -338, 195, 242, -395, 652, 410, -165, 459, -170, 74, 237, -527, 459, 169, -453, 312, -6, -8, -5, -468, 110, -325, -296, 249, -344, -50, 132, -84, 347, -226, -6, 689, -281, -192, 533, -202, 207, 270, -124, 492, -97, -107, 483, -273, 76, 57, -74, 365, -415, -97, 363, -546, -138, 152, -275, -11, -182, 4, 463, -409, 131, 467, -193, 308, 276, 191, 444, -26, 101, 338, 128, 134, 229, -7, 166, -268, 157, 189, -348, -35, -68, -360, 46, -161, -248, 275, -356, 157, -37, -421, 298, 28, -304, 387, -24, 310, 105, -315, 360, 210, 40, 226, -91, 224]
802B24K5n68Q07m13l1P4j26k32L44k42M34m93J10J65l87K32K94l46J99k8o2J71
824A51j87K55Rj91R3R9j53M36n04K4J94l11R5j16q3J62k98J80L53n68K35K90m45
847b80K94j36r9L12j36L13k16m25Q01j11l34J90m43L35J09j92K48m25K7J66j63
868a65L60q9n54N51o3k91N49m44j37M87m49L43L17p41O65j92l20N74k71k32J50
889D8k38N57k11l95N23l24J44j01l3j95J32j65M50m73K36R2l99O64l21l01M71
910A61m85N50pm02nL25J3j75O8k25K17j22L53l7n25J58J75J98j63m09N69j01m15
933b84L85K9k10o7k77N02M5m15R4J38j37J81n6J17J83l80R5L63k68J06l80O1N14
956C39k49J5q3m26Q03m44k72M13l30K19j55j9N43n25j2L46M1l30L0m0N54o40L7
$$ y = [224, 249, -319, 488, 75, 44, 118, -8, -240, 104, -138, 296, -197, -87, 78, -309, -77, 217, -129, 70, 42, -20, 151, -36, 219, 228, 37, 130, 229, 76, 512, 8, 32, 226, -85, 10, -106, -189, -27, -325, -145, 208, -360, -125, 165, -280, 14, -122, -221, 91, -45, 268, 52, -373, 428, 317, -17, 173, -270, 65, 174, -18, 230, -195, -168, -2, -165, 195, 106, -448, 103, 40, -251, 298, -146, -283, 204, -245, 98, 415, -326, 339, 147, -173, 401, 130, -102, 48, -190, 367, 156, -239, 284, -40, 104, 3, -30, -225, -93, -258, 192, -281, -45, 47, -352, 312, -9, -310, 161, -324, 226, 219, -183, -188, 137, 150, -25, 43, -182, 35, -87, 266, 229, -296, -138, 37, 235, 72, -337, 232, 131, -284, 101, 130, -80, -147, -424, 78, 123, -292, -198, -60, -197, -16, -72, 45, 228, -152, -57, 306, 38, 144, -236, -175, 339, 90, 105, 22, -404, 399, -45, -317, 96, -234, -15, -170, -189, 354, -171, -183, 163, 204, -126, -96, -136, 418, -222, -185]
979a85L53j28O8k76M9M08l64k15N60k10J05j2j8N1k92j30K73l29L95K53n57K72
1001G1Ql78Q4J2L76k65p6J58L5j69J49m5R0o5l01M30K61n74j40L93K81m18p5J61
1025Cr0P9Kj42nJ58j59L65k64k47J47K04oj56k5Q6Q7l03L01n0j30M21l08o1K74
1050A81j41k02m3Q9L74l70J01L45m52n7K13J16Jk96oL27j22j95k08M02m1L2j54
1073a06K98k32L3K45j94J13k66R5J78k71K96m8l18J31J56l65J04j49M54m3l81
1094b70L03o3k45K93K5mM1j28L3K73n24L29m0j0j60L26k2j15k60K30J19j22J99
1117B08n17K49j55J59J00M7l58L48J11m5k59p6K20j47K42j54k06L25m6J1j35j01
1139a79K63J92k27M9j05m5k49N50j27j23Q1q4o2k82L87M6l03M24n95M07j48N2
$$ y = [-185, 168, 40, 108, -168, -119, 289, -75, -290, 270, 60, 165, 153, 135, 186, -106, -236, 37, -292, 103, 356, -201, 71, 79, -299, -215, -203, 173, -92, -168, -10, 25, -144, 5, -40, 50, -15, -316, 114, 375, -199, -339, 54, 335, -83, -158, 3, -87, -8, -6, -148, -153, 5, -154, 211, -53, -300, -153, 51, 45, -111, -136, -50, 37, -266, 35, -15, -145, 276, -32, -93, 181, 40, -162, -205, -116, 258, -112, -11, 334, -118, -175, 38, 154, 155, -141, -147, 180, 58, -137, -345, 57, 16, 48, -106, 192, -40, -7, 238, 44, 157, -109, -14, 164, -107, 189, 141, -177, -46, 110, -255, -151, -300, 154, 111, -270, 33, -30, -275, 18, 43, 39, 80, -48, -15, 258, -266, 63, 23, 13, -147, 179, 157, 42, -218, 12, 131, 9, 208, -309, -60, -215, -56, 44, 91, -267, 81, 192, 147, -112, -188, 32, -115, 127, -27, -233, 92, 46, 57, -78, -179, 84, 276, 49, 98, -7, -52, -301, 249, 122, -1, 80, -4, -66, -348, 39, 85, -218, 206, -389, 18, -130, -78]
1161g8r8J87j37k0K96j00L1Qj28j7J07J16M3k99K48j99J59Q3j88K5j5Lj03K86
1185B10m01R8p4L33j75j97J63k71M71k3j77J80j94J25K12k83M6m0K09P0k43Q9
1207A28J55m38pL85j29lk8k62Q5jQ6M1l8j59K82n7j32L63k61j1j81K73N6k68%
1232a21J87M9o3k95J61J93N2j53j0j52K04p2J31P6j47r7M4NK3j60J85RN7j71k22
1257b87K72Q6L6J07Kk92J95J37k21J51q0n1k38L16jj68M1K2n4j21M40l09n5J31
1281E9j39L03k19j13K81k51L5j07OL45M5j41j14KJ09q7L4l4J22k63K82j17k01
1304a63M16m46K96l20J00L21m30J26qN1N8K6L5l30K34O5J47k04Q3j8j91J85K8
1327F1k79N40m21K33P8l43O5K80j68k02L66l37J46J64k01R9j07J69l4j21J18j05
$$ y = [-78, -176, 11, -126, -146, 150, 50, 81, 89, -39, -56, 51, 167, 210, -89, 159, -40, 119, 202, 14, 39, 24, 27, -76, 210, -191, -93, -167, 166, -9, -206, -43, -314, 157, 134, -43, 137, -57, 68, 280, -3, 43, 3, 212, 282, 39, 128, 283, -155, -162, 223, 94, 91, 63, -199, -114, -115, -29, 12, -26, -185, 97, 40, -92, 271, 10, -1, -182, 91, 147, -121, -121, 66, 115, 52, -243, -82, 111, 163, 10, 0, -152, 52, -20, 111, 187, 40, -57, -13, -8, 15, -145, 40, 49, 106, -65, -287, -15, 71, 107, 214, 216, -76, 119, 256, 35, 186, 106, 55, -183, 133, 132, -36, 5, 27, -27, -148, 292, -17, -72, 59, -80, 223, 4, -109, 172, -79, -44, -151, -145, 200, 245, 104, -10, -8, 101, 14, 48, 14, 136, -127, 155, 38, -163, 253, -193, 103, -217, -117, 204, -226, -100, -108, -57, 1, 27, 62, -268, -34, 31, 178, -26, 57, 39, -152, 33, 61, -218, 322, -99, 134, 212, -131, -66, 214, 46, -156, 210, -127, 19, 183, -18, 81, -26, 143, 109, -12, 106, 1]
1349AP5j98J9J76p5J74k50J97l5j11J58k88p9N9J8J76j42o9K36p0O7j08J52j00
1373a7JJ03j32J5K16l77N4m7P6K10q0O6M3k10l5l2J30K82k94j13N8K5J48j20j
1398c1K32l26J00Q1o1L2J8p2J49k81K26J5l40J79k5j5J66k82K32J4j77L55k69
1421h0k9J59j04%K47k12j01P4l9J11j83J98k15K26j57J77R3p5k18J38J8q9P0m8
1445c9R4j93K93j77J82k10N0j2j96J18n2J79J95j62m7N9m6J56k22j6L2k11q1L80
1469G4j19K29rl17J79p2m0K07k29K9J33K13k97k6K36p0nk06Q7K12n5k47K77k4
1493A60m2J0k54k45L58O8l8Q9p9M5j76O6K34k87o8J08J62Lk45Q4J75j47k52M63
1517A92j89K1j38o9K09J8k7j75L30j9j09p2J17p2R3p1j08M6N6j9j6Qj76K90k50
$$ y = [1, 76, -122, -103, 73, -2, 172, -78, 119, 84, -27, 131, -157, -236, -177, -159, 17, -125, -194, 42, -28, 39, -69, 83, -17, -16, 87, -45, -30, 186, -191, -137, -184, -108, 102, 22, 88, 131, -79, -114, -146, -16, 266, -28, -141, -83, -58, 90, -30, -31, 201, -125, -25, 56, -5, 27, 45, -27, 122, -159, 67, 82, -258, -79, -104, -119, 47, -235, -3, 11, -166, 189, -80, -109, 50, -54, -54, 193, -19, -120, -46, -85, 26, -157, 41, -174, 52, -105, 72, 165, 90, -128, 10, 28, -61, 9, -39, 55, -138, 155, -22, 160, -50, 0, -12, -208, -90, -142, 37, 232, 70, 23, 82, 36, 192, -30, -46, -14, -225, -306, 74, -45, 184, 175, -142, 37, -35, -75, 132, -97, -68, 65, 278, -19, -45, 191, 121, 116, -90, -3, 209, 154, -93, 184, 160, 118, 128, -126, -371, -13, 55, 17, 106, 27, 72, -104, -38, 196, -91, -159, -51, 111, 114, -131, -47, 128, -19, -271, 192, 3, 24, -114, -183, 26, 44, 17, -158, 172, 153, 44, -28, 89, 17, 110, 39, -69, -23, 33, 14, -2, 6, -170, 120, -130]
1542a30R4J67O5L3j41nj96J12J78j02r9L5J33o3l38J72kJ45j60K05j95L70k99
1565b1j20O6J30m9M5j0J03J46l56K06J9j46P0k83K08j05J33om0M2J13j71N8J17
1589A49k00O1K98m74J68%P9k42M5O3Q9k93K33Q5m8K4J65k89M0m5J04K38l96J60
1613A4J74k55J30Ok78K70n7n5q3K5J0k2J14P6r2N9J01j33k68RK52J39j05j83L21
1638A69j00j97K60k32j35J19K14l51J21J45L8J66m49J28Q8n1P5J09j7m77O21k02
1660D2J13k96K15J2R8l31K30J57l07j5k15R3K77j55J20n3j0O5N1j36K52l27J89
1683F9j97J98n2K3k72M10p9j89J68k02L3rK91l92J62J48j70j30J22R7J64k99J2
1706i4J31k30O7j7k4k6L28N5j53R5k55L77k08j33mK79Kj59o8J57j46M7j01M9k02
$$ y = [-130, -36, 131, 196, 229, 88, 83, -113, -1, 177, 75, -24, 11, 144, 81, -257, -85, -87, 58, -102, 103, -92, 278, -21, -141, -75, 55, 6, 51, 41, 144, 290, -66, 140, 159, 13, 83, -200, 8, -97, 36, 30, -10, 32, 145, -26, 32, 149, -51, 10, 308, -166, 2, 2, 81, -161, -116, -53, 36, -257, -24, 61, 13, 37, 202, -87, -47, -92, 12, 250, -146, 14, 188, -67, 63, 69, -209, 61, 4, -51, -134, -109, -99, -121, -7, 69, -23, 36, 137, 4, -264, -255, -3, 136, 31, -152, 169, 69, -128, 132, -100, -235, -116, 98, -253, -132, 13, 51, 217, -232, -104, -16, -67, 8, 117, 100, -377, 244, 42, 155, -141, 74, 86, 184, -147, 83, 240, -67, -82, -297, -204, 73, -82, 38, -15, -25, 40, 91, -45, 207, -120, 69, -128, 70, 18, 41, -231, 179, 100, -89, 79, -123, -90, -99, 192, -200, -38, 110, -60, -190, -68, 29, 193, -106, -94, 37, -193, -126, -143, -167, -193, 135, 190, 37, 132, -123, 254, 46, -87, -91, 188, 190, 31, -37, 120, -26, 21, -80, -31, -233]
1731b33K53k21K31j29J7L50l99J14o9J96lk5L31k72j76J6K0K03m31K31L5o1J55
1754A33j7q5O9j41JR6j06K47l8j50R1O4o6l40L85k13J17J5n6k11K96j03L3o9J29
1779H1l7k2m24O93m07%K40j74K36o2M7j89J11j57N9J29j84j42K79J6j00J58l66
1802b15J19Q0R0J31m85O3L47j09q9J50P0p1j91J35j45Q2K0p1J78k99J99P7k81
1825b15K47j33Q0o6P3m2J39M9j73j11M2J33j34K51J37l34J38J59k90n2m5K07R
1848F9J34j24jj08j48N96k37p8j16j71R2Q0J17K1k79K63j42j17J44Q2j31K33q5
1871I4O3k61N0J30j76J47J79j60k41oj7K64r9j4j82M30j33j05J25K9j7k04N8M9
1895Cr1j19J47p1M7K45m04J69J93k39j44L79n8n8l38M57j19l5k75K78P3j3j46
$$ y = [-233, 20, -201, 30, -99, -82, 268, -131, -17, -86, 110, 107, 82, 413, 141, -35, -19, 1, 204, -227, 4, 39, -22, 133, 116, 31, 100, -41, -40, 56, -50, 197, 159, 9, 100, 164, 98, -242, 143, -70, 47, 62, 6, -205, 91, -12, 21, -48, 81, 44, 22, -402, 291, -116, -116, 124, -50, 186, 124, 171, -18, 93, -64, -5, 124, -60, -202, 77, 93, -7, 151, -215, -96, -16, 74, 205, -280, -217, 130, 21, -68, 82, 152, 81, -110, 25, -120, -38, -18, -89, 89, -210, -11, 66, -215, 32, -101, -21, -87, -14, -56, 83, 132, -41, -152, -110, 23, -111, 140, 277, -57, 81, 240, -50, -102, -147, 60, 69, 203, 79, 78, -30, -178, 418, 181, 103, -13, -184, -92, -12, 105, 126, -153, 110, -32, -149, -5, 77, -54, 179, 94, 157, -104, -54, 76, -100, 47, 226, 66, -175, -181, -198, 66, -33, -47, -229, 201, 68, -37, 88, 117, 100, -104, -46, 3, -88, -207, -60, -131, -84, 161, -243, -74, 119, -120, -264, 115, 57, -1, -339, 118, -1, -36, -311, -33, 40, 27, -119]
1918a19M7J83l0k3j45L76n51K98J38j48J90k42N2O2j96J11j80K83k08O5J05o3
1940Ej76J33j05J63r8k0J34k43K03n6L4p7K91k03O8QO2k16J01K06k12n0l6P6L8
1965C0K6k48K27k3k7L4k31L57k47p5K81j02k98K64K54k83j0K2K15L5k21J05j16
1988c1M0j9Q8m2j85K59k4n5Ql4j87L3J89kk32J88J21J6j86K04j6q0r9M9J25L1
2014A59j59J44l07L39l7m1k81J08J54M5m7k8J02j54nJ38k11P2L53k93R8k15J8
2037d8J68k08P0K52k40O4o9k37K90k43K69j76K17k75J39J55k44j05J59J36j31
2058e7Q1J01j51j1P4j94J84p7K93m04K54j69m6J08j0J08k08R6m4k1k4K58o7j19
2082d5P7L5j23J75j22J01j84K05l72L39k81J63J16J20j41p6K5J75k26r0q4lJ39
$$ y = [-119, -72, 111, 81, 58, -87, 289, -262, 36, 174, 26, 216, -26, 26, 88, -108, 3, -177, 106, -102, -37, 68, 5, -171, -38, -143, 20, -78, -98, 36, -207, -4, -60, -26, -103, 188, -15, 53, 61, 123, -93, 8, 214, 2, -48, -84, -8, 30, 56, -192, 35, 12, -15, 19, -212, 145, -102, -177, 104, 2, -296, -32, 222, -61, -71, -49, 166, 201, -20, 85, -31, 9, -10, 78, 36, -149, 110, 86, 31, 39, 5, -182, -149, 40, 38, -194, -6, 115, 131, -55, 149, 133, 53, -46, 3, 128, 159, 0, 144, -163, 176, 139, 98, -183, -75, 79, 124, 77, 49, 151, -3, -8, 130, -81, -9, 344, 51, 149, -66, -48, 120, -88, -18, 234, -6, 58, -11, -248, 42, -201, 68, -108, 109, -166, -27, 128, -116, -221, -62, 74, -57, 24, 125, -26, -37, 37, -157, 27, -50, 243, -161, 93, -76, -122, -14, -24, 84, -124, -28, -72, -93, -117, 141, 74, -45, 32, 67, -56, 119, -3, 98, -86, 119, -253, 86, -195, -32, 84, 204, 63, -13, 12, 187, -39, -129, -213, -216, -77]
2105g7j13K03M3j11J08j38r7L50k22l4o5J82rM7k49p2J54j06L43k04N8J74M9j89
2129B5m3j23K23k10R3r9L15M7k17J64l21J99l0p5O3J6J02Oj00j00nP5k19L15j47
2154d6Qj63J7L18m4J04l22K66q8M1J58k39r7J51n2j9N7J81j52j93J92j03L5J41
2178A51o5Mn1j56J11J01jj50JQ3p6j19k6L09k15J98K22l97J12j00L5J79k88J37
2202ak09J44j69K17Kj1m1k08L14J39j86J38M8k28K25M1k48j40%L00j45r9N01o66
2226b82K05K3r2k1o6K03J37J14l36O8k1L2K77m94J82J60j05R0q7k4R4m50O03l4
2250A76j72L2m3j96R3K00k09K05j02N2j00k79O23m65M53j54j80R6m2q8k0J57J62
2273A99r6m8n0or8K82r9k27K51n9Kk17JK44j86n5J75l35K61p0O6k39K21J01L08
$$ y = [-77, -190, 13, 56, -55, 53, -85, -182, 168, -54, -88, -153, 29, 20, 67, -182, -254, -100, -206, 137, -67, -9, 165, 214, 25, -18, -141, 82, -128, -35, -134, 181, 228, 11, 175, -146, 53, 23, -52, 11, 27, 129, 135, 35, -65, -70, 5, -214, 101, -46, -38, -201, -184, 134, 90, 194, -128, 138, 50, 91, 249, 10, -87, 64, 12, -7, 50, 231, 79, -114, 78, -25, 10, 151, 86, 90, 39, -117, -6, 95, 94, -56, -55, 28, -48, -167, -193, 116, -99, 99, 321, -76, 36, -64, -29, 150, -138, -1, -210, -66, -235, -18, -16, -27, -68, -276, 38, 177, -9, 129, 177, -51, 174, 215, -33, -173, -173, 127, -18, -117, 384, -282, -77, -54, -146, -167, -233, -30, 107, 221, -115, -47, -68, -36, 241, -253, -71, 89, -16, 74, -13, -37, 57, -393, 210, 176, 4, 36, -7, -203, -110, 90, -119, 86, -16, 36, -64, -343, 280, -185, 268, 114, -66, 30, -12, -100, -120, 37, 199, 103, 55, 5, -1, -99, 183, 84, -143, 108, 49, 51, -166, -165, 79, -107, -162, 13, -322, -61, -131, -65, -304, -83, 18, 326]
2298C26m33J68j95K07j37K00j92n6j21KL48k69J61MO4MJ9j66o4n2N44m07j36J20
2322f1J13M4n6j11J28j99P1M3m8j09Q7J06J61j57j47K06k7j54j9K76j81K8o2q4
2346a52J46Mk22J61m0J4OJ66j43K79k91Pp6J16o7K16k75J18J21n6k9P4r5KK47
2371B31l33L6l3p5K37q9j49J27k9K17R5k42j4j9l2L23k90K3j15K20o0J03p5j72
2395a15J30J28k00j65L98l10Q0P5L4jm4N3p2L1pm8k46L40J53l22K47k44J1L38
2419B44k56J64l15Kj34M26p8j03J38k00m9rP9J38j2j11oL08j39RM8L4j37q8N7
2444A0j6m3J54l57L62k25Om6O0J37k46L53j24l3L30j48l70J63L9PR5m6m4n6J16
2469G8n8j41r9K24J13k3j65J38j5k24J83j62K06q5K4j08R7n3l7R4j9l3M06m30
$$ y = [326, -107, 61, -134, 73, -64, 136, -56, -112, -233, -231, 117, -152, 9, 13, 77, 81, 100, -66, -130, -182, 362, -45, -181, -61, 52, 96, 40, -71, 57, -142, -71, -28, -76, -185, -98, 8, 169, 12, -135, 71, 44, -110, -129, 147, -34, -6, -68, -152, -6, -2, -224, -63, -103, -89, -83, 83, -60, 219, -72, -65, -141, -25, -92, 124, -151, -33, 88, 32, 3, 77, -18, -16, 231, -102, -66, -99, -174, 63, -26, -175, -48, -77, 140, 235, -7, -21, -40, -72, 251, -39, -16, -131, 89, 29, 132, 57, -115, 15, 143, -57, -222, 176, -134, -54, 21, 55, 54, 10, 63, -9, 22, 15, -33, -279, 61, 214, -108, 139, -105, -94, 244, -12, 152, -163, -161, -295, 131, 53, -50, 88, -112, -161, -170, -91, 47, 35, -76, -82, 226, 87, 96, 144, 178, 41, -47, 10, -6, -49, 105, -252, 110, -115, -109, -155, -95, 42, -204, 149, 25, -8, 322, 174, -196, -33, 6, 13, 108, 62, 18, -38, 78, 20, -121, -220, 4, 117, 94, -71, 67, 52, -172, 11, -151, 55, -30, -6, -114, -17, -70, -107, -13, -32, -65, 341, -89]
2493h9J28k8m1J73j21j10R1k27K71j54K26j0j24OJ94k66j01K52k61K26jn8k48
2516b72L78L2j19j09L61k99J51J38l92L7K50k00K17m9r8J30M7k04j22Pl6J65N3
2539F6k86J86K66n8j64k26K47o1K81k23K5j46J83Ql08N50k80p5j40K71j43K7J24
2562A24n8Kl31K74k6p5p4L70m17O6R6L12l04J16O0l46L3k8J74J98m4k55M63j50
2586A80j61m2j41K20O7j73p8L30m39K32j0j18J84J44k32j99J08MQ1j18J15l3j35
2609b14P7L46m73J95j25J62j65J22k5Lj09O7L02n6k72M12j18l98M68j38l3q3r6
2632a51M09k41Rj54N8l5J90J02j32j74K50j05N4j42q4J33j25K14NO2q3j16q2L16
2656A78j80NJ85j88qP7j4J3J65j45k1j24O8j85J30j0K46r8l1j00J16J81k34J69
$$ y = [-89, 39, 11, -30, 143, 22, -88, 3, -224, 47, -107, 119, 109, -15, -9, 185, -81, -182, 70, -191, 35, 34, -24, -272, 106, 138, 19, -90, 271, -28, 123, 261, -131, -94, 156, -44, 173, 124, 26, 156, 203, -1, -123, -116, -152, 13, 66, -220, -34, 232, 174, 10, -216, 31, -30, 251, 28, 53, -93, 90, 98, -210, 340, 60, -15, -155, 116, -27, 0, 124, 66, 68, -263, 11, -15, -90, -164, 206, -211, -145, -49, 263, -41, 75, 135, -211, -178, -206, -32, 166, 122, -133, 330, 180, 19, -23, -164, 56, 123, -50, -128, 202, -237, -5, -15, -133, 51, 195, -37, -236, -128, -124, -43, -161, -46, -79, -214, -137, 209, -264, -69, -194, -32, -197, -75, -100, -97, -206, -139, 163, 107, -165, 247, 129, -269, 199, 61, 28, -55, -151, 258, 17, 26, -128, -70, -105, 85, 187, 55, -119, 131, 26, 80, -62, -146, -13, -138, 76, 81, 143, 60, -56, -138, 178, -2, 3, 188, 0, -8, 69, 55, 68, 233, 88, 67, -57, 11, -174, -44, -54, 192, 94, 63, -37, 79, 260, 26, 195]
2680A95j58qq1Q7j11K74k23q4J38k4r2k18L16Q1l24K93k59J1N9J14r0jL09j43
2704F1n0j25Qj9MJ38L4k89L55k8m65L55J1M2K1J56l70J55k6J15J42o8l40J96Q
2729B1j13N2j62j0L21m22K17m3L8Q9K22k12l0k11L39j16j42J48j84k3L16j58j02
2752a65O3%K61l40J49l2j4J75l37N01k42K15k98P5r%J27k78K25j59M8m37L28R6
2776d8J72j30K47l8l24p5J55J86k8l3o0m4j7J00k15K74j31k41L67r0J61k34J32
2799H6l41J69l5K1J14j75J34m6q8L82k08M2j11L9O2j84j44M42l80K65p9K9O1p8
2823b3Q1j38K85k12p1J59r9MR8J80l62p4K14j00J03L4n0qJ79j76O6Q9k37J08l50
2848c00M36k33k2J68l9j02M4J11n7l4j06J28K7q1k1Lq2K39j27L5J57p0J10l15
$$ y = [195, 37, 29, -52, 35, -76, 198, -25, -109, 29, 5, -87, -305, 11, 92, -232, 61, -198, -187, -128, -14, -104, -105, 204, 61, 11, -114, -106, -125, -121, 17, 51, -238, 117, 89, -376, -21, -10, 32, 53, 209, -161, -6, -32, 83, 225, 157, -183, 13, 21, -92, -40, -202, -212, 109, -313, -96, -139, -101, -12, 210, -2, -32, -243, 96, -20, -162, -14, -198, -221, 95, -63, -165, -102, -102, 159, -181, -32, -64, -78, 97, -240, 261, 19, 234, -64, 11, 2, 2, 129, -149, 76, -83, -35, -472, -144, -48, 124, -6, 241, 203, -121, -196, -41, 145, 117, 84, 24, -20, -37, 63, -152, 122, -9, -250, 117, 27, 188, -46, 86, -255, -86, -121, -100, 14, -161, -27, -73, -161, 221, 13, 55, -56, -17, 45, -139, -283, 159, -221, 44, -35, -6, 55, -23, 58, -80, 205, -7, -78, 81, -18, -14, 84, 264, -98, -172, 42, -58, 45, 79, 29, 21, 200, 24, 90, 179, -58, 50, -300, 136, -97, -119, 49, 10, -92, -48, 63, 6, -28, -134, -6, 21, -60, -81, -78, -160, 79, -48, -13, 144, 74, 184, -131]
2872a31RJ85m5Nj14j00K59o9O6J95j50j35l4K59J4k58Rj12K49k07K65k88L7k4
2896a15m7K34p2J8L1j50m3O9J45K38n29L07k96Q3J82M3j63pj02l7Q5M2P7J57j29
2921B1j98J84K6P4k14J00k00K53k47L27J10k87j90J25J12J39j12R8r5J01k0j51
2943d4K33k44o4J91j68j58J18K55m0O9lp0j45mLJ7n6j27J93J84k16j0N8K77l13
2968f4M3P7J59j37k52J14j9R4k28L98j75r2j07J36Q7J07j98k8o3J45j9k5J77R
2992A39n7j04R1l48O02j39l26J88J34k26m6J95K4L6L2o5k96K05r5J14m8J17m5
3015H2J39k86K3K4O6O0L3q1j40J27j32O9J85j89J4j00O1R1R7R3k49p3K5j68K17
3040a2q5N0j15K20j72J14K69k43k45K84l2jl15K78q5J51j87R8M0j23M6P5M10m07
$$ y = [-131, -122, 63, 18, 23, -91, -191, 68, -1, 65, 260, 110, -25, -59, 200, 214, -44, -35, -147, 102, -105, 160, -128, -91, -115, -162, 72, 0, 18, 49, -101, -144, -75, 70, 308, -221, 86, -210, -127, 55, 98, -65, -72, -174, -211, -126, -84, -7, 150, 21, -177, 7, 33, 107, -107, -7, -207, 46, -201, 126, 236, -51, -241, -116, -4, 135, 23, 121, 26, 127, 107, -44, 189, -55, -119, 72, -96, -254, -136, 119, 79, 148, 145, 75, -70, -74, -71, -54, -110, -237, -44, 140, -76, -86, -28, 249, -64, -21, 56, 215, 78, -174, -60, -79, 15, -213, 185, 10, -82, -189, -53, 34, 141, -57, -85, -148, -3, -22, -47, 130, 139, 82, -22, 69, -279, 323, 184, -142, 46, 180, -46, -92, 103, 127, 163, 195, 130, -166, 39, -56, 58, 10, 127, 82, 221, -65, -42, -18, 48, 108, 141, 60, -80, 47, -85, -16, 169, -20, -6, -106, -45, 46, 143, 236, -13, -86, -61, -229, -12, -97, -47, -162, 58, -114, 0, 269, 26, -219, 65, 33, 32, -283, -5, -90, 61, -126, -28, 12, -111, -65, 10, 420, 13]
3064A3K15r2n4l15K75J7L8J31p4R6j81Q9J00N1l24r7J60N4j17l3k67L75j85J35
3088A0k12J88r4K69Nj97j59K27N5r0j05K00j70N3n8k28L78J22L6l25K17l17L18
3111A23J55m53K6J71nj51k6J80K10k28n4j45J43J4J3J01j36Q4kQJ39q7n9J59k56
3136g6k0J1J06k96O2L46k48J25n9J68op8m0l4P7n1n6q9j9J81O3p1M2k18L48k60
3162i2OK01p7J32k10J21j42L09k23j71J76r6On6M40q2m54R6L4J14l1M8J05k54
3186a00J48k12L30m5p5o1J52K8k64M00j66k1J12l30J0J13J5N3k93J04L08m02K7
3209a69K02k61Q2J56k06J29J55j96j0P1m2j14L22Pk80J71L1k25J99J42q7J21l73
3232a75J55R2k00J31K4J49k91P0J05k20K19k39K95q7O0J35Kk98o2j1K96O6k97
$$ y = [13, 228, 136, 82, -233, 42, 59, 97, 228, 154, 250, 69, 158, 258, 309, -15, -112, 48, 102, -15, -48, -315, 60, -125, 10, -202, -14, -108, 161, 166, -31, -190, 37, 92, 2, -103, 97, -73, -20, -78, -306, 72, 194, 230, -95, 122, -195, 123, 278, -175, -149, 22, 17, -134, -160, 20, 230, 2, -52, -197, -54, -40, -27, 74, -62, 22, 20, 28, 167, 80, 21, 180, -76, -96, -85, 21, -275, -213, 133, -115, 10, -49, 119, 113, 35, -5, -39, 38, -13, -69, -158, -177, 4, 67, -4, 38, -180, 168, -92, -86, 115, 38, 170, -40, 81, -61, 248, 25, -146, 30, -66, -60, -116, 324, 242, -212, -116, -82, 32, 1, 49, 154, -100, 48, -164, 166, 121, 46, -15, 137, 165, -99, 301, 135, 114, 226, -104, -94, 19, 34, 87, -206, -102, 206, -196, -169, 33, -228, -146, 10, -196, -67, 88, -108, -118, -47, -89, -203, 119, 126, -154, 17, 48, -177, 22, 164, 77, 198, -175, -20, 72, -128, 3, 27, 176, -115, -45, 60, -160, 59, -180, 115, 28, 88, 223, 225, -73, -135, -146, 150, 216, -81]
3255h1n6L07j42p1J67j97nn8k6J12q5j03K76k29J80l13K58j2R1Qj98M7oQ5K0m1
3281g2L0J53l49J32J82j20j06K16J45k44n5O6j0p2J17Q4j34n5J13R9j58J82k2
3304A22j83j5K3K23j29p2M4L4o1J64n3k77J90k06M07l14K77j30M3k65K03Q9n3
3327F1j64K45rk15K28r2O1k17J2J81j18M6J17j52m5J90p1K0j2k05J85j01J65j33
3351b3J37R8m44M94o6k42l4K02M5j8k10J40K07k86K3j31P0J16k0l29N21l58o8
3374a76L13O9k09N3Nkm8n1P7l45M65J9k46J48K4J00j65j39M1O6j33J48J5l2L1
3399B8j06l1J16p4K46k67j94M37L3j72j58M17j75j65JJ20k31R7P0P2j26K24J24
3422B86k14j9j43O6J87j81N1r6Q7M3m7j69K23q9r5K63K82l30j68L1j28L07k9j87
$$ y = [-81, -137, 170, 28, -43, 124, -73, -78, -136, -162, -50, -135, -238, 38, -191, -11, -324, -66, -78, 13, 21, -177, -130, -136, -51, -31, -72, -42, 111, -238, -106, 76, -44, -150, 66, 211, -33, -88, -22, -32, -104, 13, 97, -37, -92, 21, 120, -38, 144, 122, -61, -76, -53, 170, 41, -31, 13, 47, -14, 150, 97, -180, 10, -196, 211, -103, 174, 44, 87, -178, 25, 114, 61, -103, 142, 133, -82, 146, 54, 115, -102, -90, 91, -27, 19, 136, -16, -61, 129, 58, 78, 66, -139, 46, -55, 110, -23, 114, 212, -232, 262, 196, -46, -80, 122, 167, 149, -61, 79, 286, 0, 23, -108, -38, 78, 58, -271, 250, -108, -176, 137, 206, -3, 50, 55, 53, 5, -46, 31, -314, 151, 170, -76, 72, 96, 196, 31, -108, -67, -1, -134, 14, 29, -3, 28, -78, -109, 7, -67, 179, -88, -282, 155, 188, 16, -142, 275, 100, -65, -64, 56, -175, -78, -8, 64, -62, 162, 286, 72, 53, -90, -24, 163, -18, 33, -63, 24, 67, 20, -149, 74, -15, -110, 153, 435, 105, -63, -32, -160, 147, 118, -69]
3446f9R9J43j81m3J15k57J39LO0m6K9K5j18O0M9J8k23K51j45r9L21j86J46Rq3
3471A7J5J81l08K05j3j71J90J68k80j22M8p9M4J75L5k86J79J88k52J68k9J61l31
3494i7J07J9m0K31j99Qq5N9J03j66n3J99n4K7j22j7q4K78j32J58j35K18j79K7
3518G1l4o4r9K13r0J51l02L12l32K36k36J75j27K7O2M3R0r7p7k31J88R9j78L82
3542A82j49N9P4k81L55l00R7P4J09l61J98n7L4J26OJ9l12l7K66p5Q2N1r2k33J70
3567En8k1p2J18m01M10K16k93R8K9k07K19Q2q4jr3J66j35n7K51l46K62j04J67
3591A51M3j61j7j87J40j67K16R7j83j24J39n2K26k64K94J5m5k28L8lM01m48l7
3614a56l0K07k2j22J68J51k28j24M40k02j07L0o4J76J15j98q7M7j65k4J65J14
$$ y = [-69, 30, 173, -8, -51, 64, -193, -54, -51, 9, -37, -8, 17, -101, -41, 8, 26, -197, 54, -91, -190, 131, -55, 91, 100, 17, 32, 213, -95, 110, 97, -74, 116, 284, 4, -118, -70, -149, -105, 70, 105, -181, -2, 186, -66, 102, 73, 234, -97, 10, 29, -11, 220, 21, 29, -56, 3, 106, -60, -113, 86, 32, 59, -63, -80, -164, 114, -18, 140, 5, 223, 44, 71, 37, -27, -126, 87, -3, 148, -154, 158, -174, 62, -174, 1, -126, -99, -37, 6, 96, -1, -78, -309, -121, -22, -200, 182, 33, 92, 166, -115, 240, -60, 37, 111, 220, -141, 57, 0, 34, 160, 166, 185, -127, -164, 102, 27, 109, 160, 68, -165, 5, -53, -74, -146, -28, -429, -19, 197, -96, 2, 31, -176, 43, 125, 41, 40, -53, 113, -22, -79, 172, -174, 88, -16, 151, 194, 33, 16, -171, -31, -198, 18, 115, -68, -192, -53, -105, 121, -143, 151, 166, 121, -107, -69, -72, 329, -119, -156, -186, 21, -1, -123, 45, 196, -32, -156, 284, 82, -25, 5, -59, 117, 232, 34, -53, -6, -171, -195, -30, 84]
3636H4j76R6j49J83J02K6k06K08k12k12L14K1r8M5n4J37p4P1k15J6P7l33K12O2
3660g5kK45Nj20j44J22j14K20k2j17j15M5J51QP0j66K45k07j06j01J15q0J64k98
3684b77J45J85q1p8p2L68l39j8M31j72l87K59K42q4l04K06j08K35l02J94q2j19
3706a58Q5J58m6k0J83o9L1j64J10j15k07J10j4J28Q9l16L32k10K02j66m4NO6J63
3730A33j65J45J3Pj13J15J2j54j3K82k7p3j11q9Q6j12K14l88L26j20R6j73j00
3753b09K73Q8j71l5K44r4mk86Q9J49J43l01m5K53n5k0j46o3J78J87k0j28j4J5
3777B8K4P5l07Q8r9K4J18J83n3L0q0J2M3n2j14J82k80J25K38j67p6J1J52J48l01
3802d8r4K06j8l59L73j39lK25j36k2q7K03j11k0J21p9O5j70J03J8k03J48q2K72
$$ y = [84, -92, 4, -145, 38, 140, 166, -40, 168, -44, -256, 58, 79, -19, 26, -28, 109, 35, 106, -109, -93, -16, -349, -137, -75, -77, 168, 173, 53, -91, 31, -83, 137, 115, -2, -117, -72, 79, 87, 157, -9, 236, 29, -77, -178, -63, -143, 21, -277, -132, 53, -28, -106, -178, 190, -149, -167, 264, 92, -295, -36, 206, 122, -182, 24, -84, 151, -151, 43, -39, -158, -73, 85, 39, 19, 202, 133, 164, 0, 110, -5, -212, -102, -116, 12, 101, -215, 117, -93, 109, -57, -101, -96, -30, 133, -32, 113, 126, 133, 20, 135, 147, -7, -20, 262, 235, 162, 51, -38, 48, -64, 150, -238, 88, -32, 64, -109, -209, 64, 152, -19, -54, 190, 96, 92, -194, -105, 44, 187, -114, -159, 94, 39, 19, -127, -190, -12, 175, 155, 27, 13, 28, 52, 127, -180, -92, -191, -167, -49, 134, 81, 111, 31, 43, 86, 34, -80, 102, -178, -53, 185, 18, -58, -47, 105, 253, -48, -142, 64, 46, -313, 60, -79, -82, 143, 7, -15, -102, 101, -10, -30, 91, 12, 77, -93, 10, 28, -175, -27, -109, 163]
3826A63j53j06L10l99K24K9k53K08j02K33R0l40M2kj45J88J7J5n3rp1K81m53K04
3850h2r3l9K00j36J4L13k69P8K79k53N4j95K11J5O8o1k66J82J19j70j54Q2J0M9
3874d4j35N23l76o0K17j42o7J42J09j74P7m5J83k92O4J41J06j07r6j23nR0n2m2
3898a08Q4q9q1J18K5J1J67j6j44K8r2LQ0r5J68m6L4j11J36M5K4K0k4l3k48l1M64
3925B89k18j27j0M3J44p0m1P3j79K59j41J88k50QR6k94L78j01K09q5j33q1l8r0
3949a71K26k9k35O5J05j37K35j63K72l90J90J50n4J23n9k31J03n7J16jk8j9Kk89
3973b76L29N8j42J43j63l1r6M7K9K6J22p5o7R0o7Q7r7r2L60r8J27j86K4O6j50
3998c2K29k25K62k21J3N5j73j93K97J07j78jJ66j66k82M45o1j2L8j1k26K19R8
$$ y = [163, 10, -96, 214, -185, 39, 68, -185, 23, -79, 154, 244, -96, -54, -56, -201, -13, 4, 19, -34, -43, -114, 167, -286, -82, -175, -214, -14, -150, -136, 177, -92, -14, 265, 12, 66, -129, 82, 97, 165, 104, -162, 20, 139, -31, -185, -103, -93, -44, -179, 344, -32, -92, 125, -17, -84, 58, 167, -7, 70, 25, 208, -84, -20, 121, 227, 120, 24, -99, -104, -14, -66, -108, -24, -113, -194, -76, -51, -40, 127, 111, -33, -5, -97, -94, -14, -109, 59, 13, 47, -64, 72, 117, 141, 161, 137, 104, -144, -175, 289, 71, -56, -66, -23, 121, 51, 10, 83, -96, 163, 22, 210, -40, -32, 64, -230, 148, 47, 256, 171, 38, -43, -81, -171, 55, 26, -209, -144, -39, -176, 59, -104, 168, -222, -32, 118, 64, 187, 128, -103, 0, -57, 59, 58, 30, 11, 13, -276, 53, 111, -31, 112, -51, -82, -178, -131, -102, -76, 46, -29, -96, -6, -73, 14, -83, -175, 185, 87, 214, 28, 52, 118, -32, 197, -28, 234, 13, 26, 81, -92, -285, 12, 119, -59, -60, 106, -60, -342, 103, 42, 30, 68, 57, -169, 50, 148]
4021A48k2J07m45K12j12Q5J21j75J31j35J67j04j94L22m7j40Pr3K02N7Q2K35l65
4044D4j5L8j19NJ87Kr1Oj99J00K80k67j91J87j26L21j97N9oJ08k36N1J2J55n5
4069E3n2J46j14J35l52J83j3R5Q5k53K18k29L79k77J71r9l85K72o5R7j0M4o8K
4093c7Q7l5L8k1K00j87L8J03M8o9j6r8k0k12JO8R9L4j71M8r9K57O2j05k2p7J50
4120F4Ll03K53l5o0J39n0R3l26L09j22P6K10k19o0o6q9L06k52K36k32P0j13j1
4144a79K04O8P4j31J4L6r7J2N9L6j67J23O1j99J09lk9L97k91L4k5kO8j09k09J45
4170aP6M9n9M6k08M7p0J1J86j24%J48Q5j79m3K00j58M3l94N12k58j36P6M07j64
4195I2r1JL49m66K95j36l1j31n7J73J77l88J29J02l32L70N1k35P6K04k70J09o5
$$ y = [148, 126, 233, -212, 0, -112, -27, 94, -81, 50, -85, 82, -22, -216, 106, 59, -81, -74, -167, 35, 92, 174, 409, 44, 29, 67, -52, -47, 140, 142, 51, 57, -142, -42, 238, -29, -220, -33, -159, 162, -35, 24, 18, 126, -110, -59, -47, 108, 53, 1, 147, 33, 168, -184, -1, -14, 81, 166, -87, 131, -98, 281, 4, 175, 76, -309, -37, -102, -5, -15, 29, -39, -37, 50, 15, 53, 32, 232, 45, 83, 186, 234, 165, 149, 51, 31, -181, -180, -112, -13, 21, -150, -102, -201, 56, 118, 13, -9, -86, 64, 67, -236, 17, -18, -78, 61, 11, 104, -222, 87, -35, 41, 251, 32, -28, -94, -183, 123, -129, 107, -125, -55, -168, -179, 25, 93, 167, 36, 50, 86, -11, 1, 60, 96, -71, 52, 113, -86, 23, 20, -9, 388, 97, 131, 106, 104, 172, 63, -146, -1, 75, 124, 65, 111, -97, -50, -120, -109, 77, -47, -47, 101, 186, 7, -36, 164, 6, 49, -345, 167, -91, -227, -151, 256, 92, 1, 2, 351, -115, 180, 44, 13, -118, -175, -2, 175, -213, -84, 18, -314, 56, 107, -128, -52, 152, -118, -9, -74]
4218g4J56j01o3n7R1K94j05k99K15k25L50k5o8j1p5M6j42Q1J53k06m4J24Kk27
4242b10J35k9K09k07J88m4l3j2o2j34L67j23R3K43k48k13J66j08Qm2j6O6j28o5
4266a99J76N0l9L4j13J12r3k39L52J12k1j51j1J34Q8j75J29j28nj48Q2RN8k9J74
4291A59l38Q5J63j07j42J38K2Q9q8Q7J3o7k48J32K06j37k1J5L75k57m1J09j58
4314a1L69j26j28k05M5J06j99P0J00om5Nk51R6M36j28j81K02J2l42J66q8M52m11
4338f2L3J09j07J45k67L21k39J80q1q6n8K41j42j04j9L02j37j5O5j4r7j58K16
4361B6l0J07j60J56j08j39K95j14rKJ9L7J10mk39M5J42l28K72o7k5p3O8J18Pj55
4387d7J99j37J34j54n4m4J32q4j22K54j36K65r6j91Q8J6j49L34k11o3J64j4k22
$$ y = [-74, 82, -19, -82, -139, -48, 246, 141, -158, 57, -168, 182, 157, 89, 78, 3, 49, -93, -12, 141, -65, -109, 15, 17, -210, -75, -104, 105, -102, 86, 42, 9, -3, -65, -199, 168, 45, 138, 381, 133, -80, 86, -22, -14, -56, -72, -6, -134, -199, -23, 27, -12, 22, -91, 21, -72, -311, 41, 153, 132, -19, -30, 104, 192, 17, 146, 18, 13, -135, -53, -44, 14, -15, 159, -179, -94, 69, -38, -180, -42, -20, 69, -19, 68, 81, 14, -234, -102, 104, -33, -54, -39, 336, 79, 38, 147, -11, 358, 232, 104, -101, -56, 50, -149, -79, 21, 15, -30, -25, -276, -180, 256, 128, -53, 149, 161, -181, -15, -103, 349, -62, -29, 80, -27, 118, -149, 172, -67, 113, 32, -54, -112, 129, -13, -117, -136, 166, 29, 14, 79, 65, -32, -190, 26, -4, 103, -57, 99, -9, -148, 147, 33, 24, 26, 45, 82, 192, 188, -51, -6, 136, -192, 80, 13, -12, -85, -17, 101, 108, -47, 152, 15, 149, -5, -59, -103, 29, -55, -177, 77, -59, 206, 110, -81, 7, 23, -126, 208, -3, -66, 98, 84, -138]
4410a38R4m6J26M5k55J15K04L5l47J44k69L28J80j84k0Q9j59L5k44J49L26j80
4432B8j59K30J78l84J03J20j85q2O8J74n2kj7j50N0K23k5p9N9k97L00k42L30j03
4456H6j20J92Mj35Lk8j66mK56O8l07J48kk8Q3K06l34J30k2j80J42p5O8J54k11
4481g2q8K09j43J26R2K5k9n9p5P7j91J54o1j8O2o8J14j43oj29J06K33k33oJ69
4506D6j54l4p8J98K03k74j2j44J96k42K49n7J25o4%J13j43J23k5j58K71k56Q4
4529c3Jn2R0M9P6J35Q3n43J06J69j18Q7k15K94k04QL37k98pJ06k12P7J0K81k74
4554d7N2j5RM8l5K02k21J19j43l8J1l04M81j35J7Q5j66o1L09k20K40k52J90O7
4578A93k41J87k27J52J59m16n2K03p8L19k89l4J47j52M49m14Q3j06Q2J35p0J08
$$ y = [-138, -44, -90, 36, 81, -174, -59, 145, 180, -167, -23, -292, 36, 216, 32, 12, 101, -58, -23, -267, -118, 208, 28, -131, 99, 277, -107, -4, 116, -69, -151, -83, 91, 39, 37, 20, -130, -80, 143, 118, 39, 98, -199, 101, -141, 189, 86, -34, 158, 162, 27, 30, 2, -164, -168, 88, 156, -151, -3, -5, -33, 50, 256, -78, 52, 30, -150, -8, -83, -15, 139, -72, -160, 49, -94, 32, 124, 149, 120, 61, -14, 63, -128, 26, -35, -53, 9, -59, 55, -88, -94, -223, -117, 116, -117, -123, 46, -108, -142, -220, -22, 181, -93, -105, -249, -53, -295, -46, -103, 22, -42, -42, 71, -72, 51, 26, -132, 139, -117, -33, -32, -84, 6, 55, 131, 266, 349, -194, -88, 81, -37, 50, -165, 129, -75, -67, 270, -28, -35, 71, -141, -64, -54, 227, -47, 5, -10, -1, 47, 12, 214, -7, 112, -31, -69, -58, -362, 119, -16, 1, 86, -80, -141, 168, -52, 188, -64, 126, 193, -48, 139, -88, 64, 223, -193, -245, -42, -120, 199, -90, -124, 23, -129, 320, -94, -11, -117, -35, 100, 30, 138]
4600A38k35K80j36j55K42m1p7o1J81k45J03r3N0J01J66j78J92p9k24Q5P7j26K03
4623A68l07J66k00K28p5Q8J28k8q6m1l3Mn3j2k8KLK88j62j72J43K4J69m22n5J10
4649a53R4N5pK35l32O1J03k33K86r9P7l00K31o2J51j46J58J78k53j36J83M3l24
4672a90K03qj55OK08r5m2N8L28l44P1j5j25Q8j63K42j26M4J10j71N1J02j65j33
4696b21J82M0n3j10J49j50k6L02q8k25m4J56j3K85j60m3q3K98j04m79N01l8l68
4719b92LK90J38k10M0K2q6n0J0n2K95Q2k69P4J4j57J9J65J9j22J73k94j19K66
4743d1O1n7N9J9o3j7R1k10J26o5J01M8p3Q6j30J15n2r4J40o0K15M8k46J15j46
4768c0QQ6n3K07k98rM0j30K82%p8m7N1K7L1L6J16k30ol83O68l07J12j70K94k80
$$ y = [138, -97, 183, 47, -108, 134, 93, 16, -45, 136, -109, -6, -99, -49, 52, 218, 40, 232, 153, -71, 14, 91, -35, 168, -139, 27, -173, 55, -20, 68, 196, 168, 82, 41, 8, 12, -41, -53, -81, -79, -76, 212, 50, -122, 21, 45, 214, -208, -263, -153, -59, -4, -11, 224, -108, -47, 56, -177, 109, 10, 87, -213, 18, -44, 107, -39, 119, 297, 44, -92, 91, 134, -190, 13, 5, -150, -144, 64, -31, -73, -15, 313, -31, 40, 25, -100, -12, -175, 67, -59, -15, 95, -76, -25, 77, -88, -221, -39, 1, -52, -162, -13, -163, -189, 113, 25, -200, -244, -88, -101, 184, 24, -19, -102, 196, 92, -387, 114, 76, -292, -289, 1, 139, -71, -31, -9, -95, -145, -135, -187, 108, 190, -79, -5, 9, -148, -129, 36, 55, -67, 106, -188, -307, -41, 20, -37, 22, 41, -22, -39, 52, -158, -32, -97, 4, 52, -21, 65, -65, 50, -2, -96, 44, -16, 199, 247, 1, 116, -30, -22, 64, 11, 218, -80, -89, -49, -179, 103, 103, 25, -22, 29, 56, 87, 123, 239, 9, 3, -380, 288, -19, 93, -77, 217, -63]
4794f3Q9k06J91J15p5N2k98L15k04K07l35L29L42l66k5m4q5J52j07Q2j52j00K26
4817D0J32k22K64l75K29J44j05R7k73J28k99J84J80l43N9K40m5k4j45J07J29j47
4839d5K29k50K24k03J32P0n8Nk6k35K26j36j35L99j51K9l6k08R2J17J2l18L36
4862G0J54k70k17L09p3J78j77L8L0k69J10N8L3K56k53j24K65L8k41J9L21j43k76
4885a64K03O5n8r2j1K27k39P1j75K03O6j2k14J61j13L89k80L3k96L67L8k95K76
4908A50q0J06j58Oj60J43j56J10l2L20k88K9M1j07m7k3J53j7j06K21r7M9J06j10
4932E3j45k5K18m35M31k23L90j76j49K31j48M5o4j54N5O1k64M12l5jk24J27j13
4955a33J59j12J52j92K27j71N8J02k60K45j82J42j52j9O9J69j13P0K4j62J08k02
$$ y = [-63, 26, -180, 11, 126, 51, 103, -195, 120, -84, 123, -212, 117, 459, 93, 68, 24, -61, 91, -16, 66, -86, -186, 40, 172, -50, 214, -161, 68, 212, 107, 204, -69, 59, -240, -56, 124, -219, -160, 80, 35, 11, -134, -27, 102, -45, 184, -66, 158, -45, 87, 157, 99, 104, 78, -157, 69, -67, -202, 197, 46, 75, 39, -169, -77, 40, 52, -266, 70, 224, -46, -263, 46, -27, 151, -26, 12, 42, -227, -117, -59, -26, 230, -23, -147, 118, 156, -85, -66, 255, 112, -164, 39, 104, 46, -46, -57, 170, -69, 2, -173, 30, 96, 84, -130, 31, -82, 307, 27, 60, -236, 131, 169, -126, 150, 70, 176, 18, 24, -136, 7, -149, -39, -71, 249, -39, -10, 31, -76, -123, -146, 7, -10, -116, 105, 8, 57, 163, 53, -92, -117, 101, -334, 97, -126, 264, 88, -61, 170, 22, 67, 3, -151, -96, -35, -299, 113, 78, 77, -147, -20, -133, 26, -86, 66, -126, 101, -70, -12, 90, -170, 75, -107, 35, -117, -136, -67, 102, -11, 59, 83, -79, 29, -173]
4977a73K0L03Q7j69k65L11l8j38J28J24j64J04j02l4Q4k99O0L18p5K3k11J91j55
5000g0J92l8j21j58J21J66j15O1j15q2K86j78J73pl77K43P8J11m26K77P9m7n2
5023AO6p2J41m4j31K07Q3m8k99j33K68K48l24R0j69L71k7r8K7q0l6n1J93l55J25
5048d7j35K19k03J94k8J94j86K3k94P0J35Q1q0J5M16m95m3J92j08K01q8Q1j3j61
5072f0K8J41n3J7j18p0J20L2j1J3J65k13M7q1J22l43N65l12Q8l29N9J28r9J16
5096d8Q3k28l1j00K98J11p7N2m6Q2L1q6L61n13J58q7m1L18l25J33J88k98J03m5
5120gJ20r4m8L6J57n2K9o5m7j27J33j03K5lJ00j34J57j04j02P7j70P9rJ13L5j7
5146b1J00j04r7Q3k65K86r3L28l26n5M3J61J86k67K99k53o7KJ79o0o1n9j08J81
$$ y = [-173, -153, 150, 237, 68, -197, 114, 76, -62, 66, 190, 26, 130, 28, -6, 78, -221, -161, 157, 82, 105, -106, 85, -70, 122, 84, -37, -195, -74, 92, -23, 38, -77, -159, 127, -51, 122, 115, -262, -19, 59, 170, -256, 21, 100, 53, 1, 67, -5, 136, 92, -39, 168, 251, 203, -96, -229, 39, 287, -37, 53, -116, 255, 228, 130, 157, 77, 41, -10, 183, -172, -47, -182, 37, -166, 28, 0, 194, 8, 31, -263, -193, -58, 23, -57, -42, 374, -121, -164, 28, -80, 121, 33, 114, 101, -60, -32, 109, 56, 73, -45, -115, 5, 37, 26, 39, 204, -9, 38, -43, 79, -264, 301, -11, 77, -252, -193, -65, -164, -48, 35, -193, -224, -324, -26, 85, 8, 60, 14, 96, 127, 41, 402, -111, 47, -40, -81, 237, -88, 45, 233, -65, 38, -7, 113, 19, -29, 7, 164, 112, 141, 76, 29, -98, 35, -68, -43, -46, 54, -80, 77, -27, -129, -52, -222, -143, -152, -39, -4, -21, 79, -25, -122, -39, -304, -18, -111, 217, -109, -164, -121, 40, 226, -41, 258, 5, -62, -60, 119, 59, -2, -61, -169, 12]
5170A2J86l09J58j39R7M1n7K25m22K43r9O9K8k02K47n9k5J97k78O8J01k73J01
5193i0j85M51j33l7r3J60r3lK13j80J77j08m8Q2k41J03L0q8K67k07Q3O5l46J18
5217a03K7K0P8P5j26J38K9o9m8j59r4J02J61j47L1K68q9j0K32l43o5Pk6J54j17
5242g4J70K28j96j99N9o7J86R3N8l96J82k80L47J12k73k66J77j53J32l0K75k1
5264F4j09J03q6j30K6K9J4j38J77N8j70J23J78r6O0j13l03L81j01J93j53J29j96
5287f0p1q6K69J02k31r2L49k96R4n3QoO4j31R9MJ63p8Rj03J46j79J18j1PJ04o9
5314G0j80j0j84K85n7j1J71r8k5J71k42N22m37j80J84m5J04K69m26m8K32r4N3
5337B4m1q6L40j14n1j79J26J30r8k3j2l38J50J64q5L60n22L50o4j46K70j0m7J7
$$ y = [12, 198, -111, 47, -92, 5, 46, -11, 214, -208, 35, -64, 5, 33, -169, 78, 19, -6, 191, -87, -19, 82, -191, -90, -275, 176, 43, 6, -87, 73, -20, -23, 190, 10, 187, 79, 31, 113, -128, -25, 5, -83, 184, -23, 60, 125, -221, -103, -76, -56, 22, 97, -29, 109, 138, 69, 21, -138, -232, -130, 31, -116, -85, 183, 94, 84, 316, -27, -92, -85, -111, 43, -74, 96, 324, 128, -71, -12, -79, 107, 200, 258, -138, 44, -236, 111, 223, -50, -316, -139, -292, -160, -190, 85, 64, -45, 58, -28, -158, -132, -103, -89, -227, -50, 8, -162, -39, 139, 43, 103, -10, -313, 68, -33, 160, 7, 136, -60, -131, -217, 52, 154, -77, -169, 180, -116, -22, -75, -67, -73, -9, -140, -41, -37, 126, 48, 57, -46, 100, -79, 39, 28, 35, 139, 70, -110, -120, -304, -19, -76, -87, 84, -14, -39, 132, -110, 412, -25, -205, -21, -66, 38, 307, -119, -167, 65, -29, 24, -17, -103, 237, 123, 72, -107, 19, 149, 51, 28, 16, -322, -172, -8, -93, 267, -255, 95, 31, -115, 155, 145, 98, 115]
5361A15K01m89L59Rj90K4j42J15J15p8m4j50J41l2k1m4K25j69J0o0Q6O5j01Q0
5385B5q3j71M81K2l82J18k9l1p2K33q3j24J22O2l8L0j5j17L07K3m14K68j96qR0
5410A8K86k61k75L42lj82M49m58Q0M7k13M4L03j6j42J2j40L59j98l28K47k03J12
5433a20J22J87j93l11L10n4L05r6r9j59P5l4O3j3o4M4o6n6N8j33M2K63j1q5j23
5458a48pK79j80J00p5m3J0J39O3k77%J94J2j69K20j4l00K11J60k02m1o6J53j93
5482a74O7J49p5j83K99j27J11j9K34m29J93r0J24j08L10q3j66J08K4N1k64m7L2
5505f3Q1j01J26R7k77J88j42RQ3L04l73p8J66k48K36q5j33J69j22J99j45K09P0
5528A70o7j79J59j49J73j01K9J10J2L7l08J23J45j45p3L01k74L2o1J00j68j08
$$ y = [115, 316, -173, 186, 195, 5, 29, -113, 2, 117, 39, -5, -155, -14, -46, -67, -111, 114, -55, -45, -105, -19, 46, -55, 25, -58, -229, 252, 274, -108, 10, -19, -50, -122, 111, 28, -96, 26, 88, 50, 80, 65, -52, 255, 278, -136, 132, -64, -72, 18, 304, 43, -232, 110, 107, -75, 374, -84, -4, 43, -170, -126, 177, 161, 19, 31, -109, 250, 52, -276, -29, -232, -120, 2, 189, -4, -315, -5, -59, 246, 150, 51, -108, -33, -67, -4, -17, -81, -37, -103, -159, -101, -234, -192, 71, 60, -25, -148, -155, 124, -56, 44, -31, -74, -64, 75, 138, -139, -139, 55, 67, -102, 118, 104, -196, 15, 175, -27, -68, -134, 19, -174, -107, 42, -33, -216, 83, -44, 67, 48, 282, -147, 46, -44, 80, -28, 282, 199, 33, 141, 165, 216, -48, -95, -63, 18, -83, 43, 140, -137, 51, -91, -82, 1, 305, -68, -146, 20, -228, 8, -77, -210, -41, -163, 36, -109, 100, 170, 103, -76, 83, -66, 107, 6, 35, 145, 157, 194, -114, 9, 154, 9, -64, 237, -37, -5, -66, 34, -134, -242]
5550b42M28k67J5k7K8Mj22L0K67j43P1M3j69K31l28K88m6n9J0p8Q6j05K48j76
5574a3J67j79k7j2o9M31k17j1j36QK01j08K9K4m4n0J85k21K50ql20J59m2P0J39
5599B06l00J09J2M7o6j19J4M4J50k54J59J02J07k68L0K0K46r3L4q7Lp5j09J42
5623E4k26K90j99r0J17K96k46j75J58L5j07R4J40l5L9p9J61k25j94M2J77J17j18
5646B6Q2j76Jk3jJ1K1P1j31J24j6J25j9j66J73k3k02J82j64j34L21o9J64R6k17
5671E6q4J55j57K60k37k11J34K31R3k48J41l68L91k2k32J9P2J37j85l9j76L31
5693F1M6k31J17n0M9k2J22J15j92L05k32j64J32l1k6j64j11M49l02L05k51m37
5715e12N69l04M30m78J09J63L7kj00P0j82J26M1R1J35l66J19K40j51q0j74N45
$$ y = [-242, 186, -81, -66, -93, -65, -61, -183, -153, 114, -29, 42, 85, -84, 147, -181, 107, 61, 2, 12, -66, 20, -85, 163, -13, 154, -25, -52, -64, -133, 298, 81, 70, -66, -58, 143, 35, 64, 88, 44, -6, 179, -42, 208, 200, -120, 39, -3, 67, 206, -94, 15, 27, 74, 8, -111, -97, -53, 97, -157, 2, 104, 211, -57, -27, -7, 239, 146, 180, 93, 96, 21, -88, 54, -172, 118, -81, -171, -54, 242, -4, -179, -21, 14, -93, 1, 141, 106, 145, 66, 227, 2, -192, -150, 27, 144, 26, 108, -68, -67, -90, -91, -80, -59, 12, -119, 5, -11, 114, 95, -71, 102, 79, -123, 59, -105, -239, 82, 13, 177, 273, 56, -28, 127, -30, 230, -7, -218, -84, 147, 240, -8, 133, -235, 156, 134, -98, -79, -7, 130, -55, -94, -270, 61, 107, -124, -7, -57, -8, -30, 92, 207, 15, 320, 88, -76, 56, 25, -1, -165, -276, 173, -129, 176, -75, -512, 57, -247, 183, -295, -186, -23, 14, 12, -88, -18, -200, -74, -33, 58, 193, -173, -54, 186, 35, -45, -219, 326]
5737C26l18m8K43J38k11j46j9j66M23n74J36K02k31J07Q8O0k9J02nN0k46J19j20
5760a19N6J60j3j4N0l89L35O2Jk30l8L1j78M08l96J72J0j23R3N3J36q1M8l9k92
5785b97K30K15m28L15J51j39K4k0l8n9j21K14lN2r5M8j17K34j74K83l24j99J10
5808a38Q1k51J33Q5J23j66M6j13K08o2P0J83j94Q2Jl6q5Q5r9O4m0j12J00J43k11
5833a03j34L1K62l34K15j31J21K06l20K40j01R2j69K36j25j24k8J76j52M26k14
5854G0j80J06K8M05m60j19J10J00MJ24l69J26P1J43k22j40K14j53J69k0KK9pj8
5878A3J61j24j11N6J58j90J32j37r5J18j07o5L00k11J22KLm9j45J93K0k7j52K06
5902G1k30J88r9q6J15l6P3N7p2l04J06K48K6j3q6M3q4l9J84J32m1r4k3j38J36
$$ y = [326, 8, -40, 203, 341, 130, -16, -35, -201, 222, -352, -216, -14, -245, -138, -50, 10, -19, 83, 78, 128, -118, 1, -119, -63, 97, 84, 70, 120, -269, 66, 128, 129, -101, -139, -108, -286, 122, -274, -102, -92, -215, -122, -69, 67, -14, 34, -5, -297, -67, 148, -280, 35, 186, 47, 71, 51, 13, -46, -167, 47, 44, 96, 1, 49, -68, 166, -8, 275, -49, -248, -138, -57, -308, -175, -90, 33, -133, -87, -200, 8, -54, 16, 199, 5, 87, 88, 52, -33, 52, -47, 17, -23, -135, -35, 108, -103, -237, -206, 56, -278, -63, -194, -73, 133, -187, 53, -48, 44, -125, 111, -14, -138, -166, 10, -142, 284, 70, -110, -4, 24, 429, -31, -150, -40, 60, 64, 188, -181, -55, 16, 159, -63, -203, 11, -142, 27, 7, 9, 38, 31, 13, 174, 50, -61, -5, 153, -37, 95, -42, -137, -19, -126, -191, 109, -102, 20, 22, 25, -24, -169, 24, 44, 17, -135, 71, -159, 29, -70, -156, -41, -77, -4, 53, -19, -323, -217, 31, 57, 44, -42, 1, -83, -122, 62, 194, 153, 59, 36, -102, 34]
5927C4R0l2K09m61K46P4k48J82J17j36k55J41rJ56k20K72o4j78N6K51m13K3L20
5950A55o8j18K06l21j53J93jJ35N4N9o3j9R1k21r3K1O2m5J72j0m6p7J60j83r9
5975b09K16m5j14K26Q3k43K83m01J35K01p4j75J83N3p6n2JO2l1M9n2j80K74j95
5999h1L8J17k14K85j00k13K42R8m9k77p2L40j08J62k84j3O6r9L1J19j44R1K92
6022B27k05J25j27j53K43n3r9q9j9J00J12K18j53n5j57%K8j1K00J05p1m7k16R
6046h8O7K5N8j34R3J09nk52J20K58K6k93R9k25J98R6l69M12j8l52K68k77J52J16
6070H4K2k04l6J56J12l7j14J53K3rk44K6k57M85l05QJ00J4n0P3j55K95J05j88
6094E7k63K16O5Ok89J5J12j25J5R8K57l50M05j43k9lR7l30K22M7Nj05K19o0k73
$$ y = [34, 124, 92, 301, -160, 86, 160, -88, 94, 211, 75, -180, -39, -48, 108, -112, 160, 96, -82, -26, 225, -188, -165, 155, 87, -31, 175, -146, -299, -106, -107, 28, 82, 141, 78, 59, 150, -71, -164, -143, -81, -126, 46, 36, -10, -87, 73, -110, -209, 7, -38, -152, 74, 157, -86, 197, -204, -69, 132, 58, -117, 66, 119, 43, -9, -8, 54, 23, 72, 20, -160, 114, -81, -43, 74, -140, 145, 45, -168, 74, 172, 123, -154, -226, 114, 6, 168, -116, -129, -63, -162, -131, -12, -156, -65, 227, 22, 147, 20, -133, 110, 57, -42, -131, -150, -50, 62, 280, 127, 72, -85, -85, -57, -68, 132, 237, 166, 119, -97, -88, -21, 4, 62, -72, 21, 130, 125, -127, -7, 251, 277, -16, 83, -142, 56, 152, -217, 195, 177, -175, 93, -184, -32, 84, 106, -98, -134, 22, 134, 97, -17, 136, 159, 150, -94, -68, -325, 160, -145, -137, -37, -23, -73, 0, -155, 140, 245, 57, -206, 10, 75, 81, -208, -193, -81, -206, -191, -93, 164, -186, 219, 76, 47, 44, 141, -189, 33, 80, 85, -20, 199, 139, -134]
6119a34M96m65K38l79R0k1J69j4p7j55N3J22J15j87Q8L4j17J00R2k89K19O7L4
6142G9Om0k7j37K53j37J23n6q7r7K76k09J52p6j63J48j58J5K38J0L4k21J55j82
6166a01J47k8R4n1J98L3k15L4o8o4j44j08N20k79n2J14o2RJ5r7K7K60j58J40J
6191A65j93J02j03K4m6Q8R4j33k6J9l7o3O5P3j25Kk88L44J47l6K5j17N3K54J0
6216B98j02l93J51K01j24K5k96K94L1n4Q0q6J28o3k91K82n7n3l8j86J82OM8N5
6240C8m6O5j90K3K46J29j66k27J65j50Q5J77k09o6j57L58j18J60J0l22K22M8J1
6263H6j73J7k34N48m41J62J21j52k15K94P5J36j36k94J89NQ1k19K16J10j37j37
6285i8J92m6l9k93L72r7J50k23Q0j19K63k9k66J03MN0K24j41m3J42k58M37m01
$$ y = [-134, 362, -103, 135, -244, -154, -175, -6, -20, -97, -252, -199, -77, 38, -149, -61, -27, -144, -44, 48, -241, -22, 45, 79, 85, 45, 18, -119, 134, -3, 120, 64, -23, -120, 156, -53, 99, 23, -140, 8, -150, -135, 103, 113, 147, -74, 81, -101, 46, 18, 112, 61, 259, 292, 77, 111, 43, -21, -165, -273, 247, -32, -84, 30, -32, -23, -8, -105, -78, 182, 24, 164, 165, -28, 74, -29, -5, -51, 37, 131, -2, -28, -9, -46, -109, -44, 29, -96, -94, -382, -38, 109, 73, 98, -19, 34, 288, 298, 196, -197, -46, 155, 31, 56, -240, 54, 85, 31, 111, 25, 153, 90, -201, 81, 24, -29, -67, -253, -71, -65, -17, 38, -8, 57, -133, -110, 136, 265, 99, -128, 37, -113, -28, 149, -60, -126, -283, 75, -43, 117, 127, -195, 27, 75, 86, -87, -70, -304, 244, -197, -35, 86, -66, -281, 13, 88, 224, 88, -206, -17, -12, 69, -150, 66, 176, 39, -98, 94, 48, 9, -284, 88, -9, 141, -82, -2, -121, 142, 113, -153, -50, -46, 4, 228, 87, 44, 186, -72, 365, -36]
6308c6l0J42J7m7j66J48j56L04o9k33K78q0k1Q5J57k97J67k95Q8j67K72q7rJ36
6332A01q3O2J4%j94J78P2k0j09o7J67o9Q3N5l17K36j89K05p2j69J12J80l08N6
6356g6K01j34Pj13L00n11K96nk44K36lQ1J70j61r6R5j32J92r7r3K91k82J07J13
6380A42q4j86J87j18Q2j13j00K68j99J32n6r8K76j9j59j36K99rj73L7k2K5lm1
6404f8R8m2L0K22j04N1j49j55K42J34o14J60J33Q4K1k54L97k00J24l75K16J41
$$ y = [-36, -66, 76, 93, 46, -120, 28, -128, 176, 107, -126, 152, 72, 51, 136, 293, -4, 163, -132, -44, -211, 61, -26, -35, 101, 18, 80, 94, 94, -100, 78, 150, 130, 21, -46, 121, 52, 135, 190, -127, 109, -80, 125, 53, -116, -4, 176, -132, -76, 125, -9, -2, -115, 185, -326, -30, -35, -279, -43, -46, 35, 205, 44, -52, 43, -89, 103, 6, -87, 204, -78, 29, 142, 58, -128, 59, -59, 23, -90, -190, 78, -121, 11, -45, -143, 133, 114, -45, -181, 118, 109, -64, -27, -49, -24, -27, -68, 30, -12, 18, 240, 136, 187, 38, -117, 125, 259, -355, -195, -62, 22, 43, -211, 186, -14, 110, -265, -49, 92]
$$ [...]
8191H
##END NTUPLES=NMR FID
##END=
