##TITLE=1H_Pr mat
 CDCl3
 8 sc, 
 5.9.2024
##JCAMPDX= 6.0         $$ Bruker NMR JCAMP-DX V2.0
##DATA TYPE= NMR FID
##DATA CLASS= NTUPLES
##ORIGIN= UXNMR, Bruker Analytische Messtechnik GmbH
##OWNER= root
$$ XWIN-NMR		Version 3.5
$$ Thu Sep  5 14:24:09 2024 Russian Standard Time (UT+4h)  she@DPX200
##.OBSERVE FREQUENCY= 200.1318
##.OBSERVE NUCLEUS= ^1H
##.DELAY= (6, 6)
##.ACQUISITION MODE= SIMULTANEOUS
##.ACQUISITION SCHEME= undefined
##.AVERAGES= 8
##.DIGITISER RES= 18
##SPECTROMETER/DATA SYSTEM= spect
##.PULSE SEQUENCE= zg30
##.SOLVENT NAME= CDCl3
##.SHIFT REFERENCE= (INTERNAL, CDCl3, 0, 15.7039)
##AUDIT TRAIL= $$ (NUMBER, WHEN, WHO, WHERE, WHAT)
$$ ##TITLE= Audit trail, XWIN-NMR		Version 3.5
$$ ##JCAMPDX= 5.01
$$ ##ORIGIN= Bruker BioSpin GmbH
$$ ##OWNER= she
$$ F:/spectra/data/she/nmr/H-F/1/audita.txt
$$ ##AUDIT TRAIL=  $$ (NUMBER, WHEN, WHO, WHERE, WHAT)
(   1,<2024-09-05 14:22:40.54 +0400>,<she>,<DPX200>,
      <created by zg, POWCHK disabled, PULCHK disabled
       configuration hash MD5:
       00 E9 B6 7A A2 85 ED C7 34 08 36 98 17 FE 4E 26
       data hash MD5: 16K
       D9 4A 4C 30 F4 2D 37 CA 62 06 4F C7 AD 53 A3 75>)
$$ ##END=
$$ 
$$ hash MD5
$$ 54 6D ED 22 F6 8D A9 55 1B 18 85 BF 3F D0 5F 61
##$RELAX= 
##$RELAX= 
##$RELAX= 
##$RELAX= 
##$RELAX= 
##$RELAX= 
$$ Bruker specific parameters
$$ --------------------------
##$DU= <F:/spectra>
##$EXPNO= 1
##$NAME= <H-F>
##$PROCNO= 1
##$TYPE= <nmr>
##$USER= <she>
##$AMP= (0..31)
100 100 100 100 100 100 100 100 100 100 100 100 100 100 100 100 100 100 
100 100 100 100 100 100 100 100 100 100 100 100 100 100 
##$AQSEQ= 0
##$AQ_mod= 1
##$AUNM= <au_zg>
##$AUTOPOS= <>
##$BF1= 200.13
##$BF2= 200.13
##$BF3= 200.13
##$BF4= 200.13
##$BF5= 200.13
##$BF6= 200.13
##$BF7= 200.13
##$BF8= 200.13
##$BYTORDA= 1
##$CFDGTYP= 0
##$CFRGTYP= 5
##$CHEMSTR= <none>
##$CNST= (0..31)
1 1 145 1 1 1 1 1 1 1 1 1 1 1 1 1 1 1 1 1 1 1 1 1 1 1 1 1 1 1 1 1 
##$CPDPRG= <>
##$CPDPRG1= <>
##$CPDPRG2= <>
##$CPDPRG3= <>
##$CPDPRG4= <mlev>
##$CPDPRG5= <mlev>
##$CPDPRG6= <mlev>
##$CPDPRG7= <mlev>
##$CPDPRG8= <mlev>
##$CPDPRGB= <>
##$CPDPRGT= <>
##$D= (0..31)
0 1.2 0 0 0 0 0 0 0 0.06 0 0.03 0 0 0 0 0.0002 0 0 0 0 0 0 0 0 0 0 0 0 
0 0 0 
##$DATE= 1725531760
##$DBL= (0..7)
120 120 120 120 120 120 120 120 
##$DBP= (0..7)
150 150 150 150 150 150 150 150 
##$DBP07= 0
##$DBPNAM0= <>
##$DBPNAM1= <>
##$DBPNAM2= <>
##$DBPNAM3= <>
##$DBPNAM4= <>
##$DBPNAM5= <>
##$DBPNAM6= <>
##$DBPNAM7= <>
##$DBPOAL= (0..7)
0.5 0.5 0.5 0.5 0.5 0.5 0.5 0.5 
##$DBPOFFS= (0..7)
0 0 0 0 0 0 0 0 
##$DE= 6
##$DECBNUC= <off>
##$DECIM= 24
##$DECNUC= <off>
##$DECSTAT= 4
##$DIGMOD= 1
##$DIGTYP= 9
##$DL= (0..7)
0 120 120 120 120 120 120 120 
##$DP= (0..7)
150 150 150 150 150 150 150 150 
##$DP07= 0
##$DPNAME0= <>
##$DPNAME1= <>
##$DPNAME2= <>
##$DPNAME3= <>
##$DPNAME4= <>
##$DPNAME5= <>
##$DPNAME6= <>
##$DPNAME7= <>
##$DPOAL= (0..7)
0.5 0.5 0.5 0.5 0.5 0.5 0.5 0.5 
##$DPOFFS= (0..7)
0 0 0 0 0 0 0 0 
##$DQDMODE= 0
##$DR= 18
##$DS= 0
##$DSLIST= <SSSSSSSSSSSSSSS>
$$ [...]
##$SUBNAM2= <"">
##$SUBNAM3= <"">
##$SUBNAM4= <"">
##$SUBNAM5= <"">
##$SUBNAM6= <"">
##$SUBNAM7= <"">
##$SUBNAM8= <"">
##$SUBNAM9= <"">
##$SW= 24.0689170037331
##$SWIBOX= (0..15)
0 0 2 0 0 0 0 0 0 0 0 0 0 0 0 0 
##$SW_h= 4816.95568400771
##$TD= 16384
##$TD0= 1
##$TE= 0
##$TE2= 300
##$TE3= 300
##$TEG= 300
##$TL= (0..7)
0 120 120 120 120 120 120 120 
##$TP= (0..7)
150 150 150 150 150 150 150 150 
##$TP07= 0
##$TPNAME0= <>
##$TPNAME1= <>
##$TPNAME2= <>
##$TPNAME3= <>
##$TPNAME4= <>
##$TPNAME5= <>
##$TPNAME6= <>
##$TPNAME7= <>
##$TPOAL= (0..7)
0.5 0.5 0.5 0.5 0.5 0.5 0.5 0.5 
##$TPOFFS= (0..7)
0 0 0 0 0 0 0 0 
##$TUNHIN= 0
##$TUNHOUT= 0
##$TUNXOUT= 0
##$USERA1= <user>
##$USERA2= <user>
##$USERA3= <user>
##$USERA4= <user>
##$USERA5= <user>
##$V9= 5
##$VALIST= <valist>
##$VCLIST= <CCCCCCCCCCCCCCC>
##$VD= 0
##$VDLIST= <DDDDDDDDDDDDDDD>
##$VPLIST= <PPPPPPPPPPPPPPP>
##$VTLIST= <TTTTTTTTTTTTTTT>
##$WBST= 1024
##$WBSW= 4
##$XGAIN= (0..3)
0 0 0 0 
##$XL= 0
##$YL= 0
##$YMAX_a= 527197
##$YMIN_a= -606435
##$ZGOPTNS= <>
##$ZL1= 120
##$ZL2= 120
##$ZL3= 120
##$ZL4= 120
##$ABSF1= 10
##$ABSF2= 0
##$ABSG= 5
##$ABSL= 3
##$ALPHA= 0
##$AQORDER= 0
##$ASSFAC= 0
##$ASSFACI= 0
##$ASSFACX= 0
##$ASSWID= 0
##$AUNMP= <proc_1d>
##$AZFE= 0.1
##$AZFW= 0.1
##$BCFW= 1
##$BC_mod= 2
##$BYTORDP= 1
##$COROFFS= 0
##$CY= 11.3945322036743
##$DATMOD= 1
##$DC= 2
##$DFILT= <>
##$DTYPP= 0
##$F1P= 15.6554695791079
##$F2P= 12.8336369535428
##$FCOR= 0.5
##$FTSIZE= 0
##$FT_mod= 4
##$GAMMA= 1
##$GB= 0.15
##$INTBC= 1
##$INTSCL= 1
##$ISEN= 128
##$LB= 0.24
##$LEV0= 0
##$LPBIN= 0
##$MAXI= 10000
##$MC2= 0
##$MEAN= 0
##$ME_mod= 0
##$MI= 1.114404
##$NCOEF= 0
##$NC_proc= 0
##$NLEV= 6
##$NOISF1= 3.799351
##$NOISF2= 2.8
##$NSP= 1
##$NTH_PI= 0
##$NZP= 0
##$OFFSET= 15.70392
##$PC= 1
##$PHC0= -26154.23
##$PHC1= 14.98748
##$PH_mod= 1
##$PKNL= yes
##$PPARMOD= 0
##$PSCAL= 0
##$PSIGN= 0
##$REVERSE= no
##$SF= 200.130013532006
##$SI= 16384
##$SIGF1= 3
##$SIGF2= 2
##$SINO= 400
##$SIOLD= 16384
##$SREGLST= <1H.CDCl3>
##$SSB= 0
##$STSI= 0
##$STSR= 0
##$SW_p= 3612.71676300578
##$SYMM= 0
##$S_DEV= 0
##$TDeff= 0
##$TDoff= 0
##$TI= <>
##$TILT= no
##$TM1= 0
##$TM2= 0
##$TOPLEV= 0
##$USERP1= <user>
##$USERP2= <user>
##$USERP3= <user>
##$USERP4= <user>
##$USERP5= <user>
##$WDW= 1
##$XDIM= 8192
##$YMAX_p= 0
##$YMIN_p= 0
$$ End of Bruker specific parameters
$$ ---------------------------------
##NTUPLES= NMR FID
##VAR_NAME=  TIME,          FID/REAL,        FID/IMAG
##SYMBOL=    X,             R,               I
##VAR_TYPE=  INDEPENDENT,   DEPENDENT,       DEPENDENT
##VAR_FORM=  AFFN,          ASDF,            ASDF
##VAR_DIM=   8192,          8192,            8192
##UNITS=     SECONDS,       ARBITRARY UNITS, ARBITRARY UNITS
##FACTOR=    0.0002076,     1,               1
##FIRST=     0,             0,               0
##LAST=      1.7004516,     0,               0
##MIN=       0,             -606435,         0
##MAX=       1.7004516,     527197,          0
$$ Real data points
##PAGE= N=1
##DATA TABLE= (X++(R..R)), XYDATA
0@%%%%Qj6K4l2L2m0N6q0J04j20J44j80K22k66L14l70M36n14O02o96P99r18J053
27E62j200J364j547J746j963K207k476K767l089L440l827M252m715N225n786O406
43C366p092P852q700R653j0727J1946j3347J4980j6910J9225k2063K5646l0337
56a6508L6775m6228O1649r2403K48330n24654O5672O78538p52702l994M69350
67A23825m31074R4770O98226n15845j77610O94183k83240m71705M45911j94956
77a7515l83905M80763l636m57325M17604K71933l20102R3978R5817k25287J32892
88H5217l6445l68663J53570K41457k02262J0644J62367K3799J49177m0671k29626
99e1436J49545L4611k87919O9919M0329k20616K47427J69797l35181J70695L29018
$$ plain form
0 0 0 0 0 0 8 -8 16 -16 16 -24 32 -48 56 -64 80 -100 122 -144 170 -200 236 -278 324 -372 427 -491 562
27 562 -638 726 -821 925 -1038 1169 -1307 1460 -1629 1811 -2016 2236 -2479 2746 -3040 3366
43 3366 -3726 4126 -4574 5079 -5648 6298 -7049 7931 -8979 10246 -11817 13829 -16508
56 -16508 20267 -25961 35688 -56715 191615 -333039 -267367 411171 -341531 -345525 123825
67 123825 -307249 -212479 485747 -30098 -207708 486475 203235 -268470 177441 -17515
77 -17515 -401420 79343 75707 -381618 35986 307919 -12183 81795 177612 -47675 85217
88 85217 48772 -319891 -166321 75136 -127126 -116482 45885 69684 218861 178190 -51436
99 -51436 98109 132720 -155199 -85280 -44951 -265567 -18140 151657 -183524 -12829 316189
110C16189k99816k2572J86032l38815N6381L25518m53315r6369O03998k02408
120G4823l16850M66044m8773l14213L49585j33795m36957M27142Q6412n29711
130c76293K93585L03876l85248K01506K87303m46813Q7587L88237m40496j70636
140b57392L86584j86163j42041K94467j62846p6860M02928j44347k94312L01753
150A21771K3435k82588J19844J1904j57271J91204L5045j86806J68586J09556
160A54680j51406N6852m816j50627J21781R629k21266J06023J31984j14387Q1229
171A9676N5285j22560J61346N8586k93627P1733J85884k33531j6447J73242j65211
182a05624N3620K36683k26488n7003L01912j62244j80842K31435j08698j62304
$$ plain form
110 316189 16373 -6199 179833 -158982 -102601 222917 -230398 -326767 277231 74823
120 74823 -242027 224017 175244 -138969 210616 76821 -360136 67006 153418 -376293
130 -376293 -82708 221168 -164080 37426 324729 -122084 -34497 353740 -86756 -257392
140 -257392 129192 -56971 -199012 95455 -67391 -144251 258677 114330 -179982 121771
150 121771 145206 -137382 -17538 -5634 -162905 28299 63344 -123462 45124 154680
160 154680 3274 60126 55310 -95317 26464 36093 -185173 -79150 52834 -61553 19676
171 19676 74961 -47599 113747 172333 -121294 -49561 136323 -97208 -113655 59587 -105624
182 -105624 -52004 184679 -41809 -98812 203100 40856 -139986 91449 -17249 -179553
192a79553K75689p0725k38565L05413Q4617k87158J53025J07758k44908J09558
202A5151Q7783k87288J02601K20263k47952o927K53785j31851m3027J81484j51330
213g308p4933K02760j17170j47705J72970j4007r8273J36004k4373r2477J51538
224H7026r535j55865Q0847L1603r8078N4544m653o9665J25109K6971j18381Q2551
236C2474N3086j02473M2248L377j18415Q5452N0355j49554O0865J14453j06133
247c4265L3857Q8411j30324L0482J24752j61458m2406J67052q8603o9232J46115
258F4381o1580o3244J62533o5917j37314J54045K050j60645R9878L9466j24861
269i1208J04636O2924j44243P5857J07820j40071j013R3678j04501p858Q9826
$$ plain form
192 -179553 96136 25411 -213154 92259 176876 -110282 42743 150501 -94407 15151
202 15151 102934 -184354 -81753 138510 -109442 -116369 137416 5565 -37462 144022 -7308
213 -7308 -82241 120519 3349 -144356 28614 14607 -83666 52338 27965 -64512 87026
224 87026 77491 -78374 2473 34076 -64002 -9458 -14111 -83776 41333 68304 -50077 32474
236 32474 85560 -16913 25335 28712 -89703 -4251 46104 -103450 -42585 71868 -34265
247 -34265 -408 88003 -42321 -11839 112913 -48545 -90951 76101 -12502 -81734 64381
258 64381 2801 -60443 102090 36173 -101141 52904 54954 -105691 -5813 33653 -91208
269 -91208 13428 76352 -67891 7966 115786 -24285 -25298 68380 -36121 -43979 45847
280D5847r8264j6049J27062n4119n1239R4979k4798m5169O5367m2658n5317P6823
292B2465j2429o1194N7283J1966l0293M8244j5886m5051N5180r917o6111L6766
304h977N672m0294M9669L300m6520O8085K3378p4154L4207K8880p0282K2870K4883
317B0717p8085L3258O6083p4461M271Q0853n1833j5892O4570n9160l1637P9840
329C8524m1700n7821Q0108J282n3894O0950N713o0142N1355J3174p9766K6444
341a5773L7953n9152J0727M4633l6056J2554M7298l8263j1368M2856k5595k9729
353a9915K1343j2339j2142K5761q450j1393L1020N954j6604M691k705n753K977
366B445j6300p262J7776m88j031J5054l696K212J7571j7855j8236J5897r999k0402
$$ plain form
280 45847 -52417 -68466 58596 4477 -46762 48217 23419 -21750 43617 959 -54358 22465
292 22465 10036 -51158 6125 18091 -12202 36042 20156 -24895 30285 20368 -45743 -8977
304 -8977 -3305 -43599 6070 9370 -37150 30935 54313 -19841 14366 43246 -27036 -4166 20717
317 20717 -57368 -24110 41973 -32488 -28217 52636 803 -15089 49481 -9679 -41316 38524
329 38524 -3176 -60997 19111 20393 -33501 27449 33162 -26980 24375 37549 -42217 -15773
341 -15773 22180 -36972 -26245 18388 -17668 -5114 42184 3921 -7447 35409 9814 -19915
353 -19915 1428 -10911 -23053 2708 -5742 -17135 13885 19839 3235 7926 5221 -532 2445
366 2445 -13855 -21117 -3341 -3829 -4860 10194 6498 8710 26281 8426 -9810 6087 -3912 -24314
380b4314J5834j092j1181K8505P168k1593K0835J4809k9171j219J0164k3015M34
393a3836J6194j9127N30L2529n781j5546J8997K157j8589L394l009j7667Q969
406a0785J2561j3448K052K3477J46q659R608l128j6491N696L43k3359M116K1697
420C826j1286l967K4419j793r612J5694r060k0781J7138j061k8569J5447J9027
433I422j8825R233J9805j8260L283J7250k7312j0806K1538j5538j2814K2186l101
446c939m302K5896l750j4514J8359l106k1524O163m875j3959J4994L5j1697K1521
460E302Q443j3252J1893j63j7012J0954n511k3991J8453Q811k2416J9345J7219
473A8075k1959J5685J3911l5609O814K0325l8873j340L1867k7482R47M2021k5176
$$ plain form
380 -24314 -8480 -9572 -20753 7752 14920 -6673 14162 28971 -200 -1419 8745 -14270 -13836
393 -13836 2358 -16769 -16239 16290 10509 -5037 13960 16117 -2472 922 -2087 -19754 -10785
406 -10785 1776 -11672 -9620 13857 14003 5344 14952 11824 -4667 1029 1372 -21987 -17871 3826
420 3826 -7460 -11427 12992 11199 1587 17281 8221 -12560 4578 3517 -25052 -9605 9422
433 9422 -9403 -170 19635 1375 4658 21908 -5404 -16210 5328 -10210 -23024 -838 -3939
446 -3939 -8241 17655 13905 -609 17750 14644 -6880 -717 -5592 -19551 -4557 -4522 -16219 5302
460 5302 13745 493 12386 12223 -4789 6165 654 -23337 -4884 3927 -18489 856 18075
473 18075 -3884 11801 25712 -9897 -3083 17242 -21631 -22971 8896 -18586 -17639 24382 -794
486g94r024M6749k4218l0815L9265j6168l7153L8063m889l6747M4565J0886m3462
499b3742L5044K0410m8162J8753K1005m8665J3903L1023m4500R199M3790l5298
511g240j816M1302l2576j1405L7298l3251j9448M1835k1695k1413M3319j1927
523B983k0615M2843j2485l1065L9533q217l9245L4058o16l6571L6565N506l9905
536b7231L7981J4760m8743K7741K1738n0714K0431K8004n1329J7654M1081n0988
548a9615O255M9780m6401p188N0891m3502j7437N7764l6008l0239O2273k0055
560F518l9580N7670j0468m6678N4288j594n7091M8049J4458n9397L6675K4553
572B7403n6537K9555L1012n9484K0023M2094n6628O464M7779m7601p75N0159m4593
$$ plain form
486 -794 -9818 36931 12713 -18102 21163 4995 -32158 5905 1016 -35731 8834 19720 -23742
499 -23742 11302 31712 -16450 2303 23308 -25357 -11454 19569 -24931 -15732 28058 -7240
511 -7240 -9056 32246 -330 -11735 25563 -7688 -27136 14699 -6996 -28409 14910 2983
523 2983 -17632 25211 12726 -18339 21194 12977 -26268 7790 7174 -29397 7168 12674 -27231
536 -27231 10750 25510 -23233 4508 26246 -24468 -4037 23967 -27362 -9708 31373 -19615
548 -19615 -13360 36420 -9981 -17169 33722 -9780 -27217 30547 -5461 -35700 26573 6518
560 6518 -33062 24608 14140 -32538 21750 20156 -36935 11114 25572 -33825 2850 27403
572 27403 -29134 421 31433 -28051 -8028 34066 -22562 -16098 31681 -15920 -16695 33464 -11129
585a1129r483N4936l8664k1861N3359k9350k5573N3204k5407l1268N8021j6229
597A0556m3145N3095m880m6921M6395k50n0177M8020J0535n8066M1968K4326o0021
610b8565L0733L0408o2247K2784M0791o2783J1088N2817n3840K13N6402m9519
622a1718r240O2299m7653k7665O7340l1733m0455O3025j6475m2482O0535q864
634A6914n2138N6747K924o1670M5366J5182o1153L8964K6937o1148L1141L9778
646C7844n9001J5567M1911n5317P091M3763n6002K82N6825m7577j3085O0751l3821
659g69k0731N4720l2373k7604N6789k8786l9438N9872j3715m5369N7971j924n1598
672c2955N2758P716o0087M0632J6660n9534L4614K3587n9972L4632L9104o4950
$$ plain form
585 -11129 -20612 34324 -4340 -26201 27158 -2192 -27765 25439 32 -31236 26785 10556
597 10556 -32589 20506 15626 -31295 15100 14850 -35327 12693 23228 -34838 7130 31456 -28565
610 -28565 2168 32576 -29671 -6887 33904 -28879 -17791 35026 -18814 -18601 37801 -11718
622 -11718 -20958 41341 -6312 -33977 33363 1630 -38825 24200 7725 -34757 25778 16914
634 16914 -35224 21523 24447 -37223 8143 23325 -37828 1136 28073 -33075 -1934 37844
646 37844 -21157 -5590 36321 -18996 -11905 31858 -24144 -23862 32963 -14614 -27699 33052 -769
659 -769 -21500 33220 847 -26757 30032 1246 -38192 21680 7965 -37404 20567 18643 -32955
672 -32955 19803 27519 -32568 8064 24724 -34810 -196 23391 -36581 -1949 37155 -27795
684b7795J9438N2958n9532j384N1989n1100q561N4456m6323j4881O4230l6568
696c073k7710O5617k5787m1156O0516j4760n1479N3121L11n1516M5980Q683m9695
709c0948M4667J4416n9954L7249K9131o4339J9091L9751n2762J0141M0897m6141
721a8801Q442M5014m7913j662N0931m5849j4933N5192l6989k5318N7572k3481
733B205l1932N3092j5164l4122N0348j4526m2890N3831l805n5831M8267J5531
745B5004n6342L4468K3327n1676K8149K5227n5297K3273L5452n7979J2395M8130
757C4131n2743j537N4675m2443j4485N2877l2685k0749M9079k8770k4601N3611
769B6360k3812l6619N6630p938m7525M6209O598m6334L4628J0014m3842L2631
$$ plain form
684 -27795 -8357 44601 -14931 -16315 35674 -15426 -23987 30469 -15854 -30735 33495 -3073
696 -3073 -30783 34834 9047 -32109 28407 13647 -37832 15289 15600 -35916 10064 18747 -30948
709 -30948 13719 28135 -31819 5430 34561 -29778 -10687 29064 -23698 -13557 27340 -18801
721 -18801 -10359 34655 -13258 -14920 36011 -9838 -24771 30421 -6568 -31886 25686 2205
733 2205 -29727 23365 8201 -25921 24427 9901 -32989 20842 17037 -38794 9473 25004
745 25004 -31338 3130 26457 -25219 2930 28157 -27140 -3867 31585 -26394 -13999 34131
757 34131 -18612 -20149 34526 -7917 -22402 30475 -2210 -22959 26120 -2650 -27251 26360
769 26360 2548 -34071 22559 14621 -32904 13305 19903 -26431 8197 18211 -25631 7000
781G000J3549m8351K9958K4237n1740J9822L4821m8072P210L8981m0126o91L7927
794B4525l5679l194M0066l6110r398M8062l1541k2534N0367j8788l1133M3559
806A8202j0097l1856L9428p615l5107M1301o79m2927L8731J1840m7334K9413K1591
819B4891m6262J9139K5840m2860J3078K9125m1536R042L6012m1083j50M3708l5291
832f347j3493M3762k4803j9983L8959j8605k0650L9686j5208k6665M1854o895
844A1612l5560L5912L161l7885K7653R392l5782K3240J3922l4579K0345J8310
856A9741l6347J5241K4041l7905O389L0359l2780k306L1803k5190m915L1025k3845
869d689q258L4132k2774j7345L5914j4629k3751L3468o395k5149L1009j127k8012
$$ plain form
781 7000 20549 -27802 2156 26393 -25347 -5525 29296 -18776 -11566 27415 -12711 -13402 24525
794 24525 -11154 -14348 25718 -10392 -19790 28272 -3269 -25803 24564 5776 -25357 18202
806 18202 8105 -23751 15677 8062 -27045 14256 13577 -29350 9381 21221 -26113 3300 24891
819 24891 -21371 -2232 23608 -19252 -6174 22951 -18585 -9543 26469 -14614 -14764 28944 -6347
832 -6347 -19840 23922 -881 -20864 18095 -510 -21160 18526 3318 -23347 18507 11612
844 11612 -23948 11964 15125 -22760 4893 14285 -21497 1743 15665 -18914 1431 19741
856 19741 -16606 -1365 22676 -15229 -8840 21519 -11261 -13567 18236 -6954 -11869 19156 -4689
869 -4689 -12947 21185 -1589 -18934 16980 2351 -21400 12068 5673 -19476 11533 10406 -17606
882a7606K7454L187l1001K3351P674l3364K0850J5445l4210J4608K2961l0603
894a1254O473K3312k7728K596K4350k7890k396K9839k2843r221L0906j5860j3105
907a2821K8531j3129j7413K7436q883k1588K5576k494k1953K4185K141k4263K1400
920F725P297k6876J4368J0608k4970J0707J2378k4006J0337J7991k3891M360K1480
933A6508k0783k068J9911j8819m860K1676j6106q318K3915j0346j1033K2102q018
946C761j4158K1247o161j9390J9645M43j9646J6417M776j7778J5607O572k0859
959i524J1932J0272k2065N790J2398j8729M254J5095j6966K207J8438j4814l490
972e202J7041j2808o391J5892j1752q160J8504o660j0862J7457k137j1452J4096
$$ plain form
882 -17606 9848 13035 -17966 5385 13059 -20305 545 15990 -18220 -3612 19349 -11254
894 -11254 -4781 18531 -9197 -6601 17749 -10141 -12537 17302 -5541 -14762 16144 284 -12821
907 -12821 15710 2581 -14832 12604 3721 -17867 7709 5215 -16738 7447 9588 -14675 6725
920 6725 14022 -12854 1514 12122 -12848 -2141 10237 -13769 -3432 14559 -9332 -4972 16508
933 16508 -4275 -6343 13568 -5251 -10111 11565 -4541 -12859 11056 710 -10323 11779 3761
946 3761 -10397 10850 4689 -14701 4944 5387 -14259 2158 6934 -10844 4763 11335 -9524
959 -9524 2408 12680 -9385 -3595 8803 -9926 -5672 9423 -7543 -5336 13102 -1712 -5202
972 -5202 11839 -969 -7360 8532 -3220 -11380 7124 464 -10398 7059 4922 -6530 7566
985G566k336j4001J2969L38j5971J0867N373j3173R243O619j3081Q103P855j5516
999e145L037R527j3290K56J0276j0469J158J2636r495k243J3091p630o091J0032
1013E650o510o588J1126m761p677J2604K6q731R422Q66r309P229K58j1063O302
1028a156M155r842M798O533p257L911N993q794J366O609r015k119O914n463j205
1043d572P449m102r96Q437l760m424O066k654n490M550j892m266O350N80m492
1058c216N602K168m796K612L62n511K202J157n458K104M073k934J536L677k650
1073I28N15K409m156j616K590k669j520K884n27J94L514q38j367K529p98l165
1089a093L16k15j570R58N95l68J980J714q26j17O18j033j388o91p07k29P03O60
$$ plain form
985 7566 5230 -8771 4198 4536 -11435 -568 4805 -8368 875 7494 -5587 2516 10371 -5145
999 -5145 -2108 7419 -5871 -5615 4661 -5808 -4650 7986 -1509 -3752 9339 1709 -4382 5650
1013 5650 -860 -7448 3678 -1083 -8760 3844 3870 -4861 4561 5427 -3882 3347 3605 -7458 -1156
1028 -1156 2999 -6843 -2045 4488 -2769 1142 7135 -1659 -293 6316 -2699 -4818 2096 -3367 -4572
1043 -4572 2877 -1225 -2221 6216 2456 -1968 4098 1444 -4046 504 -1388 -5654 696 1276 -3216
1058 -3216 2386 4554 -242 2370 2732 -2779 -577 580 -4878 -2774 1299 -1635 -99 3578 928
1073 928 1443 3852 -304 -1920 670 -1999 -3519 -635 -1162 -968 2546 1708 341 2870 2072 -1093
1089 -1093 -777 -992 -2562 -1604 -1009 -1377 603 2317 1491 1374 1992 959 -429 -1120 -1827 -2056 -1353 -693
1107f93%J127J931l90j167O57o44j995J58m64j148J906J154j299J959J735k018
1124H09K38P09l045j83J645k896M1L793j322l78L540j317j461K605k581k899L101
1141C99j516k750L933M64k259M202M40l835L082N55n476J830J556m499K491K938
1157A555l907K948L964n063P12L902n534j083M262m799q11O195l429j379P083
1172D616k618l474N685l054n079N666k180n691O852P41n727O532K131o568M757
1187B589J935q395L197L527q285K676N835o524K411O945o876L13P229p654k750
1202c827P347o049l205Q480l998l160R691k874n464Q502k322p855P021j353q221
1217g287P789J425q174P770M029q642N345L933r908L404M581j0459K652P680q754
$$ plain form
1107 -693 -693 434 2365 1975 808 1465 821 -1174 -1016 -1480 -2628 -722 432 -867 1092 2827 809
1124 809 1047 1756 -1289 -1472 173 -2723 -2682 1111 -211 -589 2951 1634 173 2778 197 -2702 399
1141 399 -1117 -3867 66 530 -1729 2473 2913 -922 2160 2715 -2761 -931 625 -3874 -1383 1555
1157 1555 -2352 596 4560 -503 209 4111 -1423 -2506 1756 -3043 -3854 2341 -1088 -2467 4616
1172 4616 1998 -1476 4209 1155 -3924 1742 -438 -6129 723 1464 -4263 2269 4400 -2168 2589
1187 2589 4524 -3871 -674 2853 -5432 -2756 3079 -3445 -1034 5911 -965 -652 6577 -1077 -3827
1202 -3827 3520 -2529 -5734 2746 -1252 -4412 5279 2405 -3059 5443 3121 -4734 2287 934 -7287
1217 -7287 502 1927 -6247 1523 5552 -3090 2255 6188 -3720 -316 4265 -6194 -3542 4138 -4616
1232d616J660R452p578l10R244q289l500R349p314n250J0133m275n123J1221k479
1247B325o724J0743j797r851Q443j72j0709P755K334j0077Q113N554j0512O020
1261A445O746j1341K642O735j1625J298Q867j0140K52J1497p882j642J1488p545
1275G95m659J0846p102p412J1066m082p761J1651j239p997J1408r0j0757R426
1289D093J411j2732P088L812j1707O610O717j1096N703Q534j1479K343Q770j1693
1303c626l61R828j0618j725J2239p800l420J2846n882n635J1561n875q071J1302
1317D763l891j0003J1641O4j0181J0838K337j0928Q795L219j2645O363N010j2751
1331g369N128P543j1699M323R926j1203J278J0775j0635k089J0591r512l356J1744
$$ plain form
1232 -4616 -2956 6496 -1082 -1392 7852 -437 -3937 5412 -1902 -7152 2981 -1294 -6417 4804 2325
1247 2325 -4399 6344 4547 -5304 3139 2967 -7742 13 2347 -7730 383 5937 -4575 1445
1261 1445 8191 -3150 -508 6227 -5398 -4100 4767 -5373 -5121 6376 -1506 -3148 8340 795
1275 795 -3864 6982 -120 -7532 3534 -548 -8309 3342 2103 -5894 5514 5424 -5333 4093
1289 4093 5504 -7228 -140 3672 -8035 -1425 5292 -5804 -101 8433 -3046 -703 8067 -3626
1303 -3626 -3987 5841 -4777 -6502 5737 -2063 -5483 7363 1481 -4154 7407 1532 -6539 4763
1317 4763 872 -9131 2510 2574 -7607 3231 5568 -5360 3435 6654 -5991 372 5382 -7369
1331 -7369 -2241 5302 -6397 -2074 7852 -3351 -2073 8702 -1933 -4022 6569 -2943 -6299 5445
1345E445p699m555J3297n242o993J2467l640r217J0868k321j0575J0521M19j0849
1359h074J0017L149j1257Q579M710j2705O026O391j2957L489Q298j1242K384R799
1373F607j0299R98J1126j0317k282J1731q898n109J1715o337o064J2127l983p207
1387f192J1796k376r093J0478j077j0913R657J496j1823Q575M611j1223O588N955
1401F459j0963M728O501j1806L011Q447j1389O97J0719r382j319J1217p736l328
1415d144J0873o931n329J0801n503o577J1326l425q043J1500q51r812R632R91
1429D508j0372P680K163j0626P229M094j1053O173O671j1126L608Q102j0634J071
1443b512Q642r533m68R486q265j742J0446p050l606J1005n862o225J0670l509
$$ plain form
1345 5445 -2254 -6809 6488 1246 -5747 6720 3080 -6137 4731 2410 -8165 2356 2775 -8074
1359 -8074 1943 5092 -6165 2414 7124 -5581 445 6836 -6121 -2632 5666 -5576 -3192 6607
1373 6607 -3692 -2694 8432 -1885 -4167 7564 -1334 -6443 5272 -1065 -7129 4998 1015 -6192
1387 -6192 5604 3228 -5865 4613 3536 -7377 2280 3776 -8047 528 5139 -6084 504 6459
1401 6459 -4504 224 6725 -5081 -2070 6377 -5012 -4315 6404 -2978 -4297 6920 -816 -4144
1415 -4144 6729 -202 -5531 5270 -233 -6810 4516 1091 -6952 4548 3697 -6115 3517 4508
1429 4508 -5864 1816 3979 -6647 582 4676 -6377 -204 6467 -4659 -1051 7051 -3583 -2512
1443 -2512 6130 -3403 -3871 5615 -2650 -4392 6054 -996 -4602 6403 541 -5684 4986 1477
1457A477p824R626j552p794R118j91q596Q747J498j0288P158L622j0519N024N311
1472D817r714L720O394r057K382P336q987Q41Q231q658j234R531p155l336R789
1487D900m912m482R043l906n217R056l333o710R052j169q322Q199J203q634O762
1502A530K586q684N417L479q949M523M569q959L370O244q753J357P743p668p96
1517b991P946o377j809P798n798k701Q547m853m448Q688k816n937P967j304o507
1532d595O980N4o975O254J210p501N612K526p888M485M187q056K764N395p229
1547b777J300N627o576N30O159o273q22P200n397k416P402l923l551O994k871
1562F06m309O650j919n144O434p30n799O028O68o423N171K116o883L781K926o383
$$ plain form
1457 1477 -6347 3279 1727 -6067 3051 2860 -5736 3011 4509 -5779 1379 5001 -5518 -494 4817
1472 4817 -4897 -1177 5217 -3840 -1458 5878 -3109 -2268 5963 -2695 -3929 5602 -1553 -4889 4900
1487 4900 -12 -4494 4549 643 -4574 4482 1149 -5561 3491 2322 -6000 2199 3402 -5232 1530
1502 1530 4116 -4568 849 4328 -4621 -98 4471 -4488 -1118 5126 -3627 -2270 5473 -2195 -2991
1517 -2991 4955 -1422 -3231 4567 -1231 -3932 4615 -238 -4686 4002 1186 -4751 3216 1912 -4595
1532 -4595 2385 2439 -4536 1718 2928 -4573 1039 3565 -4323 162 4349 -3707 -943 4452 -2777
1547 -2777 -1477 4150 -2426 -1896 4263 -2010 -2832 4368 -1029 -3445 3957 34 -3517 3477 606
1562 606 -3703 2947 1028 -4116 2318 1588 -4211 1817 2485 -3938 1233 3349 -3534 247 3173 -3210
1578c210K816L501o395K388M664o205R26N713n613n48N619m788j667N860l958
1593h97k307O043k834k955N899j940m096N666j126m998M977J86n250M360J220
1608A948n046L917J926n294K906K804n603J722L406n104R19M124m481K98M667
1623C109l865p32M626l530j745M607k933k462M809j692l018M696p32l317M104
1638A925l19m017L568K58m328L101J464m166K505K204l952J925K500m096R00K880
1654B352l959K36L252l317j64L790k723q24L847k244j724L417j855k235L344j107
1670H6k441L433k01k739L090K83l055K346O40l364J837J281l202J593J847k708
1686a274J119K094k663L85K262k689l21K357k090o47K652j467q36K706j267j307
$$ plain form
1578 -3210 -394 3107 -3288 -900 3764 -2441 -1515 4198 -1415 -1963 3656 -1132 -2799 3061 -897
1593 -897 -3204 2839 5 -2950 2949 1009 -3087 2579 1453 -3545 1432 1618 -3632 728 1948
1608 1948 -3098 819 2745 -2549 357 3161 -2442 -720 2686 -2418 -1499 2625 -1856 -1558 3109
1623 3109 -756 -1488 3138 -392 -2137 2470 -463 -2925 1884 192 -2826 1870 1138 -2179 1925
1638 1925 1606 -2411 1157 1415 -2913 188 1652 -2514 -9 2195 -1757 168 2668 -1428 -528 2352
1654 2352 -1607 -1371 1881 -1436 -1600 2190 -533 -1357 2490 246 -1478 1939 84 -2151 1193 86
1670 86 -2355 1078 877 -1862 1228 1511 -1544 802 1442 -1922 -85 1196 -2006 -413 1434 -1274
1686 -1274 -155 1939 -724 -339 1923 -766 -1087 1270 -820 -1467 1185 -282 -1118 1588 321 -986
1702i86K389q84j777J992n60j800J999J18j863J887O04k044J407O88k119R96Q39
1719H86k085O92J319j721M69J588j523O8J578j426m26J492j289o34J586p41p14
1736h81J598n28q34J437l65j113J218j70j257J049J57j105Q84M58j078O54N84
1753G08j072L61N37r86K04O87q47N3Q54p35o9P70n03k54P43m46l12N64k05m87
1773d35O56r7m14M21ql70L65Q4n20M00J17l41J29J97l47J18J43j75j5J61j43k2
1795i6J04M9j9L6o1o9j7J03j07j04J37Q4r1J17J05k28J53R1l00Q0J16l04Q5K79
1819A43k51LM01l10o2N15m25k40L89k30l49N37o5m27O25J9n74N72J17o73K56K91
1841B62q13M10L94o94L19O16o74J06O51p87J5O66p77j97R36o04l53J075m53m61
$$ plain form
1702 -986 1403 519 -1258 734 174 -1626 373 491 -1372 515 1119 -925 482 1170 -949 47 886
1719 886 -1199 -507 812 -909 -440 1148 -375 -307 1271 -155 -581 911 -378 -1012 574 -167 -881
1736 -881 717 189 -645 792 427 -686 532 362 -895 154 311 -794 90 548 -530 124 708
1753 708 -364 -3 534 -452 -248 439 -408 -355 499 -236 -305 465 -38 -292 451 5 -307 257 52 -435
1773 -435 221 124 -290 131 123 -247 118 202 -318 82 199 -142 -13 184 -163 -45 98 -77 -92 69 -74 -96
1795 -96 8 57 38 74 13 -56 -73 30 -77 -181 -44 40 -51 66 171 -57 96 187 -113 -33 83 -221 -136 143
1819 143 -108 -105 296 -14 -76 439 14 -226 163 -67 -416 121 56 -371 254 273 -301 271 388 -285 -29 262
1841 262 -551 -141 253 -441 -122 494 -180 -74 577 -210 -195 471 -306 -503 433 -171 -524 551 98 -363
1861c63R87m82o55R35l26q27R25k0r63J013J45r66R39K97j078M85O10j271M43
1880a72O21j233M79J037j103K02J155j114j91J162j070m64J336r54n67J451n06
1897F9p52J408k39j098J301l42j222J163N7j411J161M51j386J056P24j535P57
1914A62Q87j664L39J095j578K47J328j400jJ668j338k55J665j183p02J593r34
1931g1j030J766n67j164J651j23j302J497j4j518J292K17j757J200O52j814R68
1948a17J037j656O32J242j776L91J336j747J5J603j508k81J842j278m82J839j036
1965E6r07J773p51j251J785m89j398J823j66j554J580K54j719J313M67j838J198
1982A76O69j874Q42J211j851N42J438j759K52J520j707j43J736j446n15J865j166
$$ plain form
1861 -363 624 142 -513 422 96 -731 194 174 -789 224 369 -597 342 639 -439 46 656 -615 -172
1880 -172 449 -784 -305 732 -371 -169 986 -128 -319 843 -227 -691 645 -309 -876 575 69
1897 69 -683 725 486 -612 689 347 -875 288 345 -1066 95 546 -840 216 940 -595 162
1914 162 1049 -615 -276 819 -759 -512 816 -584 -585 1083 -255 -510 1155 -28 -730 863 -71
1931 -71 -1101 665 98 -1066 585 462 -840 657 643 -875 417 634 -1123 77 729 -1085 -117
1948 -117 920 -736 -104 1138 -638 -247 1089 -658 -643 960 -548 -829 1013 -265 -747 1092 56
1965 56 -851 922 171 -1080 705 216 -1182 641 475 -1079 501 755 -964 349 816 -1022 176
1982 176 845 -1029 -187 1024 -827 -285 1153 -606 -354 1166 -541 -684 1052 -394 -909 956 -210
1999b10p34J986q54j118J857n48j425J711k94j527J582J06j650J502M50j822J289
2016C01O43j836Q70R47j855O60J266j775M32J420j606O1J611j505k97J731j356
2033b88p15J872r46r35J839o83j025J711l53j466J682j26j684J425K18j614J273
2050A85N18j618J072Q20j720P36R93j720M29J268j654J63J482j446j06J593j128
2067a33m61J601j090o89J668q31j125J728l92j185J477j30j320J377R6j563J244
2084B72L51j514R69O23j574Q45Q60j526N55J060j458K02J215j323l4J363j291
2101d05j83J457j058n08J503p59p38J368n61r46J372l24j090J362o1j203J189
2118D15J59j389J059L62j351P28O79j351O06P88j318M36J002j326J36J154j063
$$ plain form
1999 -210 -944 1042 188 -930 927 379 -1046 665 371 -1156 426 532 -1118 384 834 -988 301
2016 301 944 -892 -22 925 -930 -270 996 -779 -347 1073 -533 -472 1139 -366 -663 1068 -288
2033 -288 -1003 869 -77 -1012 827 144 -881 830 477 -989 693 567 -1117 308 526 -1088 185
2050 185 703 -915 157 977 -743 -7 986 -734 -305 963 -691 -528 954 -492 -598 995 -133
2067 -133 -594 1007 -83 -772 896 65 -1060 668 276 -909 568 438 -882 495 591 -972 272
2084 272 623 -891 78 701 -873 -28 832 -694 -139 921 -537 -335 880 -443 -477 886 -405
2101 -405 -588 869 -189 -697 806 47 -691 677 116 -830 542 218 -872 490 429 -774 415
2118 415 574 -815 244 606 -745 -17 662 -689 -83 705 -613 -177 825 -501 -365 789 -274
2135b74j98J227r71k86J265r11m12J244o03p28J127k21r60J117k21r10J016N5
2153C56r49P97K82j074Q02L32j179O44O50j222L97P40r89K40Q08r59Q4Q84q39
2172a95j79J037p95l08R48n76n05J002l64o39R54j97o48P85j23p37Q05K5q68O36
2192E8K82q54N70L44q18L57N50q63K58O06p78O0P66p80J3P31o59j07P25n16l02
2213c57P15k88l98O55k84m96P53q7o35N63O1n25N14J3o01N49J71p57M38K79n76
2234b93K37L66n41J75M31n64K4N73m70j39N79n21p8N18l91j81M91j65l32M82j59
2255D2k53M13j18l64L10J24m21L29R0m26L91L3m21K28K97m65J39K57l13J9K71
2276A62m29J18L55l27p5L82k86j1K94k36j24L48j75k25L30r0j57K49q6j98L32
$$ plain form
2135 -274 -472 755 -216 -502 763 -148 -560 684 81 -647 480 259 -701 416 195 -715 301 356
2153 356 -593 204 486 -588 214 546 -633 11 661 -561 -164 576 -413 -173 635 -324 -240 644 -195
2172 -195 -374 663 -132 -440 508 -68 -573 429 65 -574 380 183 -465 320 197 -540 265 290 -578 58
2192 58 340 -514 56 400 -418 -61 489 -374 -116 490 -288 -228 538 -242 -229 502 -157 -264 461 -55 -357
2213 -357 358 70 -328 327 43 -453 300 213 -422 141 202 -323 191 204 -397 152 323 -434 4 283 -293
2234 -293 -56 310 -231 -56 375 -189 -165 408 -62 -201 378 -143 -221 297 -94 -275 216 51 -281 201 42
2255 42 -211 202 84 -280 30 154 -267 62 152 -274 117 150 -271 -43 254 -211 -72 185 -128 -109 162
2276 162 -267 -149 206 -121 -196 186 -100 -111 183 -53 -177 171 -4 -229 101 11 -146 103 17 -181 151
2297A51o7k97K29P0j68M1J51k20J46J3k36J36K24k06k4J17j66J51R9k15MK13j35
2320A1n9J26j92N2J39p1j61K54j13r1J32M8j23J56j14j21J59k6j05L9K01j72M1
2343A0L6j09J67j9j93L6Q7r4P9m3m8J42N0p4M4Lj17N2k1J6q1J43j56N9R1n1l6
2370b7J27j05J0Q4k07J6J43j28L6J12q4K1J59j62k1O0m6p2N4Nm0Q1l2NR0M7r9
2397B7K7n6p4N4km5oJ00o5P5K9o0K9Rj14K0J46j86JK00j59P0J34j51L5J33j52
2424A9q6N6m9k4R5k1n3J28m9l2J23J2j67M0pj02J01M8j09M3J23m1j5Qj07J07j9
2451B2j33j1J95j76J07K0j7R6j2r4k2P5o5m6Kk3Q3P0k9j07J28O4j14j8m0k6o7
2478a38R3q7Q7J08J0l6Q6m0m4p1o0J5J29j59lJ14R0o3K7j9M3L0j54JK8M6j68M6
$$ plain form
2297 151 84 -213 16 86 -82 -41 110 -110 36 49 -187 -51 173 -33 -57 60 -106 45 144 -71 -67 146 11
2320 11 -48 78 -114 -62 77 6 -155 99 -14 -105 27 75 -48 108 -6 -127 32 6 -99 -60 141 -31 10
2343 10 46 -63 104 85 -108 -72 15 -79 0 -43 -91 51 101 27 71 74 -43 9 -12 4 -77 66 -90 -31 60 9 -27
2370 -27 100 -5 5 89 -118 -102 41 -87 -51 61 -23 -2 157 -5 -26 34 -12 -84 -30 -25 -65 16 -16 -11 79 126 27
2397 27 54 -2 -76 -22 -24 -69 -75 25 -40 35 64 4 33 42 -72 -52 94 -92 -91 109 -50 20 154 3 38 171 19
2424 19 -67 -11 -60 -84 11 -10 -63 65 16 -16 107 119 -48 -8 -15 -117 -16 32 -77 -34 89 48 33 41 -66 41 22
2451 22 -111 -122 73 -103 4 24 7 103 91 -3 -25 50 -15 -61 -59 -82 1 71 42 -65 63 127 13 -5 -45 -71 -138
2478 -138 -45 -132 -45 63 73 37 123 83 39 -32 -92 -77 52 -107 -110 4 94 31 58 39 82 112 -42 -41 -13 33 -135 -89
2506h9Q1O9OJ4l1jK9ok29K1J33rm9k1J07J1R0j09j6N7q3j17J20j0n0J15o2j3K02
2535A60j07j00L0L1j12J07o8j39J14J50j21P9J30j09j6J06j67r2J54r1j14J99
2557B4j4l7J09n9l9K05j83j65J87K3j82Q1Q0j15K25j1k51J60J36k96J13K5k42
2580b26J90J35l33K34J81k44J8K58k17m9J74k72o7L56k30j09L60j00j79L34j42
2601G2k34K90p1l26K98O9l26K86Qk57L05K10n59K68K09m27R9K10l57O2L70l36
2623a37P0M02l25j08L15l23p9L69k53k69N56j53l38N48j30l55M58j26m65N01K2
2644A80n64M10Q1l89L20K31m87K42L88o86J93M13n96J18L86n32J20M95m51o1N73
2665C84l75k30M82l29l08O94l51l91O94pm86M97p7n67N70K6o66M29L07p93M61
$$ plain form
2506 -89 -8 61 67 81 50 49 78 72 -157 -136 -3 -12 -61 -82 25 36 126 17 1 58 -25 -142 -22 -32 -82 33 -29 -42 160
2535 160 53 -47 -17 14 -98 9 -59 -198 -84 66 -55 24 154 45 29 135 -32 -124 30 -61 -175 24
2557 24 10 -27 82 23 -16 189 6 -159 28 51 -131 -50 30 -85 140 129 -122 38 174 -122 -9 16 -226
2580 -226 -36 99 -234 0 181 -63 -45 213 -4 -53 121 -151 -218 138 -92 -201 159 59 -120 214 72
2601 72 -162 128 57 -269 29 98 -228 58 66 -191 114 324 -235 33 242 -185 -86 124 -233 -171 199 -137
2623 -137 -67 335 10 -98 217 -106 -185 184 -69 -338 218 65 -273 275 145 -210 248 122 -343 158 180
2644 180 -384 26 107 -282 38 269 -218 24 412 -274 -81 332 -264 -146 240 -292 -172 323 -128 -189 384
2665 384 9 -221 261 -68 -376 318 -33 -424 270 263 -223 274 197 -370 200 226 -440 -11 296 -497 -36
2686c6M24p03L21M88p24J40N47p64P6N93o02q1P70n83j63Q73n83l25P70l96m76
2707d34P08k58n15P21o6o16O42K29p80O20J80r01N41K93r11M55N19q88L07O70
2727E16p88J42P45q22n5P44o65k64R11o38l20J023m54n37R60l00o73P88j06p50
2747e43P62p2p44Q96J44r81O05M97j006N07M60j028L14P07r37J82P57p85N0Q75
2767F60q44j21R85q00l68R59n53n31J023l99n60J013j40q21R41j04r91Q40Q4r76
2787g03Q03L05r68O10N28r47M25N77j130L58P44j133J13J033r24p4R77p15k06
2806c27J059q43l32R81n25p19J053l28p08J083m8q98R76M7j089Q85J31j014O78
2825F2L46j127O95O54j138L70R31j121J96P06r76QR73r48j50J147o95m53J162
$$ plain form
2686 -36 388 -315 6 494 -230 -90 457 -307 -231 362 -240 -321 449 -134 -297 576 -7 -332 438 42 -434
2707 -434 274 16 -499 222 156 -460 182 411 -369 251 431 -470 71 364 -547 -92 427 -461 -154 516
2727 516 -272 -130 615 -207 -262 482 -183 -447 464 -174 -494 529 75 -462 498 198 -475 313 207 -543
2747 -543 219 147 -597 299 443 -538 67 564 -442 65 525 -503 -189 518 -419 -237 520 -265 -215 660
2767 660 -184 -305 680 -120 -488 471 -82 -613 410 11 -549 464 324 -497 444 340 -651 189 273 -703
2787 -703 100 405 -563 47 575 -372 53 630 -500 -142 602 -531 -418 615 -309 -383 594 -121 -327
2806 -327 732 -111 -443 538 13 -706 347 19 -689 394 346 -552 424 471 -618 267 398 -616 62
2825 62 408 -719 -24 630 -508 -138 793 -328 -132 574 -402 -394 579 -369 -519 628 -67 -520 642
2844F42n76n13J050m58p53R25k21q42R90L2q76R36J21j033Q41M06j241N36N48
2863E14j089L85O98j051L84Q82j088R5J067r67k79J081q50l60J158o83m84J202
2881F15n23n45J003l86q10J158l40q79Q70J18r15Q16K25j012Q16L82j102N79N59
2900F29j162L51O76r52J96Q69r10M4R83q75k45J060p98l73J038o15n91J208m28
2919A05p09J014j32p87R65k13r32R57R8j056P22M05j008O33M91r97M79N77j032
2938d20K30P90j028Q7Q64r08M6J021p86k87J078o59m72R32n44n37R72l38o88J054
2958D07p8q47Q29P6r30P89J68j006O33L51r60N02N92r29M74M97q86J84O85q51
2978c00j06Q47o22j75Q47o69k11R81m94n00Q16l13o56R15k77o53Q10J1p16P12
$$ plain form
2844 642 66 -447 603 145 -608 317 96 -746 244 276 -600 336 457 -576 265 671 -570 -34 514
2863 514 -575 -190 508 -543 -159 723 -365 -270 797 -170 -449 632 -218 -578 580 -103 -587 615
2881 615 92 -453 550 164 -646 512 172 -707 163 281 -634 182 407 -605 211 593 -509 70 629
2900 629 -533 -182 494 -458 -262 607 -303 -259 724 -151 -396 664 -134 -507 531 -84 -675 533 105
2919 105 -604 410 278 -509 456 243 -689 268 366 -690 32 437 -571 62 553 -444 35 612 -420
2938 -420 -190 600 -428 -341 523 -385 -339 682 -104 -391 687 28 -444 488 -56 -593 379 41 -647 407
2958 407 329 -518 311 387 -543 246 414 -592 41 392 -568 -66 526 -403 71 568 -318 -134 551 -300
2978 -300 -406 441 -181 -356 491 -178 -389 592 98 -402 414 101 -555 360 83 -570 240 251 -465 247
2998B47J38p78N49K41q46M43M41q70L14O65q67K02N50o31N6O93p55q7P21n71k94
3019d39Q67m20l78Q30m22n00P91j63o15P06p7o31O29O1o74N29K31o91M68K88p21
3040c31K86M47p58K42M73o39Q8N51n47nN52m88j28O19m98k99O82j89m52O97k74
3061B9l77O47j16m64M12O0n31M38J58o12M08K31o41M17K97n37J57K93n16J99L43
3082B95m99J7M41l12q1M04l21j04M44k97k44M56j22m52N17o3l18M08j8m12M63
3103B02m4l59K54J05m55K37K04m06J91K76k94j0L58k92k3K64l69P9K25k65j4L51
3125B15k07j40L60j66k05K75j06k07K51Mk44K23L7j70O7J37k49J47J59k84L1K37
3147A65k21L3J40k14M5J96j96K0J49j90l0J70j33J5J20k9q9Q8O6j62O6j2j08J24
$$ plain form
2998 247 385 -393 156 397 -449 -6 435 -435 -121 544 -323 -121 429 -202 -146 547 -208 -295 426 -145 -439
3019 -439 428 8 -370 460 38 -462 329 166 -449 257 180 -451 178 239 -435 94 325 -366 102 390 -331
3040 -331 -45 402 -356 -114 359 -280 -192 359 -188 -193 359 -129 -257 362 -136 -435 247 58 -394 303 29
3061 29 -348 299 183 -281 131 191 -340 98 256 -356 52 283 -358 59 356 -181 -24 269 -247 -48 295
3082 295 -204 -187 254 -58 -139 265 -56 -160 284 -13 -257 199 77 -375 142 79 -239 169 151 -261 202
3103 202 158 -201 53 158 -297 -60 144 -262 -71 205 -89 -99 259 -33 -56 208 -161 -82 143 -122 -136 215
3125 215 8 -132 228 62 -143 132 26 -181 70 74 -170 53 90 -80 -13 124 -125 22 181 -103 -72 165
3147 165 -56 -23 117 -97 -52 144 -52 -32 117 -73 -103 67 -66 -51 69 40 -49 39 105 -57 9 -3 -111 13
3171A3J1j29R3LL9k8rqJ00k8n7l3M8o7J1L1K2O7p0n7O8M1k1m8r3P8K5r2J03K7
3201D0n6P8J6j28J07J9j29j2Q0o8j6J31r6m6J72j60L9J19p9j17R3k2j01J72Rj88
3227a43J52J06k03R8K0j56J72j4k03J17K54k60%J83j77L9J84k55l7K30j58j14
3249a65K60o4j30K85j46j19K52j67j94K58Qk76K84M3l18L45Lk85J35K23m17K00
3271A5J34l65J85J74l01Q0L01k77K0K61l30m4L45k87j07L57j97j23L90j87j88
3292a44M60k29l54M82j21l72L35N0m14M15J31n16M03K07n66K06K31m74J42L58
3312B30m04N9L84l91J5M87m07j47M32l49j94N00l36k05N73j63l63N42p7n00N77
3333B63j14n55N00R3n38L25K12n53M08L22o05K39M60o85K4N05o46R3N57l95j52
$$ plain form
3171 13 24 -105 -12 -9 30 2 -7 -15 85 57 0 -33 15 -52 -41 -10 12 79 9 -48 20 61 40 -8 -101 -23 2 -90 13 40
3201 40 -16 62 78 -50 57 76 -53 -65 15 -53 -69 62 -34 -80 92 -68 -29 90 11 -106 -13 -35 -136 36 45 -143
3227 -143 9 115 -88 10 30 -126 46 32 -171 -54 200 -60 -60 123 -54 -15 169 -86 -123 107 -51 -165
3249 -165 95 31 -99 186 40 -79 173 6 -188 70 78 -198 86 129 -189 156 159 -126 9 232 -185 15
3271 15 149 -216 -31 143 -158 -78 223 -54 -34 227 -103 -147 198 -89 -196 161 -36 -159 231 44 -144
3292 -144 316 87 -267 215 94 -278 57 107 -307 108 239 -277 126 333 -233 -27 204 -270 -128 230
3312 230 -174 -115 269 -122 -107 380 -27 -174 258 -91 -285 215 -121 -326 247 84 -279 263 186 -314 263
3333 263 149 -406 94 187 -351 -26 186 -367 41 363 -242 -3 457 -228 -204 301 -345 -252 305 -90 -242
3354b42N97l90j45N45l60k62N54k90m58O60j24m56N24L1m96N19Q6o70L85K12o19
3375c99L39L34o66L36L92o08K28M75o66N1N74n63j22O44m91j64P63n18k70O93
3395C62l08l82O67k20m97O12j46n71P11po21N51J97p15M92K16p55L48L89o47K16
3416a08N23o62R2O15o55k5O66o22j77P24m70l32P28l24m07Q04k22n61P72j37o61
3437d39O30l7o50N77J71p16N21K89o59L47M84q96K59M88p90J45O49o32mP25o47
3458a85j5P25n92k88P95m86m13Q77m30m45Q05k58n36P89p4o86N99N3p43N75J72
3479B39o79M91L42p47L75M81p53J91M84o70M1N83o36m3O84m93k00P43m85l15Q03
3500D36m51m68P75k45n25O94p0n12O64j1o52N76P2o07L70J66o41M04M49q15L70
$$ plain form
3354 -242 355 -35 -180 365 5 -257 297 7 -451 209 85 -371 153 184 -312 207 293 -377 8 220 -399
3375 -399 -60 274 -392 -56 336 -272 -44 431 -235 -184 390 -173 -295 349 -142 -306 457 -61 -331 362
3395 362 54 -328 339 119 -378 234 88 -483 228 221 -400 151 348 -367 125 341 -414 -66 323 -324 -108
3416 -108 415 -247 -155 460 -195 -220 446 -176 -353 371 -99 -431 297 -27 -434 370 148 -413 359 222 -439
3437 -439 191 154 -496 81 252 -464 57 346 -313 34 518 -378 -119 369 -421 -276 373 -259 -263 462 -185
3458 -185 -200 525 -67 -355 440 -46 -459 418 -12 -457 348 90 -446 343 269 -417 182 235 -508 67 239
3479 239 -440 51 393 -354 21 502 -251 -60 424 -246 -205 378 -258 -301 383 -110 -310 433 -52 -367 436
3500 436 -15 -483 292 47 -478 216 146 -366 298 287 -365 211 283 -324 46 212 -429 -25 424 -391 -21
3521b1M97p48J78N48o24q5O20o29o0P33n13j88P46n26k65Q07m00m72O80j17o38
3542d77O36K7o25N74J32o58O22K17q46M19L35p48K76M36o66K09N52o20M2N98n57
3563a22j24O85n77j78P02n34k30P22k46m98P51j77n53O45m5o14O12q5n71N40K17
3584C20o91M59L56p59L36L90p06K36L98o23Q2N29n78J6P15o13j59O65l99k43N73
3605C04l37l15O25k32m87P18j39n11N44L1n67N64N2n95L98K56p22L44L86o67L11
3626c9M44o09J40L88n20qN29n17q1O01m22p3O30m07l15O14l46m08N81j21m45O24
3648B40l2n45N07J07n92N12on52M27K24o80L19L86n96K18M82o11J14M96n72K1
3669a33M50m42k09N80l18j83N67k35k85M45j54m15N05q8m63M85L1m25L54J89n12
$$ plain form
3521 -21 476 -272 -94 454 -170 -255 365 -264 -324 409 -104 -292 454 -72 -337 470 70 -402 278 161 -477
3542 -477 159 186 -439 135 267 -391 231 448 -398 21 356 -392 -116 320 -346 -137 415 -205 -163 435 -122
3563 -122 -246 439 -138 -316 386 -148 -378 344 98 -400 351 174 -379 266 221 -393 219 134 -437 103 320
3584 320 -371 88 444 -315 21 411 -295 -59 339 -284 -202 327 -251 -235 480 -133 -292 373 -26 -269 304
3605 304 -33 -348 277 45 -442 276 137 -374 170 201 -366 198 250 -345 53 309 -413 -69 317 -350 -39
3626 -39 405 -204 -64 324 -196 -204 325 -192 -273 328 -94 -167 463 56 -259 355 9 -399 182 61 -384 240
3648 240 208 -337 170 277 -315 197 191 -361 66 290 -390 -71 315 -281 -63 419 -192 -78 418 -154 -133
3669 -133 317 -125 -334 246 -72 -255 312 77 -208 237 83 -332 173 85 -378 107 138 -287 67 256 -256
3690b56L57K29n56K55K08m64J40L32m78Q7M42m22L4M01l74j39M91l75j70N01k79
3711c6k65N02j83k57M54n0l99M08m2l74L02N2m01K90K32m98K53K75m05K14J20
3732A92l82J57K82l91LL92m40N7L31k41l1L10k31j29L04k15j66L18m6k41K96k8
3754A01k61K68R6l79K29Q6l05J56J97l95K07K71l73J00J57j93j4J81k73P3K13
3775A42j95j03L09j13j40K30j37o9J61p7j60K07rk19K80l5j16J50mk33J82O3k22
3798a08J07Q3j96P9J52k85J59J66j54o8K10j90mJ88j94L3J38j32j01K43q7j46
3820a07J31M5j61J22J7j36J47J7j43J20J5j64J18N3j32P4J03k05Q5O7j63P7J18
3843I8q6l2R5p1j36J49m4p1J41n3m6P4K3p1O1Rj16J08l8n5Q8mq2L8J8j2k0O9o7
$$ plain form
3690 -256 101 330 -226 29 237 -227 -87 245 -233 -146 296 -126 -92 309 -65 -204 287 -88 -258 243 -36
3711 -36 -301 201 18 -239 215 165 -234 174 132 -242 60 112 -289 1 233 -265 -12 263 -142 72 192
3732 192 -190 -33 249 -142 -139 253 -187 -130 201 -40 -71 239 8 -121 183 -32 -198 120 74 -167 129 101
3754 101 -160 108 204 -175 54 140 -165 -9 188 -207 0 271 -102 -2 155 -38 -52 129 -144 -71 142
3775 142 -53 -156 153 40 -100 130 -7 -76 85 8 -152 55 46 -173 107 72 -44 106 102 -131 51 114 -108
3798 -108 -1 82 -114 -35 117 -168 -9 157 3 -65 145 -45 -49 139 -55 -22 116 -16 -117 126 39 -107
3820 -107 24 69 -92 30 47 -89 58 75 -68 52 67 -97 21 74 -58 16 119 -86 -1 66 -97 -20 98
3843 98 12 -20 75 4 -132 17 -27 -98 43 -10 -56 18 41 -30 31 40 -76 32 -6 -61 27 23 -59 -21 -3 -15 -35 34 -33
3872c3J3O5n4L9j5j2K8j6j7qLK3k2J7J7ol4J7m1M8j0Kl1O4%l8KjJ7k1nl0K5J9
3906El5j4J36q6j1j0j4L7M0m6n0P2%kK2j1po4R5r2N8n2oO5R5j16j8O3n8k4O8p7
3938c7m8J26r1k4J10p7PJ54j14p0R7k6j69J75j7m0J18K6j94R0P0j14O3N9k05N1
3964h0J57j29m4J99q5o7J73j08r7J84j36j30K17l8j13K24n0j59J94l4k25K17k9
3987D1j76J90n0m6P0K8k45J39J35j34M0J04k11N3J03r6k8J67j15m8J90r9j13K31
4011A30j62j00K00q3j55K78n1k32L06k3k71K35L5k60K25L9k12N0J83k56J46P7
4033I9k29Q5K73l31J6K48k63jK16j38j24L26j69j28K71j09j32K42j02k14K11k3
4055B4k19K77k1j68J88Q8l75K79J04l21J21J16k03M0K30k78L3K95l56j5M00k83
$$ plain form
3872 -33 -20 45 -9 30 15 3 31 15 -2 -10 -7 16 -6 11 28 22 -12 5 -36 12 2 4 -27 37 37 -1 1 0 17 -4 -9 -39 -14 5
3906 5 -30 -44 92 6 -5 -15 -29 8 48 2 -48 24 24 22 44 33 26 -38 57 -35 23 -29 -35 30 125 9 -9 54 -4 -28 40 -37
3938 -37 -85 41 -50 -74 36 -41 -34 120 6 -64 33 7 -162 13 -4 -44 74 100 -94 -4 66 -48 15 74 -131 -80
3964 -80 77 -52 -96 103 18 -49 124 16 -81 103 -33 -163 54 16 -97 127 77 -82 112 78 -147 70 41
3987 41 -135 55 5 -41 29 57 -188 -49 86 -48 -8 96 -115 -62 41 -55 -83 84 -31 -79 111 12 -101 130
4011 130 -32 -132 68 -15 -170 108 57 -175 131 108 -163 72 107 -153 72 111 -101 -51 132 -124 22 99
4033 99 -130 -45 228 -103 -87 161 -102 -103 113 -25 -149 177 8 -120 151 42 -90 152 50 -164 47 24
4055 24 -195 82 61 -107 81 169 -206 73 177 -144 -23 93 -110 -70 160 -118 -85 210 -146 -161 239 -44
4077d4n7K79k14n3K82j70j24K13j25j51K84q4j96K34m6j99K30P0k84J78J55l42
4099a64J25K39l41J63J82l44M4K93k79l3L53k73j13L09j80j26L24k34j38L17q7
4120C7j91L32j30k14L21j30j34K18K3l39K80Q2l20J87J37l26J71J15j88Q0J73
4141A84k76L3K00k15n2L04k23p1K83j64j40L23j46j44K90j23k81L59p0k15K58
4162A14J1k50J67J25l32J88R7l19J68J88l36J24K26k72J5K77l10qL23l14p9L35
4184A38j41j06K30j33j88L66j21j99L23j14k85K83K5k50K40P8k74K18L6k75J98
4205D9J57l66J32K04l34J02K69l39K9L02l00n1L22j98j25K91j48k10L51j23j71
4226a57K86j04k00K62j1k75K17Q9k92J80J02k16R4K34l51J32K28l78Q9K38l08
$$ plain form
4077 -44 -101 178 -36 -89 193 23 -101 112 -13 -164 120 36 -160 74 28 -171 59 129 -155 23 178 -164
4099 -164 -39 200 -141 22 204 -140 -96 197 -82 -115 238 -35 -148 161 -19 -145 179 -55 -193 124 37
4120 37 -154 178 48 -166 155 25 -109 109 132 -207 73 155 -165 22 159 -167 4 119 -69 11 184
4141 184 -92 -59 141 -74 -126 178 -45 -116 167 3 -137 186 40 -104 186 63 -218 141 71 -144 114
4162 114 125 -125 42 167 -165 23 120 -199 -31 157 -179 -55 171 -101 -86 191 -119 -127 196 -118 -197 138
4184 138 -3 -109 121 -12 -200 166 45 -154 169 55 -230 53 78 -172 68 146 -128 90 126 -149 49
4205 49 206 -160 -28 176 -158 -56 213 -126 -97 205 -95 -146 176 -22 -147 144 -4 -214 137 14 -157
4226 -157 129 25 -175 87 76 -199 18 107 -185 -5 97 -119 -25 209 -142 -10 218 -160 -71 167 -141
4247a41J7L37l01j8L11j75q6K19j67j40K81j34j68K66r8j60L33j0l18K30L9k19
4269a02R1R5k64K16J05k84J20K28l46J56J08k46J08J56k33m0L20l01J0K89j86
4290@j46L38j42j31K27p3k27J87nj95K76r3j98K28R6l34J89J22l41J70J73k70
4312a49Q6J85j87L3K06j77q7K91k98J2K60k13m9J77j48r0K71j33j13K66m6j73
4334g6J51n5j81K16K0k16J28J77k80J62K2k16J92P2k23Q1J11j72J9K11j85j9J85
4357A24j28j16J88j09n9J70q4j10K42r2j02J93q0j66J77M8k44J41L2j26J35L9
4379G3j56J01J20k16M1K15k76K6J75k20P2J99k05M6J46j59l3J41j63n3J87l4j98
4402a71K50q0q8J50J7j60J18L5j77J33jq5P5J04j48j4J77k30O8J79j64l2J17j02
$$ plain form
4247 -141 -124 213 -88 -106 205 30 -56 163 -4 -144 137 3 -165 101 3 -157 176 166 -152 78 117 -102
4269 -102 -11 84 -180 36 141 -143 -23 205 -141 15 123 -123 -15 141 -92 -132 188 -113 -103 186 0
4290 0 -146 192 50 -81 146 73 -154 33 28 -167 109 16 -182 46 142 -192 -3 119 -222 -52 121 -149
4312 -149 -63 122 -65 -32 174 -3 -90 201 -97 -85 175 -38 -87 90 -58 -148 123 -10 -123 143 97 -76
4334 -76 75 20 -161 55 75 -141 -13 164 -116 46 68 -148 44 116 -107 -26 85 -87 -68 143 -42 -61 124
4357 124 -4 -120 68 -41 -100 70 -14 -124 118 26 -76 117 37 -129 48 96 -148 -7 25 -101 34 73
4379 73 -83 18 138 -78 -37 178 -98 -72 103 -117 -45 154 -51 -5 141 -18 -51 90 -73 -126 61 27 -171
4402 -171 79 -1 -89 61 78 -82 36 71 -106 27 26 -59 16 120 -28 -42 135 -95 -27 152 -12 -44 73 -29
4426b9m6J41q0o7J17j4j31K46q4j49K47j15j32Q4M5q5O0J26k66J87j7j14K1J35
4450H0j04j7P4l7K5Rm8LJ50j64L9P0p5LQ0o7o4J35p7q5J15j0o8O5l9l8O4j4j5
4479a0M5K8j33O1Lk7m4J33j60P3J08j09QR4j00j5Q2l4l2J18r5M0l7%j12J66Kj18
4507f5P0K0j5m4M4k5P8n8JpK3l5MJ37j69j8J16r4kl6J2M4Q1r6l7Q4J6q0J09o5
4537gl4K9M5q7N9M1j11P3l2k4ok7K9K8j0JO8o9K6J7N4k7j9o7O0l2j4j5P8k6QJ
4569A0J4M7j25M9J6ko4R8q1l9J40op7L1k0J1rlj2K6K7o0P3k4o8K3R0n6l3K8K6
4600C0k6m8O2rm6N1l0L0j6n2P6J1l5K3j3k8k4L5N9p4N7n3k2J32o4m9Pk8J6K7L
4631Bl9O6Ko8L6J1l4pJ5J6Ml0k3J4Q8n4m4J54j03n3Q7p0LN9j2q1J23Lj13J12l7
$$ plain form
4426 -29 -75 66 -14 -81 36 22 -109 137 53 -96 151 36 -96 -12 33 -52 8 134 -132 55 38 -76 -55 80
4450 80 -24 -41 33 -4 21 30 -18 -15 135 -29 10 80 5 8 88 21 -43 92 15 -70 45 35 -33 32 -7 -45 19 5 -10
4479 -10 35 63 -70 -9 -6 -33 -77 56 -104 -31 77 -32 -24 70 -30 -45 37 3 -29 89 -6 34 -3 -3 -115 51 53 -65
4507 -65 5 25 10 -34 10 -15 63 5 6 -1 22 -13 -9 128 -41 -59 57 -37 -39 -75 -63 -19 62 -34 -71 13 29 -51 58 -7
4537 -7 -41 -12 33 -54 5 46 -65 8 -24 -48 -54 -81 -52 -24 -34 -33 35 -34 -8 9 63 36 17 -50 10 -22 -36 -51 27 1 9 10
4569 10 24 71 -54 -5 11 9 -55 43 -38 -77 63 57 -20 11 -9 2 -7 -10 -22 4 31 -29 44 20 -48 -25 65 9 -24 4 30
4600 30 4 -44 18 9 -37 14 -16 14 -2 -54 22 33 -2 21 8 -20 -44 -9 50 -24 33 -20 -42 90 26 -23 -16 -44 -28 -1 2
4631 2 -37 29 31 -37 -1 10 -24 -31 -16 0 4 -26 -49 -35 53 -1 -45 109 6 -47 40 -30 -27 32 20 -61 62 65 -48 64 27
4662B7m9P2o5n1R3j4n7O1K7n6L7N2r8M7J0l0ON9q8k6R6o5QL0n2m7R8m1M8J6p9
4693c1m8J14k3j02J23k9r8O8K1l8J05l1r4J17n4p4O0P0p5m3J41j00K5L7l5MJ4
4720B4n2O6K9j03J3N1r9p1K32j05n6L9O0q0J50r0j9Pql5Q7J4j01N1M4m8J8O5j34
4749e1M1M4o0L9J4p8J9O8j4n5J15p3j40J95n5j11K02o4j30J24lq9J86k7j75J41
4775F3m1j27J45Q4j67R8L1j11LQ0q6K2jo3nK24j65jR3p1j1K7l7m2J37j08r8J19
4803hN8j60J82m6j46J24N3j31J34K9k31J28J4n2O7R0j72kJ08r2L8L8l2O9l6J8
4829D2o8J05r6o9K03q8k8M1jn9Q2o7k7M8O1j30Q1No8R5L2k07J28P1k44Q8J21r2
4857d1jO9r2l0J53k9j22J58j06j9J32p9p3J42m9j24J64k2p2P4K7j23J03J7r6L7
$$ plain form
4662 27 -22 50 -15 -66 27 13 -44 17 44 -12 25 77 -21 26 36 6 12 71 -17 -43 53 -12 -4 26 -26 -73 25 -16 32 48 -31
4693 -31 -79 35 12 -90 33 4 -94 -26 -5 -43 62 31 -63 54 0 -74 -14 56 -19 -62 79 -21 4 41 6 10 24
4720 24 -28 38 67 -36 -23 28 -71 -142 90 -15 -71 -32 28 -52 98 8 -11 -4 -12 -47 40 54 -47 4 48 0 18 83 -51
4749 -51 -10 34 -26 13 27 -51 -32 36 22 -33 82 9 -131 64 9 -102 100 36 -94 30 27 -62 124 97 -78 63
4775 63 22 -105 40 124 -43 55 86 -25 -22 58 -28 -6 -7 -70 -75 149 -16 -17 76 5 -6 21 -16 -58 79 -29 -127 -8
4803 -8 50 -110 72 26 -120 4 57 -74 60 89 -142 -14 0 -52 15 105 -67 -69 39 -53 -15 23 -9 60 24 42
4829 42 -26 79 -17 -86 117 29 1 42 41 -18 64 -3 -30 18 79 -51 30 35 -33 62 94 -113 15 86 -158 -70 51 -41
4857 -41 -42 27 -65 -95 58 29 -93 65 -41 -60 72 -7 -80 62 13 -111 53 31 -41 33 60 -63 40 57 -39 -2
4883bN0j44J55J0j69P6R5j33K8J54j14p6J89j99K8J26m7n3J30m5j41J62o6j01
4907h7J14L9j45R0J5q3K3L6j11J30N4j05J12J2k16P7J35j36l5K03j73m3J43j37
4931h8O9J55j88KJ37j23j9R6q6k6J01p3j3J08q5q5Q9J07j61R3L6j20J01N1j71
4956i3Q4J17j51M4J50k71M6J76j09k1P5m1k5J02o9j04J19j12R5K5Rq9P7J7j07
4981e6J23j5j29J32M6j69J85j27j13J03P0j26J7O7p1N6Q9j33M2J2k1k7Q4o6l1
5006e8J38n0j22J92q6n3Q3l4n1P1j2j21J57m9m0O0o1n6J26Q0k31J16R9j31L8J01
5032A06p9n9J16r7qO6j04oJ40p5j17J67o0l6R5n8k7O4Qq8O5N2p8L7N4j69J16n2
5060b7j6M1Q5j09K5L3n5N0M0j51J09lm4PP9j13N9P4j51K2J11j19N0L2l3o6J20
$$ plain form
4883 -2 48 -96 59 69 -100 -24 71 -62 -34 120 6 -70 119 -80 -52 74 27 -26 104 59 -82 80 14 -87
4907 -87 27 66 -79 11 26 -57 -34 2 -109 21 75 -30 82 94 -122 -45 90 -46 -81 122 -51 -94 49 -88
4931 -88 -19 136 -52 -50 87 -36 -55 41 -45 -71 30 -43 -56 52 -33 -118 -29 78 -83 10 46 -74 27 78 -93
4956 -93 -9 108 -43 1 151 -120 -74 102 -7 -28 47 6 -19 83 14 -90 29 -83 12 37 46 -43 34 51 -56
4981 -56 67 52 -77 55 101 -68 117 -10 -123 -20 50 -76 -59 8 -63 -7 82 -51 -9 3 -18 -45 39 -27 -58
5006 -58 80 30 -92 100 14 -39 44 10 -41 30 18 -103 54 5 -35 25 -36 -92 34 114 -117 -1 98 -33 5 106
5032 106 27 -32 84 -13 -21 45 -59 -65 75 0 -117 50 -10 -46 49 -9 -36 28 36 -52 13 65 -13 24 78 -91 25 -27
5060 -27 -43 -2 83 -26 -1 32 -23 27 67 -84 25 22 -22 -15 64 -49 10 84 -67 -45 66 -53 -3 29 -4 -70 50
5087E0K0j39P5L4j14O1%j0N6o9J8L8J2p2P9jj00N2L6k9oR6j55K5Q5n3l2J48j13
5116hl2O6Lo9J14rl5L4qn1n6Q9o5n0J25o9J3O7mp3Q1o3K3l6l0J0P4k5m8M2Pn2
5148c5P2o3j7N3J1p2R6k6l6pL6j9K0K6n9K8k5m0m9R0rM4L4m2p2J10p8l0Q7p6O1
5179A3J5l2m3J7Q6m8l4K4L2K5o5j6K9K5o7K7J4K6l4J4k9J05J9j59P2Pp5O9k3Q
5209Bl2Q4j04M2k5P5q3L0J5kQ5p3mk5%m0J4O0k5K8l6l9j7L8O7k2m0o9J47o7K1
5240Em6M1K3k7N1m5K6MK3o7R8q5rK1K4j4j7m9M7Jm0k9J01J7o1j2M5n0RK7k8j1
5272b7kN0l4k3jj0K0QJ8m0J01j02K7M3l9L2j0Ml6K7J7k6Kk2M4J8m3m7K8%j3N0
5304A4K1m0j0KN1p5K3L9m6J6J9k8l1P3o2K4j5l9Q5K9j04N6K6KPk1l9RK4rK3r1
$$ plain form
5087 50 70 -69 6 40 -74 -13 -13 -23 33 -36 -18 20 32 -40 39 38 -62 -10 26 -3 -9 87 -68 -43 42 -11 -43 105 -8
5116 -8 -40 26 29 -40 74 65 30 64 56 5 -51 38 -27 -77 48 -21 -8 59 55 -18 63 0 23 -13 -43 -33 41 16 -32 10 17 -35
5148 -35 37 -26 -43 10 21 -51 45 19 -17 -24 12 -7 13 39 -20 8 -17 -57 -106 -16 -25 19 53 11 -61 49 -29 -59 28 -48 13
5179 13 28 -4 -47 -30 56 8 -26 -2 30 55 -10 -26 3 28 -39 -12 2 28 -6 8 -21 84 103 -56 16 23 -52 17 -6 2
5209 2 -30 54 -50 -8 -33 42 -41 -11 4 2 87 14 10 -15 -15 -55 -41 19 -6 22 -14 -53 -70 -32 35 13 -27 -96 51 -16 5
5240 5 -41 0 23 -4 47 2 28 32 55 -12 86 1 -8 13 37 23 6 -43 4 5 -35 -64 37 54 -7 -19 26 -24 -15 12 -16 -27
5272 -27 -29 21 -13 -36 -37 -47 -27 -19 -1 -41 60 -42 -15 28 -11 21 11 15 -21 6 23 -3 -1 -23 21 39 -4 -51 -23 -23 -36 14
5304 14 35 -5 -15 -13 38 -37 -14 25 -21 -5 14 -14 -45 28 -34 -10 -25 -64 21 50 -54 2 28 30 37 16 -23 -14 10 1 24 -67
5336f7P0k1J7oj9L0j0K0Jk7n8J46l8j1M7j02L8NM1o7N6L0o9M2k7m8K4onJ01q8
5367aoJ7ML0j04N7m8J6MoPL1lm6R2J8r1P7o7jL5%o2J7M1l5j2J22j07P2l6n8J3
5400c0Q6p8K2L1ml4K8Ml2O4m6k6P9p9l0L4%j4R2q2M1l1j8k3Q7pk2J4j5nqQo1M0
5434a5R3j17M4jl0m1Q1J4o1N9l0M6o3pq1J28p1K9O4o0m9J26l3k1l7K5n3l8J63
5463F4j59J22k9k2N1jr6NJ25J1j30R0p8M6K8r1M8O2q0L3L5r3R0%n8l5O9j4n3M2
5493a8K9n8L6M0q8P9n6k4J23j15k7O8J1m9K1K6k0j5M5j6k2Q7o5j5L6K6o1L2k0
5522a0n0J23j1m7L0l4l7N7Qk2K7j3j01R6K7j09lJ49p7Qj2m3P9l5l9MO6ko6J5n
5553b7QP5p6nQ0l2q4J31k5q8J55p5j40P7j3MQ6j4j05P6N2q5P6p0l5Q8j0o6J4P6
$$ plain form
5336 -67 3 -18 -1 -7 -26 4 -6 14 15 -12 -70 76 38 27 74 -28 10 15 56 -11 45 75 6 48 21 -27 -3 -9 -14 87 -1
5367 -1 -7 10 14 44 -60 -3 -51 -35 -31 -37 -30 1 -2 -48 44 62 -29 48 -19 -20 15 15 -47 -30 11 -24 -36 86 -21 51 15 -43 -30
5400 -30 56 -22 0 31 27 -7 21 25 -7 57 11 -15 64 -15 -45 -11 -11 -25 67 -15 26 -5 -23 -46 41 34 12 26 11 6 -2 6 -55 -15
5434 -15 78 -39 5 4 -26 -67 14 28 -33 26 -4 42 -21 -28 -109 19 -52 -23 41 -19 -68 58 25 4 -33 -8 -61 -99 64
5463 64 -95 27 -2 -24 27 26 -70 -65 60 71 -59 31 -47 -1 27 -64 -16 46 -34 -1 34 -59 31 31 -27 -62 7 -7 -60 -18
5493 -18 11 -47 -11 29 -59 20 -36 -60 63 -52 -79 -11 0 -49 -28 -2 -22 -37 8 -8 -30 57 -8 -23 13 39 -22 10 -10
5522 -10 -60 63 52 5 35 1 -36 21 29 7 34 21 -80 16 43 -66 -69 80 3 11 -1 -44 35 0 -39 -35 31 29 -37 -22 -27
5553 -27 -19 56 -20 -25 55 23 -61 70 45 -43 112 37 -103 -26 -39 -35 51 37 -68 8 60 -25 51 -19 -54 34 24 -42 -28 48
5583D8j18J00L3m1l3J18q0l7P0m8j5O7n0p9P2m7K4lK6j6N3l1k8L1m0lL4N2r9N5
5613A5kJ8l0L0n0ML9K6r7R1n9j5J2l0N4l9J8j5J10r2l3O9Ol2J3K8m5l1L6J7l9
5644b3J5L0Lj8m3K9J3j4qL3p8M8N3Nm5nJ1jN0j8o1Q3o5l3Q7n6o5O4N4l3j6M0j2
5677B4k8L5n8J1M5o2M3K2m2nL3k6l4P9p4K8N8o3k0N3l7QN6q2m6M5M8n1Q0ok4K0
5709C0j4p3J37p7o2P0j1j2JN0r3O0J7o0NQ9r7PK6k4L9o2J06n6Jmk2Q2l4l2L5j6
5741FM9n3L9n4k1K3k3L3L7j02J6J8NM4mK3o2P7q8j4O7jo2P5p7M3j2LK0k8K3lL3
5774C0n7k4M7M5o3j7L4J5j3l8n4R3QK5l2j3qO4r0O8k8J4k4j1N4jK7n5K5k9J2J8
5806B2m4N1n9N2j8lp5P8m2M0KK1j8p1J02j32J53n0k0nj3l5P9K8p3N4mn6N4J7m0
$$ plain form
5583 48 -70 30 63 22 -11 107 27 -10 60 12 -3 64 14 -65 7 -40 -16 -19 7 -9 44 13 -15 16 -24 -27 7 59 -40 15
5613 15 13 31 1 31 -19 -15 24 50 -47 44 -15 -30 -18 -48 6 -33 -15 -30 80 -12 -45 24 30 -2 11 39 -6 -37 -1 16 -23
5644 -23 -8 22 25 7 -36 -7 6 -8 -16 17 -61 -13 40 45 0 -5 6 5 55 37 -24 59 -6 -39 48 -8 -73 -9 45 12 -4 36 24
5677 24 -4 31 -27 -16 29 -33 10 32 -10 -15 18 -8 -42 37 -37 -9 49 -14 -34 19 -18 -10 46 -36 -82 -37 11 -40 40 34 10 30
5709 30 16 -57 80 3 -59 11 0 -12 -11 39 -54 6 23 -37 -32 57 -40 -33 -7 -31 8 -54 52 -4 -3 -7 -29 53 19 -13 22 6
5741 6 55 2 41 -13 -34 -11 -34 -1 36 -66 -50 -32 -27 17 13 36 -26 51 -37 -51 16 15 -47 28 -49 -6 -18 -15 5 -23 0 -3 30
5774 30 -27 -51 -4 41 -22 -39 -5 10 -3 -41 -95 -2 6 31 -1 -14 -22 42 -48 20 -8 6 -18 -29 25 24 51 -4 21 -8 4 22
5806 22 -22 29 -30 22 4 1 -74 4 -38 2 4 25 7 -64 38 -94 59 9 -11 -16 -29 -64 15 43 -30 24 20 -36 18 35 -5
5837eL7j4k2l5J6k5P1J8l3K9K8j02RN3n5K3L6m7L9jOj0l1K1LPj4J7o9N9p1L3O5
5870C6k9n2J2nj8L8k2P0m5K3K3m6O8q8N0l0M1k0j5j7n4N1M2kl0j3L7Lj7OM0l2
5902ElJ2nn7J16l4kj6o9K5R8j15P2J3m1j8j4L3J6L3m7Rk4j3oP3J8o8JJ7k3qm0
5935f2O0J5lJJ2l3pnL6k3j7J8l1Q8p2m5J04m8K6N7l8j16J13l7K3m7j9P1K5l2j4
5966@pkmK7J5Oo3K8pl4M8J5J4K6q3RJ7m1O1qj3QQ1r5K7K9p4J6m4L3JK8m5K0j5
6001b6j6pM2N2n7k3K3k1N4m6l5P9p6Q9n3j2l9L4N7k3L4o2K3K8j4j0j3k5O4k2Q
6032Gm7K1K9K3q1j1J10l5q7L7N8o7oK8O6o1m8O7m5J9K7pj7R2o9Jl5N6k7RL2l5
6064DJ3o9K8J6k6O9o6M3n3P2r0P9l6kO2l1r6Q7L8l8k5N5m7J4Lk6N4o4O6j5m0n7
$$ plain form
5837 -5 32 18 -4 -39 -23 -48 23 41 8 37 65 -37 -28 25 -30 -7 29 -18 21 20 26 16 -15 6 9 16 2 19 -50 9 -62 -29 36
5870 36 7 -45 -33 -38 -56 -18 -40 30 -15 8 31 -15 53 -35 15 -15 26 6 -9 -26 -80 -29 13 11 -19 -32 5 8 -9 -3 37 5
5902 5 2 14 9 -48 68 34 32 16 -53 -28 70 -45 27 40 -1 -19 -33 0 16 49 2 11 -13 -26 -32 41 59 -9 -8 9 -14 -22 -62
5935 -62 -2 13 10 11 23 -10 -17 -22 14 -9 -26 -8 -39 49 -23 -68 36 -12 14 71 33 -83 30 -7 16 -31 -50 21 46 14 0
5966 0 -7 -9 -13 14 29 35 -28 0 -7 -41 7 22 36 62 -21 -12 5 -36 25 17 4 12 93 -2 25 54 -20 -4 -48 -15 -14 14 -31 -11 -26
6001 -26 -42 -49 -7 45 -12 -35 -12 -33 21 -25 -60 19 -57 32 -21 -33 -72 -38 19 -4 30 -32 -9 19 5 -5 -18 -43 21 -1 7
6032 7 -40 -19 10 33 -48 -59 51 16 -71 -34 24 -43 -49 -21 45 -16 -64 3 -42 -23 4 -3 -20 72 3 4 -31 25 -2 7 39 4
6064 4 17 -52 -24 -8 -34 35 -31 12 -41 31 -59 20 -16 -18 44 13 -83 4 42 4 -21 34 -13 1 4 -22 32 -32 34 19 -21 -78
6096g8J09nm9J5j1K5n3J5K1K0J5k0N3q3K2l0N9n3N0m4K6l2K7j7J1m5J7KOk0R8
6127E1l8nL9p1J6JJ1j3M0o3rL3J0j9M1l2K9m7k8N1J3MN2o9j8JJ7M0o9P0j9l6J5
6160bP7p2j1N0r5M9K0o3R6o6PQln6Q0Lk6k2R0n4l0J5K2l8JO7o6L6L9j12N8P%r0
6194h1M0J06p8j8l4O5k3Rj6J01p7lK9Ok1m6j7O1M6o6Pmm9Q0ok0M2j8r9M3K5l8
6226e4j8OO6j8m1PJ30j02J3K8m6k9L0J7M5n3Pk5L0k8K5L1l0K3Nm5J8l7M6k5P2
6257D8o8L6pmO3q8OK3j0M8j20M0O6j6J0j8N5o0qJ3n6n7J72q7K4q3N4J6J13p2r3
6288f0M4PK6m5K6m0L9m4L4L7%k5jL0o4p4J51o3lL6j6K7m2K8N2l8m1J25j26N3K5
6319E8m6K7m6k6O6k2j3Oj1J1j5K0Rj6j6k7j8K9L2K3o2j1L7lLl6Q5n3Oj6N6l1k1
$$ plain form
6096 -78 31 26 -23 -8 -19 6 -47 -32 -11 9 24 4 57 -26 -4 -34 25 -28 22 -22 4 -28 -1 -18 -7 -52 -35 -33 -27 -47 51
6127 51 13 8 47 -24 -8 -7 4 -9 31 -32 -41 -8 2 -17 24 -8 21 -26 -54 -3 10 14 66 -3 -21 -20 -3 37 -32 38 19 -17 -2
6160 -2 75 3 -8 42 -53 -4 16 -47 49 -17 -10 -2 -5 -61 19 22 -4 -26 64 10 -20 -5 17 -21 -20 47 -19 17 56 -56 2 9 9 -81
6194 -81 -41 65 -13 -31 -65 0 -23 -14 -30 71 -6 -9 20 26 5 -41 -58 3 49 -17 -10 -14 -63 17 11 -9 33 15 -84 -41 -16 -54
6226 -54 -72 -66 0 -18 -59 -52 78 -24 -11 17 -29 -58 -28 -11 34 -19 -12 -37 -7 -35 -10 21 -9 14 19 -26 -8 -45 1 -24 48
6257 48 -20 16 9 5 68 -20 -14 9 -1 47 -73 -33 33 17 27 9 64 4 -4 9 -47 -104 68 -19 5 -78 -24 -8 105 33 -60
6288 -60 -16 -9 17 -28 -2 -42 -3 -47 -13 24 24 -1 -2 28 -36 -110 41 -22 -25 11 -5 22 -20 8 60 22 -19 106 -20 33 58
6319 58 12 39 -7 -33 33 11 -2 4 -7 4 -11 9 18 2 -14 -41 -59 -30 2 25 -37 -48 -11 -14 -11 -47 38 -15 -9 -25 31 0 -21
6352b1k1KQ9j3o2lO1n5N7k5j06J01l8M0M1l5Lk8k1J4K1J3rJ9j2j5L3J9o4L7j7
6383EqJ3kjk5K3K4m5M7k1PJ1k9K4p7L3n4O8l0N5Ql3n3L9J3m6M5K3LL4k9j7JM2
6417D8o6KqO1l1Oq6P8K3l1N4n9K3JPM4p2J7K3o0J6K3j9J4m5O5mm8J3M4l9j9M5
6450B0rRj1J1nl1L3N6l1l8l7M9m8Q1m0n8Q8r8P6L8q6j7N7j8j1J7R0r3M1m1K0o8
6482e4L1k6N2O4q8J10q4l1L0n3K9L5L1pj0K1o0J6k5m1j0O7j6P3o4J1k4%J6O4q4
6513b7M3K4Nj7n0K9o6L6L4j6J4L6q8O5J6k7rJ0kn2P2p6Mj8P6pl0NlR5o3pj5K1
6547A2j02J58l9qr5R7r1J3R0p1M2j3J4n5O4pK3m2Q2m7m3K9j4O7p2k3j8N9m9K2
6577a7J3k3M2o1kN0MN0o8N9j5l2M2q4N1mk9K3K3l6o8O3o5O6J3J5K6n9J7K0m3O0
$$ plain form
6352 -21 -42 -40 49 36 -26 -29 32 -23 34 9 -97 4 -34 6 47 12 15 -13 -34 -20 1 14 5 24 12 -3 30 49 -15 22 5
6383 5 -3 10 8 7 -18 5 29 -16 31 10 17 28 -1 23 -54 -21 -75 -7 -37 18 26 -7 -60 -21 -8 -54 -9 14 17 51 22 5 6 48
6417 48 -18 -16 -24 37 6 12 -74 4 27 -4 50 -9 14 15 22 66 -6 11 34 -26 -10 13 -6 8 -37 28 24 -24 -11 33 -6 -25 20
6450 20 11 20 9 20 15 -16 17 73 42 4 -33 16 -32 49 9 -49 39 -59 17 55 -31 -48 9 -9 -20 -3 87 -6 35 -6 14 -54
6482 -54 -23 -49 3 67 -21 89 5 -26 4 -49 -20 15 46 39 29 50 -10 6 -19 -60 -70 -3 -19 54 -10 1 -23 -23 -7 57 -27
6513 -27 16 40 45 28 -22 7 -59 -23 11 -5 9 45 -43 22 38 11 2 12 10 -42 30 -46 -42 -60 16 9 -21 -16 -19 76 13 6 -9 12
6547 12 -90 68 29 21 -74 23 -68 -55 35 -36 6 -7 7 -48 16 9 32 -10 72 25 -18 11 -3 64 -8 -31 -49 10 -39 -17
6577 -17 -4 -27 15 -46 -48 2 6 56 -12 47 32 0 42 -42 9 5 -24 -1 22 -14 -82 -19 -84 -18 -5 10 36 -23 -6 14 -29 31
6609C1p5R2k4lqLn2N8jLj4J4rOm9K2OM6o2l4K1K6l2n0Q4M0l0L2n6M7mo3N0l6O1
6644D0l5J9k1J9lk2N3r2LK0LJ2m1K5j6P7Nno6N3k8j8M1K2o6L5j3L7l7p4O4qj0
6677b7O8n9k8J00K4j18M7J5k3pP9r7J2K7j7j6M0n4oM7n3K1JP1p5M6J5n4R1m3j8
6708Im0K2R5o8n0Q0j6j8n9N9M0o1plKlMN4o0k4M2J8J8o8L1k4j4J18n0N5m8l7n2
6741e5P5o4OP1k9n1L5OL3l4m5R6m5j4K5O7r2k0L7k9J8O4j2j17P6k1j8P1n0kJ8
6772@%k6M2J5n8L0OK3l1J8j5m0K4m5J1L1K7l5JK3nrj0l6J27l8o6J5M0j9J3Nl9
6805b1L9p5R4q5P0k3%qp6J11L0k3o1K6Or3M9M2Oj6k7M6j6K4J8k2Mj2o2N6Qo5J15
6838E9l3m9N6K3m2mj2J4k6j1n5J23o1qN1m2L6J7L6q5o1J16j10O9rN9m7J1J8L8
$$ plain form
6609 31 -44 48 24 21 13 16 -36 22 21 24 10 24 15 21 -28 -6 0 46 -16 -50 -29 -3 -35 -85 -1 39 9 41 -15 32 28 -35 15 -21 40
6644 40 5 24 3 22 19 -3 50 -42 -39 -19 -16 -4 -45 -20 -36 41 46 41 -25 28 0 -18 23 45 -21 14 1 38 1 -73 -9 -17 -27
6677 -27 41 -18 -46 54 78 -40 7 22 -1 -8 71 -26 -14 13 -4 -20 20 -34 -40 7 -46 -25 -24 47 -28 18 33 -21 70 27 9
6708 9 -31 -9 86 18 -32 48 32 14 -45 14 54 -7 -14 -17 -15 -18 -14 40 -20 -44 -2 16 34 -34 -3 -27 -41 77 27 82 34 -3 -55
6741 -55 20 -44 -38 33 4 -47 -12 -6 27 -7 -52 44 -1 -15 10 77 -15 -35 2 -27 -9 55 43 -74 2 -19 -37 34 -16 -18 0
6772 0 0 -26 16 31 -27 3 9 32 1 19 4 -36 -12 -57 -46 -15 12 -23 -22 1 -4 -13 -23 -59 68 30 -36 -21 19 0 13 18 -21
6805 -21 18 -57 37 -48 22 -1 -1 -9 -85 26 56 33 -28 -2 4 -89 -40 2 8 -8 -35 11 -5 19 37 15 19 7 -55 1 9 -56 59
6838 59 26 -23 33 56 14 10 -2 12 -14 -25 -80 43 -18 -26 25 -17 19 36 72 -13 -74 42 -68 1 -8 51 4 15 33 71
6868G1k9n2N1p3J07m5NK4n8L2j1l8L4J3l3Nq1Q0M1m5mK1k3j0P0n5ppk0Kj0J14
6900F9j00j3R9n2nL1p0nL2L7j9j9j1m3N9KJ3J6j0l5M9%m4J5Jk4N7l1j4N9p1k0
6932d7M1NJ9J5qj8j8K7k7J7L2KL7j73Q7J7j0l5PP2q1J3M5l7K4l3K5M7k6l0nM2
6964B6r4L2Q9n4L6l5L7p2OP1n0k2J5L1l4J1nJ3M2m9L9m6pN2M4n9p6O0K7m6K7%
6996IK9l9k2J7K3l3N1q9O5l9NJ9%Q0n4pk5J1j5m1O1k4%L6j3m5R1l9l3K9Klj4m5
7030e2LL3MJ8M1r5M9J8Qkn3M1j04J57q2L9jj1J9l1p4K1M2M6n8j7N3m8J5M0rJ7
7062B7J6n9L4k9k2J7K8n0N9l4k3k7P9j9kn4P9l1J6m4M1K5j9j8Ql6R8o1rJ8L0j7
7094B1m3P1p0j7N6Jj2m0M7m5N0L4Mm0L1p8L4j2j8L6J8ppLl2N5l0j7O6m3j7M4o6
$$ plain form
6868 71 42 -10 41 -32 75 30 35 59 1 33 22 -16 18 31 -2 3 -78 2 43 -2 -6 15 -8 -18 52 -3 -10 -17 -37 -35 -45 69
6900 69 -31 -44 55 3 -2 29 -41 -46 -14 23 4 -15 -26 -69 -10 -8 5 21 11 -24 25 25 -19 -4 -3 -27 30 -1 -15 44 -27 -47
6932 -47 -6 -1 18 33 25 7 -11 16 -11 6 38 40 77 -96 -9 8 -2 -37 -30 42 -39 -26 19 -18 6 -27 -2 45 19 -11 -16 26
6964 26 -68 -36 53 -1 35 0 37 -35 -29 42 -8 -30 -15 16 -18 -7 -12 1 43 -6 33 -13 -20 32 76 17 -59 1 28 -18 9 9
6996 9 38 -1 -23 -6 17 -16 35 -54 11 -28 -23 -4 -4 76 22 15 -10 1 -14 -55 6 -18 -18 18 5 -40 51 12 -21 8 10 7 -7 -52
7030 -52 -49 -16 -12 6 47 -48 1 19 27 25 -28 13 -91 66 -16 23 22 11 30 -1 -75 -54 -12 34 -24 -41 12 -36 -21 19 10 27
7062 27 43 -16 18 -11 -33 -16 12 -38 21 -13 -36 -63 16 -3 -5 -59 20 -11 5 -39 2 27 8 -10 -2 -38 60 -1 -10 8 38 21
7094 21 -22 49 -21 -38 18 19 7 -33 14 -31 19 53 57 17 48 -30 4 -8 -26 10 28 21 14 17 -15 40 10 -7 59 16 -1 43 -23
7127b3m4N5j3O0n7J5m6K0J2j2M2L6o5L8J4l7Nk1jL3o6O7Mj6lJ9K5l2o2Q3o6J0
7159b6O8m5L7m8MLK1L0q6L7k5R6j10J2Q3k4k6JNJ11j11k7N2mo3M0M1o2J8n1P9
7190C0o1O6l6j8j1O7n8L5L%n6K9M9l1m2K8k1OK4m0P2j0k8Qm3MRK5L7J7K0j13Q6
7223D7j3m7K5q4J4O1Ll2J8J08q1J2o1J8M8l1k6L1Lk5rlJ7mj2O4L1j30L1O8Jn4
7255a2LJ7k6k9P1k7j8L3N2j17O4l8Pj0M7pm6N1j6k9k6R1q2O9j8k1n6P1m7K8K2
7286AK3j8J1k0m1O0j4N2j0l6m5QK5n7J6M6J2Qm9O5m1k6P2n1L1j2m9K5JN6p2N3
7318B4o5O7q7k6N1Nj3P2%m3KM8Jkp4j1O9p8P9k7M2l0l0M9l5j3O4n2O8p3j0L4J
7351Gk6J3l4rN6K8m9Rp6M3K8L1l1l2P4Jl6k1M4k3l7j7L7K7J5KJ8l9L4j2Nm1N6
$$ plain form
7127 -23 -67 -12 -25 35 -22 -7 -53 -33 -21 -33 9 45 -20 18 32 -5 0 -21 -22 11 -55 12 16 0 -3 16 41 9 -53 30 -36 -26
7159 -26 42 -3 34 -14 -10 -7 14 44 -42 -5 -30 66 -44 -32 51 27 1 2 7 118 7 -20 32 28 -35 5 46 -16 2 -49 30
7190 30 -31 35 -1 -19 -30 37 -21 14 17 17 -39 -10 39 8 -34 -6 -27 -21 3 -37 35 25 -3 5 -38 -34 -25 0 37 54 74 -39 47
7223 47 34 -13 12 -72 -58 3 6 -26 -8 100 19 31 -30 -12 36 5 -21 10 13 -12 -21 -24 -7 -11 -23 41 72 -58 -27 41 42 -12
7255 -12 -9 8 -18 -47 24 -3 -21 12 64 -53 11 -27 -20 -30 17 10 -36 15 -1 -30 -56 35 -47 22 4 -17 -73 -2 -49 -21 1
7286 1 24 6 17 -3 -44 16 2 54 44 8 -37 -29 -4 -61 -45 1 13 21 -28 37 -4 -30 42 -9 22 10 -39 -14 -13 43 -29 24
7318 24 -41 26 -61 -87 -36 -31 -44 28 28 -15 -13 35 36 34 -40 -51 18 -60 19 -8 34 4 -26 23 -12 -25 39 -13 55 -18 -28 6 7
7351 7 -19 -6 -40 -49 7 35 -14 -5 -81 -38 -10 21 -10 -42 32 33 -3 -24 20 -3 -40 -57 -20 7 22 24 42 3 37 25 30 -11 45
7384D5n4j5%j9J1N0j1r5L7O2j0J5n3k3P2L3q3P4n8oNNK6QnlL3j8JJ3n4N1r8Q2
7418A8k3Kj1o9R5o0k7M1O1j9n1N7J2n1N9m2L1p9L2J6L1q1P2j6l1K7l1L3jk1Q4
7449E8o5o2R7Lqo2j6J03r6Q2K4%k3o2k3O7l8K5M3n7j6L3J9n9O7p0O1q5J4J7k1
7480e0M1Kj1K1j3M9J6r2L6K0k2m2R3m7mJk5j3R8m1n5J37r3m7K1P9p0N2j5q1J4
7511d1J16j9n5L2J3m5K7k5j9K5j1J6l0L7m4L8j0j2l5J18o4k1M1m8M1lK2m0J2n0
7541c4j1O9k5k8pQ4k1n2P2k6l1k8J6L9n9O4k5m5K9K4RK3n0j2O3l6L5p9N1l0ON9
7573D4m0m2L0l0R0n9mjM4k3m9M2j8Po9R7n6K8lO3q7Q0m9Ko5P2M8k0k5Lj8l5MJ00
7607F1l7l9J19o3q3M3m8M7j3k4L8OJ5k0M0o0J4N4J3m3k3P7l5k2k1J7j7L6k3j4
$$ plain form
7384 45 -9 -24 -24 -43 -32 18 7 -88 -51 11 1 16 -37 -60 12 45 -38 36 -22 -28 -23 -18 8 16 11 8 41 23 24 37 -17 34 -64 18
7418 18 -5 -3 -14 -83 12 -48 -75 -34 27 8 -43 14 26 -25 34 -8 23 -56 -24 -8 23 -58 14 -2 -33 -6 -37 -4 -5 -26 58
7449 58 -7 -69 28 31 23 -39 -55 48 -48 34 58 58 35 -27 -50 17 -21 4 47 -10 -26 7 26 -33 34 -36 25 -60 -46 -29 -50
7480 -50 -9 -7 -18 3 -10 39 55 -37 -1 19 -3 -45 48 1 -3 -2 -27 -40 58 17 -38 99 6 -41 -20 59 -11 41 26 -55 -41
7511 -41 75 56 1 33 46 1 28 3 -16 9 -2 14 -16 21 -23 15 5 -7 -42 76 12 -9 32 -16 25 22 44 4 16 -34
7541 -34 -45 24 -1 -29 -36 48 27 -25 47 21 -10 -38 -22 17 -42 22 -3 -48 -19 5 14 37 -13 -25 38 2 37 -42 9 -21 -15 44
7573 44 4 -38 -8 -38 52 -7 -11 -12 32 9 -40 2 -16 -9 -78 19 -37 -9 -12 51 -36 44 -5 -3 -68 4 52 32 7 10 -8 -43 -39 61
7607 61 24 -15 104 41 -42 1 -47 0 -13 -37 1 7 22 2 42 -18 -4 50 63 20 -3 74 39 17 -4 13 -4 32 9 -5
7637eK6k7J3L0k0k0L9o7J1O3l6j5L5k6O3j13M4K1O0p8J1R2j37O5j21N7K7K4Pp5
7667e2Q8N9n0k1l1lqM0o4M5%m1jM9M2m1K1l4jk6K2M2j2j04R2m9K7O3l2k2po0O2
7700gJ4l3O4m0k4J9j6k2L6L1k9O8m9J9q1P5o8j8O4N2o2J8M4Rl2n3M2llk7M3q1
7732e0O5j3k3n1R6k0n0K8P8p1L6j7m8N7p6JO6K4mJ7m4l0L8j7K3l8pL2k6L3l7L9
7764A1k5K5k7K0J1M8r2k0J01l9m8O9p1K1J5Ro8L4PM3m1nj5R5o6qL6j7N7k5k2m1
7796b8k3Q8j1l8l9Q0J4n8jK5jj8Q3j09J7k7N6m1N7K0p0j2J5K4l0Q7p6J0L7oj8
7827GmK8J0r6P6k4RQ9n6l9k5j7J0O8k2Lkk0j7J1L1pp1P5m6lM6l7j0M1Ok7O7k7
7861B7j6k4J0j4P5n0p4K2N7jk8O0l5k9M5l8MP4r7K7N4k9m3L0O2j20J25n5K9k9
$$ plain form
7637 -5 21 -6 7 37 17 -3 36 -31 -20 43 7 -8 27 1 64 -49 -5 16 76 -2 9 101 -36 29 -92 -35 -8 16 23 -52
7667 -52 36 95 45 24 -7 -10 -18 22 -42 3 3 -38 -39 10 52 11 32 -2 -3 -29 -7 35 23 -81 11 -38 -11 52 20 -2 -9 -69 -7
7700 -7 7 -26 38 -2 -26 -7 -23 -45 -9 22 -7 61 12 31 -50 25 -43 -61 3 55 -7 11 55 64 32 -21 21 18 15 -12 31 -50
7732 -50 15 2 -21 -72 24 4 -46 -18 60 -11 25 8 -40 17 -59 -58 8 32 28 45 1 -29 9 -8 15 -23 -30 2 -24 9 -28 11
7764 11 -14 11 -16 4 15 63 -29 -49 52 13 -35 34 -37 -16 -1 8 -60 -26 -19 24 -17 -22 -37 58 -8 -16 20 3 60 35 13 -28
7796 -28 -51 37 26 -12 -51 29 43 -15 -16 9 8 -10 73 -36 -19 -46 10 -31 26 46 -24 -36 -21 3 -27 60 -16 -6 31 25 7
7827 7 3 31 41 -55 21 -3 6 95 39 0 -25 -42 -32 36 14 17 15 -5 -22 -11 20 13 -58 17 -29 -32 14 -23 -33 8 14 -13 54 27
7861 27 11 -13 -3 -17 58 8 -66 -44 13 12 -16 44 9 -20 25 -13 -9 65 -32 -5 49 20 -23 7 69 -51 74 19 48 19
7891A9j1L7l1Ll2J4K1k7M8J6m8Qn5O4qK4j6k6K8m5K3L4m1J2l5M1LM3r1M6ql2k9
7924e1M3N4o7L8j0k3k2J10o8k4l8J12pl3L1q7L9K4n2R2n0n1M3l1K7Rl9pK9pK8
7955A2K0j4k8l7M7L4l4M0p3J01p9J3OL5q3J1J6J8M2m2Qk9K0j3KM5p5M9L9q9L2
7986fL9n3J9OJo2M9M9q4P3m7kO2l8r1J24n5LJ7J8M8l3k5J4j9mKJ3mnk3L7n6N7
8020B4K3q6O2p6O1m9M4o3L5O1p6KK5l9M9K8k3J6n7O0k4m0O0m1J6N2o0N3Rk2k7
8051cK6n4KM5l0L8oj6Q0j64P1Oro8M7O1o6oO5o9N8ol6J6jK4L5m8j4J13o5k1n0
8084d5L4j1J7k5M0L1J1o2L9po9N5j3m6N8k4Pm5Q6j1j29Q9Nl1M4Nnk4R2m3k4Qj1
8117djn2J9LL8k8J7k8M1J5prLJ6n6M5l8K2k8M0j05J35J3m8Pl3N3Mo4k4P8m7J3
$$ plain form
7891 19 8 45 14 17 -15 -1 20 -7 41 57 9 17 -38 26 18 42 26 0 28 -17 6 40 -1 11 -24 17 20 63 -28 18 10 -22 -51
7924 -51 -8 46 -21 17 7 -16 -38 72 4 -20 -58 54 47 14 45 -42 -3 21 -31 61 11 -40 3 -28 -1 8 -31 -38 -9 -16 12
7955 12 32 18 -10 -47 0 34 0 40 -33 68 -11 2 8 43 -40 -29 -13 5 47 5 13 -16 4 -9 -7 38 -37 12 51 -38 -6
7986 -6 33 -20 -1 5 6 -56 -7 42 -42 31 -16 -18 44 6 -85 39 -16 -13 4 22 70 37 12 26 7 3 5 18 14 9 -14 23 -33 24
8020 24 47 -39 23 -53 8 -41 3 -60 -25 36 -40 -38 -13 -52 -3 25 2 18 -39 21 -3 -43 17 -24 -8 44 -16 37 46 24 -3
8051 -3 23 -31 -29 16 -14 24 18 2 82 -82 -11 -5 -14 -82 -35 26 -40 -46 19 -50 8 2 -34 -18 -19 5 40 -8 -22 91 26 5 -45
8084 -45 -11 -22 -5 -30 10 41 52 -10 29 22 -47 8 -5 -51 7 -17 -10 -55 31 20 -109 -20 -15 -46 -2 3 -2 -26 66 23 -1 7 -4
8117 -4 -5 -57 -38 -35 3 -25 -8 -36 5 20 13 4 7 23 -33 12 -26 -4 -32 8 -97 38 51 3 10 -23 30 34 -30 -54 24 -23 -10
8150a0O3%l2j8J7j1j3N5p0j4K6N0j9L6q0pj1Q6n8kM5o5L4J2j2mo8Q1n2K8j5L5
8182GK2N9p5n1O7pkl5L7
$$ plain form
8150 -10 53 53 21 3 20 9 -4 51 -19 -33 -7 43 24 60 -20 -27 -38 48 -10 -12 33 -32 2 14 2 -2 -70 11 -41 -13 -28 7
8182 7 29 88 13 -38 29 22 20 -15 22
8191B2
$$ Imaginary data points
##PAGE= N=2
##DATA TABLE= (X++(I..I)), XYDATA
0@%%%Qj6J6j6K4m0N3o6P7q8J12j44J76k08K45k90L41m01M70n43O23p14Q19r36
27d98J064j204J357j529J718j928K156k404K678k979L308l667M065m501M981n513
43b896O106o768P506q339R287j0379J1652j3151J4947j7149J9927k3552K8495
56A5686l5651M6950o7433J15613m09658k71942R61657n26993k70002O82982j81075
67F0134k01797O68860l53192m85353O17209r0656o75535M00300J29793m39517
77c69754L96998K40440m91479K64254L86697m17846j01646K01852k27768Q853
87a09399J05509k70162J23256L62174j71473q4292K17255j3706k0334m2266k48930
98a52368O6830J31465k50772K3652K08311j40432J32896K47114l03072n032L55082
$$ plain form
0 0 0 0 0 8 -8 8 -8 16 -24 29 -37 40 -48 64 -80 96 -112 133 -157 184 -217 253 -290 333 -381 438 -498
27 -498 566 -638 719 -810 908 -1020 1136 -1268 1410 -1569 1739 -1928 2137 -2364 2617 -2896
43 -2896 3210 -3558 3948 -4391 4896 -5483 6169 -6982 7965 -9184 10743 -12809 15686
56 15686 -19965 26985 -40448 75165 -334493 -606435 355222 -171771 -441773 241209 60134
67 60134 -141663 527197 174005 -311348 305861 215205 -460330 -60030 69763 -369754
77 -369754 27244 267684 -223795 40459 427156 9310 -92336 109516 -118252 -109399
87 -109399 -3890 -274052 -150796 211378 39905 -44387 172868 159162 138828 96562 -152368
98 -152368 -85538 45927 -204845 -181193 27118 -113314 19582 266696 -36376 -41408 313674
109C13674k80288k16491K57102j89725q8406L79903k51281k20027N89326m2561
119B51226m96295L62233J25347m54807K07124R2175m43541L09144L05151n02547
129b44790J36676M72267l68006n2397L63588l77109j32065M38095l04741l04183
139c72665M59655q816k71084K94240j927k04465L13397m3569l94029K31832J52467
150A55036l28042O5787J64353j50919J18940J21240k05178P7851J55708j94425
160a9649l6274P2033j33181O5661R8634j80324O7317K09724j15279j7179J01985
171A13468j26746L9668R4656k59713o876K59646j64982j01742K39157p4402o2782
182e0648K30181j51464j72078K79725o6598k72885K15666M0288k15278K21762
$$ plain form
109 313674 33386 -183105 73997 -115728 -204134 175769 -75512 -295539 293787 251226
119 251226 -245069 117164 242511 -212296 -5172 87003 -356538 -47394 257757 -244790
129 -244790 -108114 364153 -3853 -56250 307338 -69771 -201836 236259 -68482 -372665
139 -372665 86990 78174 -192910 101330 99403 -105062 208335 164766 -229263 2569 155036
150 155036 -173006 -107219 57134 -93785 25155 146395 -58783 19068 174776 -19649
160 -19649 -55923 16110 -117071 -51410 47224 -133100 -65783 143941 28662 11483 113468
171 113468 -13278 26390 121046 -138667 -145543 114103 -50879 -152621 86536 12134 -50648
182 -50648 179533 28069 -144009 135716 69118 -203767 11899 52187 -163091 58671
192E8671O4356k75260K09199J75781l29990L2752K04825k34452l299J85608k17347
203a29156J3339K88926j82019j12705K80233p4688j65409J69862p1878j51096
213a34591J91613k6438j89490J67945P5569j44594R3486M1556j31962R4106L9515
224G6715j75915M9241R9604j01104K3252O1376o7424P6329N9034j36479K6417
235h954Q7815j13390j0691N8306r3289M5087J01710j22040J1506J51264r1022
246A6302m4896J07721r6349m0790J37839j05804r3237J81969k2855j25939J34872
257D8833M987j18869J21903l394j69701J17117P4539j71834N9335J14164j20942
268d3862M1544J07589j37568M793J33663j25402o3022J24930o2299n4843J12045
$$ plain form
192 58671 123027 -152233 56966 232747 -97243 -64491 140334 -94118 -97417 88191 -129156
203 -129156 -115817 173109 -8910 -121615 158618 83930 -81479 88383 16505 -134591
213 -134591 57022 30584 -158906 9039 84608 -59986 33500 75056 -56906 37200 76715
224 76715 -99200 -49959 49645 -51459 -28207 33169 -34255 42074 101108 -35371 -8954
235 -8954 78861 -34529 -45220 13086 -80203 -35116 66594 -55446 -43940 107324 16302
246 16302 -28594 79127 -17222 -58012 79827 -25977 -119214 62755 39900 -86039 48833
257 48833 53820 -65049 56854 53460 -116241 876 75415 -96419 -37084 77080 -43862
268 -43862 -2318 105271 -32297 -27504 106159 -19243 -82265 42665 -19634 -74477 37568
279C7568m6667n3523J29070j9562r5975Q2981Q547q1718M9460j609o8918O7950
291G604K5242p3298M3760M0744n0570K1194O217n7585L5909J7921o8374K8299
303b2937M3008m0522K9728K9885n2615L4462L7572q2284J349N2896o2135m768
315c6361N4980n3662O738Q3912n5468l2185Q5663l3000n5866O2180k6477n5281
327e4827P6560l916p2887O9760L3730p2571L3798L0839p0345K2253L7628p3843
339d3821P697O5523m4808r789O0687k4520j5940M5785l0710l4888M0909j2291
351C834m0982K6659R302j6435K5288M604j8602K2955P944k8126j786M220q844
364i969L573m501m669K1659O522q660J0256j926j0040R013j3508k2864J6641M500
$$ plain form
279 37568 -9099 -62622 66448 46886 -49089 33892 42439 -39279 10181 8572 -60346 7604
291 7604 32846 -40452 3308 44052 -6518 14676 20893 -36692 -783 17138 -51236 -22937
303 -22937 20071 -20451 9277 39162 -13453 21009 58581 -23703 -22354 30542 -31593 -36361
315 -36361 18619 -35043 -28305 55607 139 -32046 53617 20617 -35249 26931 454 -54827
327 -54827 21733 17817 -55070 14690 48420 -24151 9647 40486 -29859 -7606 30022 -43821
339 -43821 -36124 29399 -15409 -25198 35489 10969 -4971 40814 10104 -24784 16125 3834
351 3834 -37148 -10489 -1187 -17622 7666 12270 -6332 16623 24567 -3559 -5345 -1125 -9969
364 -9969 -6396 -10897 -15566 6093 12615 3955 14211 12285 2245 11258 -2250 -25114 -8473 -3973
378c973j8632J7183J4183j2012J8513J1598k7861N344J6798l0504j0999J9817
390e45j2566m092K3888p767o043K9401l203k6410J1446O379k2646m10P854j0677
404a5391Q558J8899r211l423K0252j752j8786K191l1j6500K918R122j3904L999
418a3059K6889n152j1930J9925O46k0442P207j733k2005J2963J1545k3327J0825
431g648K8065j7056m346K0926j6906j1448J7383j8543j6479K7010j372j6231K3923
444G278P500j3288J6661n92k4653R527L242k4636M721R494j0447J3671J0940j2681
458c263J3353J1680k0563L57N298j8911M427O895j9004J4396K0971k0506P276
471B406K2802k3816l116J7980l0614o745L0285k4591j0867M1888j1505j5087M0395
$$ plain form
378 -3973 -22605 -5422 8761 -3251 15262 26860 -1001 4343 21141 -9363 -20362 -545
390 -545 -13111 -17203 6685 -1082 -7125 22276 19073 -7337 4109 10488 -12158 -12568 -4714 -15391
404 -15391 -6833 12066 2855 -568 19684 17932 -854 1337 1306 -15194 -12276 -3154 -17058 -13059
418 -13059 13830 8678 -3252 16673 17319 -3123 4084 2351 -19654 -6691 4854 -18473 -7648
431 -7648 20417 3361 -985 19941 3035 -8413 8970 -9573 -26052 958 -414 -16645 7278
444 7278 14778 1490 18151 17559 -7094 2433 5675 -18961 -14240 -4746 -15193 -1522 9418 -3263
458 -3263 10090 21770 1207 1564 6862 -12049 -7622 -727 -19731 -5335 15636 -4870 2406
471 2406 25208 1392 -1724 16256 -14358 -21103 9182 -15409 -26276 15612 4107 -10980 29415
484B9415j3451k9678L7516j0631m5595L2885O872m2365L1549K0103l9353K9301
496F568K8058m8327J2597L3797m8204k427L7310l8137l458M5700l0671j0446N0197
509C2557k4525k5536M1608j9337l1210L7838j3114l1676M3029L26l3452L8361
521A4869O388l5708L0409L487m3120K7487J1383m4915K3786K2368l8841K2017
533c90K5367m2206J7865L0664m9006O035L8684m4449j092M4598l9351n494N2375
546C3600l7353j9694N5766k9837l2741N3605k0520l8549N6410r458m8228N5209
558A8210O210n6201M3419J5967n8773L5489K4899o2415K7448L9760n9651J2907
570a2731M6883n2195K957M8948m9884o297N6542m2494j9514N8527l0167k7002
$$ plain form
484 29415 15964 -13714 23802 13171 -32424 461 7333 -35032 -3483 16620 -22733 6568
496 6568 34626 -13701 -1104 32693 -15511 -17938 19372 -18765 -22223 23477 -7194 -17640 32557
509 32557 8032 -17504 24104 4767 -26443 11395 -1719 -33395 9634 9960 -23492 14869
521 14869 21257 -14451 15958 19445 -23675 3812 15195 -29720 -5934 16434 -22407 -390
533 -390 24977 -17229 636 31300 -17706 -11671 27013 -17436 -18528 26070 -13281 -18775 33600
546 33600 -3753 -23447 32319 2482 -30259 23346 2826 -35723 20687 11229 -36999 18210
558 18210 24420 -31781 11638 27605 -31168 4321 29220 -33195 -5747 34013 -25638 -12731
570 -12731 34152 -18043 -15086 33862 -16022 -22319 34223 -8271 -27785 30742 575 -26427
582b6427N5046k4729l3798N5206j6762m3163N1541m459m4077M6923P38m7403M6771
595A5407Q626n6701L8481K0921n6413K8797K6613n4157K7169L4644n8897J7369
607h141M5756n7324L007N0129n2381m682N7823m7069j5961O5100l5746k9083O1834
620C3262k8051l7530O1542k1676n0598O3541k099n9187N3672J3677n8520M3404
632A1437J8672o3532L5770L0036o6566K3603M2898n8956J4314N0047n5151K869
644a4559N6073n0980j4044N5377m0967k0268N5540l4887k3818O3866k5384l7969
656c2020O0949j1953m5932M9104p642m7547M9418l58n3594M9912J5461n7819M0637
669H616K4643o1492K9769L2215o4019J7829M2489n6284J0736M7818n1837O689
$$ plain form
582 -26427 28619 3890 -29908 25298 8536 -34627 16914 12455 -31622 15301 16039 -31364 15407
595 15407 24033 -32668 5813 26734 -29679 -882 25731 -28426 -1257 33387 -25510 -8141
607 -8141 37615 -19709 -16702 33427 -18954 -23636 34187 -12882 -28843 36257 511 -28572 33262
620 33262 5211 -32319 29223 7547 -43051 20490 18391 -40796 12876 26553 -31967 11437
632 11437 30109 -33423 2347 32383 -34183 -10580 32318 -26638 -12324 37723 -17428 -14559
644 -14559 41514 -9466 -23510 31867 -9100 -29368 26172 -8715 -32533 31333 5949 -32020
656 -32020 28929 16976 -28956 20148 12506 -35041 14377 14019 -39575 10337 25798 -32021 8616
669 8616 33259 -28233 1536 33751 -30268 -12439 30050 -26234 -15498 32320 -19517 -12828
681a2828N6071n4860j1481O4418m5116l0964O1339k8755l3692N9828k0011l8015
693c4066O2568j1106n1025N6489M17o0142M7131J3721o2566L8309K8859n7817
705b9228K6863L4266n3626K0025L5939n9012J1458M8883n6727n262N7967l9945
717h399j5074N3445l1550j8118N1290l1913k7145N4415k5107l7267N6219j2079
729H717m4143N3499J303m9450M3489R086m9628L6412J0987n2932L7474K2222o0521
742c3485K9084L9721n7799J1368M4288m8947K588M3193m7139j843N0980m4940
754a2931j2779N9265l5812k6939N9621k3192l8245N3025j1127m1406M5988m612
766A0856m1604M6145J237m9932M4610J5939n7410L0358K9396n1997J6197L1341
$$ plain form
681 -12828 43243 -11617 -23098 41320 -3796 -34760 26579 -2176 -35868 23960 3949 -34066
693 -34066 28502 17396 -33629 22860 23277 -36865 10266 23987 -38579 -270 28589 -29228
705 -29228 -2365 31901 -21725 -1700 34239 -24773 -13315 35568 -21159 -26421 31546 -8399
717 -8399 -23473 29972 -1578 -19696 31594 -319 -27464 26951 1844 -35423 20796 8717
729 8717 -35426 18073 19376 -30074 13415 22501 -27127 9285 20272 -32660 4814 27036 -33485
742 -33485 -4401 35320 -22479 -11111 33177 -15770 -13182 30011 -17128 -18971 32009 -12931
754 -12931 -25710 33555 -2257 -29196 30425 7233 -31012 22013 10886 -30520 15468 10856
766 10856 -30748 15397 16634 -33298 11312 27251 -30159 199 29595 -22402 -6205 25136
778B5136m4679J2888L2508m5377Q870M0763m5238k392M7972l7948j5010M8422
790B5915k7046k1768M4102k0120k3254M2839j8127k7985M6930j1945l9214M5386
802A5713J705m5269L5048J1238m2578K7999J3834m1977K7358J9833m6733K1817
814b012L0634m7766R749L7929m2533j271M0014l5037p024M0729l0438j1277M3786
827B5483k7752k0201M6937j9829l1603M3687p043l5199L6119O17l3305L3079L463
840A4453l7179L1617J0838m3191K3565K0906m1293J4112K6283l5488Q515K8255
852B1393l2469L807K9683l1924k192L3412k9822j0017L7881k1921j7547L6442
864A6726j2899k0282L1894j0748k2555L2156q188k8939L2451J567l2843K7232
$$ plain form
778 25136 -19543 -6655 25853 -19524 -10654 30109 -15129 -17521 30451 -7497 -22507 25915
790 25915 -1131 -22899 21203 1083 -22171 20668 2541 -25444 21486 9541 -29673 15713
802 15713 17418 -27851 7197 18435 -24143 3856 17690 -24287 3071 22904 -23829 -2012
814 -2012 28622 -19144 -9395 28534 -13999 -15270 24744 -10293 -17317 23412 -7026 -18303 25483
827 25483 -2269 -22470 24467 4638 -26965 16722 9679 -25520 10599 11216 -22089 10990 14453
840 14453 -22726 8891 19729 -23462 103 21009 -20284 -6172 20111 -15377 -6862 21393
852 21393 -11076 -7269 22414 -9510 -11702 21710 -8112 -18129 19752 -2169 -19716 16726
864 16726 3827 -16455 15439 4691 -17864 14292 6104 -22835 9616 11183 -21660 5572
876E572R770l2485K1324J3372l3373J5724J7108l3163J1067K1690l1598P541K7569
889B0118l0203l9L1809k5288r156K9802j9806j1832K9047j7042j4856L2425j1018
902C961k1265L0166l852k4702K4640n03k6030K2535M655k7307J9686J0903k6208
915a3321J5336J3620k7077J0541J7140k7479L679K0591k2247M92K1267j9149o67
928g274K3837j8814p694K5046j4628j3481K2494r763j3946K2987o116j6183K2832
941I297j015j9304J8098J268k0871J5987M091k2759J4463J1236k1412R666J3912
954A2657j8951O158J3420k0778K459J6704j9296k506J9303j3525l968J9600j1536
967b59o883J9773r847j2550J7352n831j3468J6040k859j3212J7422J241j5826
$$ plain form
876 5572 15342 -17143 4181 17553 -15820 -96 17012 -16151 -5084 16606 -14992 -7451 20118
889 20118 -10085 -10124 21685 -3603 -12759 17043 -2763 -14595 14452 -2590 -17446 14979 3961
902 3961 -17304 12862 9010 -15692 8948 8445 -17585 4950 9605 -17702 1984 12887 -13321
915 -13321 2015 15635 -11442 -901 16239 -11240 -7561 13030 -9217 -8725 12542 -6607 -7274
928 -7274 16563 -2251 -9945 15101 473 -13008 9486 -277 -14223 8764 2648 -13535 9297
941 9297 8282 -11022 7076 8344 -12527 3460 7551 -15208 -745 10491 -10921 -1255 12657
954 12657 -6294 -136 13284 -7494 -5035 11669 -7627 -10133 9170 -4355 -8323 11277 -259
967 -259 -7142 12631 2784 -9766 7586 1755 -11713 4327 1468 -11744 5678 6919 -8907
980h907J3731M562j6470Q823M580j6217Q301P991j6000O485J2265j3039K769J1188
994A0062j2758M56J1234j3748l100J3782r246m784J3756n657m521J3270n873q402
1008e529J2144l575j1187R673o61r200J0293J416r967J0151M474j1941N145M882
1022F118j1070L083N085j0244L500Q835q490R63R533o682j468P087p635l081Q012
1037C546o028m689R100j729l837P842j376m620O855j941p662N088M27o596M208
1052a412K296m578N190L109n706K802L326o249k8K252m871R36L777l846J203N707
1068C908k464j082L560k751k068K298l094k427L655m37j839L692R45j276K355
1083B975o18l047J406j64l588O00J669q32J204J575k65R09J101j767j300L32j057
$$ plain form
980 -8907 4824 9386 -7084 1739 6319 -9898 -1597 6394 -9606 -3121 9144 -3895 -1126 10062
994 10062 -2696 -2240 8994 -4754 -7854 5928 -3318 -8102 5654 -3 -4524 8746 2873 -5529
1008 -5529 6615 3040 -8147 1526 865 -8335 1958 3374 -6593 3558 8032 -3909 1236 6118
1022 6118 -4952 -1869 3216 -7028 -3528 5307 -3183 -2220 7313 631 -837 6250 -1385 -4466 3546
1037 3546 -2482 -7171 1929 200 -3637 4205 2829 -1791 5064 3123 -4539 549 976 -5620 -1412
1052 -1412 884 -3694 1496 4605 -1101 1701 5027 -1222 -1250 1002 -3869 -2933 844 -3002 -1799 3908
1068 3908 1444 362 3922 1171 -897 1401 -1693 -4120 -465 -902 -2741 951 1896 620 2975
1083 2975 2357 -690 716 552 -3036 -2436 -767 -1599 -395 1180 915 1824 2925 1158 -142 190 -867
1100h67j324J64M22N98J281Q99n4M11R17j164j992J53j13j576M64J163m24J588
1118E46J746j554M24J472k446j379J209j944o30K697j230m10L997m75k212K650
1134B461p83l259J814q17l263L180J072k878L270K256l286K073J399m863J025
1149e99K091m965O96M054l291Q31M653l278l5M310m659k241M617l799k899N538
1165A024j811k425O559j074m162N877r00o207M163j38o274M714J942n963N386
1180G11L990o633L268M329p731J109M412p733N37O675o139j28Q315m796j743P655
1196F098n447m109P470m863n761Q395j846n596Q589R3o214P733N1q815N954J335
1212C067r518M977L755q310N475N829q370L742O818r333L95O592q978o37Q035
$$ plain form
1100 -867 -2191 -2027 -1605 -1007 274 1173 1119 1530 2447 1283 -709 -556 -669 -2245 -1781 -618 -1042 546
1118 546 2292 738 1162 2634 188 -1191 18 -1926 -2556 141 -1089 -1499 2498 2023 -189 2461
1134 2461 1678 -1581 233 -584 -3847 -667 405 -2473 797 3053 -233 1840 3239 -1624 -599
1149 -599 1492 -3473 -2777 1277 -2014 -1183 3470 192 157 4467 -192 -2433 2184 -1615 -4514 1024
1165 1024 -787 -3212 3347 2273 -1889 3988 3088 -3119 1044 906 -5368 -654 1288 -4675 711
1180 711 4701 -1932 1336 5665 -2066 -957 3455 -4278 -3741 2934 -3205 -3333 4982 186 -1557 6098
1196 6098 651 -3458 4012 -851 -6612 1783 -63 -5659 2930 3023 -3191 4542 4593 -4222 1732 3067
1212 3067 -6451 -1474 2281 -6029 -554 5275 -3095 647 7465 -1868 -1473 5119 -3859 -4496 3539
1227C539p572q59J0483n718l011J0198n210n687Q957m887p494R557k071p977J0141
1242B389J079q096Q902J519j0144P039K469j2046N216N324j0610M648P721r409
1256c999L595Q906j0328O5R234j0150k744R793q049k929J1675n813m405J2491
1270G342m320p445J0650l718r527R832j675j0147J0352K125j0080R228L967j0789
1284d205O924M207j2748M703O482j2530L211R281j0111K074J0647r534m86J0750
1298H665r772l891J0873q118n427J2092n510o046J3184l006q542J1629j539j0705
1312f113R338m13j1346R431K524j1648Q990O041j1889O211P005j2303L221P611
1326F660j2385J437R957j0600K75J1656q980j574J2201q664n055J1965o977p498
$$ plain form
1227 3539 -4033 -4892 5591 -127 -3138 7060 1850 -3837 5120 233 -7261 2296 225 -7752 2389
1242 2389 3468 -4628 4274 5793 -4351 2688 5157 -6889 -1673 3651 -6959 -2311 5410 -3999
1256 -3999 -404 8502 -1826 -1761 7473 -2677 -5421 4372 -3677 -6606 5069 -744 -5149 7342
1270 7342 3022 -4423 6227 2509 -7018 2814 1139 -9008 1344 3469 -6611 2617 6584 -4205
1284 -4205 2719 6926 -5822 -1119 5363 -7167 -3956 5325 -4786 -2712 7935 -1599 -2085 8665
1298 8665 -1107 -4998 5875 -2243 -7670 4422 -1088 -7134 6050 3044 -5498 6131 4592 -6113
1312 -6113 3225 2812 -8534 897 3421 -8227 763 6804 -5085 1126 8131 -4172 -951 6660
1326 6660 -5725 -4288 5669 -4931 -4656 7000 -1980 -3554 8647 -17 -5072 6893 -84 -7582
1340g582J1712m221p572J2090k028q930J2004l38j1403R647J527j2329P826L765
1354D168j1950P325O353j1644N728P919j1812K868Q768j2175M06J0503j0676j521
1368e740J1979q050k944J2024p076m883J1860o505p671J1956l923r257J1548n30
1382B788r755J0654J363j0874Q888K534j2018P045M309j2073N978O949j1731M162
1396a781R377j0853J144R543j0071q42R638r423k137J1417p855m126J2404n511
1410I24o462J1459l718q325J0350k205r278R994j37r611R646J873j0649Q395M025
1425F281j1995N841N763j1406L605O999j0147L029Q301j0017J313R885r687j730
1439c965J0536q054l936J0600o044m975J0806m221o236J0606l032p865J0057j392
$$ plain form
1340 -7582 4130 -91 -7663 4427 2399 -6531 5473 5135 -6268 3379 4906 -7423 403 4168
1354 4168 -7782 -457 5896 -5748 -20 7899 -3913 -1045 7723 -4452 -4046 6457 -4219 -5740
1368 -5740 6239 -1811 -4755 7269 193 -4690 7170 665 -7006 4950 1027 -8230 3318 2788
1382 2788 -6967 3687 5050 -5824 3064 5598 -6420 625 4934 -7139 -1161 5788 -5943 -1781
1396 -1781 7596 -3257 -2113 7430 -2641 -3483 6155 -3268 -5405 6012 -1843 -5969 6435 924
1410 924 -5538 5921 2203 -6122 4228 2023 -7255 2739 2602 -7009 2637 4510 -6139 2256 6281
1425 6281 -5714 127 5890 -5516 -1911 5088 -5059 -2030 6271 -3746 -2433 7452 -2235 -3965
1439 -3965 6571 -1483 -5419 5181 -863 -5838 4968 747 -5489 5117 2085 -5780 4277 2885
1453B885r683R140J301j0204P546L511r606O032M328j0049N027N620j0706L030
1467a828P669r940R00Q911q222q31R155p079k331R245o456l791R571n317n306
1482e650J0102l243o968R443r03p895P855K82q102P140J100q940O929L186r712
1497e376N380N283r388L204O221q661J539O740q023M87P547p437o88Q564o724
1512a332k682R202n115m713Q694l190n540P987k271n839P964j028p237P575Q64
1527C339q217O051K594q153M648L640p921L602M645p702K399N559p490J101O755
1542D850o938q12P458n610k230P184m460k973P190l744l983P648k527n380P197
1557B870q09o187O137L13o446N344J404o621M637K529o828L929L530p014K597
$$ plain form
1453 2885 -6798 2342 3643 -6561 985 4496 -5110 922 5250 -4799 228 5848 -4858 -1828
1467 -1828 5841 -4099 -3199 5712 -2510 -3341 5814 -1265 -3596 5649 -807 -4598 4973 -344 -5650
1482 -5650 4452 1209 -5759 3684 2781 -5114 2741 3023 -5079 2061 3161 -5779 1150 4336 -5376
1497 -5376 4 5287 -4101 -897 5324 -3337 -1798 4942 -3081 -2594 4953 -2484 -3172 5392 -1332
1512 -1332 -4014 5188 73 -4640 4054 864 -4676 3311 1040 -4799 3165 2137 -5100 2475 3339
1527 3339 -4878 1173 3767 -4386 262 3902 -4019 -417 4228 -3474 -1075 4484 -3006 -1905 4850
1542 4850 -2088 -2900 4558 -1052 -3282 3902 -558 -3531 3659 -85 -4068 3580 1053 -4327 2870
1557 2870 2061 -4126 2011 2324 -4122 1222 2626 -3995 642 3171 -3657 272 3802 -3212 -615
1572f15M719o794R40N375n720k5N652n087o22O168m733k019O549l813l422O281
1588B834k535m038O006j257m496N627k12n052N018N12n781M246J574o104L424
1603b34K964n626K403L661n108J465L888n252M95M478m863o04N050l786j307N171
1619B795k877k119N137k343l031M575j587l660M448n89l851M349M59m203L644
1634A147J253m493K586J584m570K084K362m401J542L393l976P82L535l599k14
1649i85L525l535r06L772k687j456M144j855j866M048j368k671L582p79l296L152
1665H19j25l183K916O82l124K650J353l495J873J661l559J114J921l230P91K517
1681A581k743L29K883k371l66K716k225j075K718j858j454K849r07j622K740m87
$$ plain form
1572 -615 4104 -2690 -1750 3625 -2095 -2120 3532 -1555 -2177 3991 -742 -2761 3788 -25 -3447 2834
1588 2834 299 -3739 2267 1010 -3486 2141 1929 -3123 1895 2407 -3374 872 2446 -3658 -234
1603 -234 2730 -2896 -493 3168 -1940 -475 3413 -1839 -1344 3134 -1729 -2333 2717 -1069 -2376 2795
1619 2795 -82 -2201 2936 593 -2438 2137 550 -3110 1338 749 -3102 1247 1706 -2497 1147
1634 1147 2400 -2093 493 2077 -2493 -409 1953 -2448 -906 2487 -1489 -707 2828 -771 -985
1649 -985 2540 -995 -1901 1871 -816 -2272 1872 17 -1849 2199 831 -1840 1742 963 -2333 819
1665 819 694 -2489 427 1109 -2015 635 1988 -1507 366 2027 -1532 -418 1503 -1727 -936 1581
1681 1581 -1162 -833 2050 -321 -687 2029 -196 -1271 1447 -411 -1865 984 77 -1545 1195 708
1697G08j808K352k84k321J948J50k467J683P57k161J543J162k126J075J378k255
1713f66L20J494k109J20J731j664q1J998j303m25J866j079q91J629r22j144J638
1730E12n36j135J626n6j209J377J23j370J074J96j496R24M50j363O46Q28j192
1747f01N33Q56j052J24Q73r77j60R23q57j68Q86n83k66R94l10n66P45k50n24O56
1767B76k03n32N66M3n48N00J27n09L48J76m45J78K30l99M0L41k61m0K55k18k2
1788i7K27j81q9K72j13l4Q8m2l2M9m2l0l6j3j6l3J80J03j46JJ36j32KJ5k33K7
1814a69K62k02j10L82p6j39L39k29k34L22r6m60M56L8m13L65K24n11M06K31o64
1835b78K32L54o97J50N15o01R5O81n94MO83n60k41P35n29m33P58l30n56R91k11
$$ plain form
1697 708 -1100 1252 968 -1353 595 745 -1722 -39 718 -1443 100 1262 -864 211 1589 -666
1713 -666 -346 1148 -961 -841 890 -774 -855 1143 -160 -585 1281 202 -689 940 18 -1126 512
1730 512 -24 -1159 467 411 -798 579 702 -668 406 602 -894 30 480 -883 -237 591 -601
1747 -601 -68 788 -264 -140 733 -244 -404 519 -338 -506 380 -203 -469 525 215 -351 394 144 -380 276
1767 276 73 -459 107 150 -398 102 229 -280 68 244 -201 -23 207 -192 -152 189 -72 -112 143 -75 -97
1788 -97 130 -51 -140 132 19 -15 73 31 -1 48 6 -24 -60 -73 -89 -122 58 161 15 16 152 20 22 37 -196 -169
1814 -169 93 -109 -219 163 87 -52 287 58 -176 146 50 -410 46 84 -329 36 260 -251 155 386 -278
1835 -278 -46 308 -389 -239 276 -325 -230 451 -143 -139 544 -16 -257 478 -51 -484 274 -56 -612 379 168
1856A68o67J046k20p39Q08m2j045P77J38r08O88M80r07N56O06j130M42O81j163
1875d31L9R24j046p1J196r01p5J224q30m80J233p83p57J260n38q67J249j97j000
1894h51J412P0j338J199J92j470R20M11j590Q59Q42j463O62J066j405M65J052
1911A033j397j2J219j337l30J567j043m69J631q45o91J736p98j116J598m91j330
1928a075J453k7j470J450K99j553J286N23j641R25P80j849P40R64j719N36J298
1945I20j554K31J512j468r3J556j392n06J638j083p40J804p90j003J878n66j237
1962h93J736l41j586J561K4j657J410L72j745J317P84j878R80R54j813N63J243
1979A031j883L41J538j657k5J867j530l92J882j230p79J815j078r37J856p15j179
$$ plain form
1856 168 -499 547 327 -412 396 354 -691 86 224 -684 4 484 -423 133 739 -391 51 732 -431
1875 -431 -392 532 -514 -585 611 -290 -365 859 29 -451 782 -1 -758 502 -36 -903 346 149 -851
1894 -851 561 631 -707 492 684 -786 134 545 -1045 -186 656 -807 -145 921 -484 -19 1033
1911 1033 -364 -376 843 -494 -824 743 -300 -769 862 17 -674 1062 264 -852 746 255 -1075
1928 -1075 378 351 -1119 331 630 -923 363 886 -755 170 950 -899 -159 805 -914 -378 920
1945 920 -634 -403 1109 -359 -452 1104 -288 -794 844 -239 -979 825 35 -968 910 344 -893
1962 -893 843 502 -1084 477 501 -1156 254 626 -1119 198 982 -896 84 1038 -775 -212 1031
1979 1031 -852 -511 1027 -630 -655 1212 -318 -710 1172 -58 -837 978 -100 -1037 819 104 -1075
1996a075J774k53j449J745j53j675J551K53j845J225O02j775J101Q86j810Q78
2012b0J161j840M07J500j893J42J526j539k13J803j207n47J730r66r38J793q85
2029A4j131J869n38j406J771o5j514J515J57j568J368L09j793J168O88j860Q28
2046a88J096j653N87J167j558K07J496j685m2J548j406l18J630j099o43J766q43
2063F2r24J712n73j156J547l51j296J444o9j460J370M76j682J124N25j542R18
2080A25O31j551O41J043j575L95J226j433O5J404j293k37J416j084n02J513r30
2097a46o17J485o68q87J619m91j165J397j03j242J181J52j406J171L13j408R66
2114A51N23j421P26P35j399N03R80j404J92J213j187L6J154j111j79J309r51n52
$$ plain form
1996 -1075 699 446 -1003 742 589 -1086 465 718 -1127 98 700 -1075 26 912 -898 -20
2012 -20 1141 -699 -292 1208 -685 -543 983 -556 -769 1034 -173 -720 1010 44 -894 899 14
2029 14 -1117 752 214 -1192 579 514 -1000 515 672 -896 472 781 -1012 156 844 -1016 -188
2046 -188 908 -745 -158 1009 -549 -342 1154 -531 -573 975 -431 -749 881 -218 -861 905 62
2063 62 -862 850 277 -879 668 317 -979 465 396 -1064 306 782 -900 224 749 -793 125
2080 125 756 -795 -154 889 -686 -291 935 -498 -433 971 -322 -559 857 -227 -729 784 -146
2097 -146 -763 722 54 -833 786 295 -870 527 424 -818 363 515 -891 280 593 -815 151
2114 151 674 -747 -21 714 -685 -182 798 -606 -414 799 -388 -352 802 -309 -488 821 -130 -682
2132f82J423p46p57J329m53p28J183l09r16J104oj201J030J83j174R29L43j260
2150g08P77N84j211M58P23j062K87P90j077J07R89r37j72J074q29k27R57n97l81
2169d55J011n39n56R76k83p48R27l7q62R06K4r18P29K18q65N09L13q81N52M78
2189D99r76M57N41p85O8O92p14j3P37p48q5Q30o13l25Q23l97l36P54l62m96Q21
2210C72j64o64O95j21n52O38N5p08O07J97p11L88L53p07L18L73o69K54M37n69
2230a78o5N97m90p3N58m93j01O18m24k01M98k50l30N68k38k55M36p2m69N41K0
2251A97m47L74M0l81K94J01m49K69K22m35J80L53n21J65L46n13Q0M27m26n4M21
2272B43l98kL98k93j33M74k88j93L83j52j66J94l2k86L65o0k33K58N3k60R1J50
$$ plain form
2132 -682 741 -5 -762 567 114 -614 569 260 -656 448 442 -759 271 454 -720 209 552 -708
2150 -708 69 653 -558 -100 623 -439 -152 638 -439 -332 657 -280 -452 622 -207 -434 523 -74 -455
2169 -455 556 17 -539 437 154 -594 333 296 -566 340 364 -554 175 393 -472 37 350 -531 21 499
2189 499 -477 -20 521 -264 -196 496 -218 -231 506 -242 -327 503 -110 -435 388 -9 -345 409 47 -449 372
2210 372 208 -456 239 118 -434 204 259 -449 158 355 -356 32 385 -322 -4 369 -300 -46 391 -178
2230 -178 -243 354 -136 -209 349 -144 -245 373 -51 -252 246 -4 -334 234 -4 -259 177 105 -364 177 197
2251 197 -250 124 164 -217 77 178 -271 -2 220 -215 -35 318 -203 -38 308 -205 -125 302 -124 -178 243
2272 243 -155 -157 241 -52 -185 289 1 -192 191 39 -127 67 35 -251 114 54 -179 79 132 -128 -37 113
2294A13k90K37O6k89J46J78k87K7K30k33O2J77k93J02K38k07r2J84j76LK31j32
2316eo4K03j20j30J20L8p3J21m5k61L10k8j11L3J3n2N4J0j60J24J09j99R0P1r9
2341e1J59j9j71P0O9k15N3R2%l5J35j26J51L4j35o4N2o1l4R2q2J10Q2j40LJ87
2367A56j20Mjn9r6J70q7j29J68N8j24J12J1KPo8n1P9k4j86J11M5KR3M0j60Q9P8
2395A20k08L2P6j04J26l7j15P5J78j70J2J14q5m1L7j09K5J49j07k4J78p3p4J26
2419A01o8j12J86j07q8Q8J6l0J8P3m4J11n6j72J19L7j45O4L6j13P3R1j26J4J68
2444A34j11l4Jk6LOp1k8K19q3L4M2m9K0Pj55l9J15k8o4Q3N3j1K4K1l5M5k6j49
2473a02K5%K2mO4l7R7P2j17j0Q6m9j09J0k4oJ29o8k1J45p0nl3l9K6jk3p3J09q3
$$ plain form
2294 113 -177 60 126 -163 -17 161 -126 -99 131 -102 -40 137 -156 -54 184 -23 -115 69 -107 -104 127 -5
2316 -5 -69 134 14 -116 4 42 -31 90 45 -216 94 66 -45 -12 1 -51 3 13 -147 -23 86 -113 -23 48 -51
2341 -51 108 89 -82 -12 57 -158 -105 -13 -13 -48 87 -39 112 146 11 -53 -1 -62 -96 -4 -86 24 106 -34 -31 156
2367 156 36 40 39 -20 -116 54 -33 -162 6 64 -60 52 63 65 72 4 -47 32 8 -178 -67 -22 -20 73 113 -47 42 120
2395 120 -88 -56 20 -84 42 5 -110 -35 143 -27 -15 99 14 -27 10 -99 -74 75 -32 -56 122 49 -25 101
2419 101 33 -79 107 0 -88 0 16 -14 4 77 33 144 88 -84 35 72 -73 -9 27 -86 -13 78 -48 -34 134
2444 134 23 -11 -10 -36 -33 -27 -98 -126 93 10 44 86 37 57 64 -91 -130 -15 -43 -107 -24 29 18 42 63 28 73 47 -102
2473 -102 -77 -77 -55 -59 5 -32 65 137 20 10 96 47 -62 -52 -76 -82 47 -21 -42 103 33 28 -5 -44 -18 -19 -42 -115 -6 -89
2503h9J29qM7o9K6m1jj5k0L0j36O2J14m4l1J17j8l2P3r2j06J03q4p2J32Qk5O7
2531B5K8n4P3M7j47l7K8p7R2j1n8O1J61j33L5J33j51o0M9j34n5K23m6j16J97r
2557F4j06J66k3j45O0k1j86J91N0k58K11J06j29R2P5k04j1K38l11J9K39k70K7
2580a26K72k43k2L44j93r3J87j63j15J91r9j44L30q4k19L57nl33L03kl55J69J59
2603A16l77J79K76l72K46K01l39J07K11l98K1L97l67j28M50k80j05M40l27j37
2623a86M62k68k67M11j27l16L94q6l84N54O0n19M30J20n01L12R8n48L32K68n49
2644c10J92N07n75J47L47m63L4M60m49k43O28l55k41O32k92k20N76k78l69N78
2664C06j61n42N47r0n01O09P0o01N59J70o44L14L77p04K77L47p25K05N80o45J30
$$ plain form
2503 -89 40 32 79 10 36 -5 -6 -21 -41 -11 -147 -85 29 -15 -46 71 53 21 94 2 -104 -1 -85 -157 -25 -17 -42 25
2531 25 53 -1 72 119 -28 -65 -37 -114 -22 -33 -91 -30 131 -2 33 166 15 -45 4 -130 -185 38 -8 -124 73 64
2557 64 -42 124 101 -44 16 -5 -191 0 50 -208 3 109 -20 72 147 -57 -68 170 -141 -122 117 -153 -126
2580 -126 146 -97 -119 225 32 -61 126 -37 -152 39 -60 -204 126 42 -177 180 175 -158 145 143 -212 -43 116
2603 116 -261 -82 194 -178 68 269 -70 37 248 -150 -129 268 -99 -227 223 -57 -162 278 -49 -186
2623 -186 276 8 -259 152 25 -291 103 17 -367 187 247 -272 158 278 -223 89 187 -361 -29 239 -310
2644 -310 -118 389 -186 -39 308 -155 -121 339 -110 -353 275 -80 -321 311 19 -201 375 97 -272 306
2664 306 145 -397 150 60 -441 168 238 -363 196 366 -278 36 413 -291 -14 333 -392 -187 393 -252 -122
2685a22N76n12j45O71n79k36O71m71l30P64k20m13P51k86n28Q47j92p39O82J4
2705B03p07N36K37p34O34J66p19M25M24p88K89M06p61J59O84p88K4Q63o97n1P60
2726E65n32l65Q49n82m91Q95l33n15Q28j37n98P78m2q39P92O2r90O79K40q24N40
2747b0L98q90N88N93j064K93P39r53MQ20q75q1R79p11l17J098n77l70R26n80n08
2768e08J009m35p89J030p6q85R51J44r18P76K09j051O12M30j163N59N64r41L56
2787a26P86j040J64R30r41j44R04q90j24J074q31l17J095n38n15J063l38p05R38
2806D45l40p89R97j19r84J005K68j122Q14L90j040N74N07j114K84P23j059L59
2824b01Q26j035J81J008r97j87J145q48m29J021o41m73J100m88n69J155k82q55
$$ plain form
2685 -122 454 -58 -203 468 -111 -347 324 -147 -477 287 67 -346 405 119 -409 438 246 -493 189 203
2705 203 -504 32 269 -465 169 335 -384 41 465 -323 -34 372 -389 -230 454 -334 -310 553 -144 -195 565
2726 565 33 -332 517 -65 -556 339 6 -509 319 182 -416 362 320 -519 273 335 -655 24 264 -560 -20
2747 -20 378 -512 76 669 -395 -102 637 -316 -312 508 -367 -448 531 -180 -497 601 24 -346 580 0 -508
2768 -508 501 66 -723 307 231 -654 297 441 -477 299 508 -543 69 499 -664 -105 459 -482 -126
2787 -126 660 -380 -216 714 -227 -371 533 -357 -481 593 -238 -555 540 2 -513 550 212 -493 445
2806 445 105 -684 313 194 -790 215 483 -639 175 565 -475 99 606 -508 -224 499 -560 -201
2824 -201 625 -410 -229 779 -218 -405 740 -108 -537 484 -157 -630 470 -18 -587 568 286 -569
2842e69J127k08r63Q42P3j072Q91L04j059P37M17r80N48O20j148K69Q01j061N1
2861c80R38r30k7R91q08j21J060p86m07J052o25o25J112l82p64J130j84q61J015
2880C98nr16P91J88j129P27M11j160O58O36j143M91P52j102L02P86j069OR94r21
2900c05k02J085p16l43J110n73m60J049n56p14R81k82p57J049q8r26J019J04j077
2919f02Q28L42j093N80L26j000N79N70j087M61P44r94J32R26r62r6R27q91j57
2938d67R43o26l40R85m27m61R60m75o39R29k26p75Q77pq83Q58J36q99P03L69j003
2959d68N02M91r65K95O05r61K44Q03q97R2Q84p92j03Q84p52l52R29n44l82R15
2979D28k87n76Q85k88o48R02j57p95P76Q0q92P16J95q44N62M27q80M72M23q04
$$ plain form
2842 -569 558 350 -613 229 302 -770 121 425 -634 103 520 -460 88 708 -440 -171 630 -431 -380
2861 -380 558 -372 -399 592 -216 -337 723 -63 -470 582 -43 -668 444 62 -702 428 244 -617 398
2880 398 393 -523 268 456 -673 54 465 -695 -37 599 -544 -53 699 -403 -101 685 -384 -378 616 -305
2900 -305 -507 578 -138 -481 629 56 -404 645 89 -625 356 74 -683 366 278 -648 371 475 -602
2919 -602 226 568 -525 55 381 -619 -40 530 -557 -96 648 -346 -214 712 -250 -346 581 -310 -467
2938 -467 476 -150 -490 495 68 -393 567 92 -547 382 156 -619 258 251 -632 226 362 -537 166 535 -468
2959 -468 34 525 -440 -145 460 -501 -257 546 -351 -259 625 -167 -270 614 -138 -490 439 -105 -487 428
2979 428 141 -435 450 162 -486 416 259 -536 240 320 -572 144 339 -505 57 484 -396 76 499 -305
2999c05K00N56q08J47P04p68m2Q22o55j78Q55n65l29P66m46l93P30k38n28P52
3019B77j27n00N86M4p29O75J11p47M45K61o63L02M11o93L03M92p04J42M81n96
3039b29K5N44n11j60P86n71j58O99l76l72O53l51k89N58j72n21N81Q8o16N37J02
3060B47n30M31J17o13L19L55o33K47L66n60J97M03n60Q6N01m97j14N12l48j31
3080b05M39l04j97N46k03l39M79r8l50M06q7m07M63J0m89L39K50m11J99K11l86
$$ plain form
2999 -305 -105 451 -357 -210 494 -274 -316 506 -149 -327 528 -37 -366 400 -46 -439 291 53 -475 277
3019 277 150 -350 236 280 -449 226 337 -410 35 296 -367 -65 346 -347 -44 448 -256 -114 367 -229
3039 -229 -204 340 -171 -331 455 -116 -274 425 49 -323 330 -21 -310 248 76 -445 136 224 -392 145 247
3060 247 -283 148 265 -348 -29 326 -307 -60 306 -254 -57 346 -214 -128 373 -124 -238 274 -74 -205
3080 -205 234 -70 -267 279 76 -263 216 118 -232 174 87 -320 143 153 -336 3 253 -158 41 252 -134
$$ [...]
8191i
##END NTUPLES=NMR FID
##END=
