##TITLE=1H_Pr mat 2
 CDCl3, 8 sc, 
 2.08.2021
##JCAMPDX= 6.0         $$ Bruker NMR JCAMP-DX V2.0
##DATA TYPE= NMR FID
##DATA CLASS= NTUPLES
##ORIGIN= UXNMR, Bruker Analytische Messtechnik GmbH
##OWNER= root
$$ XWIN-NMR		Version 3.5
$$ Mon Aug  2 11:44:58 2021 Russian Standard Time (UT+4h)  she@DPX200
##.OBSERVE FREQUENCY= 200.131506
##.OBSERVE NUCLEUS= ^1H
##.DELAY= (6, 6)
##.ACQUISITION MODE= SIMULTANEOUS
##.ACQUISITION SCHEME= undefined
##.AVERAGES= 8
##.DIGITISER RES= 18
##SPECTROMETER/DATA SYSTEM= spect
##.PULSE SEQUENCE= zg30
##.SOLVENT NAME= CDCl3
##.SHIFT REFERENCE= (INTERNAL, CDCl3, 0, 15.7039)
##AUDIT TRAIL= $$ (NUMBER, WHEN, WHO, WHERE, WHAT)
$$ ##TITLE= Audit trail, XWIN-NMR		Version 3.5
$$ ##JCAMPDX= 5.01
$$ ##ORIGIN= Bruker BioSpin GmbH
$$ ##OWNER= she
$$ F:/spectra/data/she/nmr/H-F/1/audita.txt
$$ ##AUDIT TRAIL=  $$ (NUMBER, WHEN, WHO, WHERE, WHAT)
(   1,<2021-08-02 11:43:54.85 +0400>,<she>,<DPX200>,
      <created by zg, POWCHK disabled, PULCHK disabled
       configuration hash MD5:
       00 E9 B6 7A A2 85 ED C7 34 08 36 98 17 FE 4E 26
       data hash MD5: 16K
       B4 F7 54 88 C0 DB 2E B7 BA BA 7D A4 8A 7A F1 46>)
$$ ##END=
$$ 
$$ hash MD5
$$ 8E 0F C3 4D 0A 51 05 05 FB D0 FB AD FE A3 C8 6C
##$RELAX= 
##$RELAX= 
##$RELAX= 
##$RELAX= 
##$RELAX= 
##$RELAX= 
$$ Bruker specific parameters
$$ --------------------------
##$DU= <F:/spectra>
##$EXPNO= 1
##$NAME= <H-F>
##$PROCNO= 1
##$TYPE= <nmr>
##$USER= <she>
##$AMP= (0..31)
100 100 100 100 100 100 100 100 100 100 100 100 100 100 100 100 100 100 
100 100 100 100 100 100 100 100 100 100 100 100 100 100 
##$AQSEQ= 0
##$AQ_mod= 1
##$AUNM= <au_zg>
##$AUTOPOS= <>
##$BF1= 200.13
##$BF2= 200.13
##$BF3= 200.13
##$BF4= 200.13
##$BF5= 200.13
##$BF6= 200.13
##$BF7= 200.13
##$BF8= 200.13
##$BYTORDA= 1
##$CFDGTYP= 0
##$CFRGTYP= 5
##$CHEMSTR= <none>
##$CNST= (0..31)
1 1 145 1 1 1 1 1 1 1 1 1 1 1 1 1 1 1 1 1 1 1 1 1 1 1 1 1 1 1 1 1 
##$CPDPRG= <>
##$CPDPRG1= <>
##$CPDPRG2= <>
##$CPDPRG3= <>
##$CPDPRG4= <mlev>
##$CPDPRG5= <mlev>
##$CPDPRG6= <mlev>
##$CPDPRG7= <mlev>
##$CPDPRG8= <mlev>
##$CPDPRGB= <>
##$CPDPRGT= <>
##$D= (0..31)
0 1.2 0 0 0 0 0 0 0 0.06 0 0.03 0 0 0 0 0.0002 0 0 0 0 0 0 0 0 0 0 0 0 
0 0 0 
##$DATE= 1627890234
##$DBL= (0..7)
120 120 120 120 120 120 120 120 
##$DBP= (0..7)
150 150 150 150 150 150 150 150 
##$DBP07= 0
##$DBPNAM0= <>
##$DBPNAM1= <>
##$DBPNAM2= <>
##$DBPNAM3= <>
##$DBPNAM4= <>
##$DBPNAM5= <>
##$DBPNAM6= <>
##$DBPNAM7= <>
##$DBPOAL= (0..7)
0.5 0.5 0.5 0.5 0.5 0.5 0.5 0.5 
##$DBPOFFS= (0..7)
0 0 0 0 0 0 0 0 
##$DE= 6
##$DECBNUC= <off>
##$DECIM= 32
##$DECNUC= <off>
##$DECSTAT= 4
##$DIGMOD= 1
##$DIGTYP= 9
##$DL= (0..7)
0 120 120 120 120 120 120 120 
##$DP= (0..7)
150 150 150 150 150 150 150 150 
##$DP07= 0
##$DPNAME0= <>
##$DPNAME1= <>
##$DPNAME2= <>
##$DPNAME3= <>
##$DPNAME4= <>
##$DPNAME5= <>
##$DPNAME6= <>
##$DPNAME7= <>
##$DPOAL= (0..7)
0.5 0.5 0.5 0.5 0.5 0.5 0.5 0.5 
##$DPOFFS= (0..7)
0 0 0 0 0 0 0 0 
##$DQDMODE= 0
##$DR= 18
##$DS= 0
##$DSLIST= <SSSSSSSSSSSSSSS>
$$ [...]
##$SUBNAM2= <"">
##$SUBNAM3= <"">
##$SUBNAM4= <"">
##$SUBNAM5= <"">
##$SUBNAM6= <"">
##$SUBNAM7= <"">
##$SUBNAM8= <"">
##$SUBNAM9= <"">
##$SW= 20.0188882624521
##$SWIBOX= (0..15)
0 0 2 0 0 0 0 0 0 0 0 0 0 0 0 0 
##$SW_h= 4006.41025641026
##$TD= 16384
##$TD0= 1
##$TE= 0
##$TE2= 300
##$TE3= 300
##$TEG= 300
##$TL= (0..7)
0 120 120 120 120 120 120 120 
##$TP= (0..7)
150 150 150 150 150 150 150 150 
##$TP07= 0
##$TPNAME0= <>
##$TPNAME1= <>
##$TPNAME2= <>
##$TPNAME3= <>
##$TPNAME4= <>
##$TPNAME5= <>
##$TPNAME6= <>
##$TPNAME7= <>
##$TPOAL= (0..7)
0.5 0.5 0.5 0.5 0.5 0.5 0.5 0.5 
##$TPOFFS= (0..7)
0 0 0 0 0 0 0 0 
##$TUNHIN= 0
##$TUNHOUT= 0
##$TUNXOUT= 0
##$USERA1= <user>
##$USERA2= <user>
##$USERA3= <user>
##$USERA4= <user>
##$USERA5= <user>
##$V9= 5
##$VALIST= <valist>
##$VCLIST= <CCCCCCCCCCCCCCC>
##$VD= 0
##$VDLIST= <DDDDDDDDDDDDDDD>
##$VPLIST= <PPPPPPPPPPPPPPP>
##$VTLIST= <TTTTTTTTTTTTTTT>
##$WBST= 1024
##$WBSW= 4
##$XGAIN= (0..3)
0 0 0 0 
##$XL= 0
##$YL= 0
##$YMAX_a= 395610
##$YMIN_a= -651955
##$ZGOPTNS= <>
##$ZL1= 120
##$ZL2= 120
##$ZL3= 120
##$ZL4= 120
##$ABSF1= 10
##$ABSF2= 0
##$ABSG= 5
##$ABSL= 3
##$ALPHA= 0
##$AQORDER= 0
##$ASSFAC= 0
##$ASSFACI= 0
##$ASSFACX= 0
##$ASSWID= 0
##$AUNMP= <proc_1d>
##$AZFE= 0.1
##$AZFW= 0.1
##$BCFW= 1
##$BC_mod= 2
##$BYTORDP= 1
##$COROFFS= 0
##$CY= 11.3945322036743
##$DATMOD= 1
##$DC= 2
##$DFILT= <>
##$DTYPP= 0
##$F1P= 2.36226072786647
##$F2P= -0.459571619588291
##$FCOR= 0.5
##$FTSIZE= 0
##$FT_mod= 4
##$GAMMA= 1
##$GB= 0.15
##$INTBC= 1
##$INTSCL= 1
##$ISEN= 128
##$LB= 0.24
##$LEV0= 0
##$LPBIN= 0
##$MAXI= 10000
##$MC2= 0
##$MEAN= 0
##$ME_mod= 0
##$MI= 1.114404
##$NCOEF= 0
##$NC_proc= 0
##$NLEV= 6
##$NOISF1= 3.799351
##$NOISF2= 2.8
##$NSP= 1
##$NTH_PI= 0
##$NZP= 0
##$OFFSET= 15.70392
##$PC= 1
##$PHC0= -12998.73
##$PHC1= 15.40099
##$PH_mod= 1
##$PKNL= yes
##$PPARMOD= 0
##$PSCAL= 0
##$PSIGN= 0
##$REVERSE= no
##$SF= 200.130013532006
##$SI= 16384
##$SIGF1= 3
##$SIGF2= 2
##$SINO= 400
##$SIOLD= 16384
##$SREGLST= <1H.CDCl3>
##$SSB= 0
##$STSI= 0
##$STSR= 0
##$SW_p= 3612.71676300578
##$SYMM= 0
##$S_DEV= 0
##$TDeff= 0
##$TDoff= 0
##$TI= <>
##$TILT= no
##$TM1= 0
##$TM2= 0
##$TOPLEV= 0
##$USERP1= <user>
##$USERP2= <user>
##$USERP3= <user>
##$USERP4= <user>
##$USERP5= <user>
##$WDW= 1
##$XDIM= 8192
##$YMAX_p= 0
##$YMIN_p= 0
$$ End of Bruker specific parameters
$$ ---------------------------------
##NTUPLES= NMR FID
##VAR_NAME=  TIME,          FID/REAL,        FID/IMAG
##SYMBOL=    X,             R,               I
##VAR_TYPE=  INDEPENDENT,   DEPENDENT,       DEPENDENT
##VAR_FORM=  AFFN,          ASDF,            ASDF
##VAR_DIM=   8192,          8192,            8192
##UNITS=     SECONDS,       ARBITRARY UNITS, ARBITRARY UNITS
##FACTOR=    0.0002496,     1,               1
##FIRST=     0,             0,               0
##LAST=      2.0444736,     0,               0
##MIN=       0,             -651955,         0
##MAX=       2.0444736,     395610,          0
$$ Real data points
##PAGE= N=1
##DATA TABLE= (X++(R..R)), XYDATA
0@%%%%%%%Kj0J6j6J6k4L2m0M8n6P2r5J19j37J61j94K34k78L25l76M34n03N80o64
31c54P57q60R78j109J250j406J577j765J972k200K447k715L011l334L685m069
47b135M488m949N455o007O617p291Q041q878R815j0876J2087j3484J5118j7058
61i057J9404k2308K6015l0937L7827m8232O5960j04081L30139l34217m07868O39603
73A62248q7485k58284J73023Q7139j26132J98417j57787l28825L26758L95483
83C84555l56354k09072K34074K4156j27843J8288q0252Q0936K49629j56882k91855
94b30620K13770J57676k09653J5842J50553j20391J0240R9153k09025l5251L26088
105A68382m5903k69393J30428J10630j78920N2531J24770j53535J3806J78274
$$ plain form
0 0 0 0 0 0 0 0 0 2 -8 8 -8 8 -16 16 -24 24 -32 40 -55 64 -73 88 -106 128 -150 175 -201 233 -270 310 -354
31 -354 403 -457 521 -588 662 -744 833 -932 1040 -1160 1287 -1428 1583 -1751 1934 -2135
47 -2135 2353 -2596 2859 -3148 3469 -3822 4219 -4659 5156 -5720 6367 -7117 8001 -9057
61 -9057 10347 -11961 14054 -16883 20944 -27288 38672 -65409 264730 -69487 -477355 162248
73 162248 74763 -183521 -10498 76641 -49491 148926 -8861 -337686 -10928 384555
83 384555 28201 -180871 53203 77359 -50484 -32196 -112448 -31512 218117 61235 -230620
94 -230620 -16850 140826 -68827 -52985 97568 -22823 -12583 86570 -122455 -157706 168382
105 168382 122479 -146914 -16486 94144 -84776 -32245 92525 -61010 -47204 131070
115A31070j63397j23954K34586J7406k04871R5272J08587j55062J1197J40942
125I1776j12820q0341J58515J9218j22627K7016M5823m4716J5761K6454m1827
136a7768P610L8057l4629k7666K8260K7511K3779k7257p7270L9368J02252o4348
148A7899r5355Q1282O1244q3352k2834O1550l904j7748J9683k9882j8226O9952
160D0309P470r1062k273Q8163l673p2418J2534N2982k4217l3356K9022J1469k1936
173f986J3930P912m1991O796O0565k0697n7048K8397L0025k9315K857J4691k7024
186a7888J0401L4975l7030k4992N7624Q060o0238M896L9151p797j1372m544j1333
199b0087K0913J6786k9118l079L0383j2320j7852J8860n266j0889K5753j3303
$$ plain form
115 131070 -32327 -156281 78305 95711 -109160 -13888 94699 -60363 -49166 91776
125 91776 -21044 -101385 57130 76348 -46279 -19263 26560 -18156 -2395 24059 -17768
136 -17768 -10158 27899 -6730 -34396 -6136 21375 45154 17897 -59373 -20005 82247 17899
148 17899 -77456 3826 65070 -18282 -41116 20434 16530 -1218 18465 -11417 -29643 40309
160 40309 47779 -43283 -45556 42607 38934 -33484 -20950 32032 7815 -25541 3481 14950 -6986
173 -6986 6944 14856 -27135 -20339 40226 19529 -37519 -9122 20903 -8412 -5555 9136 -17888
186 -17888 -7487 27488 -9542 -34534 23090 31150 -29088 -24192 14959 7162 -4210 -8754 -20087
199 -20087 826 17612 -11506 -14585 15798 3478 -14374 4486 -780 -11669 14084 781
211G81l4792L7742K2088m4973R134L5478l7982q358N4278k4282m8373M8968K2706
224C2415n7718Q441M4217k7617j4492K8061j5688j0192L5901j1489l7873K6908
236H74K4684k8931m776J6723r023K605O699j9227O446K4769j9971j6544K5123
249I451J519j5750J3192k259k0807K1612J2715l4922K853L1869j8346j6064K3827
262H890k010j5889J7804K56k5842J6453K0918k9138j0105K7493k816j7175R373
275a788M373o003O589j925j0518J0115P741j5571l380J3644k194p275K930J45
289c117K034L437q292p27J2659l277j3560Q479J0478j1738l971J0166k845m473
303d747N542j740l925P367P02q615L737Q747o036o331P615J764o153O44K841j607
$$ plain form
211 781 -34011 3731 25819 -19154 -10020 25458 -12524 -20882 33396 9114 -39259 9709 32415
224 32415 -25303 -16862 27355 -262 -14754 13307 -2381 -12573 23328 11839 -26034 874
236 874 25558 -3373 -8149 8574 -449 2156 8855 -10372 -3926 20843 872 -15672 9451
249 9451 10970 -4780 8412 6153 -14654 6958 19673 -15249 -12396 19473 1127 -14937 8890
262 8890 6880 -9009 8795 9051 -16791 -338 20580 -8558 -18663 8830 6014 -11161 -1788
275 -1788 2585 -3418 3171 1246 -9272 843 8584 -6987 -10367 3277 1083 -6192 -3262 -3117
289 -3117 -1083 2354 -5938 -6665 5994 2717 -10843 -2364 8114 -3624 -7595 2571 -274 -4747
303 -4747 795 -945 -4870 2497 3199 -5416 -1679 7068 1032 -5299 2316 4080 -2073 -1429 1412 -195
319a95m16K080K9r22J309J950j526j496J297O37r16k288R67K026j505m78J038
336A591N16M69L87j377j77J524q9l466j19L857j090m353K018L552j899k992J965
353C17K224j921j342J211l76j63N42k492L43J854m47k471R45K011q42j347J056
370h98K44k50k50q01N65M74j746q4J221q78n71J572R16k052O64L078k210j485
388b491K350o10j769J424n0j841K011K560l471r96O287j399n936M348L083m855
404a355N46K847l026j74M730l593l136P945J11r038M390O796o960l74M595n303
420i99m3Q418o496p302J1870K365j4156N453J0198r889p04Q275r509p02J4650
435A1429r803j4008J7180O457j9654M445J3589j2962L68J2196j4741k360K3228
$$ plain form
319 -195 -611 1469 1498 576 1885 3835 2309 813 2110 2747 1831 -457 510 2536 1031 553 1591
336 1591 2107 2576 2963 1586 1409 2933 2844 -622 -741 3116 2026 -2327 -309 3243 1344 -1648 317
353 317 2541 620 -722 489 113 -50 492 -2000 -1657 197 -250 -2721 -1776 235 -607 -1954 -898
370 -898 -654 -904 -1154 -1955 -1390 -916 -2662 -2746 -1525 -2403 -2974 -1402 -486 -2538 -1874 1204 -1006 -2491
388 -2491 -141 -751 -2520 -1096 -1146 -2987 -976 1584 -1887 -2883 3404 2005 -3931 417 3500 -1355
404 -1355 -809 2038 -988 -1162 3568 -25 -3161 4784 4895 -4143 247 7043 83 -291 4304 -999
420 -999 -1042 7376 880 -6422 5448 7813 -6343 -890 9308 -581 -1285 6990 -2519 -3221 11429
435 11429 1626 -12382 4798 11255 -8399 -3954 9635 -3327 -2959 9237 -5504 -7864 15364
448A5364j2409k1977K2225J0774k4008L991J5310j6717J839J8798j9565p993K8623
461A4255q351k5880K1253J1237k3263O779J2839k2085O088K5970k3954j4558L1255
474A1585m727k3305K1257M076k5514J7565J5920l3780L527L6039k1431k2882K8536
487F866J63j8268K1422k750l0179K5040K2912l6948n115L4353j2631j7650J9978
500G193o859j1350K9423q818l8284K8785L2110l6086j4528K7663n076p995J6431
513A2609j6193j4217L5500q3m1123J5343L3453k0199j6494J0955k878P724J6252
526B0649k7374j9607L8773J1619l8231J512K5131r461n655N633j3144O391K6840
539B3076k0541l2271K7505K7277k3973j5884J1301K536O168L345j9241j979K6286
$$ plain form
448 15364 2955 -19022 3203 13977 -10031 -6040 9270 -7447 -5608 13190 -6375 -14368 14255
461 14255 5904 -19976 1277 12514 -10749 -3970 8869 -13216 -7128 18842 -5112 -19670 11585
474 11585 6858 -16447 4810 8886 -16628 937 16857 -16923 -13396 22643 1212 -21670 6866
487 6866 7029 -11239 10183 7433 -22746 2294 25206 -11742 -16857 17496 4865 -12785 7193
500 7193 334 -11016 18407 9589 -28695 90 32200 -3886 -18414 9249 4173 -3822 12609
513 12609 -3584 -17801 17699 17616 -23507 -8164 25289 5090 -11404 -449 -3327 4397 20649
526 20649 -6725 -26332 12441 24060 -14171 -12659 12472 3011 -2644 2989 -10155 -3764 23076
539 23076 2535 -29736 -2231 25046 1073 -14811 -3510 -974 5194 8539 -10702 -12681 13605
552A3605l957k7515Q307K2092o703j0801l105m012J6837J5090k5897j9921K8975
565B995J7186k5452q851J7447J788n725j138q114O371K2185j3397l0739J7405
578h039L0015j3378k0890N826P009M986L418j6579m697K7019k204l2070J0615
591h969K8506j2100j5807O062k395N939J9408j9109k5779K8427J8177l0336l467
604a1443K4246q761r618R458q344L55K4805j4791l1263K5177K2110k4601k830
617e500J1815j5937P834K0808k6649j0327L8122r175l7175K4940K2433k7046J388
630d469J2496k4003R811L3377k8938k5271L5138M802k6793J5089O944k1424J6552
643C311J0181l4988J1260L9308k9299k7687L1837N022j6737J7982q260k9173L2558
$$ plain form
552 13605 9648 -17867 -9560 12532 5829 -4972 -8077 -12089 4748 19838 -6059 -25980 2995
565 2995 20181 -5271 -14122 3325 5113 -612 -1750 -9864 -3493 18692 5295 -25444 -8039
578 -8039 21976 8598 -12292 -6466 543 5529 8947 -7632 -12329 14690 12486 -19584 -8969
591 -8969 19537 7437 -8370 -2308 -4703 1236 20644 1535 -24244 4183 22360 -7976 -11443
604 -11443 12803 4042 -5576 3882 -4462 -4107 20698 5907 -25356 -179 21931 -2670 -5500
617 -5500 6315 -9622 -1788 19020 -7629 -17956 20166 10991 -26184 -1244 21189 -5857 -4469
630 -4469 8027 -15976 -6165 27212 -1726 -26997 8141 12943 -13850 1239 8183 -13241 3311
643 3311 13492 -21496 -10236 29072 -227 -27914 3923 8945 -7792 10190 1930 -27243 5315
656E315K4124m7098n010M5491j4486k8912K0473M366q364J8919j4582l1185L5688
669D739K9155m4010j3657L5399m748j3102J4456j3633q149L4837j0670m2363K9350
682b396L6284l5467j9711K5507n12k331J4370k2609j5815L9704M310m1393R863
695a0196L0496j7561j1690J1339o435N986J8392k5234k1025L6931J2530l4310
707a0777l19K0073r268j659J0266j4191k449K2794j0133k2941J8908J6202j8855
720b349o244Q895l707M574R207j5592p717J9001K071j6346M276R592p826rL925
735A751q267M228J3259j1430j4819J4845J1464j2692n184O677j528J286N196q533
749c747l390J3232j331j4870N674J3403p341p831N617J62j03O260n289q513R588
$$ plain form
656 5315 29439 -17659 -22669 22822 8336 -20576 -103 4263 -4101 14818 236 -30949 4739
669 4739 33894 -10116 -23773 11626 6878 -6224 8232 -5401 -13550 21287 10617 -31746 -2396
682 -2396 33888 -1579 -21290 4217 3705 1374 15744 -6865 -22680 17024 21334 -20059 -10196
695 -10196 20300 2739 -8951 2388 -4047 1939 20331 -4903 -25928 11003 23533 -10777
707 -10777 -11096 8977 -291 -1950 8316 -5875 -8324 14470 4337 -18604 304 16506 -2349
720 -2349 -8593 302 -3405 1169 10376 -5216 -12933 6068 8139 -8207 -3931 5661 -2165 -2174 1751
735 1751 -6516 -2288 10971 -459 -15278 -433 11031 -1661 -6845 -168 -1696 -410 4786 -3747
749 -3747 -7137 6095 4764 -10106 -4432 8971 1630 -6201 -584 -422 -525 5735 446 -8067 1521
764A521O209j1407q12J0775m559o254O117K62m184P115p92j0868O237Q716q175
779i9l615P927k968m377O449p76n958O687Q08r334M987Q451r046l337Q468k630
795A637n541P250o7p634N276L248q513L298P628q571k972R308k759o528O383J507
811B950o658K471M381n497O59N067n625j917P152k315n190N159R59n022K428K802
827A804m156O65L168l785l22M933k820l277M518J03l861L132J590l813J026K679
843A584k773j043M227j939k548L159M53k380J523J061k276N71J984j249j265K109
859A198k14j853J574L49r52P65l26l77R22L00q76k20Q38m4j018N15L74k1J42o03
879D73J04N90k27q11J82R99o36r74P81J38p67K46L06m08L03m3p11M72L65l70o38
$$ plain form
764 1521 7730 -3677 -4489 6286 1727 -4527 1590 1852 -2332 4783 3991 -6877 -640 8076 -99
779 -99 -3714 4213 1245 -3132 3317 2541 -3417 3270 4078 -5256 -269 8182 -864 -4201 4267 1637
795 1637 -3904 3346 3279 -4355 921 4169 -4344 -1046 6582 -1989 -4961 4347 1588 -4940 1443 2950
811 2950 -3708 -1237 3144 -2353 -1694 3373 -2252 -4169 2983 668 -4522 637 1596 -3426 -998 1804
827 1804 -2352 -1687 1481 -2304 -2626 2307 -513 -3790 728 831 -3030 102 1692 -2121 -1095 1584
843 1584 -1189 -2232 1995 56 -2492 667 1120 -1260 263 1324 -952 -381 1603 354 -911 1198
859 1198 984 -869 705 1054 102 867 541 164 1086 1386 510 290 1128 1084 66 581 955 934 1076 473
879 473 577 1167 940 129 311 1310 674 -300 481 619 -148 98 404 -4 299 256 -455 17 382 12 -626
900f26N02K06p03j42L33k46K95j80O5J6r8j58Q2J31k23j37N61p7j096R30O11j450
922a404M75N98n45N7O11n18j81Q31p7p98M09R67j039l5R30n01k71Q55m49j70N81
943C26L60o42OM55n81L33N65p93N2J114k11j162N34P78p5n91K39n6L15J74q00
964C40n63J386M77j648j93J504j55q26J56J75p75J357kk156N07K689j900j594
982a221J787L80j768J047J048k737J183K419l369j064L806q30k526K268n34k313
998b424L536R79n817K049N071n197j262N248l040k395N567k414n235P202K131
1013C999r281J858Q065n853k394O573m443k915Q883l028q780R212L983j1202J710
1028c613Q924o734j027P637q102k825J4255n002j3600J1858O354j3524K788R615
$$ plain form
900 -626 -124 82 -621 -763 -430 -676 -381 -561 -496 -480 -578 -736 -654 -523 -746 -883 -322 -399 -1495 -565 46 -1404
922 -1404 -929 -331 -876 -819 -208 -726 -907 -76 -153 -951 -542 425 -614 -649 281 -220 -491 364 -85 -255 326
943 326 686 44 50 505 -76 257 822 29 81 1195 984 -178 356 1134 1059 468 707 651 966 1140 340
964 340 -223 1163 1640 -8 -201 1303 1148 322 478 653 -122 1235 1233 -923 -416 2273 373 -1221
982 -1221 566 946 -822 225 1273 -1464 -281 2138 -1231 -2295 1511 681 -1845 423 -111 -2424
998 -2424 1112 2091 -3726 -1677 3394 -1803 -3065 2183 -857 -3252 2315 -99 -5334 1868 3999
1013 3999 -5282 -3424 4641 -1212 -3606 2967 -1476 -4391 4492 1464 -7316 1896 5879 -5323 -3613
1028 -3613 5311 -1423 -2450 5187 -2915 -5740 8515 3513 -10087 1771 8125 -5399 -2611 7004
1042G004r759K25J0561j0798n089J8070m421j6663J1949P519j3048M532O842j3332
1056f408M156J4083j4986p162K1173m564j8184J3901O560j5018Q221O868j8472
1069i832N352J9783j6436j1770K0170j455j5248J1979K837j3450J0937O033k0677
1082a1777N697K0937j5364j1576J6879k550r279J4244l933j7746J6644J1062k3754
1095a0516J152K1810j1174j1621J3548l363o673J5917m892k0636J5292J6167j9217
1108d206n221J4301n148l011R094r452n058J9022l649k2050J1683J7805j3797
1121C13p033P594l697K992J0584j3799r750J9171M601j8737J529J3365l818m423
1135a108O16m968P069J1155j3188j2700J4565J0165j1515m697M571J69K509J247
$$ plain form
1042 7004 -2755 -2530 8031 -2767 -7856 10214 5793 -10870 1079 8598 -4450 82 6924 -6408
1056 -6408 -2252 11831 -3155 -10317 10856 6292 -11892 2009 8569 -6449 1772 8640 -9832
1069 -9832 -4480 15303 -1133 -12903 7267 5812 -9436 2543 5380 -8070 2867 8900 -11777
1082 -11777 -6080 14857 -507 -12083 4796 2246 -7033 7211 3278 -14468 2176 13238 -10516
1095 -10516 -9364 12446 1272 -10349 3199 -164 -6837 9080 4188 -16448 -1156 15011 -4206
1108 -4206 -9427 4874 -274 -3285 5809 -3643 -8701 10321 6672 -15378 -3695 14110 313
1121 313 -6720 874 -2823 169 10753 -3046 -12796 6375 10976 -7761 -6232 7133 3315 -1108
1135 -1108 -492 -5460 1609 12764 -424 -13124 1441 11606 91 -4606 -35 134 2643 3890
1149C890r140J259J3452l981j5237M940J3375k230r597j516L310M464K652o374
1163g33o938Q127O996q160o309P634N377n536m903P60M136N864l476j1393K388
1178f166J3235k168j0364J912N157j555O15j466m416O959N449j2604m998J5939
1192E529K216j2840O56M293j681N636K03j2095L697J3887r583r457J3328K277
1206F066j0235K889J692m703R027L614j6635N43J7158n312j1320R223J064p502
1220d431P108J186j0153Q020P239j4702j677J5440m246q087O599k269n300J1820
1234F547o98j4354P935R147j2768l05J2393p474n283R618m624o940J3730L19j6345
1249i102O552J0707j0520j74Q590q740k831J1517m933q157J1552J188j3674N861
$$ plain form
1149 3890 -5250 -3991 9461 5480 -9757 -4817 8558 6328 -3269 -4785 -1475 2989 5641 -733
1163 -733 -7671 456 7452 -708 -7017 617 5994 458 -4445 -3685 451 6315 2839 -8554 -6166
1178 -6166 7069 4901 -5463 -3551 1606 51 666 -800 -5216 1743 7192 -5412 -10410 5529
1192 5529 7745 -5095 -4439 -146 -1827 3809 4012 -8083 -4386 9501 -82 -9539 3789 6066
1206 6066 -4169 -1280 412 -4291 4736 8350 -8285 -7742 9416 4104 -7216 2007 3071 -4431
1220 -4431 2677 3863 -6290 1730 8969 -5733 -7410 8030 3784 -4303 2296 27 -5273 6547
1234 6547 5849 -8505 -570 8577 -4191 -4496 7897 423 -4860 4758 134 -6806 6924 7243 -9102
1249 -9102 -2550 8157 -2363 -2537 6053 -2687 -5518 5999 1066 -7091 4461 5649 -8025 -2164
1263b164Q098q339J101N622r387N4J2322n878q637R334J024q836N628L837q072
1278d293L566N337j0057J171J1640o160p989P814O41n387N784Q07q612M977O185
1293E424q986m50R635n028n516N990K02l543N458q03q003M996O337o943j728O418
1309C460l311k574M963j957l092N337m71o433M139M882n299j165L572k872r8M845
1325C926l562l191N461k82n096L183K864l951l99K822k949J63M348k863l650M186
1341A010J082l337R15J680k513K29K137k025n66L036j618k210K181J115j814O30
1357f8Q2j362J397R57j508q13J726r33o69J040K9j021Q52j26j156J281J042j199
1375d49r22J326J96q49P42K7n48L16M72j154N66Q88o50m61M90N01m86k9L04p50
$$ plain form
1263 -2164 5934 -2405 -1304 4318 -5069 -5015 7307 1429 -7208 2126 3150 -5686 -58 3779 -4293
1278 -4293 -727 4610 -5447 -4276 7364 1204 -6785 1029 1670 -3717 2067 2874 -5738 -761 5424
1293 5424 -3562 -4012 5623 595 -4921 1069 1271 -2272 3186 2383 -5620 -624 5713 -1230 -2958 3460
1309 3460 149 -2425 2538 581 -2511 2826 2355 -4078 61 4943 -356 -1521 2051 -821 -919 3926
1325 3926 364 -2827 2634 2352 -2744 439 3303 -648 -1047 1775 -1174 -1011 3337 474 -3176 1010
1341 1010 2092 -1245 -330 1350 -1163 -934 1203 -822 -1388 1648 30 -2180 1 1116 -698 -68
1357 -68 14 -1348 49 1006 -502 -1315 411 -522 -1191 -151 -122 -1143 -291 -417 -1573 -292 750 -449
1375 -449 -1371 -45 151 -698 44 71 -477 -161 311 -843 -277 611 -39 -500 -10 491 5 -24 280 -470
1395d70L50M86Ol40L0L43k13m9K21L34o52J38N04n63J14L01k71o9M8L63j75J1
1417D47Lq6j60L30k32k4J29j10m2J55l39p8O44m49j44M95j35n91N8L48o84K72
1439a93M65n15k68M92K52q06N34O4p95N6N13l30Q1N82n47m07O70n5m02M51J13
1460d5q87L49M21o14O5N33j89j19P11n49m79P31j9q12P68L44q51L30R83j067m9
1481d45J285j155l14J337p5j401R63O89j166J24J333j320j8J401r64r64J659k10
1499G59j071M67P83q47K94P97j403m6J569q81j237J771q6j709J404L51j331R19
1517E03P54j919k02K119p17j898J798L11j692J396J59j786Q68J714k073q43K175
1534F67R4k234J397K15j231J150M73k310J001K340j640j786J815N23j369N16K73
$$ plain form
1395 -470 -120 366 372 32 62 405 192 143 364 698 46 184 688 125 239 540 269 200 248 611 436 447
1417 447 450 364 204 534 302 278 407 297 255 410 71 -7 637 188 44 539 404 -187 -129 219 -465 -193
1439 -193 272 -243 -511 -19 233 -573 -39 25 -770 -714 -201 -531 -450 132 -415 -822 -152 -207 -609 -158 -45
1460 -45 -932 -583 -162 -776 -711 -178 -367 -486 225 -324 -803 -72 -91 -903 -135 209 -642 -312 671 -396 -445
1481 -445 840 -315 -629 708 633 -768 195 884 -282 -158 1175 -145 -163 1238 274 -690 969 759
1499 759 -312 155 938 91 385 1182 -221 -267 1302 421 -816 955 869 -840 564 915 -416 503
1517 503 1257 -662 -864 1255 538 -1360 438 749 -943 453 612 -1174 -306 1408 -665 -1508 667
1534 667 761 -1473 -76 139 -1092 58 531 -1779 -778 1562 -78 -1864 -49 474 -895 -379 -106
1551a06j318J821R40k959l12L336o69k312J181N99o34R05k6k497J711K680k983
1568f43j455L311K04k225N80M20r68K220L39l759N72M040j560k928K133P53j161
1585a27P38j16k168K659J778m512o14M875m47l482J739kj086K629k58m156J971
1602e79M102l691k455L932J99k400J558j101j591L840J022n981J113N235k493
1617G10k378K444j315q82L423k117l536M800K613o668l56N192j328j592K086k837
1633a741o91N629j653o064M005L464m492n86L411k027L27K390m227j653P129k4
1649C197p872K861M571l536J10K480l976O46N024m058l725O566J289o446Q91L679
1665A701j938J427Q38n302J216O713l587m878N052J649m650J644J489k691K787
$$ plain form
1551 -106 -1424 397 1337 -1622 -1934 1402 733 -1579 -398 201 -433 472 446 -2051 -340 2340 -643
1568 -643 -2098 1213 1417 -808 -228 192 -776 1444 1783 -1976 -1404 2636 1076 -1852 281 1034 -127
1585 -127 611 495 -1673 986 2764 -1748 -2362 2513 2066 -1416 323 321 -765 1864 1606 -2550 -579
1602 -579 3523 -168 -2623 1309 1508 -892 666 -435 -2026 1814 2836 -3145 -2032 3203 710
1617 710 -1668 776 -539 -1421 2002 -115 -3651 1149 3762 -2906 -3262 1930 602 -990 1096 -1741
1633 -1741 -2432 3197 1544 -4520 -515 2949 -1543 -2129 1282 -745 -418 1972 -2255 -3908 3221 3197
1649 3197 -4675 -1814 2757 -779 -669 1811 -2165 -1519 3505 -553 -4278 2288 3577 -2869 -1978 1701
1665 1701 -237 1190 2028 -3274 -2058 4655 1068 -3810 1242 2891 -1759 -115 1374 -1317 1470
1680A470K153o698N9Q161k348o193L153J977k560J985Q65m702K511M455n679k072
1696c463O643l99n086J337J382q84L206q30o165K533O189l584m147M216P34l043
1712a361J319Kj512L280O79o256L62O941p68n325J059J527n48K143r70l909L106
1729b31L331n095j850N898M98m272J16J105o84L692k42o796J877O896k834m881
1745c472L218K501l119Q6J017j758L165J709o534r21P681J13n898J149J454j112
1761g21K429J43m764K291N060n301k764O088Q48m648P82P36j600M154J051p240
1777c456R0P652k826m469M270N27l451K405N42m059L791L580p214j655P600m58
1793B869n198L109n57k844M886M74o268K514N112n492k119N813o29l698K345n98
$$ plain form
1680 1470 3623 -3075 -3016 5145 2797 -3396 -243 1734 -826 1159 2024 -2678 -167 4288 -1391 -3463
1696 -3463 3180 2781 -2305 -968 414 -470 2736 1906 -4259 -1726 4463 879 -3268 948 1682 -1361
1712 -1361 -42 -40 -1552 1728 2407 -3849 -3487 3454 2686 -2639 -1580 -53 -601 1542 572 -3337 -231
1729 -231 3100 -1995 -3845 2053 2551 -1721 -1605 -500 -1184 2508 2266 -4530 -2653 4243 1409 -3472
1745 -3472 -254 2247 -872 -786 231 -1527 1638 3347 -3187 -4108 3573 3686 -2212 -1063 391 -721
1761 -721 1708 1851 -2913 -622 4438 -863 -3627 2461 3309 -1339 -557 179 -1421 2733 3784 -3456
1777 -3456 -3366 4286 1460 -3009 1261 1788 -1663 742 1284 -2775 1016 4596 -2618 -4273 3327 2869
1793 2869 -2329 780 223 -2621 2265 2739 -3529 -1015 4097 -1395 -3514 2299 1670 -2028 317 -281
1809b81l165N655R24o784J325N445l318j924L874k465j902M406j728l442M904
1824A524J674o710J427M631l138p09L215l237j685N307p79m755L499K493n163
1839b406J007M055l010o97K736k515j566M758m70l878K106J350k750J149K518
1854B387l156RK405k086j073L477o07k819J613J082j829J465P67k757K65K898
1870B041j929r83K375j127j617J658P90k097J207R52k176J5K326r86j506J590
1886E33m87p06J038O0j196P23L63j282O72R48r07l00K44r1K29L89l75l95K25K32
1906h3l3J56l9m66l8J66k10K56O26n29l45L74j30J23L04n32M3O35m75J57L3J07
1928A00K8j43R7k3JJ70q11N19M64n13K04J91k47j55L48Rn11P28P1n84K84M99p39
$$ plain form
1809 -281 -3446 2209 3133 -3651 -2326 3119 -199 -2123 1751 -714 -2616 1790 62 -3380 1524
1824 1524 3198 -3512 -2085 2546 -592 -1301 1914 -1323 -3008 2299 1520 -3235 264 2757 -2406
1839 -2406 -1399 2656 -354 -1051 1685 -830 -2396 2362 1892 -1986 120 1470 -1280 -131 2387
1854 2387 -769 -760 1645 -441 -1514 1963 1356 -1463 150 1232 -597 868 1635 -1122 -857 2041
1870 2041 112 -871 1504 377 -1240 418 1208 -889 318 1270 -906 -891 1435 449 -1057 533
1886 533 46 -660 378 438 -758 -35 328 -954 -282 666 -241 -541 -297 -388 -159 230 -145 -540 -315 -83
1906 -83 -116 40 1 -465 -503 -337 -547 -291 335 -194 -539 -165 -295 -172 132 -400 -357 278 -197 -40 -7 100
1928 100 128 -15 82 59 60 230 -581 -62 402 -111 93 284 37 -118 230 239 -272 456 527 -57 227 726 -13
1951a3P2P87o23l54O09K5k49k8L20k91k52L59l10M2P4r9j66K92j70J37l6j14J6
1974B8J77q1k26J76L42p89O6O88n35jL39l09j91L57j80k67K63J41j74n3L37n52
1996d44J0L36j17l67N25o9k4k24m3J73J24J75o00M47J22k20N6q5j4J5K13R4l37
2019b54L25L1j93m9M61l97J55N39o29r7M25k02k50O68o5p13N47K98q37L73N12
2040F48n35n38P56j27l73O61j26p19O62M47p02k47J194q47m86R74m20p65J195
2059F52k01j054R34M30j387L92P78o63l30J394j022p88J546o42j060J001P95j393
2077f18J45R23r70m6J184r88o91J372K1j512J042O87j350K63R26j227K18J585
2095I64j109j288J971j46j297L93Q15j189Q66Q26j604L43J451r09j266J617p8
$$ plain form
1951 -13 59 846 223 -131 478 503 254 226 546 255 3 362 52 94 168 69 -97 195 25 162 126 12 28
1974 28 205 124 -102 74 416 -373 -307 381 -154 -155 184 -125 -316 41 -139 -406 -143 -2 -176 -229 108 -444
1996 -444 -434 -98 -215 -582 -57 -126 -150 -374 -417 -244 -120 55 -545 -98 24 -196 -140 -225 -239 -224 -11 83 -254
2019 -254 71 102 -91 -140 321 -76 79 618 -11 -108 317 115 -135 533 468 -245 302 600 -237 136 648
2040 648 113 -425 331 204 -169 492 366 -353 309 756 54 -193 1001 154 -332 642 222 -543 652
2059 652 451 -603 331 761 -626 -234 544 -119 -449 945 -77 -865 681 39 -1021 -20 775 -618
2077 -618 -473 450 -520 -566 618 -370 -1061 311 332 -1180 -138 549 -801 -538 388 -839 -621 964
2095 964 -145 -1433 538 392 -905 -512 303 -886 -20 806 -798 -455 996 87 -1179 438 360
2112C60j210J106J26j046J115M75j411l49K257q36j466J118L49j163J250n8j318
2129g01P34J271j447n69J717l21j215O75j1l75R99K9j456J45J922r01j104Q20
2147B12N70q08L34l13m95R03Q72j971k46J445N59j696Q1O26l36N38k30p35J96
2166d94J397q99j629J323J357j354m93N79l9M73Q52k025m94K371l5k350P35J752
2184A027j253k52K81n81N83J478j633j989K402J811k541m22J417o65M95P54j816
2201i04k88L451j633l075K295K464k497l82J026j422J248K243l226j662M473k23
2217A888l507J547J586j977O50Q76k407R88L569l410k388L896R18l398J342P31
2233I04k295K148J325l966O75M089k463l140L401P48k350J796n10k958L072K775
$$ plain form
2112 360 -850 256 382 -664 451 926 -485 -834 1423 587 -879 239 588 -575 675 617 -701
2129 -701 33 1304 -143 -712 1005 684 -531 144 133 -242 757 786 -670 -525 1397 496 -608 212
2147 212 782 -26 308 -5 -500 403 1275 -696 -942 503 1062 -634 -553 73 -263 275 45 -690 -494
2166 -494 903 4 -1625 -302 1055 -299 -792 -213 -252 221 1073 -952 -1446 925 890 -1460 -725 1027
2184 1027 -226 -478 -197 -778 -195 1283 -350 -2339 63 1874 -667 -1089 328 -337 158 912 -904
2201 -904 -1192 2259 626 -2449 -154 2310 -187 -569 457 -965 283 2526 -700 -2362 2111 1888
2217 1888 -1619 -72 1514 -463 187 1063 -1344 -356 3213 -197 -2585 1311 2229 -1169 173 904
2233 904 -1391 757 2082 -1884 -1209 2880 417 -2723 678 1426 -924 872 362 -2596 476 3251
2249C251m811o56M118j734j977K514m06j818K815o44l500K763L089m431r21L459
2265A111p62j430K339j834j834L890J41m420K321K794l514n93K923j320o04K489
2281A697k724j760M273O20l770R18K039k077K06K226k810K89K877k104k106L415
2297A209O56k958P06J122j683J686J133k924j24L002j116k356K436L13j989J000
2313A13M63j328J627R20k886l75K984m15j731J054l55j027J604J51j985J593J085
2330A492k435j68K438p69j144O97k58o27J716K51k552P49J375r26k01R42p22l77
2348e19N55o77J05J208j07j827N81J070m00l26L69p48N2R31l03o72J061o4j334
2367a045N54Q19j11o9m13n35M26Q31l14j087P39N55k94m1J66l27K94j98l58J65
$$ plain form
2249 3251 -1560 -2216 1902 168 -1809 705 299 -1519 1296 652 -2848 -85 3004 -1427 -2348 1111
2265 1111 349 -1081 1258 -576 -2410 1480 1621 -2799 -478 2316 -1198 -1791 1132 -188 -792 1697
2281 1697 -1027 -2787 1486 2106 -1664 -746 1293 -784 -578 1648 -1162 -873 2004 -100 -2206 1209
2297 1209 1865 -1093 -387 735 -948 738 1871 -1053 -1177 1825 709 -1647 789 1102 -887 113
2313 113 576 -752 875 1795 -1091 -1466 1518 1103 -628 426 71 -956 648 799 -1186 407 1492
2330 1492 -943 -1111 1327 558 -586 111 -147 -774 942 1193 -1359 -610 765 -161 -362 580 -142 -519
2348 -519 36 -641 -536 672 565 -1262 -681 389 -11 -337 32 -716 -664 267 -36 -708 353 289 -1045
2367 -1045 -491 328 217 148 -265 -800 -374 457 143 -944 -205 350 56 15 181 -146 148 -50 -408 -243
2387b43Q97l40p83R1N95L47R3q39K5K59j93K23p8Q3L74k56o19L78N84j05n58r8
2409a63K10M00p8l63m17L96L66m56j50R58p97o8K32n35O44L60o30q29J071L30
2429D81m85J14J7k96j0M49l99jL41rj029Q75K51m81j89P3j56L95M36n91l18N06
2451b6J44m31M44M4o55L25K33l60J3Q94j098j52P72K4l87K80L65q90K32N31n08
2472b06J17L22m66N1P14j39n40L20M3n83M52J33l01J51J81j62k11N11j9p78P93
2493C83k87l10L36K94n42p2O57m78K69%m2k68J66L07n70L77j18k50j61N04n0l07
2515a62M58l46j01L77m28j95L66J52k13k18M01j73k29L18K73n14J91L7l15K98
2535b3J18k21J41J10k02l65L63m9j99L67j20m29M65j11K41j60RJ12m18L60k21
$$ plain form
2387 -243 654 314 -469 -378 217 564 657 -182 -157 102 -91 132 54 137 511 255 -364 14 598 493 -65 -163
2409 -163 47 447 369 6 -411 -15 351 -105 -255 703 -94 -162 70 -465 179 539 -91 -920 151 481
2429 481 -4 110 127 -169 -179 270 -129 -130 211 202 -827 48 299 -182 -371 -298 -454 -59 377 -214 -532 -26
2451 -26 118 -313 131 175 -480 -155 78 -282 -269 625 -473 -625 147 171 -216 64 429 -461 -229 302 -206
2472 -206 -89 233 -233 -182 532 393 -147 173 216 -367 85 218 -83 68 249 87 -124 387 368 -410 383
2493 383 96 -214 122 416 -126 -198 459 -19 250 250 208 -60 106 413 -157 220 102 -148 -309 195 145 -162
2515 -162 296 -50 -151 226 -202 -397 -31 121 -92 -310 91 -82 -311 7 280 -234 -43 -6 -321 -23
2535 -23 95 -126 15 125 -77 -442 -79 -128 -327 40 -80 -509 -44 -155 86 -74 -65 47 -371 -11 -232
2556b32O9Q1J33k48J60J58j73k45N7K50K10j71J93n74M78O4l65n2M06j80k02L14
2578A31j4n0K09q1l9l21N17j6j42j64J66j63O6K6j42L26k08j06l0J63J2R6J0k82
2602c6R2m0j9k14L89Mn54%M82P6Rj71n8k07K03K19m71L51k0l54J34J00Kj02K47
2627F2q5m31N51J64n74o7M65j03r3m3j83O4O13l06p60Q38K91n65L91l45j97L40
2649B7M31n21m44J015j86m36J80K2k76M40J79j089P22N79q15j12M36K53p02J41
2669a56L35l60M57m1n97M11N44n42k36K30k2k13M26l76k06M86N69q14l36Q41k24
2690A76k24M00l12l79O62j12r03O45P18j055j17P16m78j1L84l81l51R28q9r13
2710f96O78M09n89NM09m30j3O43q97l92J038L32p76o4M11j62Q4Q1m70J44P45m56
$$ plain form
2556 -232 -163 -82 51 -197 -37 121 -52 -297 -240 10 220 49 242 -332 146 210 -155 -207 199 19 -183 131
2578 131 117 67 276 195 156 -165 352 336 194 30 196 33 99 125 -17 309 101 -5 -35 128 140 236 246 -36
2602 -36 56 16 -3 -217 172 176 -378 -378 104 180 189 18 -40 -247 -44 175 -296 55 35 -319 -185 -85 -83 -185 62
2627 62 -23 -454 97 261 -313 -380 85 -18 -111 -154 -337 -273 340 34 -726 112 403 -162 229 -116 -313 27
2649 27 458 -63 -507 508 322 -114 66 88 -188 252 431 -658 64 643 -172 -284 152 405 -297 -156
2669 -156 179 -181 276 235 -362 49 593 51 -185 45 23 -190 236 -140 -346 140 709 -105 -441 400 176
2690 176 -48 352 40 -339 323 211 -692 -47 671 -384 -501 215 -263 -274 110 -271 -622 306 217 -696
2710 -696 -18 391 -198 -193 216 -214 -227 416 -481 -873 165 497 -279 -343 68 -94 -10 71 -399 -255 490 34
2732C4q66P03O14n28j1K20l15n8N54k97m11Q73j01p80M15N87p06p6M23l50R6Q16
2754H36p96r21J036N78q65n0P39p97L43K0l04j55J027m04j035P80N65l83j27J44
2774B31m02L62M73p07m38R79O4r81L72N80p08lN03o40K82R67p43j243J316L37
2794F01j001J91M62o00N30N25j186j62J428o50j354J151P74j264N85N1r90J028
2812A19R27j448k96J458o38j004J025K72q43N33m1j150Q83J316j240q25J268j11
2830B05m50N35r9o69P37J90j411P42J056o00j180R74M06k89M5m69m32R13N07j247
2850e36K20R83k55q06P58q9k50N32n94p09J122L57r67j71N50r2kL93o33p7O49
2871C83m38l69J99O53o18l08M31J65K65j15m29l84J073j51q32P5O27l21n4K44
$$ plain form
2732 34 -832 -129 485 -43 -54 166 -149 -207 347 50 -361 512 411 -369 46 633 -73 -149 274 -76 20 836
2754 836 40 -881 155 733 -132 -182 557 -240 103 123 -181 -336 691 287 -748 32 597 214 87 231
2774 231 -171 191 664 -43 -481 498 562 -419 -47 533 -175 -178 325 -315 -33 934 191 -1052 264 601
2794 601 -400 -209 253 -347 183 708 -478 -640 788 138 -1216 -65 709 -555 30 81 -909 119
2812 119 1046 -402 -698 760 122 -882 143 415 -428 105 64 -1086 -203 1113 -127 -952 316 205
2830 205 -245 290 191 -478 259 449 -962 -220 836 236 -944 30 436 147 192 -277 -709 204 711 -536
2850 -536 -316 667 412 -394 364 275 25 557 -37 -746 376 733 -234 -405 145 53 51 444 -189 -266 383
2871 383 -55 -424 -225 428 -190 -498 -67 98 363 248 -181 -565 508 357 -475 -400 227 -94 -148 96
2891I6k92J85J42l23l13O15L41m75m44Q1J55L81K04p01J02J26m1j80J86K64l65
2912b56L25k54J18K86q3k23j64K60K71k03k47J4N02k63j28J78j27O2j26j13K73
2933A02J43k7k97o1P7K86j83L13l74J06p2mj5L00J48n58J06P5J14J91l33m86M41
2956hL50m00Q1j61L35l23K75j14j16O5J82l82j04M64j00k74R1L04l26l7J29q8
2978a57J23L75m13n2L43j74l37L09l9j30K37J38l34k6J90j0j88K23l52J93J47
2999F6J40k56J36J94m85K05J50k16j14J64r3J11J56Qk10K86o0m08J50M12n25J02
3021h7K64k52N9J67j44l14O5J35j46K48J18n7k09K40m3j82j4M56p2k5%l47O1j67
3045b46M31q3k63J73j7k14K54K3J00l03K03J35l38J92j68R8N9n4k64O0OK87j47
$$ plain form
2891 96 -196 -11 131 -192 -505 110 451 -24 -468 -387 -232 149 353 -348 -246 -120 -161 -341 -155 109 -256
2912 -256 69 -185 -67 219 136 -87 -251 9 280 77 -170 -156 346 83 -45 133 6 68 -58 -171 102
2933 102 245 218 -79 -140 -63 223 40 353 -21 85 13 9 -6 294 442 -116 -10 65 179 370 37 -449 -8
2956 -8 342 -58 23 -138 197 -126 149 35 -81 -16 166 -216 -320 144 44 -230 -139 165 -161 -198 -69 -157
2978 -157 -34 341 -72 -124 219 45 -292 17 -22 -152 85 223 -111 -137 53 43 -145 78 -274 -81 66
2999 66 206 -50 86 280 -205 0 150 -66 -180 -16 -109 2 158 166 -44 242 182 -226 -76 336 -189 -87
3021 -87 177 -75 -16 151 7 -307 -242 -107 -253 -5 113 56 -153 87 44 -138 -152 304 232 207 207 -140 -79 -246
3045 -246 185 102 -161 12 -5 -219 35 58 158 -145 58 193 -145 47 -121 -23 36 -18 -282 -222 -216 71 -76
3068g6P5K5o2L29m19K47P0m90R0Q9O2l8K05l08L59m62J27J90j92J00k59M84j14
3091C2k80L95m86J85J01J49k45oJ13J3j39K2K81j41j18J37K2J26j97n3J29l38
3113b98J53R5J05j42J40j91M25m69L18j29lJ27r2L9k4N0k50L28j9j14K14j06J49
3136C06l4l74j74j66N59k76M44k58P1k13J88k10Q5J89r1R3k5k05M02k35L7l3L8
3159A18l15J57j59PK40j37J8K33p1j70J06K79l15P9P0Q9j08J02k14p6J69k57L25
3182A70k51j21P8J31p4K10j69k28N14l62kj38L22R1k69J65J10m21K00J42j79l
3204h4L02j52J7K4j61j23J41J37Pj73J65pJ32J5l39r8J42K48l75J15K37L7k11
3227dK13m98J48j13M27m24M37L5l27L41k49j40Q6J48l64L59J57j46k37L67m13
$$ plain form
3068 -76 -1 24 -38 291 -128 119 189 -301 -211 -122 -60 -98 107 -201 158 -304 -177 13 -179 -79 -338 146 32
3091 32 -248 147 -339 -154 -53 96 -149 -155 -42 -29 -168 -146 135 -6 -124 13 35 161 -36 -89 40 -298
3113 -298 -145 -50 55 -87 53 -138 287 -182 136 7 4 131 39 78 54 104 -146 182 163 49 263 157 306
3136 306 272 -102 -276 -442 117 -159 285 27 98 -115 73 -137 -52 137 46 139 114 -91 311 76 113 80 118
3159 118 -197 -40 -199 -192 48 -89 -71 162 91 -79 27 306 -9 70 140 229 121 223 9 -67 102 -155 170
3182 170 -81 -202 -124 7 -67 143 -26 -254 260 -102 -104 -242 80 171 -98 67 177 -244 -44 98 -81 -84
3204 -84 218 66 83 107 -54 -177 -36 101 108 -65 100 93 225 240 -99 -197 -55 193 -182 -67 170 207 -4
3227 -4 209 -289 -141 -254 173 -251 186 221 -106 235 -14 -154 -68 80 -284 75 232 86 -151 216 -197
3248a97p9K45j24J86l47N32j37j12J27lr5J90k57k07N89k53k87L78j03o6J15j41
3270d6N5R1K31k46j04K10L2l49L99j63k28K87o9k33J59K98l14j77L19m0k41j3
3292a42J96r6L71j14m42r5O97n44K36j6o8k61O80n00n3L22l9n7j81M78k76j10
3314a4J45j94J3L32k87l18K90M5m4J67j28j81J06M1j60J96JK3l21K78k16J63N5
3337hN6k62J46K24l47M8O7K60k69L99k38J0K1j26o3M3L32l10k92pJ14J56K57j71
3361D0j52K82m7l70LL64m4k51J80k3p4j0Q7J04K04l87N1K41L6n27N23j55p7M20
3385D18n70J58J17l00M21k67k04L18L8J95j39j30J72j41L8k05L2NK06k40R1k93
3407b80N62j62k59J11L04l76J15k38K50R7q5N7J0n8j29J84j50Q5j37L24l23J21
$$ plain form
3248 -197 -276 -31 -155 31 -316 216 79 -33 94 91 -4 186 -71 -278 311 58 -229 149 46 -20 95 -46
3270 -46 9 100 331 85 -19 191 223 -126 273 110 -118 169 100 -133 26 324 10 -167 152 112 -129 -142
3292 -142 54 -42 329 215 -227 -322 375 -169 67 51 -17 -278 402 -98 -151 171 132 75 -106 372 96 -14
3314 -14 131 -63 -50 282 -5 -323 -33 12 -32 135 7 -174 -68 -27 -187 9 10 33 -288 -10 -226 -63 -8
3337 -8 48 -214 -68 156 -191 -143 -76 184 -85 314 76 86 107 -19 -82 -39 293 -17 -309 -316 -202 -46 211 40
3361 40 -112 170 123 -247 -244 120 76 -175 5 -18 -92 -102 -15 89 293 -94 -43 198 234 -293 230 75 -2 418
3385 418 -152 6 123 -177 244 -23 -227 91 129 324 185 55 227 86 124 -81 -49 -44 162 -78 13 -280
3407 -280 282 120 -139 -28 276 -100 15 -223 27 124 39 96 106 48 -81 103 -47 38 -99 225 -98 23
3429B3J07l16J2L74L5k99R0k8q1K23km40L70k10L87k59o8nK5J44J1n09L56L13
3453B53n52N73k3k17J21k1k24L01j27Q2j58j31K13k1M0l0l08R8K19M3l77M06j02
3476E8l74M0O47m78J01l2o9R4J45p5j09o8K54j56P4o6J53r0K2j71L80J13j20j75
3500I8j65p8P2k0o3R8J71J02m86K17K80l1m42J71P8L24l25l7r1r7J86k5o9K68
3524A36j66K25O8l71j1J57L2j40J43j89p1L57m78J85r4K55j62K49L8l41K42j34
3546g0j00K87r2j16j30M55l73J02l2J47m3J09m5n8J02O9m60K35K65n1ql94L40
3569A39j2j56j55kK45l09J59l1K0P4N3q2J17k23L01m1M3M8j51m5K6J34m2n5R6
3594A51l16L72l38J71j58J10K21k48O6j38J02m4K8J5K09j81j71K79l11O9J5J52
$$ plain form
3429 23 130 -186 -174 200 235 -64 26 -2 -83 140 138 -302 68 -142 245 -14 -82 -87 -62 82 93 -416 -60 253
3453 253 -299 274 251 34 155 134 -90 211 84 166 8 -123 90 69 109 79 -229 -131 88 131 -246 160 58
3476 58 -316 -276 371 -107 -6 -38 -107 -13 132 57 -52 -120 134 -22 52 -14 139 49 71 -100 280 393 273 98
3500 98 -67 -145 -73 -93 -156 -58 113 215 -271 -54 226 195 -247 -76 2 326 1 -36 -127 -224 -38 -63 -132 136
3524 136 -30 195 263 -108 -119 38 70 -70 73 -116 -187 170 -308 -123 -217 38 -124 125 163 -178 64 -70
3546 -70 -170 117 25 -91 -221 234 -139 -37 -69 78 35 144 99 41 143 212 -248 -13 252 201 193 -201 139
3569 139 127 -29 -184 -186 59 -250 -91 -122 -102 -28 25 -57 60 -163 138 97 140 188 37 -8 18 152 110 55 151
3594 151 -165 207 -131 40 -118 -8 213 -35 31 -107 -5 -49 -21 -6 203 22 -149 130 -181 -112 -97 55
3616E5Rr9K16j8o2j27j14Q6m6L3j06J94M8j21r2K70L03n65K46l31K80J48j59J03
3640A51k64J5p5lL48k90K03M5q0K76m75K14l7K5j29K07l76L61j09J16j49m8O0
3663a4j39J58k47J34L39p42K72K52q0K13l04J47p7L53Kj16l68K12o2O0J48k08
3685f7J52p2R8j8j8k59K86l4r0j5N7K67j86k58O8L2R0p5L6j55L50j54k04J51L2
3710A4J2Q7l24L63rq1j42J59j62j85N99l29J33p9J10j15K3j48J57k47r3J25J14
3733a8L5j10M5K92k22J53q9r1J73j05N2k56O3K54kk91J68lJ6j38K51j31r2j91
3757b37O7M02k64R5Pj17R7j45p3K96k45L7J5J33N5j76j30J08j85J03p2J66K48
3780A85j83k20K77K3l73N63k18N6k81N5K18m8K76l80l6r3L17k57K14k22M7K44
$$ plain form
3616 55 64 -35 181 163 101 -26 -140 -54 -100 -67 -173 21 69 -52 -144 126 429 -136 110 -221 59 207 48 151
3640 151 -113 -98 -173 -176 172 -118 85 130 50 326 -149 65 28 53 -76 131 -245 116 7 123 -26 -74 -14
3663 -14 -153 5 -242 -108 231 -511 -239 13 -67 146 -158 -11 -88 265 267 151 -217 -5 -67 -7 141 -67
3685 -67 85 13 111 93 75 -184 102 68 -22 -37 20 287 101 -157 -89 -57 33 -42 -6 -161 189 35 -169 -18 14
3710 14 26 113 -211 152 143 62 -80 79 -83 -268 331 2 135 56 166 51 74 -74 83 -164 -257 -132 -18
3733 -18 17 -93 -48 244 22 175 86 -5 168 63 115 -141 -78 176 174 -117 51 48 64 -74 177 46 -46 -237
3757 -237 -170 232 -32 63 70 -47 50 -95 -168 128 -117 -80 -65 68 123 -53 -183 -75 -260 -157 -229 -63 185
3780 185 2 -218 59 82 -291 272 54 110 -171 -116 102 54 330 -50 -86 -179 138 -119 95 -127 -80 164
3802A64Mj75O8J15k55l97P10K0m45K30ON3q8R0l38o1L92J30n99O72m60P1p2J92
3826B7l03J79J87j57j31P0J41RR9j76nJ81k82J32J8J54j98K16k76r9K7Q2K6p4
3850a53L65j13n3q9L1J70r1m9j39P1J44m5m09L69j12K62j56nk28J06J54j53K92
3873A69m8o1j07P2l8j52M08l44o3J21m1J37l2l00J66J11o0J26L8j92J22P1j27
3896b4J90N4m30K37L09l72j46P4P5J35m08L84n7r5N4J99j24j46N7N2M8Q1k94Q7
3920f0K33k87J64L17o66j0N46j08q5r5K58l03p8K18M1l73L50mm0J32L8k30K70
3943B28l4p03N40J3l27J51K28k17Q8K45k42j53J17L54m42n2K92j6l47K95K06l06
3965h2J64k35j18M38k69K86j06J96m57J03J45K43l26r0Q4J8Q2J1j42k19N57l84
$$ plain form
3802 164 168 -7 61 176 -79 -476 234 254 -191 39 45 98 10 100 -238 -299 93 223 -376 296 -164 -93 -165 27
3826 27 -276 -97 90 -67 -198 -128 13 22 121 -55 -60 121 -161 -29 -11 143 -55 161 -115 -214 -187 -105 -79 -153
3850 -153 212 99 46 -43 -12 158 67 18 -121 -50 94 49 -360 9 -103 159 3 -2 -230 -124 30 -123 169
3873 169 121 60 -47 25 -13 -165 243 -101 -164 -43 -84 53 21 -279 -113 -2 -62 64 102 -90 32 103 -24
3896 -24 166 220 -210 27 336 -36 -182 -108 -33 102 -306 78 21 -74 -20 179 55 -91 -34 18 66 147 -147 -60
3920 -60 173 -114 50 367 -299 -309 237 129 44 -51 207 -96 -174 44 85 -288 62 58 18 150 188 -42 228
3943 228 194 -509 31 44 -283 -132 96 -121 -33 212 -30 -183 -66 288 -154 -206 86 70 -277 18 224 -82
3965 -82 82 -153 -271 167 -102 184 78 274 -183 -80 65 308 -18 -108 -24 -6 76 87 -55 -274 283 -101
3987a01q3M54p9m40L01J7n39M29L99m19K7q9K8j50L03j35j49L40r9j44L03j62
4009A2m96O97j11j4j51j05J12j34K56j17j00j23K44l71M69J39m50p5M63K13m47
4030h9K80n32K07K13J5n3P0K2j74J96k77J95j04L83m22nK86m01P2J09O4j24L64
4053B95k26k7j70N08m99J8J83J1j17K04j74k43L48n2j74J43R4j86m6J55N7k04
4075a02J1K79k47K75j84k46L59j99N9k36L39l99K00L35mj47j27j8n4L0K17j59
4097a8k5K55k40K61k21K36j90l7k6pj29M8Q4K24l09k2m0q8J42J7J63j09O6j40
4121a05N9J50j95k69K28J80L43n10K64j65Q3M5lj15j33Q7J29L4l12L34l32n4L55
4144I8j03J82M8j89L6k8J33J33l38J08k61L57j69p9J95j98pJ76n7m3q8l2R1O8
$$ plain form
3987 -101 -184 270 191 -249 52 69 -470 -41 358 -61 -34 -123 -95 -245 58 -77 -226 114 15 -129 174 12
4009 12 -484 213 102 88 -63 -168 -56 -190 66 -51 -151 -274 -30 -401 68 207 -243 -318 145 358 -89
4030 -89 191 -341 -134 79 94 41 111 133 -41 155 -122 73 -31 352 -70 -75 211 -190 -118 -9 55 -69 295
4053 295 69 42 -128 380 -119 -101 82 93 -24 180 6 -237 111 59 -115 28 122 -64 -110 45 102 -102
4075 -102 -91 188 -59 216 32 -214 145 -54 5 -231 108 -291 -91 244 240 93 -34 -52 -106 -76 141 -18
4097 -18 -43 212 -28 233 12 248 58 21 -5 -12 -141 -93 -9 215 -94 -116 -156 -244 -102 -85 78 -31 35 -105
4121 -105 -46 104 -91 -360 -132 48 391 -119 145 -20 63 108 105 -10 -143 -56 73 107 -205 129 -203 -257 98
4144 98 -5 177 225 36 72 44 177 310 -28 80 -181 176 7 -72 123 -75 -82 94 37 -6 -94 -126 -35 33
4168C3k39K25l1J27j71J31q2O1k94K22J86k13m5M5J01oq1M5l4j1J74k54L47k21
4192A5j33j42O56m05nJ14j98q0K27j87J27j96L59l48lR3O7k2p7O5L5l6o5L89m78
4217b28J08o9K22p3J04J05J9l98J17M6J35j94L39j70k1q1N3O3m68L18k00M86J14
4240C27k09j48R7n1K52m34O4M49n73L74l34K19L55m29L0K27j36k47K35j99P7j27
4262a81J18J14k69P7J21K81n29L31p0k31K26J61k68K37n3p8L3j33n9o5J29j20
4284b28J29l1r3K05R5o6p6J76M2r8j02m3j2p6K50j5k18K45Rl54j12O36k71Q2j72
4309i8k19M66L7j51k27L37k20L36l51J85O4j96J25q9j28L99ol53J98l4k97J45
4331g7J44j39J89j95j60LK32n1k12L12n1jpL22l03J70K43m42J23Q2j36l42O3K53
$$ plain form
4168 33 -206 19 -12 115 -56 75 -7 54 -240 -18 168 -45 -90 -45 56 50 -31 14 -20 -31 143 -111 236 15
4192 15 -118 -260 396 -9 -14 100 -98 -178 49 -138 -11 -207 152 -196 -199 -106 -39 -61 -138 -73 -38 -74 -139 250 -228
4217 -228 -120 -189 33 -40 64 169 188 -210 -93 -47 88 -106 233 63 42 -39 14 77 -391 -73 -273 213 327
4240 327 118 -30 67 16 268 -166 -102 347 -226 148 -186 33 388 -41 -11 216 80 -167 68 -131 -54 -181
4262 -181 -63 51 -218 -141 -20 261 -268 63 -7 -238 -12 149 -119 118 65 -13 20 -113 -172 -237 -108 -228
4284 -228 -99 -130 -223 -18 77 11 -65 111 153 55 -47 -90 -102 -178 72 57 -161 84 93 -261 -373 263 -8 74 -98
4309 -98 -317 149 186 35 -192 145 -75 261 -90 95 159 -37 88 -1 -129 270 264 -89 109 75 -222 -77
4331 -77 67 -72 117 -78 -238 -235 -3 -54 -266 46 -5 -6 -13 309 6 176 419 -23 100 182 46 -296 -233 20
4355B0k43J46J08k00K03J7k54Q5K91l62J31j77M17l27J78j76O7L99j39p3r7P1
4377H5q6%k01J75p5J65J13j90k01J95q0j4Q4L0rk16q3K08m9J49k10K17j9j64N0
4402a26K39P7j60j79M48m36K44j26p4J39o2j84K76p6Lm6O0o1K36j67Q9k09j7K12
4426A00p5K03j48O1nj68K50j77k77N86l53O4P1l3k80K44K36m22J36o2j58J39n9
4449a27J48PQ8l06L01J56k35kl76K40j7m0L19k9j53P7J82m89K91J25j86P6M9j82
4473h3J0L84j26m42L16M0j13J35k3k42J98J35m89L73M9l13nO4M56o98M34k2q6
4496d8J27J35j93m49Q13l62j53L63r8k30M88j30k94O3j8o1Q1R6m35K43M80m94
4518g6l87O58J84o12M86j11r4o0R6M2J1K06k68k90M66k22j65l9M32l71K45l8k55
$$ plain form
4355 20 -223 -77 31 -169 34 51 -203 -118 173 -189 -58 -235 182 -145 33 -143 -76 323 184 111 14 85
4377 85 -1 -1 -202 -27 -102 63 176 -14 -215 -20 -100 -114 -30 0 -9 -225 -308 -100 -149 0 -210 7 -12 -176 -126
4402 -126 113 190 30 -149 299 -137 107 -19 -93 46 -16 -200 76 0 3 -43 17 -44 192 25 114 -95 -112 100
4426 100 25 228 80 141 136 -32 218 41 -236 350 -3 61 132 99 -181 63 299 -123 13 -49 -207 -68 -127
4449 -127 21 28 116 -190 111 267 32 30 -346 -106 -123 -163 156 127 -26 51 233 -256 35 160 -26 50 99 -83
4473 -83 -73 311 185 -257 59 99 -14 121 98 -144 54 189 -300 73 122 -191 -196 -132 324 -374 60 38 -48
4496 -48 79 214 21 -428 385 23 -130 233 135 -95 393 263 -31 32 14 -47 34 130 -305 -62 418 -76
4518 -76 -463 195 379 -233 253 142 48 -12 84 126 137 343 75 -215 251 29 -136 -175 257 -114 131 93 -162
4541a62J88L7j44k11L95P0k50K81j97j54Q1K05k62O8J74j29O4L25k80k23Q3J39
4563I8k8j35L13m94J21K29J7k90J86o1k51J81J09j61L06N4m05K28p7L1K42l16
4585a03K60j87J59k80r8J11Q2p9J72K21l94L03j15N4l42M22q3m68O08J00L8k13
4607A68q5j63J70M5l4k46M23j84j10N55m95J31k88J08L4l2O1j25J15j88J98j77
4629a19K33l36J90L01o47K80J39o6M9q4j86J57K55j51j05K47k72J58o2K70k14
4650C7k11K02k14N8P0J36k91R8J61k17%J56J9j20J95j89J81Pj69j10r1L25m41
4673d08M12K15k27P7J68l97K29q4J60N1jQ1l52J14M1k15L99l05R4N8P6P9m3q0
4697A42k10l1K72j70j3K19M1k83M6K04K2q5J88l82k01J78K21l56O0K19l09P5M71
$$ plain form
4541 -162 26 63 -81 -292 103 173 -77 204 7 -147 -66 139 -123 -55 119 -10 54 379 99 -124 -41 98
4563 98 70 -65 248 -246 -125 104 121 -169 17 -44 -295 -114 -5 -166 140 194 -211 17 -60 -29 213 -103
4585 -103 157 -30 129 -151 -249 -138 -56 -135 37 258 -136 167 52 106 -236 186 103 -365 243 343 381 168
4607 168 83 -80 90 135 101 -145 278 94 -16 539 44 175 -113 -5 29 -3 58 -67 48 -140 58 -119
4629 -119 114 -222 -32 269 -378 -98 41 -25 24 -60 -246 -89 166 15 -90 157 -115 43 -19 251 37
4650 37 -174 28 -186 -128 -58 78 -213 -115 46 -171 -171 -15 4 -116 79 -110 71 78 -91 -201 -292 33 -408
4673 -408 4 219 -8 69 237 -160 69 -15 145 196 195 276 -76 38 79 -136 263 -42 52 110 186 265 222 142
4697 142 -68 -99 173 3 -10 209 250 -33 13 217 239 154 342 -40 -241 -63 158 -198 -138 81 -228 -153 318
4720C18p2o1rj24J18j10P0j39k12K59m3MJ15j47j28P6q2k53O29p0m03M91k48J38
4744A17k78L73l93K90j55o9j12K74q3k29J99P6k15N08l99j97R2M47j09n4J47l54
4766a24J8q3J34j09L51q4j26J00j15l3j01R9o9K66pj63K0j16J81k7r4L24j25Q4
4790B01j62k17r5L54j21j21J15J24O7k10K73j60m4m6Rj33oL76m54J65M8J73j16
4813B0k91N69l10m7j8K2n5K13k69M1M40l58P4k98k45M74j78K40m62L91J57k21
4835a11R5k65K31K76m63N7J09q9n2j8L23J35k59r5j79J20J36J29k2J2J87j16k34
4858i3J6R2k53M41o6j30J44j28l3J71k4j38Q3j84K04j29J87n8k22K12jr0J68k93
4882a24J67J42j47n7m7j76L70j34J66k70L20J39l14j99J75j5j11Q1k56K30j1k5
$$ plain form
4720 318 246 185 176 52 170 60 130 -9 -221 38 -5 -1 114 -33 -161 -85 -167 -420 209 139 -264 227 -21 117
4744 117 -161 212 -181 109 -46 -115 -227 47 -36 -265 -66 10 -205 303 -96 -293 -201 246 137 83 230 -124
4766 -124 -106 -189 -55 -164 187 103 -23 77 -38 -71 -172 -73 -142 124 117 -46 -26 -142 39 12 -82 242 117 201
4790 201 39 -178 -273 81 -40 -161 -46 78 145 -65 208 48 4 -42 -33 -166 -172 204 -250 -85 -37 136 20
4813 20 -271 298 -12 -59 -77 -55 -110 103 -166 -125 315 -43 31 -267 -512 -38 -216 24 -438 -47 110 -111
4835 -111 -16 -281 -50 226 -237 -180 -71 -160 -212 -230 93 228 -31 -126 -305 -185 -49 80 58 70 257 141 -93
4858 -93 -77 15 -238 203 137 7 151 23 -10 161 137 -1 82 -102 102 -27 160 102 -120 92 91 1 169 -124
4882 -124 43 185 38 -19 -66 -242 128 -6 160 -110 210 349 35 -164 11 -4 -115 -34 -290 -60 -71 -96
4904i6J55K56n56L21j51l29M20R7k05j06K65j96k2J67J80m32M1Oj13J58M9L98
4926C07n85K55R4m32L03K41o07L68O5l06K24J01J34j11R6R2j82k74K63j52l1N09
4948C72n85J22n3K67k65K92r1j34j87M15n25L85P7j20j31J62j96J25R1j82Q9o8
4970a40K65k40J43K99l25K1J45n0j48L1j72J07M3L75k74k6Q9r0q4R7j3l44L08
4993A7rl67M03L61n54J1J0K58k95L55k10j33Q6L73n59Q4J18l26K36K81k69M2N7
5016c0j60j26K55J77o32M62J04q7K01N0o21K21K23L5l63L60L11m08Mj7J32PK36
5039C34o11Q5M44j04n2P0n2l39L40P9j50o9J60k30M7J12L0j61L81l23j18N9J71
5062A03K6l29J69j22J47r2J14j62M78l97O2K80j10k88nL52J8j42l2j04K9j88K04
$$ plain form
4904 -96 59 315 -241 80 -71 -400 20 117 -88 -194 71 -125 -147 20 200 -232 -191 -185 -298 -140 -91 307
4926 307 -278 -23 71 -361 -58 183 -424 -56 9 -297 -73 28 162 51 147 239 57 -217 46 -106 -137 372
4948 372 -213 -91 -144 123 -142 150 59 -75 -262 153 -372 13 90 -30 -161 1 -195 -70 21 -161 -72 -140
4970 -140 125 -115 28 327 2 23 168 118 -30 1 -171 -64 -21 354 80 54 143 53 -31 66 53 -291 17
4993 17 8 -359 44 405 -149 -138 -128 130 -165 190 -20 -153 -67 306 -253 -169 -51 -377 -141 140 -129 -87 -30
5016 -30 -190 -316 -61 116 -516 -54 50 -37 164 214 -407 -186 37 72 -291 69 380 -28 -24 -41 91 98 334
5039 334 -277 -192 252 148 96 166 114 -225 115 194 44 -25 135 -95 -48 64 94 -67 314 -9 -127 -68 103
5062 103 129 -200 -31 -153 -6 -98 16 -146 332 -65 -3 277 167 -121 -126 226 244 102 70 -34 -5 -193 11
5085A1J1P4p2o4j84L33LN3j56l96L45Q7l59K57j00J7J86p2j52J55J05l35l2L0
5109b55J98k0J88j98k87J70M30k00j97L90k91p4J16L46m35J34j98P2K99J11k61
5130C8J04J36n00K87J97j28q2j39O4R4m1j38RL86l92L09m00L22j69j48K63MO2
5153A38J5k54k7J23K7j42J76J41k79R6O3O0j58jq3J0K47R3m56J06N1k75L54K9
5177E4j04j45R7j5N8K28j02l21L03j84j41L78K33l23n4J17j9j57P0ok14K22K26
5200B01l86L23m2n99M02J88j97oK0R5k4J17p3l31K71L64l25j70N17R3m04k35j10
5223c11J04L37j70m1L61l91J20j50L82k22r9L04M0l95M87l85N4J46r5j29j33M10
5245B24j64l42N87m94K94N7j41j10J97m23L71q2j3j72J00K43Qk9mK3r8K53l39
$$ plain form
5085 11 22 96 24 -40 -224 109 112 165 9 -387 -42 45 -314 -57 -157 -140 46 -26 -178 -23 82 -253 -285 -255
5109 -255 -57 -77 111 -87 -374 -204 226 26 -171 219 -72 -146 -30 316 -119 15 -183 -111 188 299 38
5130 38 142 278 -222 65 262 134 52 -87 -23 71 30 -108 -99 287 -105 204 -196 126 -43 -191 72 76 138
5153 138 153 -101 -128 -5 22 -120 56 197 -82 14 77 137 -21 -22 -105 -95 152 245 -211 -105 -54 -329 25 54
5177 54 -50 -195 -98 -113 -55 173 71 -250 53 -131 -272 106 339 16 -38 79 60 -97 -27 -33 -247 -25 201
5200 201 -185 138 96 -503 -101 87 -110 -116 -96 -1 -25 92 19 -312 -41 323 -2 -172 345 438 34 -201 -311
5223 -311 -207 130 -40 -81 280 -111 9 -141 241 19 -80 224 264 -131 356 -29 25 171 76 -53 -186 224
5245 224 60 -282 305 -189 105 162 21 -89 108 -315 56 -26 -39 -211 -111 132 140 111 107 130 32 285 -54
5268e4l9O0p6k71K87M61o59O2K83J8m65J94J19l26L55k3r0k8M2q6k0L1K15l35
5292c45L06jk08R2J35j5q8J36j2j15M22l12r4MJ93l04J83n3o1L47l7j25K16j35
5316A29j3j33j5r1mK48j33l9j27L33k72K13L5J2j50q4N15j65Q4m14J93M5J19j28
5340A58r6j00n2Q0j09L58j45o0O3j38N1O8K24k26o9O8J8k09rq9R2Rql4P8K09n44
5367d12L44k02J75k1qJ65P4k35m1O2j13K47l84Q0L02L8k67L57o9q3j49M12m72
5390b00L11j03J83k54o0J07M3K34j15k27JK27l48J84p8K65RK71o21J20K71l25
5412a05K39J93m34J7j31L40q9m4k03K55P2m9o2L16j95N5L3p2n9j82K19k15J85
5435H4j48L87l85O6j4J50l37K12L12l77P5L7n2n8n0J81j44J88j09k99L22JK3r1
$$ plain form
5268 -54 -93 -33 -109 -380 -93 368 -291 -229 54 72 -393 -199 -80 -406 -51 -74 -164 -192 -150 -236 -256 -225 -10 -345
5292 -345 -39 -40 -248 -156 -21 -36 -124 12 0 -115 307 -5 -99 -95 98 -206 -23 -76 -137 210 173 48 264 129
5316 129 116 -17 -32 -123 -127 121 -12 -51 -178 155 -117 96 131 143 -7 -91 424 259 343 -71 122 167 286 158
5340 158 62 -38 -90 -10 -119 239 94 34 97 -41 10 78 302 76 7 75 93 -116 -125 -214 -122 -113 -121 -155 -77 132 -412
5367 -412 -68 -270 -95 -116 -124 41 115 -120 -161 -99 -212 35 -349 -269 33 71 -196 161 92 9 -140 272 -200
5390 -200 111 8 191 -63 -123 -16 27 261 146 -81 -80 147 -201 -17 -95 170 179 450 -171 -51 220 -105
5412 -105 134 327 -107 -90 -221 119 30 -14 -217 38 110 61 -1 315 120 175 208 136 77 -105 114 -101 84
5435 84 -64 323 -62 4 -10 140 -197 15 327 -50 25 62 10 -48 -98 83 -61 127 18 -281 41 42 65 -26
5459b6P4o1l2j08J91j36j8J78j90K16J47l06r0m6R7M5J11m0k35K98j04j3k71K63
5483e6j34L39j86N8J67k02J99j72K07j32j50J50J15j76k51L05J9l2N4l67J39J36
5505C0K78q4l20J21J30J3R7k74k61K26j37Rl0K77Qp7J32j28L05p4k73l38P36l39
5529B7p7JQ4m09J88J59j54K31J42k5k62j35O8P6K11p5k20K95q1l36M97k14j92
5552b01P8J55p0kO2Qn02L04L51l12L23j67j13pO5k3l4K08l30J60m4n3J09k04M46
5577B07j55p8n6M01p24O78k13r3J39j08j54L21J98l81rJ45J64m24L40j57j25J14
5599C0n0qJ68J51l44K64j1k42K02j20J73k48J4j09J96J07j5r5J16l2j67m2n6J89
5623G1p7OJ4j67K80j99J91j84R7r6r8K10k51K96k57n6N0L7J01J88j72Rm9Q0l13
$$ plain form
5459 -26 48 -13 -45 -153 38 -98 -116 62 -128 88 235 -71 -161 -207 -110 -65 46 6 -229 69 -35 -48 -319 -56
5483 -56 -190 149 -37 21 188 -14 185 13 220 88 -62 88 203 27 -224 81 100 68 122 -245 -106 30
5505 30 308 224 -96 25 155 168 265 -9 -270 -44 -181 -172 -202 75 83 6 138 10 315 241 -32 -370 366 27
5529 27 -50 -49 35 -374 -186 -27 -181 50 192 167 -95 -230 -162 -86 125 50 -170 125 44 -292 205 -9 -201
5552 -201 -123 32 -38 -40 22 30 -472 -168 183 -129 194 27 -86 -93 -28 -51 -85 123 -207 -47 -91 -144 -35 -239 207
5577 207 52 -26 -82 319 -405 273 60 -33 106 -2 -156 165 363 -18 -27 118 282 -142 198 41 -84 30
5599 30 -20 -28 140 291 -53 211 200 -42 160 40 213 -35 -21 -130 66 173 158 63 179 147 -20 -62 -118 71
5623 71 -6 0 14 -153 127 -72 119 -65 32 -64 -162 48 -203 93 -164 -220 -170 -133 -32 156 -16 -7 -56 24 -289
5648b89P5J12L1r7O3j70P1K99j14JP4k4k15PN89m07O4j30n5j19J59o7j35M90j93
5673B0K7j14K39q0p5%J86l76K86K44o76M17j60J12L54k87l17J53M98k90j94M16
5695C83l26m36O16k0m45M24j81K8j19K21p0p1k31K49r5K34k23n4J29j30Q9N1K08
5718B31j75q7o9J72%K29m52m2L34j11o2o6K44k86L10q6J1k54L52n25K15%L46m45
5742b16R4J81m81L27J84j58j08L65j84p3J84k21q6K21K6j98L5L81n13K20J11o2
5764B9j72N20l85m8L41l49q0RL60m07J79K54r9l47L52J93m59L96j37k92J99p3
5786a6l8K08o0j48K17p5J2k07J55p9q7P5J53j31J27L4j07j46k32M97j75J58k10
5809g5j51K51j31j3J11O4j16k0K67k14k06K24j23J5nL0K34k55l3K49l13K52k09
$$ plain form
5648 -289 -214 -102 -71 -168 -105 -275 -204 95 -19 -18 56 32 -183 -176 413 6 70 -60 -115 -234 -75 -142 -277 213 20
5673 20 47 -67 172 92 17 17 203 -173 113 357 -319 98 -62 50 404 117 -200 -47 451 161 -33 383
5695 383 57 -379 237 217 -228 196 15 43 -76 145 75 4 -227 22 -73 161 -62 -116 13 -117 -28 23 231
5718 231 56 -31 -100 72 72 301 -151 -193 141 30 -32 -98 146 -140 170 84 95 -159 193 -332 -117 -117 229 -216
5742 -216 -122 59 -422 -95 89 -69 -177 188 4 -69 115 -106 -192 29 55 -143 -108 273 -240 -20 91 29
5764 29 -143 377 -8 -56 285 -64 -144 -135 225 -182 -3 251 152 -195 157 350 -109 287 150 -142 57 -16
5786 -16 -54 154 94 -54 163 88 100 -107 48 -31 -118 -43 110 -21 106 140 33 -113 -345 152 -23 135 -75
5809 -75 -226 25 -106 -119 -8 56 -60 -80 187 -27 -233 -9 -132 -117 -122 -92 142 -113 -146 103 -210 42 -167
5832a67K05q9j90l4L85j18k7j67K7J69j13M38k93K68l66k51K94k49M15J49J6m15
5854a13PK14j18J06k80M9J81n6L32k84R7l73L13m1j71O2L42k79j75P6K48J00m45
5877b08M7J96m0K6K25l14J67j42k3J44O2r2J92l85J57j28P8J37l35J56J63k1O1
5900A23j53M28l73q9L8n2M2O0j6J2k33K05n5j02J5j26L93k78j19K69M7k05L6J06
5924b7O5l12J79O2q5J93k32P3P7j61P3L9o0n7J36j27K16j01O6n6J68k24l6O3m0
5949a08K96j35j69L97j74NK2o9J51j78j23M8K84j42r4m0Q0J25l18K37p9j30K20
5972A06j34j41K94mo8R7k08p5NL56l57N6o0L4K17j76L07k13j9J11k12J15j3j22
5996a04J9L52k14j31J38r6l2r9J36p5J13J15Lk35J58J49k76o0K07k32J1K30O3
$$ plain form
5832 -167 38 -51 -241 -275 110 -8 -35 -202 -175 -6 -119 319 26 294 -72 -323 -29 -278 137 286 302 -113
5854 -113 -106 108 -10 96 -184 -135 46 -10 322 38 135 -238 75 34 -137 -75 267 -12 -187 -111 137 237 -208
5877 -208 -161 35 -5 21 246 -68 99 -43 -66 78 140 48 240 -145 12 -116 -38 99 -236 -80 83 62 123
5900 123 -30 398 25 -64 -26 -78 -36 24 8 20 -213 -8 -63 -165 -150 -276 117 -161 -280 -11 36 -169 -133 -27
5924 -27 38 -274 -95 -33 -118 75 -157 -84 -7 -168 -95 -56 -116 -173 -37 -164 52 -49 17 -39 129 -95 -131 -68 -108
5949 -108 188 53 -116 281 107 112 134 65 216 38 -85 -37 247 105 11 -29 51 176 -142 95 16 -114 106
5972 106 -28 -169 125 121 53 150 -58 -133 -128 228 -129 -73 -133 -99 118 -58 249 36 17 128 -84 31 18 -104
5996 -104 -85 267 53 -78 60 -36 -68 -167 -31 -106 7 122 125 -110 48 197 -79 -139 68 -164 -153 77 140
6019A40p4n9J72j92K35j01q7o4K36l78K76p7k42K63O9l76J88K84J83n81J89j42
6041a38O6J65J02k66M0J68k01Q4J33p4j22J86k36J41m%LL73j77k08j32J77j8j60
6065i8Q0N1j93L49k79J09K28l04j73K81l9q2l2k31L77nM7n3J82m68J60J24k92
6088b61L07q7j33J1r2j9M15k50l2n5P7k68O4M80m42L22j18Q1N96o54J61p2j07
6111g6j40L2K22k44N1L79k08j20K16j23j69L35JQ3k97O4l03L24J04M7k31K50p9
6134A18j64K87k16j92L80l83J12OK31l85K42L6Rj5J06k11j75M09j36j10K84k42
6156iL1O3m86K29L13k7k63j69M27m3o8R6j35m5J8k4K1M19n75J00N7J40j34mJ01
6181C3n5q3J98r9l17M73Q6n50J63L64m33L58k27J39k06L89k36n3J05R0j69K37
$$ plain form
6019 140 66 7 179 -13 222 121 34 -30 206 -172 104 27 -215 48 117 -259 -71 213 396 -185 4 -138
6041 -138 -72 93 195 -71 -31 137 -64 20 153 79 -43 143 -93 48 44 44 47 420 243 35 -97 80 62 -98
6065 -98 -18 33 -160 189 -90 19 247 -57 -230 51 12 -70 -102 -333 44 39 86 33 215 -253 -93 31 -261
6088 -261 46 -41 -174 -163 -255 -274 141 -109 -141 -196 -119 -387 -323 157 -285 37 -81 0 596 -58 103 31 -76
6111 -76 -216 -184 38 -206 -155 224 16 -104 112 -11 -180 155 156 239 -58 6 -297 27 131 178 -53 197 118
6134 118 -46 241 25 -167 213 -170 -58 -52 179 -206 36 72 81 66 172 -39 -214 195 59 -51 233 -9
6156 -9 22 85 -401 -172 141 114 -149 -318 109 66 -2 94 -41 -86 -68 -92 -71 348 -227 -127 -70 70 -64 -68 33
6181 33 -22 -105 93 -6 -323 150 236 -314 -151 213 -220 138 -89 50 -156 233 -3 -56 49 139 -30 207
6203B07p4l52J54J88j04k90L92o6n6o4jPK2P8k8j75K31p3J28j57N1n4N7M96o98
6228a81K60r8k01N18k19k65L13j65O0R0p6K14k79J52O1j85J03Q0k21m1J07J25
6250A52k11K23k1m11M85k2k67lL99l97l7K90l27J88n2lk50K73j40L3L1J16k9m92
6274d72O73k04l7Rj72J99k26K61K3k22L23n68L40L6m6p6K47j00q4K15J74l06p0
6297h3rk43L84j40j79J55J09K53k06K59k86r0L33r9Nk00N4k68K42R3k23K71j38
6320fj67L01j67pJ39j59J45k74J57J00j24j51J83J88l44L56l05k4K92N4n36K23
6342a26K95j79j5K37k80l37L49k00J08J48k97R0j39L94Ml93L54k75K54k14N0R9
6364g3PJ22j56L39n52J89L54l66K83l62K70o9J90n2k81K12J08J54k53j51J86j19
$$ plain form
6203 207 133 -219 -65 123 19 -271 121 55 -1 -65 -66 -59 -37 41 13 -162 69 -4 124 -33 18 -36 21 517 -181
6228 -181 79 -19 -220 298 79 -186 127 -38 22 112 36 250 -29 123 184 -1 102 182 -39 -80 27 152
6250 152 -59 164 143 -268 217 195 -72 -75 324 -73 -110 180 -147 41 -11 -14 -264 9 -131 -98 -67 49 20 -472
6274 -472 201 -3 -40 -31 -203 -4 -230 31 54 -168 155 -413 -73 -37 -83 -159 88 -12 -96 119 293 -13 -83
6297 -83 -92 -335 49 -91 -270 -115 -6 247 41 300 14 -76 257 158 163 -37 17 -251 -9 84 -139 132 -6
6320 -6 -173 128 -39 -46 93 -66 79 -195 -38 62 -62 -213 -30 158 -186 170 -135 -159 133 187 -349 -126
6342 -126 169 -10 -25 212 -68 -405 -56 -256 -148 0 -297 -207 -346 48 52 -341 13 -262 -8 -222 -172 -73
6364 -73 -66 56 -100 239 -313 -124 230 -136 147 -215 55 -14 176 124 -157 55 163 317 64 -87 99 -20
6386b0j2j16J77J55j45j98K8O1Q6k9M7j44q4L0J2j9J49O9j87Q6K28P4j93J79k84
6411e0Q9J7J73j06j41J2J7K79k14o3J26J08k42j58N08l39J53j79p5K70j39p3k52
6434b79J39J28k35K31o7j41J96K81l48K23k19J73m3M0j06p6o3n5K08k37J76q2
6456a56J17M5J07l96M05k35jj03J60K60l6k63K41l92K64j97j7L81l58K82j76L1
6478c7J20J8N0l49K54l6k67K11M8k39K92L9k10J30n0R5R1k01L23k97K96l6k36
6501IR8Q5l17J84O6l44K63O8J67j86j96J87j98q8L70o9J15j21k33J64m1J25p7
6524C1M0Q4l09p5J74j13K87k25k39K29J13J76k24Q1M3k69K77r3q1O5J31l08l6
6547b41K50j7J8j93J63Q6k8J99k30l5j94J44m1J13l9j88J96j56K36M1j57LJ44
$$ plain form
6386 -20 -32 -148 29 184 39 -159 -131 -70 16 -13 34 -110 -194 -164 -152 -171 -22 47 -140 -54 174 248 55 234 -50
6411 -50 39 56 229 123 -18 -6 11 290 76 13 139 247 5 -153 355 16 169 -10 -85 185 46 -27 -279
6434 -279 -140 -12 -247 -16 -83 -224 -28 253 -95 128 -91 82 39 79 -27 -103 -166 -221 -13 -250 -74 -156
6456 -156 -39 6 113 -283 122 -113 -114 -217 -57 203 167 -96 145 -247 17 -180 -197 184 -174 108 -68 -37
6478 -37 83 101 151 -198 56 20 -247 -36 12 -227 65 104 -106 24 -26 69 160 -41 282 -15 281 245 9
6501 9 107 192 -125 59 125 -219 44 112 279 93 -103 84 -114 -202 168 99 214 93 -140 24 -17 108 31
6524 31 71 155 -154 -229 -55 -168 119 -106 -345 -116 -3 173 -51 30 73 -196 81 -12 -93 -28 103 -205 -241
6547 -241 9 -8 10 -183 -20 66 38 237 7 -28 -222 -78 -119 -6 -45 -233 -37 -193 43 84 -73 -70 74
6570G4j37K02k5k67N1J12J07l97K31j02J89J82k43n6R7q3k10M32Nl21K91k49M1
6593g6J01J61K4k45J63P7k96L6P3L8n6j14K03k04J23k21J41R9j59J13LM1j77Q9
6617f3K04j75O1j00K44k03K2m2m0K9M3k6k8j72L99l57M99k03j08L92m91J92k65
6640a88J95k0Jj00K53k18J58J18l93K71M9k95J25K30j55j5K03J58n37J55L3k10
6662a82Q7p1PJ11pK23j88J7P2K55l71J00j3PJ3k3j43K74k03J98k0J0j16j36J8
6687h1J99K2n45M35m5j17J92p8L1K42m81K51p7MK7Q2k29J8L43j71j21N2j1m6K51
6712A47k3m76M04R8k41p4J39L6o5PJ54j24K3R6j86K5k4K11j31J20j25k36K34j8
6736b9r5k4J77j53N1M12l11J45j58j59J6L19q0j75PJ4j82K68r2J43l4k66K03k63
$$ plain form
6570 74 -63 139 114 -153 -102 10 117 -280 -49 -151 38 220 -23 -79 18 -65 -275 157 162 -159 132 -117 -76
6593 -76 25 186 210 -35 128 205 -91 -55 18 56 0 -114 89 -115 8 -213 -72 27 -132 -19 -16 25 -152 -63
6617 -63 141 -34 27 -73 171 -32 -10 -52 -92 -63 -20 -46 -74 -246 153 -204 295 92 -16 376 -115 77 -188
6640 -188 7 -13 -12 -112 141 -77 81 199 -194 77 126 -169 -44 186 31 16 219 377 -160 -5 28 -182
6662 -182 -95 -166 -159 -48 -55 168 -20 -3 69 324 -47 53 40 47 60 37 -106 168 -35 163 143 153 37 -99 -81
6687 -81 118 140 -405 30 -15 -132 60 -18 13 255 -226 25 -52 -48 -21 61 -168 -150 193 22 -99 -47 -58 -104 147
6712 147 124 -352 52 150 -91 -165 -26 10 -55 -48 106 -18 5 101 -85 -60 -84 127 -4 116 -9 -245 -11 -29
6736 -29 -124 -148 29 -124 -73 339 28 173 15 -144 -128 191 111 -64 -57 -43 -225 43 -49 94 60 -206 -3 -266
6760b66L22J47n43N33J42l46K17Nj13kp3n9j27L94k09r0J47J40k85k6J44l1Q0
6783A01j42J8J96j43N8Q7K7k65N3Q3j09m1j5P0o0k7K51j57k77K90J3K5Q6j46L
6808b1Kp2j43P9K65r4r5OK27j51j71o6Q5M03j94j53j03J01K8J63l3p0J5Q1oJ67
6834B50k10pj66J47J59j27l2j78NK00j07K28k36J75k04o0L27k69P4O7J0k74J92
6857c6j73J66J01n5Q2k05K61j55N7j00P7n2J20Q8k77M15k21k36P4MQ7j97J21q8
6881a42J17J99l30j05J40J16m8K30k37j96K90%n2Q1o6K0j20K51r6k71L64k37k13
6904c05N90l71K41j92k5J26k84K97M5l13K26q0j76J86J77J11l79O6r7J19O1O2
6926H5k81L71j26k43J6J77j11j72L16J91k91mj29j17N01O9k01K12m30j33J56K25
$$ plain form
6760 -266 56 203 -340 193 335 -11 206 211 98 96 23 -36 -163 231 22 -68 79 219 -66 -92 52 21 101
6783 101 -41 -23 173 30 88 175 202 -63 -10 73 -36 -77 -92 -22 -82 -109 142 -15 -292 -2 11 36 122 -24 -21
6808 -21 -19 -91 -234 -155 110 16 -79 -73 154 3 -168 -234 -149 254 60 -93 -196 -95 -67 96 63 -7 8 89 83 250
6834 250 40 33 -133 14 173 46 14 -164 -159 41 -66 162 -74 101 -103 -163 164 -105 -31 36 46 -228 -36
6857 -36 -209 -43 58 3 85 -120 141 -14 43 -57 20 -32 88 176 -101 314 93 -143 -69 -65 22 -175 -54 -142
6881 -142 -25 174 -156 -261 -121 -5 -53 177 -60 -256 34 34 -18 63 -3 17 -103 148 52 -219 145 -92 -305
6904 -305 285 -86 155 -37 -62 64 -220 77 122 -191 35 -45 -221 -35 142 253 -126 -60 -157 -38 23 85
6926 85 -196 175 49 -194 -178 -1 -112 -284 32 223 -68 -72 -201 -318 183 252 51 263 -167 -300 -144 81
6948H1Mj41k1K4K86j70j50k3J29k54L40Ln8j04M04k01m09J23K59R1m03J09r4K67
6972I2q3K01k99K63j49J84j89p4O2k55L54k96J8k0K41q4K57k32R5L6q8j29K37
6995A42j5l95J34K39Pm0J6l9Kk12L08k46J62lP9k33ko2L52j90r5%m7K76l25O8
7021a19K00j3J87m16L82k47R7j43K24j08N3l20N9J59O5j0k17L24j4l8m31J61L09
7044A44j70p6K66j33R0n1k26j0J02K70l16N0J95J11p6k13Q9O4q2o4j94p7L99j55
7068f3p2K9j63J28P7K49j89k29J83P1l79L23P9m9o4N3J12k27k4L17j50j71K23
7091F4L1K8j52K17j61J20j33l9j58J25K00j76K46j43k19K30j59j2L28ok18J25
7113A38K29j77k97K04l51R1p1k3L96k23Q9J29J04%l05J82k4n0pJ13j63K3K0j0
$$ plain form
6948 81 85 -56 -77 -53 233 63 -87 -110 19 -235 105 108 50 -54 350 149 -260 -137 122 213 -190 -81 -175 92
6972 92 9 210 -89 174 25 209 20 -54 8 -247 107 -189 -171 -191 50 -34 223 -9 86 122 34 -95 142
6995 142 127 -268 -134 105 112 72 88 49 51 -161 147 -99 63 60 139 -94 -96 -158 194 4 -91 -91 -138 138 -187 -119
7021 -119 81 68 255 -161 221 -26 71 -72 152 44 97 -223 -164 -5 60 50 -167 157 143 105 -326 -165 144
7044 144 -26 -102 164 31 121 70 -156 -166 -64 206 -110 -60 135 246 170 -43 46 110 28 -36 -230 -307 92 -63
7068 -63 -135 -106 -269 -141 -64 185 -4 -233 -50 21 -358 -35 44 -5 -69 -16 96 -131 -155 162 12 -159 64
7091 64 95 123 -29 188 27 147 14 -25 -183 -58 142 -34 212 69 -150 80 -79 -91 237 231 13 138
7113 138 367 190 -107 97 -254 -163 -234 -257 139 -84 5 134 238 238 -67 115 91 41 34 147 -16 7 27 17
7137A7jJ85k81J75q8N9Q2j08P7l0p5m4o4Q7l30J47J78l88J78J92j34J98OK1N9
7162A18l23L00k91L15k59J81j2j85j74K66J96k1k06R4O8l3K88l53l8O7j41o4K01
7185fr8r2J53M9j94p7K49P9j84J54k04N2J37k3J52k03J1P0P5p8J80k12K6R0j93
7210h7J50m6K85n00K60j70J1L17k26q6K07K05k23k28K54j08J05k12P5j68J43p3
7232a15L1L94k99K04k05L81k79r6O8j80q7K85p9k37L34j5l75L04N9k02J13N7N7
7255A18j24L7j39l9P3J47k75K21j99L61o4l7k79L3Q5k43M37k10J16k6R5j07j6
7278c5o1NO1K2Q4j35R4j38l5J03J49K1k93J60K38l74K95M9k21j63rJL42Q7j33
7303A14K41l80j15K64r4R7o5j65M58r5j13mj90k39K61J74p8j1p9rJ01o4J25m8
$$ plain form
7137 17 16 201 -80 95 7 66 148 40 117 87 12 -32 -96 -9 -339 -192 -14 -402 -224 -32 -166 32 38 59 118
7162 118 -205 95 -196 119 -140 41 29 -156 -330 -64 132 111 -95 -1 67 34 322 -31 -69 -2 -143 -207 -6
7185 -6 -104 -196 -43 6 -188 -265 -16 63 -121 33 -171 -119 18 -5 147 -56 -45 25 100 22 202 -10 16 106 -87
7210 -87 63 17 302 -198 62 -108 -97 220 -6 -92 115 320 97 -131 123 15 120 -92 -17 -185 -42 -115
7232 -115 -84 310 11 215 10 391 112 16 84 -96 -183 102 23 -214 120 105 -270 34 93 -109 4 61 118
7255 118 -6 31 -108 -147 -74 73 -202 19 -180 181 117 80 -199 -166 -81 -324 113 -97 19 -7 88 -19 -35
7278 -35 -96 -91 -30 -8 76 -59 35 -103 -138 -35 114 135 -158 2 240 -134 161 210 -11 -174 -183 -182 160 247 114
7303 114 355 -25 -140 124 30 127 62 -103 355 260 147 143 -47 -286 -25 149 71 60 -19 -28 73 9 134 86
7327H6J4j67k00N4K28J56r3j57J04j18J90l16K85Rn18L31K42k15J65J11m4r1P
7350F3L0k76L01k10k5N7M42n22K7J4j42L88j31k75K74J09l76K02K6j74QrL67l57
7374a89J31J53J0l1P5l7k64L24k38J78k4J0j59p7jJ08n7J4j25j46M39j00j94N75
7398C75k99p4n2J40l1k38K87J62p4k80J64j60L81M0l91J41k08PO6K05l05k3J14
7421e3P4Q7J36m13n9K10r1K38Qj09n4K05k51j98K42qM1j2k87L74j62K5k68L1Q8
7446b06L65n6%j13J13l27O8L9K5J72k18J76j49K44l7j64j73K20J04k76M44k24
7468B7J07j23j31J03P2j48Q5K73k53L4K58j19l98K93Q6q6j71J18l4j45K59j48
7490d1P8r0j6l3J28M7j88J17N5l9n7K68j82r1P2qN6J47l57o6L45k08J73j55J12
$$ plain form
7327 86 100 -67 -267 -213 15 171 78 -79 25 -93 97 -219 66 75 -443 -112 130 -85 80 191 147 56 63
7350 63 93 -183 118 -92 -117 -60 382 -140 -113 -99 -241 147 16 -259 15 124 -252 -50 -24 -198 -190 -199 168 -189
7374 -189 -58 95 105 74 149 112 -152 172 -66 112 88 98 -61 -138 -139 -31 -88 -74 -199 -345 94 -6 -200 375
7398 375 76 2 -50 90 59 -179 108 270 196 -84 80 -80 301 341 -50 91 -117 -110 -44 161 -144 -167 -53
7421 -53 21 108 244 -169 -228 -18 -109 129 137 28 -26 179 -72 -270 -28 -36 5 -7 -294 80 -82 -57 -325 -294 -206
7446 -206 159 103 103 -10 103 -224 -156 -117 -92 80 -138 38 -111 133 96 -68 -241 -21 83 -193 251 27
7468 27 134 11 -120 -17 55 -93 -8 265 12 46 304 185 -213 80 166 80 -91 27 -7 -152 107 -41
7490 -41 37 -53 -69 -102 26 73 -115 2 57 18 -39 229 47 -44 28 20 76 223 -134 -200 145 -63 110 -45 67
7515F7l6l67K44L88n25L61n2r8j05L4q9J47m0jp2O9n2P5K15j27Kj70R0J39j51
7540e4j42M59k95Q1j63M05k02j23%j89o4M78j79q1P5p2j49J70m1L22p0ol02pL32
7565A83O8k7j61K82K2k77l8l01L10J04J02k25J82l17N6J84j65J70J29j79j4J3
7587A01K65m49R3M5j09o7K08p1J5o0k38K97k42J62KM8j0K30j04k55K47l5m7J96
7611B22k85L4J54pj96K77q9M3o8j53j04J9J87%j7jp8L5n0N2J01k63L07J27j76
7636G1l01L22j40k24K29K53k96k3j20L49j48J14L6k99J83O5J2J29l26L34l77K15
7658E8j60J95J5k6J46k37K83k30j37K54l1k13J44j31K42k78J02o0L2J98l60M02
7680B08m1k59K24O2Nm26L39l6L6p7J89j42j13n7J58r0J26J5j87j3J75m48K23K48
$$ plain form
7515 67 31 -336 -92 296 -229 132 80 -18 -123 -89 -178 -31 -71 -72 -144 -75 -127 -52 163 36 38 -132 -42 97 -54
7540 -54 -196 263 -32 49 -114 291 89 -34 -34 -223 -287 191 12 -69 6 -66 -215 -45 -86 236 166 160 -142 -149 183
7565 183 251 224 63 345 367 90 52 -249 61 165 267 42 224 -93 -37 147 -18 152 281 102 88 101
7587 101 366 -83 10 55 -54 -121 87 16 31 -29 -267 30 -212 -50 -48 0 -10 220 116 -139 108 73 26 222
7611 222 -63 -29 125 118 -78 199 110 153 85 -68 -172 -153 34 34 17 16 -62 -27 -77 -25 76 -187 120 247 71
7636 71 -230 92 -48 -272 -43 210 -86 -109 -229 120 -28 86 122 -177 6 71 83 212 -114 220 -157 58
7658 58 -102 93 108 82 228 -9 274 44 -93 161 130 -83 61 -70 172 -106 -4 -64 -32 166 -194 208
7680 208 167 -92 132 194 199 -227 112 76 112 35 224 82 -31 -88 70 -20 106 121 -66 -79 96 -352 -129 119
7704A19r2K1O7j7j11R0P2n7k45J02n7Q5P7k0k04Q0j38K91r3l12L46j98K79J1n4
7729D2J39l06J28J5k36K01j76qL86k35p0J80r6K05k41k5J33l6O9l26q3M24P6k70
7753a10mK61k41J03L8O8j07j15l1K36k35K88l39O5K63k36L33q3l57o6N68l42J3
7776c0Q1k48J02p0J10J52J2j16O5j7lJ7m5m8J40j56J70j64J85k06l1o2K59r2k05
7801b00J49j42L65k92l12R5L42n0P2m8p2Q8j49R8o0K49j40J11j11k4l3K95m57
7824b26Q7j28L61j93j61M14m27K54j43N8K95q8j00j12J49k8R2j26L28n12K92l25
7846b39J34J07J03j26Q5Q7k80J4K91q8j94J53j26K08J4k07M1j26R9L86l63K7q9
7869h9n5K70j34K17m08K16o0m1J8l13O56k55J28j72l7J26k21L49j94R6n4m8k2
$$ plain form
7704 119 27 48 115 98 -13 77 149 92 -153 -51 -108 -23 54 34 -170 -90 -228 63 -30 -342 4 -194 85 96 42
7729 42 181 -125 3 18 -218 -17 -193 -201 185 -50 -120 60 -36 169 -72 -97 36 0 69 -257 -340 84 160 -110
7753 -110 -114 147 -94 9 47 115 8 -107 -138 98 -137 151 -188 -123 140 -96 237 154 -203 -269 299 -43 -30
7776 -30 51 -197 -95 -165 -55 97 109 -7 58 41 38 55 10 -38 102 -54 116 -48 137 -69 -100 -162 97 5 -200
7801 -200 -51 -193 172 -120 -432 -337 5 -45 27 -21 -93 -5 -154 -56 -116 133 -7 104 -7 -31 -64 231 -226
7824 -226 -139 -267 94 -99 -260 154 -273 -19 -162 -104 191 103 3 -109 40 12 104 -22 306 -206 86 -239
7846 -239 -105 2 105 -21 64 151 -129 -115 176 88 -106 47 -79 129 143 -64 -23 -149 -50 336 -27 0 -89
7869 -89 -144 126 -8 209 -199 17 -43 -84 -66 -379 277 22 150 -22 -59 67 -154 195 1 97 43 -5 -27
7892b7R1Lj88N8k04p1L32l2L73l95k62R1L4M32k93j07K7J40P2j89k7J87p0L4J17
7917A26m3N7l58M7J17J31l8P9j7r2l33N87n32M20k32J55k23J41K93n5k47P1J64
7940B18k00J84j11J1j31j89L01k6j01rJ79oJ11k26rJ14j31P5J68j56n9k65M99
7963B41l61k8K77O0j12N5j67K8l9J40k42J73J63r3M9k28J14L4o8k58K75J16l24
7986a95K87J4m8k02L1J61l71Q1J36J85k10j41K87j34L28j14k38J77j54P1m4k5
8008a18q4K16j15J28K3r4m5M9Kp4K55k94L83l29l08M72p2N3k48N09Q9l37j86J74
8032D9L2k29J81K78m01K03o6P3r2Pj88J7QK33k45N0j02K41q0r0J53k18K05j10
8056i1J93qr9n4J92J62m66J82k8L35j62l36J00K65j41j76J03J62k77K13M1k9j64
$$ plain form
7892 -27 64 67 -121 -63 -267 -338 -6 -38 335 -60 -322 -231 -197 235 -58 -165 -138 2 74 -115 -142 45 -25 9 126
7917 126 83 140 -218 -171 -54 77 39 118 101 9 -324 263 -269 151 -81 74 -149 -8 285 230 -17 54 218
7940 218 18 202 91 102 -29 -218 83 57 -44 -53 126 120 231 5 -4 110 -21 54 222 66 7 -258 241
7963 241 -120 -148 129 189 77 132 -35 -7 -46 94 -148 25 188 95 144 -84 30 64 -4 -262 13 129 -195
7986 -195 92 106 58 -144 -113 48 -323 -242 -106 79 -131 -272 15 -119 209 95 -143 34 -120 -49 -93 -118
8008 -118 -202 14 -101 27 50 -44 -89 -40 -38 -112 143 -151 232 -97 -405 67 -5 48 -200 309 398 61 -125 49
8032 49 81 -148 33 311 -90 113 47 120 28 35 -153 -136 -128 105 -140 -90 -192 49 -31 -121 32 -186 19 -91
8056 -91 102 94 -5 -59 133 295 -171 11 -17 318 156 -180 -80 185 44 -132 -29 133 -144 69 110 81 -83
8079h3K67l58j65M10j3j39J79k3J4j1j75J43o3K30j91j13N8m2J06j52k04M59K4
8102A58k56J88j85J09l4jk83J88j35J47N1Np2J34p7K78J16m55K86k88L27o8P3
8125B06Q6l27R5J23k41RJ85P0p7j03PK31j74j36j09K87l3k46J31j74N22j36l4
8148A62j67P8k76K56j30j74J37J27J20Nj68J84k30m9J64j57J54J74l12J27j83
8169a58J08j99j9L99k45J96k36j42K86L9P9j92j35L8L16j35o7J66j85N6K16j88
$$ plain form
8079 -83 184 -174 -339 71 58 -81 98 75 89 78 -97 46 -17 213 22 -91 -33 -75 31 -121 -325 134 158
8102 158 -98 90 -95 14 -20 -21 -304 -116 -251 -104 -53 -48 -120 14 -63 215 331 -124 162 -126 201 133 206
8125 206 292 -35 60 183 -58 -49 136 206 129 26 33 264 90 -46 -155 132 99 -147 -16 -190 332 196 162
8148 162 -5 73 -203 53 -77 -251 -114 13 133 138 -30 154 -76 -125 39 -118 36 210 -102 25 -158
8169 -158 -50 -249 -268 131 -114 82 -154 -296 -10 29 108 -84 -219 -181 135 0 -67 99 -86 -30 186 -2
8191b
$$ Imaginary data points
##PAGE= N=2
##DATA TABLE= (X++(I..I)), XYDATA
0@%%%%%%%%%%Qj6J6j6J9k7L2m0M8n6P2q8J04j20J39j63J90k20K54k89L28l75M27
33B27m82N41o08O83p64Q53r52J059j175J305j446J596j759J941k142K359k598
50a362K862l152L477l840M244m702N226n829O532p366Q371r614J1196j3282J6160
65H921k0391K7232m0042P1711k83638m15748P58563J19420m02414J44549J91098
76A59261j94586O9430k0687k66890K54689L94393l68543l15621K95792J08262
86A15500j92103K1896K4778K5921J71799j21327k94551J95069K41374k13500o6914
97i2058J93326q5069q2464J17324j13125p2210K87126m289l15322R1330J99363
108A23932j62071k3033J65233j13364o5012J74112r5913j60666K12223P7236k29099
$$ plain form
0 0 0 0 0 0 0 0 0 0 0 0 8 -8 8 -8 11 -16 16 -24 24 -32 40 -48 56 -64 75 -88 102 -118 136 -153 175 -200 227
33 227 -255 286 -322 361 -403 450 -502 557 -618 687 -759 837 -922 1019 -1123 1236 -1362
50 -1362 1500 -1652 1825 -2015 2229 -2473 2753 -3076 3456 -3910 4461 -5153 6043 -7239 8921
65 8921 -11470 15762 -24280 47431 -236207 -651955 106608 226028 -176386 -31837 159261
76 159261 -35325 34105 13418 -253472 1217 395610 27067 -288554 7238 115500
86 115500 -76603 -54707 -29929 -4008 167791 46464 -248087 -53018 188356 -25144 -92058
97 -92058 101268 16199 -66265 51059 -62066 -134276 152850 148561 -166761 -75431 123932
108 123932 -38139 -61172 104061 -9303 -74315 99797 3884 -156782 55441 132677 -96422
119i6422M4587J64276j32371m9306J55388o8295j15181J43395M7108j50091P610
130d9302Q6496l8123r250M0201l3057j0680M0989k5610l3271L6156K7070n208
142B6411k6027n1649L2194R4442n1352j04066P3442P8792q6387m1775P5234Q972
154B8231m0501J4965n434k0579N1647J2290q5102o073R0853j377q1341P538O3882
167B8999j7069m1669K8748K3102k7628l36J4358k9755j490N3017j4084o0685K6242
180a8250M6830k9699j2360K3856j7188m011L2867k4876l1804M8597J6947o0336
192b9427j81N2654p166k5396K786j910J2813J6416k6435j1324L1516m951k4418
205a5023J7685P136j6884J5966n98l2629K6506L1047m3967o597M3041k3920k2771
$$ plain form
119 -96422 -51835 112441 -19930 -69236 86152 17857 -97324 46071 93179 -56912 -49302
130 -49302 37194 -929 -10179 30022 -3035 -13715 27274 1664 -31607 4549 31619 26411
142 26411 384 -51265 -19071 75371 24019 -80047 -6605 72187 -14200 -55975 19259 28231
154 28231 -12270 2695 -2739 -23318 28329 40619 -44483 -50556 40297 38920 -42421 -34883 28999
167 28999 11930 -29739 -991 22111 -5517 -5853 8505 -21250 -22740 30277 16193 -44492 -18250
180 -18250 28580 -1119 -13479 10377 -6811 -10822 22045 -2831 -34635 13962 30909 -29427
192 -29427 -29608 23046 15880 -9516 -6730 -8640 4173 20589 -5846 -17170 14346 9395 -15023
205 -15023 2662 9798 -7086 8880 8282 -24347 2159 33206 -10761 -17358 25683 1763 -21008
218b1008M8631q283n4752L7017L6630n6040o992N3748k0083k9587L0771p65k0124
231a0837K7828j243l9789J9501L1620l0389j4936K4937l406p042R983j1562m60
244e795K3679j4601k2480K3303Q817k2101N841P427j8152J2659J8265k9122n541
257a7801L4816j1550k5279K2514O942k1396J0843Q618k2727Q367K4694k4204j6193
270b2356K9828K939k3234P567J0689q090J918K590q501N952R287j3587o244J5482
284D240rj0498L557L838j23K483m558k582J1133j355j3706N295J2095j0137p762
299h089J1923Q87p371N459J484n168N424J982q601J300Q490n230p995P701L621
314E817o726k12N134j615j528J489n1j127J2J382j737j408J371Q15j431j406P74
$$ plain form
218 -21008 27623 19340 -35412 1605 38235 -17805 -24797 28951 8868 -20719 10052 9287 -10837
231 -10837 16991 15748 -24041 -4540 27080 -3309 -18245 6692 3286 -3756 6227 -5335 -5795
244 -5795 17884 3283 -19197 4106 12923 -9178 -3337 4090 -14062 -1403 16862 -12260 -17801
257 -17801 17015 5465 -19814 2700 9642 -11754 -911 7707 -15020 -6653 18041 -6163 -22356
270 -22356 7472 10411 -12823 -5256 5433 -2657 -739 1851 -6650 -698 8589 -4998 -11242 4240
284 4240 4231 -6267 -2710 1128 1005 3488 -1070 -3652 7481 6126 -7580 -2285 9810 -327 -8089
299 -8089 3834 4721 -2650 2809 4293 -875 4549 6531 -2070 -770 7720 2490 -5505 2196 5817
314 5817 -909 -1121 4013 2398 870 2359 2308 1181 1193 2575 838 -570 801 1616 185 -1221 -447
331d47K162j035k108J852O94p93J7j068l47J098p2k643j059L829l23m093J558
348b778L910j550k577J762K366j948k000J248k59q83J043j255N2K108J87j519
364b093O02K107l87k318Q96R97j082j72n24Q86Q95q60P8J684l08o17Q76R87k146
383d99M0K782j269k533K477Q55k296J474P96j668J031K071k269j519M828l73o048
400b120K770M747m694j779L842j639j770L940j573m149O199K578r499K082Q005
415F940o376m005O212k989k724P305l410p925R589N259j3865J397J2783q297o347
430f453R834m917n109J3091m555j5543J4316J0847j9276j157J7701r580p466J3784
444E517p769q428K0031n075k3564J7881J7385k4427l323K1227j1622p088J9381
$$ plain form
331 -447 1715 680 -1428 424 1118 325 342 -726 -1073 25 -47 -2690 -3749 80 -243 -4336 -2778
348 -2778 1132 -418 -2995 -1233 1133 -815 -2815 -1567 -1826 -2709 -1666 -2921 -2869 -761 -574 -2093
364 -2093 -1491 616 229 -2089 -1193 -196 -1278 -1450 -1974 -1088 -193 -1053 -975 709 401 -216 660 1647 -499
383 -499 -459 2323 1054 -1479 998 1853 -443 1031 1827 159 1190 3261 992 -527 4301 3928 -2120
400 -2120 650 5397 703 -1076 2766 1127 -643 3297 1724 -2425 3774 6352 -3147 -1065 6940
415 6940 564 -3441 2771 -218 -2942 4363 953 -6972 2617 7876 -5989 -4592 8191 -106 -6453
430 -6453 3381 -1536 -6645 6446 1891 -13652 664 11511 -7765 -8922 8779 -801 -8267 5517
444 5517 -2252 -10680 9351 4276 -19288 -1407 15978 -8449 -11772 9455 -2167 -9255 10126
457A0126j0970j4895K5614J48k8602J5830J9477k3833k566K0040j5440l764K6045
470A7210j5616k1611K9409N264k9039J4212J4745k5765P201K2316k6877o502L7014
483B1961j3254l1461K7338J2305k5405J1498Q326k7476J4142K8397l2429j4959
495b1017L7364m219k7624J8677N940j8293J9550J820l6098J9427L7341l4572k4414
508b6118L3592M437j9059J2088l860j7682K7398P593m0127Q406L9064j9690k6124
521b0082J7273O222k305J0695j8209j9207L4311J6836m0418m938L2766o748j5447
534i251Q788m111n39K0976j3997l0250K4782L1089k6915k2101J8553R063k168
547C919Q61j3302l512K3638o30k7715O638K5603q370j6900K229M414R699R758
$$ plain form
457 10126 -844 -15739 9875 10023 -18579 -2749 16728 -7105 -9671 10369 -5071 -8835 17210
470 17210 1594 -20017 9392 14656 -14383 -171 14574 -11191 -3990 18326 -8551 -15053 21961
483 21961 8707 -22754 4584 16889 -8516 2982 11308 -16168 -2026 26371 -6058 -21017
495 -21017 16347 12128 -15496 3181 9121 -9172 10378 12198 -23900 -4473 32868 -1704 -26118
508 -26118 7474 11911 -7148 4940 1080 -16602 10796 18389 -21738 -13332 25732 6042 -20082
521 -20082 -2809 3413 1108 11803 -6406 -25613 8698 25534 -14884 -19822 12944 6196 -9251
534 -9251 -463 -4574 -5113 15863 1866 -28384 -3602 27487 572 -21529 -2976 6087 3919
547 3919 4780 -8522 -12034 11604 10974 -16741 -10103 15500 7130 -9770 -7541 -3127 6572 16330
561A6330k1640j8517K8970J9283k8126j3212K1831N226j2189m50o07K892J5754
574A5545j0169k7066J6180L1449j6282k6186R942J4127p82j055j0840n457K2523
587A1929J889l0393O536L1627j2638k3124J0151O672n40J1460j2390k4079K3832
600I32K3630l0803j1016K8538l973j7882J1026K65n658J7908p978k9961K0708
613d264K8833k6693j3053J9366p271k625K0502j7931j7265L3573Q76l9316J8086
626g182L1252k7754j1349K1823j3847j598L0897k0772l0910L4035J5440l2544
638a2509O212J7808k0311M866J7829k6473k50L9468k1453l5930L3109J7351k6310
651f593P753M859k5609K1202K8599m1502j5016M8252o079l8648K0016J7308j6551
$$ plain form
561 16330 -5310 -23827 5143 24426 -3700 -16912 4919 10145 -2044 -2494 -3101 -209 15545
574 15545 5376 -21690 -5510 25939 9657 -16529 -6587 7540 6758 5703 -5137 -10594 11929
587 11929 13818 -16575 -10039 21588 8950 -14174 -4023 2649 2109 13569 1179 -22900 932
600 932 24562 -6241 -17257 11281 7308 -10574 452 717 -4941 12967 4989 -24972 -4264
613 -4264 24569 -2124 -15177 4189 -3082 -5707 14795 -3136 -20401 13172 14048 -25268 -7182
626 -7182 24070 -3684 -15033 6790 -7057 -8655 22242 1470 -29440 4595 20035 -12509
638 -12509 -6297 11511 -8800 -3934 13895 -12578 -12828 26640 5187 -30743 2366 19717 -6593
651 -6593 1160 6019 -19590 1612 30211 -11291 -26307 21945 15866 -22782 -2766 14542 -2009
664b009P637j960k6827K6283L2026m1516k2738M1424M109k5323J1439r48j2885
677a1288K5592r41m0050K0935M1228l5231k8741L2938R116j4972Q592j0817j7028
690b0667L3002J0901m2330L327L7019j5374k1146J5672K476m202J3626j5833k0971
703b4500L2218J7166l7009o340K7897n099j0933J0827o585p207J8964l918k3529
716a8048J5393K0516k0576j1487J5013Q05k110P182j0969r090J8489N581j8451
729g752J111J3602o805m878O532m362K49J1001q333j4029J3979J3641j4436q488
743h968J0269J235k519M083n054m771J0763J438j4277L766J4978p074j1359P085
757d05M209l164L625k501q695P909P990j0655l621J1419k378q756O204L081o071
$$ plain form
664 -2009 5628 3668 -23159 3124 35150 -6366 -29104 12320 16429 -8894 2545 1597 -11288
677 -11288 14304 13363 -26687 -5752 35476 245 -28496 4442 13558 -1414 7178 -3639 -20667
690 -20667 12335 23236 -19094 -15767 21252 5878 -15268 404 2880 -1322 12304 -3529 -24500
703 -24500 7718 24884 -12125 -18465 9432 4333 -6600 4227 -2358 -9565 9399 5481 -18048
716 -18048 -2655 17861 -2715 -14202 811 1616 -494 6688 -4281 -13371 5118 10699 -7752
729 -7752 -6641 6961 156 -4722 1810 -2552 -2303 8698 365 -13664 315 13956 -480 -8968
743 -8968 1301 2536 17 4100 -954 -5725 5038 6476 -7801 -4035 10943 3869 -7490 -405
757 -405 3804 640 4265 1764 -6931 978 8968 -1687 -5308 6111 3733 -5023 1181 4262 -1809
772a809L896J754r269L577J0220p965o368Q432N68o937M925K042o968M074L575
787C747q429K046R511p411o375R587O2p586N203K763p934L112N434p196n3Q353
803D834o371n142R114L96q129M569M211p401R99O156m448j960N591l013l682O765
819B489o62o493M530K751n398R91M538l689j035M160k369k048N002j288m333L816
835I62J693m030J304K822l369l81L736k239k249L973n96l129K512J665k949O97
851D22J590j803m40K364j251j214J695L02j806P02J078j256J01K34l67J92N61
868A104j308k79R50J30r83K82L79m54J39l91k83R78m29q63M89P28m83j381J401
887b74L29r78O5M52k83l9J00m20L21L82l13m52L23N21p44j14P14k00K09J94m12
$$ plain form
772 -1809 2087 3841 -5428 -1851 8369 404 -5964 2468 3036 -3901 1024 3066 -3902 172 3747
787 3747 -4682 -2636 6875 -536 -6911 2676 2738 -4848 355 3118 -4816 -1704 3730 -3466 -3519 4834
803 4834 -1537 -6679 2435 2831 -5298 -729 3482 -3919 -2920 3236 -1212 -3172 2419 -594 -4276 2489
819 2489 1827 -4666 -136 2615 -2783 -1792 2746 -943 -1978 2182 -187 -2235 2767 1479 -2854 962
835 962 2655 -1375 -71 2751 -618 -999 2737 498 -1751 2222 1626 -1503 1009 2674 -275 422
851 422 2012 209 -231 2133 882 -332 1363 1665 -141 561 1639 383 484 718 351 543 1104
868 1104 -204 -483 467 597 -386 -104 275 -179 -40 -431 -714 264 -165 -1028 -539 189 -294 -1675 -274
887 -274 55 -923 -858 -406 -689 -728 -628 -1048 -727 -345 -658 -1110 -787 -266 -1010 -1124 -410 -610 -401 -207 -619
908f19P1L63k35M6L53m50K63M08l44n41O86R05j188j60J151l55l00P05n52j54
928E3P81Pj162K90J131m22p89J113j10m86N43k27n20P38K89o13j34K86j75p3L85
949I05n57l79J276j52j506P56O95l19q69j4M83q4K36o71n79J255L98j518k42J129
969B43K31j294j3Q65q41O90J88j592J46K470j040k328J578J145j667J53J680k448
987a834N10K741k620j742L979n4l373J821R17k432K740J183m636N50N708l899
1003d41l283N802q82m270M338L48n647M779M517q785j77R384m044n645O559j125
1019A428n125P324J07r141N975O876j0686j170J0945m589n818P842l412n929J1980
1034F607j195j4794R000J0499j3313j919J1974o662m888J0760n681q328J4785
$$ plain form
908 -619 -548 -185 -420 -374 -21 -471 -208 200 -144 -685 1 906 -282 -442 709 354 54 759 207 53
928 53 834 841 -321 -31 1100 678 -111 1002 892 406 949 722 202 940 1229 616 482 768 593 520 905
949 905 348 -31 1245 1093 -413 343 1038 719 -150 -164 319 235 471 -200 -779 476 874 -644 -886 243
969 243 474 -820 -833 32 -809 -119 69 -1523 -1377 1093 53 -2275 -697 448 -1219 -1066 614 -1834
987 -1834 -1324 1417 -1203 -2945 1034 980 -2393 -572 345 -2087 653 1836 -2800 -2250 3458 -441
1003 -441 -3724 2078 1196 -3074 1264 1612 -4035 744 5261 -3524 -3701 5683 1639 -4006 2553 1428
1019 1428 -3697 3627 3734 -5407 568 7444 -3242 -4412 6533 1944 -3874 3968 556 -5373 6607
1034 6607 5412 -9382 -382 10117 -3196 -5115 6859 197 -4691 6069 388 -7940 6845
1047F845O01j8581Q967J3036j3762j693J0981r677j813J4797j0030j1417J8916
1060G170J133k0678R740J3055j5669R77J2043j4397p24K0397j1517j6961J9513
1073D082N321j9033P513R848j4285M548J0741j6706l96K1841j1032j7042J7245
1086B645M414j4089R483L114j7429J0891J5519k1706n023K4110o540j7525J3452
1099A316M212j1032J0197J441j9399J0500K0007j8670j0970J7758n65r169Q103
1112C729l236p796J5220O63k1597Q460K0563j3615j2719J1427J360k419P953q923
1126i30j0912J6712P735j9709r62J6548l290r287K975n80K560Q840j0415j2754
1140a3469J4768J1636j3495p507Q265K251j187P40o028m52J1520k437j4734M761
$$ plain form
1047 6845 7446 -11135 -2168 10868 -2894 -4587 6394 -3283 -5096 9701 -329 -11746 7170
1060 7170 8303 -12375 -2635 10420 -5249 -4272 7771 -6626 -7350 13047 1530 -15431 4082
1073 4082 9403 -9630 -2117 7731 -6554 -2006 8735 -7971 -8367 13474 2442 -14600 2645
1086 2645 7059 -7030 2453 5567 -11862 -971 14548 -7158 -12181 11929 5389 -12136 1316
1099 1316 5528 -5504 4693 6134 -13265 -2765 17242 -1428 -12398 5360 4795 -4374 3729
1112 3729 493 -7303 7917 8580 -13017 -4557 16006 2391 -10328 1099 2459 40 7993 -930
1126 -930 -11842 4870 12605 -7104 -8066 8482 5192 -4095 -1120 -1700 860 9700 -715 -13469
1140 -13469 1299 12935 -560 -8067 198 2449 1262 2002 -4026 -4478 7042 4605 -10129 -5368
1154e368J4363l622j2074O18O249L506Nn865n334P328P325p990o673P616N867
1169E951o754n217L536M869K269l861r029L102J3378k718j2543K282Q075j901
1183A439k035N69k853L700N366r606o117J5250M068j5394q37Q793q56R29J069
1198C485r514J636J3679o850j1890J1591O468j2359o3O936m376L731M840j3689
1212f375k056J8217k872j5287P773O386r189L463N152r447L440R054j1947m511
1226h199J5953j355j3104O024L353o854P487K714j3658M098J2395j0909m985J3362
1240F322m152r423R261L33q831R769L806j6209L441J4495r189n737R974m195o440
1255f775J1143j243j0739R047M802j3291K557J1183p484l512P937o093l254J2069
$$ plain form
1154 -5368 8995 5373 -6701 -6083 166 3672 3677 -2188 -7522 -194 7131 -859 -7532 84 5951
1169 5951 -803 -6020 -2484 2385 4654 793 -8236 -5134 8244 5526 -7017 -4735 3340 1439
1183 1439 -596 -27 -2880 820 6186 -3420 -9537 5713 9781 -5613 -6450 2343 1487 2416 3485
1198 3485 -6029 -4393 9286 2436 -9454 2137 8605 -3754 -3817 3119 -1257 2474 7314 -6375
1212 -6375 -8431 9786 6914 -8373 -600 5786 -3403 60 5212 -4235 -795 8259 -3688 -8199
1226 -8199 7754 6399 -6705 -681 2672 -4182 3305 6019 -7639 -3541 8854 -2055 -7040 6322
1240 6322 2170 -7253 2008 2341 -6490 3279 7085 -9124 -5683 8812 -377 -6114 3860 -335 -6775
1255 -6775 4368 3125 -7614 1433 6235 -7056 -4499 6684 -800 -4312 3625 -2468 -5722 6347
1269F347l341j0912Q070M948r642K702O911p653q7P351p295k210J1703l816j0429
1284g353P341M714o969K708L455q154K625Q229p860l351J0072k774p810N972L089
1299C934n537K918J702p248K969P709o339m424O966q96m514M608M46m775L848
1314A367J198n946K549N841n164l060M755j040k093M314k013m364M759J630n308
1329b575J415M091l793j707L799j308j772M137j943m368M121K409m308N81K207
1344I86k221j93K404j260j423K286k31k810K062J398k074L59M39q42P33J638j664
1361d13r75J802p8j228J196L63j353N24M97r38P57R74j525l10R13Q48r93q3O67
1380F45q70M30P57r33K17O94o47l18M75M61o28q2O89o52K09K60O2p76K84L9J57
$$ plain form
1269 6347 3006 -7906 164 5112 -4530 -1828 5083 -2570 -2657 4694 -2601 -4811 6892 3076 -7353
1284 -7353 -12 4702 -2267 441 3896 -4258 -1633 6596 -1264 -4615 5457 2683 -5127 845 3934
1299 3934 -1603 1315 3017 -4231 -1262 6447 108 -4316 2650 1754 -2760 1848 2294 -2481 1367
1314 1367 2565 -3381 -832 5009 -155 -3215 1540 500 -1593 2721 708 -3656 1103 2733 -2575
1329 -2575 -1160 2931 -862 -2569 1230 -78 -1850 2287 344 -4024 97 2506 -1802 -1221 986
1344 986 -1235 -1428 976 -284 -1707 579 348 -2462 -400 998 -1076 -717 -278 -1120 -387 1251 -413
1361 -413 -1388 414 336 -892 304 667 -686 -162 335 -603 154 1128 -397 -707 206 1054 61 -22 645
1380 645 -225 205 962 29 246 940 293 -25 450 911 283 201 890 238 447 707 769 -7 277 316 473
1401D73m63q7O98o53m1O14m22J00K39n22J17P2o3m2j48L27n13L27o6k17J66o9
1423a73l8L9n0k61r6N02j38m55J57M29n02l51J043q74o4P55m51p4L42J90p99N21
1445c48N64q39j79P72j40n12O62j03l52M36K6l26K1L99l46R6P36m77m76J058m13
1466B59o47J245p28j86M87J94p37N43K77o03k24R98m72o68J310n81p64P68K48
1485G19j038Q59N13r63n96J577r68p15J673o99r45R08Q90j968P82P26j029j36
1503d10R82p73n84J676o22j609J655K86j532M81J069j789N68J403j736m61K149
1520G53n92j637J073J167j673K80J075j649L61J952j622j098K078K69k234O52
1536h45J244p92j08J449k090J9K560j168k030J607J238j910J84J411j400R67R91
$$ plain form
1401 473 10 -77 621 -32 -73 541 119 219 458 -64 53 125 62 20 -128 199 -314 13 -53 -270 -104 -173
1423 -173 -211 -172 -222 -483 -579 -77 -215 -670 -513 -84 -586 -937 106 -768 -832 -77 -528 -602 -260 -70 -869 -348
1445 -348 216 -623 -802 -30 -170 -682 -20 -123 -475 -39 -13 -339 -318 81 -265 -169 567 90 -386 672 259
1466 259 -388 857 129 -57 430 624 -113 430 707 104 -120 878 406 -262 1048 467 -297 471 719
1485 719 -319 540 1053 90 -506 1071 103 -612 1061 362 -583 325 1215 -753 29 755 -274 -410
1503 -410 572 -201 -785 891 269 -1340 315 601 -931 -450 619 -1170 -602 801 -935 -1396 753
1520 753 161 -1476 -403 764 -909 -629 446 -1203 -842 1110 -512 -1610 468 737 -1497 -845
1536 -845 399 -393 -501 948 -1142 -1123 1437 269 -1761 -154 1084 -826 -642 769 -631 336 1327
1553A327k274m36L232m10k863J187J436r74L42M19j909N84K870k708k017L560
1569A366J086l191O3J592o75P67M60k662p2M110j254l588K087J668k211N48M14
1586E08j525J549J812l602j345M647K70m404J246J536j388J115O65l610J375M353
1602C202l167l785M534J382l619O74Q12j827K762J356n309N1N629j558l858K606
1618a15O41j975K170j08m144L497L848o283j452O196n07l609J949o08j791M393
1634B102L30o274K495N360m641k236M635j040k013L088k616k082N848J055p798
1649c787J397N982k734k202L151k427j079N025k599m333N497K302o748j5N070
1664B500j434j208J747l539q4O314k299o232M374L330m996L88L222k672L90K731
$$ plain form
1553 1327 -947 -1383 1849 1439 -1424 -237 1199 225 567 986 -923 -339 2531 -177 -2194 1366
1569 1366 2452 -739 -676 916 241 1008 1468 -1194 -1266 2844 1590 -1998 89 1757 -454 94 508
1586 508 -1017 532 2344 -1258 -2603 2044 2314 -2090 -844 692 -696 419 1084 -2526 -1151 3202
1602 3202 35 -3750 784 2166 -1453 -779 33 -1794 968 2324 -2985 -2934 2695 1137 -2721 -115
1618 -115 526 -1449 721 613 -3531 -34 3814 -2469 -3921 2275 1768 -1841 108 -500 -2291 2102
1634 2102 2432 -3842 -1347 4013 -628 -2864 1771 731 -1282 1806 -810 -2892 2956 4011 -3787
1649 -3787 -2390 3592 858 -1344 1807 -620 -1699 3326 727 -3606 1891 4193 -2555 -2570 2500
1664 2500 1066 -142 1605 -1934 -2018 4296 1997 -4235 139 3469 -1527 -1139 2083 -589 -199 2532
1680B532m812j030P746j213p533K569M333k925M40J383l767Q91M737m204l141
1695c994O403P11o530J378L259j060Q98j22m966J835O318l148n377M010K566l751
1711a570K82J794j376J706J017n272q1P173m80o721J469L270q59L76n1l242K184
1728c81L755m404k555N635J520n399l76L093n12J653k90n372J391O772k033o307
1744c810L684L378l333j096K016q63R75K141n374j647P771M68o877K35L765p86
1760F47L12N35l828J577M646l806m342N720K526o266L21K717j148J761J512o129
1776c245m44P688j515o353L650K633m277J225K147l357J640L688n686k604P704
1791B894P45p033K291K095l136K963J893o142J323N707l953l942O031J077n628
$$ plain form
1680 2532 -2280 -3310 4436 3223 -4310 -1741 2592 -333 107 1490 -2277 -1386 3351 -853 -3994
1695 -3994 2409 3120 -3410 -2032 1227 167 1065 943 -4023 -2188 4130 982 -4395 -385 2181 -1570
1711 -1570 -1288 506 -870 836 1853 -3419 -3500 3673 3193 -3528 -2059 1211 352 728 677 -2565 -381
1728 -381 3374 -1030 -3585 2050 3570 -1829 -2205 888 376 2029 1739 -3633 -2242 4530 2497 -3810
1744 -3810 -126 3252 -81 -1177 839 -24 951 3092 -2282 -3929 3842 4310 -2567 -2332 1433 647
1760 647 959 1494 -2334 -757 3889 83 -4259 1461 3987 -2279 -1958 759 -389 1372 2884 -3245
1776 -3245 -3689 3999 2484 -3869 -219 2414 -1863 -638 1509 -1848 -208 3480 -2206 -4810 2894
1791 2894 3639 -3394 -1103 992 -2144 819 2712 -3430 -2107 3600 -353 -4295 1736 2813 -2815
1806b815K169J395l124L417K244o555J15O773k581m078M245l18l206L478K60m176
1822b757L365K894o486M6O325k436k819L280j116k689M519M42n359K306L666m515
1838a334m41M699j972k550K749r79k061M012K67m627J221L137k310n48K499j918
1854a56j176K813j034j944K992J71l489J408K107k337L72J611k664r9K864j050
1870C89k029K131J46j918J194J267j926K77R72j703J73K278o99j708J081k9n51
1887f55O82K28j238K82J162q77k52J123m43p01L84l8J73L04l38m65K05P20l96
1906a40J84J31n40pN39L7l63O32n18k81N36O27p60J88j86k0J67p2J39N8m10L31
1928B72l72M65R6j10k8n37M96M82q26J48L27o14R3P62l38o10P57j89m13R3N69
$$ plain form
1806 -2815 -646 749 -2375 1042 3286 -3269 -3154 3619 1038 -3040 1205 887 -2319 1159 1419 -2757
1822 -2757 608 3502 -2984 -2938 3387 951 -1868 1412 296 -2393 2126 2568 -2791 -485 3181 -1334
1838 -1334 -1775 2924 952 -1598 1151 172 -1889 2123 2390 -2237 -1016 2121 -189 -737 1762 -156
1854 -156 -1332 1481 447 -1497 1495 1666 -1823 -415 1692 -645 -273 1338 -1326 -1425 1439 389
1870 389 -1640 491 637 -1281 -87 1180 -746 -469 503 -1200 -1027 1251 552 -1156 -75 -104 -655
1887 -655 27 255 -983 -701 461 -416 -668 455 12 -689 -305 -343 -170 134 -204 -669 -464 256 -140
1906 -140 44 175 -365 -372 167 204 -159 473 -45 -326 210 837 77 265 79 59 226 154 293 351 -59 272
1928 272 -100 365 461 351 323 -214 282 764 -62 86 413 -201 -108 654 316 -294 463 274 -139 -46 523
1949E23l41m30N21n49K65L21o04O0J18L03j19k05K16j4n05K48L4m67N77l00j84
1970e32N96k28j19R3L8l04J81K53k92j2J04k32K12J36Q3l28R4L27l88K71J16k09
1992a40k40N67j42j43M9m9l6J61r4K1L6L7j01J4K48j2j49J76p6j79N31k03k83
2015gL05J86k68l9J30j76P3J94l63j79Q56n20k58L89K83o01L91j02k20O6K96l55
2037H1j99N75j72p63Q42J61r81N05L25p45K77L72n05l7R24p37p41J059m85o02
2057h46R19J59j002L36P70r43k92J126l63q28J140k63q14R87L42j390O12Q97j270
2076g23j58J342m05p86J417p29r14J489O9j287O06R04j203J45J030j144m51J765
2094I67o76j634J973N08j861P71J013j233J41J059j164k48J455n32j998K083M63
$$ plain form
1949 523 182 -248 273 -276 -11 310 -294 -234 -116 187 68 -137 79 65 -440 -192 -158 -625 -48 -348 -532
1970 -532 64 -164 -283 -190 -152 -456 -275 -22 -314 -326 -222 -454 -242 -106 -23 -351 -257 70 -318 -47 69 -140
1992 -140 -380 187 45 -98 -49 -98 -134 27 -67 -46 -10 27 -74 -60 188 176 27 203 127 -52 479 276 -7
2015 -7 298 484 216 177 307 131 204 398 35 -144 712 192 -66 323 606 5 396 294 74 140 436 81
2037 81 -118 457 285 -478 364 525 -456 49 374 -371 -94 278 -227 -264 660 -77 -818 241 -244 -846
2057 -846 73 232 -770 -434 336 -607 -899 227 -136 -964 176 -87 -901 86 428 -962 -350 547 -723
2076 -723 -881 461 56 -730 687 -42 -956 533 602 -685 -79 825 -378 -233 797 -347 -798 967
2094 967 291 -1343 630 1138 -723 48 1061 -172 -31 1028 -136 -384 1071 539 -1459 624 1087
2111A087j576N24J078j113J8J086j379n13J801m34j537J238K10p86M45L58j176
2128f69N23J382j243j100J889p3j288J42N00m42O95J59j398L34J463m95j470P96
2146b95P60p65K3K92m63O64M07j381o91K174L27j803k99J294k81k53Q6l95J83
2165d16R13l88j406J227J403j540j080J350K92j7K13j037o90K211L52k559K48
2182i24K196r63j154Q27Q5K0J017j029k113K588J546k377j491K721l88r27J135
2199G69j233o41K867p76k921J593K745k106j922K194o55R0J752k175j727L566
2215A420Q58m273Q00L213k101o87J553j843N02K957k171l457M069J931l955o2
2231a246J824j641J125J783l136q49M619j678l992L332K137l687Q78J062k570
$$ plain form
2111 1087 -489 35 1113 0 18 1104 -275 -788 1013 579 -958 280 490 -296 149 507 -669
2128 -669 -146 1236 -7 -1107 782 709 -579 -437 63 -379 316 475 -923 -589 874 379 -1091 -295
2146 -295 465 -300 -277 15 -448 216 623 -758 -1449 725 1052 -751 -1050 244 -37 -290 -204 -599 -416
2165 -416 497 109 -1297 -70 1333 -207 -1287 63 355 338 551 -486 -1176 1035 1387 -1172 -924
2182 -924 1272 309 -845 -18 67 87 1104 75 -2038 550 2096 -281 -1772 949 561 -366 769
2199 769 -464 -1105 1762 986 -1935 -342 2403 297 -1625 569 -86 4 1756 -419 -2146 1420
2215 1420 2278 -1995 -1195 2018 -83 -770 783 -1060 -558 2399 228 -3229 840 2771 -1184 -1246
2231 -1246 578 -1063 62 1845 -1291 -2140 2479 801 -3191 141 2278 -1409 -531 531 -2039
2246b039K007K638m043j523M953n72l437J800J352k650J782R21l298J972L302
2261C165m099k074M142J55k522J857n16k261L063J543m413J046L467l008j997
2276b452L539l03j757K040j278j750L142J593m654L19L346j733p59K009j167j211
2292a076K796j243k577K866J524l484j67K607j134j28J752k499q06L364o17k837
2308a659J767J328k540L00J931j709O08J533k599n76L101k83k289Q57P93j434
2324h71J256M87j693K69J512j932o87K610P6j986M25L87o77J258K54k123N06J936
2342A007j115p90J306k70j026P32J36o76J106J09j563J85J786l70j210N48j92
2359b97k59J061k63m24L52M31j142O5J165l34k56n40K50J61Q76m85p99J55P83
$$ plain form
2246 -2039 -32 2606 -1437 -2960 1993 1421 -2016 -216 1136 -1514 268 1189 -2109 -137 3165
2261 3165 -934 -3008 1134 1289 -1233 624 108 -2153 910 2453 -1960 -914 2553 -455 -2452
2276 -2452 1087 784 -973 1067 -211 -1961 1181 2774 -1880 -1561 1785 52 -707 1302 135 -1076
2292 -1076 1720 477 -2100 766 2290 -1194 -1361 1246 112 -16 1736 -763 -1569 1795 1178 -1659
2308 -1659 108 1436 -1104 -804 1127 -582 26 1559 -1040 -1616 1485 1202 -1087 -230 563 -871
2324 -871 385 872 -821 -552 960 -972 -1659 951 1027 -959 -534 -147 -824 434 688 -1435 -929 1007
2342 1007 -108 -898 408 138 -888 -156 -20 -696 410 519 -1044 -859 927 557 -653 -105 -297
2359 -297 -556 505 242 -182 170 601 -541 -476 689 355 99 -441 -191 -30 846 361 -438 -283 500
2378E00l57k3K48K44m55j53Q7J73N28m59q81J21Q60L05o44m08J09L20J39k57J20
2399A17l8J48n87L52K76J31j78p16r6O32J74K70o53o30R10m6k91J14K73l13m46
2420e97L98j06Q9O33m96q68R28O25o99l26L38o4j13M21m48O0K7J92n44N78M64
2441D92q00j02N95l80k0O51o36k58O16Q8n18K94K61o13K03K72k45P5M56k97n51
2462d17Q13K15o09M31l5o69M32J13j01l44K85p1l96O58K48m74k19O29r17L90P09
2483F71o47k67O32k91j06L67k05n46N18J22l17J11K40n75K58J70R3n08N25l68
2503a23r5K00K98n85K80J86n55Q9K19K56p05N45j58k14L48L24p50L25O7m8r1K20
2525C3j07j26J31P7k90K34r5M6L6K40n19L11K52R4o08j5M01k4j08K8j25J84J09
$$ plain form
2378 500 143 120 368 612 157 4 91 264 792 333 -548 -427 433 738 94 -314 -205 115 254 -3 117
2399 117 79 227 -360 -8 268 399 221 -495 -591 41 215 485 -168 -798 112 66 -225 -111 162 -151 -597
2420 -597 -199 -305 -216 417 -79 -947 -19 606 -93 -419 -81 -145 -258 163 -285 -225 -198 -6 -550 28 492
2441 492 -308 -410 185 -195 -215 436 -200 -458 158 246 -272 22 283 -330 -127 145 -100 -25 431 134 -417
2462 -417 396 611 2 433 398 -271 161 274 173 -171 114 43 -353 305 553 79 -140 489 -428 -38 671
2483 671 24 -243 389 98 -8 359 154 -392 126 248 -69 42 282 -293 -35 135 228 -280 245 -123
2503 -123 -218 -18 280 -305 -25 161 -394 -305 -86 170 -535 10 -148 -362 -14 310 -440 -115 -48 -96 -187 33
2525 33 -74 -200 -69 8 -282 -48 -143 -97 -61 179 -340 -29 223 317 -291 -306 95 71 -37 -9 -134 50 159
2548A59m63M88K49m03k7J81o7l93K85K12j8p7r4J43j70J50j74J69k7K39m53J91
2570A00K34l33m7M60l48J68l09J56k20Q3K23m25L36m2K9k28J91J6j48K22l42l5
2592b59J14K59j89j52J19l0k12L72j73lJ12N0l47K59K86k34l27K56K27n17M88
2613I9n7n54M30K02l75J22K81k62k5L04N2n06O32n26k43M59R2l24O8K66k00J67
2635A02p7l50j66R86l03n88N08L42l04R1J83o18L59L33o90k5P23m08l17K71L99
2656D51p02K92J07m33L69M64m54m89K31P52p82N9L20n52O22P1p63l1Q75n04l03
2677d00N22r2m79N47j86j53K52N17q15m74Q81j82l07M62r6k19L61J0q81O39O77
2698E84q07k51O01j00k60L75k49m04Q22J49r40K00N53l93n14O94N0n89R84n86
$$ plain form
2548 159 -304 184 433 30 3 184 117 -276 9 221 203 126 32 175 5 155 -19 150 123 362 -91 100
2570 100 334 1 -46 414 66 234 -75 81 -139 -56 167 -258 78 36 65 -163 28 44 -104 118 -224 -259
2592 -259 -145 114 -75 -227 -108 -138 -350 22 -151 -154 -42 8 -339 -80 206 -28 -355 -99 128 -389 99
2613 99 42 -512 -82 120 -255 -133 148 -114 -139 165 217 -289 343 -183 -426 33 125 -199 -131 135 -65 102
2635 102 25 -325 -491 495 192 -396 112 454 150 241 424 -194 165 498 -192 -217 506 98 -219 52 451
2656 451 -251 41 148 -285 84 548 94 -395 -164 588 -194 -135 185 -367 255 326 -437 -468 407 -97 -400
2677 -400 122 30 -449 98 -88 -241 11 528 -287 -761 120 -62 -369 93 -3 -222 139 149 -732 -93 584
2698 584 -223 -474 127 27 -233 142 -107 -511 311 460 -480 -280 273 -120 -634 60 110 -479 505 -81
2718h1n93L51Q71q20j48P44m48O9L25l45J06L44r1p81L37J031q22j13M35m59R7
$$ plain form
2718 -81 -674 -323 548 -272 -420 324 -124 -55 270 -75 31 375 284 -497 -160 871 49 -64 371 -88 9
$$ [...]
8191A24
##END NTUPLES=NMR FID
##END=
