##TITLE=1H_Pr m
 CDCl3, 8 sc, 
 8.06.2021
##JCAMPDX= 6.0         $$ Bruker NMR JCAMP-DX V2.0
##DATA TYPE= NMR FID
##DATA CLASS= NTUPLES
##ORIGIN= UXNMR, Bruker Analytische Messtechnik GmbH
##OWNER= root
$$ XWIN-NMR		Version 3.5
$$ Tue Jun  8 12:23:09 2021 Russian Standard Time (UT+4h)  she@DPX200
##.OBSERVE FREQUENCY= 200.131506
##.OBSERVE NUCLEUS= ^1H
##.DELAY= (6, 6)
##.ACQUISITION MODE= SIMULTANEOUS
##.ACQUISITION SCHEME= undefined
##.AVERAGES= 8
##.DIGITISER RES= 18
##SPECTROMETER/DATA SYSTEM= spect
##.PULSE SEQUENCE= zg30
##.SOLVENT NAME= CDCl3
##.SHIFT REFERENCE= (INTERNAL, CDCl3, 0, 15.7039)
##AUDIT TRAIL= $$ (NUMBER, WHEN, WHO, WHERE, WHAT)
$$ ##TITLE= Audit trail, XWIN-NMR		Version 3.5
$$ ##JCAMPDX= 5.01
$$ ##ORIGIN= Bruker BioSpin GmbH
$$ ##OWNER= she
$$ F:/spectra/data/she/nmr/H-F/1/audita.txt
$$ ##AUDIT TRAIL=  $$ (NUMBER, WHEN, WHO, WHERE, WHAT)
(   1,<2021-06-08 12:21:21.78 +0400>,<she>,<DPX200>,
      <created by zg, POWCHK disabled, PULCHK disabled
       configuration hash MD5:
       00 E9 B6 7A A2 85 ED C7 34 08 36 98 17 FE 4E 26
       data hash MD5: 16K
       45 D9 9C F1 2A 65 07 D2 D1 06 59 B2 03 0E AC 2C>)
$$ ##END=
$$ 
$$ hash MD5
$$ 2B EB E7 E8 57 57 18 90 D2 3E 71 FC 46 5C 45 9F
##$RELAX= 
##$RELAX= 
##$RELAX= 
##$RELAX= 
##$RELAX= 
##$RELAX= 
$$ Bruker specific parameters
$$ --------------------------
##$DU= <F:/spectra>
##$EXPNO= 1
##$NAME= <H-F>
##$PROCNO= 1
##$TYPE= <nmr>
##$USER= <she>
##$AMP= (0..31)
100 100 100 100 100 100 100 100 100 100 100 100 100 100 100 100 100 100 
100 100 100 100 100 100 100 100 100 100 100 100 100 100 
##$AQSEQ= 0
##$AQ_mod= 1
##$AUNM= <au_zg>
##$AUTOPOS= <>
##$BF1= 200.13
##$BF2= 200.13
##$BF3= 200.13
##$BF4= 200.13
##$BF5= 200.13
##$BF6= 200.13
##$BF7= 200.13
##$BF8= 200.13
##$BYTORDA= 1
##$CFDGTYP= 0
##$CFRGTYP= 5
##$CHEMSTR= <none>
##$CNST= (0..31)
1 1 145 1 1 1 1 1 1 1 1 1 1 1 1 1 1 1 1 1 1 1 1 1 1 1 1 1 1 1 1 1 
##$CPDPRG= <>
##$CPDPRG1= <>
##$CPDPRG2= <>
##$CPDPRG3= <>
##$CPDPRG4= <mlev>
##$CPDPRG5= <mlev>
##$CPDPRG6= <mlev>
##$CPDPRG7= <mlev>
##$CPDPRG8= <mlev>
##$CPDPRGB= <>
##$CPDPRGT= <>
##$D= (0..31)
0 1.2 0 0 0 0 0 0 0 0.06 0 0.03 0 0 0 0 0.0002 0 0 0 0 0 0 0 0 0 0 0 0 
0 0 0 
##$DATE= 1623140481
##$DBL= (0..7)
120 120 120 120 120 120 120 120 
##$DBP= (0..7)
150 150 150 150 150 150 150 150 
##$DBP07= 0
##$DBPNAM0= <>
##$DBPNAM1= <>
##$DBPNAM2= <>
##$DBPNAM3= <>
##$DBPNAM4= <>
##$DBPNAM5= <>
##$DBPNAM6= <>
##$DBPNAM7= <>
##$DBPOAL= (0..7)
0.5 0.5 0.5 0.5 0.5 0.5 0.5 0.5 
##$DBPOFFS= (0..7)
0 0 0 0 0 0 0 0 
##$DE= 6
##$DECBNUC= <off>
##$DECIM= 32
##$DECNUC= <off>
##$DECSTAT= 4
##$DIGMOD= 1
##$DIGTYP= 9
##$DL= (0..7)
0 120 120 120 120 120 120 120 
##$DP= (0..7)
150 150 150 150 150 150 150 150 
##$DP07= 0
##$DPNAME0= <>
##$DPNAME1= <>
##$DPNAME2= <>
##$DPNAME3= <>
##$DPNAME4= <>
##$DPNAME5= <>
##$DPNAME6= <>
##$DPNAME7= <>
##$DPOAL= (0..7)
0.5 0.5 0.5 0.5 0.5 0.5 0.5 0.5 
##$DPOFFS= (0..7)
0 0 0 0 0 0 0 0 
##$DQDMODE= 0
##$DR= 18
##$DS= 0
##$DSLIST= <SSSSSSSSSSSSSSS>
$$ [...]
##$SUBNAM2= <"">
##$SUBNAM3= <"">
##$SUBNAM4= <"">
##$SUBNAM5= <"">
##$SUBNAM6= <"">
##$SUBNAM7= <"">
##$SUBNAM8= <"">
##$SUBNAM9= <"">
##$SW= 20.0188882624521
##$SWIBOX= (0..15)
0 0 2 0 0 0 0 0 0 0 0 0 0 0 0 0 
##$SW_h= 4006.41025641026
##$TD= 16384
##$TD0= 1
##$TE= 0
##$TE2= 300
##$TE3= 300
##$TEG= 300
##$TL= (0..7)
0 120 120 120 120 120 120 120 
##$TP= (0..7)
150 150 150 150 150 150 150 150 
##$TP07= 0
##$TPNAME0= <>
##$TPNAME1= <>
##$TPNAME2= <>
##$TPNAME3= <>
##$TPNAME4= <>
##$TPNAME5= <>
##$TPNAME6= <>
##$TPNAME7= <>
##$TPOAL= (0..7)
0.5 0.5 0.5 0.5 0.5 0.5 0.5 0.5 
##$TPOFFS= (0..7)
0 0 0 0 0 0 0 0 
##$TUNHIN= 0
##$TUNHOUT= 0
##$TUNXOUT= 0
##$USERA1= <user>
##$USERA2= <user>
##$USERA3= <user>
##$USERA4= <user>
##$USERA5= <user>
##$V9= 5
##$VALIST= <valist>
##$VCLIST= <CCCCCCCCCCCCCCC>
##$VD= 0
##$VDLIST= <DDDDDDDDDDDDDDD>
##$VPLIST= <PPPPPPPPPPPPPPP>
##$VTLIST= <TTTTTTTTTTTTTTT>
##$WBST= 1024
##$WBSW= 4
##$XGAIN= (0..3)
0 0 0 0 
##$XL= 0
##$YL= 0
##$YMAX_a= 853174
##$YMIN_a= -733713
##$ZGOPTNS= <>
##$ZL1= 120
##$ZL2= 120
##$ZL3= 120
##$ZL4= 120
##$ABSF1= 10
##$ABSF2= 0
##$ABSG= 5
##$ABSL= 3
##$ALPHA= 0
##$AQORDER= 0
##$ASSFAC= 0
##$ASSFACI= 0
##$ASSFACX= 0
##$ASSWID= 0
##$AUNMP= <proc_1d>
##$AZFE= 0.1
##$AZFW= 0.1
##$BCFW= 1
##$BC_mod= 2
##$BYTORDP= 1
##$COROFFS= 0
##$CY= 11.3945322036743
##$DATMOD= 1
##$DC= 2
##$DFILT= <>
##$DTYPP= 0
##$F1P= 15.9154993809931
##$F2P= -4.1035820241983
##$FCOR= 0.5
##$FTSIZE= 0
##$FT_mod= 4
##$GAMMA= 1
##$GB= 0.15
##$INTBC= 1
##$INTSCL= 1
##$ISEN= 128
##$LB= 0.24
##$LEV0= 0
##$LPBIN= 0
##$MAXI= 10000
##$MC2= 0
##$MEAN= 0
##$ME_mod= 0
##$MI= 1.114404
##$NCOEF= 0
##$NC_proc= 0
##$NLEV= 6
##$NOISF1= 3.799351
##$NOISF2= 2.8
##$NSP= 1
##$NTH_PI= 0
##$NZP= 0
##$OFFSET= 15.70392
##$PC= 1
##$PHC0= -11491.09
##$PHC1= 19.20101
##$PH_mod= 1
##$PKNL= yes
##$PPARMOD= 0
##$PSCAL= 0
##$PSIGN= 0
##$REVERSE= no
##$SF= 200.130013532006
##$SI= 16384
##$SIGF1= 3
##$SIGF2= 2
##$SINO= 400
##$SIOLD= 16384
##$SREGLST= <1H.CDCl3>
##$SSB= 0
##$STSI= 0
##$STSR= 0
##$SW_p= 3612.71676300578
##$SYMM= 0
##$S_DEV= 0
##$TDeff= 0
##$TDoff= 0
##$TI= <>
##$TILT= no
##$TM1= 0
##$TM2= 0
##$TOPLEV= 0
##$USERP1= <user>
##$USERP2= <user>
##$USERP3= <user>
##$USERP4= <user>
##$USERP5= <user>
##$WDW= 1
##$XDIM= 8192
##$YMAX_p= 0
##$YMIN_p= 0
$$ End of Bruker specific parameters
$$ ---------------------------------
##NTUPLES= NMR FID
##VAR_NAME=  TIME,          FID/REAL,        FID/IMAG
##SYMBOL=    X,             R,               I
##VAR_TYPE=  INDEPENDENT,   DEPENDENT,       DEPENDENT
##VAR_FORM=  AFFN,          ASDF,            ASDF
##VAR_DIM=   8192,          8192,            8192
##UNITS=     SECONDS,       ARBITRARY UNITS, ARBITRARY UNITS
##FACTOR=    0.0002496,     1,               1
##FIRST=     0,             0,               0
##LAST=      2.0444736,     0,               0
##MIN=       0,             -733713,         0
##MAX=       2.0444736,     853174,          0
$$ Real data points
##PAGE= N=1
##DATA TABLE= (X++(R..R)), XYDATA
$$ [...]
$$ plain form
2611 -686 -82 206 364 -27 -317 50 -334 -65 680 -215 -896 77 855 299 -1017 -727 381 619 -180
2630 -180 -1258 -57 1303 -199 -1362 -30 710 72 -604 -884 -149 402 157 -547 -33 304 -571 -24
2648 -24 931 -297 -852 673 423 -451 -127 226 213 207 -248 -922 786 1302 -1014 -1264 1093 705 -347
2667 -347 138 -202 -128 998 -24 -1085 833 1023 -935 -547 1267 -293 -163 1106 -712 -472 1398
2684 1398 274 -628 123 8 -698 1057 693 -1599 -116 1203 -993 -608 1641 -454 -1066 755 -514
2701 -514 -628 1582 -61 -2086 211 994 -1365 240 1495 -1631 -986 1424 -41 -618 949 -1324
2717 -1324 -1363 1672 614 -1722 720 803 -2253 -221 1750 -1150 -450 709 -1529 -832 2635 -37
2733 -37 -1927 933 -132 -1683 2067 1395 -2755 -370 2079 -1065 -140 2366 -1099 -1491 1282 -686
$$ packed form
2611f86O04K88J58l91k90L67l84K69P45q95o81R73P78n56j316K90J108K38p99
2630a80j078J201J360j502j163J332P40o38o76k80P35N51k45p04N14L37q75N47
2648b4R55j228n55J525k50q74L24L53j3om55o74J708N16k316k50K357l88j052
2667c47M85l40P4J126j022j061J918J90j958L88J814j560J30J269j818K40J870
2684A398j124r02P51j15p06J755l64k292J483J319k196L85K249k095o12J821j269
2701e14j14K210j643k025K297P83k359J605J255l126O45K410j465n77J567k273
2717a324l9L035j058k336K442Q3l056K032J971k900P00J159k238O97L467k672
2733c7j890K860j065j551L750o72m150K385K449l144R25K506l465l92K773j968
$$ plain form
2749 -686 -523 3309 178 -4155 590 2695 -860 178 944 -2559 73 2905 -1013 -966 2798 -1251
2765 -1251 -2862 2434 1977 -1850 553 360 -3029 1337 3306 -1937 -1478 1064 -2142 -128 4029 -679
2781 -679 -3433 1718 1041 -2272 1997 2061 -3158 -438 1358 -2322 1432 3602 -3311 -3194 2902 999
2797 999 -1365 2066 -541 -4002 1491 2739 -1810 623 1138 -3859 -473 4176 -1081 -1654 2849 -2027
2813 -2027 -3598 3574 2216 -2591 95 -423 -2914 2857 3992 -3973 -2297 2872 -1119 -1258 3690
2828 3690 -620 -3051 1363 -269 -1854 3986 2232 -5315 -1157 3434 -705 807 2643 -3588 -2432
2843 -2432 4021 528 -1707 2232 -274 -3840 2410 2759 -2697 1410 1707 -4724 -717 5313 -182
2858 -182 -2217 1018 -2183 -1082 5026 809 -4719 1348 1706 -3170 1486 3628 -2543 -1689 1511 -1723
$$ packed form
2749f86J63L832l131m333M745K105l555J038P66l503K632K832l918M7L764m049
2765a251j611N296m57l827K403j93l389M366J969n243M59K542l206K014M157m708
2781f79k754N151o77l313M269O4n219K720J796l680L754K170o913J17O096j903
2797I99k364L431k607l461N493J248m549K433N15m997L386M649n257n73M503m876
2813b027j571P172j358m807K686n18k491N771J135p965J676N169l991j39M948
2828C690m310k431M414j632j585N840j754p547M158M591m139J512J836o231J156
2843b432O453l493k235L939k506l566O250L49n456M107K97o431M007O030n495
2858a82k035L235l201J101O108m217n528O067L58m876M656K142o171Q54L200l234
$$ plain form
2874 -1723 392 4996 -1957 -4733 2168 1660 -1680 2578 808 -4881 106 3416 -1733 166 2234
2889 2234 -3657 -2020 3800 187 -1902 2415 -959 -4456 2485 3450 -2276 -201 652 -3547 1042
2904 1042 4460 -2302 -2772 2275 -913 -1993 3697 683 -3405 846 501 -2614 2936 3048 -3970 -1957
2920 -1957 2739 -849 86 3184 -1974 -3522 2844 1566 -1875 2045 611 -3643 1086 2791 -1891
2935 -1891 712 2875 -3070 -1901 3719 1170 -1541 894 -1421 -2242 3552 2107 -3468 148 2013
2950 2013 -2343 -5 3113 -990 -1155 1143 -1560 -583 3808 271 -3798 874 1571 -1487 1369 1412
2966 1412 -2866 -431 2287 -1039 -512 2236 -1450 -2330 1891 493 -1479 2004 334 -3582 529
2981 529 2793 -975 -593 310 -1964 104 2631 -1313 -2091 2041 28 -2341 1159 1704 -1259 -5
$$ packed form
2874a723K115M604o953k776O901n08l340M258j770n689M987L310n149J899K068
2889B234n891J637N820l613k089M317l374l497O941R65n726K075Q53m199M589
2904A042L418o762m70N047l188j080N690l014m088M251l45l115N550J12p018K013
2920a957M696l588R35L098n158j548O366j278l441L920j434m254M729J705m682
2935a891K603K163n945J169N620k549k711K435k315q21N794j445n575L616J865
2950B013m356K338L118m103j65K298k703R77M391l537m069M672O97l058K856M3
2966A412m278K435K718l326N27K748l686q80M221j398j972L483j670l916M111
2981E29K264l768L82R03k274K068K527l944p78M132k013k369L500N45k963J254
$$ plain form
2997 -5 121 -1588 1498 2264 -2222 -1806 1903 -62 -949 1457 -64 -2107 950 866 -989 866 795 -1619
3015 -1619 108 1310 -1169 56 1969 -874 -2118 1413 1529 -715 -2 -487 -806 1484 956 -2148
3031 -2148 214 1813 -794 -1286 1221 559 -522 339 -725 -1061 1893 561 -1674 212 824 -685
3047 -685 612 778 -802 -702 1327 186 -1061 436 219 -122 510 -576 -1046 1371 898 -2103 -948
3064 -948 1804 850 -1186 -754 -190 873 951 -1224 -1474 1440 1292 -1239 -650 565 122 -133 -518 -599
3082 -599 349 983 -168 -901 566 125 -213 219 -481 -933 482 781 -495 -682 76 487 246 -299 -884
3101 -884 337 1298 -336 -1587 178 1620 203 -952 -379 741 1143 -310 -1200 -4 1272 330
3117 330 -767 -12 507 81 369 -169 -460 321 453 307 -135 -568 147 953 214 -687 -730 880 813 -521
$$ packed form
2997eJ26j709L086P66m486M16L709j965q87K406j521k043L057q4j855J855p1k414
3015a619J727J202k479J225J913k843j244L531J16k244P13m85l19K290n28l104
3031b148K362J599k607m92K507o62j081Q61j064l36K954j332k235J886O12j509
3047f85J297J66j580J00K029j141j247J497k17l41O32j086m70K417m73l001J155
3064i48K752r54k036M32N64J063P8k175k50K914j48k531N89J215m43k55l85q1
3082e99R48O34j151p33J467m41l38M32p00m52J415K99j276j87P58M11k41n45n85
3101h84J221R61j634j251J765J442j417j155N73J120M02j453q90J196J276r42
3117C30j097P55N19m26K88n38k91P81J32j46m42m33P15Q06p39r01m3J610o7j334
$$ plain form
3137 -521 -1020 167 1170 173 -1148 -501 900 952 -481 -1470 490 1176 -47 -728 -233 520 560 -631
3155 -631 -748 33 605 -51 -478 -466 25 358 160 -333 -745 286 508 -25 -680 -420 507 1017 -541 -1058
3175 -1058 188 1510 320 -1198 -492 732 705 -285 -947 284 1414 40 -859 -194 428 225 -457
3192 -457 -255 249 212 81 -396 -40 450 260 70 252 -243 -404 535 542 -555 -410 362 539 -90 -244 -324
3213 -324 522 989 -661 -779 558 537 -424 -370 -154 53 265 176 -636 -233 695 -173 -281 483 -270 -368 651
3234 651 0 -682 269 563 -331 -480 66 -156 351 415 -1402 -342 1659 242 -1157 253 169 29 299
3253 299 -126 -820 655 671 -1343 32 1126 -529 -751 530 -444 -412 1125 -81 -1470 272 336 -543
3271 -543 702 345 -1305 -98 1205 -1059 -768 1355 -225 -1033 812 -13 -561 807 -144 -1561 794
$$ packed form
3137e21m99J187J003r97j321O47J401N2j433r89J960O86j223o81M95P53M0j191
3155f31j17P81N72o56m27J2M91L33j98m93m12J031K22n33o55K60R27N10j558n17
3175a058J246J322j190j518P06J224k7r90o62J231J130j374q99O65O22k03o82
3192d57K02N04l7j31m77L56M90j90j90J82m95j61R39Pj097J45P72J77o29j54q0
3213c24Q46M67j650j18J337k1r61N4K16K07K12q9q12M03R28q68j08P64p53r8J019
3234F51o51o82R51K94q94j49N46k22N07O4j817J060K001j417j399J410q4j40K70
3253B99m25o94J475J6k014J375J094j655k22J281r74L2J537j206j389J742O4q79
3271e43J245l57j650J207J303k264K91K123j580q08J845q25n48J368r51j417K355
$$ plain form
3288 794 1728 -943 -405 994 -1047 -545 2162 -46 -1172 779 -157 -829 1746 582 -1552 474
3304 474 1148 -1554 62 2363 -813 -1164 1072 -184 -156 1913 -532 -2166 1346 1198 -1511 637
3320 637 1084 -1848 -496 2030 -817 -545 1499 -1150 -1512 1740 793 -1058 1023 -190 -2603 1528
3336 1528 2485 -1927 -1105 1378 -1082 -146 1844 -1058 -1337 1666 -502 -1928 2314 1372 -2659 -541
3352 -541 1199 -910 858 2092 -2475 -1418 2290 -337 -881 1891 -991 -2663 1524 1384 -1927 1004
3368 1004 1389 -2717 -304 2334 -789 -127 1702 -2518 -1822 3453 704 -2746 659 457 -1988 1599
3384 1599 2014 -1967 -58 1639 -2247 107 3391 -1131 -2302 1617 -143 -1312 2927 567 -3299
3399 -3299 -114 1532 -1127 1103 1797 -3176 -985 3442 -407 -1379 2369 -362 -2602 1241 1070 -1146
$$ packed form
3288G94R34k671N38J399k041N02K707k208j126J951r36o72K575j164k134K026
3304D74O74k702J616K301l176l51K236j256K8K069k445j634L512j48k709K148
3320F37M47k932J352K526k847K72K044k649l62L252r47j851K081j213k413M131
3336A528R57m412Q22K483k460R36J990k902k79L003k168j426M242r42m031K118
3352e41J740k109J768J234m567J057L708k627n44K772k882j672M187j40l311K931
3368A004L85m106K413K638l123O62J829m220O96N275k749l450L405k02k445L587
3384A599M15l981J909J697l886K354L284m522j171L919j760j169M239k360l866
3399c299L185J646k659K230O94m973K191M427l849r72L748k731k240L843j71k216
$$ plain form
3415 -1146 1401 15 -3779 839 3679 -1459 -1543 1349 -1361 -866 2970 187 -2404 1229 347 -2394
3431 -2394 1952 2202 -2608 -382 1341 -1914 249 3541 -1424 -3325 1274 645 -843 1758 -359
3446 -359 -3459 1517 2152 -2352 482 2152 -2441 -1598 2490 57 -101 1742 -1713 -2483 2810 1900
3462 1900 -2381 472 1014 -2534 839 3006 -1637 -1173 1766 -1260 -907 2827 -132 -2037 1335 99
3478 99 -2074 2290 2393 -2806 -1005 1611 -671 596 1882 -2085 -1437 2572 -153 -1721 1627 502
3494 502 -2434 385 1561 -941 1040 931 -2765 -546 3039 -418 -1410 1239 -1188 -1632 2417 778
3510 778 -2524 721 959 -1840 635 1805 -1652 -552 1208 -1626 -540 3043 -75 -2559 493
3525 493 754 -690 1474 411 -2510 861 1945 -1899 -391 1909 -924 -1306 1218 247 -363 1559
$$ packed form
3415a146K547j386l794M618K840n138q4K892k710M95L836k783k591L633q82k741
3431b394M346K50m810K226J723l255K163L292m965j901M599o29j488K601k117
3446c59l100M976O35m504K834J670m593Q43M088k433j58J843l455p70N293r10
3462A900m281K853N42l548L373K167m643M64K939l026L53L734k959j905L372j236
3478I9k173M364J03n199J801K616k282J267J286l967O48M009k725j568L348j125
3494E02k936K819J176k502J981j09l696K219L585l457r92K649k427m44M049j639
3510G78l302L245K38k799K475J170l457J100J760k834J086L583l118k484L052
3525D93K61j444K164j063k921L371J084l844J508K300k833l82K524r71o10J922
$$ plain form
3541 1559 -681 -2323 1454 1856 -1207 8 903 -1482 -7 1731 -816 -1252 1232 -452 -1122 1050
3557 1050 488 -1178 653 261 -1690 1041 1948 -1575 -1030 847 84 139 961 -819 -876 1696 422
3574 422 -1461 830 1235 -1177 -209 699 -128 429 844 -1176 -818 1343 59 -1018 615 -48 -1187
3591 -1187 946 842 -1225 -8 573 -493 -15 369 -624 77 769 -834 -1022 1105 994 -1298 -533
3608 -533 618 8 556 -288 -991 302 1022 -778 -909 892 38 -624 -100 96 -206 764 186 -1155
3626 -1155 232 610 -87 -231 193 -393 -226 1046 -491 -854 354 787 -322 -144 29 76 853 -155
3644 -155 -979 216 1420 153 -913 -45 788 220 -126 -728 -53 1145 188 -1031 85 588 117 -145
3662 -145 -18 353 244 341 -92 -454 200 253 -92 10 -256 -367 687 449 -466 -397 374 551 -439 -558 123
$$ packed form
3541A559k240j642L777M02l063J215Q95k385J475J738k547m36K484j684o70K172
3557A050n62j666J831l92j951K731R07l523N45J877p63N5Q22j780n7K572j274
3574D22j883K291M05k412R68R08q27N57M15k020L58K161j284j077J633o63j139
3591a187K133j04k067J217N81j066M78L84r93P01O92j603j88K127j11k292P65
3608e33J151o10N48q44p03J293P20j800j31J801q54o62N24J96l02R70n78j341
3626a155J387L78o97j44M24n86J67J272j537l63J208M33j109J78J73M7P77j008
3644a55q24J195J204j267j066Q68Q33n68l46o02O75J198r57j219J116N03m71k62
3662a45J27L71j09R7m33l62O54N3l45J02k66j11J054k38r15O9P71J77r90j19O81
$$ plain form
3683 123 484 337 -370 -836 715 674 -364 -663 189 486 -314 -345 -70 244 320 -122 -167 29 215 -208 -75
3704 -75 245 -167 57 106 36 -445 -36 476 279 -435 -488 -166 745 94 -848 -165 678 508 -635 -590 451
3725 451 662 -1 -955 -162 821 358 -691 -463 268 344 -34 -436 -115 402 364 -162 -412 10 98 14 -89
3746 -89 -316 -272 796 496 -624 -464 353 486 -2 -621 -12 571 653 -647 -966 377 561 -519 -535 -64
3766 -64 264 531 -11 -568 464 546 -130 -349 264 45 104 500 -334 -424 507 265 -197 93 -270 -27 479
3787 479 140 -905 -43 639 -184 -561 191 -144 45 367 -592 -518 924 137 -1061 -108 601 -49 46 98
3807 98 -559 58 927 -209 -750 319 -11 -488 614 57 -629 384 630 -955 -322 1007 169 -432
3825 -432 161 -644 253 1449 -519 -1658 789 718 -531 223 249 -573 250 666 -790 -32 1457 -520
$$ packed form
3683A23L61j47p07m66J551m1j038k99Q52K97q00l1K75L14P6m42m5J96J86m23J33
3704g5L20m12K24M9p0m81M09N12j97p14n3L22R11o51r42O83Q43j70j143M5J041
3725D51K11o63r54P93R83m63j049K28P31P6l78m02L21N17l8n26k50M22Q8q4j03
3746h9k27M4J068l00j120J60Q17J33m88o19O09N83Q2j300l19J343J84j080j6M71
3766f4L28K67n42n57J032Q2o76k19O13k19N9L96q34r0R31k42m62K90l63K43N06
3787D79l39j045Q62O82q23l77P52l35J89L22r59P4J442p87j198R53P09o50R5N2
3807I8o57O17Q69j136n41J069l30m77J102n57o86J013K46j585O33J329q38o01
3825d32N93q05Q97J196j968j139K447p1j249P54K6q22Q23M16j456P58J489j977
$$ plain form
3843 -520 -1095 1055 96 -544 821 -146 -1154 831 1238 -759 -631 626 -953 37 981 -707 -797 1299
3861 1299 -287 -1418 1070 597 -738 270 -258 -1119 837 1443 -1260 -1075 1279 -272 -624 1207
3877 1207 -564 -1371 1044 492 -1177 1105 816 -1585 -14 1276 -1167 70 1681 -1408 -1810 1742
3893 1742 643 -1097 427 -507 -1342 1353 1193 -1784 -93 1600 -1372 -579 2024 -597 -809 1030
3909 1030 -828 -1080 2311 603 -1942 252 792 -977 1012 1652 -1914 -717 1997 -361 -923 1667
3925 1667 -386 -1461 1277 18 -1544 1831 786 -2849 -218 2403 -489 -907 1052 -1258 -472
3940 -472 2330 -77 -1831 1582 224 -1742 1207 1675 -1665 -223 1069 -1954 -332 2790 -777
3955 -777 -1519 956 -646 -759 2410 16 -2826 704 1503 -1222 330 1431 -1681 -776 1639 -811
$$ packed form
3843e20n75K150r59o40J365r67j008J985M07j997J28J257j579R90R44j688r0K096
3861A299j586j131K488m73j335J008n28q61J956O06k703J85K354j551l52J831
3877A207j771q07K415n52j669K282k89k401J571J290k443J237J611l089m02L552
3893A742j099j740J524r34q35K695j60k977J691J693k972P93K603k621k12J839
3909A030j858k52L391j708k545K194N40j769J989O40l566J197K714k358n62K590
3925A667k053j075K738j259j562L375j045l635K631K621k892m18J959k310P86
3940d72K802k407j754L413j358j966K949M68l340J442J292l023J622L122l567
3955g77p42K475j602j13L169k394k842L530P99k725J552J101l112R05K415k450
$$ plain form
3971 -811 -260 2571 -938 -2581 1337 1071 -1207 728 234 -2437 511 2440 -1242 -907 1417 -1216
3987 -1216 -924 2433 -118 -1660 1616 -62 -2416 1173 2034 -1499 -347 692 -1431 677 2599
4002 2599 -1750 -2285 2156 397 -1463 1474 141 -1884 798 649 -1699 1029 1839 -2548 -1149 2362
4018 2362 -137 -680 1634 -1301 -1788 2071 1306 -1457 669 306 -1694 989 1441 -1837 -416 2262
4034 2262 -1655 -1595 2277 584 -1432 607 -373 -1298 1962 1428 -2691 -83 1661 -1084 -265 1664
4050 1664 -1103 -1334 1512 -477 -841 1981 311 -2105 581 1125 -1264 777 1216 -2498 -668 2184
4066 2184 -90 -844 814 -796 -989 1661 -24 -1669 1232 1120 -2242 94 2013 -560 -574 365
4082 365 -1080 -38 2198 -221 -1901 1115 566 -1359 549 594 -1485 238 1046 -1071 9 1513
$$ packed form
3971h11N51K831l509j643L918k66k278J935m94k671K948J929l682L35K324k633
3987a216K92L357k551j542L276j678k354L589Q61l533J152J039k123K108J922
4002B599m349n35M441j759j860K937j333k025K682j49k348K728Q10m387J399L511
4018B362k499n43K314k935m87L859p65k763K126l63k000K683M52l278J421K678
4034B262l917O0L872j693k016K039r80r25L260n34m119K608J744k745Q19J929
4050A664k767k31K846j989l64K822j670k416K686N44k389K041M39l714J830K852
4066B184k274p54J658j610j93K650j685j645K901j12l362K336J919k573j4R39
4082C65j445J042K236k419j680L016n49j925J908M5k079J723Q08k117J080J504
$$ plain form
4098 1513 -567 -917 880 97 -381 1447 -12 -2063 559 1915 -814 -419 353 -871 346 1309
4114 1309 -919 -353 1543 -315 -1740 844 911 -632 148 -140 -1021 963 1109 -1232 -624 1212 -402
4131 -402 -523 688 -348 -880 856 251 -889 436 949 -656 -354 459 -863 543 876 -1275 -828
4148 -828 1420 341 -875 -184 -75 -106 772 191 -875 760 1327 -942 -797 963 184 -120 418 -345
4166 -345 -329 830 346 -1044 161 135 -420 171 168 -793 -194 1030 -361 -510 492 371 -312 113 -270
4185 -270 -334 570 548 -1172 -172 950 16 -522 -560 -78 198 565 -497 -726 364 382 -701 -305 490
4204 490 -16 348 -158 -691 362 626 52 -663 -25 -107 -29 410 -306 -537 323 423 -645 -357 242 307
4224 307 101 -486 -301 182 457 -402 -903 242 855 -422 -611 -216 501 203 -254 -656 -48 563 -237
$$ packed form
4098A513k080l50J797p83m78J828j459k051K622J356k729L95P72j224J217R63
4114A309k228N66J896j858j425K584O7j543P80k88q81J984J46k341O08J836j614
4131d02j21J211j036n32J736o05j140J325N13j605L02Q13j322J406L33k151M47
4148h28K248j079j216O91J09l1Q78n81j066J635N67k269J45J760p79l04N38p63
4166c45J6J159m84j390J205k6n55N91lr61N99J224j391j49J002j21o83M25l83
4185b70o4R04k2j720J000J122r34n38l8M82K76L67j062k29J090J8j083L96P95
4204D90n06L64n06n33J053K64n74p15O38q2P8M39p16k31Q60J00j068K88N99O5
4224C07k06n87J85M83K75q59n01J145O13j277j89L95P17k98m57m02O08O11q00
$$ plain form
4243 -237 -457 -270 437 -95 -246 -256 -348 151 170 -33 -521 243 168 245 64 -547 -137 502 490 -657 -398 695
4265 695 466 -141 -392 -293 784 607 -481 -118 712 453 -166 -542 266 137 273 -504 -244 207 534 252
4285 252 -241 -132 11 247 167 -102 -559 49 394 71 -205 15 304 556 -100 -620 249 625 -81 -704
4305 -704 -392 742 290 -656 -266 34 543 -239 -900 -104 446 5 -433 -371 -187 380 451 -328 -433 404
4325 404 206 -197 -257 38 -15 492 352 -541 -18 424 172 -340 -393 -275 536 270 -490 -603 1052 476 -727
4346 -727 -305 252 240 -2 -157 -322 240 638 -239 -447 288 245 -465 303 -227 -304 465 389 -423 -46 560
4367 560 -6 -18 -41 -811 -305 1073 -31 -1089 372 633 -301 4 -9 -361 643 307 -876 -185 971
4386 971 -205 -739 410 -50 -232 734 -368 -962 545 499 -726 103 444 -650 258 700 -977 -341
$$ packed form
4243b37k20J87P07n32j51j0r2M99J9k03m88P64p5P7j81o11M10O39j2j147K59J093
4265F95k29o07k51R9J077j77j088L63Q30k59o19l76Q08j29J36p77K60M51L27k82
4285B52m93J09J43K36q0k69m57O08L45l23k76K20K89K52o56n20Q69L76p06o23
4305g04L12J134m52r46L90L00N09p82o61P96N50m41m38O2J84N67P1p79j05Q37
4325D04j98m03o0K95n3N07j40q93N23M42k52n12n3J18Q11k66p60j13J655n76j203
4346g27M22N57j2k42j55j65N62L98q77k08P35m3p10P68n30p7P69p6q12L77O06
4367E60n66j2k3p70N06J378j104j058J461K61r34L05j3l52J004l36j183O91J156
4386I71j176n34J149m60j82R66j102n94J507m6j225Q29L41j094R08M42j677O36
$$ plain form
4404 -341 1127 -432 -988 502 252 -192 572 -360 -1278 686 809 -876 -544 670 -159 -469 564 -349
4422 -349 -317 823 -426 -1145 765 904 -1025 -307 275 -787 254 1074 -904 -782 1013 -44 -584
4439 -584 793 -100 -1152 777 536 -1278 513 1183 -1182 -667 874 -169 115 723 -863 -1052 1571
4456 1571 535 -1349 450 586 -1043 288 1059 -951 64 1146 -991 -349 1677 -28 -1000 601
4472 601 -342 -1192 1435 1048 -1654 21 891 -778 129 1015 -1033 -501 1387 -900 -1030 1576 417
4489 417 -1688 623 577 -789 1221 613 -2007 -143 1680 -717 -854 1150 -839 -1030 1454 338
4505 338 -1436 917 550 -1507 462 1285 -835 -101 633 -1517 -192 2199 -474 -1728 847 236
4521 236 -791 944 330 -1879 475 1002 -1421 99 1799 -1187 -1026 1096 -32 -740 1507 -638
$$ packed form
4404c41J468j559n56J490k50m44P64r32r18J964J23j685L32J214q29l10J033r13
4422c49L2J140j249p19J910J39j929P18N82j062J041Q20j978J22J795j057n40
4439e84J377q93j052J929k41j814J791O70k365N15J541j043K84O08j586j89K623
4456A571j036j884J799J36j629J331P71k010J015J082k137O42K026j705r72J601
4472F01r43q50K627l87k702J675Q70j669R07Q86k048N32J888k287j30K606j159
4489D17k105K311m6j366K010o08k620J864J823k397j37K004j989j91K484j116
4505C38j774K353l67k057J969Q23k120P34P34k150J325K391k673j254K575o11
4521B36j027J735o14k209K354N27k423J520J700k986J61K122j128p08K247k145
$$ plain form
4537 -638 -1963 747 1199 -931 851 605 -1625 131 1765 -660 -743 1573 -607 -1299 1235 230
4553 230 -1049 1191 -110 -2079 797 1718 -1022 -898 930 -560 -150 1771 -614 -1170 1344 110
4569 110 -1368 1176 667 -1518 72 1040 -1196 422 1731 -1188 -1294 1073 135 -417 1156 -774
4585 -774 -1773 1229 828 -1522 266 1158 -1388 -275 939 -721 -235 1262 -1024 -1297 2226 439
4601 439 -1722 504 101 -901 743 805 -1493 -372 1317 -663 -351 1312 -611 -793 1024 -272
4617 -272 -945 1105 490 -1771 -209 1042 -400 328 724 -1505 -369 1705 -359 -1142 1011 102 -1062
4634 -1062 361 411 -821 569 792 -1342 3 1627 -462 -1004 907 -379 -536 1406 71 -1070
4650 -1070 452 664 -798 597 369 -970 176 1213 -990 -384 1569 -31 -1201 415 469 -289
$$ packed form
4537f38j325K710M52k130J782k46k230J756J634k425q3K316k180o92K534j005
4553B30j279K240j301j969K876R21k740J24J828j490M10J921k385n56K514j234
4569A10j478K544n09k185J590R68k236J618J309k919j06K367r38n52J573j930
4585g74r99L002m01k350J788Q92k546J113J214j660M86J497k286k73L523j787
4601D39k161K226m03j002J644O2k298J121J689j980L12J663j923j82J817j296
4617b72o73K050o15k261J562J251j442P28L96k229J136K074k064p83K153r09j164
4634a062J423N0j232J390K23k134J345J624k089n42J911j286j57J942j335j141
4650a070J522K12j462J395k28j339J146J037k203O06J953j600j170J616N4p58
$$ plain form
4666 -289 713 -407 -1207 412 1184 -631 -357 720 -572 -520 413 -299 -360 856 -248 -1179 454 646
4684 646 -416 141 200 -914 272 1136 -685 -1136 462 263 -605 392 -342 -599 811 110 -1032 275
4702 275 814 -572 -694 461 -27 -26 543 -602 -484 1016 342 -606 240 324 -334 287 133 -520 320 648
4722 648 -312 -469 416 99 -246 451 -258 -242 811 507 -429 -154 742 -52 30 -95 -233 144 345 -378
4742 -378 -433 362 325 -490 -198 93 80 42 -39 -571 -150 569 -105 -349 71 -59 -177 377 -454 -533 233 505
4764 505 -218 -415 208 334 91 -161 -310 -38 645 -404 -690 457 439 -34 -261 -390 -63 125 42 -286
4784 -286 -273 681 37 -523 -72 59 272 146 -245 -192 321 244 -295 -348 192 186 142 156 -324 -19 330 11 -327
4807 -327 4 -134 571 -79 -352 -201 401 514 -191 -737 291 384 -153 -301 -132 399 229 -370 -481 397
$$ packed form
4666b89J002j120q00J619P72j815K74J077j292N2R33p12o1J216j104r31J633J92
4684F46j062N57N9j114J186Q64j821m51J598j99q68R97p34k57J410p01j142J307
4702B75N39j386j22J155m88JN69j145J18J500o74r48Q46Q4o58O21j54o53Q40L28
4722F48r60j57Q85l17l45O97p09J6J053l04r36K75Q96p94Q2j25j38L77K01p23
4742c78n5P95l7q15K92K91j3l8q1n32M21P19o74k44M20j30j18N54q31p9P66K72
4764E05p23j97O23J26k43k52j49K72O83j049k86J147j8m73k27j29L27J88q3l28
4784b86J3R54o44n60M51J31K13j26l91N3N13p7n39n3N40om4J4m80L05L49l19l38
4807c27L31j38P05o50k73J51O02J13p05n46J028R3n37j48J69N31j70n99j11Q78
$$ plain form
4827 397 589 -151 -316 85 -16 305 138 -353 -127 378 -90 -170 -140 -117 307 117 -13 -445 6 338 110
4848 110 -416 -272 316 258 38 -606 -64 436 76 -571 -291 319 217 -206 -22 98 181 280 -123 -324 329
4869 329 201 -173 77 -234 -4 244 -122 -448 1 30 49 145 108 -178 342 365 -374 -513 360 473 -40 -309
4891 -309 323 290 -10 44 -377 123 722 -352 -608 264 346 -214 122 -47 -273 633 221 -196 -2 340 63
4912 63 134 -47 -138 164 267 -181 -415 333 228 -112 92 -266 89 346 514 -553 -264 565 -91 -362 -236
4933 -236 -135 -45 412 36 -361 390 179 -610 -177 233 -243 -59 9 -729 215 732 94 -663 172 62 -426
4954 -426 530 -203 -721 -29 652 -516 -316 556 -274 -306 126 -404 -82 877 -6 -761 317 586 -646
4973 -646 -35 48 -680 23 735 -649 -286 852 -207 -315 380 -114 -257 407 44 -889 260 749 -551
$$ packed form
4827C97J92p40j65M01j01L21j67m91K26N05m68q0L0K3M24j90j30m32M51L32k28
4848A10n26J44N88n8k20o44N42N00l60o47K80O10j02m23J84J20Q3R9m03k01O53
4869C29j28l74K50l11K30K48l66l26M49K9J9R6l7k86N20K3p39j39Q73J13n13k69
4891c09O32l3l00N4m21N00N99j074k56Q72Q2n60L36j69k26R06m12m17J94L42k77
4912F3P1j81r1L02J03m48k34P48j05l40K04l58L55K57J68j067K89Q29o56k71J26
4933b36J01R0M57l76l97P51k11p89M33M10m76J84O8p38R44N17o38p57Q35j10m88
4954d26R56p33n18O92O81j168K00Q72q30l2M32n30L22R59q83p55J078K69j232
4973f46O11Q3p28P03P12j384L63J138j059j08O95m94j43O64l63r33J149M89j300
$$ plain form
4992 -551 -83 199 -402 172 947 -623 -719 806 81 -898 307 456 -511 4 64 -934 387 1003 -772
5011 -772 -817 857 -314 -497 685 -361 -1062 710 316 -1111 409 724 -1012 -33 779 -533 -545 869
5029 869 -680 -805 1001 184 -1064 281 -72 -579 779 514 -842 -51 989 -698 -390 1105 -353
5046 -353 -906 602 -95 -1091 843 567 -1171 215 745 -722 376 731 -1184 -370 1029 -333 -317
5063 -317 853 -217 -927 620 26 -680 741 782 -1299 -106 1270 -356 -485 641 -281 -400 1508
5080 1508 -8 -1147 762 395 -1029 611 666 -805 -55 677 -1052 -361 1394 -446 -827 749 73
5097 73 -674 1152 -146 -1540 623 937 -906 344 830 -980 -195 1153 -566 -651 1110 -352 -1236
5114 -1236 882 802 -843 313 101 -1326 499 1287 -1056 -552 1023 -605 -350 1139 150 -1126 707
$$ packed form
4992e51M68K82o01N74P75j570r6J525p25r79J205J49r67N15O0r98J321O16j775
5011g72m5J674j171j83J182j046p01J772l94j427J520L15j736R79Q12j312j2J414
5029H69j549j25J806q17j248J345l53n07J358k65j356P91J040j687L08J495j458
5046c53n53J508o97r96J934k76j738J386N30j467J098L55j915Q14J399j362J6
5063c17J170j070p10J547n94p06J421M1k081J193J376j626j29J126r22j19J908
5080A508j516j139J909l67j424J640N5j471P50P32j729O91J755j840l81J576o76
5097G3p47J826j298j394K163L14j843J250M86j810P85J348j719q5J761j462q84
5114a236K118q0j645J156k12j427J825P88k343N04J575j628K55J489r89j276J833
$$ plain form
5131 707 320 -1007 608 829 -1240 -360 539 -638 61 1269 -727 -966 967 44 -1030 637 -113
5148 -113 -1151 664 597 -1016 202 853 -1252 -542 1075 -682 -355 808 -220 -897 965 339 -988
5165 -988 336 449 -1241 541 617 -468 -419 862 -349 -861 1011 22 -653 374 137 -735 1015 740
5183 740 -1564 -243 1156 -427 -93 921 -247 -329 908 17 -815 631 504 -999 360 628 -612
5200 -612 229 388 -867 -194 967 -29 -297 517 -141 -976 453 101 -800 298 394 -863 30 544 -447
5219 -447 -157 573 -504 -315 785 -16 -945 392 239 -547 320 279 -761 272 863 -264 -122 702
5237 702 -453 -170 447 108 -450 512 126 -836 408 443 -296 -180 434 -266 142 817 -404 -444 699
5256 699 45 -603 542 277 -502 354 373 -403 301 476 -449 -373 422 -153 -253 615 -282 -484 500 131
$$ packed form
5131G07l87j327J615K21k069Q80Q99j177O99J208j996k39J933r23j074J667p50
5148a13j038J815o7j613J218O51k105P10J617j757L27J163j028o77J862o26j327
5165i88J324J13j690J782P6j085M9J281j211n12J872r89o75J027k37q72J750k75
5183G40k304J321J399j583L34J014j168q2J237q91q32J446j27j503J359K68j240
5200f12Q41J59j255O73J161r96k68Q14o58q35J429l52r01J098R6j257Q93N14r91
5219d47K90P30j077J89J100q01r29J337j53p86Q67m1j040J033N91j127J42Q24
5237G02j155K83O17l39n58R62l86r62J244L5p39J16O14p00M08O75j221m0J143
5256F99o54o48J145k65p79Q56J9p76P04J75r25P6P95n75j00Q68q97k02R84l69
$$ plain form
5276 131 -605 54 420 -133 46 395 -444 202 575 -223 -559 210 387 -430 57 -149 -294 466 296 -506
5296 -506 -37 456 -159 -290 338 -172 87 347 -81 -438 288 76 -369 322 182 -138 125 341 -313 -263
5316 -263 427 -65 -485 196 182 -304 208 86 -113 243 259 -373 -14 277 16 -183 -175 132 -41 330 -91
5337 -91 -317 186 191 -110 307 373 -43 192 414 -163 -99 52 -80 -215 -113 247 173 117 -45 -358 39 440
5359 440 -27 -304 -164 -63 153 94 -133 217 214 -63 -144 35 155 -148 -54 -94 -37 298 279 -249 -61 115 219
5382 219 -34 -100 157 28 137 279 -76 87 -224 173 -175 -467 -273 0 -98 -149 -330 322 48 -242 59
5403 59 93 -27 -184 182 -126 284 -37 43 -386 56 77 29 195 -131 -14 278 -110 -11 84 55 -91 -190 -48
5426 -48 -165 19 244 -36 -242 -9 205 -21 234 -408 338 326 256 -46 -42 225 68 -147 -117 18 -160 167
$$ packed form
5276A31p36O59L66n53J79L49q39O46L73p98l36P69J77q17M87k06j45P60j70q02
5296e06M69M93o15j31O28n10K59K60m28l57P26k12m45O91j40l20K63K16o54N0
5316b63O90m92m20O81j4m86N12j22j99L56J6o32L59K91k61j99QL07j73L71m21
5337i1k26N03Nl01M17O6m16K35K22n77O4J51j32j35J02L60p4n6j62l13L97M01
5359D40m67k77J40J01K16n9k27L50lk77q1J79J20l03R4m0N7L35j9n28J88J76J04
5382B19k53o6K57j29J09J42l55J63l11L97l48k92J94K73r8n1j81O52k74k90L01
5403E9L4j20j57L66l08M10l21Q0m29M42K1m8J66l26J17K92l88R9R5k9j46r9J42
5426d8j17J84K25k80k06K33K14k26K55o42P46j2p0l02MK67j57k15L0J35j78L27
$$ plain form
5448 167 -35 -332 33 207 -41 -126 321 -160 -127 52 -144 -271 210 110 -62 96 261 -61 77 -61 -244
5469 -244 41 241 -225 -62 -10 2 -167 21 -188 -15 220 -249 -213 335 260 -310 234 15 -191 342 556
5490 556 -375 -311 668 -35 -99 -3 -2 -277 68 -190 -358 146 91 -471 -132 383 -42 -98 369 -388 -176 546
5512 546 27 -482 -110 135 -40 120 104 -429 -90 497 -383 -128 569 -32 -443 324 166 -309 778 -170
5532 -170 -515 170 217 -468 -59 316 -146 -135 534 -219 -353 511 -177 -583 356 192 -156 394 23 -623 242
5553 242 591 -149 -131 452 -159 -130 504 -291 -185 444 -102 -777 88 483 -333 26 411 -360 -256 839
5573 839 -277 -600 466 -7 -427 499 -52 -664 350 282 -866 210 481 -430 -501 286 81 -345 647
5592 647 -219 -643 500 396 -714 144 394 -692 180 355 -504 -90 406 -381 -353 664 -279 -500 479
$$ packed form
5448A67k02k97L65J74k48q5M47m81L3J79j96j27M81j00j72J58J65l22J38j38j83
5469b44K85K00m66J63N2J2j69J88k09J73K35m69L6N48p5n70N44k19k06N33K14
5490E56r31O4R79p03o4R6Jk75L45k58j68N04n5n62L39N15m25n6M67p57K12P22
5512E46n19n09L72K45j75J60j6n33L39N87q80K55O97o01m11P67j58m75J087r48
5532a70l45O85M7o85M09L75m62J1O69p53j34Q64o88m06R39j64l48N50l71o46Q65
5553B42L49p40J8N83o11K9O34p95J06O29n46o75Q65L95q16L59L85p71J04J095
5573H39j116l23J066m73m20R26n51o12J014o8j148J076K71r11p1P87k05m26R92
5592F47q66m24J143j04j110Q58K50j086Q72J75q59M14M96p87K8J017r43k21R79
$$ plain form
5611 479 -229 -264 519 486 -513 170 712 -179 -124 740 -531 -557 825 -3 -753 864 244 -679 241 340 -489
5632 -489 56 633 -713 -268 740 -367 -440 521 -273 -415 591 168 -806 155 338 -604 -102 409 -380
5651 -380 -289 585 -459 -422 1116 -93 -681 377 190 -501 350 407 -711 5 640 -751 -6 640 -481
5670 -481 -473 454 162 -257 763 211 -1058 292 434 -546 118 633 -506 1 702 -514 -428 602 -123
5689 -123 -525 641 120 -555 -36 148 -952 378 685 -779 -141 691 -347 -298 547 -315 -761 687
5707 687 142 -401 457 555 -920 -77 824 -495 39 1112 -294 -266 614 -156 -397 250 116 -916 544
5726 544 670 -467 -33 361 -566 -162 500 -175 -271 275 -231 -410 417 189 -404 101 295 -510 -5 740
5746 740 -538 69 673 -160 -284 431 1 -416 365 177 -781 409 418 -556 89 308 -332 189 496 -226
$$ packed form
5611D79p08l5P83l3r99O83N42q91N5Q64j271k6J382q28p50J617o20r23R20R9q29
5632d89N45N77j346M45J008j107p3R61p94j42J006m23r74R61J83r42N02N11p89
5651c80R1Q74j044L7J538j209n88J058j87o91Q51N7j118P16O35j391P45O46j121
5670d81QR27k92m19J020n52j269J350J42r80O64N15j139N07P01j216Q6J030p25
5689a23m02J166n21o75N19J84j100J330L07j464O38Q32j038M9Q45q62m46J448
5707F87n45n43Q58R8j475Q43R01j319N34J073j406K8Q80p70k41O47j34j032J460
5726E44J26j137M34L94r27M04O62o75r6N46n06j79Q27k28n93N05J94q05N05P45
5746G40j278O07O04q33j24P15m30m17P81j88r58J190Rr74O45K19o40N21L07p22
$$ plain form
5766 -226 -306 657 179 -149 545 -146 -498 43 284 -555 111 618 -357 -193 600 -97 -172 313 -340 -572 448
5787 448 122 -476 250 576 -183 151 575 -155 51 435 -234 -253 599 -256 -178 330 81 -272 337 371 -727
5808 -727 -64 492 -33 -287 686 -622 -387 341 -216 -285 349 225 -423 140 252 -404 -83 331 -376 -147
5828 -147 387 -398 -339 118 -123 -68 136 128 -440 195 27 -279 13 493 -57 -128 592 -162 -78 73 -116 -445
5850 -445 149 -51 -212 14 138 -139 -103 274 -257 175 117 184 -169 63 -49 -151 21 228 -210 10 304
5871 304 -26 -173 197 32 80 129 220 -123 204 87 -319 -222 398 -37 55 115 -254 -272 197 -155 -113 167 134
5894 134 182 -76 146 -378 -242 25 123 -72 68 -232 74 16 50 -328 287 -186 5 142 104 -282 -49 -147
5916 -147 -41 -186 -273 -299 58 243 -294 -33 44 -257 -108 -260 -182 -42 -14 225 -388 -76 162 27 -110 -129
$$ packed form
5766b26q0R63m78l28O94o91l52N41K41q39O66N07r75J64P93o97p5M85o53k32J020
5787D48l26n98P26L26p59L34M24p30K06L84o69j9Q52q55P8N08k49l53O09L4j098
5808g27O63N56n25k54R73j308K35P28n57o9O34j24o48N63J12o56L21M14p07K29
5828a47N34p85N9M57k41N5K04qn68O35j68l06K92M80n50p1P20p54Q4J51j89l29
5850d45N94k00j61K26J24k77L6L77n31M32n8O7l53K32j12j02J72K07m38K20K94
5871C04l30j47L70j65M8M9R1l43L27j17m06R7O20m35R2O0l69j8M69l52M2K80l3
5894A34M8k58K22n24J36K67R8j95J40l00L06n8L4l78O15m73J91J37l8l86K33r8
5916a47J06j45q7k6L57J85n37K61P7l01J49j52P8J40K8K39o13L12K38j35j37j9
$$ plain form
5938 -129 64 -92 -47 149 -91 -93 313 22 -33 -80 4 -107 109 -341 -266 -57 159 -164 105 -74 243 335 -273
5961 -273 -104 148 69 -90 50 -125 -189 28 -13 -47 30 -73 276 -120 -10 140 -26 -155 180 -227 -79 18
5983 18 -111 -128 152 -87 -20 -3 14 22 195 -21 -130 233 65 -7 -79 90 -265 -39 403 -226 -23 230 11
6006 11 26 159 40 -89 -30 57 -64 66 211 -96 -74 126 -11 118 -21 97 -107 4 -52 -195 258 205
6028 205 -26 150 138 -91 -48 49 -55 -207 66 -157 -25 119 -38 -13 -3 -146 -399 281 101 -323 130 -58
6050 -58 -288 120 287 -263 -100 164 173 -163 121 216 -35 207 36 -100 16 115 3 -310 144 -259 -172 405
6072 405 15 -50 466 326 -209 205 424 -215 -4 312 -224 -144 90 -103 -229 162 -118 -389 83 -198 -198
6093 -198 253 221 -380 -52 238 -289 -190 262 -16 37 431 -57 -614 -72 55 -211 364 411 -270 20 10 -302
$$ packed form
5938a29J93j56M5J96k40kM06k91n5m7Q4j11K16m50P5K09K16l23K69j79L17R2o08
5961b73J69K52p9j59J40j75o4K17m1l4P7j03L49l96J10J50j66j29L35m07J48R7
5983A8j29j7K80k39O7J7J7QJ73k16j09L63j68p2p2J69l55K26M42o29K03K53k19
6006A1J5J33j19j29N9Q7j21J30J45l07K2K00j37J29j39J18k04J11n6j43M53n3
6028B05k31J76j2k29M3R7j04j52K73k23J32J44j57K5J0j43k53O80j80m24M53j88
6050e8k30M08J67n50J63K64Rl36K84R5k51K42j71j36J16R9j12l13M54m03Q7N77
6072D05l90o5N16j40n35M14K19o39K11L16n36Q0K34j93j26L91k80k71M72k81%
6093a98M51l2o01L28K90n27R9M52k78N3L94m88n57N42J27k66N75M7o81K90j0l12
$$ plain form
6115 -302 -303 183 -120 -341 177 -145 -300 228 55 -615 86 77 -319 17 507 -210 61 122 -325 -169 385 -175
6137 -175 -284 350 195 -375 274 104 -458 10 300 -360 -30 404 -82 -381 378 31 -377 403 103 -490
6157 -490 224 466 -415 62 285 -390 -218 582 -294 -166 680 -11 -239 273 -67 -323 123 222 -358 446
6177 446 475 -279 -335 304 -231 -484 489 -74 -421 619 417 -541 560 434 -764 -84 515 -131 -205 638
6197 638 -375 -464 469 -14 -355 478 391 -420 180 513 -487 198 296 -525 -282 151 6 -455 493 -109
6217 -109 -209 406 9 -394 47 318 -261 -28 542 -296 15 602 -458 -94 704 228 -449 560 345
6236 345 -403 220 375 -532 66 587 -375 -234 537 -109 -372 650 16 -554 481 -93 -556 152 195 -385
6256 -385 -96 161 -423 -34 494 -194 -509 954 -40 -241 372 74 -395 191 282 -509 83 352 -429 -211
$$ packed form
6115c02jM86l03k21N18l22j55N28j73o70P01rl96L36M90p17K71O1m47J56N54n60
6137a75j09O34j55n70O49j70n62M68K90o60L30M34m86k99P59l47m08P80l00n93
6157d90P14K42q81M77K23o75J72Q00q76J28Q46o91k28N12l40k56M46R9n80Q04
6177D46K9p54n6O39n35k53R73n63l47J040k02r58J101j26j198O80N99o46p4Q43
6197F38j013q9R33m83l41Q33q7q11O00L33j000O85R8q21K43M33j45m61R48o02
6217a09j00O15l97m03M41K71n79K33N70q38L11N87j060L64P98m76o77J009k15
6236C45p48O23J55r07N98N21r62J41P71o46k63J022o34n70J035n74m63P08M3n80
6256c85K89K57n84L89N28o88l15J463r94k01O13k98m69N86R1p91N92K69p81K18
$$ plain form
6276 -211 288 -348 -305 298 -132 -284 340 189 -315 233 -67 -613 -2 255 -160 -97 438 -249 -342 386 -30
6297 -30 -105 60 -130 -174 353 350 -229 266 213 -209 -66 659 -148 -577 217 -160 -285 267 362 -135 268 182 -497
6320 -497 45 623 -32 -174 288 -189 -208 240 79 -334 503 170 -284 278 43 -341 154 269 -274 -189 226
6341 226 -18 -170 435 193 105 46 -95 -390 57 26 -275 0 252 6 -368 240 52 -149 123 -193 -236
6362 -236 303 70 -382 -63 179 -533 -98 14 -87 -12 338 52 20 123 -169 -449 -155 -1 -34 281 54
6383 54 -215 -186 -74 -70 -85 173 -174 -215 270 34 -78 -3 -93 -79 20 -1 -356 -268 138 -276 -234 13 -154 -255
6407 -255 234 -76 -196 112 -4 -231 33 238 45 210 65 73 -85 -74 142 -220 123 21 -329 18 43
6428 43 -87 -19 -24 -185 -118 94 -365 -263 143 -69 -87 43 -61 -110 128 -92 -158 173 213 -101 73 48 103 -73
$$ packed form
6276b11M99o36M3O03m30j52O24j51n04N48l00n46O11K57m15O3N35o87r3P28m16
6297c0p5J65j90m4N27ln79M95n3m22J43P25q07m29P94l77j25N52R5m97M03q6o79
6320d97N42N78o55j42M62m77j9M48j61m13Q37l33m54N62k35l84M95J15n43Q5M15
6341B26k44j52O05k42q8n9j41k95M47l1l01K75K52k46l74O08j88k01K72l16m3
6362b36N39k33m52L19K42p12M35J12j01P5L50k86l2J03k92k80K94J54l3L15k27
6383E4k69K9J12Mj5K58l47m1M85k36j12P5r0J4R9k1l55Q8M06m14M2K47j67j01
6407b55M89l10j20L08j16k27K64K05j93J65j45Qj58J1K16l62L43j02l50L47K5
6428D3j30O8nj61O7K12m59J02M06k12j8J30j04m9K38k20o6L31M0l14J74k5N5j76
$$ plain form
6452 -73 54 -10 33 22 171 -233 -175 135 -283 -17 -98 32 163 171 41 -285 231 -75 192 71 87 166 69 174
6476 174 109 44 155 -136 -81 6 23 -80 131 116 -32 110 182 255 78 -99 -150 -83 -183 -79 -69 63 262 -94
6500 -94 298 -39 42 -57 -200 -343 -49 206 -14 196 86 -201 -43 32 -107 229 108 -18 123 123 -54 -188
6522 -188 -98 166 326 -19 -51 160 126 -71 -132 -128 -217 75 35 -96 -87 -329 72 318 -41 -17 -173 -183 -270 143
6546 143 66 0 159 23 -188 -42 139 -206 282 74 -60 -46 88 -130 -90 74 -16 -105 -49 -81 -96 -42 -42 -219
6570 -219 -106 38 -242 -50 155 82 126 -141 -65 -148 246 269 -146 175 155 -166 -19 -185 -169 -78 -148 -146 -174 -39
6594 -39 -125 150 34 -350 184 302 119 -50 243 283 -109 -55 81 100 -165 262 -352 30 240 -96 -224 -152
6616 -152 236 -198 -9 -31 4 -47 147 -266 6 35 -6 92 161 71 -223 -17 -96 -118 -98 -136 -107 -14 296 -24 123
$$ packed form
6452g3J27o4M3j1J49m04N8L10m18K66q1J30J31Qj30l26N16l06K67j21J6P9r7J05
6476A74o5o5J11k91N5Q7J7j03K11j5j48J42P2P3j77j77n1O7j00J04J0J32J99l56
6500i4L92l37Q1r9j43j43K94K55k20K10j10k87J58P5j39L36j21j26J41%j77j34
6522a88R0K64J60l45l2K11l4j97o1Mq9K92m0j31Rk42M01K46l59K4j56j0q7M13
6546A43p7o6J59j36k11J46J81l45M88k08j34J4J34k18M0J64r0q9N6l2j5N4%j77
6570b19J13J44k80J92K05p3M4k67P6q3L94K3m15L21k0l21J47j66J6R1p0Kk8J35
6594c9q6K75j16l84N34J18j83j69K93M0l92N4J36J9k65M27o14L82K10l36j28P2
6616a52L88m34J89k2L5n1J94m13K72K9m1R8O9r0k94K06p9k2K0l8K9R3L10l20J47
$$ plain form
6641 123 233 -48 180 328 144 34 6 30 -29 200 209 -168 12 166 -133 -100 25 -182 -145 312 -238 -51
6663 -51 419 170 -77 224 73 -389 147 107 -223 -64 95 -56 -194 424 -69 -210 315 -2 -450 16 331
6684 331 -154 -78 46 -79 245 539 -26 -280 528 -22 -331 84 -201 -172 244 255 -494 280 96 -135 91
6705 91 52 -422 -128 517 -4 -49 501 -341 -271 212 111 -236 252 -72 -353 73 209 -37 -20 368 -294 119
6727 119 45 25 -88 96 -36 -477 151 114 -234 -20 197 -253 -41 528 -183 -236 339 -51 -225 206 359
6748 359 -361 133 289 -238 -65 501 -106 68 245 59 -363 302 188 -234 248 -49 -375 201 399 -76
6768 -76 -71 489 -287 26 640 -193 -34 348 -180 -212 350 -24 -189 172 75 -423 -90 342 -336 -171 449 -120
6790 -120 132 565 -251 -319 207 287 -340 235 276 -220 114 256 -278 -270 343 48 -299 149 40 -193 392 125
$$ packed form
6641A23J10k81K28J48j84j10k8K4n9K29Rl77J80J54k99L3J25k07L7M57n50J87
6663e1M70k49k47L01j51m62N36m0l30J59J59j51j38O18m93j41N25l17m48M66L15
6684C31m85P6J24j25L24K94n65k54Q08n50l09M15k85K9M16J1p49P74j84k31K26
6705I1l9m74K94O45n21m5N50q42P0M83j01l47M88l24k81M26J36k46J7L88o62M13
6727A19p4k0j13J84j32m41O28l7l48K14K17m50K12N69p11n3N75l90j74M31J53
6748C59p20M94J56n27J73N66o07J74J77j86m22O65j14m22M82k97l26N76J98m75
6768g6NN60p76L13O14q33J59L82n28l2N62l74j65L61r7m98L33M32o78J65O20n69
6790a20K52M33q16o8N26Q0o27N75M1m96L34J42n34QO13k95l47M48j09k33N85k67
$$ plain form
6812 125 -244 232 239 -533 -70 450 -111 -185 18 -244 -83 380 252 -371 188 -104 -315 288 324 -410 -18
6833 -18 101 -300 -29 341 -273 -316 251 82 -83 215 217 -281 63 331 -303 59 144 -216 -137 522 -234 -159
6855 -159 434 -203 -158 220 98 -423 208 139 -419 142 313 -137 -35 122 -274 22 365 207 -104 217 170
6876 170 -341 220 34 -303 49 135 -144 -97 422 -49 33 236 -38 -204 129 183 -409 250 207 -376 -12 294
6898 294 -15 -316 -120 -261 -159 134 -199 -123 225 182 -284 91 10 -325 -18 444 36 -139 31 -138 -87
6919 -87 354 173 -125 -19 -78 -312 201 176 -390 -135 355 -151 28 99 -167 2 245 220 -150 -80 25 -102
6941 -102 204 96 -251 359 406 -437 -170 304 -142 -67 385 -3 -175 233 257 -227 -72 181 -30 55 135 281
6963 281 -57 125 -28 39 200 -41 -138 37 107 -308 -25 70 -72 -281 117 -375 -193 168 -116 -110 66 25
$$ packed form
6812A25l69M76Pp72M63N20n61p4K03k62J61M63j28o23N59k92k11O03L6p34L92
6833a8J19m01K71L70o14m3N67j69j65K98Km98L44K68o34L62Q5l60P9O59p56P5
6855a59N93o37M5L78j22n21O31o9n58N61J71m50J02J57l96K96L43j58l11L21m7
6876A70n11N61j86l37L52Q6k79M7N19m71Q2K03k74j66L33N4n92O59m3n83L64L06
6898B94l09l01J96j41J02K93l33P6L48m3m66L75q1l35L07M62m08j75J70j69N1
6919h7M41j81k98J06n9k34N13k5n66K55M90n06J79P1k66J69K43k5l70P0J05j27
6941a02L06j08l47O10M7q43K67M74m46P5M52l88j72M08K4m84J55K53k11Q5Q0J46
6963B81l38J82j53O7J61k41r7J75P0m15K83R5j42k09L98m92J82L61k84OJ76m1
$$ plain form
6985 25 -175 -1 41 -111 251 94 12 -35 355 -1 -146 160 -13 -85 179 192 -111 180 -45 2 141 222 -112
7008 -112 -196 -196 54 -83 274 77 -66 -2 -200 -367 -346 110 -45 -26 239 -10 -112 -121 -32 70 115 120 -99 -108 90
7033 90 -84 224 69 22 96 -24 -154 87 87 133 -31 159 384 -164 128 72 30 79 31 -99 -50 80 -145 164
7057 164 92 -47 -78 219 82 -141 -184 -34 -34 -280 56 -14 -202 -145 -160 -219 30 -130 -23 -176 142 -331 -111
7080 -111 -22 -55 -162 151 -170 -109 138 -112 60 -93 -42 -197 80 135 -173 131 49 -15 -157 113 -157 46
7102 46 333 -225 -144 -179 3 -4 -143 -133 -53 -44 182 -141 139 232 -285 95 110 -234 -57 -180 -102 -226 -106 -51
7126 -51 52 -116 143 -381 -114 94 -59 -72 45 27 -21 97 -191 149 84 300 90 206 31 21 106 70 -58
7149 -58 177 -223 -365 -97 200 -154 -200 77 -119 262 -59 154 -159 317 163 -151 160 297 -120 63 -36
$$ packed form
6985B5k00J74M2j52L62j57q2m7L90l56j45L06j73p2K64J3l03K91k25M7J39Q1l34
7008a12q4%K50j37L57j97j43O4j98j67K1M56j55J9K65k49j02rQ9J02M5Nk19rJ98
7033I0j74L08j55m7P4j20j30K41%M6j64J90K25n48K92n6m2M9m8j30M9J30k25L09
7057A64p2j39l1K97j37k23m3J50%k46L36p0j88N7j5n9K49j60J07j53L18m73K20
7080a11Q9l3j07L13l21O1K47k50J72j53N1j55K77N5l08L04q2o4j42K70k70K03
7102D6K87n58Q1l5J82pj39J0Q0RK26l23K80R3n17L80J5l44J77j23P8j24J20N5
7126e1J03j68K59n24K67K08j53j3J17j8m8J18k88L40o5K16k10J16j75j0Q5l6j28
7149e8K35m00j42K68K97l54m6K77j96L81l21K13l13M76j54l14L11J37m17J83r9
$$ plain form
7170 -36 -319 119 259 -77 50 247 113 112 186 -83 -162 -92 102 -114 -8 -12 150 94 126 -117 -53 108 -41 -181
7194 -181 82 181 -90 -66 30 -249 -153 68 -12 -21 195 106 -72 96 -96 99 104 -122 -48 -38 404 -125 29 230
7218 230 15 -64 434 225 -137 220 -17 -114 179 102 -117 152 155 -145 -32 342 -285 165 128 50 -471 -71
7240 -71 358 -188 266 71 7 160 383 -223 11 163 68 84 136 -268 -59 51 138 -147 -108 -78 -358 -58 311
7263 311 -341 73 159 -266 -160 20 -264 -183 152 11 -46 121 -51 -176 86 254 -125 161 395 -161 0
7284 0 91 5 -82 286 59 -84 130 -187 -421 189 274 -245 72 192 -152 -106 323 -163 -123 330 -86 -164 370
7307 370 184 -218 -72 163 -206 -199 312 -221 -56 204 -487 -183 313 -65 -266 495 188 -279 234 -48 -302
7328 -302 -44 246 -301 -177 226 107 -30 209 170 -193 -58 92 -206 169 118 -222 119 13 -184 -289 192
$$ packed form
7170c6k83M38J40l36J27J97j34jP4k69p9P0J94k16J06mJ62n6L2k43O4J61j49j40
7194a81K63R9k71K4R6k79R6K21q0rK16q9j78J68j92J95Nk26P4J0M42n29J54K01
7218B30k15p9M98k09l62L57k37r7K93p7k19K69Ll00J13L74o27M50l7p8n21M00
7240g1M29n46M54j95o4J53K23o06K34J52r5J6N2m04K09J10Q7k85L9L0k80L00L69
7263C11o52M14Q6m25J06J80k84Q1L35j41n7J67j72j25K62J68l79K86K34n56J61
7284@R1q6q7L68k27j43K14l17k34O10Q5n19L17J20l44M6M29m86M0M53m16p8N34
7307C70j86m02J46K35l69PN11n33J65K60o91L04M96l78k01P61l07m67N13k82k54
7328c02K58K90n47J24M03j19j37K39l9l63J35J50k98L75n1l40L41j06j97j05M81
$$ plain form
7349 192 -229 -175 157 1 50 192 47 -385 -141 170 -81 113 274 -22 -333 384 -37 -324 372 11 -264
7370 -264 199 121 -131 261 74 -184 27 414 -171 -63 163 -278 -54 273 -389 -574 68 233 -323 188
7390 188 285 -36 55 472 -216 -146 90 -309 -350 279 23 -197 44 8 -350 317 341 -216 -294 435 18 -99
7412 -99 184 108 -107 135 4 -264 33 93 -161 146 -149 -25 53 124 -341 -257 365 118 -6 159 32 -115
7434 -115 401 42 -203 -27 58 -69 -364 88 -138 158 146 -240 -124 82 134 14 -27 53 -235 89 -24 -137
7456 -137 141 227 -53 -252 157 161 -231 205 -36 -474 118 -42 -321 42 269 191 -190 262 -60 52 409
7477 409 2 15 -27 -113 -60 64 5 10 34 99 -176 342 273 -187 -75 89 55 209 142 -258 0 105 218 91
7501 91 110 105 28 49 300 -331 180 -46 -184 -6 24 84 12 48 -134 -317 -6 165 26 -42 233 -106 -78 130
$$ packed form
7349A92m21N4L32j56M9J42j45m32K44L11k51J94J61k96l11P17m21k87O96l61k75
7370b64M63p8k52L92j87k58K11L87n85J08K26m41K24L27o62j85O42J65n56N11
7390A88R7l21R1M17o88P0K36l99m1O29k56k20K41l6l58O67K4n57p8P29m17j17
7412i9K83p6k15K42j31k68K97O0k54L07k95J24P8P1m65Q4O22k47j24J65j27j47
7434a15N16l59k45J76Q5j27k95M52k26K96j2l86J16K06N2j20m1Q0k88L24j13j13
7456a37K78Q6k80j99M09Ml92M36k41m38N92j60k79L63K27p8l81M52l22J12L57
7477D09m07J3m2q6N3J24n9NK4O5k75N18o9m60J12J64l4J54o7m00K58J05J13j27
7501I1J9np7K1K51o31N11k26j38J78L0O0p2L6j82j83L11J71j39o8K75l39K8K08
$$ plain form
7525 130 -97 146 243 41 -145 180 -120 -102 86 -177 -243 28 53 -26 -185 126 -21 -101 156 121 -216 155
7547 155 125 -153 102 -64 -342 -103 -114 -92 2 60 -4 130 193 1 -145 5 38 19 118 -60 45 15 173 222
7571 222 -122 -7 -40 66 170 92 297 164 173 169 51 213 -87 -120 104 16 -26 -4 -231 -251 114 2 -292 5
7595 5 -186 74 233 170 271 45 -223 11 21 74 75 -176 144 102 -27 -187 31 -132 -110 -59 -47 -297 77 -151
7619 -151 0 128 -78 -50 93 190 5 39 -78 68 85 32 -45 -26 74 -97 -177 70 -108 -229 -158 -87 124
7642 124 152 99 -97 -21 464 59 299 34 4 38 -4 181 -15 4 -226 -89 49 -87 -226 62 60 -80 -131
7665 -131 -126 -22 -25 101 -165 -125 -223 124 408 231 212 223 -302 43 110 -203 262 -136 139 123 142 -143 -7 4
7689 4 -146 30 106 -168 98 78 -188 -32 191 -149 -94 97 -138 84 93 108 213 -30 -78 -63 2 73 -115 183
$$ packed form
7525A30k27K43R7k02j86L25l00J8J88k63o6K71K5p9j59L11j47q0K57l5l37L71
7547A55l0k78K55j66k78K39j1K2R4N8o4J34O3j92j46J50L3j9R9j78J05l0J58M9
7571B22l44J15l3J06J04p8K05j33Rmj18J62l00l3K24q8m2K2k27k0L65j12k94K97
7595Ej91K60J59o3J01k26k68K34J0N3Jk51L20m2j29j60K18j63K2N1J2k50L74k28
7619a51J51J28k06K8J43R7j85L4j17J46J7n3p7J9J00j71q0K47j78j21P1P1K11
7642A24K8n3j96P6M85m05K40k65l0L4m2J85j96J9k30J37J38j36j39K88kj40n1
7665a31NJ04lJ26k66M0r8L47K84j77j9J1n25L45O7l13M65l98K75j6J9k85J36J1
7689Dj50J76P6k74K66k0k66J56K23l40N5J91k35K22RJ5J05k43m8J5O5P1j88K98
$$ plain form
7713 183 -136 212 -162 -47 71 -152 291 -255 -134 -296 89 -60 -122 245 -161 142 128 33 -164 -14 12
7734 12 -78 -122 -120 52 -324 111 36 181 71 -12 26 -17 105 -73 68 230 212 -9 302 -177 -42 82 -203
7757 -203 92 109 -178 -150 -118 -236 216 126 -24 -15 138 276 116 108 129 -84 -26 -3 36 -301 207 -83 60 264
7781 264 246 95 184 -170 -64 102 -191 36 33 79 -103 92 52 -68 11 130 -119 44 -4 -20 -104 90 96 -195
7805 -195 117 344 -316 -46 69 25 -115 46 52 -183 93 -34 -408 69 211 -94 -58 188 47 -194 45
7826 45 203 -78 198 8 200 123 -31 -169 190 -60 89 147 -101 47 -93 269 11 -85 151 -94 -191 264
7848 264 -214 -181 148 64 50 119 127 -316 -71 223 -142 28 297 -32 80 147 -233 -81 305 199 -347 -76
7870 -76 -28 -222 47 15 45 -101 88 -21 -112 -48 -125 -412 196 52 -225 75 45 -47 -53 214 -319 -48 -64 -94
$$ packed form
7713A83l19L48l74J15J18k23M43n46J21j62L85j49o2L67m06L03j4r5j97J50K6
7734A2r0m4KJ72l76M35p5J45j10q3L8m3J22j78J41J62j8k21L11m79J35J24k85
7757b03K95J7k87K8L2j18M52r0j50RJ53J38j60qK1k13N8K3L9l37N08k90J43K04
7781B64j8j51Q9l54J06J66k93K27lM6j82J95m0j20P9J19k49J63m8j6q4J94Ok91
7805a95L12K27o60K70J15m4j40J61Ok35K76j27l74M77J42l05L6K46j41k41K39
7826D5J58k81K76j90J92p7j54j38L59k50J49N8k48J48j40L62k58r6K36k45r7M55
7848B64m78L3L29q4j4O9Qm43K45K94l65J70K69l29J12O7l80J52L86j06n46K71
7870g6M8j94K69l2L0j46J89j09r1O4p7k87O08j44k77L00l0r2oK67n33K71j6l0
$$ plain form
7894 -94 -247 88 -96 -328 197 245 -322 -40 -21 -312 -242 55 -197 -90 78 -278 -318 137 85 -405 -56 116
7916 116 -17 -1 295 -282 13 142 -54 39 59 60 -276 254 -148 -30 118 -15 -319 181 29 -242 -51 181
7938 181 -124 107 220 -114 -9 278 -7 -72 3 -138 -12 216 132 -391 -290 176 50 -15 -63 -147 -63 230
7960 230 -78 -277 194 -215 -24 -139 -162 -151 -45 -47 -480 -41 132 -52 9 172 -168 -134 164 133 -113 190
7982 190 316 -251 76 -80 -168 -71 316 -62 292 -12 -41 -307 115 120 -363 149 -42 6 212 190 75 -312
8004 -312 169 -92 -85 -9 -5 -44 89 -84 -113 242 -28 -2 -103 50 -81 -212 248 -89 -118 385 -93 81 128
8027 128 80 -315 126 63 -231 -109 116 -243 48 8 42 -142 130 -14 -164 160 283 -73 -78 135 -172 155
8049 155 25 -242 -6 128 -192 19 66 -19 -114 -129 -62 -198 -77 51 64 -39 242 -18 61 23 -199 -286 -249
$$ packed form
7894i4j53L35j84k32N25M8n67K82J9k91P0K97k52J07J68l56m0M55n2m90L49J72
7916A16j33J6K96n77K95J29j96R3K0Jl36N30m02J18J48j33l04N00j52k71J91K32
7938A81l05K31J13l34J05K87k85o5P5j41J26K28q4n23J01M66j26o5m8q4Q4K93
7960B30l08j99M71m09J91j15k3J1J06km33M39J73j84O1J63l40L4K98l1k46L03
7982A90J26n67L27j56q8R7L87l78L54l04k9k66M22Nm83N12j91M8K06k2j15l87
8004c12M81k61PP6Ml9J33j73k9L55k70K6j01J53j31j31M60l37k9N03m78J74M7
8027A28m8l95M41o3k94J22K25l59K91m0L4j84K72j44j50L24J23l56nK13l07L27
8049A55j30k67K36J34l20K11M7q5r5j5O7j36J21J28J3j03K81k60P9l8k22q7L7
$$ plain form
8072 -249 -54 -269 18 -63 -110 -175 -106 -5 -246 253 -6 22 0 -114 -42 -268 177 209 236 -11 -227 -162 77
8095 77 -194 -13 180 26 -48 36 -244 -178 111 -93 -149 -49 -149 -67 248 19 -70 175 -195 -238 33 -110 -137
8118 -137 -246 23 84 -121 163 -124 226 131 45 -106 337 38 -4 130 116 -100 -61 -99 192 44 -111 -200 -189
8141 -189 152 88 -110 -16 157 13 57 134 83 247 -1 -210 -378 31 56 -132 -281 -158 -107 -38 31 87 -94
8164 -94 -57 -26 95 109 9 -216 -113 127 85 69 100 -216 -146 84 -124 -157 -31 -39 24 155 123 -82 203 30
8188 30 13 -268 148
$$ packed form
8072b49J95k15K87q1m7o5O9J01k41M99k59K8k2j14P2k26M45L2K7k47k16O5K39
8095G7k71J81J93j54p4Q4k80O6K89k04n6J00j00Q2L15k29q9K45l70m3K71j43k7
8118a37j09K69O1k05K84k87L50r5q6j51M43k99m2J34j4k16L9l8K91j48j55q9J1
8141a89L41o4j98R4J73j44M4P7n1J64k48k09j68M09K5j88j49J23N1O9O9N6j81
8164i4L7L1J21J4j00k25J03K40m2j6L1l16P0K30k08l3J26qO3J31l2k05K85j73
8188C0j7k81M16
8191A48
$$ Imaginary data points
##PAGE= N=2
##DATA TABLE= (X++(I..I)), XYDATA
$$ plain form
0 0 0 0 0 0 0 0 0 8 -8 8 -8 8 -16 19 -24 32 -40 48 -59 72 -86 104 -123 145 -171 203 -232 267 -313 359
30 359 -409 469 -532 604 -684 772 -865 969 -1086 1212 -1352 1501 -1668 1847 -2042 2258
46 2258 -2497 2749 -3031 3342 -3680 4054 -4466 4925 -5438 6015 -6670 7417 -8281 9289
60 9289 -10492 11953 -13768 16093 -19195 23561 -30197 41567 -66179 231824 -544132 -733713
72 -733713 371099 263817 56539 47953 -223094 -115059 306572 -200678 -287140 536807
82 536807 279031 -652977 -187042 347176 1477 93745 215106 -402647 -317816 311569
92 311569 186752 11868 100501 -378202 -352599 527938 335042 -494005 -77746 337215
102 337215 -203695 -220942 212707 131985 88711 -49835 -513747 -73751 746671 145281
$$ packed form
0@%%%%%%%Qj6J6j6J6k4L5m3N6p2Q8j07J31j58J90k27K68l16L74m35M99n80O72
30C59p68Q78j001J136j288J456j637J834k055K298k564K853l169L515l889M300
46B258m755N246n780O373p022P734q520R391j0363J1453j2685J4087j5698J7570
60I289j9781K2445k5721K9861l5288M2756n3758P1764j07746K98003p75956j89581
72g33713J104812j07282k07278q586k71047J08035M21631n07250q6462Q23947
82E36807k57776r32008M65935N34218l45699R2268J21361o17753Q4831O29385
92C11569j24817j74884Q8633m78703K5603Q80537j92896q29047M16259M14961
102C37215n40910j7247M33649q0722m3274j38546m63912M39996Q20422o01390
$$ plain form
112 145281 -640517 -97241 271234 -57113 88590 154938 -224453 -77803 110378 -152424
122 -152424 87672 352789 -210777 -339986 226029 80625 -200999 254188 194686 -399915
132 -399915 -192247 232699 161982 142783 -91956 -457709 45175 541285 -70836 -391093
142 -391093 178369 179939 -241048 -44182 154142 54527 106577 -124596 -365805 173697 458493
153 458493 -138860 -297831 82614 11172 -37534 227788 19600 -259419 22632 109429
163 109429 -69971 92471 75695 -179655 19754 124808 -190284 -13266 346413 -39899
173 -39899 -374984 -4654 230088 103229 4907 -201587 -184092 252729 192394 -265369 -74774
184 -74774 240232 -54221 -196540 70049 104384 19901 12695 -155890 -117379 222381 121925
$$ packed form
112A45281p85798N43276L68475l28347J45703O6348l79391J46650J88181k62802
122a52424K40096K65117n63566j29209N66015j45404k81624M55187n9502n94601
132c99915K07668M24946p0717j9199k34739l65753N02884M96110o12121l20257
142c91093N69462J570m20987J96866J98324r9615N2050k31173k41209N39502K84796
153D58493n97353j58971L80445p1442m8706K65322k08188k79019K82051Q6797
163A09429j79400J62442j6776k55350J99409J05054l15092J77018L59679l86312
173c9899l35085L70330K34742j26859r8322k06494J7495M36821o0335m57763J90595
184g4774L15006k94453j42319K66589L4335q4483p206j68585L8511L39760j00456
$$ plain form
195 121925 -188410 -31585 70277 -101623 32836 166884 -79197 -135917 58368 26624
205 26624 -17144 66146 -38222 -78871 94464 -4100 -146507 104805 165713 -139748 -140931
216 -140931 79866 78368 28492 -6121 -114963 -28885 145850 5280 -115209 62578 59032
227 59032 -103236 -2354 84065 -22250 -8048 30563 -55136 -19000 73056 1424 -22346
238 -22346 40000 -52641 -71057 117284 83023 -118289 -57464 72527 33540 -4411 -23931
249 -23931 -39401 48682 64016 -85273 -66818 116894 62173 -105627 -48576 50873 41149 20548
261 20548 -41291 -66510 44728 70182 -47167 -48486 43480 16377 -32557 3903 1085 -12843
273 -12843 30987 1221 -52044 4085 37098 -4118 -10178 -10797 -24258 16447 40720 -25454 -48388
$$ packed form
195A21925l10335J56825J01862j71900J34459J34048k46081n6720J94285l1744
205B6624m3768Q3290j04368m0649J73335r8564j42407K51312O0908l05461j183
216a40931K20797j498m9876l4613j08842Q6078J74735j40570j20489J77787l546
227E9032j62268J00882Q6419j06315J4202L8611q5699L6136R2056p1632k3770
238b2346O2346r2641j8416J88341l4261k01312O0825J29991l8987l7951j9520
249b3931j5470Q8083J5334j49289J8455J83712n4721j67800N7051R9449r724k0601
261B0548o1839k5219J11238K5454j17349j319R1966k7103m8934L6460k818j3928
273a2843M3830k9766n3265N6129L3013m1216o060o19j3461M0705K4273o6174k2934
$$ plain form
286 -48388 24671 32826 -23148 -19709 2449 11202 16965 -20774 -35288 24866 38287 -25315 -38609
299 -38609 16943 29458 -8949 -17741 -4410 10592 17342 -14145 -21349 20875 18756 -19489 -13891
312 -13891 14775 14506 -7543 -10575 3848 10930 6352 -10876 -7830 18476 9094 -14925 -3925
325 -3925 11945 10310 -3892 -10286 4502 12598 3349 -8060 -6096 12213 10778 -7976 -6801 4183
339 4183 10309 3885 -10384 -3886 9987 6996 -3343 -10082 1051 12941 699 -10133 -5214
352 -5214 6759 10687 -6944 -12782 3318 10136 1790 -12062 -8924 10410 8212 -9136 -12604 789
366 789 13961 -1007 -18341 -2847 10966 4524 -9414 -13960 3495 13709 -3176 -16725 -4885
379 -4885 15173 4401 -17040 -5822 7708 5069 -1041 -14095 -5713 17984 6151 -18949 -8302
$$ packed form
286d8388P3059Q155n5974L439K2158Q753N763l7739j4514O0154J3421o3602j3294
299c8609N5552J2515l8407q792J3331J5002O750l1487p204M2224k119l8245N598
312a3891K8666k69k2049l032J4423P082m578j7228L046K6306r382k4019J1000
325c925J5870j635j4202o394J4788Q096r249j1409J964J8309j435j8754J175J0984
339D183O126o424j4269O498J3873k991j0339o739J1133J1890j2242j0832M919
352e214J1973L928j7631n838J6100O818q346j3852L138J9334k198j7348l468J3393
366G89J3172j4968j7334J5494J3813o442j3938m546J7455J0214j6885j3549J1840
379d885K0058j0772k1441J1218J3530k639o110j3054Q382K3697j1833k5100J0647
$$ plain form
392 -8302 14023 7853 -8314 -5482 -1497 5037 12158 -10796 -14704 20213 11437 -19735 -4452 13659
406 13659 6380 751 -5503 -11513 10001 24612 -13579 -21256 23146 11682 -20272 3194 11951
419 11951 -590 6604 -7488 -18423 22469 29774 -27475 -25095 29539 10948 -16684 8866 -115
432 -115 -10325 18335 -5443 -25292 29200 25313 -40073 -17956 31592 3697 -5430 12186 -26934
445 -26934 -19313 44524 5405 -37927 14906 10599 -29164 11783 17377 -25282 10280 24307 -48958
458 -48958 -23119 64372 11636 -46989 -5041 -5664 58 50434 -10843 -67352 25294 45208 -47313
471 -47313 -14992 53663 -8984 -36481 6784 -13345 11578 63016 -35355 -80776 43754 48484
483 48484 -36947 9002 22130 -52992 -6525 54778 -12466 -11393 32904 -43435 -34153 72356
$$ packed form
392h302K2325o170j6167K832L985O534P121k2954l908L4917q776l1172J5283J8111
406A3659p279n629o254o010K1514J4611l8191p677M4402j1464l1954K3466Q757
419A1951j2541P194j4092j0935M0892P305n7249K380N4634j8591k7632K5550q981
432a15j0210K8660k3778j9849N4492l887o5386K2117M9548k7895r127J7616l9120
445b6934P621O3837l9119m3332N2833m307l9763M0947N594m2659L5562J4027p3265
458d8958K5839Q7491n2736n8625M1948o23N722N0376o1277n6509R2646J9914r2521
471d7313L2321O8655o2647k7497M3265k0129K4923N1438r8371m5421J24530M730
483D8484q5431M5949J3128p5122M6467O1303o7244J073M4297p6339R282J06509
$$ plain form
495 72356 8533 -50766 41436 6915 -79156 27632 83189 -24694 -33295 1337 -38252 32131
507 32131 91733 -52098 -77696 62624 14152 -55202 54410 40078 -67188 -7105 25451
518 25451 -32339 41786 66375 -79095 -57068 66649 -66 -12642 76814 -38689 -115742
529 -115742 55335 87601 -35239 -12691 349 -55032 31783 61765 -65027 -4800 96096
540 96096 -73423 -115726 99099 97968 -50164 -46611 -46239 -19627 118522 50918 -135059 -26851
552 -26851 94595 -44122 -41399 92959 -1203 -74084 16852 -17596 -22996 107197 20832 -129479
564 -129479 -11478 59010 -22132 51946 61844 -132614 -76742 130496 42337 -59111 16803
575 16803 -24209 -46864 66706 8382 -60800 84492 40079 -166212 -27954 172362 29392
$$ packed form
495G2356o3823n9299R2202l4521q6071J06788N5557j07883q601L4632l9589P0383
507C2131N9602j43831k5598J40320m8472o9354J09612j4332j07266O0083L2556
518B5451n7790P4125K4589j45470K2027J23717o6715j2576Q9456j15503p7053
529a15742J71077L2266j22840K2548J3040n5381Q6815K9982j26792O0227J00896
540I6096j69519m2303K14825j131j48132L553L72K6612J38149o7604j85977J08208
552b6851J21446j38717K723J34358r4162p2881R0936l4448n400J30193q6365j50311
564a29479J18001P0488q1142P4078R898j94458N5872K07238q8159j01448P5914
575A6803m1012k2655J13570n8324o9182J45292m4413k06291J38258K00316j42970
$$ plain form
586 29392 -79990 -26132 -48309 22628 130840 -25259 -109662 52387 23067 -86593 63131
597 63131 101879 -84139 -57590 48353 -26614 10090 98656 -38097 -84527 31256 -12600
608 -12600 -5905 136112 -3969 -194359 1226 153864 1935 -45063 2919 -50112 8545
619 8545 70056 -55923 -15930 124052 -51209 -166002 68931 137146 -30240 -41440 -29731
630 -29731 -69243 64027 114524 -66150 -66264 42880 -42101 -19242 118907 -8169 -115376
641 -115376 37740 40814 -75572 28267 88634 -41012 -53054 -17010 -37150 93503 126011
652 126011 -137907 -158909 118184 110655 -62437 -27526 4893 -25578 30860 3476 -56236
663 -56236 72914 77635 -138585 -83803 132497 58817 -52387 -4313 -42551 -45992 89910
$$ packed form
586B9392j09382N3858k2177P0937J08212j56099q4403J62049k9320j09660J49724
597F3131L8748j86018K6549J05943p4967L6704Q8566j36753m6430J15783m3856
608a2600O695J42017j40081j90390J95585J52638j51929m6998M7982n3031N8657
619H545O1511j25979L9993J39982j75261j14793K34933O8215j67386j1200J1709
630b9731l9512J33270N0497j80674j14J09144q4981K2859J38149j27076j07207
641a15376J53116L074j16386J03839O0367j29646j2042L6044k0140J30653L2508
652A26011k63918k1002K77093p529j73092L4911L2419l0471N6438k7384n9712
663e6236J29150M721k16220N4782K16300p3680j11204M8074l8238l441J35902
$$ plain form
674 89910 58417 -64502 -14403 1880 -50731 58953 87261 -85178 -53741 86495 -17271
685 -17271 -71336 68123 57842 -44262 -34470 -37140 3457 128797 30303 -164462 -35123
696 -35123 131575 9642 -53506 26382 -10330 -30562 30971 -8428 -12370 69472 -12567 -103132
708 -103132 26721 78829 -31503 -4675 36712 -69816 -42778 88536 39619 -41004 -28005
719 -28005 -39109 11554 95274 -11111 -106740 31687 80470 -64884 -50834 69846 35100
730 35100 -30764 -41845 -43820 49433 102976 -50129 -115899 37451 73737 -27388 -13490 16483
742 16483 -30767 -2570 30558 -21405 -1099 38955 -29212 -34540 33018 -597 -15488 49653
754 49653 -3600 -86596 7661 86749 5123 -47699 -25853 -3426 49125 34950 -65632 -29685
$$ packed form
674H9910l1493j22919N0099J6283n2611J09684K8308j72439L1437J40236j03766
685a7271n4065J39459j0281j02104R792k670M0597J25340r8494j94765J29339
696c5123J66698j21933o3148P9888l6712k0232O1533l9399l942Q1842q2039r0565
708a03132J29853N2108j10332K6828M1387j06528K7038J31314m8917q0623J2999
719b8005j1104N0663Q3720j06385r5629J38427M8783j45354J4050J20680l4746
730C5100o5864j1081j975R3253N3543j53105o5770J53350L6286j01125J3898K9973
742A6483m7250K8197L3128n1963K0306M0054o8167n328O7558l3615j4891O5141
754D9653n3253q2996R4257P9088q1626n2822K1846K2427N2551j4175j00582L5947
$$ plain form
766 -29685 76539 8240 -75321 7477 63877 1631 -33391 -26064 -2063 54233 29315 -62127
778 -62127 -26264 50723 4486 -23042 22085 2448 -29530 10016 20062 -10875 1798 7438
790 7438 -14275 6952 9501 -25611 12005 42839 -29303 -48774 28825 42779 -11282 -27341
802 -27341 -12225 10586 30830 -4098 -40653 9497 36897 -20655 -26681 20632 12859 -9770
814 -9770 -4381 -8308 -3525 17589 4619 -18164 -2440 3766 -7569 12871 12671 -27768 -14368
827 -14368 27737 10249 -20599 -10731 8649 13327 -416 -22056 -9284 30583 15167 -35866
839 -35866 -17726 29843 17619 -15546 -18496 284 20077 9650 -19285 -13177 18055 13677 -14544
852 -14544 -9684 10020 6628 193 -3440 -7067 4328 11163 -1640 -7005 -571 3841 4527 2248
$$ packed form
766b9685J06224o8299q3561Q2798N6400o2246l5022P327K4001N6296k4918r1442
778f2127L5863P6987m6237k7528M5127j9637l1978L9546J0046l0937J2673N640
790G438k1713K1227K549l5112L7616L0834p2142j9471P7599J3954n4061j6059
802b7341J5116K2811K0244l4928l6555N0150K7400n7552o026M7313p773k2629
814i770N389l927M783K1114j2970k2783J5724O206j1335K0440k00m0439J3400
827a4368M2105j7488l0848R868J9380M678j3743k1640J2772L9867j5416n1033
839c5866J8140M7569j2224l3165k950J8780J9793j0427k8935O108L1232m378k8221
852a4544M860J9704l392o435l633l627J1395O835j2803n365O434M412O86k279
$$ plain form
866 2248 -3953 -5908 7223 9577 -6395 -7244 5903 6755 32 -5948 -2785 7829 5394 -5892
880 -5892 -6115 5193 7535 -3794 -6121 3214 4545 -192 -4027 -1963 4844 1636 -4826 -1637 3517
895 3517 2330 -3805 -4358 3177 2970 -2937 -4072 -250 4163 580 -6033 -2004 3565 2390 -3063 -6104
911 -6104 1483 5328 -1535 -5514 -2527 3934 3291 -5422 -4826 2888 3744 -1046 -5626 -1099 4802 796
927 796 -4380 -2391 2875 3024 -3593 -2592 3146 1058 -1089 -826 -222 2930 220 -2357 1263 3006
943 3006 -636 -2855 2138 3905 -1918 -1348 1975 361 2584 1347 -3412 1353 4289 -917 -1158 2138
959 2138 401 -1738 3277 1051 -5064 3558 6663 -4863 -3600 2767 2221 4367 -714 -9851 443
974 443 13886 334 -13812 1103 10869 -1794 -4957 -1869 -275 9274 342 -17441 137 19455
$$ packed form
866B248o201j955J3131K354j5972q49J3147Q52o723n980L163J0614k435j1286
880e892k23J1308K342j1329k327R335J331m737l835K064O807l208o462L189N154
895C517j187o135n53P535k07n907j135L822M413l583o613M029N569j175n453l041
911f104P587L845o863l979K987O461o43q713N96P714Q56m790m580M527N901m006
927G96n176J989N266J49o617J001N738k088k147K63O04L152k710k577L620J743
943C006l642k219M993J767n823N70L323j614K223j237m759M765K936n206k41L296
959B138j737k139N015k226o115Q622L105j1526J263O367n46K146n081r137J0294
974D43J3443j3552j4146J4915R766j2663l163L088J594R549q932j7783J7578J9318
$$ plain form
988 19455 -715 -16566 -1362 6927 2092 2504 -5754 -9867 9810 6253 -15012 84 13411
1001 13411 -6351 -8912 3737 -1700 1122 10551 -7968 -16521 9834 10886 -9242 1721 1839
1014 1839 -13747 5028 13377 -10968 -3684 12568 -8749 -11824 14250 6307 -9171 4357 -4091
1027 -4091 -14279 17955 16064 -20387 -5548 13165 -7985 -170 17894 -6363 -12380 9863 -2812
1040 -2812 -7624 23714 5061 -29324 2188 18313 -7666 5456 11873 -20352 -7327 20303
1052 20303 -3336 -5155 20511 -10058 -28585 18786 20621 -13571 3153 1908 -24606 9370
1064 9370 27596 -14176 -8695 14584 -18215 -13473 33377 8796 -26402 2526 235 -16013 24739
1077 24739 18464 -31956 -6693 16696 -16733 2752 33461 -15702 -32206 13333 6359 -5830
$$ packed form
988A9455k0170j5851J5204Q289m835M12q258m113J9677l557k1265J5096J3327
1001A3411j9762k561J2649n437K822R429j8519q553K6355J052k0128J0963J18
1014A839j5586J8775Q349k4345P284J6252k1317l075K6074p943j5478J3528q448
1027d091j0188L2234j891l6451J4839J8713k1150P815J8064k4257o017K2243j2675
1040b812m812L1338j8653l4385L1512J6125k5979J3122O417l2225J3025K7630
1052B0303k3639j819K5666l0569j8527M7371J835l4192J6724j245k6514L3976
1064I370J8226m1772N481K3279l2799M742M6850k4581l5198K8928k291j6248M0752
1077B4739o275n0420K5263K3389l3429J9485L0709m9163j6504M5539o974j2189
$$ plain form
1089 -5830 25441 -4249 -42120 9784 26000 -15087 6850 16200 -34132 -14771 33616 2376
1101 2376 -11179 16962 -17364 -31638 29285 24415 -19644 4326 -2644 -36596 19348 47476
1113 47476 -21529 -27679 14370 -7558 -6107 33006 -1895 -26710 15186 -5857 -29535 40223
1125 40223 38201 -46545 -28788 23009 5567 13779 20124 -36923 -25339 39301 4480 -23106
1137 -23106 31560 6913 -48866 4403 32248 -6808 11077 9097 -46941 -9538 50901 4622
1149 4622 -19047 11560 -23950 -27138 49743 26893 -42480 -5065 13497 -23181 12058 32770
1161 32770 -18821 -11227 11928 -31120 -4831 63948 1839 -62520 -1702 22816 -1990 23589
1173 23589 3177 -46009 727 29442 -17760 4583 35979 -31624 -40783 32318 17373 -14817
$$ packed form
1089e830L1271k9690l7871N1904J6216m1087K1937R350n0332J9361M8387l1240
1101B376j3555K8141l4326j4274O0923m870m4059K3970o970l3952N5944K8128
1113D7476o9005o150M2049k1928J451L9113l4901k4815M1896k1043k3678O9758
1125D0223k022q4746J7757N1797j7442Q212O345n7047J1584O4640l4821k7586
1137b3106N4666k4647n5779N3269K7845l9056J7885j980n6038L7403O0439m6279
1149D622k3669L0607l5510l188P6881k2850o9373L7415J8562l6678L5239K0712
1161C2770n1591P594K3155m3048K6289O8779o2109o4359O0818K4518k4806K5579
1173B3589k0412m9186M6736K8715m7202K2343L1396o7603r159P3101j4945l2190
$$ plain form
1185 -14817 19402 -7008 -44700 14112 32817 -9128 8135 -606 -52385 4028 67091 -5885
1197 -5885 -45206 10156 4041 -13965 24655 6706 -21161 16330 -5458 -44717 30131 59847
1209 59847 -31481 -45685 14059 8384 9265 30464 -22062 -39780 24516 15426 -17698 24046 11023
1222 11023 -43689 -499 33003 -13807 -1250 32128 -22026 -38022 21952 22488 3790 11618
1234 11618 -33476 -39941 48992 44962 -42570 -23008 27060 -4901 -10937 16171 -1040 682 12940
1247 12940 -34028 -23422 56894 24927 -50388 -15055 18095 -3321 14191 16717 -29904 -15563
1259 -15563 21251 -4230 -1918 25287 -17302 -30953 24887 10859 -25327 16819 21441 -32322
1271 -32322 -18977 19352 11806 11482 -2456 -43471 -6005 54187 3273 -41646 7233 16454 -16104
$$ packed form
1185a4817L4219k6410l7692N8812J8705m1945J7263q741n1779N6413O3063p2976
1197e885l9321N5362o115j8006L8620j7949k7867L7491k1788l9259P4848K9716
1209E9847r1328j4204N9744n675Q81K1199n2526j7718O4296r090l3124M1744j3023
1222A1023n4712M3190L3502m6810J2557L3378n4154j5996N9974N36j8698P828
1234A1618m5094o465Q8933m030q7532J9562N0068l1961o036K7108j7211J722J2258
1247A2940m6968J0606Q0316l1967p5315L5333L3150k1416J7512K526m6621J4341
1259a5563L6814k5481K312K7205m2589j3651N5840j4028l6186M2146M622n3763
1271c2322J3345L8329p546l24j3938m1015L7466O0192n0914m4919M8879R221l2558
$$ plain form
1284 -16104 1372 11126 -5165 7356 -840 -28748 6874 38353 -9879 -25551 10945 -2205
1296 -2205 -10716 26488 10433 -30178 -7602 13882 4285 10390 -2251 -25549 7595 28412 -19705
1309 -19705 -20223 32757 13107 -31213 -10755 14693 16943 11969 -21725 -30202 24389 34351 -21344
1322 -21344 -21588 18115 5405 -10859 5255 873 -2495 10682 -6724 -17046 13219 13921 -10643
1335 -10643 -1696 2721 -14659 4530 26239 -7994 -26264 4275 14934 3083 -2818 -13514
1347 -13514 -2781 21190 -725 -27436 5103 28546 -7421 -25532 1376 15192 7898 -4545
1359 -4545 -18674 -2808 21436 1537 -18186 2614 9856 -7637 -3572 7225 -1542 -3902 3643
1372 3643 -1853 -2887 3464 -2152 537 7827 -7976 -12275 13295 14476 -12505 -13804 6990 11375
$$ packed form
1284a6104J7476R754j6291J2521q196k7908L5622L1479m8232j5672L6496j3150
1296b205q511L7204j6055m0611K2576K1484r597O105j2641k3298L3144K0817m8117
1309a9705n18N2980j9650m4320K0458K5448K250m974l3694q477N4591R962n5695
1322b1344k44L9703j2710j6264J6114m382l368J3177j7406j0322L0265P02k4564
1335a0643Q947M417j7380J9189K1709l4233j8270L0539J0659j1851n901j0696
1347a3514J0733K3971k1915k6711L2539K3443l5967j8111K6908J3816p294j2443
1359d545j4129J5866K4244j9899j9723K0800P242j7493M065J0797q767k360P545
1372C643n496j034O351n616K689P290j5803m299K5570J181k6981j299K0794M385
$$ plain form
1386 11375 976 -8205 -7439 8361 12667 -9947 -12522 11514 10700 -7661 -7384 3083 5510 2981
1400 2981 -1862 -5525 920 6342 -234 -1854 1638 -3498 -670 8526 819 -9418 -459 9135 2905
1415 2905 -7392 -5078 5666 9060 -1914 -12825 -140 14942 2174 -13334 -4425 9455 6925
1428 6925 -5956 -8410 2396 8535 526 -8414 -2710 7196 2253 -5484 -2805 1281 1969 370 -2786
1443 -2786 -1997 606 1304 407 -2051 -2270 -297 2001 1340 -3810 -3175 3049 2639 -2314 -3440 317 3704
1460 3704 -270 -3669 -811 1966 1670 -2140 -1857 2015 1237 -1449 -596 786 682 -677 -699 1455 551
1477 551 -1212 -171 1279 1581 -953 -1877 1877 1915 -402 -709 -483 1948 1547 -1111 -1221 662 2158
1494 2158 618 -1083 -274 721 1789 1316 -2905 -898 3544 1686 -2128 -1829 1081 2847 514 -2807
$$ packed form
1386A1375j0399r181P66J5800M306k2614k575K4036q14j8361K77J0467K427k529
1400B981m843l663O445N422o576j620L492n136K828R196p707j0237Q959R594o230
1415B905j0297K314J0744L394j0974j0911J2685J5082j2768j5508Q909J3880k530
1428F925j2881k454J0806O139q009q940N704R906m943p737K679M086O88j599l156
1443b786P89K603O98q97k458k19J973K298o61n150O35O224m10m953j126L757L387
1460C704l974l399K858K777k96l810K83L872p78k686Q53J382j04j359k2K154r04
1477E51j763J041J450L02k534r24L754L8k317l07K26K431m01k658j10J883J496
1494B158j540j701Q09R95J068m73m221K007M442j858l814K99K910J766k333l321
$$ plain form
1510 -2807 -1516 3090 2575 -3457 -2509 3809 1091 -2544 -680 -95 1034 1224 -1750 -1733 1740 130
1526 130 -2944 1079 2783 -3476 -2671 3743 547 -2317 -586 -1479 681 2250 -2684 -3219 3966 2015
1542 2015 -6101 -1342 4651 -685 -2246 608 -3141 -16 5139 -1706 -4144 2106 141 -2140 4194
1557 4194 1094 -6282 1123 6498 -4658 -3170 5861 675 -2077 -83 -3965 2462 10531 -4139
1571 -4139 -13023 4990 11275 -3361 -4703 1628 -883 3191 3176 -7174 1062 11395 -5894 -10891
1585 -10891 7672 7856 -3904 -194 -1180 -5941 6819 8837 -8441 -3941 6291 -4655 -580 9829
1599 9829 -4049 -8158 7356 528 -8675 6834 7909 -9025 -3361 2682 -4300 6861 9793 -14628
1613 -14628 -9509 13279 2452 -7402 5351 -674 -10332 4791 5009 -6772 5411 4725 -16173
$$ packed form
1510b807J291M606n15o032R48O318k718l635J864N85J129J90k974J7L473j610
1526A30l074M023J704o259Q05O414l196k864J731q93K160J569m934n35P185j951
1542B015q116M759N993n336j561K854l749L125N155o845k438O250j965k281O334
1557D194l100p376P405N375j1156J488R031n186k752J994l882O427Q069j4670
1571d139q884J8013O285j4636j342O331k511M074j5j0350Q236J0333j7289m997
1585a0891J8563J84j1760L710r86m761J2760K018j7278M500J0232j0946M075J0409
1599I829j3878m109J5514o828r203J5509J075j6934N664O043o982J1161K932k4421
1613a4628N119K2788j0827r854J2753o025r658J5123K18j1781J2183o86k0898
$$ plain form
1626 -16173 -1976 15732 -2936 -6065 6081 -7818 -8697 13839 6017 -10385 1182 -718 -10555
1639 -10555 11038 13238 -15070 -6280 10842 -6443 -3380 14899 -2281 -11818 4761 -1927 -5262
1652 -5262 17367 5213 -22871 -1665 15047 -3945 1854 8906 -14408 -7130 15693 -623 -6245
1665 -6245 12586 -4147 -18792 9715 13878 -7803 3051 3104 -18865 2324 23328 -4900 -10447
1678 -10447 6209 -8187 -5854 20366 3018 -17736 4857 4045 -13691 10592 17543 -15087 -9296
1691 -9296 7170 -7019 5514 20712 -13152 -21744 13042 7955 -8542 10455 3077 -20287 1748
1704 1748 12660 -7848 6806 11596 -23194 -12776 23127 5533 -9860 5439 -7941 -14928
1716 -14928 16804 12204 -14576 1982 4183 -19674 3799 24061 -7560 -12355 6380 -8908
$$ packed form
1626a6173J4197J7708j8668l129J2146j3899q79K2536p822j6402J1567j900r837
1639a0555K1593K200k8308Q790J7122j7285L063J8279j7180r537J6579o688l335
1652e262K2629j2154k8084K1206J6712j8992N799P052k3314P278K2823j6316n622
1665f245J8831j6733j4645K8507M163k1681J0854N3k1969K1189K1004k8228n547
1678a0447J6656j4396K333K6220j7348k0754K2593q12j7736K4283O951l2630N791
1691i296J6466j4189J2533J5198l3864q592L4786n087j6497J8997p378k3364K2035
1704A748J0912k0508J4654M790l4790J0418L5903j7594j5393J5299j3380o987
1716a4928L1732m600k6780J6558K201k3857K3473K0262l1621m795J8735j5288
$$ plain form
1728 -8908 -5056 23355 2886 -21125 1798 3884 -8811 15525 12275 -23821 -7439 16078 -4745
1741 -4745 -738 16548 -9995 -17364 10870 4603 -4451 16139 -1951 -28129 5833 22914 -5992
1754 -5992 -2062 5635 -16590 -4074 21147 -589 -9456 9006 -7941 -15537 19237 13995 -16355
1767 -16355 -504 5029 -15221 6060 21933 -8813 -12376 4702 -6767 1134 23433 -5039
1779 -5039 -25395 7609 12244 -10069 5803 9622 -14452 -3894 8212 -6758 5976 17896
1791 17896 -16959 -21508 16529 12741 -7751 3009 -3755 -15646 10086 14486 -11611 -1364 7503
1804 7503 -13781 -3376 18144 -2008 -9169 7955 -6154 -14060 15557 13900 -13439 -6302 -20
1817 -20 -5550 13921 12368 -20098 -9907 17168 -328 -10229 10054 3624 -9954 958 -935
$$ packed form
1728h908L852K8411k0469k4011K2923K086j2695K4336l250l6096J6382K3517k0823
1741d745M007J7286k6543p369K8234o267r054K0590j8090k6178L3962J7081k8906
1754e992L930P697k2225J2516K5221k1736q867J8462j6947p596L4774n242l0350
1767a6355J5851N533k0250K1281J5873l0746l563J7078j1469P901K2299k8472
1779e039k0356L3004M635k2313J5872L819k4074J0558J2106j4970J2734J1920
1791A7896l4855m549L8037l788k0492J0760o764j1891K5732M400k6097J0247Q867
1804G503k1284J0405K1520k0152p161J7124j4109p906K9617j657k7339P137O282
1817b0n530J9471j553l2466J0191K7075j7496r901K0283o430j3578J0912j893
$$ plain form
1830 -935 -3952 16674 5223 -23896 -3669 18702 136 -4590 4710 -7839 -6146 13008 2808
1843 2808 -7830 5900 -456 -11498 7994 9668 -9791 795 8179 -11646 -5294 15652 4207
1856 4207 -8536 -2088 -4118 1074 15895 -989 -18397 4227 12405 -7403 -3525 8453 -2180
1869 -2180 -3640 1607 -4588 1652 12440 -4654 -14369 5430 7478 -4505 3009 2029 -11416 -113
1883 -113 10799 -1413 -4912 1047 -3173 264 6592 -5131 -6824 10841 2678 -14879 -601 12593
1897 12593 1566 -6271 -6298 -2618 9366 7842 -11690 -8837 10991 4764 -9026 -337 4774 -1221
1911 -1221 -169 -1909 -4158 5248 5696 -6687 -4330 4612 739 -311 4792 -3519 -7348 5486 6846
1926 6846 -4175 -3424 1006 1915 3694 -1764 -6838 3818 9220 -5075 -9450 5166 8886 -2070
$$ packed form
1830i35l017K0626j1451k9119K0227K2371j8566m726R300j2549J693J9154j0200
1843B808j0638J3730o356j1042J9492J674j9459J0586P384j9825O352K0946j1445
1856D207j2743O448k030N192J4821j6884j7408K2624Q178j9808L878J1978j0633
1869b180j460N247o195O240J0788j7094r715J9799K048j1983P514r80j3445J1303
1883a13J0912j2212l499N959m220L437O328j1723j693J7665q163j7557J4278J3194
1897A2593j1027p837k7L680J1984j524j9532K853J9828o227j3790Q689N111n995
1911a221J052j740k249R406M48j2383K357Q942l873j050N103q311l829J2834J360
1926F846j1021P51M430R09J779n458n074J0656N402j4295m375J4616L720j0956
$$ plain form
1940 -2070 -5594 -2294 3659 6742 -2010 -7737 2410 6628 -2718 -3939 2915 1702 -1713 499 139
1955 139 -1268 1674 797 -882 573 -1343 -2063 4015 2732 -5586 -3546 5409 4160 -4330 -4433 1476
1971 1476 4270 963 -5498 -3432 5933 3355 -5786 -4029 3898 3532 -2128 -3567 -375 2616 1732
1986 1732 -1883 -2419 1202 1023 -743 84 -689 -1848 934 2456 -797 -3358 -153 3647 1123 -3594
2002 -3594 -2868 2928 4625 -2367 -5460 1491 5668 358 -5372 -1684 4642 3011 -3158 -3330 1838
2017 1838 4164 -823 -3648 394 2989 1211 -1535 -1069 1180 1124 -19 -292 -249 345 799 563 280
2034 280 -1087 -532 2202 874 -1978 -1255 1653 2128 -906 -2199 593 2116 335 -2036 -1168 1949
2050 1949 1273 -1798 -517 955 492 -481 -1077 424 428 -390 -233 149 94 -972 -535 1626 139 -2284
$$ packed form
1940b070l524L300N953L083q752n727J0147M218r346j221O854j213l415K212l60
1955A39j407K942q77j679J455j916p20O078j283q318K040Q955j249q490j03N909
1971A476K794l307o461K066R365k578r141J757P927l66n660j439L192K991q84
1986A732l615n36L621j79j766Q27p73j159K782J522l253k561L205L800k524m717
2002c594P26N796J697o992l093O951M177n310n730L688O326j631o169j72N168
2017A838K326m987k825M042K595j778k746M66K249n6j143k73M3N94M54k36k83
2034B80j367N55K734j328k852P23K908M75l034j293K792J523j781k371Q68L117
2050A949o76l071J281J472m63r73n96J501Mq18J57L82n5j066M37K161j487k423
$$ plain form
2068 -2284 -556 873 185 -785 -1165 228 1224 -160 -1838 -298 2036 -128 -1990 -89 498 -111
2084 -111 601 -800 -1275 1091 735 -697 -124 452 -634 158 950 -1447 -639 2431 -165 -2229 824
2101 824 1206 -75 510 -699 -1313 1747 1794 -2211 -226 2512 -987 -1507 2465 650 -1334 849 -314
2118 -314 -751 2331 731 -2065 1317 1430 -2288 107 3743 -975 -3015 1714 622 -47 2507 -1219
2134 -1219 -2793 2614 1725 -2594 1116 2334 -3231 -995 3109 -1450 -1162 3197 -1712 -3485 2723
2149 2723 1316 -1370 1497 -1564 -4682 3239 5150 -4760 -3229 3678 -613 -1709 2659 -1332 -1367
2164 -1367 3058 -3078 -4757 6081 4291 -6627 -2756 3398 -493 1101 2409 -4909 -2229 5174
2178 5174 -1323 -2837 4822 -704 -5974 2667 2841 -3216 2291 3101 -5946 -1681 6090 -211 -724 2780
$$ packed form
2068b284J728J429o88r70l80J393R96j384j678J540K334k164j862J901N87o09
2084a11P12j401m75K366l56j432N73N76j086P92P92k397Q08L070k596k064L053
2101H24L82j281N85j209o14L060M7m005J985K738l499n20L972j815j984K183j163
2118c14m37L082j600k796L382J13l718K395L636m718k040M729j092o69K554l726
2134a219j574N407q89m319L710J218n565K236M104m559K88M359m909j773O208
2149B723j407k686K867l061l118P921J911r910J531O907m291j096M368l991l5
2164a367M425o136j679J0838j790j0918L871O154l891J594J308p318K680P403
2178E174o497j514P659n526n270Q641J74o057N507Q10r047M265P771o301n13L504
$$ plain form
2194 2780 -5622 -3076 8923 1672 -6790 1595 2400 -4608 2147 4817 -3448 -484 3026 -5720 360
2209 360 9679 -2262 -7224 3293 587 -2804 6232 1918 -8019 137 4552 -2432 2291 4833 -7482
2224 -7482 -3656 7553 -1029 -3558 6191 -975 -8126 2797 4589 -2072 2802 -287 -9390 2079
2238 2079 11193 -3391 -5834 3943 -2805 -3151 7024 649 -5631 2792 -472 -7235 5331 7970
2252 7970 -7071 -3980 3350 -3600 1309 9162 -4831 -8538 4509 1666 -2682 5738 323 -9050
2266 -9050 1974 5317 -4764 2029 6809 -8151 -6133 7409 1619 -983 4258 -5567 -7622 8674
2280 8674 6079 -7133 417 3006 -7110 985 8552 -2915 -2638 3554 -5911 -2705 11308 1640
2294 1640 -9078 972 1532 -4228 6301 5735 -8396 -2820 5559 -3044 1010 8317 -5371 -7969
$$ packed form
2194B780q402K546J1999p251q462Q385Q05p008O755K670q265K964L510q746O080
2209C60R319j1941m962J0517k706l391R036m314r937Q156M415o984M723K542j2315
2224g482L826J1209q582k529R749p166p151J0923J792o661M874l089r103J1469
2238B079R114j4584k443R777o748l46J0175o375o280Q423l264o763J2566K639
2252G970j5041L091P330o950M909P853j3993l707J3047k843m348Q420n415r373
2266i050J1024L343j0081O793M780j4960K018J3542n790k602N241r825k055J6296
2280H674k595j3212P550K589j0116Q095P567j1467K77O192r465L206J4013r668
2294A640j0718J0050N60n760J0529n66j4131N576Q379q603M054P307j3688k598
$$ plain form
2308 -7969 5595 1873 -3259 6265 691 -9952 1260 6873 -2463 1698 3100 -9411 -2259 10156
2322 10156 -372 -4512 3639 -2792 -6211 6516 4933 -5066 854 276 -7327 3997 9323 -5388
2336 -5388 -5105 3334 -2767 -1240 8067 -868 -7766 2203 1181 -3441 5492 3136 -8830 -1228 5651
2351 5651 -2993 336 6163 -5164 -6358 4506 2165 -929 3974 -2881 -8030 5166 6736 -5251
2365 -5251 -755 3869 -5203 -1776 6052 -168 -1330 2790 -4887 -4664 8678 4334 -7044 -890 2505
2380 2505 -3189 2897 5033 -4946 -2392 3797 -2393 -1117 6469 -1102 -5934 2704 1385 -3056 4748
2395 4748 3151 -7477 -2141 5108 218 533 1771 -5602 -1581 6700 -215 -4993 3579 1721 -5690
2410 -5690 445 3759 -999 1072 -102 -6104 1442 7389 -2039 -5225 2153 39 -2134 3421 804
$$ packed form
2308g969J3564l722n132R524n574j0643J1212N613r336M161J402j2511P152J2415
2322A0156j0528m140Q151o431l419J2727j583r999N920n78p603J1324N326j4711
2336e388K83Q439o101J527R307q935o898R969j022m622Q933k356j1966P602O879
2351E651q644L329N827j1327j194J0864k341l094M903o855n149J3196J570j1987
2365e251M496M624r072L427P828o220j162M120p677K23J3342m344j1378O154L395
2380B505n694O086K136r979K554O189o190J276P586p571m832Q638j319m441P804
2395D748j597j0628N336P249m890L15J238p373M021Q281o915m778Q572j858p411
2410e690O135L314m758K071j174o002P546N947r428l186P378k114k173N555k617
$$ plain form
2425 804 -4169 632 1286 -3096 1628 3186 -3866 -1407 2596 -2507 -1052 4822 -459 -5502 344
2440 344 2471 253 1376 -1488 -4220 2854 4288 -3608 -2067 3885 -604 -2835 1192 875 337 1581
2456 1581 -2335 -3645 3468 3465 -2936 -937 1316 -1785 962 3404 -1734 -2559 2045 1161 -911 681
2472 681 -365 -832 2365 -91 -3823 2087 4561 -2174 -3965 1010 2691 1433 -1103 -3297 -64
2487 -64 4617 46 -4348 833 3371 -822 -1733 102 573 1675 406 -2730 -735 2568 705 -2058
2503 -2058 -96 36 -908 1877 855 -2410 -521 1962 277 -1050 -1119 -78 1620 670 -2471 -1631
2519 -1631 3048 1650 -2885 -2088 1455 1820 -118 -2261 -1174 1890 1660 -1915 -1485 1378 1338 -979
2535 -979 -624 382 44 506 -111 -655 158 574 178 652 -225 -1394 538 2077 80 -2271 -311 2176
$$ packed form
2425H04m973M801O54m382M724J558p052K459M003n103J455N874n281n043N846
2440C44K127k218J123k864k732P074J434p896J541N952m489k231M027l17n38J244
2456A581l916j310P113lo401J999K253l101K747K442n138q25M604q84k072J592
2472F81j046m67L197k456l732N910K474o735j791M975J681j258k536k194L233
2487f4M681m571m394N181K538m193r11J835M71J102j269l136J995L303j863k763
2503b058J962J32r44K785j022l265J889K483j685j327o9J041J698r50l141Q40
2519a631M679j398m535P97L543L65j938k143J087L064k30l575M30K863m0k317
2535i79L55J006l38M62o17n44Q13M16l96M74q77j169J932J539j997k351J960K487
$$ plain form
2553 2176 1122 -1344 -1568 1228 2455 -239 -2620 -28 2835 892 -2192 -980 1398 1253 -720
2568 -720 -1235 88 1364 706 -949 -144 396 363 255 -213 -422 -375 731 747 -852 -1166 537 1126 -218
2587 -218 -1972 -624 1795 1200 -1477 -1792 1130 2120 -521 -2153 152 1792 867 -1838 -1040 1211
2603 1211 1239 -922 -1102 147 1032 17 -1073 -173 443 175 -275 -498 -111 -84 -265 671 -225 -837 -95
2622 -95 889 188 -540 -332 543 609 -252 -1016 116 1402 116 -1228 286 1346 3 -548 -197 364
2640 364 470 64 -552 -281 714 313 -242 772 -69 -644 906 469 -600 -202 577 79 185 -242 -608
2659 -608 825 1191 -1002 -1428 1080 991 -718 -381 -105 2 797 154 -1248 181 1368 -846 -600 930
2677 930 208 -912 258 -292 -975 938 341 -1161 -12 542 -461 345 787 -1326 -700 1568 -673
$$ packed form
2553B176j054k466k24K796J227k694k381K592K863j943l084J212K378j45j973
2568g20n15J323J276o58j655Q05N40l3j08m68k09M7J106J6j599l14J703N89j344
2587b18j754J348K419n95k677l15K922R90k641j632K305J640r25k705P98K251
2603A211K8k161j80J249Q85j015j090R00O16k68m50k23L87K7j81R36q96o12P42
2622i5R84p01p28K08Q75O6q61p64J132J286j286j344J514J060j343n51L51N61
2640C64J06m06o16K71R95m01n55J014q41n75J550m37j069L98P79m98J06m27l66
2659f08J433L66k193m26K508q9j709L37K76J07P95o43j402J429J187k214K46J530
2677I30p22j120J170n50o83J913n97j502J149N54j003Q06M42k113O26K268k241
$$ plain form
2694 -673 -1051 1383 -25 -1283 202 19 -639 1136 309 -1914 290 1490 -1096 -696 1275 -912
2710 -912 -1612 1543 493 -1247 561 -573 -1601 1517 1127 -1943 -218 1489 -1509 -497 2520 -557
2726 -557 -1625 1140 -735 -964 2325 379 -2539 398 1078 -912 1229 1610 -2427 -909 2947 -310
2742 -310 -1257 2022 -717 -2141 1710 498 -1048 1980 489 -3913 284 3950 -727 -1467 925 -1496
2758 -1496 -484 3171 -557 -1778 1846 -467 -2780 2218 2509 -2558 -923 1031 -1977 560 3683
2773 3683 -1747 -2806 1587 -544 -765 3390 -389 -4396 1298 2122 -2220 741 1975 -2969 -1428
2788 -1428 2281 -797 136 3146 -2658 -3908 3290 2273 -2441 455 60 -3398 928 3153 -1988
2803 -1988 -1133 1688 -2514 -1070 4488 -254 -3268 1866 41 -3143 3045 3271 -3058 -1164 1038
$$ packed form
2694f73l78K434j408j258J485j83o58J775q27k223K204J200k586M00J971k187
2710i12p00L155j050j740J808j134j028L118l90l070J725J707k998J012L017l077
2726e57j068K765j875k29L289j946k918K937O80j990K141L81m037J518L856l257
2742c10r47L279k739j424L851j212j546L028j491m402M197L666m677p40K392k421
2758a496J012L655l728j221L624k313k313M998K91n067J635J954l008K537L123
2773C683n430j059M393k131k21M155l779m007N694Q24m342K961J234m944J541
2788a428L709l078R33L010n804j250P198j017m714K896l95l458M326K225n141
2803a988Q55K821m202J444N558m742l014N134j825l184O188K26o329J894K202
$$ plain form
2818 1038 -1580 1857 3887 -4101 -3343 3904 322 -2131 2966 450 -3444 1171 1578 -1688 2363
2833 2363 2157 -5087 -1790 4903 56 -1230 2182 -2632 -2798 4641 1685 -3376 1012 702 -3496 1851
2849 1851 3820 -2425 -912 2528 -3390 -1481 5473 284 -4137 394 205 -948 3915 1101 -5281
2864 -5281 5 3343 -2101 -99 3667 -2603 -3084 2461 -401 -918 3409 -1122 -5255 1679 3225
2879 3225 -1876 379 1112 -4462 -378 4443 -1130 -1678 2035 -2331 -2313 4198 1197 -3051 1251 305
2895 305 -3680 1910 4201 -2638 -1937 1378 -1683 671 4405 -2097 -4279 2583 722 -1987 2550
2910 2550 1280 -3958 -40 2172 -1719 1279 3211 -3404 -2613 3762 518 -1166 2466 -1309 -3765
2925 -3765 2548 2889 -2077 273 1276 -3130 296 3569 -1682 -1314 2465 -2189 -2582 3680 1634 -2803
$$ packed form
2818A038k618L437K030p988P58P247l582k453N097k516l894M615M07l266M051
2833B363k06p244L297O693m847j286L412m814j66P439k956n061M388l10m198N347
2849A851J969o245J513L440n918J909O954n189m421M531j89j153M863k814o382
2864e281N286L338n444K002L766o270m81N545k862n17M327m531m133O934J546
2879C225n101K255P33n574M084M821n573n48L713m366J8O511l001m248M302r46
2895C05l985N590K291o839P01L315l061K354L734o502k182O862j861k709M537
2910B550j270n238L918K212l891K998J932o615P91O375l244j684L632l775k456
2925c765O313L41m966K350J003m406L426L273n251L68L779m654l93O262k046m437
$$ plain form
2941 -2803 -261 62 -1657 2710 2239 -3932 -782 3057 -1516 -1165 2983 -617 -2351 1010 -70 -1065
2957 -1065 2868 414 -4378 134 3127 -1182 -190 1214 -2484 -1040 3013 -395 -1485 1550 -713
2972 -713 -2314 1757 1312 -1859 649 461 -2722 317 3252 -861 -1817 716 -695 87 2669 -694
2988 -694 -2453 1548 1083 -2419 652 2610 -1729 -1042 763 -667 759 2091 -1992 -1929 2145 866
3004 866 -1215 1240 550 -1868 625 1639 -957 -35 1152 -1309 -461 1807 -444 -671 1758 -493
3020 -493 -1910 1536 1918 -1182 -669 307 -467 1325 1117 -2124 -321 2016 -565 -1655 1150 1011 -1127
3037 -1127 -1 -121 -1004 1190 466 -1993 -394 1522 -235 -486 793 -1204 -745 1389 254 -1209
3053 -1209 118 555 -529 -229 -164 -594 881 764 -2048 -874 1849 958 -1392 -859 271 751 446
$$ packed form
2941b803K542L23j719M367m71o171L150L839m573L51M148l600j734L361j080r95
2957a065L933k454m792M512K993m309R92J404l698J444M053l408j090L035k263
2972g13j601M071m45l171K508j88l183L039K935m113r56K533j411P82K582l363
2988f94j759M001m65l502L071J958m339O87J805j430J426J332m083O3M074j279
3004H66k081K455o90k418K493J014k596R22J187k461Q48K268k251k27K429k251
3020d93j417L446L82l100N13R76p74J792k08l241J803K337k581j090K805j39k138
3037a127J126j20q83K194p24k459J599J916j757k51J279j997M59K134j135j463
3053a209J327M37j084L00O5m30J475j17k812J174K723q91k350N33J130M80l05
$$ plain form
3070 446 -1053 -1489 1328 1297 -1527 -944 1302 707 -185 -492 -368 650 755 -211 -1028 617 741 -194
3088 -194 197 21 -794 610 920 -578 -681 362 758 140 -367 -452 770 1062 -226 -1542 565 1568
3106 1568 60 -988 -412 713 760 -271 -1105 83 1002 33 -662 -141 540 17 -100 -196 -76 66 267
3125 267 -196 -326 -116 150 558 120 -737 -810 645 879 -744 -952 580 1164 67 -1167 -405 961
3143 961 937 -1173 -1442 448 1066 -382 -1211 -305 764 445 -223 -740 -120 685 56 -662 -312 179 461
3162 461 162 -274 -512 240 1028 -129 -615 -215 754 724 -380 -838 74 1451 251 -1258 -435 1083
3180 1083 724 -464 -805 183 1250 -1 -1211 -297 1188 313 -265 -265 401 327 231 -304 -150 428 455 -213
3200 -213 340 -196 -286 318 380 -655 -574 702 487 -457 -356 -99 262 642 -624 -1059 846 967 -981
$$ packed form
3070D46j499m36K817l1k824N83K246n95q92l07J24J018J05r66q17J645J24r35
3088a94L91j76q15J404L10j498j03J043L96o18n07q5J222K92j288j316K107J003
3106A568j508j048N76J125M7j031q34J188R19r69o95N21O81n23j17r6J20J42K01
3125B67m63j30K10K66M08m38q57p3J455K34j623k08J532N84j097j234P62J366
3143I61k4k110k69J890O18j448q29R06J069l19o68n17O20Q05o29p18L50M91K82
3162D61k99m36k38P52P88j157m86M00R69l0j104m58R12J377j200j509Q23J518
3180A083l59j188l41R88J067j251j210R14J485q75n78%O66p4r6n35J54N78K7o68
3200b13N53n36r0O04O2j035Q1J276k15r44J01K57L61L80j266m35J905J21j948
$$ plain form
3219 -981 -377 102 190 78 -105 -470 1 794 -3 -676 481 -185 -514 405 148 -873 224 839 -519
3238 -519 -371 193 68 72 252 -969 -512 1599 513 -1472 -69 679 -338 -108 120 -785 411 725
3256 725 -932 -369 1317 23 -1377 522 302 -741 873 251 -1484 477 1006 -413 -36 506 -989
3273 -989 -176 1823 -191 -1181 816 90 -1403 826 873 -795 481 266 -1640 449 1696 -1012 -973
3290 -973 1018 -481 -813 1680 19 -1882 542 749 -1015 903 848 -1639 -197 1638 -1171 -596
3306 -596 2034 -672 -1985 869 694 -818 1060 -358 -2261 978 1532 -1298 -511 1174 -1489 -639
3322 -639 2025 -270 -1630 1392 -338 -1736 1614 1177 -1611 151 339 -1790 997 2688 -1477 -2053
3338 -2053 1605 -78 -844 1897 -186 -1930 1486 382 -1905 1625 1838 -2547 -1129 1920 -462
$$ packed form
3219i81O04M79Q8j12j83l65M71P93p97o73J157o66l29R19k57j021J097O15j358
3238e19J48N64j25MJ80j221M57K111j086j985J403P48j017K30K28r05J196L14
3256G25j657N63J686j294j400J899k20j043J614o22j735J961N29j419L77N42j495
3273i89Q13J999k014r90J997p26j493K229M7j668J276k15j906K089J247k708L9
3290i73J991j499l32K493j661j901K424K07j764J918n5k487J442J835k809N75
3306e96K630k706j313K854j75j512J878j418j903L239N54k830P87J685k663Q50
3322f39K664k295j360L022j730j398L350m37k788J762J88k129K787J691m165n76
3338b053L658j683p66K741k083j744L416j104k287L530K13m385J418L049k382
$$ plain form
3353 -462 -302 1679 -1708 -1631 2546 469 -1518 1254 -393 -2591 1239 2160 -1784 -82 1694 -1798
3369 -1798 -1003 2656 145 -1314 1275 -1251 -1648 3308 1254 -3168 -268 1697 -1337 698 2321
3384 2321 -2098 -1311 1753 -1104 -805 3069 -477 -3073 1245 1384 -1575 1597 1145 -3453 -449 2978
3400 2978 -720 -91 1527 -2620 -1555 3574 162 -2481 1344 509 -2840 1054 2094 -1326 -117
3415 -117 412 -2760 149 4194 -1353 -2986 1415 -47 -1599 2443 540 -3072 656 1608 -2143 793
3431 793 2641 -2427 -1630 2027 -746 -627 3097 -1126 -3578 1619 1737 -962 790 84 -2713 1285
3447 1285 3421 -1942 -934 2581 -1813 -2006 2735 586 -1433 1175 -764 -2383 2618 2183 -3180
3462 -3180 -814 1803 -1457 208 2906 -1341 -2099 1795 -387 -1266 2429 507 -2772 665 1181 -2030
$$ packed form
3353d62J60J981l387P7M177k077j987K772j647k198L830R21l944J702J776l492
3369a798P95L659k511j459K589k526l97M956k054m422K900J965l034K035J623
3384B321m419P87L064k857K99L874l546k596M318J39k959L172m52m598L004L427
3400B978l698O29J618m147J065N129l412k643L825q35l349L894J040l420J209
3415a17N29l172K909M045n547j633M401j462j552M042j903l612L728R52l751K936
3431G93J848n068P97L657k773J19L724m223k452N197J18k699J752p06k797L998
3447A285K136n363J008L515m394j93M741k149k019K608j939j619N001m35n363
3462c180K366K617l260J665K698m247p58L894k182q79L695j922l279L437N16l211
$$ plain form
3478 -2030 1301 2385 -2986 -1880 2614 9 -564 1367 -1667 -1944 2563 538 -2268 1119 1280 -2328
3494 -2328 102 2190 -882 -378 1064 -1964 -912 2967 -60 -2257 676 13 -1300 1969 1282 -2494
3510 -2494 -459 1722 -1348 -205 2032 -1393 -1154 1477 -640 -1216 2507 122 -3246 382 1899
3525 1899 -624 573 537 -2180 374 2464 -1272 -1056 2181 -315 -1600 1170 958 -744 800 -112
3541 -112 -2101 1154 2334 -1366 -702 917 -835 -32 1881 -495 -1558 1132 557 -966 841 1016
3557 1016 -1237 330 829 -1388 239 1923 -1383 -1926 1407 552 -454 689 -470 -1150 1413 456
3573 456 -1713 38 1562 -1028 -700 814 -138 -188 537 -1050 -823 1335 161 -1190 226 308 -1015
3590 -1015 337 904 -1164 -616 942 -546 -204 762 -482 -570 664 -109 -1177 1098 735 -1383 -543
$$ packed form
3478b030L331J084n371J106M494k605n73J931l034k77M507k025k806L387J61l608
3494b328K430K088l072N04J442l028J052L879l027k197K933o63j313L269o87l776
3510b494K035K181l070J143K237l425K39K631k117n76L723k385l368L628J517
3525A899k523J197l6k717K554K090l736K16L237k496j285K770k12j702J544r12
3541a12j989L255J180l700O64J619j752Q03J913k376j063K690n75j523J807J75
3557A016k253J567M99k217J627J684l306n43L333q55j006J143j159o80K563r57
3573D56k169J751J524k590L28J514r52n0P25j587K27K158j174j351J416Q2j323
3590a015J352N67k068N48J558j488L42R66j244q8J234p73j068K275l63k118Q40
$$ plain form
3607 -543 1047 21 -135 15 -794 207 868 -481 -738 889 564 -791 34 382 163 374 253 -877
3625 -877 -125 793 -86 -248 40 -116 -232 794 -284 -1241 404 1015 -433 -703 304 409 417 -18 -994
3644 -994 69 1453 -36 -1167 16 998 163 -421 -541 30 681 271 -1102 110 877 100 -415 -139
3662 -139 201 62 -25 -124 -388 149 543 -198 -272 -12 -346 460 273 -466 -468 862 690 -702 -453 464 527
3683 527 40 -714 -730 491 587 -615 -646 275 432 -225 -382 -160 276 75 -29 -172 288 241 -28 -308 -190
3704 -190 -230 478 437 129 -357 76 492 162 -286 -274 93 770 -74 -820 -139 1033 408 -772 -507 531
3724 531 750 -165 -909 -210 718 453 -771 -130 713 465 -495 -634 -124 629 112 -456 -167 131 239 182
3744 182 -170 -158 -334 368 471 -808 -433 596 377 -227 -639 -183 576 460 -552 -582 633 503 -224
$$ packed form
3607e43J590j026j56J50q09J001O61j349k57J627l25j355Q25L48k19K11j21j130
3625h77P52R18q79j62K88j56j16J026j078r57J645O11j448k70J007J05Qm35r76
3644i94J063J384j489j131J183R82q35n84j20N71O51m10j373J212P67p77n15K76
3662a39L40j39q7r9k64N37L94p41p4K60l34Q06j87p39kJ330j72j392K49R17O3
3683E27m87p54j6J221R6j202l1R21J57o57j57K22M36k01j04j43M60m7k69k80J18
3704a90m0P08m1l08m86M33M16l30m48J2L67O77q44p46O81J172o25j180K65J038
3724E31K19r15p44O99R28k65j224O41Q43k48r60j39N10P53n17n68K89K98J08n7
3744A82l52J2j76P02J03j279L75J029k19o04m12M56P59j16j012l0J215j30p27
$$ plain form
3763 -224 -790 76 565 584 -430 -770 318 459 -390 -578 25 45 -342 350 -111 -430 304 385 -397 -151
3783 -151 229 101 376 66 -536 91 976 133 -376 -83 204 5 61 -286 -677 793 85 -1106 69
3802 69 1052 42 -537 237 -245 66 800 -95 -986 620 271 -392 299 143 -643 459 688 -874 -414
3821 -414 950 363 -630 129 -90 -13 982 -204 -1518 675 1452 -855 -533 622 -471 -68 517 -841
3839 -841 -299 1140 -194 -1321 904 765 -678 363 41 -1097 580 1067 -867 -875 640 -16 -382
3856 -382 1078 -427 -1039 1015 388 -1481 534 1003 -1029 -672 678 -650 397 1341 -1262 -1450 1302
3873 1302 422 -1190 735 68 -1557 630 983 -1282 224 1080 -1358 -460 1472 -349 -760 1329
3889 1329 -473 -1645 1606 1307 -1446 -218 76 -1175 1233 1522 -1544 -371 1442 -711 -1084 1561
$$ packed form
3763b24n66Q66M89J9j014l40J088J41q49j88O03K0l87O92m61l19P34Q1p82K46
3783a51L80j28K75l10o02O27Q85q43n09K93K87j99N6l47l91J470p08j191J175
3802F9R83j010n79P74m82L11P34q95q91J606l49o63O91j56p86J102K29j562M60
3821d14J364n87r93P59k19P7R95j186j314K193P77k307L22J155j093M03N85j358
3839h41N42J439j334j127K225j39j443J041l22j138J677M87j934qJ515o56l66
3856c82J460j505o12K054o27j869K015M69k032L57J350j328J047R44k603j88K752
3873A302q80j612J925o67j625K187L53k265J506Q56k438Q98J932j821m11K089
3889A329j802j172L251k99k753J228K94j251K408K89l066J173J813k153l73K645
$$ plain form
3905 1561 225 -1558 829 164 -1313 1602 1176 -2311 -75 1437 -616 -28 1333 -1489 -1229 2214
3921 2214 -61 -1547 1044 359 -1735 725 1009 -1539 904 1212 -2432 -675 2630 119 -1495 802
3937 802 -678 -844 2020 468 -2340 810 1168 -1811 475 1765 -1445 -1044 1381 -969 -569 2628
3953 2628 -504 -2373 1030 536 -1085 1729 587 -2895 73 2493 -1045 -693 1555 -1114 -1053 1614
3969 1614 -354 -1287 2004 -354 -3100 1414 2206 -1392 -353 587 -1877 167 2589 -1071 -1675 1441
3985 1441 -699 -1112 1969 264 -2237 1158 953 -2082 678 2485 -1542 -1552 1242 -583 80 2499
4001 2499 -1663 -2846 2176 1390 -1883 890 795 -1803 230 1149 -1052 140 1990 -1930 -1786 2376
4017 2376 534 -1472 1257 -526 -2223 1726 1731 -1939 -231 998 -1250 372 1908 -1520 -1286 1769
$$ packed form
3905A561j336j783K387o65j477K915m26l487K236J512k053N88J361k822K60L443
3921B214k275j486K591o85k094K460K84k548K443L08l644J757L305k511j614K297
3937H02j480j66K864j552k808L150L58k979K286J290l210M01K425k350M00L197
3953B628l132j869L403m94j621K814j142l482K968K420l538L52K248k669O1K667
3969A614j968r33L291k358k746M514P92l598J039R40k464K044K422l660o04L116
3985A441k140m13L081j705k501L395k05l035K760J807m027j0K794j825O63K419
4001B499m162j183N022p86l273K773r5k598K033R19k201J192J850l920J44M162
4017B376j842k006K729j783j697L949Nl670J708J229k248J622J536l428K34L055
$$ plain form
4033 1769 -658 -1791 2029 1268 -1957 74 655 -672 1169 1255 -2654 -723 2662 -461 -1317 1780
4049 1780 -495 -1976 1408 416 -1161 1219 645 -2251 216 1791 -893 -187 1245 -1490 -1026 2244
4065 2244 484 -1635 651 221 -822 1295 572 -1700 550 1626 -1566 -314 2396 -406 -1450
4080 -1450 474 -307 -443 1965 -306 -1917 1095 1010 -928 93 781 -1309 -202 1662 -488 -833
4096 -833 1251 -374 -1509 856 456 -762 959 -151 -1987 514 1776 -809 -1221 630 -438 -52
4112 -52 1063 -929 -938 1623 -32 -1815 737 1407 -715 -747 120 -578 520 1069 -1309 -1111 1356 213
4130 213 -792 740 28 -1063 674 342 -1092 233 1234 -990 -377 869 -219 150 718 -718
4146 -718 -854 1426 570 -977 -15 347 -165 429 93 -946 158 1211 -633 -879 980 565 -571
$$ packed form
4033A769k427j133L820p61l225K031N81j327J841Q6l909J931L385l123q56L097
4049A780k275j481L384r92j577K380n74k896K467J575k684P06J432k735M64L270
4065B244j760k119K286m30j043K117p23k272K250J076l192J252K710k802j044
4080a450J924p81j36K408k271j611L012q5j938J021O88k090J107J864k150l45
4096h33K084j625j135K365m00j218J721j110j836K501J262k585m12J851j068L86
4112e2J115j992rK561j655j783K552O70k122l2Q67o98J098N49k378J98K467j143
4130B13j005J532p12j091J737l32j434J325J001k224O13J246j088L69N68j436
4146g18j36K280q56j547R62L62n12N94l36j039J104J053j844k46J859m15j136
$$ plain form
4163 -571 215 -201 -399 981 154 -1108 -163 432 -287 -80 627 -538 -115 740 -41 -767 143 465 -420
4182 -420 -412 -12 -292 875 295 -1045 -228 1068 131 -1076 -175 -19 161 361 -597 -495 707 405 -941
4201 -941 -310 631 255 -109 -119 -34 7 537 -454 -609 -133 603 -5 -106 -182 -293 270 331 -618 -510 388 635
4223 635 -274 -310 -184 541 531 -514 -943 353 998 -411 -512 101 506 561 -328 -518 -56 610 -73 -405
4243 -405 -27 159 97 -176 -74 37 214 256 -273 -556 -189 433 40 -189 -457 -164 492 284 -435 -355 628
4264 628 299 -400 -378 -205 653 422 -844 -541 599 575 -293 -368 300 424 -17 -368 -277 326 279 -330 -543
4285 -543 194 211 -121 235 -211 -505 214 519 -174 -522 -76 363 373 -217 -862 350 715 -279 -960 -62
4305 -62 750 16 -414 -523 95 717 117 -785 -20 834 -88 -544 -129 410 194 13 -387 -411 347 158 -134
$$ packed form
4163e71P86m16j98J380q27j262R45N95p19K07P07j165M23Q55p81p26R10L22q85
4182d20QM00k80J167n80j340Q17J296r37j207R01J56J80K00r58J02J202l02j346
4201i41O31R41l76l64j0Q5M1N30r91j55M76P36o08j01p6j11N63O1r49J08Q98K47
4223F35r09l6J26P25j0j045m29J296O45j409j01O13M05N5q89j90M62O66o83l32
4243d05L78J86o2k73J02J11J77M2n29k83L67O22l93k29k68K93O56k08p19Q0R83
4264F28l29o99K2J73Q58k31j266L03J140k4q68p5O68J24m41l51R1O03m7o09k13
4285e43P37J7l32L56m46k94P19L05o93l48M46M39J0n90o45J212L65r94o81Q98
4305f2Q12p34m30j09O18O22o00r02P65Q54r22m56M15N39k16j81m00k4P58j89k92
$$ plain form
4326 -134 -414 -161 -30 261 84 -785 -248 660 331 -113 -291 255 640 -170 -401 -317 620 516 -854 -365
4346 -365 802 399 -191 -391 -312 177 721 -316 -611 446 180 -99 222 398 -410 254 573 -900 -368
4365 -368 569 12 -243 -15 -482 -198 931 -229 -769 258 846 -432 -126 -47 -208 364 201 -1058 -127
$$ packed form
4326a34k80K53J31K91j77q69N37R08l29m44j78N46L85q10k31Q4R37j04j370M89
4346c65J167m03n90k00P9M89N44j037k95J057k66k79L21J76q08O64L19j473N32
4365c68R37n57k55K28m67K84J129j160n40J027N88j278L06P9j61N72j63j259R31
$$ [...]
8191E3
##END NTUPLES=NMR FID
##END=
