##TITLE=1H_Pr ipid
 CDCl3,8 sc, 
 11.03.2021
##JCAMPDX= 6.0         $$ Bruker NMR JCAMP-DX V2.0
##DATA TYPE= NMR FID
##DATA CLASS= NTUPLES
##ORIGIN= UXNMR, Bruker Analytische Messtechnik GmbH
##OWNER= root
$$ XWIN-NMR		Version 3.5
$$ Thu Mar 11 11:04:28 2021 Russian Standard Time (UT+4h)  she@DPX200
##.OBSERVE FREQUENCY= 200.131506
##.OBSERVE NUCLEUS= ^1H
##.DELAY= (6, 6)
##.ACQUISITION MODE= SIMULTANEOUS
##.ACQUISITION SCHEME= undefined
##.AVERAGES= 8
##.DIGITISER RES= 18
##SPECTROMETER/DATA SYSTEM= spect
##.PULSE SEQUENCE= zg30
##.SOLVENT NAME= CDCl3
##.SHIFT REFERENCE= (INTERNAL, CDCl3, 0, 15.7039)
##AUDIT TRAIL= $$ (NUMBER, WHEN, WHO, WHERE, WHAT)
$$ ##TITLE= Audit trail, XWIN-NMR		Version 3.5
$$ ##JCAMPDX= 5.01
$$ ##ORIGIN= Bruker BioSpin GmbH
$$ ##OWNER= she
$$ F:/spectra/data/she/nmr/H-F/1/audita.txt
$$ ##AUDIT TRAIL=  $$ (NUMBER, WHEN, WHO, WHERE, WHAT)
(   1,<2021-03-11 11:03:26.68 +0400>,<she>,<DPX200>,
      <created by zg, POWCHK disabled, PULCHK disabled
       configuration hash MD5:
       00 E9 B6 7A A2 85 ED C7 34 08 36 98 17 FE 4E 26
       data hash MD5: 16K
       2F 56 88 79 6B BE 43 1C 1B C3 0C C6 FC 50 80 97>)
$$ ##END=
$$ 
$$ hash MD5
$$ CD F2 0C 08 8B 8C 34 84 38 E7 7A 3A 4D F3 39 58
##$RELAX= 
##$RELAX= 
##$RELAX= 
##$RELAX= 
##$RELAX= 
##$RELAX= 
$$ Bruker specific parameters
$$ --------------------------
##$DU= <F:/spectra>
##$EXPNO= 1
##$NAME= <H-F>
##$PROCNO= 1
##$TYPE= <nmr>
##$USER= <she>
##$AMP= (0..31)
100 100 100 100 100 100 100 100 100 100 100 100 100 100 100 100 100 100 
100 100 100 100 100 100 100 100 100 100 100 100 100 100 
##$AQSEQ= 0
##$AQ_mod= 1
##$AUNM= <au_zg>
##$AUTOPOS= <>
##$BF1= 200.13
##$BF2= 200.13
##$BF3= 200.13
##$BF4= 200.13
##$BF5= 200.13
##$BF6= 200.13
##$BF7= 200.13
##$BF8= 200.13
##$BYTORDA= 1
##$CFDGTYP= 0
##$CFRGTYP= 5
##$CHEMSTR= <none>
##$CNST= (0..31)
1 1 145 1 1 1 1 1 1 1 1 1 1 1 1 1 1 1 1 1 1 1 1 1 1 1 1 1 1 1 1 1 
##$CPDPRG= <>
##$CPDPRG1= <>
##$CPDPRG2= <>
##$CPDPRG3= <>
##$CPDPRG4= <mlev>
##$CPDPRG5= <mlev>
##$CPDPRG6= <mlev>
##$CPDPRG7= <mlev>
##$CPDPRG8= <mlev>
##$CPDPRGB= <>
##$CPDPRGT= <>
##$D= (0..31)
0 1.2 0 0 0 0 0 0 0 0.06 0 0.03 0 0 0 0 0.0002 0 0 0 0 0 0 0 0 0 0 0 0 
0 0 0 
##$DATE= 1615446206
##$DBL= (0..7)
120 120 120 120 120 120 120 120 
##$DBP= (0..7)
150 150 150 150 150 150 150 150 
##$DBP07= 0
##$DBPNAM0= <>
##$DBPNAM1= <>
##$DBPNAM2= <>
##$DBPNAM3= <>
##$DBPNAM4= <>
##$DBPNAM5= <>
##$DBPNAM6= <>
##$DBPNAM7= <>
##$DBPOAL= (0..7)
0.5 0.5 0.5 0.5 0.5 0.5 0.5 0.5 
##$DBPOFFS= (0..7)
0 0 0 0 0 0 0 0 
##$DE= 6
##$DECBNUC= <off>
##$DECIM= 32
##$DECNUC= <off>
##$DECSTAT= 4
##$DIGMOD= 1
##$DIGTYP= 9
##$DL= (0..7)
0 120 120 120 120 120 120 120 
##$DP= (0..7)
150 150 150 150 150 150 150 150 
##$DP07= 0
##$DPNAME0= <>
##$DPNAME1= <>
##$DPNAME2= <>
##$DPNAME3= <>
##$DPNAME4= <>
##$DPNAME5= <>
##$DPNAME6= <>
##$DPNAME7= <>
##$DPOAL= (0..7)
0.5 0.5 0.5 0.5 0.5 0.5 0.5 0.5 
##$DPOFFS= (0..7)
0 0 0 0 0 0 0 0 
##$DQDMODE= 0
##$DR= 18
##$DS= 0
##$DSLIST= <SSSSSSSSSSSSSSS>
$$ [...]
##$SUBNAM2= <"">
##$SUBNAM3= <"">
##$SUBNAM4= <"">
##$SUBNAM5= <"">
##$SUBNAM6= <"">
##$SUBNAM7= <"">
##$SUBNAM8= <"">
##$SUBNAM9= <"">
##$SW= 16.9725357007746
##$SWIBOX= (0..15)
0 0 2 0 0 0 0 0 0 0 0 0 0 0 0 0 
##$SW_h= 3396.73913043478
##$TD= 16384
##$TD0= 1
##$TE= 0
##$TE2= 300
##$TE3= 300
##$TEG= 300
##$TL= (0..7)
0 120 120 120 120 120 120 120 
##$TP= (0..7)
150 150 150 150 150 150 150 150 
##$TP07= 0
##$TPNAME0= <>
##$TPNAME1= <>
##$TPNAME2= <>
##$TPNAME3= <>
##$TPNAME4= <>
##$TPNAME5= <>
##$TPNAME6= <>
##$TPNAME7= <>
##$TPOAL= (0..7)
0.5 0.5 0.5 0.5 0.5 0.5 0.5 0.5 
##$TPOFFS= (0..7)
0 0 0 0 0 0 0 0 
##$TUNHIN= 0
##$TUNHOUT= 0
##$TUNXOUT= 0
##$USERA1= <user>
##$USERA2= <user>
##$USERA3= <user>
##$USERA4= <user>
##$USERA5= <user>
##$V9= 5
##$VALIST= <valist>
##$VCLIST= <CCCCCCCCCCCCCCC>
##$VD= 0
##$VDLIST= <DDDDDDDDDDDDDDD>
##$VPLIST= <PPPPPPPPPPPPPPP>
##$VTLIST= <TTTTTTTTTTTTTTT>
##$WBST= 1024
##$WBSW= 4
##$XGAIN= (0..3)
0 0 0 0 
##$XL= 0
##$YL= 0
##$YMAX_a= 146566
##$YMIN_a= -146204
##$ZGOPTNS= <>
##$ZL1= 120
##$ZL2= 120
##$ZL3= 120
##$ZL4= 120
##$ABSF1= 10
##$ABSF2= 0
##$ABSG= 5
##$ABSL= 3
##$ALPHA= 0
##$AQORDER= 0
##$ASSFAC= 0
##$ASSFACI= 0
##$ASSFACX= 0
##$ASSWID= 0
##$AUNMP= <proc_1d>
##$AZFE= 0.1
##$AZFW= 0.1
##$BCFW= 1
##$BC_mod= 2
##$BYTORDP= 1
##$COROFFS= 0
##$CY= 11.3945322036743
##$DATMOD= 1
##$DC= 2
##$DFILT= <>
##$DTYPP= 0
##$F1P= 15.9154993809931
##$F2P= -4.1035820241983
##$FCOR= 0.5
##$FTSIZE= 0
##$FT_mod= 4
##$GAMMA= 1
##$GB= 0.15
##$INTBC= 1
##$INTSCL= 1
##$ISEN= 128
##$LB= 0.24
##$LEV0= 0
##$LPBIN= 0
##$MAXI= 10000
##$MC2= 0
##$MEAN= 0
##$ME_mod= 0
##$MI= 1.114404
##$NCOEF= 0
##$NC_proc= 0
##$NLEV= 6
##$NOISF1= 3.799351
##$NOISF2= 2.8
##$NSP= 1
##$NTH_PI= 0
##$NZP= 0
##$OFFSET= 15.70392
##$PC= 1
##$PHC0= -11120.99
##$PHC1= 15.20094
##$PH_mod= 1
##$PKNL= yes
##$PPARMOD= 0
##$PSCAL= 0
##$PSIGN= 0
##$REVERSE= no
##$SF= 200.130013532006
##$SI= 16384
##$SIGF1= 3
##$SIGF2= 2
##$SINO= 400
##$SIOLD= 16384
##$SREGLST= <1H.CDCl3>
##$SSB= 0
##$STSI= 0
##$STSR= 0
##$SW_p= 3612.71676300578
##$SYMM= 0
##$S_DEV= 0
##$TDeff= 0
##$TDoff= 0
##$TI= <>
##$TILT= no
##$TM1= 0
##$TM2= 0
##$TOPLEV= 0
##$USERP1= <user>
##$USERP2= <user>
##$USERP3= <user>
##$USERP4= <user>
##$USERP5= <user>
##$WDW= 1
##$XDIM= 8192
##$YMAX_p= 0
##$YMIN_p= 0
$$ End of Bruker specific parameters
$$ ---------------------------------
##NTUPLES= NMR FID
##VAR_NAME=  TIME,          FID/REAL,        FID/IMAG
##SYMBOL=    X,             R,               I
##VAR_TYPE=  INDEPENDENT,   DEPENDENT,       DEPENDENT
##VAR_FORM=  AFFN,          ASDF,            ASDF
##VAR_DIM=   8192,          8192,            8192
##UNITS=     SECONDS,       ARBITRARY UNITS, ARBITRARY UNITS
##FACTOR=    0.0002944,     1,               1
##FIRST=     0,             0,               0
##LAST=      2.4114304,     0,               0
##MIN=       0,             -146204,         0
##MAX=       2.4114304,     146566,          0
$$ Real data points
##PAGE= N=1
##DATA TABLE= (X++(R..R)), XYDATA
0@%%%%%%%%%%%%%Mj2J6j6J6j6K4l2L2m0M8n6P0p8Q8j04J20j36J57j80K03k28K55
36A35k86L21l59M02m49M96n48O07o71P42q19R01r95J095j204J329j465J616j786
55i38J978k198K450k741L086l502M015m663N511o668Q347j1010J5849k7232R8148
70H0432M1781k68417J38863J18795j63648J8296J12044j04441q299P4331k5718
81A4019j5479o345j9004P1414p368r7945N3407O8203p5647q293M8662k5832j6227
94a6435L1391J098k2595k1248L5399L7325o6064k2290P5904j3781m8218L5787
106F273l743k1572L5955j6388j8677K5889k1905Q123M1843o5308j2330R3176m8903
119B433n4345Q0952k3949n0163Q3824k7709p5553R3150L671q5387O6250J7042
$$ y = [0, 0, 0, 0, 0, 0, 0, 0, 0, 0, 0, 0, 0, 0, 4, -8, 8, -8, 8, -8, 16, -16, 16, -24, 24, -32, 38, -40, 48, -56, 64, -72, 85, -95, 108, -120, 135, -151, 170, -189, 213, -236, 260, -288, 319, -352, 390, -429, 472, -523, 572, -632, 697, -768, 848, -938, 1040, -1158, 1292, -1449, 1637, -1865, 2150, -2513, 2998, -3670, 4677, -6333, 9516, -17716, 80432, 122213, -146204, -7341, 111454, -52194, -33898, 78146, -26295, -34594, 39737, 14019, -1460, -7805, -26809, 44605, 37237, -60708, -7301, 60902, -14745, -23038, 25624, -208, -16435, 14956, 16054, -6541, -27789, 7610, 44935, -21129, -43419, 32485, 18704, -29514, 6273, 2530, -19042, 16913, 525, -18152, 7737, -14168, -6045, 35798, -29510, -41840, 51336, 2433, -51912, 29040, 5091, -45072, 38752, 11043, -64510, 28640, 32311, -53076, 13174, 30216]
131C0216q2921O2367M0705r6751K3176O9904n1275k1477M0952j1663j1774J6296
143G755k814n873q476J2512K0073k9641j4121M0346o875k6976K4280p517j3534
156a0861L0763j3471k3877K9675m913j6978K8269j9956j9209M3960j1195l4513
168b2306L1885N98k6240L1439p404l2132L3644O401l1536J7463M479k0610K4766
181A0447l434k8014K6262M199k5446K1906J302l1617K9279J5011m0498P440K9687
194A6524j8327j2841J8199j23j3371L485J7190r283k3705K4274J9784l7020k900
207a8114L9010k1573j8538L4576j2899k1831L0545j488k4564K0092p64j3889K3177
220A3740j1414k0866L2003R63l2930K2281J3121k9439J3012J6699k3776l92J9976
$$ y = [30216, -52705, 9662, 50367, -46384, -23208, 46696, -4579, -26056, 14896, 3233, -8541, 7755, 4941, -932, -9408, 3104, 23177, -6464, -20585, 19761, 12886, -14090, 10190, 2673, -10861, 19902, 6431, -17446, 12229, 7316, -9662, 18607, -1349, -20558, 23402, 12207, -22306, 9579, 10177, -16063, 15376, 7972, -24160, 9484, 15885, -15651, 1812, 6291, -14319, 10447, 7013, -21001, 5261, 9460, -15986, 5920, 7222, -24395, 4884, 19895, -20603, -13163, 16524, -1803, -14644, 3555, 3432, -9939, -6454, 10736, 1453, -22252, 2022, 21806, -15214, -18114, 20896, -677, -19215, 15361, 2462, -19369, 11176, 9688, -14876, 5216, 4452, -9437, 13740, 2326, -18540, 13463, 14426, -18504, 3777, 16898, -12541, 471, 17170, -6606, -6998, 12978]
233A2978r114o978N178j686N506k090q052O331L981q402M272L556r360L050O287
248E457k730o620L64Q538p80j0878N022Q033j2247L281J0055j4956M79J6537j1996
263b441p996J7138r391o329J8077j2293j1399K3723n368k0292K1232J491k1341
276a5189J7320P822k3861Q790J7522j8335k055J4558p847m741J0364l302p110
289f064P907J199m579Q27J373n38J367J077m096R07M899j733n350N569J626p398
305c007O449L014j0911M209J0381j1806j846J1742p921l104J0253o835o317J3062
319G363m038r600J1117j821r033J0672j05j2939R832O187j3987M251P807j0069
333d363N92J0151r637l491J1215l835o805O485J593p588N025L034p470J622O498
$$ y = [12978, 3864, -3114, 2064, 378, 5884, 3794, -4258, 2073, 6054, -2348, 1924, 5480, -3880, -830, 5457, 2727, -3893, -3529, 5009, 4229, -6649, -1627, 6406, -5841, -2560, 7495, -7461, -6982, 9555, -2441, -10437, 6701, -2690, -9019, 9058, -3235, -14634, 9089, 3721, -16571, 4661, 6152, -15189, 2131, 9953, -13908, -5118, 12404, -5931, -7986, 6572, -1275, -6016, 4348, 1046, -6064, 1843, 3042, -1537, -710, 663, 125, 1492, 2569, -1527, -620, 4279, 2546, -2804, 2765, 4391, -3007, 3442, 6456, -4455, -246, 10135, -1671, -3517, 8225, 304, -2800, 7453, 618, -5699, 7363, 3325, -6275, 4842, 3021, -6012, 4660, 4555, -8384, 1448, 7635, -6352, -2101, 5706, -4363, -3771, 6380, -3257, -6748, 4467, 632, -6173, 312, 1905, -5683, -658, 2376, -5094, -3472, 3026]
348C026m875l232O692k981l155O697k370n801P098K393r955N307N791r223J796
363b792Q873q531l825J2302m238p286P742J046o065M796O35n343N351n9m915N056
379B747P40p168O285N242j2416K514J1487q799o328J1795j484r837P897L489r056
394b892J573O691n095j920M207k894L68K519l984n51O089m684l707P688k256o420
410e268O105L013q776K251O329o197j126M742k176j977M334l706j303O275m070
425a550l779P240m54q280O469M743q763o14Q789k693o777N209L430l752k276L164
441A06L085m469k252N677K463q466R81R367m526q054P654O380j0637j848J1242
456F703k438r870O443O910r232k609R160j04q581K753O489m123m019L529K950
$$ y = [3026, -1849, -5081, 1611, -1370, -4525, 2172, -198, -5999, 1099, 3492, -6463, -1156, 4635, -4588, -2792, 6081, -2450, -6275, 6027, 1789, -5497, 2245, 3291, -2774, 2022, 2657, -2686, 2665, 2606, -2309, 2747, 3487, -3681, 2604, 7846, -4570, -2056, 9431, 632, -5696, 6099, 4615, -5222, 2675, 6164, -2892, -1319, 5372, 277, -1643, 2564, -330, 38, 2557, -1427, -1978, 4111, -573, -4280, 3408, 1152, -5268, 837, 3850, -4926, -2675, 3654, -2543, -3669, 1073, -1103, -3080, 1254, -2452, -3755, 2520, -1550, -5329, 1911, 1457, -6823, -354, 4389, -4374, -4988, 3801, 1108, -5669, -460, 2970, -782, -3058, 106, 3191, -1278, -3530, 2147, 4610, -3856, -2875, 6492, 1966, -6088, 1566, 7946, -2691, -4539, 6703, 4265, -5605, 838, 7748, -1484, -4093, 5067, 4963, -3618, -865, 5624, 1501, -2518, 1011, 3961]
471C961l816j934L483J659m507j434O028q39o207K618N213m884l322N801m07m796
487c383J986L688m087q62L943k561j343L509j819l304N779r74o503O359L512r331
503e391J117R887p316n276J0104j223p123M215L714m223m48J504J193J150m877
518b993N88Q294n424p819J1806J796j3598O322J0710j1744m486J3664l331r453
532e668P183L765o132l78L753o70o67j346J08L885k656m710O380K670j0172K748
548a907R478q281n338J1598j730j0727Q675L741j0426L515O952q997M08Q276q231
563b994r77R071o707m566J0686l388q468R317Q89q679N011L386o376K249K597
578A051m222L713J52m994M666L228r072L370P931r065k536J0727l051q588P770
$$ y = [3961, 145, -1789, 1694, 3353, -1154, -2588, 3440, 2601, -3606, -988, 4225, -659, -3981, 1820, 1413, -3383, -1397, 2291, -1796, -2658, 1285, -1276, -2619, 890, -929, -4233, 1546, 572, -5931, 428, 3940, -5391, -4274, 5613, -1703, -6979, 3125, 1902, -5221, -1006, 2708, -1515, -1963, -459, 734, 1884, -2993, -2405, 5889, 465, -7354, 4452, 6248, -7350, -1028, 9682, -2062, -6548, 7116, 3785, -5668, 1515, 5280, -852, -1230, 2523, 1853, 1186, -160, -52, 3833, 1177, -3533, 2847, 5517, -4655, -1907, 7571, -710, -6048, 5550, 3820, -6907, 1768, 5509, -4917, -1402, 5550, -3447, -3039, 5237, -2994, -3971, 5100, -1607, -6173, 4513, 1125, -7343, 1974, 2863, -5816, -805, 2581, -3795, -1546, 1051, -3171, 542, 694, -4300, 366, 3594, -5478, -2108, 5823, -3242, -5778, 4949, 1898, -6690, 1080]
593A080M047q967J318O617l370m105M657J048k661O55l12J396N06l261R29N509
609E086m730m146Q638q57r260O315O483j0735K8J0401o418n515Q557k76p390N260
625A441J945n344K533J122l221K019J403m331K557K373m620J159L392l541j298
640b411M210k063k725L094N18k600Q76J651k043J94J372j377l12J997j266j350
656b235K884j345j770K516O31l027K024J765l805J813K353l135j34L633k836r71
672a639M028k304j762L779j296k653L555k5l458L221J035l717J486K966l821O0
688e45L856k908j491L724r59k969K865J005l627J007K553k567r54L189j926j533
704a280K833q46j668J420N78k314J665L25k380J430J259k679O36K316k820j47
$$ y = [1080, 5127, -3840, -2522, 4095, 725, -3380, 1277, 2325, -336, 319, 7, 1403, 1909, -1352, -423, 5086, 356, -3790, 4848, 3991, -5269, 1046, 7529, -3206, -3178, 7223, 805, -4710, 3847, 3571, -3819, 1441, 3386, -1958, 575, 1697, -1524, 495, 1898, -2433, 124, 2497, -2123, -964, 2428, -1113, -2411, 1799, -264, -2989, 105, 623, -1977, -1101, 550, -1493, -1299, 73, -1304, -1616, 381, -885, -2235, 649, -696, -2466, 50, 681, -2346, -322, 1443, -2362, -549, 1804, -1331, -1465, 2168, -668, -1639, 2389, 85, -1677, 2102, 806, -1847, 1708, 1683, -1775, 1446, 2481, -1236, 250, 3216, -605, -545, 3311, 403, -1088, 2636, 1677, -1292, 1573, 2578, -1049, -42, 2511, -56, -1010, 2179, 253, -1280, 1553, 707, -961, 459, 1037, -1277, 388, 713, -1667, -237, 1022, -1657, -1021, 1295, -1525, -1672]
720a672K743j813j464K409n00k287K613k29k033K216M8k051J330J372k727J306
736g39J902k637k7K839j778j551K933o22j980K056R57k308R10J540j996L21J452
753A272j150o92K271j263j130K702j152j761K201N54k865J807J962l699J058K563
769B678k359j378L273j175k338K971l33k344J884O62k415J235P18j726P29N76
785F58j521O22J199j871m0K034k066l77J786q49j779K231L03k353J236J250j734
802a271l07J961j123j069J920m05j255J177L76j995K089J70k145J666J122k322
818a411O38K459k684o7K826j804j106K668p54j710K301n44j733J983q0j824J840
835I98P89k715J358J811k358q2K304j303j463J698K99j576M94J003j071n57J399
$$ y = [-1672, 1071, -742, -2206, 203, -297, -2584, 29, -200, -2233, -17, 31, -2020, -690, 682, -2045, -739, 1163, -1474, -1501, 1338, -440, -1991, 942, 320, -1660, 396, 1353, -955, -45, 1495, -501, -180, 1272, 122, -570, 1701, 438, -692, 2010, 858, -903, 1298, 1852, -1013, 794, 2756, -943, 115, 2678, 319, -1059, 2214, 1039, -1299, 1672, 1339, -1005, 879, 1541, -874, 361, 1079, -647, 82, 658, -863, -241, 958, -913, -953, 1081, -985, -1362, 424, -425, -2204, 27, 330, -2023, -787, 463, -1271, -1578, 383, -740, -1809, 111, -294, -1549, -372, 4, -1991, 98, 268, -1877, -211, 911, -1411, -773, 1686, -998, -1065, 1761, -43, -1149, 1519, 765, -945, 1356, 812, -921, 1062, 982, -842, 998, 1787, -928, 430, 2241, -117, -199, 2105, 802, -661, 1037, 1336, -240, 254, 1257, 186, -371, 1028]
852A028o09j88K09O2p30J116p55r32K051j038k080J998J118l097J170K136l089
869a630J61K872k483p43K791j692j117K828j924j147L058j174k681L785j48l376
885b620K668R74k790P69K070k115K17R52n38N14k7o17O09Q98j725J75J985j319
903H0j322J924J125k700K40L012j834j931K700Q05l194J428J899k237r1J708j066
920E46j95Q26j726J547L12k724J593K567l934j31M609l742j837M773j937k674
936b127L044j0k595K207l47j469J738m04j858K317q6k347J878L35j689P76N22
953a15p09J71M79o33R08o72o19J406n31p77P96N19q25n5J91P88j30j249J437L86
973G66k121N98K590k221q39K758j232r05J277K22q44N11o08P23P41k384J416J913
$$ y = [1028, 419, 231, 440, 502, -228, 888, 133, -799, 1252, 214, -1866, 132, 1250, -1847, -677, 1459, -1630, -1469, 1403, -1080, -1823, 968, -724, -1841, 987, -937, -2084, 974, -200, -2881, 904, 756, -2620, 48, 1022, -1768, -999, 1071, -1044, -827, 125, -413, 101, 74, -543, 66, 964, -761, -586, 1399, 80, -1242, 682, 1807, -893, -653, 2359, 525, -1406, 1294, 2099, -1095, 333, 2232, -5, -96, 1612, 546, 351, 1177, -549, 998, 1310, -1414, 179, 2746, -1188, -1319, 3290, -452, -2289, 2484, 547, -2127, 917, 907, -1688, 519, 172, -1297, 441, 37, -1821, 496, 410, -1937, -59, 276, -1413, -637, -115, -824, -653, -174, -807, 101, -571, -1190, 216, -315, -1092, -296, 223, -602, -657, -466, 322, 192, -1057, 380, 766, -1355, -757, 1833, -388, -1227, 1531, 299, -606, 671, 893, 49, 560, -48, 675, 1416, -968, 448, 2361]
991B361k843k79L409k336j595L194j145j190J431j96r10Q21j088N26J459k476
1007h57L68K148k175p63L212k183j566L309j568j432K205q80j177K244j149j547
1023a811K462j017j627K400l59j992K086l37j352J681k87j200J436k23j036R67
1039b09L44j382R86M62n36j32K90L86k84o92J040P96k048O73J470j966O13J605
1057A416j620k51J694j605M47J620k026M28J630k146K3K824k839k16L263k788
1073a46j168L615j763j832L043j269j861K837j035j772K400o55j754K252n46j611
1089a265J954l11j564J466N9j516J357k38q44N86Q0k87K45l09J57K19r10P95M40
1108A14j338P28J178j840N63J433j950M09J945k297M63J849k035j92K372j951
$$ y = [2361, -482, -761, 2648, 312, -1283, 1911, 766, -424, 1007, 811, -99, 722, -366, 160, 1619, -857, -489, 1659, -516, -1279, 1933, -250, -1816, 1493, -75, -1507, 698, -182, -1359, 885, -264, -1811, 651, -366, -1993, 407, 48, -1944, 142, -195, -1547, 134, -153, -1353, 83, -140, -1176, -209, 135, -1247, -261, 201, -335, -467, -177, 209, -75, -767, 273, 1069, -979, -306, 1164, -802, -189, 1416, -204, -455, 1239, -366, 81, 1701, -325, 103, 1733, -413, -390, 2434, -405, -621, 2642, -146, -1314, 2301, 538, -1294, 1749, 480, -1381, 1456, 421, -1351, 1049, 394, -1360, 892, 346, -1265, 689, 378, -1186, 280, 339, -1177, 180, -58, -902, -316, -236, -523, -278, -587, -430, -211, -1121, -326, 114, -1224, -496, 682, -1158, -595, 838, -1112, -703, 1242, -1055, -592, 1257, -778, -970, 1402, -549]
1124e49n05K984k483m25K361j638p48K426j128j473K580r86r89J758m45j480K015
1141A275o31j198J680o72q22R30L26j146J210o40k72Q25p98J33N62o65R9M61j236
1160e79N14R84j677N74J078j389J93R80j502j06J937k063J33J979j730l48J724
1177G02j254q36K099j368n84J854r18j023J770p64j031J837n16r71Q76J79q08
1194g56P06N05j119N26M9k37O38j95j83N47o00Q8P52r05L09N30p16K66N23o65
1214F3L29N78j468R18R53j818M43J331j427l6J305j013l08J655j437o79J587q00
1232A76p71J733o64j338J664n41r69R18J89j186R19K34j136P42l2m75L90J24n62
1251e85J18J55J06j96k63M42j2l29M95k2n15K20L41j108Q74P57j342P42O13j178
$$ y = [-549, -1054, 1930, -553, -978, 1383, -255, -1003, 1423, 295, -1178, 1402, 416, -573, 1185, 740, -740, 1275, 644, -554, 1126, 454, -368, 562, 888, -258, 952, 312, 40, 865, 67, 200, 762, 97, 196, 657, -579, -65, 919, -758, -184, 894, -495, -302, 678, -824, -930, 1007, -1056, -923, 1056, -674, -1022, 702, -552, -1388, 711, -657, -1241, 613, -305, -1328, 442, -322, -1353, 484, -32, -1003, -127, 52, -756, -50, 455, -664, -138, -89, -326, 312, 117, -66, 481, -119, -31, 721, -184, 125, 655, -61, 205, 728, 63, 392, 970, -498, 420, 1373, -445, -2, 1329, -98, -134, 1171, 158, -150, 1505, 68, -611, 976, 176, -595, 1138, 474, -864, 800, 259, -710, 208, 397, -789, 130, 364, -772, -30, -62, -537, -147, -23, -585, -467, -312, -206, -402, -665, -223, -235, -564, -69, -91, -606, -386, -45, -1153, -279, 478, -864, -122, 491, -687]
1271f87M07J028j496L44J069r19m42J668j068n41J354n95m55J090m33p01J083
1288G06j39j254J268J22r19M98K91n24J5Q68p25q8L07m3l79L36J41l72J43L42
1308E94n61j81Q54p60k17R32o64n26O13K61j081O35M11j109M11N05p21Q9Q78j062
1328f99l5O92n09j03Q79m12p92R69p5j070R63K86o05K23N07o39m5N60o08J06N47
1349A40m83j11R59m42n25O24R7m74M38N39j029J82P85n69k97J042m70n14Q18k17
1369D93o04O89k0n35L00N54p82L78o9m91L54L33m39j90N41j86m73Q07m49p09O85
1390A87K42q80L83M99q77J76N56p41m3O88n27j99P81m52n07Q42k52p53Q52O2p95
1411g58M16O14j161N01K70m98J06M17l93K51N28n39l40P48j51n74P77Q5p95M39
$$ y = [-687, -280, 748, -748, -404, 665, -254, -696, 972, -96, -637, 717, 122, -333, 757, 324, -377, 706, 567, -687, 581, 703, -216, 282, 573, 49, 64, 932, 207, 119, 426, 383, 4, 340, 481, 109, 252, 594, 33, -148, 706, -54, -271, 661, -3, -529, 84, 345, -736, -101, 310, -799, -388, 117, -604, -515, 363, -699, -734, -42, -551, -654, 225, -187, -979, -10, -85, -1155, -192, 94, -511, -288, 219, -420, -465, 95, -513, -407, 140, -343, -454, 505, 63, -462, 162, 259, -215, 223, 762, -267, -85, 700, 131, -166, 876, 406, -108, 710, 493, -111, 578, 558, 23, 323, 877, 95, 473, 404, -87, 267, 600, 161, -29, 512, 326, -147, 660, 211, -498, 187, 429, -451, -68, 431, -446, -270, 286, -455, -498, 190, -337, -536, 245, -207, -714, 128, -124, -877, -25, 37, -758, -342, 272, -889, -388, -118, -616, -510, -93, -486, -235, 293, -246, -586, 162, 11, -563, 214, 299, -496, -57]
1431e7L25k84j33N19O9o98O58l88K61K21m46K22P9L31p34M61m0l99N15K40o61
1452F1O9N72m25l56O99p10k9O29k55l34K69l03j02M46k54j34K33J16o50N97k38
1473i9j51J49j2K5j66L60k01k40K62m27L5L47m73K11J30j99J13J89k59J24j4J24
1495a72K3p7k19J78K20k34O27m78jK67j12K26l15L12k10J88J69j16n7j29K75N3
1517D18j24j02K16j13j17J29J5k1K0o0L7N5j57K8L4r2j60L17k13j76L09n65M96
1540A74J39l34l4K91l33l80O46l81k06L95k9l68M05n0n37M75m7k27k8N04n44K14
1562b55M61n83J79J20k75L8L11Pl72M18j11J05k30J00k58L18K32k47o7J75K54
1583C20l45J86L94m81K9K09p7l74O35m52J23J75j05m26Q10j62o38O55j01j73L36
$$ y = [-57, 268, -16, -149, 370, 439, -259, 399, 11, 272, 493, 47, 269, 348, 679, -55, 406, 366, -33, 482, 722, 61, 130, 702, 277, -79, 620, -90, -119, 510, 255, -79, 190, -113, -215, 231, -23, -157, 76, 192, -458, 139, -99, -250, -101, -113, -88, -254, 106, -95, -335, -73, -500, -465, -118, -591, -380, -250, -449, -336, -147, -406, -282, -296, -172, -149, -226, -445, -267, -47, -281, 346, -132, -133, 134, 22, 248, -67, 245, 35, 223, 392, 276, 219, 90, 365, 418, 294, 192, 408, 295, 178, 307, 322, 301, 321, 261, 298, 353, 196, 224, 258, 166, 6, 323, 110, -66, 243, -322, 174, 313, -21, -55, 236, -97, -477, 169, -212, -418, -23, -52, -420, -15, -65, -602, -127, -174, -401, -429, 75, -469, -255, 206, -377, -198, -78, -353, -315, -4, 3, -369, 49, -62, 43, -187, -87, -345, -27, 205, -42, -109, 66, 320, -25, 161, 555, 74, 103, 312, 235, -139, 496, 44, 167, 342, 237, -189, 621, 459, -179, 476, 375, 202, 538]
1604E38j80o04O72p1p74L06O58o68Q4J31Q7k08J92k34k90L26j19O8J40j68k51
1625c65K79j14J25l9J3j53r6L64k46l6J65Q7j76j74K62j49m8M31k75l72M43Qj1
1648g7J68k52k07L97Qm25N40Q7o10M25J92m10L85j20l31L84L40n62M89k6k77m0
1670G8L47k16q5J0%J54r7L46q3j41j79j99J69J10J74m21J35o9J36j96J03J9j19
1693b4L06l62N8N3n6l21L00j18l4K77k66k99M18Q4l86p8N03l87q8L51j27j41J97
1716a40L9k16N82m04j92L55kp9J50j14M4k89L53j90NK3j00K73R7l1l62M48l8J08
1740C20r7q3k08J80Q2J01k86L07M3n91Q00r5m95J80K41k60P5K77o56J57K59l16
1762f5m1K32k43j18P27n99r5L91j80l92O0L49n28N12p9k62oL61l14j40L89k14
$$ y = [538, 358, -246, 426, 355, -419, -113, 545, -123, -39, 92, 179, -29, 163, -71, -361, -35, -154, -86, 54, -114, -365, -86, -200, -75, -114, -101, -254, -350, 14, -232, -268, -103, -16, -192, -366, -104, -253, -301, 130, -145, -517, -74, -66, -77, 91, -161, -368, 29, 37, -388, 152, 239, -371, 54, 246, -164, 221, 101, -230, 154, 494, -68, 421, 395, 118, 78, 425, 209, 124, 134, 134, 288, 191, 537, 454, 313, 134, -65, 104, 214, 388, -33, 102, 33, 169, -27, 76, 95, -24, 282, -80, -22, 31, -25, -346, -46, -164, -198, 79, -187, -486, -68, 16, -370, -448, 55, -332, -420, -69, -196, -337, -140, -101, -317, 265, -139, -331, 24, 22, -57, 93, -21, 23, -266, 87, -103, -98, -75, -175, 98, 195, 164, -198, 250, 212, 320, 223, 140, -68, 112, 194, 295, 9, 316, 359, -232, 568, 473, -22, 158, 399, 139, 214, 491, -165, -8, 251, -65, -106, 126, -117, -235, 492, -107, -202, 189, 9, -383, -323, 26, -502, 10, -69, -331, -337, 24, -290, -430, -41, -255]
1784b55J73M1M0m22N41l27%K2J66l14p3N21m71M30Q7m34j18N38j68l54O23k47
1806ak52L80Q4l22J83J92m09J36L55k47r9L95k77j61M72k83l35K73K27l60L43
1827B94K55m87K44r6m5o7K59l89J0L49j76k48P2L71n30L10J77o06L79J99l82j56
1849b63L13j88j09L99l46P3pj93q4M02J22m59J50J05j83J49J45n43P6N10k75K2
1871a84J90l84K10J89j14k49K44m5j77L46J51j73Q2M26n17J0N10n36k1N47o11
1892a06o1M83l65NL01o0k29L91k18K4K4K66l92j94L75o9O2J44k70l56N08p9k77
1915i3M53k00k00K7J23l15K18j32J23M2j03L5j40K93j43k79M11j48l51L46L4l52
1937c51J45K69m57L35j3j82j23M05m11J36L79m10L00K39k41j63L36k11j84J58
$$ y = [-255, -82, -41, -1, -423, 118, -209, -209, -187, -21, -335, -408, 113, -358, 72, 159, -275, -393, 145, -23, -377, 246, -1, -253, 127, 211, -111, 72, 264, -145, -9, 346, 99, 0, 395, 118, -43, 429, 146, -189, 84, 311, -49, 294, 549, 62, 306, 210, 165, 98, 357, -32, -22, 327, 151, -97, -25, 346, -184, 126, 303, -303, 76, 275, -107, -263, 50, -138, -247, 152, -194, -121, -128, -321, -405, -3, 119, -340, -190, -85, -268, -119, 26, -517, -441, 69, -206, -184, 6, -378, -168, 21, -93, -342, -98, -143, -320, 26, 177, 4, 86, 512, -5, 5, 515, -21, -42, 505, -106, -167, 316, -49, -44, 257, 197, -32, 359, 141, 165, 189, 455, 63, -131, 244, 175, 237, 381, 111, -245, 263, 184, -93, 360, 160, -40, -13, 110, -205, 13, -119, 4, 46, -57, -22, -162, 131, -12, -291, 120, -28, -379, -33, 1, -351, -206, 63, -394, -59, -72, -254, -377, 28, -383, -247, 132, -278, 22, 261, 20, -143, 193, -18, -202, -44]
1957d4P7J0O9L0J51l84R8mK86o0k35K58m58L74J06j55p3J13l28N72k90p3J63k16
1981a3J3L9J65j96J38J10l73K09K16l43J95K53n29J56j50KK2J34k93K22R0j05
2003c8j64J73j25J00N6k72N8J58k94J32K05j62j47K19l44L38R2l26L17J21m24
2024c27M11n1k52K45J11l55R2J26k95L27R1k92L11J85l57L87j5l93L70j39q0p9
2046B1J66j48K90N9l48J17J4m33K75L83k89O4l7j20J31k4r0K82n3j68j12R1j85
2069a14K36O3l45K3K00k16j41M58m73L62k15k34L30R5m35L51O7k80K73n5l9P2
2091a7N4k58K86k10J28k37K65j31L74j65l17J74K4J87k28K08j45J96j37m13N74
2112B12j02j64M30k55j53J49k1j1J03J80l14M9J14k72L79k96m9J52K51l79K35
$$ y = [-44, 33, 43, 112, 142, 293, -91, 7, 3, 289, 229, -6, 252, -206, 168, 274, 119, 46, 159, -169, 403, 113, 40, 203, -13, 0, 39, 204, 8, 146, 256, -117, 92, 308, -35, 160, 413, -116, 40, -110, -108, -86, 48, -245, -23, 67, -38, -202, -29, -154, -54, 2, -270, -212, -54, -348, -216, -11, -173, -320, -101, -445, -107, -15, -341, -24, 97, -327, 84, 33, -219, 26, 137, -218, -126, 0, -295, 32, 123, -169, 142, 327, -30, 357, 342, -51, 319, 180, 100, 21, 187, 39, 329, 388, 40, 157, 171, -262, 13, 396, 107, 171, 134, 14, 145, 121, 31, 313, 260, 92, -20, 71, -114, 122, 185, -160, -137, 63, -153, -294, 164, -309, 53, -162, -396, -66, 29, -406, -55, 12, -268, 5, -50, -89, -17, 37, -221, 65, -145, -17, -254, 11, -120, 254, 89, -228, -54, -30, 157, -71, 137, -8, 188, 51, -362, 212, 110, -54, 376, 121, -32, 117, 96, 85, 188, 368, 54, 103, 217, -55, 324, 28, -21, 131, 382, 3, 238]
2133B38P3m76R4M13m09J27L20n40K10l2j70K13J8j62N6j12j95L48j23k8N8j40
2155b19M0K12J48n71M03Pl94M90j59j93KJ35j69P1O9l5L49l41m1J42%o3J61J99
2179B43m31PJ08k57M96j21j58K92j67p7M29j6l96J82j6L0m2R8j74J41r8p4J65
2202A64Qj35q3Q2p2K15j04OK50l18L4K61j97q2n2L88m32K31m0l55K12l3r1K12
2226F9J46k77J82j51q8K15j38l44K52J50r7L9r7R2%j30o7K65k94K86k5j01M0J36
2250F3j15k31K39o1n9K76k09m5J95j88P4K85k64n7K96j69k6J26k0l4l9Q1o8L38
2274C88j59j0K32m76J32mr5M0J5K30k89KL35k76j46K06k53k8J53L6k06J60J62
2297A49j71P0l22L68o0j61J09J3r7J86j16j44O7J81o0j04j29J91j8J34l87O12
$$ y = [238, 311, -165, -71, 342, -67, 60, 380, -160, 50, 18, -152, 61, 79, -83, -27, -139, -334, 14, -109, -137, -79, -219, -179, 33, 181, -390, 13, 20, -374, 116, -43, -236, -234, -99, -268, -197, -128, -163, 186, -155, -196, -54, -54, -117, 44, 243, -188, -181, -73, -330, 166, 45, -113, 179, 12, -65, 364, 348, -48, 134, 118, 148, 106, 204, 30, 171, 73, -1, 164, 172, 37, -46, 36, -36, 179, 75, 81, 331, 13, 47, 308, 111, 29, -23, 365, -67, 164, 124, -231, -19, -52, -143, 69, 215, -62, 120, -31, -119, 96, -42, -386, -134, 16, -81, -42, -139, -47, -47, -177, -244, 21, -273, 13, -12, -113, -73, 63, -52, -283, -44, -105, -164, 112, -97, -142, 53, -135, -61, 224, -40, -97, 199, 30, 4, 130, 110, 76, 37, 118, 50, 388, 229, 219, 451, -25, 107, 103, 8, 48, 63, 293, 4, 6, 341, 65, -81, 125, -128, -156, -3, 33, -173, -13, 149, -22, 48, -274, 94, 34, -127, -18, -5, -102, 84, -32, -176, -109, 72, 12, -92, -221, -30, -48, 86, -301, 311]
2319C11n90K5L36j59nR5K9l18L83k16J07J56j77L2N3j8j06K56k11O5J8K96k99
2342F3n4J87l8J8P6J15l68J84J1k2J44j01J1j53o0J16R2O7l01k18L19O8j62j42
2366a48J51l5L5N4k70J89j24O8J96n5Q1m9l07J41J17k89o8L28j04q7Nm7K17j67
2390a68K87k45k11J87J75J5p7N8p2L2j36J75j53p4K63j85K01j07j46K20J58l66
2412a69Q7N4p3j35M60K1j87j32O5j00K37o6J3J46k03j15J81J04j30N1J41m2q8
2435A20N5k41K3Q7K3j26R6j53L01k49K86N5m20J46R3k1n4jk55K84k67J64j37j5
2459b06K58j32L1P0j10J51l33K18K09k64k34L67j10L9p4J28J12j92P2o0J10m18
2481c68N33j93J23m1J06k65l2K37j0n9K14k10j0K64j59J37k11J47ORj72J5J95
$$ y = [311, -279, -254, 82, -77, -82, 13, 42, -276, 107, -109, -2, 154, -23, 9, 62, 44, -62, 194, -17, 48, 66, 362, 63, 9, 196, 158, 176, 252, 367, -1, 183, 194, 172, 316, 215, 226, 73, 13, 129, 221, 288, -13, -231, 88, 156, -6, -148, 3, -32, 3, 57, -213, -24, -148, -80, 116, 61, 142, 93, -214, -73, 44, -245, -313, 15, -89, -176, -171, -218, -1, -168, 119, -126, -337, -150, 25, 40, -37, 21, -51, -19, -155, 20, -133, -207, 56, -129, 72, -35, -181, 39, 197, -169, -82, -28, -101, -236, 224, 245, 58, -74, -9, -109, 128, 62, 75, 221, 18, -97, 84, 188, 58, 109, 250, 208, 120, 175, -66, -43, 44, 67, -59, 37, -116, 185, -64, 222, 277, -143, 3, 96, 75, 21, 20, -235, 49, -218, -54, -191, -206, 52, -80, -49, 21, -89, 62, -271, -53, 156, -108, -342, 25, -85, -46, -120, 8, 120, -72, 0, -60, 50, -368, 165, -28, 95, 54, 160, -105, -137, 100, 90, 31, 245, 35, 25, 289, 130, 267, 56, 203, 209, 218, 46, 61, 256]
2504B56k89K13R5m06o1M02k31M49m19R4l99N67q7j29N7l4J05o6n5j79N4O7r6O8
2528b4O4j78J48J41k68J18j68q6J91K2J39l90L10k69J19J38n9j28K17j69K05l69
2550b96L11K43m66K02N8m25M00J29k10j47K05l3j08K79k33J16P2P0l5K7q6j49
2572g6K50k11J31J80j85M2n8J07j34J11L7m4j78O9Q7o2j41M13k56N0P4k20j6J08
2596G8P1n2j50j07J58K36j21l01J88k83J05K40k03j82L36M9j50l9N24o71J92o4
2618a46O9J2p4j53K02J34k54J9J30j4K4K16k77L3J48k60j60M94k58j17J48K30
2640A46n7k6q9j09K48K4k30K83l9Q3j08j23r9J06J17r6j02J76J03j1j44R1J9j51
2664A2l9K12j5q8r8j87K51m4m37L85K36j79p3J13j17j21J17j86K4K14l86K38L58
$$ y = [256, -33, 180, 275, -131, -192, 210, -21, 428, 9, 103, -296, 271, 184, 55, 112, 78, 183, 117, 62, -117, -63, 4, -92, -24, 40, -138, 10, 151, -117, 1, -167, -253, -62, -40, 99, -291, 19, -250, -131, 7, -52, -180, 37, -132, 73, -296, 15, 258, -208, -6, 52, -373, 27, 156, -54, -201, 4, -29, -137, 142, -91, 25, 97, 167, 132, 159, 73, -76, 174, -37, 94, 274, 89, 131, 73, 180, 46, 157, 194, 150, -28, 41, 128, 66, -75, 338, 82, 132, 206, -14, -30, 78, 149, 97, -53, -160, -2, 234, 113, -188, 0, -283, -178, 62, -141, -323, 13, 62, -88, -127, 397, -274, -82, -146, -77, -65, -139, -292, -90, 44, -210, -191, -61, -75, -51, 165, -112, -79, 69, -191, -351, 143, -115, -232, -84, 146, 89, 63, -26, -135, 113, 137, -93, 190, 151, 234, 126, 3, -96, 10, 127, 31, -71, 105, 208, 197, 53, 144, 163, 12, -27, 185, 170, 82, -16, -203, 48, 4, -433, -48, 188, 9, -64, 49, -68, -189, -72, -258, -234, -20, -406, -168, 190]
2687A90k56J11P5j14j21J37q9Mj72K12Ok00M2J09kJ41j80J02q7J16J47r6k06R7
2711c4r6J84k09K16J39k53K91k60n8Q6J23l41J83K61Oj93j59K77k01L26j84n5
2733D9J20k09j29M3P8k10K52j9N4J11j22k20L52q3r8k02L97j44p0J7p4l0M4j05
2757a98K09oQ0k37L52l1k17l66L54J84j05j16m9RJ07j77J75M3m6J24j33M2or6
2781a04K68j61j47Q8KK46j07k84K60J69k93Q0J68j89J46m0M3p1j22K44k38P1K25
2804B54j20j08J82k25L4J01N2j62J69k16J79J52l70q9L35j17j8K5J5j04l8L29
2826B60l35j3L61l32J51j33q6l6J22j69K29k63N6J40p1lN6Q8q2j38J18p3J92J00
2850A39l68l7L86r0k1j62O0J53P4j97M1k18L27N6j43j13J68r6K01k72l6K51K5
$$ y = [190, -66, 45, 120, 6, -115, 22, -67, -63, -235, -23, -17, -217, -175, -66, -68, 73, -107, -5, -92, 24, 171, 75, -131, -34, -130, 54, -155, 61, 200, -53, 238, -22, -80, 6, 129, -212, -29, 232, 238, 45, -114, 163, -38, 288, 104, 49, 169, -40, -169, -126, -48, -258, -6, -25, 29, 140, 18, -202, 150, 67, -31, -233, 164, 20, -50, -33, -107, -137, -93, -198, 11, 5, 85, -152, 200, 169, -48, -414, -60, 124, 19, -97, -146, -137, -30, -207, -32, 11, -35, 89, -44, -2, -8, -104, 164, 3, -144, -56, -54, 192, 85, -199, 61, 230, -63, 17, 185, -4, 142, 102, 145, 74, -48, 196, -42, 29, 254, 134, 26, 208, -17, 17, 118, 170, 8, 177, -39, 140, 292, -78, -167, 168, 51, 33, 58, 73, -31, -69, 260, -75, -88, 273, -59, 92, -41, -127, -163, -41, -210, 19, -244, -188, -48, -119, -122, -66, 22, -60, -198, -80, -153, 39, 139, -229, -266, 120, 30, 9, -153, -93, 60, 134, -63, -22, -240, 87, 143, 0, -113, 55, -41, 160, -112, -148, 103, 128]
2873A28p0l7N2K8j70J39LL01j67q1l1j2j64Q2J25k66J93o5qm9O5J86k72R8Kj71
2899a61K55k11j08K24r8m6L35j42j35P4N4j78J55j99j10K60R7Lk56J47j47R3j78
2922b72L02k7J53J54k73k43K25l6J5J6J56k00k69K97J40l58L30q1J79L8k76J28
2944I8k31J57J28k48K33k58Q0J51M9j79q8O2K09Q2k16mJ87j99k66L29k52J89J72
2967A85J34k51p9J6j79K14L0m3Oj2l4no2omk8J21j09J11j04R8j11K0m0o2J56k73
2994c11K9J98M0J51j90J73l34L87j95j81L31j96K12l5Oj28J3P9m6K78l78J91J91
3017B85j87k9k68M06j59k6q6O0L65j80J31k22M6r6J47m0j9j3o3J0J03o1j35K22
3041A91j39k45K92j87J66l45M67j72l09J19K12N2o6j34j1k4J24j71J89m1J64l5
$$ y = [128, 58, 21, 73, 101, -69, 70, 73, 374, 207, 126, 95, 83, -81, 1, 126, -140, 53, -12, -20, -69, -4, 182, -90, 8, 10, -161, 94, -117, -225, -1, -99, -145, 190, 48, -87, -13, 41, -137, 18, -181, -291, -31, 66, 69, -187, -40, -187, -94, -272, 30, 3, 156, 310, 37, -206, 19, -17, -2, 14, 170, -30, -299, -2, 138, -220, 110, 29, 208, 246, -30, 98, -133, 24, 152, -96, 137, -121, -41, 110, 159, -20, -108, -46, 163, 245, 29, 25, 212, 13, -253, 76, -176, 13, 185, 319, 68, -11, 5, -174, 40, 70, 27, 33, 21, -13, -18, -80, -86, -90, -118, 3, -106, 5, -99, -1, -112, -92, -132, -194, -38, -311, -282, -84, -44, 107, -83, 90, -244, 143, -52, -233, 98, -98, 114, 79, 85, -43, -30, 49, 3, 281, -97, 94, 285, 98, 69, -199, 207, 48, 22, -64, -4, 361, 181, 312, 90, 136, 40, 187, 147, 128, 115, 52, 62, 165, 104, -31, 191, 52, -193, 99, -88, 78, -267, 200, 28, -281, -162, 50, 102, 36, -98, -109, -133, -9, -180, 9, -32, 132, 97]
3063I7R3n20K55P5j47M9m8L9K21j88K4PQ8j90L2J80p0OQ9j44Nj33M4J40K4r7K03
3090A34j38o1K28j13k4k9K7J71j40l0J2J07J20m41K93mj88L44q9j28q3J02K7K39
3114C36l96j75K07j44K02M15l29n0K44m04J10k24J67j26L02k87J54k73J31k5J
3135a64n7M0K95o81P89N0k63k08N4L1mJ44k22l9M04p8j68J5k2J6J93j75K2J3m0
3160e5o6K00m19L96j01M6r4J09J22l19Q6M1O0L2K1J3j83N8N1J18l14J53R7r4R5
3185E3o9l6J4PN4R3l61K13K7J71O8j32m7P5j62N6k03J66k8j27K3K26r7O1J5j97
3211a37M6M3J62k71K33r5Kp5n8J67j84J23j21L43j79j03J68P8l1j90p8K19J41
3234B03l31P8j36M13j41p5j01l6J55L2J11m03K95L1j28O4q7J60LJ8n2k33K36m4
$$ y = [97, 190, -330, -75, 0, -147, -98, -146, -107, 114, -74, -50, -43, 45, -145, -113, 67, -3, 3, 92, -52, -47, -180, -136, 4, 28, -69, 134, -4, -65, 163, 50, 26, -3, 24, 195, 55, 25, 37, 144, 264, -177, 116, 112, -76, 268, 179, 51, -32, 70, 97, 336, -60, -235, -28, -172, 30, 445, 116, 66, 310, -94, 16, -208, -41, -167, 135, -152, 2, -271, -140, -165, -164, -221, -181, 114, -567, 222, 272, 9, -199, -145, -114, -118, 26, -196, -235, 169, 91, -77, -62, -84, -68, 125, -50, -28, -15, -55, -121, 79, -340, 56, -45, 1, -93, 16, 138, -181, -95, -54, 6, 38, 59, 72, -111, -53, -2, 116, -198, -45, 52, -42, 53, -16, -52, -38, -31, 23, 116, -245, -32, -5, 166, 234, 102, 55, 130, -32, 24, -179, -13, -41, -168, -145, 81, -16, 45, 60, -137, -91, -48, 114, -157, 76, -19, -17, -92, -150, 17, -167, -44, -165, 178, -1, -104, 64, 142, 111, -79, -157, 62, 203, -128, -50, -186, 227, 86, 11, -90, -126, 29, 61, 172, -231, 64, 95, -33, 31, -56, 104, 107, 125, 73, -160, 76, 32]
3258C2j67K50j49J96k26K74m4k35K83j85K15j53k98K34J11j95J9r2P8J11l4k94
3280b69M33k1l07K55j13j16J50j39P8j78J71K1P5k49K87k67J85j51J02L7j05L9
3302h2n0K09j77n7J60o1O9j45L85k26j42Q3K64j50J62l07R7L05k14j13j32K26
3324A04m7q2Qj64L37Kj00p7J54j03J31l45M09j38r7Q4p3l9p9J05m6ok57J11J99
3349ij3k46L68n8n7p6Q9j69J60K44l52J02N8n1j21j00M26l52k09L29J9J2j25K55
3373A24k08P6j32L31n7j97K1J18k00J57o2n6J99l04L10k74K98l00J78k4R4k32
3395a40J82m8J19j97J98k03K28j73K70j7n3j04K49l65Q1L8P0k2l5pr6O6M1n3p
3420B2Q4j34J44m9j45J2j05L31j33k19O6Q8KR3j80K04j67K76l09J80Ql1k45J07
$$ y = [32, -135, 115, -34, 162, -64, 210, 166, -69, 214, 29, 244, 91, -207, 27, 138, -57, -38, -130, -52, 59, 25, -269, 164, 143, -164, 91, -22, -138, 12, -127, -49, -227, -56, -35, 40, -209, 78, -189, -4, -155, -53, -16, -121, -82, -132, 77, -100, -157, 3, -58, 11, -134, 251, 25, -117, -34, 230, 80, 242, -65, 32, 337, 123, 10, -122, 104, 57, -25, -17, -181, 156, 158, 58, -19, 135, 32, 163, -182, 227, 89, -8, 76, 3, -36, -115, -10, -56, -62, -319, -208, -9, -22, -268, 100, 42, -15, -91, -2, -171, -11, 233, -119, -17, 41, -10, -131, -231, 195, -157, -366, -37, -18, -6, -131, 124, -84, -8, -140, 191, 134, -63, -42, 76, -124, 33, -29, -85, 114, -190, 120, -154, 144, -156, 22, -2, 92, -140, 42, -6, 113, -84, 114, -89, 139, -34, 236, 219, 166, 62, 311, -54, 27, 65, 135, 113, 78, 71, -25, 41, 82, 29, 22, 106, -28, 116, 67, -78, -66, -171, 160, 27, -192, -126, -38, -36, 57, -123, 81, -86, 190, -119, 61, 69, 38, -207, -100]
3444a00k29J91P8k1k3J41j51j52J04P3OJ72l7k86L39n6rJ03k19J2K17k14J55k87
3468a93J34J46k81L43j25j54J55K4J38j30N7n5L7j96j7K70p6M2rk4kn1l4L2o0
3493b9j02M7K03Q5j83J68J3k59j23J75j21J19j75R7R0k9j32n4J46M10l48%J31
3516A29K9j45r5K93k96q7J64K0l1Q7p9n2n5O4L1P3j78M24k73j41J28L8L1k29P2
3541g8j8J70Mr9o4M0R1R3o9j44J09J14l00O5L3J45j85Q5r1p7L82J56o32L95j14
3566A1n9m3K93l56L15J42j63R6P3l65o7L30m9k42K05j16k65J12j10J96Q7j76L5
3589a16K6K3J90l32N4R0o6L05r5k99M76l71J38k27L95j2l54N6J0J58j11rl0m8
3613a49J5J90J05Q4j78k2j1j65J83p6q1J6K25k14P9M4k44K49j32J45j24q7L26
$$ y = [-100, -329, -138, -60, -81, -104, 37, -114, -266, -162, -89, -83, 89, 52, -234, 105, 49, 40, 143, -76, -64, 153, -61, 94, -193, -59, 87, -194, 149, 24, -130, 25, 49, 187, 57, 114, 59, 96, -100, -117, 153, 77, 119, 110, 86, 84, 33, -1, 31, -29, -131, -84, 119, 204, 21, 189, 202, -57, -180, -5, -126, -7, -182, -85, 5, -24, -156, -210, -64, 346, -2, -2, 129, 158, 13, -82, 211, -85, -172, -8, 12, -19, 68, -11, -63, -118, -54, -23, 50, -128, 296, 23, -118, 10, 48, 79, -150, -78, -96, 74, 78, -21, -85, -45, 46, 139, 70, -74, 35, 149, -151, -86, -53, 92, -93, -8, -99, -176, 206, 362, -270, 125, 11, -48, -91, 202, -154, 161, 303, 140, 236, 309, -56, -123, 207, 158, -84, 121, 5, -260, -148, -258, -62, 25, -151, -116, -90, -67, 123, -209, -155, -65, -131, 174, 79, -220, 256, -115, 23, -204, 191, 179, -175, -119, -109, 49, -62, -71, -101, -149, -134, 56, 161, 245, 67, 45, 34, -131, 52, -24, -105, -89, 136, -78, 1, 45, -199, 50, -82, 63, -61, -148, 178]
3636A78Q8j70j40o6L32p2O3k59L8J0l6J36N5q3R5k78J91M8j53n3K24j99j09J86
3660B6n9K7k0J17j87K2J02k19J88Pj2j45k3j1J07J97k77J16O6J98l08J82k19j83
3684c08K38k4k1M07l39n4J31p7n2O0j23J75Q3J6L2mk86J88O3k7R1m4o8l3R1j99
3710h4R9R1q8O5J75k69N4k85M06l09R0j63k7L35P4N8j10r7J36q5j26M8j68K26
3734D6r8J46n4R7O2j36j67J24j13M8j95L31j69j72K30j07J81o3j79M46m63j13
3756c18J49M7J63nk23K0K02J91q3q1j03k07J77J79%k77K33p3Q4J11l02K18M0J89
3780C31j97j22L1M7P3k12K09k02Q4K10j97j03J99o7M3k57K93k76J62j10pL30j63
3803I9p8j55K06j23j23J62j8K47j88Lj95Q5j7k0m6R3N7j05Q4n0J7J08K4l1jr5
$$ y = [178, 266, 96, -44, -110, 222, 150, 213, -46, -8, 2, -34, 102, 157, 74, 169, -109, 82, 130, -23, -76, 148, -51, -160, 26, -33, -6, -26, 91, -96, -74, 28, -191, -3, 4, -8, -153, -176, -187, -80, 117, -160, -44, 22, 220, -88, 94, -125, -308, -70, -94, -115, 292, -47, -101, 30, -47, -99, -39, -162, 13, 96, 112, 144, 140, -146, 42, 105, 78, 169, 125, 57, 24, 115, -84, 15, 106, 18, 83, 258, -11, 43, -242, 164, -145, -55, -218, -245, 90, 164, 222, 112, 15, 151, 66, -60, -12, -180, 46, -52, 94, 40, 137, 199, 63, -104, 20, -93, -45, -240, 91, -78, -250, -20, -127, 54, -9, -188, 258, -205, -318, -169, -122, 41, 36, -187, -167, 35, 226, 143, 62, -41, -248, -71, 108, 108, -169, 64, -9, 75, 186, -116, 102, 142, 331, 134, 12, 43, 90, 163, -49, 160, -42, 42, 252, 55, -48, 151, 84, 127, -130, 163, -113, 49, -61, -68, 262, 99, 21, -134, 72, -51, -174, -12, -30, 217, 29, 32, -163, -78, -95, -115, -161, -68, -11, -116, -32, -82, -65, 43, 67, 36, 35, -60]
3829f0J56j67m5K56k25J32j01N6j8p2K79k27O3J20k49R1NJ5j31k4R2m3J34o2K70
3854B45l87L17k67J02J57k87L11j86j60K02J30j71M2J3K2j11j6N1q0J6J62l5j10
3877d0QM0m1R9m2m8K12k97j1PJ57Nm6m8n2J63j12R5k85M86p6m3m15L28q5k0J70
3904A09k44L8j33jK94n7O1k13l6J57L38l47q2K22k2M5k82P4M9j36K23m6j74k3
3928a86L19j13j3Q2j05r1J8J06K3K24k60J25o5j2j39J60J15k69k9K21l49J57J94
3951A13j55p4l1K69j70J27k26K40oj85K98nj06l39L30k33L41r4o3j87J10n3K5
3974g4M1L2k16J88J09k69J08J88k71J92j18J78j49J25m7P5l2K55j98j06k11KL72
3997A74k55J14p0Q6k87L51m8J3kl5K53j60k8j73RK07j95J38j58J6J99j34O2k7
$$ y = [-60, 96, -71, -116, 140, -85, 47, -54, 2, -16, -88, 191, -36, 27, 147, -102, -11, -6, 9, -122, -146, -54, -97, 37, -25, 245, -142, 175, -92, 10, 167, -120, 191, 5, -155, 47, 177, 6, 48, 61, 83, -28, -44, 7, -73, -57, 105, 70, -40, -32, 8, -33, 66, 24, -24, 188, -109, -120, -113, 44, 49, 3, -45, -97, 66, -46, 49, -236, 250, 174, 131, -284, 44, -41, -61, 109, -135, -97, -230, -231, 63, 6, 67, -146, -182, -25, 313, -34, -116, 106, 84, 129, -153, -79, -30, -166, 57, 11, -163, -186, 133, 20, 7, 89, -16, -107, -89, 17, 40, 264, 4, 129, 64, 52, -87, 73, 188, -81, -110, 111, -238, -81, 113, -42, -116, -147, 122, -48, 79, -147, 93, 87, -98, 200, 195, 89, -250, 80, -153, 188, 94, 31, -156, -46, -99, -74, -33, -1, -217, -29, 80, -189, -81, 107, -164, 28, -90, 88, -61, 64, 17, 92, 60, 315, 117, 11, -200, -198, 174, -81, 33, -37, 49, -238, 113, 65, 78, 76, 41, 294, 134, 106, -67, -58, 149, -46, 92, -66, -50, 149, 15, 77, 50]
4021E0n9k25Q6N06m43qJ82J7r1j52K88k41R3R1k0j0l6l8k8k99M03q9J06l94K36
4046g5J71j9l3k39J30K3j96J83J48l33k5J63l0K49j83L0m9M8M5j0j68K18M8QM9
4071A53k77N3P3J0N5j00Q8J84l27L87m45K96J27k79R6j01Q2j3j8K3j34o4J50l5
4095a6J03k8j15p6j65L11k04M15m21L96n9k7k4k44J03p9K16j28k5k82M41j44m9
4118a01K0J31j18j76K66j46J06PQ1l13M00j33l92L38j12L81k19j68jQ4r6L10j5
4141A34J03n29L72Lq5J97j72J00j06j04k4lJ63J32k30P7J30l02K56J11o6q5Q9
4164A61j83Q0k64K19J00k45K16r0O7m1j35J62j93K52m7n1j20J55L9k40O8L84k85
4187IK03m17J37j4r7O8M1J89j51k90J64m2K80k84K33j25j4P1l5K75l6j27J74j00
$$ y = [50, -9, -234, -148, 358, -85, -93, 89, 106, 15, -137, 151, -90, 3, 94, 74, 64, 28, -10, -38, -337, 66, -23, 83, -311, -75, 96, 77, 44, -195, -65, -42, -238, -55, 93, -240, -265, -102, -132, 117, -66, -36, -85, -37, 8, -2, -170, 48, 96, 104, 153, -124, -71, 2, 12, 67, -33, 55, 239, -88, 299, -146, 150, 277, -2, 94, -7, 75, 62, 44, 67, -67, -131, 19, -16, 87, 59, -56, -132, -297, 14, -190, 225, -196, 200, 141, 114, 90, -154, -51, -130, 86, -42, -67, -349, 92, -52, -101, -81, 50, -68, -244, 22, -124, -18, -11, 70, -243, 157, 24, -368, -30, -142, 239, 20, -148, -149, -65, -161, 149, 134, 237, -292, 80, 83, -2, 195, 23, 123, 17, -87, -111, -114, 49, 181, -49, 28, 158, -144, 112, 223, 157, 72, 161, -22, 58, -206, 13, 113, -132, 84, -6, 61, 20, -115, 47, -146, 106, 59, 8, -112, 43, 82, -158, -90, 294, 9, 212, -205, -68, -82, -179, -111, -70, 119, -32, -322, -158, -200, 80, -204, 29, -96, -110, -39, -74, 201, 165, 38, 212, 112]
4211A12k58j13J87J18Q9j63k30K86K88l12j14JJ08Jk1j0K51j41j99PJ82q3K53
4234B39j29q9L6k05L42m02R9J96k10k6p3K50K0J66j73J17N7j26O2l83K71l7n7
4257e5Q0J49k49K23l24K01m5J97j23k5l5N4j97J30Q9l32L04k60P6K05Oj11m3Q1
4281dJ66k88J00Q7L3kq1j27J59J11P6k80K64k47p2m4J49k70K20R5J22n5k33Q2
4305c9R6L4k00L24k03L9j45j5m1J1j5K23j43q0j27L60Q8l3O3l76L15R0q9J6l3
4330A20j93j8K68j10o1J74k50k10J98J14k83J70R3Q2K32j75j06n0Km1J75n09L98
4353B0K81j82m6M0j09j34K36p4K0p2P2p2J77j91j84L17j34O6N3j43J20O6j36j99
4377b08J55L46k90k7PNO7j45K41l3k0Oj51J88j18J33k28L40k81K9R0q1o5O1k81
$$ y = [112, -146, -259, -72, 46, 135, -28, -258, 28, 316, 4, -110, -109, -1, 0, -21, -31, 220, 79, -120, -113, 69, -14, 239, 110, 21, 57, -148, 194, -208, -109, 87, -123, -149, -222, 28, 48, 214, 41, 158, 215, 89, 151, -232, 39, 2, -55, 25, 174, -75, 148, -176, 25, -20, 177, 54, 29, -6, 48, -149, -19, 70, -262, 42, -218, -142, 63, 69, -42, -85, -4, 162, -126, -26, 61, 94, 92, 11, -116, 43, 154, 230, -50, 214, -33, -105, -149, 0, -270, -50, 45, 167, 112, -121, -39, 57, 91, -109, 215, 12, 51, -94, -109, -150, -139, -154, 69, -74, -154, -281, 79, 167, 134, 197, -179, 136, 226, 137, 153, 120, -73, -91, 177, 67, 6, 180, -70, -280, -82, 32, -251, -81, 12, 94, 326, 151, 45, -5, -3, -44, 131, -378, 20, 301, 119, 73, 113, 4, -130, 106, 32, 52, -20, 52, -20, 157, -34, -218, 99, -35, 31, 84, -59, 61, 127, -9, -208, -53, 293, 3, -24, -17, -12, 55, -90, 151, 118, 98, 104, -47, 141, 23, 156, -72, 268, -13, 16, 106, 25, -40, 21, -260]
4402b60L69j65N1k2j7N7p7kp7K93k33K1K6j02J9K69j04n9L2Q5r3k8J6nL2j80L41
4429A87k87L3q9J76j39J50L5k49R5J94k30J69P7l42n4M84l25K44l5k04Q1K02j72
4452Aj3j91J61J68r3L9j01J54J31j86p4K76j69p2j39J05K5o1J97l64L32k40K67
4475A53j20J47j92k8J26k68L21m16L12k3j2J06r3Mm8o1o8J73j21l9j01K32K20
4498B04l57J08mn4P2j88q5L65j67J87k05J62M1j59J36pj9J16k06M5q1J16j12L2
4522f0K9J07Kj54l9J14r8J93k2j31J86k06L04k17Q4O6l81J26J19J04j80J19J11
4545A76k07n0k2J20j10l7p4O0J54Q5o9j10K37N0j79J68k27N2J13j11k77K81j03
4568h0J88k26J45K41l14k23L76J25k19j82J15M4m2J82k18j74N52l48K7n6P3j67
$$ y = [-260, 109, -56, -5, -27, -44, 13, -64, -66, -143, 150, -83, -62, -36, -138, -119, 150, 46, -13, 19, 104, 11, -17, -1, -6, 26, -154, 187, -100, -67, -156, 20, -119, 31, 66, -183, -88, 106, -124, 45, 122, -220, -274, 210, -115, 129, 94, -110, -29, 173, 1, -12, -203, -42, 126, 33, 72, -29, 125, 256, 70, -4, 272, 103, 31, -108, -3, 22, -39, 158, -206, 126, -114, 153, 33, 180, -12, -40, 86, -182, 139, -277, 35, 12, 0, 106, 13, 17, -31, -92, -160, 13, -108, -147, -248, -16, 204, -153, -45, -49, -103, -31, -219, -304, 61, -106, 81, -124, 38, 79, -80, 56, 49, 30, 146, -60, -15, -96, 20, -92, -60, -31, 76, 78, -76, -115, -1, -99, 94, 72, -59, 127, -79, 225, 8, 92, 158, -223, -97, 22, 126, -54, 65, 176, -31, -81, -103, 17, -93, -130, -204, -144, 10, 95, 26, -84, 153, 203, 24, 192, -35, 17, 130, 19, -258, 23, -80, 108, -118, 27, 268, -46, -269, 107, 232, 13, -169, -54, -10, -52, 130, -88, -262, 290, -58, -31, -87, -14, -181]
4590a81J76q0M0k8K03j88Q0j61Q2M2J59k04L3j35K39j65J45o3L27k87q2m9J05
4613Hj65N4J58r7k64Q5Q1J40l11L77%j65kK64o9Rjj80mL1j39K59l2OPk4O3k31
4641a42N1N5J25J89m6j48j5j81R1J44l28L14J0r6J30r2j73J37J00j46o3O4P1o8
4665a7q6r4M18m19kK49j90K29o9j60J05k9J09m9J11J34k80O4j28P8k26K86l41
4688c07K32R6j42K92j31R8mj94O5l26L72k4P8k44K06l38J96m4L06k39L8P0k6J28
4712A58r0p2PQ4r5R8r5p6n6K70l25J77j42J42j12J43k23K34R0j1o5N9j07o0M9
4737a8J22j8N7q3J5K20l07j62n2K39pR1j87K83j5o1r8j05K18k83Q6N6Q1j47J47
4762G2k25K24p1M2J0q1J78k54o2K67r0np7K72r6J23j46k23K52O9p7j99R5k9m6
$$ y = [-181, -5, -85, -45, -73, 130, -58, 22, -139, -57, -15, 144, -60, -27, -162, 77, -88, 57, -6, 321, 34, -48, -97, 8, -157, -103, 55, -42, -306, -221, -140, 0, -311, 66, 66, -99, -101, 163, 94, 103, 102, -78, -82, -51, -190, 69, 37, 43, 50, 26, 89, -142, -91, -36, 89, 278, 232, 84, 69, -112, -21, 123, -205, 109, 119, 23, 153, 61, -112, 25, 125, -21, -84, -20, 51, -17, -103, -197, 221, -198, -200, 49, -141, 88, 19, -141, -36, -65, 44, -5, 106, 240, -40, 24, -104, -26, -252, 34, -307, -75, 21, -121, 171, 40, 138, 134, -60, 5, -321, 51, 27, 105, -139, 67, -271, -75, -119, 187, -52, -14, 56, 30, 158, 68, -4, 3, 87, -8, 90, -5, -81, -137, 133, -192, -15, -157, -15, -127, 16, -207, 27, 117, 106, 41, 100, -7, -67, -18, 104, 86, 143, 60, 75, 295, -12, -174, -226, 13, 6, 97, -90, 193, 178, 117, 19, -86, 132, -151, -65, -9, 72, -75, 72, -153, 71, 0, 42, 52, -29, 149, -105, -167, 100, 10, 5, -72, 200, 104, 227, 81, -142, 110, 179, 102, -97, -2, -31, -77]
4787g7J05q7K24j5J1k62J65mJ31Q9k05j05J26K3J8m8k24J17j48J13q4L5Q7q0L1
4812f4j6k9J54k94QK53k31K09j29K19j06K78l11K24l24K83k48p4N80m35K32k34
4834e5j79M88j37k60K16l9j24K22p8j80K49j92m4K00k7J27k49L23k74lJ75l90
4856b31J31K1M0p4K05O4l07J32j98L2J55J80k93J2K55j18J24N2j25n8R7j42P7
4879C1j1j43J01mJ67p2j81P7J54l82J18po1M52k60J46j36l0J01k8p7J03K3p1k86
4904b76K56m8L45l5m02K06l71L49j11J54j09K41o8k21J34J00J6q7j03j9J9J46
4926A16j64M3R9r6r8j23L96k16p3K83l30J55M7j45J07O0K4k01p2J43j08J49j34
4949a38J98K1k43L4j8J97k5k10K01J99k77j33M1J96j6q6J4j84N00l86J57j80p1
$$ y = [-77, 28, -59, 165, 150, 161, -101, 64, 60, 191, 280, 75, -30, 96, 119, 137, 89, -135, -18, -166, -53, -137, -102, -15, -95, -64, -80, -109, 45, -249, -241, 12, -219, -10, -139, 80, -26, 252, -59, 165, -159, 124, -124, -198, 382, -53, 179, -55, -234, 254, 117, -143, 73, 34, -90, 132, 54, -126, 123, -69, -113, 87, 60, 187, -62, 261, -13, -16, 159, -231, -100, -79, -39, -113, 92, 156, -151, -19, -217, -185, -30, 150, -143, -131, 124, 6, 130, 182, 57, -1, 96, -46, 31, 20, -123, -22, -26, 141, 69, -112, -35, 119, -263, -145, -152, -213, 239, -21, 125, -11, -41, 60, 32, -45, 58, 81, 10, -276, -20, -68, 277, 242, -160, 46, -325, 24, -87, 67, -42, 199, 131, -90, 44, 144, 160, 73, -30, -49, -30, 116, -48, -5, 94, -2, -100, -223, 173, -43, -116, 167, -163, -8, 39, -106, 1, 61, 85, -116, -188, -45, -153, -4, -138, 60, 81, -162, -128, -146, 51, 26, -184, 17, 216, -61, -194, -153, 43, 27, -59, -45, -229, 271, -115, 42, -138, -209]
4972b09J03R8l7J53l05K33j00K51l5N3r7k20L1J05N3rJ7j07m3L00m51M14j74Q2
4996A06j19J1J10j69J91l08K88N5J84k67J93n21L35O2N7o7k09J78K7j83l9J8J79
5019A12L0O0k73J93k11K21r3Mj92K69j18O4k09L08l36J06Q4l9J69k03j32L61j34
5042D1j9o9j06K65j70J55j8J9q4l78K34l7M0J68QJ56j89m9l3K98R6k54kQ1m62
5067c09K89n6L46k21rJ05l38K4lK6J53K43l52j06L21k45J50K23l79J55k5R1j55
5090g2N1k6J85j89o8Q6q3K51j97J08p6J95M9j79Q5k09J57J2l57K85k53J22J41
5113A8Pn9k4P0k21R4J5K85k9j40kJ7q2Q2o4P3K74k69M5o2N8l2k58K51L4l7j17
5140g3l6J36mM7j81K5J26P8r6n4N3l4J19Ln1Nn4l0J89l26J72k7J50j07Q2j15l03
$$ y = [-209, -106, -8, -45, 108, -197, 36, -64, 187, 152, 205, 108, -112, -81, 24, 77, 68, 85, -22, -65, 235, -216, 198, 24, 106, -13, -2, 108, -61, 130, -178, 110, 165, 349, 82, 275, -246, 89, 151, 208, 141, -68, 110, 137, -46, -85, -67, 112, 142, 202, -71, 122, -89, 132, 39, 43, -149, 120, 2, 66, -143, 165, -171, -65, 19, -20, 149, -54, -186, 175, 41, 22, -47, -153, 112, -58, 97, 79, 98, 14, -364, -130, -167, -127, 41, 49, 205, 16, -33, -66, 232, 328, 74, 72, 153, -309, -20, -76, 270, 49, 40, 145, -193, -169, -172, -146, 7, 250, -102, -208, 113, -132, 18, 241, -138, 17, -8, 83, -72, -21, -47, 138, -51, -119, -33, -116, 135, -62, 46, -30, 165, 214, 35, 120, -89, 68, 80, -277, 8, -245, -123, 18, 25, -34, -58, 12, -209, -115, -100, 185, 156, 16, 14, 31, -51, 31, -33, 40, 314, 45, 90, 28, 86, 54, -204, 47, 81, 44, -73, -109, 27, 23, 70, -111, -86, 40, 118, 22, -32, 21, -13, 106, 109, 58, 63, 9, -21, 168, -158, 14, -13, 137, 30, 112, -3, -306]
5167c06M04l59L06j17Q5l1R6o5M9q5j92K02P4r4O6o7K01j66j08J61p7p2K42p4
5191G3j43K7N9J46j41M1l1j62J96j96J59r3j1k02J2M42k87oR6J01r9k63L13j0
5215B1L07m90p0J85J00K45l63J05J46lk20J86P3j97r8K2k23L09K0q5L51l41j5
5238c5J48r4q6j6J28k52K99j62j29M73j75k35M2o2P4J39R6k19j79J77n4L1J01
5261A0J69k76K33j84J29l98K62N2k4j43Kj12K69L2j07J4J31K13k53o3l3J21j07
5284f3K20q1K2Nk3P0j02j92J68k4J29j1m34M00j02k7N5k15K25J38j25m1K6q7K37
5309A68j52J44j54P5k7j10q3J70j00J19M4r0j48J26L55j16l26n7K0J46J83j28
5331E9k5j62J5J11n2L0M4n8p2J66j49J15P7p4mp7J84j32j41K9J78j26L63l45J26
$$ y = [-306, 98, -261, 45, -72, 13, -18, 78, 13, 62, -23, -215, -13, 61, -33, 33, -34, 167, 1, -107, 54, -23, -95, 147, 73, -70, -43, 16, 162, 21, 62, 31, -131, 65, -131, 28, -65, -76, -278, -266, 176, -111, -117, -21, 80, -19, -282, 31, 21, 328, -162, -232, -47, 53, 298, -65, 40, 186, 183, -37, 149, 222, 25, -73, -51, -274, 35, 55, -30, 321, -20, -35, 113, 19, -67, -83, 45, -207, 92, -70, -199, 274, 99, -136, -94, -156, -82, 57, 153, -66, -245, -68, -122, -91, 10, 179, -97, 136, -48, 81, -317, -55, -3, -27, -170, -168, -280, -11, 21, -86, -72, 59, 272, 19, -44, -77, 44, -63, 157, 76, 98, 103, 80, 150, 48, -144, 24, 0, 129, 118, -316, 84, -18, -45, 10, -205, 20, 158, 33, -8, 18, -69, 168, 16, 160, 6, 81, 54, -56, -139, 31, -69, 50, 94, 4, -144, -18, 337, 221, -105, -162, -142, 4, 187, 59, 34, -128, -113, -2, -54, -24, 20, -38, -110, 56, -93, 22, 99, 25, 21, -56, 128, -4, -145, -116, 62, -64, 299, -46, 80]
5356H0k88J32L2j98L24r7q4L35j12M6j06j92L2Q8J42l13L21q7k39L02l07P7J04
5379hP0O2m25J87J28j44p7M44J36n75K66j06L5K07k53O9Q5j1NK21l58J5J00j71
5403i8Q1j0j98J48N5k5P2j63K74j72J88k35K22m10J17J73k6J4k6j07L22k93m6
5426a43J23Q2k8M2Q1%j28j33J98j50k60Q9M33j62k24m7J02K8K34o0j78J90j11
5449b2o9Pr1K77J1l0j20N6M2L4j26j9K15k95K57J17j81J65l27J11P0j49J26J59
5473B18o7k59L6K9n8M4n1j13L00M0k0m3j26l4j8L09j45K3j26k3J29n7l9O7K2J26
5499A64j99N5j63j08J58J36J40k33j2q8J87k98M28j56j21o2M16q3l02j08J54Q6
5521ik9L9j18P1l0M9O6L44m20K65L5k38j13m9J13r5L03j49j81P0K17L5j39j11
$$ y = [80, -208, -76, -44, -242, 82, -15, -99, 236, 124, 170, 64, -128, -96, -8, 134, -179, 142, 55, -184, 118, -189, -112, -8, 62, 124, -301, -114, 14, -130, -207, 237, 373, -202, 64, -42, -7, 200, -53, 16, 101, 90, 95, 316, -42, -27, 73, -98, -17, -27, -225, -77, -22, -47, 25, -138, 136, -36, 152, -83, 139, -271, -154, 19, -7, 7, -19, -126, 196, -97, -143, -20, 62, 34, 76, 157, 157, 29, -104, 94, -56, -316, -227, 206, 44, -180, -227, -125, -97, 137, 77, -101, 89, -22, -91, -84, -175, 102, 113, 83, -37, 19, 61, 95, -31, -50, 165, -130, 127, 244, 63, 228, -99, 12, 82, -67, 59, 218, 151, -108, -72, -43, -101, -57, -108, -221, 79, 119, 99, 56, -70, -104, -122, 187, 42, 65, -61, -84, 45, -12, -51, 16, 38, 164, -35, 20, -143, -251, -93, 43, 183, -50, -62, -150, 37, -261, 167, 11, -110, -172, 244, 161, -141, -249, -95, -9, -38, 1, -117, -46, -76, -27, 39, 383, -37, 228, 263, 25, -88, -137, -24, -119, 184, 35, -146, -76, 141, 176, 37, -74]
5545g4J64j11K85q6k44R6R7Mk71J71k17R7J50m48L39L2j01J84J18l79L71kj78
5568cl9J7M0L2q4o6J62J13j78j53L32K97m95j96K33K66m87J80j36M9K7M0P8m4
5592a5K05j20j48L0n6J92j26K2j3K7K19K08k57k54J60j54K22Kk73J34O7j82O0
5615e0J42M4j20L2o3K88l78J05l0J66m36K35N0p0J48m2J50K13n15M1K3J84j45
5638b8Q2L0Q3j46j12Q9J28m4o3q0J51k0j22j00L77k15J00m7l4n4J15k91L23r2
5662C0P9r1j68k4J92J9j14J15N1n7j05J54p3K49n94N34m9q7j27J19j09k8N6J68
5686A40q0Mj01p4K87j61RM2L6l47L76l29L47J13k46j04M4J17L4p9J18q0K2j05
5710a7M5j44J76j96J33o4o2Q3J56r4j31j12M40k38P9j31J74j51l5O7m5K79l75
$$ y = [-74, 90, -21, 264, 178, -66, 30, 127, 131, -140, 31, -186, -89, 61, -387, -48, -16, -117, 67, 185, -194, 177, 175, -3, -42, -25, 15, 47, -37, -103, 59, 172, -6, -159, 173, 470, -25, -221, 12, 278, -209, -29, -165, -116, -89, -49, 29, -15, 190, 70, -78, -48, -104, 88, -38, -16, -29, -2, 217, 425, 168, -86, 74, -80, 142, 144, -129, 5, 72, -110, -50, 92, 136, 16, 48, -15, 273, -105, 0, -30, 136, -300, -65, -15, -85, 63, 21, 171, 384, -131, -90, -67, 117, -28, 54, 84, 167, 21, -91, -2, 126, 82, 19, -61, 90, 70, -52, -152, 225, 10, 110, 63, 29, -25, 90, -201, 122, 30, 109, 18, -150, -174, 18, 37, -77, 38, 89, 32, -73, 81, 8, 257, -337, 197, 148, 61, -66, 53, -56, -84, -28, 140, 60, 64, -37, -111, 176, 15, 24, 66, 102, -245, 131, -198, 149, 262, 16, -88, -44, 73, 107, 28, 146, 66, 88, -17, 28, -116, 60, -136, -3, -67, -129, -46, 110, 16, -115, -227, 213, -25, 54, -77, 97, -54, -89, -22, -67, 212, -163]
5733a63N6q6K20j16Rj81O7L07p6r3K0N8L7J9l02L47j44K60k93M2p6N4Q2n7J78
5758A69k2o9K47k11p3J23k78J01j23J28j04J05j84M2J82Lj91Q5K6P9k56n8L86
5781A07j24J5j47J34k0k35J86J30l6mq2Q2o2K0M30m99N3N3q2O4N2J1M3j25J08
5806G2m4j00R3o4k53K20L6p1J96k16j36K72J53l3j66kk2K57k66R3J27k6l6N1J53
5831B88n35K72q0M7j00J04r6J30R5r3R9j4Pj70J58j22LJ24J28l39L19j57j8j31
5855h1N1J03l8j07j49K87kj56l7O6p3K20N8j81o0m7J80q7k1J62M7k67K73k64O9
5880e4j29M41k96P7J93%j85j46K25n4k61K38k9O4m7r1M0n4O6k31L40j52p7r4J62
5905e4J71j36p0o2m9L17k08O4k56M10j37O8k15L50k14o7K73j14N4l8q3J57p8J6
$$ y = [-163, -107, -193, 27, -89, -80, -261, -194, 113, 37, -56, -36, 22, 59, 78, -224, 123, -21, 239, -54, -12, -88, -34, 48, -9, 169, 147, 78, 325, 114, 41, 164, -114, -13, -136, -8, -112, -7, -191, -149, 33, 36, -155, -70, -44, 35, -221, -279, 107, -17, -2, -149, -15, -35, -270, -84, 46, 10, 6, -76, 6, -56, -36, 394, -105, -52, 1, -81, -17, 35, 46, 89, -36, 72, 28, -72, 21, -43, -296, -76, -40, -111, 85, -131, -267, 5, 158, 125, -41, -43, -65, 192, -74, 19, 146, 120, 84, 135, 288, -247, 25, -55, -8, -108, -4, -100, 30, 125, 32, 131, 117, 124, -46, 112, -10, -7, 117, 245, -94, 225, 68, 50, -81, -30, 73, 35, -72, -221, 66, 64, -92, -129, -63, -136, 84, 142, -39, -99, -146, 34, -53, -74, 88, 135, -132, 141, -123, -54, -183, 258, -38, 39, 232, 232, 47, -99, 126, 72, -189, 49, 20, 84, 37, -54, -14, -68, -2, -233, 107, -45, -122, -216, -54, 117, -19, -89, -151, -200, 117, -91, -27, -283, 127, -10, 58, -157, 193, -21, -88, 185, 71, 125, 87, 4, 161, 83, 99]
5929I9j68K84j95l7n4O5Pj51J5L83j55m3P9m0j06kj73L97Q4m27J88l67M00r4n1
5954f2OJ97k14L50n55K43j60P7J50k51M97l95J1K67r8R2j54M6J7o5j33O6M0J39
5978A11r2O9Mj71L15k29m6m9L03J48k58k70J7J43p7m5J46l02J47K73l15K49j04
6001c3n6J72j9o2J21l21K55j27M7J14n9L0k0O7k60K16j55J43k05K22j98nJ48J85
6025B00j90l4j1m6K74p6K1j86qrJ72j77R2J09k39J33r4o0pK66J82l33n1J65m2
6050E1j7M7k70j05O30l28P0J45k36l7j06K20k4j99J90k3n1n6R1j06M2J70j53P7
6074B2L0M4j62j21J80l8j06K22l13K95q5j74J25M1Jj56K12k02K84j81P8j13J57
6097D0K1l7j11l0J34k7o3P3k7M3l9l8j08M7K43k09J52K34o8k89J79j47J01p8P5
$$ y = [99, -69, 215, 20, -17, -71, -6, 1, -150, -135, 248, 93, 50, 129, 89, -17, -19, -192, 205, 289, -138, 50, -317, 83, -11, -62, -56, 141, -73, 277, -278, -35, -195, -118, 32, -219, 278, -117, -106, 161, 63, 155, 1, 47, 64, -1, -134, -68, -28, 111, 19, 88, 92, -79, 236, 7, -39, -88, 215, 363, 105, -165, -148, -5, -82, -127, 19, -283, -136, 137, -178, 71, -33, -89, 83, 64, 2, 123, -198, 57, -70, -23, 91, 32, 62, 42, 109, -151, 65, -90, 53, -152, 70, -128, -133, 15, 200, 10, -24, -35, -81, 193, 117, 138, -48, -56, -65, 107, -70, 22, 131, -108, 25, -69, -129, -136, 130, 312, -21, -72, 93, 51, 34, 81, -189, -294, 336, 8, 78, 223, -13, -50, -156, 64, 40, -159, 31, 8, -43, -99, -8, -114, -72, 98, -55, 22, 52, 96, -66, -187, -7, -45, -151, 71, -242, 53, -32, -206, -81, -40, -39, -195, 17, -185, 99, -82, -4, -117, 40, 61, 24, -87, -117, 17, -10, -73, 0, -27, 16, -23, -61, -169, -122, 121, -88, 64, 298, 230, -59, 120, -27, 74, -4, 71]
6122G1r5K49k26J66j65k39l1N59l45N7k2r4K3Q1m8L03j68l6j48q4L57j13o7r4
6146a09K39k35K64k01J10K7p5J64O0k94J36k7P2M6r2Q9k46K34k01l1q9K15j91
6169a35J64On7J01o4k59K16P2j36J31j20K14m2k40J24M5J08k67J53l7r0J46m6
6192a3K6k45J25J27j52L81j75k33R3p9j6N9RP6o2K37k30j6n7J86n9J57l4O2l94
6217b27J74j6L21j62j71J64J37N4j95o5j14k30L47N6j49o3K19N2k31K18j18N3
6239E4M2M1k00o5K07O7o9K7l4j87K48k29L21j71N4j92K83j79o3j56O8K71j99j2
6263g3R5k23J60j46J57o4j59M30k09J23o6r8P3K11j71K9J31k09j91J72J0J8j1
6286a1N8j28J90J99l73J82k02p4J04kO5r7K6k4l6r1K73Q0j14M4o2qk2K28j43j12
$$ y = [71, -24, 225, -1, 165, 0, -239, -270, 289, -56, 1, -21, -115, -92, -11, -59, 244, 76, 40, -108, -192, 165, 52, -15, -109, 130, -105, 159, -42, 68, 95, 20, 184, 244, -50, 86, 59, 131, 177, 85, 174, -72, 162, -39, -70, -159, 56, -135, 29, 35, -22, 79, 15, -244, -28, 44, -92, 39, -81, 133, 91, -149, -25, 20, 128, -139, 14, -23, -113, 33, -13, 13, -232, -107, 20, -132, 249, 74, -159, -66, -145, -161, -102, -93, -17, -79, 158, -72, -88, -145, 41, -18, 139, 105, 167, -227, -53, -69, 252, 90, -81, 83, 220, 274, 79, 14, -100, -330, 17, 73, -76, -139, 80, 132, -99, 119, 1, 54, 96, 137, -63, -128, 79, 146, 77, 104, 70, -117, 131, -98, 223, 52, 106, -86, 197, 18, -45, -201, -133, 138, -61, -73, 22, -201, -41, -187, -30, -94, -253, 177, -32, 91, 25, -73, 0, 211, 40, 69, 200, -9, -200, -28, -18, 0, -11, 47, -81, 109, 308, -65, 117, -85, -159, -55, -57, 8, -89, -63, -87, -123, -214, 59, 139, 25, 69, 7, -1, -23, 205, 62, -50]
6312e0l1r7J69o8L91k72M5m8m1J80j07n1J8j95P4J8J88l7j14P6m4r7J44k2R6K1
6338A46l06R8O8j0l00K88J9j77K70j1j28J12k8k67J11J59J58k54M35l45L8J2m6
6361D2J53l66Q1J91j38q0K34l12J67J51m0l01L22j16m3R6p9R3m7m7j4J43M6k65
6385a29p1K32R0k01J06P8J1l21L3K08P0k19J52R8j06lm8Q6l49K49o4J30n0J47
6409A29k55PR8k0j3K60k56M7P3N3j82J97l00L77k74k4j00N6L56l00L02k53R8R9
6433A75R0Kk17k5J3K8J19j81K00l64J78R7K8k63K49l25J04N4JQ1p4k3M6J02j23
6458b8K3N5Kj66k5K32k0P3K4o8K2j91n1J60N6q0l0k46L45k84k3K90j05K9K36k65
6484c5k6j78K15J84j32O9n7K1o6j39L4J69k05k0K98p4J02M9j19j20j70K17L6P2
$$ y = [-50, -81, -178, -9, -77, 314, 42, 87, 39, -2, 178, 71, 20, 38, -157, -83, -65, 123, 86, -28, 48, 4, -93, 51, 29, 125, 146, -160, -62, 6, -4, -304, -16, 3, -174, 96, 85, -43, 69, 41, -226, -115, 44, 202, -52, 383, 38, 76, 88, 42, 195, -171, -90, 101, -37, -117, 117, -195, -28, 123, 83, -218, 104, -12, -55, 41, -38, 55, 8, -39, -53, 90, 136, -129, -200, 32, 122, -79, 27, 105, 116, -205, -172, 36, 106, -113, 39, 137, 31, 28, -20, 66, -283, -34, -98, 32, -18, 129, -126, -119, -21, -41, -54, 206, -50, -3, 70, 123, -59, 138, -162, 215, -59, -83, -183, -127, 229, -71, 231, -22, 76, 175, 265, 267, 50, 25, 38, 66, 185, 4, 204, -160, 18, 115, 143, -120, 129, -196, -92, -38, -37, 44, -30, -53, -7, 95, -28, -5, 50, 52, -114, -139, 93, 73, 146, 170, 102, 124, -67, -118, 42, 98, 18, -12, -258, 87, -197, -220, 70, -35, -6, 230, -35, -61, -239, -24, 160, 28, 97, 40, 61, -5, -144, -110, 59, -146, -166, 132, 58, 160, 209, 90, -30, -200, 17, 53, 125]
6508A25k49K88K4j45n0K05j58Qn6J50p6l10N53l57N7J29j14j45L65Q6m25R4L8
6531C7Q4l33L52j49K4L5j79L75l28K4K42k08M9Q5k1M0k78L39N8l38L23j18j9j01
6555erM4J5kJ13L1k54P5j71J16L38j22j90K4k43L75j85n7J92J61n74L40J29r0
6579E1j22M7l0L20k74N5J18k45J90N4j76k64K96k32K63j26J9J62O6l39K65M9N3
6602B00j2k57j79J63J85j01R6q6LJ41J3j73j60J53O2j13L01j80k41P9J06N8L6
6625I4k30L22j2j2r2Mk79OL12j05r9K9J52k2q8J03j59N4l1nM7J71k06J88j82l4
6651g4j0O5j11r2L16lk7m4k95J94J87j46j29K73o2k7J78j44M7j73K86k0j66oo4
6676d7J39Mk92J17%J72q1j72m0J86j53K09m2Pj11J81j26l0Q4p5K01J5j42J32j46
$$ y = [125, -124, 164, 188, 43, -7, 198, 40, 48, -8, 142, 66, -244, 309, -48, 9, 138, 24, -121, 244, 330, -95, -1, 37, 121, -212, 140, -9, 15, 50, -129, 246, -82, -58, 184, -24, 25, 110, 89, 129, -149, 190, 248, -90, 233, 115, 96, -5, -14, 30, 45, 43, 156, 187, -67, 8, -163, -47, 291, 169, -21, 3, -240, 135, -50, -107, 85, 246, -328, 12, 141, 51, -71, -24, -54, 266, -8, 47, 165, -80, 110, 164, -12, -276, 20, -212, 51, -75, -56, 106, 172, -167, 98, 147, 200, 188, -69, -248, -85, 100, -1, 95, 9, 12, 153, 166, -7, -167, -14, 48, -65, 236, 56, -185, -106, 0, 58, 94, -136, 186, 174, 162, 70, 74, -205, -199, 113, 8, -91, -62, 90, 68, -20, 83, -76, -22, -53, -58, -11, 160, -46, 142, -40, -74, -84, -19, -130, -222, 94, 91, 64, 20, -275, -81, 106, -40, -169, 104, 42, 15, 193, 49, 96, -77, 209, 189, 23, 17, -47, 92, 96, -196, -79, -79, 93, 12, -160, -200, -14, -167, 42, 0, 7, -104, 77, -49, -79, 5, -70, 131, 146, 4, 136, -10]
6701a0J19k51k8K98J72k92P0q6J32k58p4L45l07K66N3j13j5p5J65M6k27K11j37
6724DK1j18J34j18J61j93J96L0j1l93L77l10L9J09N2j67K03J65j80J06J48j49
6746A06j87N5K09n2M1j8k16p1K7MJ01J60k80R2j14R6J00q9O5l8J08k20K14k14
6770a21Q0pj24K50j82J38j2J38j52K1j7J24k3j92J93J61m08K54j96R5J63j91j1
6793a9%pm5K23J12j2q3j42q3j23K44k7l6k9j09P6k2j63K81k3j09J35J8j22J46
6818H1j92L03k01M1o8M5K09p1k09K59n4q4J38k12j06J2M5M7j54j85L86j25o4Q3
6842g6J8n6J67J25k31o9K46j60J44Lk12k09K73N3q3J98P5q8J2L2j29j16j1j27
6866b21J77L4p5o8O4J40l42K08N2M6K14k3j50q2J66q9J8P0j35M2M3j2j58L88m52
$$ y = [-10, 109, -142, -170, 128, 300, 8, 78, -8, 124, -134, -208, 137, -170, 96, 149, 36, 21, -54, 111, 157, -70, 141, 4, 25, -93, 41, -77, 84, -109, 87, 117, 106, -287, 90, -220, -181, -72, -20, -187, 16, 181, 1, 107, 255, 106, -81, -26, 183, 131, 172, 154, -62, -133, -106, -102, -1, 159, -121, -29, -143, -47, 53, -36, 29, -9, 99, -121, 93, -121, -41, -48, -172, 78, -104, 34, 22, 160, 8, 29, 12, 136, 113, -79, 114, 275, -133, 121, -75, 20, 183, -8, -19, -19, -26, -71, 152, 264, 252, 169, 27, -56, -179, 65, 38, 2, -27, -136, -60, -82, -245, 36, 13, -96, 39, 57, -65, 81, -111, 192, -9, 32, -36, 9, 218, 147, -62, 197, 143, 59, 197, -15, -121, -109, -64, -17, -171, -356, 30, -95, -159, -76, -58, -114, 53, 178, -53, -122, 124, -36, 108, 111, -101, -310, -37, 16, -67, 131, 206, 118, 130, 162, 33, -83, -94, -221, -44, -10, -85, -153, -89, 51, -291, -83, -31, 15, 229, 206, 56, -26, 140, 51, 69, 139, 4, 46, 89, 77, -81, 307, -145]
6891a45K47k20j36M73j62O4J42j17k27J35k3P2j08J40k85J48J88q6m9j18j06J19
6913e4M5J46r8m2l8Q5Jj60p4J95j05L03L7p8k66J06p3lk16K22J25k30L06l6P4
6938A72j49L8J40p1k70L24k23N9jK2r9J33O2k83Q9J95k8j70O2O0j78N6J29k74
6962b05L98m74M52j02l26J30Q9j66L37Lj19j10J82j92o2K32p2j01K19l14K76j24
6984d9pj25K05m9j0Q7q3m1r7M6l1L89k82L07l24L53j80k59J14M03k91q7o1L32
7008B60j75j45J39L7j99J8Q3l2o4J11q7J62m2n5R5n0k64Q6J70O5j72O4j00l6M6
7033h5Q4Q4pK63k09l20K41q0J5P7n2K8k3K5NQk66k63M37J47J22j03NJ34j23j00
7059D4j68J17k09K00p4j61R4K50l32L71j08n5j06K07J60k16J4rm1J91n1j52J27
$$ y = [-145, 102, -118, -254, 219, 57, 121, 263, 146, -81, 54, 31, 103, -5, 135, -150, -2, 186, 100, 51, -67, -173, -54, -9, 137, 39, -3, -41, 44, 45, -115, -189, 6, -99, 204, 241, 163, -103, 3, -70, -73, -289, -67, 58, -172, 134, 98, 172, 23, 61, 201, 130, -140, 184, -39, 20, 19, 41, -58, 75, 137, -146, -57, 138, 110, -60, 2, 62, -116, -60, 69, -205, 193, -281, 171, 69, -257, -127, -38, -204, 133, 136, 17, -93, 89, -103, -165, 67, -5, -106, 113, -201, 75, -49, -56, -181, 24, -25, -35, 52, -31, -72, -169, -123, -154, 235, -47, 260, -64, 289, 109, -150, -36, 367, 76, -11, -72, 260, 85, -60, 79, 116, -83, -65, 18, -14, -78, 33, -54, 108, 66, 11, 106, 56, -208, -122, 48, 113, -59, 5, -95, -131, -85, -1, 83, 76, 339, 130, -190, 51, -29, -14, 63, 11, 39, 16, 41, 46, 54, -212, -475, -38, 109, 231, 128, 133, 267, 144, 44, -124, -7, -216, -16, -90, -251, -157, 93, -239, 132, 24, -31, -137, 70, 230, 14, 28, 19, -22, 169, 118, -34, 93]
7082I3q1K12j80J65j54L4l62K76l7J86l23K43P9m56L66J1Q5Qr6j31Q8o4j33J36
7106c5J85j16m1J69j91L39m62K08J66k17K06j07k21J92j08J32Jj80J75l69K15
7127e9MO6j86L78k62k16P8K58n0k2m4O0j18k2r4J96J29j70J80J15n8O6m37K60
7151E2M5J9NJ3K37l08J62k12K3K9nr7Q6l17L96l10N9J34Plj9k0J37q9Q8K0j55
7178b3K00k16M3J27k70N4O0n6P9KJ79k31L16j59j22J3r3J60nRk7K81m69K01j2
7203D1j31K08j06p8J45k61P4J0K31j39J11r0N9J6p8j71J37Q1K9r6P6O2j10k3k6
7228b9k6k1J38M3J64o0n2j25n3J44j98O3k4K09n7r1q8J9j3p2J72k1j12P4M3pj20
7255a00J40j64Q9N8K3j41J5J40k25K98j84J40l89J17K98j72K87k08J13k40K35
$$ y = [93, 12, 224, 44, 209, 55, 89, -273, 3, -34, 152, -171, 72, 151, -305, 61, 72, 157, 165, 69, -62, 26, -38, -171, -35, 150, 34, -7, 162, -29, 310, -152, 56, 222, 5, 211, 104, -117, 75, -33, 99, 100, -80, 95, -274, -59, -55, 11, -175, 203, -59, -275, -197, 61, 11, -11, -55, 5, -113, -135, -229, -33, 96, -74, 106, 221, 163, 229, -208, 52, 97, 116, 121, 134, 371, 63, 225, 13, 36, 65, 60, -37, 49, -268, 128, -182, -123, 11, 18, 15, -4, -24, 113, 24, 112, 132, -23, 177, -39, 4, 131, -139, -85, -25, -81, -2, 0, 179, -52, 264, 105, -17, -4, -97, 63, 58, 67, 40, 321, -148, 53, 41, -90, 118, 12, -66, 79, -182, -108, -98, 133, -6, 105, 15, 74, 90, 12, -159, -22, 59, 88, -8, 68, 130, 20, -3, -29, -55, -76, 62, 105, 269, 209, 157, 32, -21, 123, -75, -12, -36, 173, 116, 25, -63, -44, -57, -129, 43, 22, -90, -16, 27, 20, -100, 40, -124, -35, 23, 46, -95, -80, 60, -165, 133, -51, 89, -300, -183, 115, -57, 230, 22, 135, -105, 130]
7276A30m8M6k3k33J14M8j31lL69m13k3K68j3n3j29J90r8k25J38k10M6J81o9K72
7300A31j13q3L6l3J20j51P8lM6n6J47K5PON4l39n4J82n8O4Oo0o2K38J3l3k57L07
7328A58j92K04j52j81J96k20l8N09k49j08K06j10k19K42J59k22o4P6J15k63N9
7349i4J08p7K6O7m3O9K10k04L0k00J52k57J3J08Q6k27J59K87l79J96j72J34P8
7372G0L9lq1j59L55k26k12M06k59p6O6lj45K04n4L14l18nQO5l2L1q3J2q8J66L5
7399B7k11J30K2o2l1K97j20J22k71J92l20M9J39J12O7j51J55j70J18k02J14k1
7421a5p3J85j64N9J69m0j44j99K16R8%k61J34l1K15k58J18l1K5k10J86l75N47
7444A51p3Or7o5N0k00K65j70R4J27r6m8J16J45k08j94P5R4o3J60K34m29K17l77
$$ y = [130, 82, 128, 105, -128, -14, 34, -97, -100, 269, -144, -167, 101, 88, 35, -94, 96, -2, -227, -89, -299, -253, -72, -141, 131, 18, -65, -29, -62, 58, -93, -15, -18, 28, -28, 119, 144, 151, 157, 211, -128, -182, 0, -58, 6, 12, -48, -110, 128, 141, 108, -149, 158, -34, 170, 18, -163, 33, -187, -225, 284, 35, -73, 133, 23, -196, 46, 205, -17, -81, -5, 110, -153, -94, 14, -63, -37, 30, -13, 56, 266, 62, 92, -108, 44, -213, -200, -92, -6, -233, -74, 213, -166, 30, -142, -8, 70, 109, 106, 25, -134, 221, -5, -217, 189, -70, -146, -80, -83, -228, -24, -78, 236, -82, -87, -79, -14, -46, -15, -98, -86, -174, -8, 27, -184, -54, -32, -94, -125, 172, 52, 174, -97, 95, -225, -176, -37, 75, 142, -9, 146, -24, 94, -108, 6, -15, -88, 97, -67, -8, 161, 121, -23, -222, -6, 92, 92, -169, -35, -66, 149, -109, 9, -22, 3, -207, -21, -396, 151, 78, 84, -13, -78, -28, -228, 37, -133, -39, 88, -8, -56, 60, 205, -3, -197, -122, -28, -91, 69, 303, -126, 91, -286]
7468b86L13j35K62j13j38q1J78lK5j06j6jl1J45q8J37j47K7LL6J0N2j92J66n0
7493c3o5R7j81J26J02oK6M2p5J98k54P2K8k25M49l79J25M8r3L6P7n6p0J71l40
7518a80J78J71l81K86K3j85J64j29K40j56O8r1L6q8j8L5j08K22K0O4l68K05p4
7541f6l6J42n0m1J25j07%k03L04j06K48j69lo2j57K70J26l41J02j1J85l57M9K58
7565A00l09K32J31k44N6j12J01K98l08O0j81K27M1J5O6L2l34J81p6P5O2m6j13
7588d6l8m4J84O6j83J5r1O3j31L37o7k13K37j64J59o1J49r8J07k92J09N6k22O1
7612a07j7L54m77M22P4k09J06l89J91n8J72P0m8k90Q8L53L2l65J08J48o9m1j76
7635a28q9L59j60n5O0n2RK58j61j63l9M89l09pk4M7j30J23M9J7j5j39J98n0j69
$$ y = [-286, 27, -108, 154, 41, -97, -178, 0, -3, 22, -84, -100, -101, -132, 13, -75, 62, -85, -58, -55, -19, -9, 43, -149, 17, -33, -98, -1, -182, -56, 46, 40, 66, 108, 33, 231, -23, 49, 77, -148, 301, -78, 47, 95, 2, 38, 115, 59, -11, 160, -180, -2, 169, -212, 74, 97, -88, 76, -53, 187, 31, 99, 8, 44, -44, -62, -27, -135, 87, 107, 171, -197, 8, -66, -102, 40, -10, -51, 74, -33, -33, -236, 68, -38, 210, 41, 38, -24, -181, 89, 215, -126, -24, -35, 150, -207, -158, 100, -209, 23, 154, -90, -34, -146, -45, 253, -55, 5, -176, 51, 92, 107, 173, 205, -129, 52, -24, 51, 113, 67, -46, -84, -128, 56, 122, -61, -46, -137, -74, -205, 132, 65, -148, 89, -75, 84, 23, 172, 74, 181, -111, -2, 54, -168, -107, -124, 230, -247, 175, 249, 40, 146, -243, -52, -110, 62, 132, 84, -206, -118, 235, 267, -98, 10, 158, 89, 48, -128, -217, 142, -18, -73, -13, -65, -56, 202, 41, -122, -161, 328, 19, 12, -12, 35, -95, 28, 77, 94, 79, -60, 138, 88, -81]
7660h1K23m29K80j23P3k4L7K27k08k68K34Q3k22J63l5j26K68K8l16J31J57k71
7682a99L61j34N2J5o8J6K5k15J56o4K1j23J22Q3j05J55k58j5L05j60K52j90J6
7705D8J53j5r2l22L76l25L68k75J88q9o9N7p9O0K9K33k54m3J31J16j60L1j17J4
7729c6p9J89k68K35l1N6l24L20j16o1J15L23k84q0J43j98K15M7p4p6l0n7J47j83
7753a07M8o4K27k30J00J73k04K14k37m5l8J19j41J23L17j94o1P6k27K95j9j15
7775A0j50K18k66q7L17M0j00j6J6K76m91J70L67k77L4q6k5J85m20J89K30j9j23
7798hq1QJ59q3j07L14j96r1p6J25L4j05J89M3j63j3N0J3k26M1K79j29j12J15q0
7823a00Q9k02L60j41K73m38l5K72J4l98L05j67j12J14J74l13M64j78n3N2Nl14
$$ y = [-81, 142, -287, -7, -130, -57, -81, -44, 183, -25, -293, -59, 24, -198, -35, -70, -196, 72, 100, -216, -85, 72, -199, 162, 28, 80, 95, 27, 43, 68, -147, 9, -55, -34, -157, -35, 48, -57, 98, -160, -175, 130, -30, 222, 32, 48, 201, 186, 94, -228, 148, -177, 191, -84, 104, 15, -54, 3, -76, -16, 13, 246, -8, -51, 80, 196, 36, 67, -50, -36, -115, 74, -194, 41, 10, 66, -258, 62, -54, -115, 0, 323, 39, -41, 102, -96, 119, 166, 92, 16, -14, -71, 76, -107, -59, -123, 104, -126, -26, 147, -57, 157, -80, -125, -163, -44, -185, -62, 255, 61, 0, 76, -151, 144, 125, 10, -140, 78, -188, -275, 42, 82, -18, -34, -18, 258, -233, -63, 304, 27, 61, -25, -50, 135, -285, -96, 134, 115, -8, -89, -81, 78, -5, -112, 202, 6, -85, -161, -36, -2, -107, 82, 125, -38, -51, -1, 12, -214, -173, 106, -23, -135, -20, -100, -11, -213, 147, 6, 279, -159, -194, 78, 92, -306, -1, -168, -280, -166, 8, -305, 159, -19, -72, -20, -15, -329]
7845c29K24l9J73jN9m9M2J71k23n6K4L9J84l61Q3q0J50J17Q8l9j55P5j40n2M5
7870e0K59j58J64l69L24k22J4J61%P4l86N11l80r0J76l19N84l17k9K01k5L7k2
7893A38k9j56k5Q6J4k9j86K73j10L2J95l02PJ29O1j10O1mj12J62o9j02K13J17
7917B54k23J16l81M02j06k36J08K8K54k37O9k15J42K63l73L2J73j77M43n69J44
7938h9Q4k2K44j99J02J98l43p3J72o2J3M3K03j42k7JK6qj29J23k24J49k51M31
7962B20j97j23J97o6k47N8Q3K2J15l2j79R7Jj08L4J46j56J56J54j25j37j31L46
7985A28k48J51r4p0k49L89L5k20K31q6p4K28r7MJ56r3r1j43O6R5o7J71R6n01J64
8010a19J53j30K0l0J74n8j25L66k01k07J21J87j84j34J27J16MJ8j35m4q3J88l2
$$ y = [-329, -105, -144, 29, 28, 87, 38, 80, 251, 28, -28, -4, 35, 219, -142, -59, -139, 11, 128, 216, 177, 22, 97, -43, -95, -50, 209, 51, 215, -154, 170, -52, -38, 123, 123, 197, -189, 322, -58, -148, 28, -291, 293, -24, -53, 148, 123, 160, 138, 109, -47, -72, 14, 28, -1, -187, 86, -24, 8, 203, -99, -92, 37, 98, -12, 49, 45, -67, 95, 26, -76, 137, 254, 31, 147, -234, 168, 62, -174, -66, -38, 216, -21, 48, -167, -25, 238, -135, -103, 70, -107, 336, -233, -89, -5, -27, 217, 18, 120, 318, -25, -98, 74, 12, 25, 68, 271, 129, 102, 103, 129, 121, -8, 115, -109, 40, -211, 220, 23, -100, 97, 31, -216, -158, -75, -53, 62, 30, -149, -52, -51, -159, -125, 21, -135, 21, 175, 50, -87, -218, 128, -120, 31, -63, -133, -382, 7, 42, -178, 53, -33, -107, 121, 24, 28, 184, 91, 0, -143, -77, 18, -49, 122, 218, -283, -119, 34, -96, -76, -106, 68, 10, -115, 251, 50, -157, -36, 151, -33, -167, -40, 76, 80, 98, -37, -81, -164, 24, -8]
8033hj50N9R7J96j54l05K73P6l30J80J8J10j64J70j35r2m4K02Q3k14K48k4j15
8056b3J72j01j72J98j49K1j09N6o2K90j20R1j03jl7K15MN6l66J2L75k27J64k64
8080h0J72q5o0N1M2p1Q2l28K95j41J63N1J07k76K64k64n4N3J96M0k33J17P6j22
8104ej32Q8J27qj09J83q6P8L5j13P8O0l20K63j77K30r3k89L73k33J41j20l80M36
8128B7K7KLj1k8j35rK38k16J78J3j22p9R4J18r8J37j82K24J0k81j41N29k78L7
8153E7p9l8K1p1K62k00j03J17J82m5k65K43p4L3J02p9q8Q0j9k29K22N2l2q3l6
8178g0L8j02L90l01K28k82N5J15j18K0J44m7j30
$$ y = [-8, -158, -99, -2, 194, 40, -265, 8, 84, -246, -66, -48, 62, -102, 68, -67, -159, -203, -1, 82, -132, 116, 92, -23, 149, 48, -124, 74, -75, -54, -163, -107, -169, 121, 1, 92, -11, -12, -49, 166, 170, 226, -140, -128, 247, 20, 184, -80, 92, 7, -53, -2, 40, -31, 51, -277, 18, -123, 40, 91, 198, -78, 186, -78, -132, -79, 117, 157, -76, 41, 117, -5, -137, -49, 78, 70, -39, 144, 58, 136, 171, 58, 136, 196, -124, 139, -38, 192, 99, -190, 183, -50, 91, -29, -409, 27, 54, 56, 59, 48, 20, -115, -124, 114, -102, 76, 89, -33, -112, -18, 100, 2, 139, -43, 181, 191, -90, -231, 298, 20, 57, -22, -60, -39, -110, 152, -48, -151, -34, 148, 103, -162, 81, 7, 40, 142, 63, -25, 55, 36, -193, 29, 81, 49, -34, -70, -32, -134, 256, -45, 183, -99, -44, 71, -47, -27, 117, 70, -60]
8191f0
$$ Imaginary data points
##PAGE= N=2
##DATA TABLE= (X++(I..I)), XYDATA
0@%%%%%%%%%%%%%Qj6J6j6J6k4L2l2M0m8N6p2Q3r2J07j27J49j69J93k22K51k83
35a50L19l59M03m52N05n62O26o98P75q56R46j045J153j271J400j541J698j875
53i84K066k277K517k786L093l447L857m341M923n637O540p720R334j1701J5547
68H984k3154O6851j59041L3035K19891j78759l6190J39041o7907o4266J05180
79D3665k4728m0195J2666n106L5957J4123r4099L2296Q8145o9515l9372O6681
91B0518j4023l0234L0569N689k7791p412K4579L2883n1420l3715P5148N238o7131
104c7102K8833K3295l3743K5612K316l2784K7020j560j3248L6720l6398l3505
116d4544Q7263j8224q1689P2518J6427p2825N9940J4312q9682O7358M4038r9075
$$ y = [0, 0, 0, 0, 0, 0, 0, 0, 0, 0, 0, 0, 0, 0, 8, -8, 8, -8, 8, -16, 16, -16, 24, -24, 32, -40, 43, -49, 58, -69, 80, -89, 104, -118, 133, -150, 169, -190, 213, -239, 266, -296, 330, -368, 407, -449, 497, -548, 605, -666, 734, -807, 891, -984, 1082, -1195, 1322, -1464, 1629, -1818, 2039, -2302, 2621, -3016, 3524, -4196, 5138, -6563, 8984, -14170, 52681, -106360, -73325, 146566, -32193, -68383, 70658, 2751, -61515, 43665, 18937, -21258, -8592, -13698, 22259, 36382, -57717, -25421, 62724, -6791, -46163, 20518, 6495, -23739, 6830, 12519, -15272, -22684, 1895, 34778, -16642, -50357, 24791, 30029, -37102, -8269, 15026, -18717, 6895, 9211, -23573, 3447, 1887, -11361, 25359, -11039, -44544, 42719, 24495, -57194, 15324, 31751, -41074, 18866, 33178, -56504, 10854, 54892, -44183]
128d4183L5960N6358q2522K5518O7877q8072o915Q9321m3265m5117M9482J621
140A6063k6426J7385P82j0508j047O628J5900k1003j9554L6723M731l7373J7607
153i2J0846k3210K2516J54l1023K4087J0456k7615J9428o28k8570L5648M571m3196
167b6628K3653J9511l3370J7458J1372l6623K3891K0457l6663P255K0457k2674
179a1904J1837J0795l0733J7400J7508k8665J0133J5413k9646J5180K6083l8478
191a5077k558L7039j4702k0708J9471N573j5768L085J3728m613k0861J6058K3801
204B4468l1688j2464M0072q827l1636L0808L127l1104K4351J0471l0375J2876
216G9J3106k0656J4339J940k5051K3497J2327l5400J1037K5070k8663Q92K4217
$$ y = [-44183, -8223, 48135, -34387, -8869, 59008, -29064, -35979, 53342, 10077, -35040, 14442, 16063, -10363, 7022, 7804, -2704, -3751, 2877, 18777, -2226, -21780, 14943, 19674, -17699, -92, 10754, -12456, 10060, 10214, -20809, 3278, 13734, -13881, 5547, 4919, -23651, 11997, 16568, -26628, -2975, 16536, -16834, 624, 11996, -24627, -736, 19721, -16942, -9687, 10770, -11904, -67, 10728, -20005, -2605, 14903, -13762, -3629, 11784, -17862, -2682, 23401, -15077, -17635, 19404, 4702, -16006, 3465, 9038, -6730, -3645, 10083, 5470, -15391, 667, 24468, -7220, -19684, 20388, 11561, -20075, 10733, 13860, -17244, 7107, 17578, -12797, 79, 13185, -7471, 6868, 8808, -16243, 7254, 19581, -15819, -4782, 20288, -8375, -7483, 16734]
229A6734k0661q145K2975n767j4171Q932R67Q12K08q377M577O506q097k83P289
244C499q266L6Q479l842n994J304P287k41r843K186J0918r133l363J2935j0010
259d048n437J7392o576j3789J6827p79j3220J5496k890j6182J9172M164k4277
272a4147J4682J2308k3432R621J4936k1870P71K2599j5082j0198J8141l893r630
285e194R888K65r024O657L735o878M92K952n90o68J326k981k56M508j550n216
301b534L065M340p157K142N340q855L37J1120q061p640J3022l440q427J0158k068
316A342r407J0673J484j2878Q762L794j0903O725M762j2642M835J0951j3368n38
330f408J1855q256l771J1168n325p696J1604m78r141N428M587p291J700O078o871
$$ y = [16734, -3927, -12072, 10903, 5136, -9035, -103, 864, 1676, 1884, -6493, -1916, 4590, -3507, -3790, 3499, -4767, -4731, 3748, -94, -6088, -4784, 2503, 2262, -7581, -5395, 5523, -3610, -6973, 5962, -4048, -9485, 7907, 1331, -12458, 4369, 3590, -9630, 5866, 2976, -13206, 5966, 10130, -14147, 535, 12843, -10589, -968, 13968, -7902, -7131, 15468, 386, -9812, 8329, 4436, -5194, 4694, 4959, -4065, 2592, 6327, -551, -59, 2893, 2303, 1635, 2961, -20, -276, 4232, 2682, -2534, 531, 4871, -2286, -144, 5196, -3659, -3322, 7798, -263, -7903, 5119, 1679, -6748, 3410, 1342, -8065, 2608, 4092, -8786, -24, 3770, -7133, -408, 4354, -8288, -3453, 7498, -5870, -6408, 5447, -2809, -6580, 4588, -737, -8433, 3171, 2693, -6448, -1020, 3567, -3724, -2024, 4054, -2817]
345b817m09P203l305m784O218L08n429N429M86o419M770N171r488J425Q835p866
361f72k143R939n615o814J1077o2j0747O954L928p103J753L819n619K313L132
376D140o226L101K542o656K503P394j0214j497J2295o184q855J0438K222j1668
390f665N203O824r111n31P661l508m841N475q48k501L191k372j661N410j632o335
406f241P054J109p703M613M962p864o48Q914m899m108O215q99l309L938j006l333
422c205N643j119n267N917J743p843L184P566p997k535Q907r91p951L917N495
437E464m884k257L255K641l488k574M536K127o696j135R666l136q968O053P260
452G864r255m428J1319m94j0632M124Q963q222n272R537J057r087J175P516l458
$$ y = [-2817, -3226, 3977, 672, -4112, 2106, 2414, -3015, 2414, 2900, -3519, 1251, 6422, -3066, -1641, 7194, -672, -2815, 7124, 1509, -5305, 5772, 5710, -5037, 1917, 5845, -1258, 495, 4314, -1305, 1008, 4140, -2086, 1015, 3557, -3099, -596, 6798, -3416, -4913, 7382, 1198, -7657, 2781, 5003, -6665, -1462, 5362, -3749, -4280, 3381, -127, -4968, 507, -341, -2842, 349, -2023, -3684, 1726, 94, -6241, 813, 1922, -5781, -1168, 3794, -4070, -4718, 4196, -703, -4811, 1404, 505, -2804, 1134, 128, -3205, 2438, 1319, -3948, 1969, 3712, -4131, -947, 6619, -1378, -3913, 4994, 4003, -3948, -31, 5464, 580, -1677, 1578, 4219, 731, -1843, 2693, 4820, -1876, -3011, 6655, 3519, -5449, 604, 7864, -1391, -5819, 5500, 5006, -5626, -1502, 7461, -761, -6033, 3504, 4561, -4526, -3351, 4165, 707]
467G07n374M206K774l266k713L577J758l696k101N186L71o328K383N183l450m358
483e141N358J783n599J099M291k985k018M353j148k800L262R2l416L503J812o486
499d040L752N583p988j616J0338m253p823R055J850q710L251N662m928j289K871
514A715J56J160l749r07P106k939q427Q592N574j3824K448J2943r591p972J3345
529E630N16j2565N906O833p112k285N338r01k054k53J35K551j143m614M181L949
545D112q226o95J0695o050q036J0571K075j2022N586P764j0691K02R486o629l767
560e625R554m668n034R318l104p232R271R73j0545P187M941r569K424O256n962
575a815m28N053l720M86L050m789K096M897p274j85R334o582n564J0615n83r840
$$ y = [707, -4667, -461, 2313, -953, -3666, -89, 1669, -2027, -4128, 1058, 1429, -4899, -2516, 2667, -783, -5141, 217, 2000, -3599, -2500, 1791, -1194, -3212, 1141, -7, -2807, 455, 547, -2869, 634, 2446, -4040, -288, 5295, -2693, -4309, 6029, 1776, -6047, 3008, 4858, -3852, -601, 5061, 133, -1156, 1715, 1871, 3031, -718, -1625, 5481, 2542, -5885, 2707, 8281, -5543, -3095, 9848, 257, -7715, 5630, 6146, -6419, -513, 6320, -792, -3077, 2261, 1360, -694, -947, -812, 1739, 596, -4018, 163, 4112, -4114, -4809, 5886, -164, -8200, 2371, 4446, -7576, -1990, 5774, -4917, -4715, 4771, -1858, -5625, 3929, -739, -5773, 3545, 441, -6791, 2480, 3453, -7092, 95, 5036, -4533, -2109, 4147, -1815, -2243, 2810, -910, -424, 2626, -2163, -67, 4830, -2444, -2629, 6705, 123, -5441, 5174, 4591, -5249]
591e249N578P083r174j100Q041k691n352M019K105l479K47Q29J89O26k427l44
607a099M661k393n702P150J945r714L285Q794q891m111J1383l736p975P836K365
622C798q730L405M746n988P56L364l367M99K623l530J062L254m115l54M144k394
638h27k655M449l10l797K664J677k617L3K544j764q17K296j160m05J522k43j707
655a117K465j26k570K363J097l156J192L013l781J62L243k211j262L501j689k479
671a355L619p23k982L246J97l363K474J768m445J917K430l808J06L211k525j647
687a880M095j430k971K923O80l654J478K654l567K11K812k140j572K854l13k870
703b690K611M61k273R11J403k192P74J448k212M88K011j979p15L185j997j363
$$ y = [-5249, 329, 7412, -1762, -2862, 5179, 2488, -2864, 1155, 3260, -219, 28, 857, 1046, 1672, -755, -1099, 3562, 1169, -4533, 2617, 4562, -5152, -1867, 6927, -1964, -6075, 5308, 1572, -6403, 1433, 3798, -4932, -1527, 3219, -2769, -2013, 1351, -2016, -1517, 1106, -2424, -1362, 1892, -2223, -2577, 1567, -827, -3482, 967, 657, -3140, -476, 1201, -1416, -1383, 1161, -603, -1420, 876, -284, -689, 833, 590, -1117, 1348, 1222, -1348, 1015, 2112, -1044, 148, 3161, -620, -458, 2785, 574, -688, 2813, 1124, -1355, 2264, 1541, -1441, 1805, 2002, -1361, 1113, 2881, -1564, 353, 2783, -1025, -919, 2292, -233, -1880, 2215, 785, -2186, 737, 1417, -2237, -759, 1895, -1672, -1461, 1351, -789, -2361, 493, 180, -2690, -79, 382, -1891, -980, 423, -1769, -995, 453, -1759, -1271, 740, -1239, -1954, 1231, -766, -2129]
719b129L369j341k093K524L65k100J416J174k735J726J118k249P16J868k335J74
735e32K739j944r34K714o96k342K323P07k843J444J193j572k90K149j776l68J634
752A606j060r29J793l14k067K238K02k747J803J062k612M98K816l347l38L188
768A792j931k143L158j34l216K704Q30l127J409J281j984N8K080k092K48J145
784G8j327l7J516j217o30K200j229j351K432k41j871J444J142k533P45J834r89
801c4j052J856k55j557J626O5j164O55J093j879J087J013k099O97J701j880l78
818e05K704j798j586L197r44k066J999R17k710J829O39k482J337Q00k073P94J853
835A905k539L69K035k186j033K667p19k244K037P01k208N02J149p25q84R24m0
$$ y = [-2129, 1240, -101, -2194, 330, 695, -1405, 11, 1185, -1550, 176, 1294, -955, -239, 1629, -706, -532, 2207, 263, -671, 2043, 1347, -995, 1328, 2035, -808, 636, 1829, 257, -33, 2116, 340, -28, 1606, 546, -383, 1410, 1096, -971, 1267, 1469, -1278, 525, 1587, -1025, -527, 2289, -1058, -1396, 1792, -139, -2282, 876, 742, -2474, 230, 1060, -2067, -658, 623, -1361, -1303, 777, -1315, -1067, 78, -1249, -1286, 230, -987, -1617, 583, -646, -1997, 435, 194, -1677, -233, 909, -1624, -879, 955, -34, -1086, 770, 515, -1042, 584, 649, -515, 140, 1233, -646, 441, 1454, -645, 52, 1753, -127, -505, 2199, 401, -1185, 2012, 1068, -998, 1001, 1918, -792, 1037, 1676, -806, 531, 1331, -742, 52, 1905, -634, -265, 1770, -416, -1449, 1218, 499, -1745, 292, 993, -1215, -713, 436, -289, -1173, -249, -289]
852b89l33L53k76m19N98J2j443J711L92k136J268J794k746n3L259k759q82L228
870A279j318k044K739l41j963K755q08k094K698Q6l005K758J237l580J582K182
886B163k727j61K500j429j053K274j145mM39o90J51R77j060o59K284j003j772
903i15J544J366k585k73K981j136k769K377J381l054J38K969k062j369K097n98
919I2j068J290j015p7J805k581K40L047k885j657M523j624l521M190L47l778K267
936d05J651l116J214J061k188J599M98j670J153J147k715J460J326k559O22J648
952G26j158j9N03k39N94j86q83J192K31j206P34P87q34j58M09P0Lr43J144N83
972A350j389l03K519j610j715K729l50k035J267P87j074mK2L3Q55j747M15K090
$$ y = [-289, -622, -269, -545, -964, -366, -354, -1797, -86, 306, -1830, -562, 1232, -1514, -1567, 1692, -1067, -1949, 1279, -39, -2083, 656, 315, -1648, 1107, 299, -1795, 903, 989, -2016, 742, 1979, -1601, -19, 2163, -564, -725, 1775, 346, -707, 1567, 422, 418, 857, 167, 318, 1295, 235, -424, 1860, 857, -915, 629, 1995, -590, -863, 2118, 982, -1787, 590, 1971, -1083, -945, 2024, -38, -1407, 690, 92, -976, 314, -701, -778, 1027, -1554, -1314, 1733, -1152, -2809, 1714, 90, -3431, 759, 1106, -2672, -405, 1246, -1870, -656, 405, -1783, -184, 314, -1356, -203, 944, -1771, -311, 1015, -1544, -922, 726, -432, -451, 52, -187, 407, 221, -662, 530, 761, -445, 289, 1076, 242, 84, 493, 563, 566, -377, 767, 1350, -39, -342, 2177, 567, -1148, 1581, 1231, -804, 463, 1250, 176, 172, 194, 227, 1082, -665, -250, 1840]
990A840k222r48L013j129k749L133l4k370J478N04j358N84j35l42J485j530q94
1007a674K668j487j792K844m08k768K948K00k609K157oj746K112Q5k424K419p7
1024D42k299K018O14k039J324R78k380J641N31j592R70R10j546N56R41j352O02
1041C19O28p06J09J86J88n9o35L79Q57j422J54J561j863j81J986j029r71J868
1059A369j089q46J778j242n13K008j760q14K803k033j256L173j333k190L058n10
1075F03k960K883K39k932K410Q7k352J949N56k231J470P30k327J446R24j881Q80
1092e06J175j863N30J126j481O98N55r37N94q7J54L40o30P8R76j432M06J480j504
1111c28M6J467j159q45K370j300q40K071j184j203K586j118j707K802j003j569
$$ y = [1840, -382, -1330, 1683, 554, -2195, 938, 904, -1466, 12, 516, -842, -258, -393, -735, 750, -780, -1674, 994, -493, -2285, 559, 151, -2617, 331, 531, -2078, 79, 73, -1673, 439, 524, -1900, 519, 442, -1857, 161, 775, -1264, 60, 1038, -1342, 299, 830, -762, 208, 1118, -428, 128, 1069, -283, 319, 947, 241, 350, 536, 724, 665, 30, 409, 1266, -156, -2, 1559, -304, -485, 1501, 472, -499, 1369, 280, -566, 1212, -30, -543, 1465, -295, -1109, 1694, -339, -1595, 1578, 245, -1945, 1113, 603, -2357, 526, 765, -2167, 243, 330, -2022, -73, 483, -1748, -278, 452, -1875, -429, 495, -1386, -506, 669, -1194, -664, 462, -1019, -321, 234, -703, -109, -196, -42, 298, -332, -254, 722, -710, -304, 1176, -328, -282, 1185, 26, -819, 1551, 251, -589, 1482, 298, -905, 1681, 563, -1144, 1658, 655, -914]
1127i14K477p92j781K262K5k352K015j04j857J686K25j553J103N64j806J324K58
1144G80j479P22K67o03O8L62m76L24o2n17Q79o52l17R79o72n36J286j020l07J445
1164D71j203n2J169j168k02J830j301r45K059p73j352K196p16j485K041j09j678
1181a218J921k00j416J592J78j666J242L25j527J031M66p87J52N47o74M75k2l96
1199B3P75l05j96M28l50k86N53k64k82O50q23JQ03p95k7R46j053j08J155r62l68
1220d85J497j152j151J996m65j167J539o55j030J383l29j095J125Mj305J236j12
1237a66r58P88L65q78M02M76q44M79L36m41K3L45j57pJ51L4j6j33L46o0m03K84
1259c4K68m60L57O60j047K53Q76j067J11R30o82m29J190p61k13J189o96r23J252
$$ y = [-914, 1563, 771, -1010, 1252, 1277, -1075, 940, 836, -1021, 665, 890, -663, 440, 1004, -802, 522, 780, -699, 23, 290, -313, -245, 117, -359, -35, -97, -614, 265, -387, -704, 275, -397, -933, 353, -667, -974, 471, -732, -784, 385, -783, -985, 845, -456, -1401, 658, -115, -1467, 729, 13, -1472, 569, 460, -1218, 703, 503, -913, 679, 857, -809, 433, 758, -769, 262, 728, -59, 93, 640, -34, 441, 419, 23, 798, 493, 297, 725, 375, 89, 642, 378, 96, 746, -77, -76, 727, -68, -95, 851, -202, -310, 845, -117, -485, 1012, -140, -1291, 705, 240, -927, 612, -43, -1073, 310, -19, -1114, 11, 15, -1290, -54, -166, -1124, -336, 29, -849, -447, 29, -815, -336, 0, -441, -418, -73, -230, -237, -86, -52, -68, -201, 145, 85, -318, -34, 234, -226, 131, 791, -256, -3, 873, -194, -83, 847, 165, -264, 926, 165, -48, 1141, 445, -478, 774]
1278G74m54r27J390p6r64J079k71r20J193j63j256N74P27j096L37N98p94k85J011
1297D77o73m26N52P8m33J98L03l49l1L31m88k97O17n5o29N90j16j99M23L59q76
1318f44J30P61r27J56O24n34l04R40n8r36J074n59j53N80L7p39P24M10q96M76
1338A62K70l95J30O83q25l48J119o33l56O10K10l35J39J14p02N96J23p53K01O17
1358F27o18J67N88n21m47O96k13p65N88J76o69N54L29o87L6N82o58PK53k95l66
1379f36Q54n43m22Q74l8q46O13J85r62M89P62j356M11P79q21q2R71m29m43P73
1399A33k14o63R12p6o76P12K75j288R94K75o34J30N48n09k20J083q61n6O06m1
1419D30m84N83Np19O12K49o74M09L12p91K65N58o82J21M23m42k28L99k6n08N27
$$ y = [774, 320, -607, 783, 707, -257, 822, 551, -369, 824, 661, -595, -21, 706, -390, -53, 545, -249, -534, 477, -196, -622, -70, 8, -425, -227, 76, -273, -304, 27, -461, -758, -141, -196, -825, -235, -351, -550, -127, 232, -644, -514, 247, -680, -524, 100, -434, -738, 202, 144, -792, 282, -277, -430, 150, 187, -552, 172, 582, -314, 162, 432, 37, 167, 850, 25, -323, 796, 163, -193, 417, 627, 292, 431, 545, -157, 439, 562, -191, 10, 627, 9, 176, 764, 243, -204, 492, 279, -486, 102, 278, -391, 163, 492, -195, -159, 423, -235, -228, 25, -270, -636, 218, -325, -747, 127, 89, -757, -144, 41, -921, -432, 330, -1026, -615, 164, -657, -739, 232, -197, -640, 133, -81, -744, 168, 92, -584, 128, 403, -885, 109, 384, -250, -120, 428, -81, -301, 782, -79, -135, 471, 430, -54, 529, 534, -185, 427, 676, 2, 411, 723, -68, 197, 755, 73, 194, 617, 175, -53, 346, 320, -188, 339]
1440C39l18m9P7K48k36k05L73n71K07M64n04l83P00k80j83K10q0m61M41L04q53
1461g60N83J00m86K17J08j33O3K61m45%N61n86M18R0j30j15K14k45p8M25k06m3
1483a87nJ26j69L20M6J08Oj97J78M3k62K07J27k88K96k04J11J37l6m8J27O6m16
1506H6J51k8PM25k18o8k58J75n7K3M23m84k93J94m5j17K58k0k92l0p7L19k83J8
1530a91J14M4j03j25J71j30Ro3j42N10k59k65L43r7m49L52K04k84M6K99k47k2
1552b85M55m02J33J37l83L18R7k27j03N42l40k80N85j49N2J88m3j68L24l26j37
1573a2K69M5J17p4K61m58j50J32L56l40J04%j00P7J17k49o5M69k23n77M82q7m18
1596c24L22r5L1J36M9p62O94J74m12p9K58m45J97M92o46J08L45m34K17J45j94
$$ y = [339, 21, -28, 49, 297, 61, -144, 229, -342, -135, 329, -175, -558, 142, -138, -321, -111, -191, -652, -211, 93, -760, -177, -77, -563, -346, -238, -371, -308, -47, -492, -492, 69, -517, -99, -9, -139, -254, -40, -285, -363, 62, -144, -187, -192, -66, -235, 85, 131, 239, 245, 48, 226, 269, 7, 214, 341, 53, 349, 145, 256, 393, 357, 309, 436, 502, 86, 237, 209, 216, 641, 423, 355, 97, 272, 215, 238, 661, 177, -116, 78, 33, -84, 174, 154, -138, -168, -245, 74, -209, -191, -77, -33, -136, -261, -90, -220, -211, -274, -416, 94, -165, -430, -87, -184, -633, -281, -77, -361, -315, -16, -263, -285, 170, -232, -99, 38, -345, -27, 70, -157, -260, 282, -58, -338, 247, 98, 150, 338, 295, 127, 451, 125, -12, 257, 302, 419, 345, 606, 148, -2, 130, 486, 146, 250, 250, 150, 227, 344, 95, 30, 499, 276, -301, 181, 94, -324, -2, -97, -66, 70, 119, -643, 51, 225, -187, -266, -8, -453, -256, 236, -410, -302, 43, -391, -174, -29, -223]
1617b23l03M99l74l1K72J80m65K82J68j75p0K95j77q3M0K52j28l3L09k00p8L47
1639C04j50m87O91k29p4K09l4l83L95Nj02J81L6m77L44J84m45K30L23n79J96L05
1661D43m13k7K03j45K28J09m08p4L53qm51L30q2j07j0lj55R7R8j22N7K45k38p4
1685a54p8L30l01nK70l30j82L71K66m07K25j83p0R9N8m28K98J15j27R2q0Q4k33
1708c70L19J15j59O9J99k76J98k3r2K86j11J4M3P5j74J00L7j35K5L85l01j05K09
1731C28m9l90N10o7l16J58L51m49r4M90m74J3L11j66k05Q8J61l21J41P8m65L27
1753d0N6j75o3J86k20P5K43n66K83L85m78N8L00l39j89L12J64m31M56J79m76P
1775b73K6p1R5J88q5q2L87l51Q9K45Q3k83J17r8l74N56J72l97K32K33l26j29K45
$$ y = [-223, -526, -27, -401, -432, -160, 20, -445, -163, 5, -170, -240, 55, -122, -205, -165, 87, -41, -74, 235, 35, -43, 304, 154, -333, 358, 129, 55, 264, 230, -153, 242, 247, 145, 326, 362, -115, 229, 413, -32, 198, 521, -58, 138, 443, 30, 3, 206, 61, 289, 398, -10, -84, 269, 261, -190, 140, 58, -49, -59, -62, -217, -120, -22, -144, -87, 158, -80, -154, -232, 98, -203, -208, 62, -268, -450, -79, 187, -220, 5, -178, -248, -149, -91, -519, -221, -106, -233, -141, -221, -137, -370, -51, 64, -95, -26, 173, -103, 95, 72, -20, 266, 155, 169, 212, 287, 113, 213, 250, 115, 140, 525, 224, 119, 328, 279, -111, 399, 332, 16, 174, 525, 76, -18, 472, -2, 11, 322, 156, -49, 39, 200, -121, 20, 98, -367, -40, 16, -159, -222, -36, -256, -181, 62, -504, -221, 164, -314, -256, 44, -295, -484, -172, -8, -439, 17, 196, -280, -273, -247, -318, -223, -35, -120, -202, 185, -166, -77, 168, 251, -32, 85, -13, -387, 169, 341, -56, 176, 409, 83, -46, 199]
1798A99J65m24N05k40j99L79q7l51K29L19l79q9M57m43j06K43o8o3K86J8n01O39
1820D89j69k54J86p6j00k39L24m06j32L21J7q3q6M7j98N73n9m50L14M7l57OL63
1843G8m34O0K59l26K99Nj37j12J90L2k23J35K34l62K24K46m11L27J86o08L77J33
1865A72j77j1K64j25l02K61j8k17N07k10l63P11l88k59L62j38L6O4j09m5J10L70
1887D95m68r8K31P8m37L05Q1p6O4n6j76K09J1m42RK17j01J71M0j17k2J91j99j82
1911b72J86K51m84L35j76j76j02M39j61k52L74k23p3J80j2k11L96j79L3K70j21
1932B2m78O7N33k69k50N22k47J07K80k54j03L10j45k36L54Q8n8q6Q2j44J77r1
1954A81j11J95k5J52k76Q1J16k66j77M09J89k49j32j4Q5j84J79J11k09m1K6NJ23
$$ y = [199, 364, -60, 445, 205, 6, 385, 298, -53, 176, 495, 116, 27, 484, 41, -65, 178, 110, 47, 333, 351, -150, 489, 320, 66, 252, 176, 76, -163, 161, -245, -377, -56, -39, -122, -208, -161, -359, 214, 155, -295, 19, 66, -291, -285, 78, -356, -296, -37, -363, -64, -59, -196, -308, -118, -86, -309, -174, 60, -302, -78, 168, -243, 84, 270, -338, 39, 172, -5, -16, 248, 123, -179, 82, 64, -153, 354, 144, -219, 492, 104, -155, 207, 69, 105, 169, 60, 15, 125, 495, 27, -71, 160, 238, -199, 106, 187, 111, 175, 119, -57, 152, 163, -279, -270, -53, -154, 17, 57, -60, -82, 109, -90, -272, -86, 165, -319, 16, -160, -336, -438, 1, -160, -412, -38, -261, -334, -154, -166, -377, 19, -160, -127, 143, 22, -456, -389, 144, -125, -375, 147, -100, 7, 287, 33, -70, 240, 95, -141, 213, 301, 243, 157, 239, 95, 272, 181, 70, 265, 240, 392, 116, 197, 313, 47, -130, 279, 468, 219, 87, 73, 158, -26, 153, 264, 55, 14, 40, 45, 168]
1977A68m22L69J27o06M23L3l07J66K40n92K82J14k10mJ39k4j61K62k35j72J27
1998b83L92j62N6J53l03K78k34j19J35K48j28J61j80l9j83K47q7l0J00j61K65
2019A26k70L68j93PJ44J64l49%K07n3K8J41l15M12jl62J78k4l39K61K17n31K26
2042D2K11l01j4M35n99J42M02m15JM15l45j93M01k18p6M04o24L74Q0k28R2k73
2064b87K69l61L95l06J48J93k40J9J77n05L34M63m93J7J64k68K59K55n68K20J78
2085F3j97J0K12m20J83J91j11m5L28k80K03J76k98r2M46l52J5M15k15k96K35j4
2107A57J79O5l00j38K83j81j18L01k89P1L32p07L56K72k62K02j91j89P2L49p77
2128e13L40K79k19j64L78k34j62L46r3J85l35n1n5M53m81NL36l13K19J62k17j54
$$ y = [168, -254, 115, 242, -364, 59, 92, -215, -49, 191, -401, -119, -5, -215, -219, -80, -104, -265, -3, -238, -410, -283, 109, -53, 3, 156, -147, 131, -103, -222, -87, 161, 33, 194, 14, -25, -208, 39, -48, -78, 22, -139, 126, -144, 224, 31, 38, 182, 346, -3, -3, 204, 151, 179, 320, 5, 417, 416, 54, 232, 208, -131, 130, 347, -184, 42, 253, -48, -62, 373, -226, -84, 318, -97, -96, 319, -26, -219, 182, -36, -112, 292, -332, 42, 122, -106, -14, -287, -18, -379, 16, -290, -142, 51, -189, -170, 7, -498, -164, 299, -194, -177, -13, -281, -22, 233, -335, -115, 63, -134, -124, 88, -332, -149, 42, -69, -114, 214, -66, 137, 313, 15, -77, 369, 17, 32, 447, 232, -64, 171, 157, 336, 401, 101, -37, 246, 65, -53, 248, -41, 30, 362, -345, 11, 283, 21, 223, 32, -157, -85, 264, -513, -173, 106, -113, -277, 101, -133, -295, 51, -42, 143, -192, -243, -298, 155, -326, -321, 15, -298, -79, 83, -134, -288]
2150b88K11n2J12J93m38J74k7j80K46K76n97J37K67j9m2M3j77J43P6n4J37K38
2172C79m16k9K68k7L8M8q2J24j00j16o1K49l03J93J07j50j95L23k95J74J6l5O5
2195A75P1m62K51K01l16J98l4l31L32j1l43N03j74l83L96k54J5O4P4j84K48K43
2217B79n51R5J25k69J34L87p14M08K81n62J62K03k71P2L25m11L40J23n72L98n2
2238g0n4R9j00OJ55O6j52J38n4p6K18k12J21J35p7k75M67n42L22j5lm3J39K09
2262D02l22J35P1j23J56k01k64m5K75j04k2M1p9l3M5j57K75P7l66JJ39l0L5Pj61
2287b48M0L47j74k19J14l8N8m9p0p2J60k5J52N4j95o6P4J18L6j25k05M99k1j47
2311bK4J37p2n8j47L5K66l27R3O5J29j45Q7J16m60L25R2n9o7j42J40L82P9q74
$$ y = [-288, -77, -129, -17, 176, -262, -88, -115, -295, -49, 227, -370, -233, 34, 15, -27, 16, -161, -18, 58, 4, 141, 379, -37, -66, 202, 175, 213, 261, 179, 303, 203, 87, 26, 275, -28, 165, 272, 122, -73, 250, -45, 129, 145, 110, 175, 246, -216, 35, 236, -80, 118, 84, -247, 85, 74, -269, 234, 60, -323, 73, -181, -166, -102, -28, -212, 36, 279, -272, -177, -52, -321, -187, 200, -514, -106, 175, -387, -225, -22, -293, -221, 104, -307, 33, 156, -416, -18, -70, -124, -25, -125, -119, 36, 102, -50, 88, 34, -42, 176, -36, 85, 220, 143, -132, 335, -207, 115, 100, 97, 54, 193, 402, 80, 215, 286, 163, 319, 118, -146, -191, 84, -20, -42, -1, -80, -113, -68, -225, 50, 127, -239, -238, -99, -129, -94, -87, -248, -208, 139, -35, -254, -140, -178, -120, -169, -239, -311, -151, -176, -24, 30, -165, -231, -157, -39, -3, -128, -333, 166, 145, -2, 22, 159, 87, 29, -118, -83, 183, -144, -51, 14, 143, -2, 85, 201, -259, 66, 158, 99, 32, -110, 30, 412, 491, -383]
2335c83L74K10k68L62k69m7PK46j09o5Kj65J23K05Rq4Q4J05l73K19l39J48l15
2358c23L80j05l69O22j48l6j14J47k83J55J05l03K45j01N4L3k26J47J69k38K58
2379F9j23p1K49j51j6P2k92L2Q9QJ09L1k82J73J51Q1j92J84k41K74j42N0j04K96
2403B54k31K9J30l7n7j76K20j59j82M46j16K4j15r8K72k11R9R1j06r1NJ32N4j76
2427AJ66j93M4J69k38K6J26k70J70j01J09k38P1K5N1j11o4K75Rk19O2n8J00Kj39
2452b25J27j48J66K44l34K8q6j5K30j62K08j44L92m28J68J24j84J65j44J44l46
2473b20N70j22k9r4Mj57P9K88k39N7k21K83o5j3q9q8K32J86k46Op1k13J77k1n
2498a1KM1K9K7Lq9O9P6k92L8L5N2j70J29O6o3J68j22k67M05m24m1K20l5j40K65
$$ y = [-383, -9, 201, -67, 295, 26, -21, -14, 232, 123, 58, 60, -105, 18, 223, 232, 148, 232, 337, -36, 183, -156, -8, -323, 57, -48, -417, 205, 57, 21, -93, 54, -229, -74, 31, -272, -27, -128, -74, -41, -267, -120, 49, -189, 69, -54, -125, 124, -27, -43, 29, -263, -231, -142, -134, -25, 6, -276, -103, 48, 129, -63, 121, -120, 154, 12, 62, -42, 254, 23, 52, 182, 145, 88, -88, 132, -27, -209, 237, 121, 145, 30, -68, 204, -7, 92, 183, 77, -14, -9, 123, 177, 1, 167, -26, 18, 187, -51, -25, 101, -169, 1, -100, 9, -229, -158, -133, -82, -193, -257, 18, 27, -192, -130, -188, -88, -86, -225, -98, -246, -80, 164, -170, -142, -228, -243, -13, -175, 33, -111, 281, -147, 21, 145, -39, 126, -18, 126, -220, 350, 228, 199, 105, 109, -48, 31, 319, 80, 137, -84, 199, 134, 121, 32, -56, 176, 362, 116, 122, 51, -162, 15, -6, -11, -9, 32, 61, 88, 91, 2, 71, 147, -145, -107, -72, -20, -190, -61, 5, -58, 110, -12, -279, 126, -298, -339, -119, -154, -294, -29]
2524b9j23j7L35K56o60M04j29q5L8J28q6j7Q1k45M22l81J52J17n0j92L2j14L56
2547A93l7k35K10J78j61k6k12J88m6K63j59N4lk28Q0J61j20r7J35j66K9J52j17
2570C6J15J77k98J04m9K52m74N8J71K0j74R2O7K23k42k87Q3Q1K2rl9K07l1l12
2594b07L64m19L14j77j15L31q6o0L4K41k20k66L4K44k68J03K69l99J18O8J41m05
2616c61K44J61j95J79L9OL8M7j11K93m7j84K39j32k68J76K83m00N2j2j29J90r2
2639A6J47k37M03k35o2j06J38L9j37j7P4M4q2L9l15L69j1j97l6R3P8pj22K05J6
2664I7Q2l47L7J13q2r6M15l44n7J70j62l8L74l73Q6J58n1k77K75l31K84Nj79J0
2688b31K03J48l11L12j91k08J93nj91L37P4j59K34l6l40K29N2j55J20q5J70j3
$$ y = [-29, -152, -169, 166, 422, -238, 166, 37, -48, -10, 118, 32, 15, 96, -149, 273, -108, 44, 161, 111, -81, -49, -163, 193, 156, -79, 131, 309, 148, 122, -90, 98, 52, 315, 156, 210, 207, -21, 59, 220, 100, 3, 138, -28, 1, 153, 36, 151, 328, 30, 134, 85, 337, -137, -79, 92, 112, -62, 30, 97, 320, 78, -209, -126, -45, -23, -32, -71, 136, 105, -207, 157, -262, 52, -125, -240, 91, 5, -55, -21, 220, 0, -266, -232, 12, -256, -153, 116, -283, -165, -97, 44, -361, -117, 44, -151, 28, 67, 73, 111, 158, 47, 340, 293, 109, 348, 216, -52, 124, 407, 7, 59, 47, -82, 108, 16, 163, -74, 329, 94, 32, -74, 64, 103, -34, -51, 23, 67, -15, 24, -291, 78, 67, -130, -166, -73, 5, -2, -124, 81, 97, 179, -168, -131, -18, -100, -196, 219, -125, -182, -12, -174, -212, 162, -211, -125, 33, -18, -295, -20, -351, -67, -62, -241, -231, -28, 120, -191, 121, -70, -278, -85, -90, -281, 56, 130, -29, 205, 169, -171, 58, 110, -45, 75, -10, 160, 147]
2710A47j10J48j33j0J47q5O9K2N7l17J68J19j99J11%kq6Q7l15K67j47K39j20j41
2734h4L61l06K65m65K66j6j67K23k53R9oK73m23M6K14j54J52J60k73m7K72l12
2756a75K63k38J19q0m7J17j6J0J21R0j62j27J18j1j13M9J79j75J60m8P5J18l33
2779a06L54k14O6N8K0n6K64j83k9j33j83J23M8j4J38j04L9J85l84J49k40L35j85
2802e2J31j26K1O1r7J2J3j0j42L02k75K0J41r7j39K65J1k99K98j99O6j12J34P2
2826aK4j05N5l9K21l98K42Q5l94K47M0l1J27k59J03Q0k34L68j75Q4J94l70R4J33
2850I1j9j47M06r6q1J0k1J44l7j32k40K41K40l49j27M23o5k05J8j08J37k9J26
2873A80j38l3K0j43K32P1J4n17M86l70K33l1q0J22j67m2M5K2r0J51L8L4o1Q9j65
$$ y = [147, 37, 185, 52, 42, 189, 104, 173, 195, 252, -65, 103, 222, 23, 134, 134, 132, 46, 133, -182, 85, -62, 177, 57, -84, 277, -29, 236, -229, 37, 21, -146, 77, -176, -77, -83, 190, -233, -187, 27, -127, 25, 185, -88, -135, 137, -175, 88, -150, -31, -111, -158, -41, -57, -47, 74, 164, 2, -125, -7, -18, -131, -82, 97, -78, 82, 34, 109, 227, -106, 248, 34, 100, 158, 178, 122, 386, 203, 174, 41, -142, -19, 29, 15, 153, 49, 88, 273, -111, 38, -202, 133, -52, 79, -47, -26, 35, -62, -50, -37, -47, -189, 113, -162, -142, -1, -98, -237, 28, 39, -260, 38, -161, -95, -207, -73, -1, 23, -82, -27, -66, 155, -243, -1, 84, -310, -63, -23, -54, 73, -186, -83, -3, -237, 131, -44, 40, 234, -136, -42, 91, 72, -75, 331, 235, 154, 164, 143, 287, 250, 118, -122, 119, 359, 10, -117, 306, 241, 36, 54, -54, 83, 54, 180, 42, 9, 29, -114, 118, 189, 203, -314, 172, -198, 35, 4, -76, 46, -121, -163, -118, -96, -186, -35, 3, 37, -24, 65, -100]
2898a00J3n1L16l84RK90k45J38l19L44j24K96m16K49j86R7K5MK2J09P0R5j03j85
2922c6J62rk5j41jJ40l84L00j53R0K30J09j62r6N3P9P5j69k33J47N8M5j74K87
2946A92l12R4R2r1pQ9l54N61k45k28K0J83Q8j87J86k27o9K45j92mJ76m8j1J77
2970A28l60J25j9J31O3m2j24J30k11K31j84j20K46L3k84L99k30L18k52m4J25q9
2992c0K06p3j71P9o1m7J51Ql0K1r6J78p7l4J18q8o1L5J45Q2lj23j61N5R3k4OR2
3020A90l83L39l9q2J45k57J83r7K43l92M7J12j39pM59l66P0j47K19j76R2pk15
3043b08M0qJ61j49L9J04q6N0P4k78J69J22r9m4J75K1n1l35L67k16Q2O2l1L7K54
3068B52l32K61j29n4K37k58J57j30R0j35J45k05J31J74J52l36J4J48k24K88r8
$$ y = [-100, -87, -138, 178, -206, -197, 93, -152, -14, -333, 11, -113, 183, -233, 16, -170, -73, -48, -44, -22, 87, 157, 252, 149, -36, 126, 117, 92, -49, -50, 90, -294, 6, -147, -57, 173, 282, 120, 24, 77, 156, 231, 62, -171, -24, 34, 79, -95, 192, -120, -26, 66, -25, -32, 57, -297, 264, 19, -209, -189, -6, 82, -105, 81, -146, -215, 30, -162, -166, 10, -38, -49, 128, -232, -107, -126, 5, 68, 26, -98, 32, -179, 52, -132, -252, -6, 27, -257, 142, -88, 230, -22, -66, 59, -30, 176, 103, -68, 11, -50, -97, 54, 62, 32, 53, -43, 135, 58, 24, 142, 54, -7, 28, 173, 255, 252, 129, -32, 23, 116, 92, 98, 190, -193, 146, 107, 25, 170, -87, 96, -1, 242, -150, -103, 9, -130, -137, 322, -44, 26, -121, 98, -78, 14, 7, -208, -168, -176, -15, -164, -125, -21, -107, -57, 17, -261, -92, 30, -69, -113, 62, 83, 32, -303, 64, -152, -70, -8, -39, -2, 252, -80, 181, 52, -2, 235, -23, 134, 4, 94, -41, 104, -101, 30, 204, 356, 20, 34, 182, -42, 246, 148]
3089A48k7j57J02n6L2M6k1j04J11K7l3n9P9r9N3j99J21P2p1J02k25L32l65J92
3113APq0J04q8P9P6k95L4J25m0P5J86k38P2M4j68J6J53k94l7L32p3K5L29l31m3
3139b9RJ64n3Q7j70J9J59J15k03K6n0j8J35j54N9L8p3r5L7J69o4K9j21K50k48
3164A8j07J26j8m8Q7J81k19q1J40n0r0KL00j60m7k6J68k4q8j39Q6j80J25K5m05
3189d24O48l47RK84j57J77l85J88O2K12l83J73k25J33j23j44Q6J51rJ29K03k99
3211d1J52k55M6o5L81j90p9j69K75J09j54P5j14O9J90o0k08J4K38n2k73P1J42
3234A02N6N8k23m0rj5Q2R4j85j49K07K57l31J21l95M51Q5M2j84n0j0P5N5l37J54
3259h9J72j29j42J65J70k09J25o0p2J11k52K28k37R5J16q8J11O9k00J5l6L57l17
$$ y = [148, 121, -36, 66, 10, 42, 88, 67, -37, 74, 101, 68, 9, 88, -11, 42, -157, -36, 36, -35, 67, -158, 174, -191, 1, 8, -72, 32, -56, 23, 99, -196, -162, -37, -77, -2, 184, -54, 18, 62, -106, -90, 63, -231, -268, 64, -9, 16, 345, 14, -29, -20, 144, 91, 178, 8, 27, 186, 301, 98, 124, 74, 56, 191, 37, 96, 134, 61, -34, 3, 172, 108, 137, 16, 266, 18, -89, 37, 19, -29, 58, 239, 20, -61, 79, 29, -61, -59, 241, 81, 34, 8, 176, 152, 64, -75, 11, -169, -44, -19, -424, 224, -123, -114, 170, 13, 190, -195, -7, 55, 267, -116, 57, -168, -35, -158, -302, -216, -65, -74, 55, 258, -41, 111, -144, -98, -163, 218, 28, -51, -220, 55, 164, 10, 85, -29, 40, 230, 170, -38, -24, 214, 162, -111, -40, 102, 158, 216, -7, -47, -56, -71, 11, 105, -80, -229, -22, 235, -96, 25, -370, 81, 166, 208, 24, -26, -36, 39, 94, -243, -89, 83, -46, -188, -23, 147, -62, 63, 3, -69, 42, -210, 18, -219, -124, -8, -96, 15, 84, -116, -101, -137, 220, -97]
3282i7K09p5q4M0J64O6j78n8k8k7n7K17P1N7l93J98q2j83K77j78J39J09r4J06
3306A19J37k72J32R7j20m5N2qJL1R4Pk9j10p9J90j43k1J3L5j45K1q6K61j30j27
3332a25j12J92J28l16L00j56O1J78l31K54r2j55J60L9j52L68k19j83L8J34J89
3353B00l86L49l60o2J74o4R8o8p2L11j50P1j23k4J03j3O9k40J28K55j0k73J53
3376F6k0j35J91j72K40L8n3k66K09L9j86O2J47O0J9k73K00j71K00k2o4j10l7q1
3400a19m6K11m7j43J67K2k08L51j68p8K10j43n9n4K1J6k1j01P2K91j75J63k38
3423g6K77l34M4j03P2J07k39K48N2J12q9J14j83J73L2k76nj4k0J34p5Q7l8j54
3447a54K30r9K0K07m13J74k1R4Pn9k0K97l94J38J40j20K32j06k89J78p9K10j21
$$ y = [-97, 112, 37, -47, -7, 157, 223, 45, -13, -41, -68, -125, 92, 163, 220, -173, 25, -57, -240, 37, -141, -2, 107, 13, 119, 256, -16, 116, 213, 93, 48, 100, 92, 93, 124, 218, 225, 196, 86, 7, 197, 54, 33, 46, 81, -64, -43, -129, 132, 2, -125, -237, -45, 83, -233, 67, -89, -28, 150, -181, 73, -19, -174, -14, 25, -127, 241, 22, -161, -123, 11, 200, -186, 163, -197, -259, -85, -149, -51, -119, -191, 120, -30, 41, -82, -106, -3, -16, 53, -187, -59, 196, 186, -87, 66, 46, -89, 102, -70, 170, 208, 155, -111, 98, 137, -49, 13, 160, 220, 239, -34, 166, -5, 195, 173, 109, -1, -38, -119, -165, 46, -1, -144, 23, 45, -163, 188, 20, -58, 152, 9, -50, -104, -83, -67, -88, -189, -117, 174, -1, 162, -76, 201, -133, -89, -192, -120, -13, -252, -4, 48, 160, 71, 185, 2, 175, 207, -69, -74, -88, -108, 26, -49, 38, 0, -154, 76, -23, -3, 204, -209, -35, -56, 38, 45, -14, -34, 263, -131, 7, 147, 27, 259, 153, -136, 42, -37, 173, 52]
3470E2l9J29q7j59O5J85j00M6j3L2qj52J2L31m25K42k03l7J04J26p4j02J51j65
3494h9P7k3J61k14J01k3j82K18O2k67K84k09k4J50j82L58k30J06k03R9n9Q9k8
3517b8Rk13M3J22k5N3q9K69J47j96j58J18j77J02q2J73O5j42L0J56j31J08k18
3540f4K52k02J51k15K92k34m5J87N3L09k21k47J6l17K29J09P7o9j14L01j03j9
3562A26m60L48J83k77j19J21M7R2k06K23k87J44m8q4M14m13K65k33L27j46q1K25
3584A61K0k89j77PJ69R7j26J47k59L72k99J63J24%J1j6j62L27k85J93k22J60j73
3607e7J35j36o4J08j58L41k47K4L71n07K38J36j79N7j6o1K95l06N0O6j54K04M4
3630A84m7l1k30O9MK03j17J49k52K37Kj40qN0j61r8J60O8J12l70K29Oj24K91l15
$$ y = [52, 13, 142, 55, -104, -39, 146, 46, 92, 79, 111, 103, -49, -37, 294, -131, 111, -92, -129, -25, 101, 27, -75, 76, -89, -12, -35, 126, -88, 13, -10, -192, 26, 88, -179, 105, -104, -128, 22, -160, 198, -32, 74, -129, -30, -89, 0, -28, -19, -232, -189, -67, -92, -39, -128, 141, 288, 92, -66, 52, -125, -23, -105, 68, 133, -9, 21, 177, 46, 154, -64, 188, -14, 137, -78, 214, -20, -65, 122, 175, 484, 263, 16, 32, -285, -56, 53, 130, 61, -53, 248, 145, 126, -334, 14, 197, -80, -199, -78, -31, 61, -145, 78, -209, -65, -113, -197, 217, -196, 69, -164, 163, 17, -64, 161, 181, -108, -285, -278, -109, -12, -138, 9, -250, 122, -177, -14, 110, 110, 121, 105, -57, 270, -15, 178, -44, 116, -57, 78, -58, -122, -14, -172, 169, -78, -54, 317, -190, 48, 184, 5, 62, 46, -15, 280, -26, 24, 90, -64, 140, 184, 137, 106, -124, -55, -51, 152, 35, 184, -68, 169, 171, 31, 23, 73, -88, -186, -26, 42, 154, -216, 13, 19, -105, 186, -129]
3655a29K62l0l31K46q7N7K99l08K11r3Q4m8r0J6k1p2K28J13l64j28L32p3Q2o5
3679I1LQq3j4P9J03j71J18N1k84j89L71j64j0m9K26Nj62J07o9M4MQ4k40K09q2
3705a4p6K85k87J99o2q0m4J42k01MJ59J01l35P1J44j47J44o6j5J85l62K94J14
3728A53k58J35N4K6j22j1j42K56j32Jk0j59O8J21P8j52K98j55m8K18j45N3k41
3751a24L15j28J27j95l4J30JM8Lk4R9k19o2K24m07L71k52J23N0M5j02J34R7q8
3775A32j48j05p0Q4J97j4k23Ok4M7K58K6j45o0j49K26O0J9k29J23j1J68j83J56
3799A41j06K5M8j91N0J33J72l20q0J63N0k89L64j95l4L0J05q6n3J38r8K07k2j92
3823d0j7K66m48K57O0j44M4r4l7K49j10L9l4J19l2N4R1l08K96p7m0j08J73k79
$$ y = [-129, 133, 103, -228, 18, -69, -12, 287, -21, 190, 97, 181, 133, 43, 59, 38, -34, 194, 307, -57, -185, 147, 74, 156, 91, 94, 102, 19, 5, 84, 187, 16, 134, 185, -99, -288, 83, -81, -91, -140, 86, 91, -71, 36, -33, 11, 15, 99, -141, 68, -14, -90, 195, -92, 107, 45, -35, -79, 63, -138, -134, 25, 126, -209, -138, 6, -141, 3, -63, -78, 107, -255, 39, 153, -105, 30, 84, 110, -12, -23, -165, 91, -41, -40, -60, -219, -151, -30, 48, -104, 194, 39, -9, 209, 64, 117, -124, 191, 63, 190, -5, -39, 91, 92, 140, 143, 119, 218, -1, -63, 161, -246, 125, -127, -4, 46, 91, -11, 123, 220, 132, -16, -121, -191, -107, 90, 76, -147, -141, -165, -118, 140, 166, 21, -39, -188, 38, 98, 117, -112, 11, 0, 168, -15, 141, 35, 60, 108, -83, -33, 100, 272, -48, -128, 35, 85, -204, 160, -35, -69, -39, 66, -20, -73, 65, -33, 174, 152, -40, -57, 209, -239, 18, 78, -66, -22, -116, -153, 96, -14, 25, -9, 110, 78, 132, 223, -85, 211, 134, 94, -14, 159, -120]
$$ [...]
8191I5
##END NTUPLES=NMR FID
##END=
