##TITLE=1H_Pr h-TGF
 CDCl3
 8 sc, 
 6.10.2023
##JCAMPDX= 6.0         $$ Bruker NMR JCAMP-DX V2.0
##DATA TYPE= NMR FID
##DATA CLASS= NTUPLES
##ORIGIN= UXNMR, Bruker Analytische Messtechnik GmbH
##OWNER= root
$$ XWIN-NMR		Version 3.5
$$ Fri Oct  6 14:37:15 2023 Russian Standard Time (UT+4h)  she@DPX200
##.OBSERVE FREQUENCY= 200.13135
##.OBSERVE NUCLEUS= ^1H
##.DELAY= (6, 6)
##.ACQUISITION MODE= SIMULTANEOUS
##.ACQUISITION SCHEME= undefined
##.AVERAGES= 8
##.DIGITISER RES= 18
##SPECTROMETER/DATA SYSTEM= spect
##.PULSE SEQUENCE= zg30
##.SOLVENT NAME= CDCl3
##.SHIFT REFERENCE= (INTERNAL, CDCl3, 0, 15.7039)
##AUDIT TRAIL= $$ (NUMBER, WHEN, WHO, WHERE, WHAT)
$$ ##TITLE= Audit trail, XWIN-NMR		Version 3.5
$$ ##JCAMPDX= 5.01
$$ ##ORIGIN= Bruker BioSpin GmbH
$$ ##OWNER= she
$$ F:/spectra/data/she/nmr/H-F/1/audita.txt
$$ ##AUDIT TRAIL=  $$ (NUMBER, WHEN, WHO, WHERE, WHAT)
(   1,<2023-10-06 14:35:30.62 +0400>,<she>,<DPX200>,
      <created by zg, POWCHK disabled, PULCHK disabled
       configuration hash MD5:
       00 E9 B6 7A A2 85 ED C7 34 08 36 98 17 FE 4E 26
       data hash MD5: 16K
       6E 77 3F 54 B5 BC 38 A5 BD 53 69 51 38 F3 26 B0>)
$$ ##END=
$$ 
$$ hash MD5
$$ 07 59 E5 98 DB E2 84 47 7F 83 1C 7B A4 09 A6 C1
##$RELAX= 
##$RELAX= 
##$RELAX= 
##$RELAX= 
##$RELAX= 
##$RELAX= 
$$ Bruker specific parameters
$$ --------------------------
##$DU= <F:/spectra>
##$EXPNO= 1
##$NAME= <H-F>
##$PROCNO= 1
##$TYPE= <nmr>
##$USER= <she>
##$AMP= (0..31)
100 100 100 100 100 100 100 100 100 100 100 100 100 100 100 100 100 100 
100 100 100 100 100 100 100 100 100 100 100 100 100 100 
##$AQSEQ= 0
##$AQ_mod= 1
##$AUNM= <au_zg>
##$AUTOPOS= <>
##$BF1= 200.13
##$BF2= 200.13
##$BF3= 200.13
##$BF4= 200.13
##$BF5= 200.13
##$BF6= 200.13
##$BF7= 200.13
##$BF8= 200.13
##$BYTORDA= 1
##$CFDGTYP= 0
##$CFRGTYP= 5
##$CHEMSTR= <none>
##$CNST= (0..31)
1 1 145 1 1 1 1 1 1 1 1 1 1 1 1 1 1 1 1 1 1 1 1 1 1 1 1 1 1 1 1 1 
##$CPDPRG= <>
##$CPDPRG1= <>
##$CPDPRG2= <>
##$CPDPRG3= <>
##$CPDPRG4= <mlev>
##$CPDPRG5= <mlev>
##$CPDPRG6= <mlev>
##$CPDPRG7= <mlev>
##$CPDPRG8= <mlev>
##$CPDPRGB= <>
##$CPDPRGT= <>
##$D= (0..31)
0 1.2 0 0 0 0 0 0 0 0.06 0 0.03 0 0 0 0 0.0002 0 0 0 0 0 0 0 0 0 0 0 0 
0 0 0 
##$DATE= 1696588530
##$DBL= (0..7)
120 120 120 120 120 120 120 120 
##$DBP= (0..7)
150 150 150 150 150 150 150 150 
##$DBP07= 0
##$DBPNAM0= <>
##$DBPNAM1= <>
##$DBPNAM2= <>
##$DBPNAM3= <>
##$DBPNAM4= <>
##$DBPNAM5= <>
##$DBPNAM6= <>
##$DBPNAM7= <>
##$DBPOAL= (0..7)
0.5 0.5 0.5 0.5 0.5 0.5 0.5 0.5 
##$DBPOFFS= (0..7)
0 0 0 0 0 0 0 0 
##$DE= 6
##$DECBNUC= <off>
##$DECIM= 32
##$DECNUC= <off>
##$DECSTAT= 4
##$DIGMOD= 1
##$DIGTYP= 9
##$DL= (0..7)
0 120 120 120 120 120 120 120 
##$DP= (0..7)
150 150 150 150 150 150 150 150 
##$DP07= 0
##$DPNAME0= <>
##$DPNAME1= <>
##$DPNAME2= <>
##$DPNAME3= <>
##$DPNAME4= <>
##$DPNAME5= <>
##$DPNAME6= <>
##$DPNAME7= <>
##$DPOAL= (0..7)
0.5 0.5 0.5 0.5 0.5 0.5 0.5 0.5 
##$DPOFFS= (0..7)
0 0 0 0 0 0 0 0 
##$DQDMODE= 0
##$DR= 18
##$DS= 0
##$DSLIST= <SSSSSSSSSSSSSSS>
$$ [...]
##$SUBNAM2= <"">
##$SUBNAM3= <"">
##$SUBNAM4= <"">
##$SUBNAM5= <"">
##$SUBNAM6= <"">
##$SUBNAM7= <"">
##$SUBNAM8= <"">
##$SUBNAM9= <"">
##$SW= 18.05172834244
##$SWIBOX= (0..15)
0 0 2 0 0 0 0 0 0 0 0 0 0 0 0 0 
##$SW_h= 3612.71676300578
##$TD= 16384
##$TD0= 1
##$TE= 0
##$TE2= 300
##$TE3= 300
##$TEG= 300
##$TL= (0..7)
0 120 120 120 120 120 120 120 
##$TP= (0..7)
150 150 150 150 150 150 150 150 
##$TP07= 0
##$TPNAME0= <>
##$TPNAME1= <>
##$TPNAME2= <>
##$TPNAME3= <>
##$TPNAME4= <>
##$TPNAME5= <>
##$TPNAME6= <>
##$TPNAME7= <>
##$TPOAL= (0..7)
0.5 0.5 0.5 0.5 0.5 0.5 0.5 0.5 
##$TPOFFS= (0..7)
0 0 0 0 0 0 0 0 
##$TUNHIN= 0
##$TUNHOUT= 0
##$TUNXOUT= 0
##$USERA1= <user>
##$USERA2= <user>
##$USERA3= <user>
##$USERA4= <user>
##$USERA5= <user>
##$V9= 5
##$VALIST= <valist>
##$VCLIST= <CCCCCCCCCCCCCCC>
##$VD= 0
##$VDLIST= <DDDDDDDDDDDDDDD>
##$VPLIST= <PPPPPPPPPPPPPPP>
##$VTLIST= <TTTTTTTTTTTTTTT>
##$WBST= 1024
##$WBSW= 4
##$XGAIN= (0..3)
0 0 0 0 
##$XL= 0
##$YL= 0
##$YMAX_a= 202707
##$YMIN_a= -231818
##$ZGOPTNS= <>
##$ZL1= 120
##$ZL2= 120
##$ZL3= 120
##$ZL4= 120
##$ABSF1= 10
##$ABSF2= 0
##$ABSG= 5
##$ABSL= 3
##$ALPHA= 0
##$AQORDER= 0
##$ASSFAC= 0
##$ASSFACI= 0
##$ASSFACX= 0
##$ASSWID= 0
##$AUNMP= <proc_1d>
##$AZFE= 0.1
##$AZFW= 0.1
##$BCFW= 1
##$BC_mod= 2
##$BYTORDP= 1
##$COROFFS= 0
##$CY= 11.3945322036743
##$DATMOD= 1
##$DC= 2
##$DFILT= <>
##$DTYPP= 0
##$F1P= 15.7292609196834
##$F2P= 12.9074282941183
##$FCOR= 0.5
##$FTSIZE= 0
##$FT_mod= 4
##$GAMMA= 1
##$GB= 0.15
##$INTBC= 1
##$INTSCL= 1
##$ISEN= 128
##$LB= 0.24
##$LEV0= 0
##$LPBIN= 0
##$MAXI= 10000
##$MC2= 0
##$MEAN= 0
##$ME_mod= 0
##$MI= 1.114404
##$NCOEF= 0
##$NC_proc= 0
##$NLEV= 6
##$NOISF1= 3.799351
##$NOISF2= 2.8
##$NSP= 1
##$NTH_PI= 0
##$NZP= 0
##$OFFSET= 15.70392
##$PC= 1
##$PHC0= -22425.34
##$PHC1= 5.452712
##$PH_mod= 1
##$PKNL= yes
##$PPARMOD= 0
##$PSCAL= 0
##$PSIGN= 0
##$REVERSE= no
##$SF= 200.130013532006
##$SI= 16384
##$SIGF1= 3
##$SIGF2= 2
##$SINO= 400
##$SIOLD= 16384
##$SREGLST= <1H.CDCl3>
##$SSB= 0
##$STSI= 0
##$STSR= 0
##$SW_p= 3612.71676300578
##$SYMM= 0
##$S_DEV= 0
##$TDeff= 0
##$TDoff= 0
##$TI= <>
##$TILT= no
##$TM1= 0
##$TM2= 0
##$TOPLEV= 0
##$USERP1= <user>
##$USERP2= <user>
##$USERP3= <user>
##$USERP4= <user>
##$USERP5= <user>
##$WDW= 1
##$XDIM= 8192
##$YMAX_p= 0
##$YMIN_p= 0
$$ End of Bruker specific parameters
$$ ---------------------------------
##NTUPLES= NMR FID
##VAR_NAME=  TIME,          FID/REAL,        FID/IMAG
##SYMBOL=    X,             R,               I
##VAR_TYPE=  INDEPENDENT,   DEPENDENT,       DEPENDENT
##VAR_FORM=  AFFN,          ASDF,            ASDF
##VAR_DIM=   8192,          8192,            8192
##UNITS=     SECONDS,       ARBITRARY UNITS, ARBITRARY UNITS
##FACTOR=    0.0002768,     1,               1
##FIRST=     0,             0,               0
##LAST=      2.2672688,     0,               0
##MIN=       0,             -231818,         0
##MAX=       2.2672688,     202707,          0
$$ Real data points
##PAGE= N=1
##DATA TABLE= (X++(R..R)), XYDATA
0@%%%%%%%%%%%%%%%%%pJ5j6J6j6J6k0K8l2L2m0M8n2O0o8P6q6R8j11J26j41J56
$$ 0 0 0 0 0 0 0 0 0 0 0 0 0 0 0 0 0 0 -7 8 -8 8 -8 8 -12 16 -16 16 -24 24 -28 32 -36 40 -46 52 -59 67 -74 82
39H2j73J91k12K34k58K86l15L46l81M19m62N10n62O20o82P54q39R35j046J176
$$ 82 -91 100 -112 122 -136 150 -165 181 -200 219 -243 267 -295 325 -357 397 -442 493 -553 623
59F23j332J520j755K061k470L046l918N380q245J5807p1312j71223K36352J98173
$$ 623 -709 811 -944 1117 -1353 1693 -2225 3155 -5090 10717 -60595 -231818 4534 202707
73B02707j73866j76749J05747J09911n2299l6565L4759j2647k604O3425j1321
$$ 202707 28841 -147908 -42161 67750 15451 -21114 13645 998 -1606 61819 50498
84E0498j08368M985J24455J1352j07044j0686P7467L895m7261m081p876k5137
$$ 50498 -57870 -52885 71570 82922 -24122 -34808 42659 46554 -707 -4788 -12664 -37801
96c7801L9389N1112n4786o6435N5200N6812o7496n3433O9403M8649n1898j8263
$$ -37801 1588 52700 -2086 -68521 -13321 43491 -24005 -77438 -8035 40614 -11284 -29547
108b9547M9047L70l7308J9183K5045l1916j204N4963o250n9790J7313M9447n0457
$$ -29547 19500 19870 -17438 1745 26790 -5126 -6330 48633 42383 -17407 -94 49353 -1104
121a104n9267O9377O5319q3701p2501Q1361O3126q7538o4228P5382N3686n5850
$$ -1104 -60371 9006 74325 -9376 -81877 -516 62610 -24928 -89156 -13774 39912 -15938
133a5938k6786N1882J3674m0617o98K9396n525r072K6228J0459k5349o522J4967
$$ -15938 -42724 9158 22832 -17785 -18483 10913 5388 -3684 22544 33003 7654 1132 16099
146A6099p639j0428J3645N2k4248Q285L1001j9658m8092R812M1092j0164k8659
$$ 16099 8460 -1968 11677 11729 -12519 -4234 26767 7109 -40983 -31171 9921 -243 -28902
159b8902J9189K3448k2123j4423K4577L680k5019J2398L8017r342l2826J1988
$$ -28902 -9713 13735 -8388 -22811 1766 5446 -19573 -7175 30842 21500 -11326 662
171F62K8265j3079k4688N650J0599K495J1582k810l7575j3160M2953J6956n2011
$$ 662 28927 15848 -8840 -3190 7409 9904 21486 18676 -18899 -32059 10894 27850 -24161
184b4161k4465N5116L3975m7419l8530L3191L2991j9582k2601J2803J9764O661
$$ -24161 -48626 6490 40465 -6954 -45484 -12293 20698 1116 -21485 -8682 11082 17743
196A7743k879j5284j4669J3266K2993p225k1275O804J8389o996j6082j330M99
$$ 17743 14864 -420 -15089 -1823 21170 13945 -7330 -526 17863 10867 -5215 -6545 -6046
209f046l049R280Q548j3657j0052J8583Q501k6778j5379K8923K2921j8011j6989
$$ -6046 -9095 185 8733 -4924 -14976 3607 12108 -14670 -30049 -1126 21795 3784 -13205
222a3205J5407J2461j2835j0223N931N981K336L639l530p113L744M062j3617r967
$$ -13205 2202 14663 1828 -8395 -2464 3517 5853 9492 5962 -1151 2593 6655 -6962 -16929
236a6929J6024J4837j2538j1607J0512N658j3824o034J3023N641o938K956R441
$$ -16929 -905 13932 1394 -10213 299 5957 -7867 -13901 -878 4763 -2175 781 10222
249A0222m857j0681K595N913m468j432R154M438o710n293j811l288J328O289j428
$$ 10222 5365 -5316 -2721 3192 -1276 -2708 6446 10884 4174 -1119 -2930 -6218 -4890 1399 -29
264b9n654N980R225r005j4142N099J1932l471n991Q857R068o483q297J567J768
$$ -29 -5683 297 9522 517 -13625 -8526 3406 -65 -6056 2801 11869 5386 -2911 -1344 424
279D24k054L209O046j714m364J833K03p689l901M361L061j35K318J332o134l590
$$ 424 -1630 1579 7625 5911 1547 3380 3583 -4106 -8007 -3646 -585 -720 1598 2930 -3204 -6794
295f794L198l30m649N124J1576n14r580m1P120l084p257L263Q936J584l155p63
$$ -6794 -3596 -3926 -8575 -3451 8125 7611 -1969 -2010 5110 2026 -5231 -1968 6968 8552 5397 4634
311D634k103l835j573L50m30J829N474k14p520l051L107j084l995K905P807O88
$$ 4634 2531 -1304 -2877 -2527 -2957 -1128 4346 4132 -3388 -6439 -3332 -4416 -8411 -5506 2301 2989
327B989k722J078J77n092j591N573M018r14J438L071k885n734j543J926j48J075
$$ 2989 267 1345 1522 -3570 -5161 412 4430 3516 4954 8025 5140 -594 -2137 -211 -359 716
343G16K643N37k794j809j515m009j661M540M175j256m80K708j132n962j250M823
$$ 716 3359 3896 1102 -707 -2222 -6231 -7892 -3352 823 -433 -913 1795 663 -5299 -6549 -1726
359a726K417M00K218K333j593k820j262j488q77L741M236K4l411p84o27l182k924
$$ -1726 691 1091 3309 5642 4049 1229 -33 -1521 -2398 1343 5579 5603 2192 1408 781 -2401 -5325
376e325J131L071K854J409j797l958j741J982M50l096J250P550L634m591n704
$$ -5325 -4194 -1123 1731 3140 1343 -2615 -4356 -2374 -1924 -5020 -3770 3780 7414 2823 -2881
391b881L48K508L00j396J120L040L512r24n873m738J837M317k81k356K491L733
$$ -2881 -2533 -25 275 -1121 -1 3039 6551 5627 -246 -4984 -3147 1170 889 -1467 1024 4757
407D757j044n016l470N79J345K481K728L68j670j002m32j503j784k94L164L960
$$ 4757 3713 -1303 -4773 -4194 -2849 -368 2360 2728 1058 56 -376 -1879 -3663 -3957 -793 3167
423C167J911k556m027r22J579m6k211J470M647K981j720m676l613J1L885L318
$$ 3167 5078 2522 -1505 -2427 -848 -894 -3105 -1635 3012 5993 4273 -403 -4016 -4005 -120 3198
439C198k388k816L864O182l907j1283k618R762N975n364m786M740N415m338p471
$$ 3198 810 -2006 1858 8040 4133 -7150 -9768 -6 5969 605 -4181 559 5974 1636 -5835
454e835k151M644N477K519k887l296J284L043j921n975n12P014O063j863n372
$$ -5835 -7986 -3342 2135 4654 1767 -1529 -245 2798 877 -5098 -5610 1404 7467 5604 232
469B32o64J551j173k686P64L874J404j125j43q55m155l582K432N768k33l841J526
$$ 232 -432 1119 -54 -2740 -1976 1898 3302 2177 2034 1179 -2976 -6558 -4126 1642 1409 -2432 -906
486i06M922j353p401k609L960M880K516K79k453l671K272M978m505r529L805J5042
$$ -906 4016 2663 -4738 -7347 -3387 1493 4009 4288 1835 -1836 436 5414 909 -8620 -4815 10227
502A0227K900j4711p838J0507P799j0492j0334P213J3036l82r288n249K033L656
$$ 10227 13127 -1584 -9422 1085 8884 -1608 -11942 -4729 8307 7925 -1363 -6612 -4579 -923
516i23J117j942k743K306P506K667q528p920L725Q881L62o407K62P858K506q073
$$ -923 194 -1748 -4491 -2185 5321 7988 -540 -8460 -4735 4146 4508 -1899 -1637 6221 8727 654
532F54o762K930M968n7q04J198q7k296j012Q79k456l819L419P306N92n371k647
$$ 654 -6108 -3178 1790 1733 929 2127 2040 -256 -1268 -389 -2845 -6664 -3245 4061 4653 -718 -3365
549c365K154k73j825J686K295k92J576M084k008r202j724R923M434q536n131J0128
$$ -3365 -1211 -1484 -3309 -1623 672 380 1956 6040 4032 -5170 -6894 3029 7463 -1073 -6204 3924
565C924Q626r350j3103K580J0709J285o032r14M026J516l243l015j862oM700M307
$$ 3924 12550 3200 -9903 -7323 3386 4671 -1361 -2275 1751 3267 24 -2991 -4853 -4859 -159 4148
581D148j461n169Q28M754j725p150q85Q741N365l801m893J109K266k225k754J235
$$ 4148 2687 -2482 -1654 3100 1375 -5775 -6660 2081 7446 3645 -1248 -139 2127 -98 -2852 -1617
597a617L444O01j75K50q53k825k829O50K829J888J65j63o76q76j279j794j508
$$ -1617 1827 2428 2253 2503 1650 -1175 -4004 -3354 -525 1363 1528 1365 689 -187 -1466 -3260 -4768
614d768K499N677J218m703l441L991L720n742o423N158J0301J24q205k439M301
$$ -4768 -2269 3408 4626 -77 -3518 473 4193 -1549 -7972 -2814 7487 7611 -594 -3033 1268
629A268J275m323j640L181L173P40o01l208l830J062L646r01l698J893O339J117
$$ 1268 2543 -1780 -3420 -239 2934 3674 3073 -135 -3965 -2903 743 -158 -3856 -1963 4376 5493
645E493o895n154K414M463P06j998K24L086J751l150m253Q2L521J779j170J40
$$ 5493 -1402 -6556 -4142 321 1027 -971 -747 2339 4090 940 -3313 -3231 290 2069 899 1039
661A039K766l12l504k372M33N78J207K353P46j457k170p96n18r02M54J596J297
$$ 1039 3805 3493 -11 -2383 -1950 -1372 -165 2188 2934 1477 -693 -1489 -2007 -2909 -2455 -859 438
678D38J074J036k425l212L9K160J31j92K940K921k209l927k40J678j026l23K788
$$ 438 1512 2548 123 -3089 -3050 -890 -759 -951 1989 4910 2701 -1226 -1466 212 -814 -1137 1651
695A651J935j105j393Nj447k772J82K813J269J91j51r30k015j405M88L95J391
$$ 1651 3586 2481 1088 1093 -354 -3126 -2944 -131 1138 1329 1178 248 -1767 -3172 -2684 -2289 -898
712h98K066Q38q50q96M8j629k005J586M072N67r74R4Q16k706l036M97L314J231
$$ -898 1168 2006 1156 260 308 -1321 -3326 -1740 2332 2899 1925 2019 2835 129 -2907 -2410 904 2135
730B135n51O4l50j198j341j363n36J214K901O39j009n09j11j940k008J558K863
$$ 2135 1584 1648 1298 100 -1241 -2604 -3140 -1926 975 1614 605 96 -15 -1955 -3963 -2405 458
747D58Q50oR39p21k315j295J143J077k78J214K548k99k387j879m49l60R50J343
$$ 458 1308 1302 2241 1520 -795 -2090 -947 130 -148 1066 3614 3315 928 -951 -1400 -1760 -810 533
765E33Q22O52n02j635j991r07J229R79j6J297J729p44k216j135N6J1Q82K399J627
$$ 533 1355 2007 1505 -130 -2121 -3028 -1799 -820 -836 461 2190 1446 -770 -1905 -1849 -1838 -956 1443 3070
784C070p46j369o49j040r39L64K155J308J80o90p11r12j571n34L30J035K329N41
$$ 3070 2324 955 306 -734 -1673 -1309 846 2154 2334 1644 933 21 -1550 -2084 -1754 -719 1610 2151
802B151j527j887K3j32j526J89K851J964n08j130m17n77j026k15J227J666J248
$$ 2151 624 -1263 -1240 -1372 -2898 -2709 142 2106 1598 468 51 -526 -1552 -1767 -540 1126 2374
819B374L85j063j418q33m75R7N24J271J605m23j444j341q00o53K26J117J329Q37
$$ 2374 2759 1696 278 -555 -1030 -933 -409 862 2467 2044 600 -741 -1541 -2194 -1968 -851 478 1315
837A315j27q79j815j249K91J791M78N34J191Q00j242k312o70R84J047P45Q10O43
$$ 1315 1188 309 -1506 -2755 -2464 -673 -195 339 1530 2330 1088 -1224 -1894 -910 137 882 1692 2335
855B335J63j523j800j090M04J383R61P73l06l05j539j001j069M06Q25J573J370
$$ 2335 2498 975 -825 -1915 -1511 -128 833 1606 1300 995 -544 -1545 -2614 -2208 -1383 190 1560
872A560j81j475j342l6J87n37J125K122J245j67j712j652n3J69O36N27P52J085
$$ 1560 1379 -96 -1438 -1474 -1287 -1824 -699 1423 2668 2501 789 -863 -916 -747 -111 416 1168 2253
890B253L38j669k115j164Q10J387L02K80O28R1j073j856j051k4K021J769J30j90
$$ 2253 2591 922 -1193 -2357 -1547 -160 142 422 1050 1141 68 -1788 -2839 -2863 -842 927 1057 867
908H67m24k08q59j375L89J509J470R58N0p64j945m35j05J21L30J661J207l45j903
$$ 867 443 235 -624 -1999 -1610 -101 1369 2327 2377 1613 -332 -767 -872 -751 -421 1240 2447 2102 199
927A99j341p91j68Q35J379K24r6L84L84k047k616N47L096J799j051k50P11K7j592
$$ 199 -1142 -1933 -2101 -1266 113 337 241 625 1009 -1038 -3654 -3107 -11 1788 737 487 1198 1225 -367
946c67j612k25J823K437P82j105j328l76J90r61j022K02K776J844j194k726j007
$$ -367 -1979 -2204 -381 2056 2838 1733 405 29 219 -742 -1764 -1562 1214 3058 1864 -862 -1869
963a869Q50J58j042M2K175K038j034k262k04j34j67M95J395J095o9J98K2j892
$$ -1869 -1019 -861 -1903 -1861 314 2352 1318 -944 -1148 -1282 -1449 -954 441 1536 1467 1665 1687 -205
981b05j975O23K595M10l64P75L6j811j096k64M28n37J162K292K61l062j652J351
$$ -205 -2180 -1557 1038 1448 1084 1859 1895 84 -1012 -1276 -848 -1385 -223 2069 2330 -732 -2384 -1033
999a033M65j559o9K376K213p01k197q64K7O80L71K55P30J211R60j131k206j787
$$ -1033 -568 -2127 -2196 180 2393 1692 -505 -1369 -1342 -662 -291 -36 694 1905 2865 1734 -472 -2259
1017b259R71K141N49p44J64J175m57k931j743J043K329r7m06J048N95j846j459
$$ -2259 -1288 853 1402 658 822 1997 1540 -1391 -3134 -2091 238 141 -265 783 1378 -468 -1927
1034a927j60M96M06J501J813m54j909j61K05o41n10J390J877j2m62r3m83k092
$$ -1927 -2087 -1591 -1185 316 2129 1675 -234 -395 -190 -831 -1341 49 1926 1914 1452 1359 876 -1216
1052a216q93J589J377O1o47R07J11k071k314P08K135P07k39P8N10l97j280j191
$$ -1216 -2109 -520 857 918 271 1178 1289 -782 -3096 -2388 -253 454 215 293 803 406 -874 -2065
1070b065L44O15J768J438l55j339n85N35q27j125Q06K567J097j365j697K2P5r46
$$ -2065 -1721 -1106 662 2100 1745 406 -179 356 -471 -1596 -790 1777 2874 1509 -188 -166 -91 -1037
1088a037o60J017J504L18j60p00j564q14N9J015N74R22J085n17j302r24o3L96
$$ -1037 -1697 -680 824 1142 982 282 -1282 -2096 -2037 -1022 -448 474 1559 1042 -260 -1184 -1247 -851
1106h51L82Q03R11Q24m71p65j309k68OK70J471R66J82j587j611J10k07l14M37
$$ -851 -469 334 1245 2069 1598 833 -476 -744 -738 -468 1003 1969 2151 564 -1047 -937 -1144 -1458 -1021
1125a021J460P51k59p98n78j333m34R62J081M50P73Q61q11k175n05J153N97o1
$$ -1021 439 1190 931 133 -445 -1778 -2212 -1250 -169 281 1054 1915 1104 -1071 -1576 -423 174 113
1143A13Q29J184p05o99r13m54o99N84J458P66l80J00j177j519p98Q62J261L11
$$ 113 942 2126 1421 722 -191 -645 -1344 -760 698 1464 1084 1184 7 -1512 -2310 -1448 -187 124
1161A24J42O13k43j273m47j75R5O11J307Q46k31n40m18j051p67Q07J534M40j61
$$ 124 266 879 636 -637 -1084 -1259 -1164 -553 754 1600 1369 829 411 -640 -1407 -600 934 1374 1213
1180A213K46m36j296q90K99Q4M66O98J216j006j150l18l56q71P22J869R77p99
$$ 1213 1459 1023 -273 -1163 -864 -780 -314 384 1600 594 -556 -874 -1230 -2101 -1379 490 1467 668
1198F68l32j82p01r14L17J373M33K04R84J08j652j254K71K50K31J208J224j124
$$ 668 336 154 -547 -1461 -1144 229 662 866 1850 1958 306 -948 -677 -427 -196 1012 2236 1112
1216A112j004n77m69m78m4J279P79l28L25j20j446p89n3P83O70P98R06j53j465
$$ 1112 108 -469 -938 -1416 -1460 -181 598 270 595 475 -971 -1760 -1813 -1030 -360 438 1344 1191 -274
1235b74p81L51j14L59J518O51m23l95l43o15j140K76J011P65j34L83k8j405j469
$$ -274 -1055 -704 -818 -459 1059 1710 1287 892 549 -66 -1206 -930 81 846 712 1095 1067 -338 -1807
1254a807O5Q29L44R45M72k06j074k43l07k65k64J414J668n8m78k98r36o81k74
$$ -1807 -1742 -913 -569 376 848 642 -432 -675 -982 -1247 -1511 -97 1571 1513 1035 737 -199 -880 -1154
1273a154J246P07M75O54n22j271j114L86K83p03R19J422k37p63n65n32r22j48
$$ -1154 92 799 1274 1928 1406 135 -979 -593 -310 -1013 -94 1328 1091 328 -237 -769 -1691 -1839
1291a839J086J066M03j95j02p92r16Q1R30L49N72Q38j31m64j014j88l37O3Q86
$$ -1839 -753 313 716 521 419 -373 -1289 -1208 -278 71 643 1481 1350 886 -128 -316 -653 -590 296
1310B96J281j64p46l55r10o53j14Q97L91M74O60j36j297q00n1J51R5Q64J156L38
$$ 296 1577 1413 667 312 -598 -1251 -1365 -468 -77 397 1057 921 -376 -1176 -1227 -1076 -981 -117 1039 1377
1330A377p07q73k97l32M7Q14J198L61m53k60n13j124j65N88N41L02M70L29q51
$$ 1377 670 -203 -500 -832 -785 29 1227 1588 1135 875 362 -762 -927 -339 202 504 974 1303 452
1349D52j210p53J99M41O71P68O0j95m70n94p02k1R59P74N89O70n10o49j203k74
$$ 452 -758 -1511 -1312 -871 -200 568 628 433 -37 -631 -1333 -1354 -395 379 968 1638 1128 479 -724 -998
1369i98O15K72Q13R02J91j005q55n55n60K30Q16N51P19n43l03m84j131j01N87
$$ -998 -383 -111 702 1604 1795 790 -65 -620 -1180 -950 -134 417 1136 593 290 -194 -1325 -1426 -839
1388h39Q71M01k9L93m70r97l93q0O41O61Q42L74m75l54m96n44j86L67J005N84
$$ -839 32 433 404 797 327 -670 -1063 -1143 -502 159 1001 1375 900 546 50 -494 -680 -313 692 1276
1408A276Q7n82n76q75l85N6L32N87P77J71p42q72k42k76J19P65P50K95Q4J7p92
$$ 1276 1363 781 205 -670 -1055 -999 -667 -80 697 868 126 -746 -988 -1264 -1145 -380 370 665 749 766 -26
1429b6q40j78N61P05N98K74K27m39j012p71O7L51Q17L58L80m20n89o63o31J56
$$ -26 -866 -1044 -483 222 820 1094 1321 882 -130 -901 -834 -483 334 692 1072 652 63 -600 -1231 -1075
1449a075J0O94R84M06o33q21l94q1N2L12P82R23J19p58l12p42j56M06N91P60K87
$$ -1075 -1065 -371 613 1019 386 -435 -829 -910 -858 -546 236 1159 1278 520 208 -534 -690 -284 307 1067 1354
1470A354k20m22o09j127J14M07N94J48K60on07o19n50j04N94N38N42L93l36o41
$$ 1354 1134 712 103 -1024 -910 -503 91 239 499 493 -14 -633 -1183 -1287 -693 -155 387 780 444 -197
1490a97q74K78J91M06M82Q21M33o90o38o40k02K4O94O54K57nk11p72p27o07N73
$$ -197 -1071 -793 -602 -196 286 1107 1540 850 212 -428 -630 -606 88 742 999 994 783 11 -716 -1323 -750
1511g50N31O62L4j02k30m80q61k27O61O41N57L03j50m12o42k06j8N83Q55J84R9
$$ -750 -219 443 477 375 145 -335 -1196 -1423 -762 -121 436 739 589 177 -465 -671 -689 -106 749 933 1032
1532A032J23r46p06j5J29M5R08L71K20p50p40k04l85l13P64P77K8q6P7l38j145
$$ 1032 1155 209 -497 -512 -383 -338 570 941 1161 411 -329 -533 -918 -1231 -467 310 338 252 329 -9 -1154
1553a154N6N40O17M02J43L19m47q97j32k34M80O91P99K57n13n76n50k57m93K81
$$ -1154 -1098 -558 59 461 604 923 476 -421 -553 -787 -307 384 1183 1440 927 351 -199 -456 -949 -668
1573f68R98K47L4k74p49m22k26J03N0Q90M45N18p91n03l74j98J08M83R48K75m3
$$ -668 330 577 611 337 -412 -834 -1060 -957 -907 -17 428 946 155 -348 -722 -920 -812 -329 619 894 851
1594H51n5o12n35k14J84N30M04K73M75q03j142k70J39Q2M62O76K89n60m47k01
$$ 851 796 184 -351 -565 -381 149 553 826 1301 498 -644 -914 -775 -693 -231 445 734 174 -273 -474
1614d74m04m39O18O33P25k58K4m1r30j94M69P47K00M24J67o82n60l95o1J88J17
$$ -474 -878 -1317 -699 -66 659 401 425 384 -546 -740 -271 476 676 1100 1267 585 25 -370 -431 -243 -126
1635a26N47K30K00k92o83o48k59K85N20K44M34j20l52o83k70K12K60L82Q24r5
$$ -126 421 651 851 559 -124 -772 -1031 -746 -226 18 452 332 -20 -703 -973 -761 -501 -119 705 610
1655F10J31m29n66l55J18K52Q31M13m5k74l41p09j76o7K42N92L91K4n73l20o54
$$ 610 741 312 -254 -609 -491 -239 592 1005 960 686 345 -364 -540 -607 -365 227 618 642 69 -251 -905
1676i05j1j00O36O16N79j0n62n19p81J25O40L80P06K12j45m48l49m76j25M33L00
$$ -905 -916 -1016 -380 236 815 805 243 -276 -1057 -932 -292 88 794 1006 861 413 64 -412 -537 -104 196
1697A96M90K87l33k87r08k47J23K57Q06N8K1l65o52m41n1L25L34O37J57J83j43
$$ 196 686 973 640 353 -555 -802 -679 -422 384 442 463 98 -554 -995 -1046 -721 -387 250 407 590 447
1718D47l42q18K9J89O12M42M42j65l23p92k64K74L83Q0K24L86M6q89n08L8m17
$$ 447 105 -713 -684 -495 117 559 1001 836 513 -279 -543 -269 114 194 418 804 850 -39 -547 -509 -926
1739i26N74L27N08J17n17j83o39l89M18P63M63k08M46k15k04o72k0K2J58O05Q22
$$ -926 -352 -25 483 600 83 -100 -739 -1128 -710 53 516 308 754 539 335 -337 -357 -335 -177 428 1250
1760A250k32q19l06k11k39j23R28M02l82j80J07o77n12j1L26%O36N04K17n96q27
$$ 1250 1018 199 -107 -318 -557 -680 248 650 268 88 195 -482 -994 -1005 -679 -679 -43 461 678 82 -745
1781g45J38J95j56P96Q10j91k28l76j04m15j72O37M75M1j1J42p65o86j59L94K22
$$ -745 -607 -412 -568 228 1038 847 619 243 139 -276 -448 189 664 705 694 836 71 -615 -774 -380 -158
1802a58K03O87k33n80k26k69p5k57Q02N67K85j19m44m81k64k3M00N12N33P4j26
$$ -158 45 732 499 -81 -307 -576 -651 -908 -106 461 746 627 183 -298 -562 -585 -185 327 860 934 808
1823H08p49n02K64Q8r1K70N30M3o76k41lo08j55N94M72M65k27k4m33n64l6K25
$$ 808 59 -443 -179 -91 -182 88 618 661 -15 -256 -259 -867 -1022 -428 44 509 282 258 -175 -739 -775 -550
1845e50N45Q4O12J5j97n29n02K80j05O02L25N36n90o8n71n33j93P38K12J65J78
$$ -550 -5 79 691 706 509 -20 -522 -242 -347 255 580 1116 526 458 -113 -646 -839 -101 111 276 454
1866D54j65m08n89o6M66J08j6N99L01m60q64J61j04k63O65N91L78k20K0l86m04
$$ 454 289 -119 -708 -774 -308 -200 -216 383 684 224 -640 -479 -583 -846 -181 410 788 568 588 202 -202
1887b02l42K03P48N1J75Q3m09o00k36k18L89K63K70L95l40o07j66j51j3J98N86
$$ -202 -544 -341 407 458 633 716 307 -293 -529 -747 -358 -95 175 570 230 -377 -543 -694 -707 -509 77
1908G7N35j79j9k67k04l47J8M01J67P34kl78n48j52j76J71n3O85M48l42k98k90
$$ 77 612 433 414 147 -57 -404 -386 15 182 916 914 536 -12 -164 -340 -169 -222 463 911 569 271 -19
1930a9m85m77N22K66J17L9N51k44n86m39Q5L92N6O58J98k7m30k47K36m33Q1M89
$$ -19 -504 -981 -459 -193 -76 -37 514 270 -316 -755 -670 -278 -222 436 634 607 177 -70 166 -267 -186 303
1952C03M92j03j24l29l55j74ON1N84J09l4M3o38m20l16L28K49J98O34k54k15j21
$$ 303 795 692 568 239 -116 -290 -284 -233 351 460 426 469 -169 -589 -905 -577 -328 -130 504 250 35 -86
1974h6m30l75L64M07L88J89M37l73m44m87j62M88L29K80K03j79n33k46j94j43
$$ -86 -516 -891 -527 -120 268 457 894 521 77 -410 -572 -84 245 525 728 549 16 -230 -424 -567
1994e67J94L68O09l15j62k44k61l11m8M37L59L23q3o8k70l42J18k24O14K08L83
$$ -567 -373 -5 604 289 127 -117 -378 -689 -737 -300 59 382 299 231 -39 -381 -263 -487 127 335 718
2015G18J24o66k80p2j31J13J77M99J41l20k13k89k06m72L89L73M12J82k05k66
$$ 718 842 176 -104 -176 -307 -194 -17 482 623 303 90 -199 -405 -877 -488 -115 297 479 274 8
2035Hm11m44J43K52M42M56K45l12l49m11J1J21L34L68M03k74m04Q6l58l69K4L43
$$ 8 -403 -847 -704 -452 -10 446 691 379 30 -381 -370 -249 85 453 856 582 178 264 -94 -463 -439 -96
2057i6L21M9N1k67m92k6k55K06P1M68M73k07n48k13k2q5K82N00J92j16J07k69
$$ -96 225 274 325 58 -434 -460 -715 -509 -438 30 503 296 -252 -465 -487 -572 -290 210 402 286 393 124
2079A24l19k14K23K24K11L77K5k89k71n14O9k75L29N49K69l68o3j94m63j25J33
$$ 124 -195 -409 -186 38 249 626 651 362 91 -423 -354 -629 -300 249 518 150 87 -107 -570 -695 -562
2100e62N21J25K59l4mk95m91K50J38P0N40N5K95n12l36m27r8J85O03K97k29j12
$$ -562 -41 84 343 309 305 10 -481 -231 -93 -23 517 572 867 355 19 -408 -506 -321 282 579 350 238
2122B38p0j84l78j84J57L76J7O18m61l62k99l0J99J75N60l5O7j94n44L70n33K30
$$ 238 168 -16 -394 -578 -421 -45 -28 590 129 -233 -532 -562 -363 -188 372 337 404 210 -334 36 -497 -267
2144b67M84L22J03p1p0m84n14j11L09L28J46M16j83k99n92l79J79K34R7P96R1
$$ -267 217 539 642 571 501 17 -497 -608 -299 29 175 591 408 109 -483 -862 -683 -449 -352 444 535
2165E35n04N6l90k92J63L27M65K03r1%n57j17JK26o6K90L36j40k04l11m0n07J36
$$ 535 31 87 -303 -595 -432 -105 360 563 472 472 -85 -202 -201 25 -41 249 585 445 241 -70 -110 -617 -481
2188d81M32K69P3Qk29n54k49j0N91J4K59j2K53l78j47p1j48P7N51K49rq3k06k19
$$ -481 -49 220 293 301 72 -482 -731 -741 -150 -136 123 111 364 -14 -161 -232 -380 -303 248 497 488 405 199 -20
2212b0l16R6L31L01J1L7l96P0o74R1R1K11J52L43R5l60m79j51j14K94M83J24K36
$$ -20 -336 -240 91 392 403 440 44 114 -560 -469 -378 -167 -15 328 423 63 -416 -567 -681 -387 96 220 456
2235D56q4j67k40l29j00J64N09K21K07Jk46m23k29l78K86L22J55N01o67j66l26
$$ 456 372 205 -35 -364 -464 -300 209 430 637 638 392 -31 -260 -638 -352 -30 125 626 -41 -207 -533
2256e33m8k7K44N66j59K68k83k30k90k6k9L41M16J65Q1j03n91j9p7M61J2J60J76
$$ -533 -581 -608 -364 202 43 311 28 -202 -492 -518 -547 -206 210 375 456 353 -238 -257 -334 127 139 299 475
2279D75J96o95k23k0k44L16K56J81o7k5j91p0n10J16N0N30J3J59Lq3m71j07L68
$$ 475 671 -24 -247 -267 -511 -195 61 242 175 150 -41 -111 -621 -505 -455 75 88 247 250 167 -304 -411 -43
2302d3o0L25J85K15k66l60Jm26J91M19J30K71k86j49j62k62k00J98O6K83R7M3
$$ -43 -103 222 407 622 356 -4 -3 -429 -238 181 311 582 296 147 -15 -277 -477 -279 -213 70 167 210
2324B10j57n57j04J56K36J54L34J54j56j31j92k36K27K48K9M97r2q1k41m84j38
$$ 210 53 -504 -608 -452 -216 -62 272 426 270 139 -53 -289 -62 186 215 712 620 539 298 -186 -324
2345c24n0L21K29nJ55n7n99j24R1j54L48M03r6O8k78j74j13k52L50K22O95j63
$$ -324 -374 -53 176 171 326 269 -330 -454 -363 -517 -169 234 138 206 -72 -246 -359 -611 -261 -39 656 493
2367D93q6n1n03m5J29J33M3M02r8K7n18j55n1k3K37K28j21J42j21j16m04k41K93
$$ 493 407 356 -147 -192 -63 70 113 515 417 444 -74 -229 -280 -303 -66 162 41 183 62 -54 -458 -699 -406
2390d06M1M23K67J10l62j74l6l6l02M09N51j1J37o25j26j10k30M67K16L04m4L1
$$ -406 -365 58 325 435 73 -101 -137 -173 -475 -66 485 474 611 -14 -140 -250 -480 -13 203 507 463 494
2412D94m85l45r2K05J5K25P6J74j06m68J32j04m2nM75J07P5l00k67J17j95J12
$$ 494 9 -336 -428 -223 -208 17 93 267 161 -307 -175 -279 -321 -326 149 256 331 31 -236 -119 -314 -202
2434b02L64K07J49P2l73k6n79K79j8J24L39L09m75k10j08j08k7n4L39PQ2Nmk64
$$ -202 162 369 518 590 217 191 -388 -109 -127 -3 336 645 170 -40 -148 -256 -283 -337 2 9 91 96 92 -172
2458a72j53J52J82J24J08N0j5j04l55R5k6J28L52L8rk09j76k18k47PL94r8L09
$$ -172 -325 -173 9 133 241 291 276 172 -183 -88 -114 14 366 404 395 186 10 -208 -455 -448 -54 -152 157
2481A57o0k4l29J41l04J20L57J4j32J93k98K10j27l21M44M7M32j87k32n8j07j54
$$ 157 97 73 -256 -115 -419 -299 58 72 -60 133 -165 45 -82 -403 41 88 520 333 101 43 -64 -218
2503b18J17K57j90K71J52l4l10r3k22k13N8O01q1J8J32k92r3k99K82L69j24K02
$$ -218 -101 156 -34 237 389 355 45 -48 -270 -483 -425 176 95 113 245 -47 -140 -439 -157 212 88 290
2525B90l0p8l91j34RL52j8K41K05j14k87M8l49j23M6K37K61m6p0K6l85j22N5J71
$$ 290 260 182 -209 -343 -334 18 0 241 446 332 45 93 -256 -379 -333 -96 165 119 49 75 -310 -432 -377 -206
2549b06M89k44L03j44l04l51p4K24M1K87M16l5l22L6q0k84M4JL58M06j27k50j92
$$ -206 283 39 342 198 -106 -457 -531 -307 -266 21 437 402 80 116 36 -248 -204 -203 155 561 434 184 -8
2572hj92j9jL32j67L5J76k34nk83mJ0L51L25j50J25l83j46R7o4rL03O5L80l70
$$ -8 -200 -219 -220 112 -55 -20 156 -78 -83 -366 -370 -360 -9 316 166 291 -92 -238 -141 -205 -214 89 154 534 164
2597A64P6j30o07J27N28J17K2K40k01j73m00N7j80L49K9K50%r3l06k03L3J3L75
$$ 164 240 110 -497 -370 158 275 297 537 336 163 -237 -180 -360 -11 18 268 268 175 -131 -334 -301 -288 87
2620H7K24O6j29n4n24M35j78qOL17r0J23k45o0j68k22L25K43J55j99M6l82J66
$$ 87 311 377 248 194 -330 105 -73 -81 -75 242 152 275 30 -30 -198 -420 -95 148 303 104 150 -232 -66
2643f6o61M34J37K36k10M42m58K3j73J4J97J88j39N35k69q8l41J2JJ70M6L82O4
$$ -66 -727 -293 -156 80 -130 312 -146 -123 -296 -282 -85 103 -36 499 230 142 -199 -187 -186 -16 30 412 476
2666D76j73k09l98n1J01P1M16l2j42K42n46J54k32OK4K90K23r7j47K11m31mq1
$$ 476 303 94 -304 -355 -254 -183 233 201 59 301 -245 -91 -323 -317 -293 -3 220 123 -24 187 -244 -248 -329
2689c29N16J84J2p3J15l11k53k13R7N14k19L67l19J70l13j28m2J45j25J11K72
$$ -329 187 371 383 310 425 114 -139 -352 -255 259 40 407 88 258 -55 -183 -225 -80 -205 -94 178
2710A78r4R6l10k98N4j04M12L39J98j89l99k69J42O0M74j28J94K04l92%k81J00
$$ 178 84 180 -130 -428 -374 -478 -66 273 471 282 -117 -386 -244 -184 290 162 356 560 168 168 -113 -13
2732a3M5j64K07K82j45l8n07j91K40R2L09p1K78m12o5M4j83l2L65N3J75p8J8k64
$$ -13 32 -132 75 357 212 174 -333 -524 -284 -192 117 46 324 -88 -153 -109 -292 -324 41 94 269 191 209 -55
2756e5K17k74j26J66M18j59J42o1k68j91k35L78j24N19l33K65j74j13j48J6k04
$$ -55 162 -112 -238 -72 346 187 329 268 0 -191 -426 -48 -172 347 14 279 105 -8 -156 -140 -344
2777c44L51J28K22k95j78J26m48K14L9L24q0j56K56qk58k18J28j47L50M09k75
$$ -344 7 135 357 62 -116 10 -438 -224 -185 139 59 -97 159 151 -107 -325 -197 -344 6 415 140
2798A40Nn4k57k10L6K6N07l06K40j59p6N8k85R8J18L03N0M3j84ln58K78m4L22
$$ 140 145 91 -166 -376 -340 -314 193 -113 127 -32 -108 -50 -335 -237 -119 184 234 277 93 90 -468 -190 -234 88
2822H8J13K98l95L4k83K30o8k52K40R4J73j17p8k06j43k8K54r4K33J35j60j49
$$ 88 201 499 104 138 -145 85 17 -235 5 99 272 155 77 -129 -272 -300 -46 -140 93 228 68 -81
2844h1j08q5J83o6L6M15q1j0l46J80k60L2L4M34RJ20k80j79k67J14j27M58j65
$$ -81 -189 -274 -91 -157 -121 294 213 203 -143 37 -223 -191 -157 277 286 406 126 -53 -320 -206 -333 125 -40
2867d0K58L3L0k05n21P4J25o9M10K16m04o6l6L5p8J0K90K12j74L19l28m2k15J75
$$ -40 218 251 281 76 -445 -371 -246 -315 95 311 -93 -159 -195 -160 -238 -228 62 274 100 419 91 49 -166 9
2891Ik80J96M63J14l46m71M46k61j21J44j6R0J47j22k53J82k62R2L71M1j12J74
$$ 9 -271 -75 388 502 156 -315 131 -130 -251 -107 -123 -33 114 -8 -261 -79 -341 -249 122 163 51 225
2913B25m2k04j82k14L17J76J39J1M3j08k41K0J4N3L52m2k07j44k2j75J3J23j20
$$ 225 183 -21 -203 -417 -100 76 215 226 269 161 -80 -60 -46 7 359 317 110 -34 -56 -231 -218 -95 -215
2936b15L10j01L29k10k84N7M1j27O3L89J58k97J70k36J41k26J13j08L73O6l7l07
$$ -215 95 -6 323 113 -171 -114 -73 -200 -137 252 410 113 283 47 188 -38 75 -33 340 406 369 62
2958F2k70j35j54L19J82J87j1l25nN7j14M3Q5j3K02l93M06r8m3j13Po1L29Q3m6
$$ 62 -208 -343 -497 -178 4 191 180 -145 -150 -93 -207 -164 -79 -92 110 -283 123 25 -18 -131 -124 -185 144 227 181
2983A81Q4N2j88j87K83j96m1J43r4p0jj45o7J6J28K18o0r3R1q7Qj80J83j0J45
$$ 181 265 317 129 -58 225 29 -12 131 37 -33 -34 -179 -246 -230 -102 116 56 -37 54 -33 -25 -205 -22 -32 113
3008A13qJ33q9l21k9J54mL92j9K5o3k34k27QJ69r6K82MN5j57n9j34l9N9rj00K18
$$ 113 105 238 149 -172 -201 -47 -51 341 322 347 284 50 -177 -169 0 -96 186 190 245 88 29 -105 -144 -85 -94 -194 24
3035B4Q1R3k70k00J14K2K39J56J2j60p8j38j22J12J04K56nm8P0k47J6j68n4L18
$$ 24 105 198 -72 -272 -158 -136 103 259 271 111 33 -105 -227 -115 -11 245 240 192 262 15 31 -137 -191 127
3059A27j72K54q6O8J5o82J70M7O9K86J09q5Q7l43J13n9j40L53j99L54j12J3j61
$$ 127 -45 209 123 191 206 -476 -306 -259 -190 96 205 120 207 -136 -23 -82 -222 131 -68 286 174 187 26
3082B6lm8O5q0K23J27j62J29n7k55k38J81K1K47j11J62j27l30r6L4j16M01J95
$$ 26 23 -25 40 -40 183 310 148 277 220 -35 -273 -92 -71 176 65 227 100 -230 -326 -292 -408 -7 188
3105A88n5K02k78k54K34l0L5K01p6J03j41kj22k74L2K35J75J06j0m03K3l06N9
$$ 188 133 335 57 -197 37 7 42 243 167 270 129 127 5 -269 -237 -2 173 279 269 -134 -111 -417 -358
3128c58K30L72l26M02Ql87k3l61M71j89J50RJ43J10J8j69l40K18k76M17L3N0J02
$$ -358 -128 244 -82 320 328 -59 -82 -443 28 -161 -11 -2 141 251 269 100 -240 -22 -298 119 152 202 304
3151C04j75l24J89J6k7J17J9j54K64l11q1R0k81M67p7L14j58m07J02n3M6q1K23
$$ 304 129 -195 -6 10 -17 100 119 -35 229 -82 -163 -73 -354 113 36 350 192 -215 -113 -166 -120 -201 22
3174B2J11j3K53k56k40J86k29L40k25O4L43m0k15j96k00K07J69m1k41K13j20K83
$$ 22 133 120 373 117 -123 63 -166 174 -51 13 356 316 101 -95 -295 -88 81 40 -201 12 -108 175
3196A75j86J3p9lP6L11k53K8m4k04j78J74L77J23J1l39K30l16r7l2J68j57K67
$$ 175 -11 2 -77 -80 -4 307 54 82 38 -166 -344 -170 207 330 341 2 232 -84 -181 -213 -45 -202 65
3219F5P4j49L9m2l28K36p3K19j32K72k70m8n7J14k26K67l0J91J75p5J49n83L88
$$ 65 139 -10 29 -13 -341 -105 -178 41 -91 181 -89 -137 -194 -80 -306 -39 -69 122 297 222 371 -212 176
3242A76k62M2J32J13m0J15l65j09K23l34L92K57l26J07q0M6j74j91R3J78N3J03
$$ 176 -86 -44 88 201 161 276 -89 -198 25 -309 83 340 14 121 41 87 -87 -278 -185 -7 46 149
3264A49Rj9k98J2k21J67J52n7L72k34m8n9m8J51j09L45Oq5O2k17l87r9L69K43
$$ 149 158 139 -159 -147 -368 -201 -49 -106 266 32 -16 -75 -123 28 -81 264 270 185 247 30 -357 -456 -87 156
3288A56k94J46J05j00j33j41N9J34L5P7j00J41M6j86q0j87K00K01M9J47K2j70
$$ 156 -138 8 113 13 -120 -261 -202 -68 -33 44 -56 85 131 -55 -135 -322 -122 79 128 275 297 127
3310A27j42n3J30p5J64L7o2K2k1k54j29J02K32j32L89l37P5j68j48J56K35P5k48
$$ 127 -15 -68 62 -13 151 188 126 148 127 -127 -256 -154 78 -54 335 -2 73 -95 -243 -87 148 223 -25
3333b5J04N5q1j46m5j47J71nJ03J30R3j74P4k13q2J11j6J29L7J22j60n0J58m03
$$ -25 79 134 53 -93 -138 -285 -114 -119 -16 114 207 33 107 -106 -188 -77 -93 36 73 195 35 -15 143 -260
3357b60L36l75L72K14l11lk03J8J93l4K85n7r4n2j65O3j33R3l8J67N2Q8N1k15
$$ -260 76 -299 73 287 -24 -27 -230 -212 -19 -53 232 175 81 29 -136 -73 -206 -113 -151 16 68 156 207 -8
3381hj50q3J49k19L71k1J28l69N2J1Q6l9J24J18Kk7j76j08k17L59L99k83O0j79
$$ -8 -158 -241 -92 -311 60 39 167 -202 -150 -139 -53 -92 32 150 152 125 -51 -159 -376 -17 382 99 159 -20
3405b0P6mk32R6J39j38P4j97N82j89j6l32J29l4J87q7r3n9j19K35j57K6J1K50
$$ -20 56 52 -180 -84 55 -83 -9 -206 376 187 171 -161 -32 -66 121 34 -59 -118 -237 -2 -159 -133 -122 128
3429A28l72L85rK3j62k1r0l6J79L99l26K7j49K58j62o9K18j30K12k03O7k37N1
$$ 128 -244 141 132 155 -7 -28 -118 -154 25 424 98 125 -24 234 72 3 221 91 303 100 167 -70 -19
3452a9j21q4K38P5L1l0R3m38J83q1J59k55K80j73M08P0n48K30k61J67R2JJ28l0
$$ -19 -140 -224 14 89 120 90 183 -255 -72 -153 6 -249 31 -142 266 336 -212 18 -243 -76 16 17 145 115
3476A15K07l68j03j01K22J6J95k80K3j80mL11k58J80j22J50J00K2k69K46k93J56
$$ 115 322 -46 -149 -250 -28 -12 183 -97 -74 -254 -258 53 -205 -25 -147 3 103 125 -144 102 -191 -35
3498c5K56j32L0j8N8j37j57L5L9J7J42o7J51k02j53J66l65L55j97K61K05k05j56
$$ -35 221 89 119 101 159 22 -135 -100 -61 -44 98 31 182 -20 -173 -7 -372 -17 -214 47 252 47 -109
3521a09j79j84J54N13j99q4M12j67j05j28J39M4N6j04n4K68k00Pj8j11n5J95n5
$$ -109 -288 -472 -318 195 -4 -88 324 157 52 -76 63 107 163 59 5 273 73 80 62 -49 -104 91 36
3544C6J18M8J7l66J49k1k43J84J94p2J17k55J5l93M16J6K67j12n6j11j86J57p7
$$ 36 154 202 219 -147 2 -19 -262 -78 116 44 161 -94 -79 -472 -56 -40 227 115 59 -52 -238 -81 -158
3567a58j7M21k53Q4p7K10l30j55K39J12N4j66J60M2j27o8k00j84M20k88K29K74
$$ -158 -175 246 -7 77 0 210 -120 -275 -36 76 130 -36 124 166 39 -29 -229 -413 7 -281 -52 222
3589B22j26k84K89j38L7k30L42j67J42J32l95L91l67K17j03L67j47P9j78m2k05
$$ 222 96 -188 101 -37 0 -230 112 -55 87 219 -176 215 -152 65 -38 329 182 261 83 41 -164
3610a64M4j47o9N00j77j27K60j93JR9j79l3N56j89R2l58J76k75J10K0K7j4J29
$$ -164 -120 -267 -336 164 -13 -140 120 -73 -72 27 -152 -185 371 182 274 -84 92 -183 -73 -53 -26 -40 89
3633H9K64n19N40m18k15nN28k09K48o3l24o1q6M8K97j62O5o8O2q3j83K70j00n5
$$ 89 353 -166 374 -44 -259 -264 264 55 303 240 -84 -145 -231 -183 114 -48 17 -51 11 -72 -255 15 -85 -140
3657a40M17j00l35K27or4K78l34K83J1J16m04R0J67j49j78L6J58n0K22j84j80
$$ -140 277 177 -158 69 63 -31 247 -87 196 207 323 -81 9 176 27 -151 -115 43 -7 215 31 -149
3679a49R8mo6om7K44k3j71J77j32k56M39j70R4K16j08R4m02O5Q6k8J21p9R1J44
$$ -149 -51 -55 -121 -127 -174 70 47 -124 53 -79 -335 104 -66 28 244 136 230 -172 -107 -21 -49 72 -7 84 228
3704B28J1n16L21l10J93J34Q6j72j0Q0j30q4k23L2K02J48L70l42K2j11K21k14
$$ 228 239 -277 44 -266 -73 61 147 -25 -35 45 -85 -169 -392 -360 -158 -10 360 18 40 -71 150 -64
3726f4J5J36j50L15k2j66l16N3J23J34K33j12kk08J4J68k57j5J00q7K97L6k27
$$ -64 -49 87 -63 252 230 64 -252 -199 -76 58 291 179 177 -31 -17 151 -106 -121 -21 -108 189 225 -2
3749bprj17j65K59J48K79j90m06J55K15m06L93j12l2n0K39J12n65K53k66N3J23
$$ -2 -9 -18 -135 -300 -41 107 386 196 -210 -55 160 -246 147 35 3 -47 192 304 -261 -8 -274 -221 -98
3772i8J25J57Lj94l03K46J07k17K21R7k44MJ25o9k7P1n7K09j82L56j54k47K77
$$ -98 27 184 187 -7 -310 -64 43 -174 47 144 -100 -96 29 -40 -67 4 -53 156 -26 330 176 -71 206
3795B06k14j2k9J97M2q8l37K20j28K99q4j96K77q7N2l62K6L33l12p8K20J32nk59
$$ 206 -8 -20 -49 148 190 102 -235 -15 -143 156 72 -124 153 66 118 -244 -218 115 -197 -275 -55 77 72 -187
3819a87K05J26k79j77Q3L72M4J2j90J11j7j62j3Q3J00o8L9k63J9M6Q0j26K53N6
$$ -187 18 144 -135 -312 -229 143 187 199 9 120 103 -59 -72 11 111 43 82 -181 -162 -116 -36 -162 91 147
3843A47n1p5k31N4K90l03n2L55r8j5K00k61J17k93J0K17J45o7L3q1p7l8J19m7
$$ 147 96 21 -210 -156 134 -169 -221 134 36 21 221 -40 77 -216 -206 11 156 89 122 41 -36 -74 45 -2
3867bn3P8j28L4P5k33K26q4j67J0M10q9M4k61P3J90l45J53q4J31L02k39M7j34
$$ -2 -55 23 -105 -71 4 -229 -3 -87 -254 -244 166 77 121 -140 -67 123 -222 -69 -153 -22 280 41 88 -46
3891d6j56K29j82K68J13K8l52R3k12J43n2M7r7M24l31J05J04l6l29K32k50J72
$$ -46 -202 27 -155 113 226 254 -98 -5 -217 -74 -126 -79 -176 248 -83 22 126 90 -239 -7 -257 -85
3913h5J35K3l6j31k9o7R5L17N6p7j15q6J22R6n47M10k26J88j15K74k26K32n6j97
$$ -85 50 73 37 -94 -123 -190 -95 222 278 201 86 0 122 218 -329 81 -145 43 -72 202 -24 208 152 -45
3937d5j46K43j90Q5J66k48m7mo8K02P4R1p0JK48n01J35M30j68j86R5M1j1j77k8
$$ -45 -191 52 -138 -53 113 -135 -182 -186 -254 -52 22 113 43 44 292 -209 -74 356 188 2 97 138 127 -50 -78
3962g8j5K08k77K00K49j24kl28m2J6j37M76j10k27K93j80j35M4l7J81L18j23L13
$$ -78 -93 115 -162 38 287 163 161 -167 -209 -193 -330 146 36 -191 102 -78 -213 -169 -206 -25 293 170 483
3985D83k95j62o9J02LN6j7rJ49q3j82m7k58K48R4r7J36J6M4m02L87k87P3K16j25
$$ 483 188 26 -43 59 62 118 101 92 241 158 -24 -71 -329 -81 13 -84 52 68 112 -290 97 -190 -117 99 -26
4010b6J51l22K38k74J87j58K5L31j29j62M85j31l17j89J76o4J46L22m23K72m4
$$ -26 125 -197 41 -233 -46 -204 -179 152 23 -139 346 215 -102 -291 -115 -179 -33 289 -134 138 94
4031I4k0k37J34o7Qj31K10J49k1k18m6k03K09L8J56Nj63j38K16j98P9J97J90k85
$$ 94 74 -163 -29 -96 -88 -219 -9 140 119 -99 -145 -348 -139 -101 55 60 -103 -241 -25 -223 -144 53 243 -42
4055d2J10O9p2l33K71j32J49j29K00J7m61O3L57j56J52j22J14j84L44k52J22q9
$$ -42 68 137 65 -268 3 -129 20 -109 91 108 -353 -290 67 -89 63 -59 55 -129 215 -37 85 -4
4077dkP6o7J79Kj52j38J98j60J05k0P0J36j39j31K6j04p2K4J98j2R4j14rj51p3
$$ -4 -6 70 3 182 184 32 -106 92 -68 37 17 87 223 84 -47 -21 -125 -197 -173 25 13 107 -7 -16 -167 -240
4103b40r2j9M31p1J38P8j5l57K18k48K35R5j68K71J4l41p0j23J80R9l4P1K01j61
$$ -240 -332 -351 80 9 147 225 210 -147 71 -177 58 153 -15 256 270 -71 -141 -264 -84 15 -19 52 253 92
4127I2m9l19q5N58m68L40o5P7J00N1n91L58J67J70l95L92k93J13l8m21L1L82K5
$$ 92 43 -276 -361 197 -271 69 4 81 181 232 -359 -1 166 336 -59 333 40 153 115 -306 -275 107 132
4150A32O4j7J4l61o9K20j20j30M17o5k24L10j23p0k60J98j28K89k46L97n8k33
$$ 132 196 179 193 -168 -237 -17 -137 -267 150 85 -139 171 48 -22 -282 -84 -212 77 -169 228 170 -63
4172f3L14l68r9M14k76q0J46K4Q6p2P9J78l15R4j43M0lnK92l18p0J84J3J2l3m17
$$ -63 251 -117 -216 198 -78 -158 -12 12 98 26 105 283 -32 62 -81 -41 -44 -49 243 -75 -145 39 52 64 31 -386
4198c86K57R4p8j0L86j10Q1k54Mj68J58P2PL4Qq6J58l64L6J02O3j62K1K10R3o9
$$ -386 -129 -35 -113 -123 263 153 234 -20 -16 -184 -26 46 53 87 95 9 167 -197 -161 -59 4 -158 -137 73 166 97
4224I7k14j07K8oK79j57J34l00M07l26Q6r5J86J65k10K39l79P1k18M23k88K88
$$ 97 -117 -224 -196 -202 77 -80 54 -246 161 -165 -79 -174 12 177 -33 206 -173 -102 -320 103 -185 103
4246A03Pk68J83K35k26J65m53j0J82j1O7j27J65k9j77J71q5k67K66K39J98m32
$$ 103 110 -158 25 260 34 199 -254 -264 -82 -93 -26 -153 12 -17 -194 -23 -108 -375 -109 130 328 -104
4268a04J07K2J18r3n4L6r2R1q3K09j20K2q1k95M23j21J49j0m8k51J59j4J09J34
$$ -104 3 25 143 50 -4 32 -60 31 -52 157 37 59 -22 -317 106 -15 134 124 76 -175 -16 -30 79 213
4292B13j23l22L43k72K9J1L8l0O01n53J68j49k31K43j06K06K13j31j51O4m5K4
$$ 213 90 -232 111 -161 -132 -121 -83 -113 488 -65 103 -46 -277 -34 -140 66 279 148 -3 61 16 40
4314D0K41k40l29K82L06l32j31J04j52K80J47k58J54p9J02o3k69K05K00m14K02
$$ 40 281 41 -288 -6 300 -32 -163 -59 -211 69 216 -42 112 33 135 72 -197 8 208 -206 -4
4335dN2J48j57M9k73L35j61J58r4K88l5l07j88P3L8O0Q6k54L13j08j73P8K2O5
$$ -4 48 196 39 88 -185 150 -11 147 53 341 306 -1 -189 -116 -78 -18 68 -186 127 19 -154 -76 -54 11
4359A1J09j06j19J04j34K87k19j49L10l13N27l63rQ8Q8j37k60J47J03L58k67K70
$$ 11 120 14 -105 -1 -135 152 -67 -216 94 -219 308 -55 -64 24 112 -25 -285 -138 -35 323 56 326
4381C26l08o6j63J20N1K70k88K8J77q0j68j92K2Q9J92pM69k73N9k14O1k63R9K91
$$ 326 18 -48 -211 -91 -40 230 -58 -30 147 67 -101 -293 -271 -182 10 3 472 199 258 44 105 -158 -59 232
4405B32k75K81k4l6k0l49J54n2L8O7J47l52R9q9K40k78n8M37M4k55N5m6j77J9
$$ 232 -43 238 214 178 158 -191 -37 -89 -51 16 163 -189 -90 -179 61 -217 -275 162 206 -49 6 -40 -217 -198
4429a98K33N3mp7K9J89m10J25K23k57K21j15j5P4o6j56K43k58K13P3p9J66K0m33
$$ -198 35 88 84 7 36 225 -185 -60 163 -94 127 12 -3 71 5 -151 92 -166 47 120 41 207 227 -206
4453b06K19M7j06l09K59J48J02P8l23P6j52k2N1J45J13o2l6l0k14QJ34L58l10
$$ -206 13 60 -46 -355 -96 52 154 232 -91 -15 -167 -189 -138 7 120 58 22 -8 -222 -214 -80 278 -32
4476c2%L28j32j42n1K3N9k90L18J13l60K56k1L0l36K24j29N9K8J00j41Ok82L38
$$ -32 -32 296 164 22 -29 -6 53 -237 81 194 -166 90 69 99 -237 -13 -142 -83 -55 45 -96 -90 -372 -34
4500c4K43m66K20M64p55M35R9m04J44J68J13k13K9j11j9J39m9l35M01j12pK04
$$ -34 209 -257 -37 427 -328 107 206 -198 -54 114 227 14 43 -68 -87 52 3 -332 69 -43 -50 154
4522A54j56P6Q7l47L11j87N3J92k08J13l3n4j15L38l2k84L28l48L39j93k25K82
$$ 154 -2 74 161 -186 125 -62 -9 183 -25 88 55 1 -114 224 192 -92 236 -112 227 34 -191 91
4544I1P7j56K2j1K60l27J76k45j51J21J38o9Q5K53l72O8j09J47J99P6j87j75K36
$$ 91 168 12 34 23 283 -44 132 -113 -264 -143 -5 -74 11 264 -108 -40 -149 -2 197 273 86 -89 147
4567A47P8k22j22Q7l8J22k4Ok26NN6j1j78M06j72K51M2k46J37j03j6Qm9K20m3
$$ 147 225 3 -119 -32 -70 52 28 34 -192 -187 -131 -142 -320 86 -86 165 207 -39 98 -5 -21 -13 -62 158 115
4592A15j23rK9l02J54K50l01L53N4l51r5J77j3P3K70k37M7K77m23J00j23o8K64
$$ 115 -8 -17 12 -290 -136 114 -187 166 220 -131 -226 -49 -62 11 281 44 91 368 -55 45 -78 -146 118
4615A18j5k41L17j96L7j29p9J16J27j42JJ35L9p6qp7o0J78J2j39j13M38k24R9
$$ 118 103 -138 179 -17 20 -109 -188 -72 55 -87 -86 49 88 12 4 -73 -133 45 57 -82 -195 243 19 118
4639A18l03P9M4K07j63L6j83P9J33j88M3oL6P1O9q6j02L5K10M9k79O9M9j52K28
$$ 118 -185 -106 -62 145 -18 18 -165 -86 47 -141 -98 -104 -68 3 72 -14 -116 -81 129 178 -101 -32 17 -135 93
4664I3J17o7m39J09J17L93J5k45k31j18K97l04L08J60k33p0K30k32k45K73j45
$$ 93 210 143 -296 -187 -70 323 338 93 -138 -256 41 -263 45 205 -28 -98 132 -100 -345 -72 -217
4685b17P4K69k80N35j80j20o1J14j11J53j61P9K52n4n00J51j69O3L42k21J8K85
$$ -217 -143 126 -154 381 201 81 20 134 23 176 15 94 346 292 -208 -57 -226 -163 179 -42 -24 261
4707B61j70q7N9k72P2K18mJ1O2k7o4P5l38P4J30J19O9j56M0l48J82K0k7R9K53
$$ 261 91 4 63 -209 -137 81 77 88 150 123 59 134 -204 -130 0 119 188 32 72 -276 -94 -74 -101 -2 251
4732B51Nm15K37j85J8M8k3J08O1Q5k12o4Q7m7k08K71l4O2p1j98J85PLJ27r6q8
$$ 251 256 -159 78 -107 -89 -41 -64 44 105 190 -22 -86 1 -46 -254 17 -17 45 -26 -224 -39 -32 -29 98 2 -86
4758h6L34j92q2n9n7r9L40j00J03k91K80J6n9j8J19L5P9l08J92l92R9K42k33K09
$$ -86 248 56 -26 -85 -142 -241 99 -1 102 -189 91 107 48 30 149 184 263 -45 147 -245 -146 96 -137 72
4782G2Q7j12l6J07k95L53j47j53J27m5q9K46r8o3O8q4j5K10j74k05K48M1K7O6
$$ 72 159 47 11 118 -177 176 29 -124 3 -42 -131 115 17 -46 22 -62 -77 133 -41 -246 2 43 70 136
4806A36k93K5O7j4P2J90j2m7m12J10J81j61Q9J39j64j44J27m0J81M0j67L01j30
$$ 136 -157 -132 -65 -79 -7 183 171 124 -288 -178 3 -158 -69 70 -94 -238 -111 -151 30 70 -97 204 74
4829G4k0J07l23L31j89k51L19n9j60J69K3p1j44J21K74q6j53K21j11j7O6k19l5
$$ 74 54 161 -162 169 -20 -271 48 -11 -171 -2 21 -50 -194 -73 201 115 -38 183 72 55 121 -98 -133
4852a33J15P9k3O4R2p5j40j22J38M3O9J01j49k30L10Kk12o8J35J49j04J21k18
$$ -133 -18 61 38 102 194 119 -21 -143 -5 38 107 208 59 -171 139 141 -71 -139 -4 145 41 162 -56
4875e6j11J14J46k3r6l23K51K14l62Q1Q3O5j27J35Q0j00n9j72L12k95K22M2j53
$$ -56 -167 -53 93 70 -26 -349 -98 116 -246 -165 -82 -17 -144 -9 71 -29 -88 -260 52 -243 -21 21 -132
4898a32K40k05K15k45lK21j05j59K85j86J41k9l58L2M33k1K8j28k3L08l30o6Q2
$$ -132 108 -97 118 -127 -130 91 -14 -173 112 -74 67 38 -320 -288 145 124 152 24 1 309 -21 -87 -5
4921eJ80k70K29l8j64K34j2k95N7l6J36J84j3j40L6n6j33L2J64k2J31k5r0p7L54
$$ -5 175 -95 134 96 -68 166 154 -141 -84 -120 16 200 187 47 83 27 -106 -74 90 68 199 174 84 7 361
4946C61k53k30Q5M4K7ok00J62J02k70J97p6%P1K7J7j12q2p5Q4J78L7p9j7k63L36
$$ 361 108 -122 -37 7 34 28 -172 -10 92 -178 19 -57 -57 14 41 58 -54 -136 -211 -127 51 88 9 -8 -271 65
4972F5j89K81m2j36m6K01l78j62P18k91j78K68J99n62J50K04J17k25k59L75j58
$$ 65 -124 157 115 -21 -67 134 -244 -406 312 21 -157 111 310 -252 -102 102 219 -6 -265 110 -48
4993d8K78j74j9P5k81J44n1l3J04k15L40n9l32J96M3j22O0K7J79p2O1J3k6n0J75
$$ -48 230 56 37 112 -169 -25 -76 -109 -5 -220 120 61 -271 -75 -32 -154 -94 -67 112 40 101 114 88 38 213
5018B13k27J22m7l6K43j52j0J20k98L35j22k48K24J6m04L96k38j9P2Q4p1j43J67
$$ 213 -14 108 61 25 268 116 106 226 -72 263 141 -107 117 133 -271 125 -113 -132 -60 24 -47 -190 -23
5041b3M2m5M6l4K29p0n7k69K13p9km7K24m49L10pJ37j06qk85P5K4K64n7J77j30
$$ -23 19 -26 20 -14 215 145 88 -181 32 -47 -49 -96 128 -321 -11 -18 119 13 5 -280 -205 -181 83 26 203 73
5067G3l33M92k36M0k81M23j02q1N7J00k33mJ60j63R9j77L46J46k25j4k70J68K08
$$ 73 -260 232 -4 36 -245 178 76 -5 52 152 -81 -85 75 -88 11 -166 180 326 101 87 -183 -15 193
5090A93k21J42O0k22J06l83O5K71k11L82q5j2Om7j97J15Q9l0M7R2r7k12N2L00
$$ 193 -28 114 174 -48 58 -325 -260 11 -200 182 97 85 91 44 -153 -38 51 21 68 160 63 -149 -97 203
5114B03l57j9L83j84NK71l12j79L64j72L7Lj05J92l55P1o6K1J37P4J07k43J14
$$ 203 -154 -173 210 26 31 302 -10 -189 175 3 40 43 -62 130 -225 -154 -220 -199 -62 12 119 -124 -10
5137a0or7k94N38l20J09j4L06j38n1J54n5J6l18K85K54n54J48L09m82L51k10J68
$$ -10 -16 -113 -407 131 -189 -80 -94 212 74 23 177 122 138 -180 105 359 -195 -47 262 -220 131 -79 89
5160H9M3k15R1J23K6k32q0p3l3K33N5J65k15K19l46n0J25K11Rp6n6k59J11L16
$$ 89 132 -83 8 131 157 -75 -155 -228 -261 -28 27 192 -23 196 -150 -200 -75 136 145 69 13 -246 -135 181
5184A81k06J29j1k20J02n9L39l89J63r1j76K54j1M4P7L9l52K68J75l05Q7L23m62
$$ 181 -25 104 93 -127 -25 -84 255 -134 29 -62 -238 16 5 49 126 165 -187 81 256 -49 38 361 -101
5207a01J28j30J60oo2O8K3J35k42K5N4M6j92Q8J91ql55M43j74l77L31J17j89k00
$$ -101 27 -103 57 51 -11 57 80 215 -27 -2 52 98 -94 -6 185 177 -178 265 91 -286 45 162 -27 -227
5231b27J65R1k39K96j66K07l7j38Q4J26k07j08J87q7JJJ05k9l1m3K11j81k4j51
$$ -227 -62 29 -210 86 -80 127 90 -48 36 162 -45 -153 34 -53 -52 -51 54 25 -6 -49 162 -19 -43 -194
5255a94N1J98j88J52j60P8J63k1k09J25N7P5L4N5Mk65K97k89mK80j10j02k9OK4
$$ -194 -143 55 -133 19 -141 -63 100 79 -130 -5 52 127 161 216 220 -45 252 -37 -41 239 129 27 -2 4 28
5280B8j06M4q5J22k5J24O8k74m9r3L29K02j47l1k8m2Q6m94J98K18n5K96l22M5
$$ 28 -78 -34 -119 3 -22 102 170 -104 -153 -246 83 285 138 107 79 37 123 -371 -173 45 -10 286 -36 9
5304Ip5m1Q9J30Pj15k0J7q6J50q7m6J97J0P4j80K62n66J09J51K6O3j16J66l47
$$ 9 -66 -107 -18 112 119 4 -16 1 -85 65 -22 -68 129 139 213 33 295 -271 -162 -11 15 78 -38 128 -219
5329b19J77L6Q1Q1k24M9k45L69jJ44l87K03k54k7J01kJ47k77M01j2n2O1k88P0
$$ -219 -42 -6 75 156 -68 -19 -264 105 104 248 -139 64 -190 -217 -116 -118 29 -248 153 141 89 150 -138 -68
5353f8r5K67j23Q5J9m15K33k23J94L17J08j43j6L5n5j39j38K82r1j7J66m12J90
$$ -68 -163 104 -19 66 85 -330 -97 -320 -126 191 299 156 140 175 120 -19 -157 125 34 17 183 -229 -39
5376c9M8j5J48k68K60k21n5k5K32n3k60K43J42l9j54p8O5N6J22j91K8m5M4r7J80
$$ -39 9 -6 142 -126 134 -87 -142 -167 65 12 -248 -5 137 98 -56 -134 -69 -13 109 -82 -54 -99 -55 -152 28
5401B8k82L17o3j28J13N9Q6J96j97L0Pj18j48J98j17M0n6n7K42r3rj70P3j58K75
$$ 28 -254 63 0 -128 -15 44 130 326 129 159 166 48 -100 98 -19 21 -35 -92 150 57 48 -122 -49 -207 68
5426F8j86K09p4k68K42J8j62J21N4mn3J08jj58j60M36k64J27L6J6O7r5m8Q9l68
$$ 68 -118 91 17 -251 -9 9 -153 -32 22 18 -35 73 72 -86 -246 190 -74 53 89 105 172 77 29 118 -250
5451b50K42n0J76j4j75l9J72j10j28M37k87m2K76k88K83j06l22J97J8J45n4K1
$$ -250 -8 -58 118 104 -71 -110 62 -48 -176 261 -26 -68 208 -80 203 97 -225 -28 -10 135 81 102
5473A02k97L66r2j49K17l1n7J3J31j50K06k70R1J58j04J41j90l51K86k2o4o4J57
$$ 102 -195 171 79 -70 147 116 59 72 203 53 259 -11 80 238 134 275 85 -266 20 -2 -66 -130 27
5496B7N5p8J38l76J26K15j16M3m5o7o4kN5J81j97j03J6P0J56j39K47l56J35J24
$$ 27 82 4 142 -234 -108 107 -9 34 -11 -78 -142 -144 -89 92 -105 -208 -192 -122 34 -105 142 -214 -79 45
5520D5J2k4R7l70N0J96j9j40k3J43k70N72j79j42J25j26J40M6k75L81l00n5O4
$$ 45 57 33 130 -240 -190 6 -13 -153 -176 -33 -303 269 90 -52 73 -53 87 133 -142 239 -61 -116 -52
5543e2j89L10r1p3J54J12k96J18N5N8l30J29p2M51j22k08K15k16o3R8p3K26j93
$$ -52 -241 69 -22 -95 59 171 -125 -7 48 106 -224 -95 -167 284 162 -46 169 -47 -110 -12 -85 141 -52
5566e2O6J08L4j64N5J73m07J75j00K15J84j41l16K06q4J13o7k26J86J94k88K72
$$ -52 14 122 156 -8 47 220 -187 -12 -112 103 287 146 -170 36 -48 65 -2 -228 -42 152 -136 136
5588A36O8l19J12j40J49J48P7l45P7K06l71K93q2K03J56k83N9n0J8m02L09L33
$$ 136 204 -115 -3 -143 6 154 231 -114 -37 169 -202 91 9 212 368 85 144 94 112 -290 19 352
5610C52l19k05K10o3J49o1j45O0L0P7L6j63J01k77K41r9K86j90m9p3J81j89Q7
$$ 352 33 -172 38 -25 124 63 -82 -22 8 85 121 -42 59 -218 23 -76 210 20 -29 -102 79 -110 -23
5633b3nJ13j72O3n6L9J40L4k63Q9j50q7J97J4K60k56K33m42J40J66O0J47m59J60
$$ -23 -28 85 -87 -24 -80 -41 99 133 -130 -41 -191 -278 -81 -67 193 -63 170 -272 -132 34 94 241 -218 -58
5657e8K20q0k46K44m8k36M21p6j05N9o6j17n5K98l03K12j1l67K36P0L45l13N6
$$ -58 162 82 -164 80 32 -204 217 141 36 95 29 -88 -143 155 -148 64 53 -314 -78 -8 337 24 80
5680H0k83Q6k5P1N8j76j30J99K02Q7l58J36J45k20J88j36L82l77j11J30J90J8
$$ 80 -203 -117 -142 -71 -13 -189 -319 -120 82 169 -189 -53 92 -128 60 -76 306 -71 -182 -52 138 156
5702A56m04K43L4K09j87J66n1j33K45k24R0o7j95K59j41N9j11m9J59k09K0L32
$$ 156 -248 -5 29 238 51 217 166 33 278 54 144 77 -118 141 0 59 -52 -101 58 -151 -131 201
5724B01j80Q5j9R0m94L61J23p9l4j42K41k5q0j45RN9j67R9K40J14l40K0L2j24
$$ 201 21 106 87 177 -317 44 167 88 54 -88 153 128 48 -97 -88 -29 -196 -97 143 257 -83 -63 -31 -155
5748a55R8K11k45P4mJ36k98K00j29LM00j88q1%K33k13j62J78J20j14K58k0m47
$$ -155 -57 154 -91 -17 -21 115 -183 17 -112 -109 291 103 22 22 255 42 -120 58 178 64 322 302 -145
5771a45L56j44j39J06j74M29k70j4n0J04j60j50J51J84L7j59J77j23k7p5j76N25
$$ -145 211 67 -72 34 -140 289 19 5 -45 59 -101 -251 -100 84 121 -38 139 16 -11 -86 -262 263
5793B63l43M28l88N1j2J8J54j08j23p1K8J1L08m42P2J2J16o7Q0M6Q0l56J45k4
$$ 263 -80 348 -40 11 -1 17 171 63 -60 -131 -103 -92 216 -226 -154 -142 -26 -93 -13 33 113 -243 -98 -122
5817a22J47p3J41J22k62J93J4l38J78j82P9L67m01M47k50N8l3j83J71l8O5l79
$$ -122 25 -48 93 215 -47 146 160 -178 0 -182 -103 264 -137 310 60 118 85 -98 73 35 100 -279
5839b79M05j18j97K10r1J58p0J08K1l90J73J40j05J43j72J67j46p6J17K27m18
$$ -279 126 8 -189 21 -70 88 18 126 147 -243 -70 70 -35 108 -64 103 -43 -119 -2 225 -193
5860a93K48l71O9L6J32PJ35k9j18k2P4j27J9J14M8n8J34j3j61o7M5L18j18l10
$$ -193 55 -316 -247 -211 -79 -72 63 34 -84 -106 -32 -159 -140 -26 22 -36 98 85 -76 -143 -98 220 102 -208
5884b08K09M8j47k6N2n9K92Q1r5q9j16J17k07M0O4J94L6k36j18L40m1j59j69K93
$$ -208 1 49 -98 -124 -72 -131 161 242 147 58 -58 59 -148 -108 -44 150 186 -50 -168 172 131 -28 -197 96
5908I6j62J98k22%J08k41L60J40l05J61k48n9j4N2L9J78j06l9J53P0m25K60M4
$$ 96 -66 132 -90 -90 18 -223 137 277 -28 133 -115 -174 -188 -136 -97 81 -25 -64 89 159 -266 -6 38
5931C8l2N1M8p4r6J10J3j61J88j57R7J82k72J45j80J61j37p3q1K14P7j74J3J77
$$ 38 6 57 105 31 -65 45 58 -103 85 -72 25 207 -65 80 -100 61 -76 -149 -230 -16 61 -113 -100 77
5955G7R2n9j75j36L47j2m6k12L84k03L4j60J16n1M6J7M8j71q3O7j30K68K6j38
$$ 77 169 110 -65 -201 146 134 88 -124 260 57 91 -69 47 -4 42 59 107 -64 -147 -80 -210 58 84 -54
5979e4J51q1J06j80O4N3j79J37j62L71k13k23O3J61P5Mp4P0N3q4L8l25L46m9J71
$$ -54 97 16 122 -58 6 59 -120 17 -145 226 13 -210 -147 14 89 93 19 89 142 58 96 -229 117 68 239
6004B39k03J68k88J53M4L3n6m6M3j95K60K5j2k90K74k48J74j17j07K83j87K06
$$ 239 36 204 -84 69 113 146 90 44 87 -108 152 177 165 -125 149 -99 75 -42 -149 134 -53 153
6026A53L7j19j26J88j78O9L9j51J32l7O3N0j58p7M50k67J60m98K46P0n0Q5j76
$$ 153 190 71 -55 133 -45 24 63 -88 44 7 70 120 -38 -115 335 68 228 -270 -24 46 -4 81 -95
6049i5J35q6m1L52o1l55K1O2J16p0J02k06J62J88j98J0k85K89j19K77L1k84P7
$$ -95 40 -46 -87 265 204 -151 -130 -68 48 -22 80 -126 36 224 26 36 -249 40 -79 198 229 -55 22
6072B2n2J24k79n3K48L8j70r3K82j55K48k30Q8J70m3q3O7k66K54k60pj84K25K19
$$ 22 -30 94 -185 -238 10 48 -122 -215 67 -88 160 -70 18 188 145 62 129 -137 117 -143 -150 -334 -109 110
6096A10j88J13r6K55j70L93o04L01l22K29J8r8J32j89J45j34K57l3j53p5J45j8
$$ 110 -78 35 -61 194 24 417 -187 114 -208 21 39 -59 73 -116 29 -105 152 119 -34 -109 36 18
6118A8j71M64m65J83L5kp3o3J49K4j2k97K23M5J1r3L2J55l10K76q6m8l9k44K95
$$ 18 -153 311 -154 29 64 62 -11 -74 75 99 87 -210 13 58 69 -24 8 163 -147 129 43 -5 -44 -288 7
6143GO2j68L49l52j90L42p3J05j39k68K39PJ53J00j42k2p0R1j18l56N43r7ol14
$$ 7 69 -99 250 -102 -292 50 -23 82 -57 -325 -86 -79 74 174 32 10 -60 31 -87 -443 100 3 -3 -317
6167c17M43j6k35P9J72j68J00J95m34K69J48k33K79j55j86K0L21j12n6J61p4k17
$$ -317 126 110 -125 -46 126 -42 58 253 -181 88 236 3 282 127 -59 -39 282 170 114 275 201 -16
6189a6J32l19L86j0j88j40J39N5J00M3k36K90j15k3J24j8l31R1J52k04J63o3O6
$$ -16 116 -203 183 173 -15 -155 -16 39 139 182 -54 236 121 98 222 204 -127 -36 116 -88 75 12 78
6212G8j36K19j09L3r9J99k4n7N3l40M01k22M4q9j11J37k12J34J86k88L23k07J70
$$ 78 -58 161 52 85 -14 185 161 104 157 -183 218 -4 40 -49 -160 -23 -235 -101 85 -203 120 -87 83
6235H3M3m83M42j48J85k17L8n0K5j4K33j96N1P1k08M74l98K22l75j6K44j71L5
$$ 83 126 -357 85 -63 122 -95 -57 -107 -82 -96 137 -59 -8 63 -145 329 -69 153 -222 -238 6 -165 -130
6258a30J29K19n39K87K36l13J9J05o1nO9K01k49R7P9j20o8j71j61J46L10J8j5
$$ -130 -1 218 -321 -34 202 -111 -92 13 -48 -53 16 217 -32 65 144 24 -44 -215 -376 -230 80 98 83
6281H3L9q3k19j4M11l20K54l8J9QM0k62j9J09j20L22l74J90q2j93j16M59k41M0
$$ 83 122 39 -180 -194 217 -103 151 113 132 140 180 -82 -101 8 -112 210 -164 26 -56 -249 -365 94 -147 -107
6305a07J10J48k53J88l0k99N35m5k04j73M19k08j67R8k8l9r6K64o5Lj0r5MJ09
$$ -107 3 151 -102 86 56 -243 292 247 43 -130 289 81 -86 12 -16 -55 -151 113 48 51 41 -54 -50 59
6329E9n8N5Jj0r2l3J71k0k86N12k53M5j81R1m2M4L1j68L04l77R6J64p6rK47j00
$$ 59 1 56 57 47 -45 -78 93 73 -213 299 46 91 -90 1 -41 3 34 -134 170 -207 -111 53 -23 -32 215 115
6355A15o1M9q1o1J53k9o0k70M46q0j54m7J2nL1M8oj63K86j07l0K13O4l12n7K73
$$ 115 54 103 22 -39 114 85 25 -245 201 121 -33 -80 -68 -73 -42 6 0 -163 123 16 -14 199 263 -49 -106 167
6381A67k47n6m1J28j7K53k77P9jk4m1N1J78J02m17J27J05j38p8J52R5k65Q4J78
$$ 167 -80 -136 -177 -49 -66 187 -90 -11 -12 -36 -77 -26 152 254 -163 -36 69 -69 -147 5 100 -165 -81 97
6405I7J02l83J26L4l1J26j43J92j53J69R8k08k58N5N4N8J67j54j56L09j84k36
$$ 97 199 -184 -58 -24 -55 71 -72 120 -33 136 234 26 -232 -177 -123 -65 102 -52 -208 101 -83 -319
6427c19P40m47Q3P7m02K75q1OJ20j28J45p9J1R0k39j01J77j59M10m22J82K6Q4
$$ -319 421 -26 57 134 -268 7 -74 -68 52 -76 69 -10 1 91 -148 -249 -72 -231 179 -243 -61 -35 49
6450D9k40K15J37j39m4n2K14J28k04n9O9K3l33K08j9J7l4J25J6l87J92K74l18
$$ 49 -191 24 161 22 -22 -74 140 268 64 5 74 97 -236 -28 -47 -30 -64 61 77 -310 -118 156 -162
6473a62M27l75J39K06q2k42k4J62j35L31m51O2n7K25j7q6R4J05o9O2r8k85L54
$$ -162 265 -110 29 235 153 -89 -113 49 -86 245 -206 -144 -201 24 7 -79 15 120 51 113 15 -270 84
6496H4k4j0L6k1j59Q0j05K46p3l04L38q2J76k99K36k97j7l2K61j8r1P3q7K04j4
$$ 84 60 50 86 65 -94 -14 -119 127 54 -250 88 6 182 -117 119 -178 -195 -227 34 16 -75 -2 -89 115 101
6521A01r2j70K28R8J15k13k46K60j03Q8N8k1j9k08m4J14J31K5j25J76o0k80M33
$$ 101 9 -161 67 165 280 67 -179 81 -22 66 124 103 84 -124 -168 -54 77 102 -23 153 93 -187 246
6544B46j24k78k7J95R0k47K25OP5j17j71K66P6k95L17k58K09k13J4j86J78j1K89
$$ 246 122 -156 -183 12 102 -145 80 86 161 44 -127 139 215 -80 237 -21 188 -25 -11 -197 -19 -30 259
6567B59K3k20J55l82P4k66J85K51l01N11k18q2R4n4l4pj9k23K65j09J52j93K9
$$ 259 282 62 217 -165 -91 -357 -172 79 -222 289 71 -11 83 29 -5 -12 -31 -254 11 -98 54 -139 -110
6590a10K25N0l33K31K68l78J12J90l19PJ04j06L4j15L36l48L8J4j65J70r7L26
$$ -110 115 165 -168 63 331 -47 65 255 -64 -57 47 -59 -25 -140 196 -152 -114 -100 -265 -95 -192 134
6612A34k78K83J11j95p6K33j99L01m35L18k87p4L3O6j52K67L1j18k71M00M4M6
$$ 134 -144 139 250 55 -21 212 13 314 -121 197 -90 -164 -131 -65 -217 50 81 -37 -308 92 136 182
6634A82j84L10m03P5J61j83K09l02L0j09K70j16O8k03J63J75P8k10q6J21k4n5
$$ 182 -2 308 -95 -20 141 -42 167 -135 -105 -214 56 -60 8 -195 -32 143 221 11 -75 46 22 -33
6656c3o8K55P4k60J08l55K94j00N0N5k52J15n0R0J3q7Q5L59k04k1j53K15k6m7
$$ -33 -101 154 228 -32 76 -279 15 -85 -35 20 -232 -117 -167 -77 -64 -151 -66 293 89 68 -85 130 104 57
6680E7j29L18j26O6r4J4k58J08J11j53j10O6L28j3k15K5K46j37nL6j71R5Nj41
$$ 57 -72 246 120 186 92 106 -152 -44 67 -86 -196 -130 198 185 -30 -5 241 104 99 135 -36 59 64 -77
6704g7k5L92k25l52M58k77ro2M17j99o2k02J63L6j78L45m02M6J53J34p8J66k74
$$ -77 -102 290 65 -287 171 -106 -115 -177 240 41 -21 -223 -60 -24 -202 143 -259 -213 -60 74 -4 162 -112
6727a12jJ11k40l0K53J72q5l47L20q7J65k88J92j18J0M5L27l60pK68n7o5j00J36
$$ -112 -113 -2 -242 -272 -19 153 68 -279 41 -46 119 -169 23 -95 -85 -40 287 -73 -80 188 131 66 -34 102
6751A02m0j09Q6j39K92j45p1l20L25K39k97K32l2J76k37J05k24P0J47P2j40q2
$$ 102 62 -47 39 -100 192 47 -24 -344 -19 220 -77 155 123 299 62 167 -57 13 160 232 92 10
6773A0O8j66j02K29N7j28M54o77P6N0j7m9K92p3Lk19J52J34l13K63ro7L7J03L8
$$ 10 78 -88 -190 39 96 -32 422 -255 -179 -129 -146 -195 97 24 27 -192 -40 94 -219 44 35 -32 5 108 146
6798A46k33p1J18K95l63l2K21l30L90l3j15J19O4k95L50j20j03o4PK14l17O7m
$$ 146 -87 -158 -40 255 -108 -140 81 -249 141 108 -7 112 176 -119 231 111 8 -56 -49 165 -152 -85 -89
6821h9J75O9m6L6k5l4j4k31J18L1k8K15j20k35K54k00%K29j02k19J63NL0l3l5
$$ -89 86 155 109 145 120 86 72 -159 -41 -10 -38 177 57 -178 76 -124 -124 105 3 -216 -53 -48 -18 -51 -86
6846h6K86l87J13K64L9j23n4k18J9J39o6Q6J36j56jK93m18L05j47N0Nk21L15j07
$$ -86 200 -187 -74 190 229 106 52 -166 -147 -8 -74 12 148 -8 -9 284 -134 171 24 74 79 -142 173 66
6870F6k2n2K71k77K06k02J31p2l27Q3OL70j31j84K67j13j06j0O7j54O6J78k40
$$ 66 44 -8 263 -14 192 -10 121 49 -278 -195 -189 181 50 -134 133 20 -86 -96 -29 -183 -117 61 -179
6893a79K21j6oJ58mm47K32L2L0J78Lk20O5j98m1K91j24m7Q3J27Nj34O1n5rJN6
$$ -179 42 26 20 178 174 -273 -41 -9 21 199 202 -18 47 -151 -192 99 -25 -72 11 138 143 9 70 15 6 7 63
6920F3J74l51J82K5r3j99Q5J22n1J26q2k4j76J25o0J16J44j99J78R1k16P4J37
$$ 63 237 -114 68 93 0 -199 -114 8 -43 83 1 -23 -199 -74 -134 -18 126 -73 105 196 -20 54 191
6943A91j86o6j02L02m4p9j87J43m9N7l9o5N0k36J38L44l37L60k35R2j09L59j53
$$ 191 5 -61 -163 139 95 16 -171 -28 -77 -20 -59 -124 -74 -310 -172 172 -165 195 -40 52 -57 302 149
6966A49k6Lk97J47n3K83j67J1J20p2J6k64K96o3k21J49j01J90q7r8K4K15j29k15
$$ 149 123 126 -171 -24 -77 206 39 50 170 98 114 -150 146 83 -138 11 -90 100 13 -85 -61 154 25 -190
6990a90J84J33m0j12m5P9K00k82p7L65o0j34k95J45R5O0m9J01M6R8l13M46o72
$$ -190 -6 127 87 -25 -70 9 209 -73 -150 215 155 21 -274 -129 -34 26 -23 78 124 222 -91 355 -317
7013c17K85L00k98K41k17J29k25J59j17J74j73L35j41ok53L24l47J38j58J84L
$$ -317 -32 268 -30 211 -6 123 -102 57 -60 114 -59 276 135 129 -124 200 -147 -9 -167 17 20
7034B0N6k22k7Q8Q8K23k29m9J94r1J54rj66j75L22q3Q3j90k5P5Lq1r3J05Qm2K9
$$ 20 76 -146 -173 -85 3 226 -3 -52 142 51 205 196 30 -145 177 94 177 -13 -38 37 40 -41 -134 -29 -21 -63 -34
7061c4J51M0k40J65j40j26K70r5j04Q3k84J90J31Rj2K42k07N2l3l14K01K01j72
$$ -34 117 157 -83 82 -58 -184 86 -9 -113 -30 -314 -124 7 16 4 246 39 91 58 -256 -55 146 -26
7084b6k96K44K35n8j8k04J53M19m40J06k9j49j43J87M6O6n3M6k10R3m4L0J12J24
$$ -26 -322 -78 157 99 81 -123 30 449 9 115 86 -63 -206 -19 27 93 40 86 -124 -31 -75 -45 67 191
7108A91k41o6J81o9m9O5p6O0j01j1J76q8K43mm30J40R4J1p2nK49j83pr0J98J16
$$ 191 -50 -116 65 -4 -53 12 -64 -4 -105 -116 60 -28 215 211 -219 -79 15 26 -46 -51 198 15 8 -82 116 232
7134B32j81P8k55j50J60j06J06K22j24J0M4r4q8K02l3K84m25J54j94J84p5o1O9
$$ 232 51 129 -126 -276 -116 -222 -116 106 -18 -8 36 -58 -146 56 23 307 -118 36 -158 26 -49 -110 -41
7157d1N8J7N3K5k68j0K08K2L3j90M15m65Q3M5n7p5J02K84k78j66L90k09j15K88
$$ -41 17 34 87 112 -156 -166 42 64 97 -93 322 -143 -60 -15 -72 -147 -45 239 -39 -205 185 -24 -139 149
7181A49q9Q6k19MJ50j35k2J27m5n2k9m3K54j89K3P9n7r3J49m89L68j0J15l4L3
$$ 149 60 146 -73 -69 81 -54 -76 51 6 -46 -75 -118 136 -53 -30 49 -8 -101 48 -441 -73 -83 32 -2 31
7206C1j62J09J32p1j34P9q8KN1K44k55l6J40j53J39j36L5k1N6l0M2O8j71J23j21
$$ 31 -131 -22 110 39 -95 -16 -104 -102 -51 193 -62 -98 42 -111 28 -108 -73 -94 -38 -68 -26 42 -129 -6 -127
7231a27O1LK7O5N3l3k48K81n5j74j3K09R1o3j45K97j65j26NL30k98O9Q3j72K12
$$ -127 -66 -63 -36 29 82 49 -199 82 27 -147 -160 49 140 77 -68 229 64 -62 -57 273 -25 44 127 -45 167
7256A67k82M76n44K6K37j57O8J10j04p2J11L1j50k6J64n6j62K5j01L54K36l91
$$ 167 -115 361 -183 -157 80 -77 -9 101 -3 -75 36 67 -83 -109 55 -1 -163 -138 -239 115 351 -40
7278d0Q3r2P7k00j39K79Qq8OK83p0O9k23j94K08J42k61J39j9J43J08l05L1p5K37
$$ -40 43 -49 28 -172 -311 -32 -24 -112 -106 177 107 176 -47 -241 -33 109 -152 -13 -32 111 219 -86 -55 -130 107
7303A07k38J30m1K5J09l03L83k7j82J45j64OJ35k13K40l5jN9n7l07M46l20J83
$$ 107 -131 -1 -42 -17 92 -211 172 145 -37 108 -56 -50 85 -128 112 77 76 135 78 -229 217 -103 80
7326H0j43P1j39J22J3Q3m75M24jk28L3K19k2q0P6LK18k22O0j24K08k56j6J96j2
$$ 80 -63 8 -131 -9 4 87 -388 36 35 -193 -160 59 37 -43 33 36 254 32 92 -32 176 -80 -96 100 88
7351H8k3j58j7K02k7O1kj02j42M7L1J29j01j0P9j07J1N7o5n2J80j83L14j35O9
$$ 88 65 -93 -110 92 65 126 124 22 -120 -73 -42 87 -14 -24 55 -52 -41 16 -49 -101 79 -104 210 75 144
7376A44k8j77o8J51j22K11k67J02r7J40PM8J05r9KM8j35MN1r5J09p2K9m0R5j41
$$ 144 116 -61 -129 22 -100 111 -156 -54 -151 -11 -4 44 149 50 52 100 -35 -31 20 -75 34 -38 -9 -49 46 -95
7402i5L13n0k98J27j31j24L58k80J59J99m62K83n8J92O7m49L13K4l07j0J53J9
$$ -95 218 168 -130 -3 -134 -258 100 -180 -21 178 -284 -1 -59 133 200 -249 64 88 -219 -229 -76 -57
7424e7o2J22M7j68K3J44l91N13l04R3p2K8k7K72p6lk10J56j5K2rr4n1M2K16r2
$$ -57 -119 3 50 -118 -95 49 -342 171 -133 -40 -112 -84 -111 161 85 82 -128 28 13 35 26 -68 -119 -77 139 47
7450D7j26J99l04J15P7K02l7j26n1j32J96p6o9k2jR4J98N7l32kJ29o9M06k49k02
$$ 47 -79 120 -184 -69 8 210 173 47 -4 -136 60 -16 -85 -107 -108 -14 184 241 -91 -93 36 -33 373 124 -78
7475g8J85k09J35M2K4j37n8q0L50j70p4Q7o0L29k79J25L4j80R5p7j84N0N8K12
$$ -78 107 -102 33 75 99 -38 -96 -176 174 4 -70 17 -43 286 7 132 166 -14 81 4 -180 -130 -72 140
7499A40N3n5n6j61K77k79J36j14p5K57p1Q8k45J87n9k06J92J09R3k98N7J82nk11
$$ 140 193 138 82 -79 198 -81 55 -59 -134 123 52 140 -105 82 23 -183 9 118 211 -87 -30 152 147 -64
7523f4p7K25k16J86j25N1m5K2N5j19K54j35K6J27k65J15J77k90O0P0l1J53l29
$$ -64 -141 84 -132 54 -71 -20 -65 -43 12 -107 147 12 38 165 -100 15 192 -98 -38 32 1 154 -175
7546a75J34K82l19n7J70K3q3Q0k21K42j70J77J35j45m1n5K8n8K15o0m18K88k46
$$ -175 -41 241 -78 -135 35 58 -25 55 -166 76 -94 83 218 73 32 -23 5 -53 162 102 -316 -28 -274
7569b74J57J16l7m3J66k58J37J06k55L27k10J58j04P1j16QK02L0m31L96l53j36
$$ -274 -117 -1 -38 -81 85 -173 -36 70 -185 142 -68 90 -14 57 -59 -51 151 181 -250 146 -207 -343
7591c43M27O0j77P5k16M18j69j40K16q4Kj77J61j53J2K57j14n7j59K05K16j41
$$ -343 84 144 -33 42 -174 244 75 -65 151 67 69 -108 53 -100 -88 169 55 -2 -161 44 260 119
7613A19K24l91RR3q3P7Mj06J20Qk8r4J26m8J6r5L2o7m3K70J97m39o9K10k7J1N8
$$ 119 343 -48 -39 54 -29 48 52 -54 66 74 46 -48 78 30 46 -49 -17 -84 -127 143 340 -99 -168 42 15 26 84
7640H4q6j04K6L8k58K25Q7m6m0J52Q2k82J1P1O9k01L79j42m3j53R7j4Q5j06J26
$$ 84 -2 -106 -80 -42 -300 -75 12 -34 -74 78 160 -122 -111 -40 29 -172 207 65 22 -131 -34 -48 37 -69 57
7665E7M1j97m7J6j2K26l2J75l57K1J32M3k97K09m0NM7K18k94J20K21j72k36L26
$$ 57 98 -99 -146 -130 -142 84 52 227 -130 -109 23 66 -231 -22 -62 -57 -10 208 -86 34 255 83 -153 173
7689A73k61qJ22J12l25L05j37J86m8r1j95K98j25L3q5J00J24o2k14O2J53j20j05
$$ 173 -88 -96 26 138 -187 118 -19 167 119 28 -167 131 6 39 -46 54 178 116 -98 -36 117 -3 -108
7712a08k5J95q3J52j18j3j13J33j55L97l44J39j15L7j32L03j64j50J21R9J13m3
$$ -108 -133 62 -21 131 13 0 -113 20 -135 262 -82 57 -58 -21 -153 150 -14 -164 -43 56 169 126
7734A26j83j8L2J48J14k82O9j2L4k3J22k66r1M79n1k21J10N4l09J91k71J24J93
$$ 126 -57 -75 -43 105 219 -63 6 -6 28 5 127 -139 -230 249 198 -23 87 141 -168 23 -248 -124 69
7757F9r6j40J79o5Q0r0L42Pp7k84l3J92q4J29l49L30Q6j36o6K13j64l70L59p9
$$ 69 -27 -167 12 -53 27 -63 279 286 209 -75 -108 84 0 129 -220 110 196 60 -6 207 43 -327 32 -47
7781d7P6O3OKK95l67J12N6k48J07K20m15J87J40l14K23N2q3p6k39K30r8kK49j6
$$ -47 29 92 98 100 395 28 140 196 -52 55 275 -140 47 187 -127 96 148 65 -11 -250 -20 -118 -120 129 113
7806A13o3j1J0N1m86M87j77p1N45m57K76l26Q2N0j48j0J62k1m4o7L20l56N8J19
$$ 113 50 39 49 100 -386 101 -76 -147 398 -59 217 -109 -27 23 -125 -135 27 6 -38 -105 215 -141 -83 36
7830C6n1l4P0l9J22j60m3L94l01k44K82k17J28q3P7K10qj56L7J60k16k4q7P4K49
$$ 36 -15 -49 21 -18 104 -56 -99 295 -6 -250 32 -185 -57 -140 -63 147 139 -17 20 180 -36 -60 -147 -73 176
7855A76N9l59L3K05j05j97Q8J88j21n3L00m35J54J80N9L1k93J01j24J38j84j2
$$ 176 235 -124 -91 114 9 -188 -100 88 -33 -86 214 -221 -67 113 172 203 -90 11 -113 25 -159 -171
7877a71K80k20L50p5n1j31J97l5j38P0j20r7K52Q4k69L4l2L29k16M3q6k8K2j52
$$ -171 109 -111 239 164 113 -18 179 144 6 76 -44 -141 111 195 -74 -40 -72 257 41 84 -2 -30 -8 -160
7901a60K7K78k02J89r1MP8p2o3k9N4L8k27J27j7j8K70k61Q3L1j47N2O8J74k20
$$ -160 -133 145 -57 132 41 45 123 51 -12 -41 13 51 -176 -49 -66 -84 186 -75 8 39 -108 -56 12 186 -34
7926c4M2K65j2m24M95m36oJ8Q3m2q7M07m90L75j30j17j22L19j9j98K2J36j12J74
$$ -34 8 273 261 -163 332 -104 -110 -92 -9 -51 -138 269 -221 154 24 -93 -215 104 85 -113 -91 45 -67 107
7950A07%n7J23j2l16K85k27J0P1j49J52qK6M%K20j48O0N8l72K13r7M0j4J91m3
$$ 107 107 50 173 161 -155 130 -97 -87 -16 -165 -13 -21 5 9 9 229 81 141 199 -173 40 -57 -17 -31 160 117
7976A17j38k16R4L47p6j66Q5J73k69R6J30q8j20MK81j50N8K6j74j03j24M11J82
$$ 117 -21 -237 -143 204 128 -38 47 220 -49 47 177 89 -31 -27 254 104 162 188 14 -89 -213 198 380
7999C80j70k33k8l3m6L62k18j20p8K09J25p0j98J8J13J6j47RK03N1k4l32L81m9
$$ 380 210 -23 -51 -84 -130 232 14 -106 -184 25 150 80 -118 -100 13 29 -118 -109 94 145 121 -211 170 121
8023A21j26n7j8K42j64l08J95J29j17L64l27k15N98m41Q3k1J88r5q0O3k06J68
$$ 121 -5 -62 -80 162 -2 -310 -115 14 -103 261 -66 -281 317 -124 -41 -62 126 31 -49 14 -192 -24
8045b4J16j2N2j19K37n9k62Q6j41P1K8J4k9r4J8j5M12n07J63J3l4J64o4J59k53
$$ -24 92 80 132 13 250 191 -71 15 -126 -55 -27 -13 -42 -136 -118 -133 279 -228 -65 -52 -86 78 14 173 -80
8070h0j51J77J50Mj69k23L32L6j62K08j96J3J75j06r0q0L36k27p7Q2rJ87q1%k28
$$ -80 -231 -54 96 100 -69 -292 40 76 -86 122 -74 -61 114 8 -82 -162 174 -53 -130 -48 -57 130 49 49 -179
8095a79K30LQ8m7j12J25j05l2j13J86M6j69J8O4P1j10k7J93j45j17L23j85O9K15
$$ -179 51 54 142 95 -17 108 3 -29 -142 44 90 -79 -61 3 74 -36 -63 130 -15 -132 191 6 75 290
8119B90j35j59J72k43J90j82qJ03J29l28K28m4p1K90j45j00j2k37L45j2j95R7
$$ 290 155 -4 168 -75 115 -67 -75 28 157 -171 57 13 -58 232 87 -13 -25 -262 83 71 -124 -27
8141b7K45J27m81L09l42J99j18K62j53n7j80P0J24r9J57O9j45J15k25K51q5J0
$$ -27 218 345 -136 173 -169 30 -88 174 21 -36 -216 -146 -22 -121 36 105 -40 75 -150 101 16 26
8163B6j27M5J59k05J20O7j47O2P7m3o3J00j22l3l6P6K33n3k21M1K74j82j61Q7
$$ 26 -101 -56 103 -102 18 85 -62 0 77 34 -29 71 -51 -84 -120 -44 189 136 -85 -44 230 48 -113 -26
8187b6L9K2p4O9
$$ -26 13 35 -39 30
8191C0
$$ Imaginary data points
##PAGE= N=2
##DATA TABLE= (X++(I..I)), XYDATA
0@%%%%%%%%%%%qJ6j6J6k4L2l2M0n4O2p2Q8j04J21j44J68j93K24k57K95l38L85
$$ 0 0 0 0 0 0 0 0 0 0 0 0 -8 8 -8 8 -16 16 -16 24 -30 32 -40 48 -56 65 -79 89 -104 120 -137 158 -180 205
33B05m36M93n57O25p00P83q74R75j085J204j336J479j635J807j992K196k418K662
$$ 205 -231 262 -295 330 -370 413 -461 514 -571 633 -703 776 -859 948 -1044 1152 -1266 1396
51A396k934L235l567L939m359M830n368N993o728P601q658R975j1666J3932j7140
$$ 1396 -1538 1697 -1870 2069 -2290 2540 -2828 3165 -3563 4038 -4620 5355 -6311 7621 -9519
66i519K2062l0671N0018j74989M5270K72875k11459j47607J31773J59189r4409
$$ -9519 12543 -18128 31890 -143099 -97829 175046 -36413 -184020 -52247 106942 12533
77A2533o5672L8430L2527n270O1706k574q4789m980J09285j3207j22086j5175
$$ 12533 -53139 -14709 17818 12548 74254 71680 -13109 -18089 91196 77989 -44097 -59272
89e9272J01207J0603o1286j4476Q951k4498J6592L4954m2299n1398O7671O9713
$$ -59272 41935 52538 -8748 -23224 -14273 -38771 -22179 12775 -29524 -80922 -13251 56462
101E6462o0102o0841O3527M7588n7132k5022O3759J9887l8929O447K3312l6473
$$ 56462 -3640 -64481 -954 46634 -10498 -35520 28239 48126 9197 15644 38956 2483
113B483j9443M3051K452n1930J5540N3761m0748o4440N0582N6807p6490o2926
$$ 2483 -16960 26091 28543 -23387 -7847 45914 5166 -59274 -8692 48115 -28375 -91301
125i1301R2579P4815q4220o8395P5309N4539o6299l5228O2646K9046m0741p419
$$ -91301 1278 76093 -8127 -76522 -1213 53326 -12973 -48201 14445 43491 2750 -4669
137d669K9639j0316k5458J4993J2310k0694k975K2397l447k0999J679l70j9647
$$ -4669 24970 14654 -10804 4189 16499 -4195 -7170 15227 11780 -9219 -7540 -7910 -27557
150b7557R378L5322q109l8663J3273L9752j5341l7693J6936L2719j2781j3506
$$ -27557 -18179 17143 9034 -29629 -16356 23396 8055 -29638 -12702 20017 7236 -6270
162f270K5036N441l1819j333K8388r359l0794J6545L3997j5112l2492K260J2340
$$ -6270 18766 24207 -7612 -8945 19443 10084 -20710 -4165 29832 14720 -17772 -15512 -3172
175c172k927K885K532j8782p97M0235J0728n3800k4440N5254L4749m4793l0441
$$ -3172 -6099 -3214 -682 -19464 -20261 19974 30702 -23098 -47538 7716 42465 -2328 -32769
188c2769M3081L4454l1872l4327J2166K1987J117o467q313o219J0794J2456j7070
$$ -32769 10312 44766 12894 -21433 -9267 12720 13837 7370 -943 -7162 3632 16088 -982
201i82k6092P973K4779l67j3654K249N273n301J94N357q138k214K2732J3380k3129
$$ -982 -27074 -19101 5678 5311 -8343 -6094 -821 -6122 -5928 -571 -8709 -10923 11809 25189 2060
216B060j5862K3019J5035k4431j7563K1811J9084j2214j4445L229R88o345j868
$$ 2060 -13802 9217 24252 -179 -17742 4069 23153 10939 -3506 -277 711 -5634 -7502
229g502O3PP408O406j1011j1999J0443J0235j2348q051J7589J4062j0538p915
$$ -7502 -7439 -7432 -24 6382 -4629 -16628 -6185 4050 -8298 -16349 1240 15302 4764 -3151
243c151R085J338j1444J057J2992J063p137K916L604r213r443N048M535m009n42
$$ -3151 5934 7272 -4172 -3115 9877 10940 3803 6719 10323 1110 -8333 -3285 1250 -2759 -3301
258c301M303l63l302o32n227o454P491J3213k090r070N539R633q714j1587P221
$$ -3301 1002 639 -2663 -3295 -8522 -14976 -7485 5728 3638 -5432 107 9740 1026 -10561 -3340
273c340J1911k122m584N219K797o923m135Q99k415j443O351N336m834n819M38
$$ -3340 8571 6449 1865 7084 9881 2958 -1177 -278 -2693 -4136 2215 7551 2717 -3102 -2664
288b664q52m512J161N314L05J005M661j412q393r15P279l96n492N620J1213k639
$$ -2664 -3516 -8028 -6867 -1553 -1248 -243 4418 3006 -5387 -6302 977 581 -4911 709 11922 9283
304I283j0741j978M828j332l086L319M461k57j478k257m592k407L349K271j959
$$ 9283 -1458 -3436 1392 60 -3026 293 4754 4497 3019 762 -3830 -6237 -2888 -617 -2576
319b576J956O390p55q368k336L891j02j598N078M860k484l664R39j345n146L71
$$ -2576 -620 5770 5015 -3353 -5689 -1798 -1900 -3498 1580 6440 3956 292 1231 -114 -5260 -4889
335d889O397K151j933O94N08l741m310O09K006J528L520K911k417l363k66n1l221
$$ -4889 1508 3659 1726 2420 2928 -813 -5123 -4514 -2508 -980 2540 5451 3034 -329 -595 -646 -3867
352c867L52O102L356l018j651J635k823n249n9M099K249Q73R77j440l927j661
$$ -3867 -3515 2587 5943 2925 1274 2909 86 -5163 -5222 -1123 1126 1999 2976 1536 -2391 -4052
368d052J107o17l50M219M664p62l586j726k16k66O31J700J513K291K466k185o937
$$ -4052 -2945 -3562 -3912 307 4971 4209 623 -1103 -1319 -1585 -954 746 2259 4550 7016 4831 -2106
385b106l191M021L480k414j718M139K947l784o199k485K162L580K088o52p07K547
$$ -2106 -5297 -1276 2204 -210 -1928 2211 5158 1374 -4825 -7310 -5148 -1568 520 -132 -839 1708
401A708J603m923m863J959O156L215j147o84Q89j254k502j650j23Q90K832L131
$$ 1708 3311 -1612 -6475 -4516 1640 4855 3708 3024 3913 2659 157 -1493 -1616 -726 2106 5237
417E237k71l837l796j437Q53P78J00P58K484K608k139n901k450L569L324O77m
$$ 5237 4966 1129 -2667 -4104 -3251 -2473 -2373 -1615 869 3477 1338 -4563 -7013 -3444 -120 557 553
434E53J203J568R71j936n736k720N666Q452q00p763j197O979O7r916n359P877
$$ 553 1756 3324 4295 2359 -3377 -6097 -431 8021 7221 -542 -1739 5240 5307 -4609 -9968 -2091
450b091Q549j985o044j661K538N0k368l342O26O205N816j543o938l002L879L157
$$ -2091 6458 4473 -1571 -3232 -694 -644 -3012 -6354 -5728 477 6293 4750 -2188 -5190 -1311 1846
466A846k825j922M379M824k96n153k560N34j65k65K419K972n01k837R2P84l932
$$ 1846 -979 -2901 1478 6302 6006 853 -1707 -1173 -1338 -1603 816 3788 3287 450 542 1326 -2606
483b606m740K975Q107J615n587k647K518Q91k857j512L79K245N287M356n392j0379
$$ -2606 -7346 -4371 3736 5351 -236 -2883 -365 526 -2331 -3843 -3464 -1219 4068 8424 3032 -7347
499g347R42J1683M99j1773j879J4996P814j3339j2380N680J0891j761q205j46
$$ -7347 -6405 5278 5777 -5996 -7875 7121 14935 1596 -10784 -5104 5787 4026 -4179 -4325
513d325P587L727l075o973m734K207P229L383n525l905N486N553n219j0353N35
$$ -4325 3262 6989 3914 -3059 -7793 -5586 1643 5026 -499 -4404 1082 6635 1416 -8937 -8402
528h402R904N130n569l781M223K889m309m555J284L098J734K437J569l401n387
$$ -8402 1502 6632 1063 -2718 1505 4394 85 -4470 -3186 -88 1646 4083 5652 2251 -3136
543c136o5M447l50l652J221N688M44m213k441r92j423R79N519Q83n003m26P295
$$ -3136 -3201 1246 896 -2756 -1535 4153 4597 384 -2057 -3049 -4472 -3493 2026 2909 -2094 -2520 4775
560D775j41j1892m425J1913J0324o944r880N003R487l450j0398j207P287M881
$$ 4775 4634 -7258 -11683 230 10554 3610 -6270 -1267 8220 4770 -5628 -6835 452 5333
574E333j270k041j122j699N16K28k411k578M587O724j488q219k640N424K254n177
$$ 5333 4063 2022 900 -799 -283 -55 -2466 -5044 -457 6267 4779 -3440 -6080 -656 1598 -3579
590c579k394N655N594j713m742j129R17m94KK616L180O6k003r28l95j359j456
$$ -3579 -5973 -318 5276 3563 -1179 -2308 -1391 -1885 -1883 733 3913 3979 1976 1048 653 -706 -2162
607b162P41K498J902O88k153l375n69J987p61l293Q71O869L711o581p835K860
$$ -2162 -1421 1077 2979 3667 1514 -1861 -2430 -443 -1204 -4497 -3626 3243 6954 373 -7462 -4602
623d602P696j786o758J781Q541J948n756m053J163J687M83N05O37J35J988J105
$$ -4602 3094 1308 -5450 -3669 4872 6820 1064 -2989 -1826 -139 344 849 1486 1621 3609 4714
639D714m000o512R43O700K201m513j838L422K669l803n686j52M574L491o14j903
$$ 4714 714 -5798 -4855 1845 4046 -467 -2305 1117 3786 -17 -5703 -5855 -1281 2210 1596 -307
655c07L81J687j867l922q3M241K861m79p48M10j114j838n68P00K28J572K030M77
$$ -307 74 1761 -106 -4028 -4111 130 2991 2512 1764 2174 1060 -778 -1346 -646 -418 1154 3184 3661
673C661k115k227j724p51J160K501Q97q86N17M27k494l332J092L296K9o21K112
$$ 3661 1546 -681 -2405 -3156 -1996 505 1402 516 1033 1460 -1034 -4366 -3274 22 51 -570 1542
690A542J853k449l606J62J646L4J098K965P02k566j619K42r73o30Q21K247M55
$$ 1542 3395 946 -2660 -2498 -852 -818 280 3245 3947 1381 -238 4 -969 -1599 -778 1469 1924
707A924M05n28j920k189k75M41O20J843K226p59k955p15Q86j192j177K493L571
$$ 1924 2329 1801 -119 -2308 -2583 -2142 -1522 321 2547 1788 -1167 -1882 -996 -2188 -3365 -872 2699
724B699K19k406j36L26j363j955J429K414J339R38j380j958j284J06k18l84K025
$$ 2699 2918 512 376 702 -661 -2616 -1187 1227 2566 3504 2124 166 -1118 -1012 -1230 -1614 411
741D11K346p25j868o43n86j461r42K084K225K93k99Q71j633k907m99K389J797
$$ 411 2757 2032 164 -479 -1065 -2526 -3468 -1384 841 1134 835 1706 73 -2834 -3333 -944 853
758H53K54O02J055r81k327p52l46P05J943J288R3n04k10j655k747j01K575J060
$$ 853 1107 1709 2764 1783 -544 -1296 -1642 -937 1006 2294 2387 1883 1673 18 -2729 -2830 -255 805
776H05k37L80K52j210k652j69Q93K74J003J978R89j511j405p03j93m54J332K114
$$ 805 568 948 1200 -10 -2662 -2831 -1938 -1664 -661 1317 2306 795 -610 -1313 -1506 -1960 -628 1486
794A486J312K67j468j614j220M02L13J08J275K059o8k476k202K03J06k42K28J905
$$ 1486 2798 3065 1597 -17 -1237 -835 -522 -414 861 2920 2852 376 -1826 -1623 -1517 -1759 -1531 374
812C74J869j193j947j100k93J78Q70J332J180O57k5j201k116j94O72R81R32J249
$$ 374 2243 1050 -897 -1997 -2290 -2112 -1242 90 1270 1927 1902 701 -1415 -1609 -937 44 976 2225
830B225N35n96j741j345q22K98J281J137M48j77n66j078j623j348J213K045Q72
$$ 2225 2760 2164 423 -922 -1744 -1446 -165 972 1420 1243 677 -401 -2024 -3372 -2159 -114 758
847G58k2m1j24j033j939j29R61K346J184M0n31o47r22r09n20R10J915R29L65r31
$$ 758 736 695 571 -462 -2401 -2530 -1569 777 1961 2001 1470 823 -99 -1008 -1528 -618 1297 2226 2591 1660
867A660j653j356k94K65L59R30R22Q74n89k207j604L55J019O01R77O22Q90m96
$$ 1660 7 -1349 -1643 -1378 -1019 -89 833 1707 1118 -1089 -2693 -2338 -1319 -718 259 881 1771 1275
885A275j705j616k10J269K175R63m75K25m16n40k041r23J140J957J032k38o49
$$ 1275 -430 -2046 -2256 -987 1188 2151 1676 1901 1485 945 -1096 -2019 -879 1078 2110 1872 1223
902A223r70r74j013p17M63J808J908o9j491j210l30p79J71J066J339Q45M44j05
$$ 1223 253 -721 -1734 -2451 -1988 -180 1728 1659 168 -1042 -1372 -2151 -1980 -914 425 1270 1714 1609
920A609j599j510j75J313R67L86R81L42r42j284p65q77j74K125J852l03k116k20
$$ 1609 10 -1500 -1675 -362 605 991 1972 2314 1372 88 -677 -1554 -1728 397 2249 1946 -170 -390
938c90O43j361j860q8K995K277p18j523r68j83M3l11k07J199K456J104j147k504
$$ -390 253 -1108 -2968 -3056 -61 2216 1498 -25 -993 -1176 -1133 -1444 -1651 -452 2004 3108 1961 -543
956e43q98R65R55m87l4J596J557p97l007j870P72J547N3o4J334P35j331j586p16
$$ -543 -1441 -476 479 -8 -42 1554 3111 2314 -693 -2563 -1791 -244 -191 -255 1079 1814 483 -1103 -1819
975a819j48l16J725K023k5j393m3N49j511j565J247K794M11k25M36j183j852o23
$$ -1819 -1967 -2283 -558 1465 1440 47 4 553 -958 -2523 -1276 1518 1929 1704 2140 957 -895 -1518
993a518J348P08j106P63K560n7l342k381J289J370l63j5J131J122n84j460k189
$$ -1518 -170 538 -568 195 2755 2698 -644 -3025 -1736 -366 -729 -744 387 1509 925 -535 -2724
1010b724m54J420K202R71p69j15O10j47j629j861J109K796J355j309q67L07K06
$$ -2724 -3178 -1758 444 1415 646 531 1141 994 -635 -2496 -1387 1409 2764 1455 588 895 1101
1027A101j962j624J679J956K38m10j90q24j567l38R15Q5l7J259J687r20k244n26
$$ 1101 -861 -2485 -806 1150 1388 978 788 -36 -1603 -1941 -1026 -941 -978 281 1968 1048 -1196 -1722
1045a722N41j78K81K045J648q90j372K19k88j803l18K666J548o36j191K15Lj398
$$ -1722 -1181 -1359 -1078 967 2615 1725 353 572 284 -1519 -1837 829 2377 1741 550 765 768 -630
1063f30j638J44K202J666k42r80j020r42n56L62L40N11J366J454n73k117j052
$$ -630 -2268 -2124 78 1744 1502 522 -498 -1440 -1996 -1634 -1294 -783 583 2037 1464 -653 -1705
1080a705J010L04k20K48K198J061j285j825q45M48j2Q43Q00L27M2m13r35j295
$$ -1705 -695 -391 -611 -363 1835 2896 1611 -214 -1059 -611 -623 220 1020 1347 1389 976 41 -1254
1098a254p59P71O97J083N1M15n70j631o44j66J005J078O41M81j81k93j444m89
$$ -1254 -2013 -1242 -545 538 589 1004 434 -1197 -1841 -2007 -1002 76 717 1198 1017 724 -720 -1209
1116a209N92P11P8R21J118p8j538j584k60L35M23J220Q27l42j057m89o46j051
$$ -1209 -617 94 172 1093 2211 2133 595 -989 -1249 -914 -491 729 1556 1214 157 -332 -978 -2029
1134b029qJ465J208l87O2K90q85j320o01J374R41N79J032k34p42j261j8m4L22
$$ -2029 -2037 -572 636 249 311 601 -284 -1604 -2205 -831 110 689 1721 1487 745 -516 -534 -578 -256
1153b56R29J297o01m58j00l86j970j78J013J137L68K71l49j090j361m9N64J17
$$ -256 673 1970 1369 911 811 425 -1545 -1723 -710 427 795 1066 717 -373 -1734 -1783 -1219 -1102
1171a102R56J223L9o95n75k71o78l77J047J726L36l6k00j229j694N01J189K53
$$ -1102 -146 1077 1116 421 -154 -425 -1103 -1480 -433 1293 1629 1593 1393 164 -1530 -1029 160 413
1189D13M02N18M6j452r50K4j42j90O65J525L42o67o98o61j238k32J549J394J68
$$ 413 815 1333 1379 -73 -1023 -999 -1141 -1331 -666 859 1201 534 -164 -825 -2063 -2295 -746 648 816
1208H16M7J2n74j156j11O00K70M05J259O52r21j240m90m03l22P50J580L02o48
$$ 816 863 875 301 -855 -966 -366 -96 309 1568 2220 1299 59 -431 -834 -1156 -406 1174 1476 828
1227H28p06p49o63m21P95P73Q5M35M97m99j390l69K01J14J027J409M06r40p37
$$ 828 122 -627 -1290 -1711 -916 -143 -58 377 874 375 -1015 -1384 -1183 -1069 -42 1367 1773 833 96
1246I6j10p44j82R38J432J06m75N5k14j295q94N14L16K93R66R05j536j398j85
$$ 96 -14 -758 -940 -2 1430 1536 1061 1116 902 -393 -1287 -773 -457 -164 802 1707 171 -1227 -1412
1265a412K08J52J00J495L54m64o42O9q29l59Q03N47R55L39K86o55j306q22N95
$$ -1412 -1204 -1052 -952 543 897 433 -209 -140 -969 -1328 -525 22 977 1316 1602 947 -359 -1181 -586
1284e86Q43K03M68L62m17j060n98j69k76L1J619K64j29n70p8j162o23N67J189
$$ -586 257 460 928 1290 873 -187 -785 -954 -1230 -1199 420 684 555 -15 -93 -1255 -1878 -1311 -122
1303a22L80R07r7l35j189l01M41l08P13P89J026n00p88l14r40n75P28Q31N23m2
$$ -122 258 1165 1068 733 -456 -757 -316 -624 89 878 1904 1404 616 302 -638 -1213 -485 346 869 827
1323H27J02n77j196n69L09L75K83N99O04j32j012m74k70r9L95J137J077k95n29
$$ 827 929 352 -844 -1413 -1104 -729 -446 153 757 625 -387 -861 -1131 -1230 -835 302 1379 1084 555
1342E55j55n61q08M60O95Q15J30j05J22j026q62l21M69L30R89N05l90j091l47
$$ 555 400 -161 -969 -509 186 1001 1131 1026 1148 122 -740 -1061 -592 -262 727 1232 842 -249 -596
1361e96m45o38Q77P65M96M48k92k99r32m02O6P03L45Q90N42l83n63j129j17J7
$$ -596 -1041 -1679 -802 -37 459 907 615 316 -616 -1018 -952 -249 96 986 1528 1145 582 -547 -664 -647
1381f47L20J238M21J6j003m31m21o40J17Q65M78J41J00l11q05o15p1L84N05P67
$$ -647 -327 911 1332 1348 345 -86 -507 -1147 -1030 -165 313 454 554 243 -562 -1177 -1248 -864 -359 408
1401D08P49j86o12q33j84J9M65M12O45M34K53r62r31n24J45N04N11M44K06k52
$$ 408 1157 971 359 -474 -658 -639 -174 238 883 1317 1570 608 -323 -847 -702 -198 313 757 963 711
1421G11r88o57j34l15N66J022O15l93n47k6n55o30k6J102R85N80l65m93l75m39
$$ 711 -277 -934 -1068 -1383 -817 205 820 427 -120 -146 -701 -1331 -1357 -255 730 1310 945 452 77 -362
1441c62m42N79M65O84K33K20r04r04n50K85L25K38N15N24r5q20j010j95k0P73
$$ -362 -804 -225 240 924 1157 1377 473 -431 -981 -696 -371 -133 382 906 811 -9 -1019 -1214 -1234 -461
1461d61M55M71K03Jr74o17MR3L49J214K16J43m15l18p84l48L34O24N78O40n95
$$ -461 -6 465 668 669 -305 -922 -918 -825 -476 738 954 1097 682 364 -420 -768 -434 190 768 1408 813
1482H13p12l0p34j76JQ85L79J34R0o27q06o83L09O47L77L82P89l17p00p62K05
$$ 813 101 71 -663 -839 -838 47 426 560 650 23 -783 -1466 -1157 -510 -133 249 1038 721 21 -741 -536
1503e36j6K63Q97O10j66m94k31l60q12lO75Q58J50n7m73o64n50k74J76O16O07
$$ -536 -552 -289 608 1218 1052 558 327 -33 -845 -848 -173 685 835 778 305 -359 -909 -1183 -1007 -391 216
1524B16N69j38o48l42o51q8M72N69P45K97Kn84o93n01K86K23M64Q85M71o62q61
$$ 216 785 647 -1 -343 -994 -1082 -610 -41 704 1001 1003 419 -274 -775 -489 -266 198 1083 1554 892 31
1545C1n06j72J03K53Q12J07J52n53n81l56r13M64Q78N35J93K21j66r49l42K17
$$ 31 -475 -647 -544 -291 521 628 780 227 -354 -710 -1623 -1159 -281 254 447 668 502 -447 -789 -572
1565e72J71K17O36O89p9m56n26n22k05O38L91N39L0j90l09r42m28K53K54O37K26
$$ -572 -401 -184 452 1141 1062 606 80 -442 -647 -9 382 921 951 761 452 -490 -918 -665 -411 226 452
1586D52K42j32j026k94l31K6M18N33Q25j5l53k40l02p71N37Q19J67J70K78k36
$$ 452 694 562 -464 -758 -1089 -1063 -645 -112 713 698 345 105 -197 -968 -431 388 555 725 1003 767
1606G67n63p79j72L56N70L52L48j36r07m31k09M0P5M82O84Jm87mn09k07j29L75
$$ 767 204 -575 -747 -391 179 531 879 743 -164 -595 -804 -764 -689 -207 477 478 -9 -13 -522 -729 -858 -483
1628d83N92N95K63j42q07n36N5m9M12P07O46p0m55p52m49l21K90M49O52qk0k92
$$ -483 109 704 967 825 18 -518 -463 -512 -100 607 1253 1183 728 -24 -473 -794 -504 -55 597 589 569 277
1650B77p11n52o7L43N04N23J43j20l92l78l35O6K02N45P81J04j85l84k75n49P8
$$ 277 -434 -986 -1053 -710 -206 317 460 340 -52 -430 -765 -699 -497 48 829 933 748 364 89 -460 -382
1671c82L43M96N97j94q9q88m36k95p9M45O38k77K12K67p36k38k46l1N49N27K41
$$ -382 -39 457 1054 860 771 -117 -553 -848 -927 -482 156 -121 91 358 -378 -616 -862 -893 -344 183 424
1692D24K20m33m67j35O0nL69O09M75k18m37k50l38n49K29O91K31M33k38m39r68
$$ 424 644 211 -256 -391 -331 -336 33 642 1117 899 462 212 -126 -675 -446 245 476 909 671 232 -736
1713g36k45L41Q0M81L01L62n57l55l83j4j84L70Q50L11O7j40n97l26n9J29P95
$$ -736 -981 -640 -560 -79 222 584 27 -328 -711 -725 -909 -539 311 622 689 549 -48 -374 -433 -304 491
1734D91Q4oM03l75j071J05M9k01O26N11Lk14m16l96m51l14M85Q54N95k88p7j99
$$ 491 575 569 972 597 -474 -369 -320 -521 105 616 619 405 -11 -407 -858 -1172 -687 167 762 474 397 198
1756A98q58j16M72L98k1N80K41k24o61m26K3K5K66O81M99j76n37l22o23l47L99
$$ 198 -660 -776 -304 94 73 653 894 670 9 -417 -394 -369 -103 578 1077 901 364 42 -581 -928 -529
1777e29Q76n7K0K59k11r26l50K53QL82M72N68j2n72o30Mn1K36Q68J84k4Rk71q48
$$ -529 347 290 310 569 358 -568 -918 -665 -657 -275 197 765 753 181 -449 -445 -496 -260 608 792 768 777 506 -342
1801c42l14M8L92N58L02K81m81p86o31K01J58K55O86j27R2m61n4k39n43N59K81
$$ -342 -656 -608 -216 342 644 925 444 -342 -973 -772 -614 -359 327 200 292 -169 -223 -462 -1005 -446 -165
1822a65P60j49L92j65q18j47k23M49M37M95J68l22m27m21l30j06K29K29M68J09
$$ -165 595 446 838 673 -145 -292 -515 -66 371 866 1034 712 285 -136 -466 -572 -343 -114 354 463
1842D63k81k63o10j83l3M79M93M33K68m33n94l35k7K17K23P04K49rn87O1k24o41
$$ 463 182 -81 -691 -874 -907 -428 65 498 766 333 -261 -596 -623 -406 -183 521 770 761 174 235 11 -630
1864f30L45N83L89j0L0n51m57k59p2M68L04n1M68k28m51n22j9L0P2M54R38k99
$$ -630 -285 298 687 677 707 156 -301 -560 -632 -164 140 89 557 329 -122 -644 -663 -633 -561 -107 831 532
1886E32k25m14l03j32R8N26O38p8J75j03m07n91k07j2Q18p3K96M9m71l00j97k37
$$ 532 307 -107 -410 -542 -444 82 720 642 817 714 307 -284 -491 -503 315 242 538 587 116 -184 -381 -618
1908f18J79J84L82K72k34l38l05m13K54K45L99L08M79k41k91m93m05L91J30K86
$$ -618 -439 -255 127 399 165 -173 -478 -891 -637 -392 7 315 794 553 262 -231 -636 -245 -115 171
1928A71N84Q0m14n21j08l00m4M21K84K95k68j96j96m26l19K94N28J53K11N1l67
$$ 171 755 835 421 -100 -208 -508 -552 -131 153 448 180 -16 -212 -638 -957 -663 -135 18 229 280 -87
1949h7J5n48P1M19K34N07J34l10m3l53j18l54L35O08M15l10l5n23j2n81j62J81
$$ -87 -72 -620 -549 -130 104 611 745 435 392 39 -79 -433 -98 510 925 615 580 57 45 -536 -698 -517
1971e17Q25l8J11k58k00k81m07J0K92Q30J82r1m56j39k16j93J77N43J41K12J14
$$ -517 308 270 381 123 -77 -358 -765 -755 -463 367 549 458 2 -137 -353 -546 -369 174 315 527 641
1992F41l00m85l3k05L86J10M71J15l44l08n73n7P0K9M27N14l61J84m96k34l49
$$ 641 341 -144 -177 -382 4 114 585 700 356 48 -525 -582 -512 -483 -56 458 97 281 -215 -449 -798
2013g98J31M01M24K67J1K6p36L6R0j54J44N34M04o4l25m49l50J78j62L58L09j39
$$ -798 -667 -266 158 425 436 462 -274 -238 -148 -302 -158 376 780 716 391 -58 -408 -230 -392 -34 275 136
2035A36O8k33m12q5K4J49L51J44J36J3k67l56j54j7j43O15N83K41m82j14k14j81
$$ 136 204 -29 -441 -526 -502 -353 -2 142 278 291 24 -332 -486 -503 -646 -31 552 793 311 197 -17 -198
2057a98K4K18M60n1K23j11o27n32P4J26K48l2M04K71m02l13m76j2j69P59K45L52
$$ -198 -174 44 504 453 676 565 -62 -594 -520 -394 -146 -178 226 497 95 -218 -694 -706 -875 -116 129 481
2079D81m49J11k50m10K13K51L48K54K48q4n95m05k14K77N7K23N88k07J9l95m16
$$ 481 32 143 -107 -517 -304 -53 295 549 797 713 118 -287 -501 -224 -167 56 644 437 456 61 -355
2100c55k76pM26L47r5J26M6k79o98K73l5L07L07K97Ll6m27m01K16K7O02jL25k50
$$ -355 -631 -638 -212 135 40 166 212 -67 -765 -492 -527 -220 87 384 387 351 -76 -477 -261 -234 368 367 692 442
2124D42j74j75n26J85O2K56R9K41J19k85o88k42K25K20J16M48J7k67l52j28q8
$$ 442 268 93 -433 -248 -186 70 169 410 529 244 -444 -686 -461 -241 -125 323 340 73 -279 -407 -495
2145d95j4L77N47K4L1n1k77l60k52K38L69j37N75K82o57p55J55o4k91N30L16N68
$$ -495 -509 -132 415 439 470 419 142 -218 -470 -232 137 0 575 857 200 -555 -400 -464 -755 -225 91 659
2167F59o12j93m16pL9M3O70N1J07k25J98q07o8L14K79M09jP5j90k81n6j17n2J27
$$ 659 47 -146 -562 -569 -530 -487 183 234 341 116 314 -493 -561 -247 32 441 440 515 325 44 -12 -129 -181 -54
2191e4M43o3R1k5o28l13k78N61J97K90j05j47J09l91j58n8M22k4O59j83ro3l98
$$ -54 389 326 417 392 -236 -549 -827 -266 -69 221 116 -31 78 -313 -471 -529 -107 -131 528 345 336 273 -125
2214a25m6j34M8M83L37pj52om63k85j31M99K18k26L69l65j13k98k09l1L11K41
$$ -125 -171 -305 -257 226 563 556 404 398 -65 -350 -481 18 236 10 379 14 -99 -397 -606 -637 -326 -85
2236h5M41N3l82r4k45j77J49O90j54K76J02l59m00J01n2m5J92K56K20J4o23k32
$$ -85 356 409 27 -67 -312 -489 -340 350 196 472 574 215 -185 -84 -136 -181 11 267 487 501 -122 -354
2258c54m5R9J25K68J60k33J20l62k55k07j6N21M25n3j5n5j57j50j74O2J13N20
$$ -354 -399 -300 -175 93 253 20 140 -222 -477 -684 -700 -179 246 193 178 123 -34 -184 -358 -296 -183 337
2280C37L93k63L9k63j95k69J83LL93j04N4o8o34K43n02K11K96K43K28j70l85k04
$$ 337 730 467 506 243 48 -221 -38 -35 358 254 308 240 -394 -151 -653 -442 -146 97 325 155 -230 -434
2302d34R6J39K69p2K3K25K8j06k84k58k0M07L26K19l4r4n56j28Q7J1J62J26J97
$$ -434 -338 -199 70 -2 21 246 274 168 -116 -374 -394 13 339 558 524 430 -126 -254 -167 -156 6 132 329
2325C29m4n8m83k26QJ22o7O09K28k87l76k70Qj11N22L63K4J65r4Jm33j17k02N12
$$ 329 285 227 -256 -482 -474 -352 -419 190 418 131 -245 -515 -507 -618 -96 267 291 456 362 363 -70 -187 -389 123
2349A23K9J67n4O6l49k43J2j90K35M32p2Q8j37l08j36j45K26L5N61j79J44l38
$$ 123 152 319 265 331 -18 -261 -249 -439 -204 228 156 244 107 -201 -337 -482 -256 -221 340 161 305 -33
2371c3J18m25J51L3K44J28K98k61P6m06J1j5N6R0K76K34l28q9m41l42J90K98K52
$$ -33 85 -340 -189 -156 88 216 514 253 329 -77 -66 -81 -25 65 341 575 247 158 -283 -625 -435 -137 115
2394A15J67k34M8k48l76J65q4N19L9K41l5k24k24j92J21qJ40J96L65j62P7o12
$$ 115 282 48 96 -152 -528 -363 -447 72 111 352 317 93 -131 -323 -202 -210 -70 126 491 329 406 -206
2416b06j05k7L92j10N38r4j24N5o45l7l19M03L14J41j0R4j98k15j93l8O83M7l
$$ -206 -311 -338 54 -56 482 388 264 319 -326 -363 -682 -279 35 176 166 260 62 -153 -346 -384 299 346 343
2439C43MP2k99l35j61L14K70j45K23J29k27j92N2l15p8K65K22j04K29m72L3l25
$$ 343 347 419 120 -215 -376 -62 208 63 286 415 188 -4 48 -267 -345 -80 142 38 267 -205 -172 -497
2461d97p5K63K33K61J24jq5l15k68K27l4K31K21L57j05l91k88L1j89L79j31N33
$$ -497 -572 -309 -76 185 309 308 223 -92 -360 -133 -167 64 285 642 537 146 -142 -111 -300 79 -52 481
2483D81J03m76k14k55J52l02L70L38M5j67k45Q7j83r6j84J29O41K28k44k09K53
$$ 481 584 108 -106 -361 -209 -511 -141 197 242 75 -170 -83 -266 -362 -546 -417 224 452 208 -1 252
2504B52l52k18K62L48Q6n8o2k01l35j81J67O7L11K35n1O8k85l78K7j89K13K30
$$ 252 -100 -318 -56 292 378 320 258 57 -278 -459 -292 -225 86 321 270 338 53 -325 -298 -487 -274 -44
2526d4L71l7l42j72m7M2J16j8L14K12l29L66k45m51J65k60O17l5P8j09j06k10
$$ -44 327 290 -52 -224 -271 -229 -113 -131 183 395 66 432 187 -264 -99 -359 258 223 301 192 86 -124
2548a24j16J81l6J17n5K68K2k65k18k13m3Q2Q8L82L72l79l03J26j99J54K04L21
$$ -124 -240 -59 -95 22 -33 235 257 -8 -226 -439 -482 -400 -312 70 442 63 -240 -114 -313 -159 45 366
2570C66p9K27k94J09k79k84J9J76K71n7J08m3l89j01j57p9K95L75L05n39Q1l67
$$ 366 287 514 220 329 50 -234 -215 -39 232 175 283 240 -149 -250 -407 -486 -191 184 489 -50 31 -336
2592c36r4J00K10L3K16n5K93l22j43l9P4J97jP5L74k29l78k8q1r8L88K86l53K54
$$ -336 -430 -330 -120 -87 129 74 367 45 -98 -137 -63 134 133 208 582 353 -25 -53 -134 -232 156 442 89 343
2616C43j9m04p4j00r0k23O96J11r7j3j82r9p5P7J98L41n2P0k19j87o9q7K07K03
$$ 343 324 -80 -154 -254 -344 -567 129 240 143 130 -52 -151 -226 -149 49 390 338 408 189 2 -67 -154 53 256
2640B56J08N3j51l41k10K05l99M14J82K70k94l3l01j87L1L59j20J63K44l19MJ80
$$ 256 364 417 266 -75 -285 -80 -479 -65 117 387 93 60 -241 -428 -397 -38 -158 5 249 -70 -66 114
2662A14k76j12J26P5K59l3K55j21l46p0R5J70qR0J19j68j05R5l90o2N1K44o2K77
$$ 114 -162 -274 -148 -73 186 153 408 287 -59 -129 -34 136 128 218 337 169 64 159 -231 -293 -242 2 -60 217
2686B17m41J25j6k37k61M92N9L34l86J61q3j71p6J22M14m4l4K05M8k98m44N2K01
$$ 217 -224 -99 -115 -352 -613 -121 -62 272 -114 47 -36 -207 -283 -161 253 209 175 380 428 130 -314 -262 -61
2709f1o0K89J99J83n85k26J8J6K37j11L2K09j1L2k19k73o7L63J17J43M5l78nj53
$$ -61 -121 168 367 550 -35 -261 -243 -227 10 -101 -69 140 129 161 -58 -331 -398 -35 82 225 270 -108 -113 -266
2733b66J10j69N37l9M14k06j43q8k83k69L26j2J91J47pk79J27k03j90K36j32J28
$$ -266 -156 -325 212 173 587 381 238 150 -133 -402 -76 -88 103 250 243 -36 91 -112 -302 -66 -198 -70
2755g0k6J50kJ8j13j55J03J20K87R0j67j20j58k4k26M41Kj56L94l26ln1j78J50
$$ -70 -96 54 52 70 -43 -198 -95 25 312 402 235 115 -43 -67 -293 148 150 -6 388 62 59 8 -170 -20
2779b0l51O26L9q1j07m70k16m3K09J81O24n3j43j43j09j72j49L89j9J49K25o0
$$ -20 -371 255 294 213 106 -364 -580 -623 -414 -233 391 338 195 52 -57 -229 -378 11 -8 141 366 306
2801C06k41J09m45J38J89k6J92O6k78k42k4j00J20k9K44J97j95L47k45m57J91
$$ 306 65 174 -271 -133 56 30 222 288 10 -232 -256 -356 -236 -265 -21 176 -19 328 83 -374 -183
2822a83O4l2M06k90L60k02j77J13j6k24K64J25N1n2J0k88j76r1K8L69J23m3j57
$$ -183 -119 -151 255 -35 325 123 -54 59 43 -181 83 208 259 207 217 -71 -247 -338 -310 59 182 139 -18
2845a8L3l38j0L10kN8n7J02J35k69q0Ll5K42K54j96%P1J7k02m58K14L67K3R1j73
$$ -18 15 -323 -333 -23 -25 33 -24 78 213 -56 -136 -133 -168 74 328 132 132 203 220 18 -440 -226 141 164 255 82
2871H2P3k16j78J94l65J13J90M23k21m7l1l75J6Q3Q6R7J91Lj25J51n85K43R8K61
$$ 82 155 -61 -239 -45 -410 -297 -107 316 95 48 17 -358 -342 -259 -173 -76 115 118 -7 144 -441 -198 -100 161
2895A61m7J08J03j74k55r9J32o2K88j00L40j67l36K3j82M7o9K48pJ48j91j25m4
$$ 161 114 222 325 151 -104 -203 -71 -133 155 55 395 228 -108 -85 -267 -220 -289 -41 -48 100 -91 -216 -260
2918b60K03J5L8M18k03l4O6N3n26K8R7N8K20M9J95l98p4k06J54r4O02p7k44j82
$$ -260 -57 -42 -4 414 211 177 243 296 -230 -202 -105 -47 173 222 417 19 -55 -261 -107 -201 401 324 80 -102
2942a02J34l38J50q9K68o2K41K5j0k33J5l44K27J30J06L0K39j22k12j52M7q4J32
$$ -102 32 -306 -156 -245 23 -39 202 227 217 -16 -1 -345 -118 12 118 148 387 265 53 -99 -52 -136 -4
2965dM35k96j0j92m8k68K50j19J09L85o3m6j44k18j5j42L41k41K97K76K7j69l37
$$ -4 431 135 125 -67 -115 -383 -133 -252 -143 242 179 133 -11 -229 -244 -386 -45 -286 11 287 314 145 -192
2988a92J97k39K71J25p4M02k29k52K1O9o7Pp0J78K04k20k60m9J23J9J63k93J14
$$ -192 5 -234 37 162 88 490 261 9 30 99 32 39 -31 147 351 131 -129 -178 -55 -36 127 -166 -52
3011e2R6r6l00L15k35j66K63M13Kp3p3qk73J40J47j11M27rj25l38L5j05j06J38
$$ -52 44 -52 -352 -37 -272 -438 -175 238 240 167 94 86 -187 -47 100 -11 416 407 282 -56 -21 -126 -232 -94
3035i4R8J02J67j86j24k03m2j06K77J51R1P9j24m0k28l1J03K31P4rm8l13K09p3
$$ -94 4 106 273 87 -37 -240 -282 -388 -111 40 131 210 86 46 -182 -213 -110 121 195 186 138 -175 34 -39
3059c9k15J19J90L25j91r9J22j82n1OM2j61K24j03J10k67r7J77j89K5K78N3J35
$$ -39 -254 -135 55 380 189 90 212 30 -21 -15 27 -134 90 -13 97 -170 -267 -90 -279 -254 24 77 212
3082B12k24p3j3m7m8J39M43j60l4J35m38K18l36q9L02M02j11j35J53l35k90O7
$$ 212 -12 -85 -98 -145 -193 -54 389 229 195 330 -108 110 -226 -315 -13 389 278 143 296 -39 -329 -262
3104b62K04J37N0J4J29l44k51J04J28o2J58J10L08k82j03k89K91j92J81J00R0
$$ -262 -58 79 129 143 272 -72 -323 -219 -91 -153 5 115 423 141 38 -251 40 -152 29 129 219
3125B19j90R9j52K42l98J83j85L44K1k03O4o6j75O5R0R3O6o0K8j72Q4J42l54K12
$$ 219 29 128 -24 218 -180 3 -182 162 183 -20 44 -22 -197 -132 -42 51 117 57 85 -87 -3 139 -215 -3
3149cJ76Qm7r8K72k44k67RL32r9K04j41P4o7k66q1L2J40M9m8K54k40j44R9j76
$$ -3 173 181 134 36 308 64 -203 -194 138 39 243 102 176 109 -157 -238 -206 -66 -17 -65 189 -51 -195 -96 -272
3174b72l3J74J07K45k04j93L35k46k22N00J71j22M7j06j52k60J12J74j30J78L23
$$ -272 -305 -131 -24 221 17 -176 159 -87 -309 191 362 240 287 181 29 -231 -119 55 -75 103 426
3195D26k86K23k16m47P3Q1M2l8K83j39K8J46k81J56j35j60M46k29L37k28J6j01
$$ 426 140 363 147 -300 -227 -146 -104 -142 141 2 30 176 -105 51 -84 -244 202 -27 310 82 98 -3
3217cN8q5K45PJ0j6j20j21j01J67J00r6N9m8P3N1m37K50q1k13L90Mk7K81n64j34
$$ -3 55 -30 215 222 232 216 96 -25 -126 41 141 45 104 56 129 180 -257 -7 -88 -301 89 93 66 347 -217 -351
3243c51J20j39L52l9K05J7k05O1J54k52M1p3J85P8J91j80k52j79J51J59l3j06
$$ -351 -231 -370 -18 -57 148 165 -40 21 175 -77 -36 -109 76 154 345 165 -87 -266 -115 44 11 -95
3265i5J65J4l47K43o5l64M51k4K64j99L15on49qP1j25L27OO3j45L23l30J29k81
$$ -95 70 84 -263 -20 -85 -449 2 -22 242 43 358 352 -197 -205 -134 -259 68 74 137 -8 315 -15 114 -167
3289a67kJ22L90k51k73K21j31Q3m03M02o6J15j33K41l74L53k54k4p4L18j11J43
$$ -167 -169 -47 343 92 -181 40 -91 -8 -411 -9 -75 40 -93 148 -226 127 -127 -151 -225 93 -18 125
3311A25j17r2O0p9K97R5k33O3J56q1l96J07J89k46L78j64K62o08J53J82j98m2
$$ 125 8 -84 -24 -103 194 289 56 119 275 194 -202 -95 94 -152 226 62 324 -284 -131 51 -147 -189
3333a89o7M4L12j63kk10k1J7K20J10J15j44K19J06n95K28j22m5K34K17k45L58
$$ -189 -256 -212 100 -63 -65 -275 -296 -279 -59 51 166 22 241 347 -248 -20 -142 -187 47 264 19 377
3355C77k71q4q5n4k4J11K79l40K73k64l10J37K33j50J5M26n9j99R8k71N5J37r0
$$ 377 106 22 -63 -117 -141 -30 249 -91 182 -82 -392 -255 -22 -172 -157 269 210 11 109 -162 -107 30 -60
3378f0J36R0j3R5r9j28k34J08K80J3L3k22K65k88o3N8n9O1j2K46l61j1r6K97p0
$$ -60 76 166 153 248 149 21 -213 -105 175 188 221 -1 264 -24 -87 -29 -88 -27 -39 207 -154 -165 -261 36 -34
3403c4l5M7J65J86k4l36J13j38l9K92K9m5K7j08j12o3J02k95J28K31O4Kl08P0
$$ -34 -69 -22 143 329 305 -31 82 -56 -95 197 226 181 208 100 -12 -75 27 -268 -140 91 155 157 -151 -81
3427h1J80n54M91p2K17m30L09J06r4p1j61l5r4L33L15l2k38J22l35L13j19l2L15
$$ -81 99 -455 36 -36 181 -249 60 166 72 1 -160 -195 -289 44 359 327 89 211 -124 189 70 38 353
3450C53j29k29m8M4J0j1MJ31j87K40k44J13k56j26q8M70rj1J13l44L39l10J47
$$ 353 224 -5 -53 -9 1 -10 -6 125 -62 178 -66 47 -209 -335 -423 47 38 27 140 -204 135 -175 -28
3473b8q8L12K12j72j1k35Q7j42j46J52J1J49K00k71J48k93k26J91j15J02J36K20
$$ -28 -116 196 408 236 225 -10 77 -65 -211 -59 -48 101 301 30 178 -115 -341 -150 -265 -163 -27 193
3495A93k18q9R7k47KL84k57J19K55n6l52M0j24k0M36n1K65k2j35l44K40k27O5
$$ 193 -25 -114 -17 -264 -262 122 -135 -16 239 183 -169 -129 -253 -273 163 112 377 355 220 -124 116 -111 -46
3518d6J80O2n22M76j82l35N59m07J11J01kR0M9j77q4J53K3j41J02L73k36q0J08
$$ -46 134 196 -326 150 -32 -367 192 -215 -104 -3 -5 85 134 -43 -127 26 49 -92 10 383 147 67 175
3541A75l19J31r2J93k65M11M6j72k6k52J05Q5pJ27K0m7j13j51P8j78K62k76N51
$$ 175 -144 -13 -105 88 -177 234 280 108 82 -170 -65 20 13 140 160 113 0 -151 -73 -251 11 -265 286
$$ [...]
8191a25
##END NTUPLES=NMR FID
##END=
