##TITLE=1H_Pr eth
 CDCl3,8 sc, 
 26.10.2021
##JCAMPDX= 6.0         $$ Bruker NMR JCAMP-DX V2.0
##DATA TYPE= NMR FID
##DATA CLASS= NTUPLES
##ORIGIN= UXNMR, Bruker Analytische Messtechnik GmbH
##OWNER= root
$$ XWIN-NMR		Version 3.5
$$ Tue Oct 26 12:03:41 2021 Russian Standard Time (UT+4h)  she@DPX200
##.OBSERVE FREQUENCY= 200.1313468511
##.OBSERVE NUCLEUS= ^1H
##.DELAY= (6, 6)
##.ACQUISITION MODE= SIMULTANEOUS
##.ACQUISITION SCHEME= undefined
##.AVERAGES= 8
##.DIGITISER RES= 18
##SPECTROMETER/DATA SYSTEM= spect
##.PULSE SEQUENCE= zg30
##.SOLVENT NAME= D2O
##.SHIFT REFERENCE= (INTERNAL, D2O, 0, 15.7039)
##AUDIT TRAIL= $$ (NUMBER, WHEN, WHO, WHERE, WHAT)
$$ ##TITLE= Audit trail, XWIN-NMR		Version 3.5
$$ ##JCAMPDX= 5.01
$$ ##ORIGIN= Bruker BioSpin GmbH
$$ ##OWNER= she
$$ F:/spectra/data/she/nmr/H-F/1/audita.txt
$$ ##AUDIT TRAIL=  $$ (NUMBER, WHEN, WHO, WHERE, WHAT)
(   1,<2021-10-26 12:02:19.12 +0400>,<she>,<DPX200>,
      <created by zg, POWCHK disabled, PULCHK disabled
       configuration hash MD5:
       00 E9 B6 7A A2 85 ED C7 34 08 36 98 17 FE 4E 26
       data hash MD5: 16K
       70 AC 46 9A 2E 06 25 CF C5 79 5B CD 63 83 48 10>)
$$ ##END=
$$ 
$$ hash MD5
$$ 32 FD 99 9F 43 4E CB 0D 10 B2 EB 8E 0C 6F 83 8D
##$RELAX= 
##$RELAX= 
##$RELAX= 
##$RELAX= 
##$RELAX= 
##$RELAX= 
$$ Bruker specific parameters
$$ --------------------------
##$DU= <F:/spectra>
##$EXPNO= 1
##$NAME= <H-F>
##$PROCNO= 1
##$TYPE= <nmr>
##$USER= <she>
##$AMP= (0..31)
100 100 100 100 100 100 100 100 100 100 100 100 100 100 100 100 100 100 
100 100 100 100 100 100 100 100 100 100 100 100 100 100 
##$AQSEQ= 0
##$AQ_mod= 1
##$AUNM= <au_zg>
##$AUTOPOS= <>
##$BF1= 200.13
##$BF2= 200.13
##$BF3= 200.13
##$BF4= 200.13
##$BF5= 200.13
##$BF6= 200.13
##$BF7= 200.13
##$BF8= 200.13
##$BYTORDA= 1
##$CFDGTYP= 0
##$CFRGTYP= 5
##$CHEMSTR= <none>
##$CNST= (0..31)
1 1 145 1 1 1 1 1 1 1 1 1 1 1 1 1 1 1 1 1 1 1 1 1 1 1 1 1 1 1 1 1 
##$CPDPRG= <>
##$CPDPRG1= <>
##$CPDPRG2= <>
##$CPDPRG3= <>
##$CPDPRG4= <mlev>
##$CPDPRG5= <mlev>
##$CPDPRG6= <mlev>
##$CPDPRG7= <mlev>
##$CPDPRG8= <mlev>
##$CPDPRGB= <>
##$CPDPRGT= <>
##$D= (0..31)
0 1.2 0 0 0 0 0 0 0 0.06 0 0.03 0 0 0 0 0.0002 0 0 0 0 0 0 0 0 0 0 0 0 
0 0 0 
##$DATE= 1635235338
##$DBL= (0..7)
120 120 120 120 120 120 120 120 
##$DBP= (0..7)
150 150 150 150 150 150 150 150 
##$DBP07= 0
##$DBPNAM0= <>
##$DBPNAM1= <>
##$DBPNAM2= <>
##$DBPNAM3= <>
##$DBPNAM4= <>
##$DBPNAM5= <>
##$DBPNAM6= <>
##$DBPNAM7= <>
##$DBPOAL= (0..7)
0.5 0.5 0.5 0.5 0.5 0.5 0.5 0.5 
##$DBPOFFS= (0..7)
0 0 0 0 0 0 0 0 
##$DE= 6
##$DECBNUC= <off>
##$DECIM= 32
##$DECNUC= <off>
##$DECSTAT= 4
##$DIGMOD= 1
##$DIGTYP= 9
##$DL= (0..7)
0 120 120 120 120 120 120 120 
##$DP= (0..7)
150 150 150 150 150 150 150 150 
##$DP07= 0
##$DPNAME0= <>
##$DPNAME1= <>
##$DPNAME2= <>
##$DPNAME3= <>
##$DPNAME4= <>
##$DPNAME5= <>
##$DPNAME6= <>
##$DPNAME7= <>
##$DPOAL= (0..7)
0.5 0.5 0.5 0.5 0.5 0.5 0.5 0.5 
##$DPOFFS= (0..7)
0 0 0 0 0 0 0 0 
##$DQDMODE= 0
##$DR= 18
##$DS= 0
##$DSLIST= <SSSSSSSSSSSSSSS>
$$ [...]
##$SUBNAM2= <"">
##$SUBNAM3= <"">
##$SUBNAM4= <"">
##$SUBNAM5= <"">
##$SUBNAM6= <"">
##$SUBNAM7= <"">
##$SUBNAM8= <"">
##$SUBNAM9= <"">
##$SW= 18.0517286264689
##$SWIBOX= (0..15)
0 0 2 0 0 0 0 0 0 0 0 0 0 0 0 0 
##$SW_h= 3612.71676300578
##$TD= 16384
##$TD0= 1
##$TE= 0
##$TE2= 300
##$TE3= 300
##$TEG= 300
##$TL= (0..7)
0 120 120 120 120 120 120 120 
##$TP= (0..7)
150 150 150 150 150 150 150 150 
##$TP07= 0
##$TPNAME0= <>
##$TPNAME1= <>
##$TPNAME2= <>
##$TPNAME3= <>
##$TPNAME4= <>
##$TPNAME5= <>
##$TPNAME6= <>
##$TPNAME7= <>
##$TPOAL= (0..7)
0.5 0.5 0.5 0.5 0.5 0.5 0.5 0.5 
##$TPOFFS= (0..7)
0 0 0 0 0 0 0 0 
##$TUNHIN= 0
##$TUNHOUT= 0
##$TUNXOUT= 0
##$USERA1= <user>
##$USERA2= <user>
##$USERA3= <user>
##$USERA4= <user>
##$USERA5= <user>
##$V9= 5
##$VALIST= <valist>
##$VCLIST= <CCCCCCCCCCCCCCC>
##$VD= 0
##$VDLIST= <DDDDDDDDDDDDDDD>
##$VPLIST= <PPPPPPPPPPPPPPP>
##$VTLIST= <TTTTTTTTTTTTTTT>
##$WBST= 1024
##$WBSW= 4
##$XGAIN= (0..3)
0 0 0 0 
##$XL= 0
##$YL= 0
##$YMAX_a= 376151
##$YMIN_a= -455349
##$ZGOPTNS= <>
##$ZL1= 120
##$ZL2= 120
##$ZL3= 120
##$ZL4= 120
##$ABSF1= 10
##$ABSF2= 0
##$ABSG= 5
##$ABSL= 3
##$ALPHA= 0
##$AQORDER= 0
##$ASSFAC= 0
##$ASSFACI= 0
##$ASSFACX= 0
##$ASSWID= 0
##$AUNMP= <proc_1d>
##$AZFE= 0.1
##$AZFW= 0.1
##$BCFW= 1
##$BC_mod= 2
##$BYTORDP= 1
##$COROFFS= 0
##$CY= 11.3945322036743
##$DATMOD= 1
##$DC= 2
##$DFILT= <>
##$DTYPP= 0
##$F1P= 2.36226072786647
##$F2P= -0.459571619588291
##$FCOR= 0.5
##$FTSIZE= 0
##$FT_mod= 4
##$GAMMA= 1
##$GB= 0.15
##$INTBC= 1
##$INTSCL= 1
##$ISEN= 128
##$LB= 0.24
##$LEV0= 0
##$LPBIN= 0
##$MAXI= 10000
##$MC2= 0
##$MEAN= 0
##$ME_mod= 0
##$MI= 1.114404
##$NCOEF= 0
##$NC_proc= 0
##$NLEV= 6
##$NOISF1= 3.799351
##$NOISF2= 2.8
##$NSP= 1
##$NTH_PI= 0
##$NZP= 0
##$OFFSET= 15.70392
##$PC= 1
##$PHC0= -15162.34
##$PHC1= 24.00083
##$PH_mod= 1
##$PKNL= yes
##$PPARMOD= 0
##$PSCAL= 0
##$PSIGN= 0
##$REVERSE= no
##$SF= 200.130013532006
##$SI= 16384
##$SIGF1= 3
##$SIGF2= 2
##$SINO= 400
##$SIOLD= 16384
##$SREGLST= <1H.CDCl3>
##$SSB= 0
##$STSI= 0
##$STSR= 0
##$SW_p= 3612.71676300578
##$SYMM= 0
##$S_DEV= 0
##$TDeff= 0
##$TDoff= 0
##$TI= <>
##$TILT= no
##$TM1= 0
##$TM2= 0
##$TOPLEV= 0
##$USERP1= <user>
##$USERP2= <user>
##$USERP3= <user>
##$USERP4= <user>
##$USERP5= <user>
##$WDW= 1
##$XDIM= 8192
##$YMAX_p= 0
##$YMIN_p= 0
$$ End of Bruker specific parameters
$$ ---------------------------------
##NTUPLES= NMR FID
##VAR_NAME=  TIME,          FID/REAL,        FID/IMAG
##SYMBOL=    X,             R,               I
##VAR_TYPE=  INDEPENDENT,   DEPENDENT,       DEPENDENT
##VAR_FORM=  AFFN,          ASDF,            ASDF
##VAR_DIM=   8192,          8192,            8192
##UNITS=     SECONDS,       ARBITRARY UNITS, ARBITRARY UNITS
##FACTOR=    0.0002768,     1,               1
##FIRST=     0,             0,               0
##LAST=      2.2672688,     0,               0
##MIN=       0,             -455349,         0
##MAX=       2.2672688,     376151,          0
$$ Real data points
##PAGE= N=1
##DATA TABLE= (X++(R..R)), XYDATA
$$ plain form
0 0 0 0 0 0 0 0 0 0 0 0 -8 8 -8 8 -16 16 -24 25 -32 40 -48 56 -68 80 -96 112 -128 151 -173 198 -225 257
32 257 -293 333 -376 422 -476 534 -597 662 -740 823 -912 1010 -1117 1235 -1362 1503 -1657
49 -1657 1824 -2009 2214 -2441 2693 -2974 3294 -3654 4066 -4549 5114 -5792 6618 -7658 9011
64 9011 -10842 13479 -17624 25122 -42931 178456 -52385 -447665 35695 315095 50031
75 50031 -216225 -38831 90294 55440 18059 -22203 -140653 -32156 198585 117873 -217258
86 -217258 -187833 161858 209440 -106911 -187228 36651 135069 4146 -73595 -44394 1309
97 1309 63422 85245 -50909 -139304 19689 156036 13665 -122505 -10227 92420 -974
108 -974 -50381 20565 5623 -43069 42460 76427 -73084 -116321 69257 125256 -62040 -111769
$$ packed form
0@%%%%%%%%%%qJ6j6J6k4L2m0M9n7P2q8J04j24J48j76K08k40K79l24L71m23M82
32B57n50O26p09P98q98J010j131J259j402J563j735J922k127K352k597K865l160
49a657L481l833M223m655N134n667O268o948P720q615R663j0906J2410j4276J6669
64I011j9853K4321l1103M2746o8053K21387k30841l95280M83360K79400k65064
75E0031k66256J77394J29125l4854l7381m0262j18450J08497K30741q0712l35131
86b17258K9425L49691M7582l16351q0317K23879R8418j30923p7741K9201M5703
97A309O2113K1823j36154q8395J58993J36347j42371j36170J12278J02647r3394
108i74m9407P0946j4942m8692Q5529L3967j49511m3237J85578N5999j87296m9729
$$ plain form
120 -111769 50247 66382 -62325 -28674 74865 -8829 -91607 44726 109219 -77840 -129826
131 -129826 97577 156744 -79628 -153599 59014 132908 -35517 -85938 31910 46878 -23948
142 -23948 -6166 19525 -34858 -26299 67635 37782 -88949 -56948 77114 53165 -62366 -43918
154 -43918 41659 19122 -32934 -745 17618 -18655 1817 42419 -9604 -57274 11837 65590
166 65590 -6108 -48876 20084 36798 -31733 -22883 44386 16843 -48583 -7481 50290 -5425
178 -5425 -54847 8075 45186 -12780 -33229 11557 5782 -29865 12651 48792 -26091 -66471
190 -66471 29973 75603 -29338 -78116 29276 83778 -14515 -69611 3312 48395 10581 -12308
202 -12308 -6466 -13837 -1401 35613 11173 -51608 -21530 57323 28279 -58830 -41922 41122
$$ packed form
120a11769J62016J6135j28707L3651J03539q3694q2778J36333O4493j87059n1986
131a29826K27403N9167k36372p3971K12613P3894j68425n0421J17848J4968p0826
142b3948J7782K5691n4383Q559R3934k9853j26731L2001J34062k3949j15531J8448
154d3918Q5577k2537n2056L2189J8363l6273K0472M0602n2023m7670O9111N3753
166F5590p1698m2768O8960J6714o8531Q850O7269k7543o5426M1102N7771n5715
178e425m9422O2922L7111n7966k0449M4786n775l5647M2516L6141p4883m0380
190f6471R6444M5630j04941m8778J07392N4502r8293n5096P2923M5083l7814k2889
202a2308N842p371J2436L7014k4440o2781L0078P8853k9044q7109J6908Q3044
$$ plain form
214 41122 39214 -25124 -30069 3282 6283 5901 12132 -12896 -27324 17085 44180 -14160 -53934
227 -53934 11399 60269 2652 -46675 -5581 34508 7494 -17079 -19 5217 -4527 6896
239 6896 7225 -20539 -16053 24540 20629 -28706 -28107 21881 19462 -22726 -13425 19852 5786 -19770
253 -19770 -815 17470 -4961 -11685 16406 12891 -17524 -8691 20142 10002 -14377 -1131 16060
266 16060 -3640 -14303 7943 11104 -9874 -8016 10650 1657 -18337 -3371 16355 -1647 -16598
279 -16598 1645 9828 -8160 -10093 10774 8269 -12319 -3213 14158 -874 -13082 7560 18042
292 18042 -4167 -14363 7249 13698 -6235 -6808 8737 4765 -6725 -2671 3315 -3855 -4578 7729
306 7729 1854 -15489 -6173 12598 2872 -15225 -4297 14175 2246 -14508 -1784 11635 1825
$$ packed form
214D1122j908o4338m945L3351L001l82O231k5028j4428M4409K7095n8340l9774
227e3934O5333M8870n7617m9327M1094M0089k7014k4573J7060N236r744J1423
239F896L29k7764M486M0593l911m9335N99M9988k419m2188R301L3277j4066k5556
253a9770J8955J8285k2431o724K8091l515l0415Q833K8833j0140k4379J3246J7191
266A6060j9700j0663K2246L161k0978J858J8666q993j9994J4966J9726j8002j4951
279a6598J8243Q183j7988j933K0867k505k0588R106J7371j5032j2208K0642J0482
292A8042k2209j0196K1612O449j9933n73J5545l972j1490M054N986p170p23J2307
306G729n875j7343R316J8771r726j8097J0928J8472j1929j6754J2724J3419r810
$$ plain form
319 1825 -3797 3070 2834 -3283 1877 9577 -779 -7108 6240 8826 -6023 -8687 5655 9061
333 9061 -5002 -8202 2783 1793 -5244 -1898 2217 -2031 -4892 809 1323 -6197 -2328 8246 2076
348 2076 -7842 -1425 7977 2728 -5293 1514 8348 1179 -3490 1308 2508 888 1921 2202 -2339
363 -2339 -4251 2359 3884 -4568 -5151 2035 2094 -4267 -5861 198 2031 -1977 -611 490 -3807 -1908
379 -1908 4883 4589 -3318 -4079 5594 6895 -2087 -3436 2124 5504 4150 -1454 -4051 -1659 4698 6222
395 6222 -3174 -9092 -765 7240 2282 -8515 -8214 3601 7359 -1717 -9609 -6393 5276 9229 -1414
410 -1414 -9941 -3909 8841 9403 -3962 -8924 2241 10863 5995 -5222 -7630 1973 10595 6324
424 6324 -6454 -11910 1290 13361 3456 -13652 -11042 8345 12598 -5474 -15420 -3533 9370
$$ packed form
319A825n622O867k36o117N160P700j0356o329J3348K586j4849k664J4342L406
333I061j4063l200J0985r90p037L346M115m248k861N701N14p520L869J0574o170
348B076r918O417R402n249q021O807O834p169m669M798J200j620J033K81m541
363b339j912O610J525q452n83P186N9o361j594O059J833m008J366J101m297J899
379a908O791k94p907p61R673J301q982j349N560L380j354n604k597K392O357J524
395F222r396n918Q327Q005m958j0797L01J1815L758r076p892L216J1669L953j0643
410a414q527O032J2750N62j3365m962J1165Q622m868j1217k408R603Q622m271
424F324j2778n456J3200J2071r905j7108K610J9387M253j8072r946J1887J2903
$$ plain form
437 9370 7340 -5106 -11164 -3704 8210 11095 -2103 -14079 -3130 14949 12022 -8258 -15218
450 -15218 4349 20729 6499 -16122 -12689 10505 17764 -2062 -16502 -6443 9701 10902 -3661
463 -3661 -15578 -6890 9956 11473 -5829 -17560 -4644 14883 12280 -9615 -19091 1872 21510
476 21510 7027 -15868 -10326 11556 14670 -2166 -10205 -2516 5319 9623 5281 -8739 -13198 3769
490 3769 17524 3560 -20047 -12786 14875 16636 -9739 -21647 -1298 17214 6451 -11847 -11281
503 -11281 608 10499 9515 -4173 -15005 -4024 18017 15685 -12702 -20475 7105 25937 6263
516 6263 -22846 -15489 16410 22749 -5204 -24021 -6260 19307 12757 -12454 -18024 -829 13770
529 13770 8683 -8949 -16335 -2914 16212 13088 -13392 -21335 5919 25299 5237 -22215 -11871
$$ packed form
437I370k030j2446o058P460J1914K885j3198j1976J0949J8079k927k0280o960
450a5218J9567J6380j4230k2621L433K3194P259j9826j4440J0059J6144J201j4563
463c661j1917Q688J6846J517j7302j1731J2916J9527k603k1895r476K0963J9638
476B1510j4483k2895N542K1882L114j6836q039P689P835M304m342j4020m459J6967
490C769J3755j3964k3607P261K7661J761k6375j1908K0349J8512j0763j8298N66
503a1281J1889R891r84j3688j0832J0981K2041k332k8387p773K7580J8832j9674
516F263k9109P357L1899O339k7953j8817J7761K5567o550k5211n570J7195J4599
529A3770n087j7632p386J3421J9126l124k6480p943K7254J9380k0062k7452J0344
$$ plain form
542 -11871 18990 18173 -8408 -15614 1286 12316 6508 -2146 -6974 -7146 4058 14633 424 -19565
556 -19565 -9888 16890 15655 -13680 -21466 3795 18174 2304 -14557 -10312 6168 12078 3322
569 3322 -8677 -10421 2858 15603 7067 -11643 -12715 8284 20541 1953 -20098 -10212 16510
582 16510 18774 -8117 -23316 -1246 21342 8959 -17496 -17136 7524 15949 -694 -14426 -8366
595 -8366 5696 11834 2242 -12590 -11417 8651 18696 -1311 -19443 -3561 19496 11337 -12851
608 -12851 -13086 8651 14390 -1123 -9514 -3210 4251 5426 1234 -5336 -7630 597 9035 996 -10697
623 -10697 -6124 5992 6544 -4501 -8399 56 5997 2889 -2519 -3762 132 3862 3191 398 -2129
638 -2129 -854 3653 4371 447 -4022 -2685 4571 5921 -2123 -7767 -1773 7259 3755 -7823 -6967
$$ packed form
542a1871L0861q17k6581p206J6900J1030n808q654m828j72J1204J0575j4209j9989
556a9565R677K6778j235k9335p786K5261J4379j5870j6861M245J6480N910q756
569C322j1999j744J3279J2745q536j8710j072K0999J2257j8588k2051R886K6722
582A6510K264k6891j5199K2070K2588j2383k6455L60K4660Q425j6643j3732O060
595h366J4062O138r592j4832J173K0068J0045k0007j8132J5882K3057q159k4188
608a2851k35K1737N739j5513q391O304P461J175m192o570k294Q227Q438q039j1693
623a0697M573J2116N52j1045l898Q455N941l108n408j243L894L730o71k793k527
638b129J275M507P18l924m469J337P256J350q044n644N994R032l504j1578Q56
$$ plain form
653 -6967 3725 5293 -2471 -6119 -1291 2388 1976 376 -3034 -4038 2556 6439 508 -5495 -1125
668 -1125 7028 4356 -3391 -3374 2869 4779 839 -2755 -1534 1603 1604 252 -2532 -2764 187 2095 -451
685 -451 -3694 -2455 1749 957 -2301 -1572 279 514 736 302 -501 -463 769 2225 906 -47 631 982
703 982 1788 1647 -681 -1380 471 2623 645 -3234 -1899 1982 1350 -2030 -3539 -680 1934 102
719 102 -2480 -1985 81 1703 265 -1896 -1390 1169 2810 970 -2017 -92 3082 2509 -262 -1591
735 -1591 776 2945 1143 -1430 -1543 483 2478 8 -3127 -1787 1025 1692 -1444 -3731 -709 1840
751 1840 230 -2496 -1895 1228 2093 -899 -1657 1 1922 1943 -415 -615 1503 2236 1068 -659 -122
768 -122 1682 1344 -429 -860 -156 1025 170 -1706 -1286 -133 20 -612 -1928 -1194 378 -269 -947 -1590
$$ packed form
653f967J0692J568p764l648M828L679m12j600l410j004O594L883n931o003M370
668a125Q153k672p747J7O243J910l940l594J221L137Jj352k784k32K951J908k546
685d51l243J239M204p92l258P29J851K35K22m34q03L8J232J456j319r53O78L51
703I82Q06j41k328o99J851K152j978l879J335L881o32l380j509K859K614j832
719A02k582M95K066J622j438k161N06K559J641j840k987J925L174n73k771j329
735a591K367K169j802k573j13K026J995k470l135J340K812O67l136k287L022K549
751A840j610k726O01L123Q65k992p58J658J921K1k358k00K118P33j168j727N37
768a22J804l38j773m31P04J181q55j876M20J153J53o32j316P34J572o47o78o43
$$ plain form
786 -1590 -154 1474 262 -835 87 821 1425 405 -126 937 1851 1118 43 -253 1082 1147 -476
803 -476 -765 27 697 -108 -1296 -748 100 -721 -1139 -1152 -100 -102 -657 -572 -289 -711 400 594 -360 119 778
824 778 1344 627 283 871 797 436 479 492 -7 347 497 460 -731 -1037 115 17 -1153 -1315 -635 -166 -443
845 -443 -742 -894 -1009 72 1098 -642 -1235 323 1649 796 -1193 74 1958 1467 232 1 136
862 136 986 1624 394 -943 -1243 1259 1647 -1782 -2651 18 1801 -276 -2546 -1139 883 451 -339
879 -339 -1119 -1399 763 1857 229 -1742 -642 3087 2150 -1242 -511 1071 1564 927 150 -253 -782 1194
897 1194 2482 -907 -3383 93 3014 29 -3689 -2146 2313 548 -2390 -1153 -40 -660 1 1582
913 1582 -675 -2946 600 4962 186 -4344 -57 5033 2451 -3154 -1550 2687 2392 -316 -805 -651
$$ packed form
786a590J436J628j212j097R22P34O04j020n31J063R14p33j075k96J335O5j623
803d76k89P92O70q05j188N48Q48q21m18j3J052kn55Q5K83m22J111J94r54M79O59
824G78N66p17l44N88p4l61M3J3m99L54J50l7j191l06J152r8j170j62O80M69k77
845d43k99j52j15J081J026j740n93J558J326q53j989J267J884m91j235k31J35
862A36Q50O38j230j337l00K502L88l429q69K669J783k077k270J407K022m32p90
879c39p80k80K162J094j628j971J100L729r37l392P31J582M93o37p77m03n29J976
897A194J288l389k476L476K921k985l718J543M459j765k938J237J113o20O61J581
913A582k257k271L546M362m776m530M287N090k582n605J604M237k95k708m89J54
$$ plain form
929 -651 229 1420 759 -1760 -2717 3 2566 -129 -3328 -2358 1003 2358 -494 -3828 -1690 2921
945 2921 3234 -1988 -4164 1725 4638 6 -2671 -29 2445 771 15 1790 -775 -2644 2429 5035
961 5035 -2348 -6584 1135 7171 -875 -8323 -674 5942 388 -5424 -1271 2610 -762 -1486 2146
976 2146 -383 -4171 1037 5999 190 -6279 -314 7660 2558 -5967 -2226 5204 4028 -2611 -3377
991 -3377 1528 2404 294 -1019 -1662 -1115 516 1040 -432 -2434 -2075 1170 2434 -949 -4138 -2005
1007 -2005 4385 3346 -4252 -4202 3502 5593 -2298 -4277 2739 4570 -1660 -1243 2845 600 -3332 1295
1023 1295 5314 -1989 -6965 2262 7563 -2510 -8701 793 7135 -1285 -7104 -84 4174 -1378 -2946
1038 -2946 1554 933 -2847 -5 4902 17 -5203 1113 6427 1087 -5260 -799 5368 2251 -2763
$$ packed form
929f51Q80J191o61k519r57K720K563k695l199R70L361J355k852l334K138M611
945B921L13n222k176N889K913m632k677K642K474j674p56J775k565j869N073K606
961E035p383m236P719O036q046p448P649O616n554n812M153L881l372p24L632
976B146k529l788N208M962n809o469N965P974n102q525L741P430j176o639p66
991c377M905Q76k110j313o43N47J631N24j472k002L59L245J264l383l189K133
1007b005O390j039p598N0P704K091p891j979P016J831o230M17M088k245l932M627
1023A295M019p303m976R227N301j0073o191R494O342q420n819P020M258n552j568
1038b946M500o21l780K842M907m885n220O316N314n340o347M461O167l117n014
$$ plain form
1053 -2763 -1979 1437 1747 356 -1354 -1500 97 1029 139 -2078 -974 705 -439 -175 -170 -2059 -1812
1070 -1812 2064 2469 -2395 -3972 3239 5093 -2541 -3762 2723 3822 -1594 -1835 2628 1488 -2804
1085 -2804 322 3574 -1344 -4345 1769 4830 -1739 -5715 1544 4606 -2268 -4978 971 2700 -1857
1100 -1857 -1797 1914 0 -2822 1304 3298 -1913 -2859 2981 3725 -1241 -2582 1861 2335 -1021 -559
1116 -559 799 64 86 788 -197 -2498 -683 2195 -477 -2871 -428 1653 -693 -2234 56 647 -1547
1133 -1547 -398 1824 -41 -2198 858 2944 -1041 -2414 1762 3114 -1207 -1066 2379 1393 -1806
1148 -1806 -43 2134 -72 -2555 1050 2480 -1980 -2846 1451 1349 -2534 -1833 1998 439 -2868 -46
1164 -46 1789 -1135 -2011 1441 2339 -1555 -1062 2627 1733 -2011 -189 2423 569 -1309 593 1980
$$ packed form
1053b763P84L416L10j391j710j46J597R32q90k217J104J679j144K64Nj889K47
1070a812L876M05m864j577P211J854p634j221O485J099n416k41M463j140m292
1085b804L126L252m918l001O114L061o569l976P259L062o874k710N949J729m557
1100a857O0L711j914k822M126J994n211r46N840P44m966j341M443M74l356M62
1116e59J358p35K2P02r85k301J815K878k672k394K443K081k346j541K290N91k194
1133a547J149K222j865k157L056K086l985j373M176J352m321J41L445r86l199
1148a806J763K177k206k483L605J430m460q66M297j02l883P01L831j559l307K822
1164d6J835k924q76L452Q98l894M93L689q94l744J822K612j854j878J902J387
$$ plain form
1180 1980 -951 -1403 1419 750 -2284 -688 1839 -86 -2474 -344 1883 -844 -2217 590 725 -1314
1196 -1314 -779 1302 189 -1590 642 2479 -548 -1276 1843 1749 -1136 -406 2092 980 -1706 279
1212 279 1896 -874 -1878 1075 1171 -1678 -1645 1266 528 -2435 -1089 1567 -531 -2088 434 1326 -1155
1229 -1155 -1703 1605 1620 -1386 -700 2031 827 -1403 -9 2070 374 -1270 1402 1775 -1135 -897
1245 -897 1275 449 -1775 -724 1699 -297 -2028 181 902 -1137 -1424 636 186 -1251 -462 1697
1261 1697 -66 -1323 493 1622 -325 -823 1072 1408 -818 -296 1562 436 -1032 517 967 -407
1277 -407 -1298 498 871 -1324 -951 849 -120 -1611 -194 1044 -460 -1476 435 1036 -931 -658 1172
1294 1172 481 -930 -164 1649 272 -997 627 1625 -136 -539 883 981 -746 -441 880 337 -1368
$$ packed form
1180A980k931m52K822o69l034J596K527j925k388K130K227k727j373K807J35k039
1196a314N35K081j113j779K232J837l027p28L119r4k885P30K498j112k686J985
1212B79J617k770j004K953R6k849L3K911p38k963J346K656k098j557K522Q92k481
1229a155n48L308J5l006O86K731j204k230J394K079j696j644K672L73k910K38
1245h97K172q26k224J051K423j996j731K209P21k039k87K060m50j437P89K159
1261A697j763j257J816J129j947m98J895L36k226N22J858j126j468J549M50j374
1277d07q91J796L73k195L73J800r69j491J417J238j504j016J911O01j967K73J830
1294A172o91j411P66J813j377j269J624R98j761m03J422R8j727L05J321n43j705
$$ plain form
1311 -1368 -286 1082 -590 -1171 -65 291 -798 -968 502 8 -868 111 743 -346 -795 369 1184
1328 1184 40 -342 803 822 -2 189 714 424 -89 372 666 -340 -522 582 159 -961 -506 204
1346 204 66 -908 -684 121 -644 -674 137 31 -477 -181 568 210 -522 -20 875 450 134 182 784 493 237
1367 237 390 436 -296 101 358 -228 -469 3 314 -124 -1064 -424 -169 -289 -346 -153 -321 -177 378 187 -267
1388 -267 -178 430 932 -113 -186 553 914 395 -497 296 650 366 289 204 -120 -326 106 297 -599 -908 -66
1409 -66 379 -498 -1042 -558 284 350 -901 -522 175 11 -78 -24 323 103 42 987 612 -279 85 857 929 -146
1431 -146 -876 105 881 -66 -995 -190 658 76 -805 -586 -164 -459 -214 -186 -505 -702 -174 599 107 -843
1451 -843 -234 638 1054 -238 -995 592 1311 45 -422 517 871 237 -320 243 523 -634 -723 475 -84
$$ packed form
1311a368J082J368j672n81J106L56j089j70J470m94q76R79O32j089m49J164Q15
1328A184j144l82J145J9q24J91N25k90n13M61K94j006j82J104m23j120M55P10
1346B04j38r74K24Q05p65l0Q11j06n08K96P49l58p32N02Q95m25l16M8O02k91k56
1367B37J53M6p32L97K57n86k41M72L11m38r40O40K55j20n7J93j68J44N55j91m54
1388b67Q9O08N02j045p3P39L61n19q92P93L54k84p7q5l24k06M32J91q96l09Q42
1409f6M45q77n44M84Q42O6j251L79O97j64q9N4L47k20o1R45l75q91L64P72P2j075
1431a46p30R81P76r47r29Q05Q48n82q81K19M22k95K45K8l19j97N28P73m92r50
1451h43O09Q72M16j292p57J587P19j266m67R39L54o34n57N63K80j157q9J198n59
$$ plain form
1470 -84 -988 -556 899 -82 -1466 -721 937 296 -1173 -1132 847 656 -968 -555 549 166 -243 331
1488 331 766 -66 -547 1119 1023 -437 -677 704 917 -328 -1055 58 748 -88 -769 -898 2 -49 -340
1507 -340 -490 102 -327 -283 -189 457 -88 -543 529 1264 -202 -786 471 1068 11 -956 360 1443 301
1526 301 -795 108 691 -49 -870 349 794 -658 -800 823 144 -1642 -935 1019 306 -1498 -581 973
1544 973 465 -861 -410 440 323 -367 613 535 -64 -60 702 574 -208 -213 567 752 -241 -595 45 388 -189
1565 -189 -829 -505 -44 325 -135 -805 -563 75 -146 -538 39 202 39 -53 570 528 -571 -32 980 216
1585 216 -1039 397 1268 261 -850 143 944 -694 -866 514 379 -922 -527 398 -97 -1285 -658
1602 -658 722 -107 -1041 -10 567 -25 -1029 85 642 -52 107 1019 406 -374 268 1063 235 -510 -23
$$ packed form
1470h4r04M32J455r81j384P45J658o41j469M1J979j91j624M13J104l83m09N74
1488C31M35q32m81J666r6j460k40J381K13j245p27J113O90q36o81j29R00n1k91
1507c40j50N92m29M4R4O46n45m55J072P35j466n84J257N97j057r67J316J083j142
1526C01j096R03N83p40q21J219M45j452j42J623o79j786P07J954p13j804R17J554
1544I73n08j326M51Q50j17o90R80p8n99MP62j28p82nP80J85r93l54O40L43n77
1565a89o40L24M61L69m60o70K42O38k21l92N77J63j63r2O23m2j099N39J012p64
1585B16j255J436Q71j007j111R93Q01j638j72J380j35j301L95R25m95j188O27
1602f58J380q29r34J031N77n92j004J114N57o94J59R12o13p80O42P95q28p45M87
$$ plain form
1621 -23 906 -24 -195 356 93 -481 -246 -5 -201 -748 183 19 -838 -850 441 211 -498 -314 580 138
1641 138 -421 645 578 -350 -42 956 434 -323 560 994 234 -409 610 330 -130 -375 339 218 -778 -423
1661 -423 493 -462 -1051 -149 278 26 -988 215 693 -686 -542 812 214 -441 28 1075 287 -381
1679 -381 212 861 -352 -133 796 533 -169 -250 330 -279 -453 98 412 -471 -356 -72 -16 -567 -558 -10 84
1700 84 -662 25 497 7 -105 164 767 -55 -70 909 381 -385 400 848 -144 -344 -29 435 -385 -535 515
1721 515 525 -823 -375 68 -274 -712 -236 340 -421 -602 196 259 -435 9 553 349 -431 52 736 53
1741 53 -61 408 491 -93 133 489 469 -292 -295 458 -224 -609 14 13 -391 -446 272 95 -711 -687 501 -10 -700
1764 -700 -48 387 -95 -335 475 325 -249 28 662 446 -249 24 1093 85 -590 343 275 -258 -134 150
$$ packed form
1621b3R29r30j71N51k63n74K35K41j96n47R31j64q57j2J291k30p09J84Q94m42
1641A38n59J066o7r28L08R98n22p57Q83M34p60o43J019k80m60k45P14j21r96L55
1661d23R16r55n89R02M27k52j014J203M78j379J44J354n98o55M69J047p88o68
1679c81N93O49j213K19R29k63p02q1N80o09j74N51L14q83J15K84N6n51RN48R4
1700H4p46O87M72m90j12K69O03q22j5R79n28p66P85M48r92k00L15M64q20j50J050
1721E15J0j348M48M43l42m38M76N76p61j81P98O3o94M44N44k04p80M83O84o83
1741E3j14M69Q3n84K26L56k0p61lP53o82l85O23jm04n5P18j77q06K4J188n11o90
1764g00O52M35m82k40Q10j50n74K77O34k16o95K73J069j008o75R33o8n33J24K84
$$ plain form
1784 150 -277 -398 -295 466 -349 -884 239 -93 -650 -407 69 202 -457 130 913 123 -50 334 580 -290
1804 -290 -180 775 515 -133 -151 896 151 -399 -151 404 -183 -524 55 208 -504 -482 -27 -10 -550 -277 312
1825 312 -63 -422 -45 442 -139 -65 349 278 19 304 293 248 -302 316 407 20 74 622 248 -343 153 375
1847 375 -242 -478 175 318 -760 -810 501 104 -639 -580 574 -120 -251 -80 197 -9 -119 102 633 -150
1867 -150 -393 509 409 4 -140 451 216 -331 -170 186 199 -206 -235 -391 -453 -230 107 -217 -502 -432 171
1888 171 -254 -295 156 196 -54 56 512 19 -401 622 852 43 -105 730 484 -89 -255 460 112 -475
1908 -475 61 82 -121 -606 224 135 -419 -824 73 380 -290 -734 -303 306 -108 -368 28 331 -226 60 240
1929 240 262 119 139 428 165 -132 387 229 315 -42 -401 3 176 -95 -559 -229 -48 -143 -665 -422 438
$$ packed form
1784A50m27j21J03P61q15n35J123l32n57K43M76J33o59N87P83p90j73L84K46q70
1804b90J10R55k60o48j8J047p45n50K48N55n87l41N79J53p12K2M55J7n40K73N89
1825C12l75l59L77M87n81P4M14p1k59K85j1m5n50O18R1l87N4N48l74n91M96K22
1847C75o17k36O53J43j078n0J311l97p43N9J154o94j31J71K77k06j10K21N31p83
1867a50k43R02j00m05j44N91k35n47J61L56J3m05k9j56o2K23L37l24k85P0O03
1888A71m25m1M51M0k50J10M56m93m20J023K30q09j48Q35k46n73j66P15l48n87
1908d75N36K1k03m85Q30q9n54m05Q97L07o70m44M31O09m14k60L96L03n57K86J80
1929B40K2j43K0K89k63k97N19j58Q6l57l59M04J73k71m64L30J81r5n22K43Q60
$$ plain form
1950 438 -69 -510 -103 114 -88 -341 373 335 -135 -207 634 443 -14 -15 443 289 -164 -172 381 445 -70 -365
1972 -365 24 270 -277 -352 62 -104 -317 -322 104 68 -511 -93 289 92 -552 -345 492 390 -161 67 706
1993 706 500 -3 131 137 164 -493 100 554 -156 -608 12 518 -206 -821 -137 349 -449 -590 -170 -64 -313
2014 -313 -307 74 -18 -289 -57 106 208 -260 -185 379 618 -35 -214 529 674 2 0 -9 345 -280 -189 -25 -105
2037 -105 105 -219 -203 133 -336 -456 138 370 -310 -310 394 446 -444 -302 469 408 -367 41 720 812 -197 -143
2059 -143 627 72 -247 272 478 -32 -516 218 199 -458 -301 -52 0 -508 -250 -135 7 -360 130 100 -12
2080 -12 -103 -15 120 241 91 41 290 163 54 171 221 241 177 366 -7 -123 305 -250 -441 261 299 -475 -207
2103 -207 342 -624 -422 270 181 -473 -341 452 138 -303 -48 403 401 -317 5 535 402 -152 325 657 59
$$ packed form
1950D38n07m41M07K17k02k53P14l8m70p2Q41j91m57jM58j54m53qN53O4n15k95
1972c65L89K46n47p5M14j66k13nM26l6n79M18L82j97o44K07Q37j02n51K28O39
1993G06k06n03J34OK7o57N93M54p10m52O20N06p24o15O84M86p98j41M20J06k49
2014c13OL81r2k71K32J63J02m68P5N64K39o53j79P43J45o72krL54o25R1J64q0
2037a05K10l24J6L36m69j20N94K32o80%P04N2q90J42P71o1p75M08O79R2j009N4
2059a43P70n55l19N19K06n10m84P34j9o57J57K49N2n08K58J15J42l67M90l0j12
2080a2r1Q8J35J21j50n0K49j27j09J17N0K0o4J89l73j16M28n55j91P02L8p74K68
2103b07N49r66K02O92q9o54J32P93l14m41K55M51kp18L22N30j33n54M77L32n98
$$ plain form
2124 59 123 516 18 -99 -348 437 442 -417 -346 99 108 -495 -409 -70 -197 -254 -289 -38 30 -65 174 149 -187 350
2148 350 221 -31 170 249 -35 -21 90 442 203 -220 329 128 -389 -122 77 85 -358 -90 202 -178 -476
2169 -476 -81 72 -357 -352 153 368 -437 -170 283 234 -217 -158 640 237 -164 159 483 203 -139 139 313
2190 313 39 150 274 20 -409 -115 -135 -346 -135 -297 -219 -349 -58 -124 22 -285 111 458 -192 -203 433
2211 433 98 -27 173 386 383 -350 293 575 -55 -147 126 233 -175 -428 482 59 -210 -11 -124 -229 -468
2232 -468 -343 -5 -223 -460 285 132 -202 -46 379 112 29 15 420 179 10 337 244 185 141 434 156 -95
2254 -95 -143 64 -179 -344 -51 -79 -13 -428 337 -90 -371 -207 267 65 -144 -178 161 -14 -19 179 540 -5
2276 -5 -81 591 301 42 208 365 29 -31 141 258 -80 -70 38 -168 -299 -108 -486 -184 -490 13 -41 -455
$$ packed form
2124E9O4L93m98j17k49P85Nq59P1M45Ro03Q6L39j27n7l5K51O8r5K39k5l36N37
2148C50j29k52K01P9k84J4J11L52k39m23N49k01n17K67J99Qm43K68K92l80k98
2169d76L95J53m29NN05K15q05K67M53m9m51N9P98m03m01L23L24k80l42K78J74
2190C13k74J11J24k54m29K94k0k11K11j62P8j30K91o6J46l07L96L47o50j1O36
2211D33l35j25K00K13lp33O43K82o30r2K73J07m08k53R10m23k69J99j13j05k39
2232d68J25L38k18k37P45j53l34J56M25k67q3j4M05k41j69L27r3n9m4K93k78k51
2254i5m8K07k43j65K93k8O6m15P65m27k81J64M74k02k09l4L39j75nJ98L61n45
2276ep6O72k90k59J66J57l36o0J72J17l38J0J08k06j31J91l78L02l06N03n4m14
$$ plain form
2298 -455 -384 130 256 -178 -94 243 94 -35 168 214 105 227 377 76 -67 -43 460 194 -40 180 24
2319 24 -163 -240 -87 88 -223 -240 -257 -403 -108 -123 64 -40 54 -257 -189 76 -167 177 162 194 -49 120 86
2342 86 -140 187 176 34 28 393 9 -89 234 93 71 -82 -304 -57 -287 -182 -9 -231 -128 -26 248 34
2364 34 -285 -123 273 248 211 79 291 202 40 351 426 281 -5 164 4 -82 -209 -61 -14 -52 -294 123 78
2387 78 -228 -46 -183 -187 -74 -38 -284 -106 148 143 -121 206 188 -90 7 224 605 -185 -115 256 41 2 96 265
2411 265 47 -442 -11 276 -364 -153 -264 200 -152 -467 -103 162 -236 -240 426 70 -35 -14 310 187 -72
2432 -72 94 232 133 110 -10 273 114 -56 -263 -125 69 -39 -147 -167 271 -495 -88 -134 -107 -325 -271 -305 152
2455 152 -67 -421 -103 114 66 -167 182 256 -262 -157 262 463 -236 -53 273 -79 -114 149 162 190 -160 -123
$$ packed form
2298d55P1N14J26m34Q4L37j49j29K03M6j09J22J50l01j43K4N03k66k34K20j56
2319B4j87p7J53J75l11j7j7j46K95j5J87j04R4l11O8K65k43L44j5L2k43J69l4
2342H6k26L27j1j42oL65l84r8L23j41k2j53k22K47k30J05J73k22J03J02K74k14
2364C4l19J62L96k5l7j32K12q9j62L11P5j45k86J69j60q6j27J48M7l8k42M17m5
2387G8l06J82j37mJ13L6k46J78K54nk64L27j8k78R7K17L81p90P0L71k15l9R4J69
2411B65k18m89M31K87o40K11j11M64l52l15L64K65l98mO66l56j05K1L24j23k59
2432g2J66J38r9k3j20K83j59j70k07J38J94j08j08k0M38p66M07m6K7k18N4l4M57
2455A52k19l54L18K17m8k33L49P4n18J05M19K01o99J83L26l52l5K63J3K8l50L7
$$ plain form
2477 -123 188 -17 -262 -362 132 -177 -504 -139 73 -1 -225 -142 22 -169 -246 131 199 -5 -38 240 207 -45
2499 -45 -47 346 169 -182 66 9 277 157 -253 -49 215 -120 -193 -13 -102 -407 -190 161 -132 -253 -105 175
2521 175 58 -21 -309 -113 160 -291 105 125 153 190 -28 147 128 -161 135 132 146 201 -203 8 80 -296 -52
2544 -52 -126 77 -240 -256 104 22 34 182 125 -103 -382 64 240 280 -192 -13 329 144 -167 -40 563 312
2566 312 -262 449 199 -38 -264 -1 116 -297 -125 -194 -208 47 -73 33 -72 -200 -126 -14 36 -57 -99 -39
2588 -39 -99 -29 -18 228 151 -26 215 92 77 214 255 28 218 177 -54 46 137 -148 -376 -167 235 -336 -279
2611 -279 60 14 -66 -359 -7 293 -361 -19 92 233 -222 -48 346 -2 -33 26 393 335 -88 103 113 -130
2633 -130 148 74 -25 -162 197 -20 -197 -151 63 -18 -214 -201 76 -220 -406 170 149 -22 79 389 45 -224
$$ packed form
2477a23L11k05k45j00M94l09l27L65K12p4k24Q3J64j91p7L77O8k04l3K78l3k52
2499d5kL93j77l51K48n7K68j20m10K04K64l35p3J80q9l05K17L51k93j21J48K80
2521A75j17p9k88J96K73m51L96K0K8L7k18J75j9k89K96lJ4N5m04K11P2l76K44
2544e2p4K03l17j6L60q2J2J48n7k28k79M46J76M0m72J79L42j85l11J27O03k51
2566C12n74P11k50k37k26K63J17m13J72o9j4K55j20J06j05j28P4J12N0r3m2O0
2588c9o0P0J1K46p7j77K41j23j5J37M1k27J90m1k31J00R1k85k28K09M02n71N7
2611b79L39m6q0k93L52L00o54L42J11J41m55J74L94l48l1N9L67n8m23J91J0k43
2633a30K78p4r9j37L59k17j77M6K14q1j96J3K77k96j86N76k1j71J01L10l44k69
$$ plain form
2655 -224 -114 162 43 -216 254 458 2 -61 298 73 -343 -14 169 -191 -384 -278 -6 -236 -499 102
2675 102 169 -515 -355 278 236 86 -34 160 110 -49 377 371 237 -236 93 102 238 -109 6 50 -32 121 198
2698 198 27 117 6 -1 -197 -114 129 -237 -220 -158 4 -89 -102 82 335 -78 197 299 204 -130 94 168 81 -69
2722 -69 384 620 81 -55 2 292 -137 -142 30 3 -248 -57 176 -191 -239 -61 137 51 -329 -7 32 -318 77
2745 77 250 134 301 63 21 55 116 182 -196 198 113 121 -196 -64 129 165 -313 -62 258 79 -165 -183 93
2768 93 -152 -139 -26 -41 -209 -333 38 288 -309 49 242 410 -66 -2 685 254 -215 193 407 -46 -50 355
2790 355 49 -297 -68 -66 -37 -147 -40 -125 22 -175 93 53 -124 -297 405 -288 -222 152 254 40 -16 365
2812 365 -43 49 146 135 -88 -205 138 350 -206 -264 59 153 -218 -30 -200 -161 -444 -283 81 -147 -332 -159
$$ packed form
2655b24J10K76j19k59M70K04m56o3L59k25m16L29J83l60j93J06K72k30k63O01
2675A02O7o84J60O33m2j50j20J94n0j59M26oj34m73L29RJ36l47J15M4q2J53P7
2698A98j71R0j11pj96Q3K43l66J7O2J62r3j3J84K53m13K75J02r5l34K24P4q7j50
2722f9M53K36n39j36N7K90m29nJ72k7k51J91K33l67m8J78J98q6l80L22L9l50L95
2745G7J73j16J67k38m2L4O1O6l78L94q5Ql17J32J93L6m78K51L20j79k44j8K76
2768I3k45J3J13j5j68j24L71K50n97L58J93J68m76O4O87m31m69M08K14m53mM05
2790C55l06l46K29KK9j10J07q5J47j97K68m0j77j73P02o93O6L74J02k14n6L81
2812C65m08R2R7j1k23j17L43K12n56n8L23R4l71J88j70L9k83J61L64k28j85J73
$$ plain form
2834 -159 98 -198 -227 107 -3 -162 -22 240 202 -230 188 167 184 25 -63 -52 -160 -19 191 -216 -68 -275
2856 -275 31 -382 -287 -56 -144 -139 48 -93 -235 -125 261 -189 -188 -315 176 139 -17 -114 123 141 -65 219 365
2879 365 444 -133 139 236 229 -113 -85 173 -235 67 33 29 -278 -49 -54 -44 -195 -117 14 -70 32 -128 126 -9
2903 -9 26 64 192 47 241 150 106 -10 217 107 50 154 188 -11 -7 -67 282 -174 -219 -98 -81 -471 -11 44 1
2928 1 -77 78 39 57 -258 54 -28 -38 -6 190 197 -46 -117 46 132 324 73 -29 -225 -43 -13 -44 -34 58 -238
2953 -238 -177 136 138 -211 -162 -273 -130 20 -63 -151 53 -126 -136 42 278 206 4 422 76 -31 20 309 68
2976 68 -291 22 287 -15 -163 212 265 2 -306 -213 23 68 -5 81 -37 31 -108 -233 -15 -25 19 124 6
2999 6 49 180 -15 199 157 -121 275 57 -22 -75 -60 217 -7 -73 -128 49 14 50 206 46 -12 -61 -77 24 -312
$$ packed form
2834a59K57k96k9L34j10j59J40K62l8m32M18k1J7j59q8J1j08J41K10m07J48k07
2856b75L06m13R5K31q8NJ87j41j42J10L86m50Jj27M91l7j56r7K37J8k06K84J46
2879C65P9n77K72R7pl42K8K58m08L02l4ml07K29nJ0j51P8J31q4J02j60K54j35
2903iL5L8J28j45J94r1m4j16K27j10n7J04L4j99Mo0L49m56m5J21J7l90M60N5m3
2928Ap8J55l9J8l15L12q2j0L2J96Pk43p1J63Q6J92k51j02j96J82L0l1J0R2k96
2953b38O1L13Kl49M9j11J43J50q3q8K04j79j0J78K36p2k02M18l46j07N1K89k41
2976F8l59L13K65l02j48L75N3k63l08R3K36M5p3Q6j18O8j39j25K18j0M4J05j18
2999FM3J31j95K14m2k78L96k18p9n3J5K77k24o6n5J77l5L6J56j60n8m9j6J01l36
$$ plain form
3024 -312 -319 217 76 -1 -149 139 205 -84 191 44 281 107 90 187 72 8 62 154 -22 131 77 97 17 38
3048 38 -295 -174 -160 -23 6 204 -155 -321 -118 120 228 2 -84 55 8 0 195 95 -57 43 266 248 238
3071 238 -117 -71 37 88 -203 -304 69 -44 -306 -41 -211 -433 227 -40 131 -204 -111 -124 23 183 -10
3092 -10 158 131 121 236 67 165 73 -133 232 153 325 -243 50 304 -187 -131 34 -98 -251 -175 -168 14 -138
3115 -138 -278 -95 26 -232 -316 -87 249 60 61 143 360 -223 -166 108 423 -42 22 86 233 -16 84 125 63
3138 63 -214 -158 156 -6 24 -134 -160 92 -165 -1 -55 82 -231 -11 -22 227 -106 -70 329 141 -141 -15
3160 -15 205 65 -5 121 302 112 95 64 16 43 151 -161 -49 -292 -427 -103 -67 -113 -132 25 227 60 -125
3183 -125 -145 232 -4 -34 -130 189 70 -47 150 -12 -151 -16 96 97 228 -31 115 29 -152 -15 144 51
$$ packed form
3024c12pN36j41p7j48K88O6k89K75j47K37j74j7R7j15o4N4R2j76J53n4K0q0K1
3048C8l33J21J4J37K9J98l59j66K03K38J08k26q6J39m7qJ95j00j52J00K23j8j0
3071B38l55M6J08N1k91j01L73j13k62K65j70k22O60k67J71l35R3j3J47J60j93
3092a0J68k7j0J15j69R8r2k06L65p9J72n68K93K54m91N6J65j32j53P6PJ82j52
3115a38j40J83J21k58q4K29L36j89JQ2K17n83N7K74L15m65O4O4J47k49J00M1o2
3138F3k77N6L14j62L0j58k6K52k57J64n4J37l13K20j1K49l33L6L99j88k82J26
3160a5K20j40p0J26J81j90j7l1m8K7J08l12J12k43j35L24L6m6j9J57K02j67j85
3183a25k0L77k36l0r6L19j19j17J97j62j39J35J12JJ31k59J46q6j81J37J59r3
$$ plain form
3205 51 -93 -234 129 -256 -176 63 -150 68 -24 -218 60 87 257 -13 78 -26 132 27 28 -1 -118 35 44
3228 44 162 136 143 116 240 55 -128 8 -334 -95 34 25 72 -306 58 73 -200 -40 -338 100 132 -57 317
3251 317 202 283 -163 275 68 272 106 165 144 -146 85 64 -26 232 -21 -9 -219 -129 -75 -314 -170 135 -173
3274 -173 -92 -77 16 -52 -122 97 197 12 -14 187 234 206 463 156 105 88 -3 276 -100 93 69 -258 -16 -85
3298 -85 331 -18 -49 -56 39 -23 -263 -6 -55 -15 -176 256 -11 123 22 280 99 -65 -88 314 94 254 359
3321 359 77 -147 -138 117 -7 -52 -72 -69 49 202 161 -210 72 -258 -265 145 58 103 32 162 55 -123 68 244
3345 244 80 181 136 115 322 234 17 83 215 0 74 150 45 116 179 -34 -29 -92 -148 -80 -85 -171 111 4 -6 -197
3371 -197 190 167 -265 62 84 109 60 133 315 -140 140 110 109 135 -180 127 -61 0 -249 129 -134 8 241
$$ packed form
3205E1j44j41L63l85Q0K39k13K18r2j94K78K7J70k70R1j04J58j05Jk9j17J53R
3228D4J18k6Pk7J24j85j83J36l42K39J29rM7l78L64J5k73J60k98M38L2j89L74
3251C17j15Q1m46M38k07K04j66N9k1k90K31k1r0K58k53J2k10R0N4k39J44L05l08
3274a73Q1J5R3o8p0K19J00j85k6K01M7k8K57l07n1j7r1K79l76J93k4l27K42o9
3298h5M16l49l1pR5o2k40K57m9M0j61M32k67J34j01K58j81j64k3M02k20J60J05
3321C59k82k24RK55j24m5k0LJ18J53m1l71K82l30pM10q7M5p1J30j07j78J91J76
3345B44j64J01m5k1K07q8k17O6J32k15P4P6j05P1O3k13No3n6O8nq6K82j07j0j91
3371a97L87k3m32L27K2K5m9P3J82m55K80l0jK6l15L07j88O1k49L78k63J42K33
$$ plain form
3394 241 62 70 -46 -400 289 -61 -108 -152 -78 -33 -114 -133 268 -121 -1 164 36 77 274 57 153 202 -51 26
3418 26 -189 -199 -141 126 63 190 -24 -233 -170 -222 -341 -374 -199 45 -319 -80 -161 116 -123 -118 52 37 -238 -179
3442 -179 -64 -154 213 -1 280 145 34 -89 182 38 179 -206 -37 124 -222 -177 24 86 -111 -111 12 -49
3464 -49 -130 -32 129 -4 79 124 83 -53 -75 169 63 -44 93 91 178 132 26 121 -152 129 -3 31 -41 230 -125
3489 -125 -95 -191 14 282 -33 -124 60 -107 -119 120 213 -78 -89 -77 220 36 304 166 -117 29 -47 328 231
3512 231 -180 -126 -33 71 -204 -225 -29 364 96 -281 -46 -177 -225 -260 47 -177 -35 -34 -90 -32 132 -27 -183
3535 -183 160 -15 -120 208 -88 2 -159 234 103 -65 83 -8 242 71 89 -331 -71 36 -8 97 99 -62
3557 -62 -111 -62 -88 -204 -111 116 -19 -306 105 -132 -246 -235 311 291 25 87 386 116 327 -5 -203 122 -174
$$ packed form
3394B41j79Qj16l54O89l50m7m4P4M5q1j9M01l89J20J65j28M1J97k17R6M9k53P7
3418B6k15j0N8K67o3J27k14k09O3n2j19l3J75K44l64K39q1K77k39NJ70j5k75N9
3442a79J15r0L67k14K81j35j11j23K71j44J41l85J69J61l46M5K01O2j97%J23o1
3464d9q1R8J61j33Q3M5m1j36k2K44j06j07J37kQ7m6j06R5k73K81j32L4p2K71l55
3489a25L0r6K05K68l15r1J84j67j2K39R3k91j1J2K97j84K68j38k83J46p6L75r7
3512B31m11N4R3J04k75k1J96L93k68l77K35j31m8l5L07k24J42Jn6N8J64j59j56
3535a83L43j75j05L28k96R0j61L93j31j68J48r1K50j71J8m20K60J07m4J05Kj61
3557f2m9M9k6j16R3K27j35k87M11k37j14J1N46k0k66O2K99k70K11l32j98L25k96
$$ plain form
3580 -174 -86 -62 -147 -22 -165 -147 87 -119 15 196 33 -236 -212 45 85 8 -108 257 224 10 97 38 100 150
3604 150 396 139 -55 2 -103 40 143 -66 93 -176 -102 130 146 196 -146 33 -49 123 120 -17 -84 203 -17
3627 -17 143 -23 -106 -191 -27 43 314 50 24 22 -94 -30 -167 -231 -55 -112 -163 30 -61 30 -137 -15 -122 -131 94
3652 94 3 221 177 1 250 -11 -88 55 -193 128 -123 -375 33 90 181 310 20 -171 -7 108 170 -8
3674 -8 -39 19 -48 -129 -143 12 -120 77 -29 -53 -6 13 27 30 44 53 96 -22 257 226 236 94 178 61 -115 26 181
3701 181 95 -32 194 338 89 50 149 -133 36 -9 -99 112 121 -325 -147 -167 -52 -46 -57 -20 120 -253 -131 -32
3725 -32 -181 43 73 88 35 -9 221 196 31 207 -71 58 90 269 -105 110 99 -49 55 -149 -135 -110 95
3748 95 -50 54 -156 130 27 -121 -121 -133 289 57 51 -111 224 127 -31 -143 -1 2 -47 -134 -93 -2 -317 -83
$$ packed form
3580a74Q8K4q5J25j43J8K34k06J34J81j63k69K4K57M0p7j16L65l3k14Q7n9O2N0
3604A50K46k57j94N7j05J43J03k09J59k69P4K32J6N0l42J79q2J72lj37o7K87k20
3627a7J60j66q3q5J64P0K71k64k6kj16O4j37o4J76n7n1J93r1R1j67J22j07rK25
3652I4r1K18m4j76K49k61p7J43k48L21k51k52M08N7R1J29k90j91J64J15O2j78
3674hl1N8o7q1j4J55j32J97j06k4M7J9J4LJ4RM3j18K79l1J0j42Q4j17j76J41J55
3701A81q6j27K26J44k49l9R9k82J69m5r0K11Rm46J78k0J15Oj1L7J40l73J22R9
3725c2j49K24L0J5n3m4K30k5j65J76k78J29L2J79l74K15j1j48J04k04J4K5K05
3748I5j45J04k10K86j03j48%j2M22k32oj62L35r7j58j12J42Lm9q7M1R1l15K34
$$ plain form
3772 -83 75 60 -22 -10 35 137 -4 -192 134 -104 -123 19 24 109 35 175 -18 -56 249 27 117 134 276 46
3796 46 77 -2 51 137 -171 -5 -221 32 -242 -53 -278 27 -86 -129 88 -44 -152 49 -115 -24 31 -48 91
3819 91 -42 97 153 75 39 260 -10 127 -8 -87 85 -14 -21 152 31 -84 -99 28 -122 -102 -112 -120 -81 10 167
3844 167 46 235 -90 100 -121 -51 -134 -64 -28 -11 210 209 141 -166 -59 -10 76 131 11 25 104 11 -122 -216 -118
3869 -118 107 15 -87 98 -171 -34 -159 129 98 -232 10 414 12 8 -120 -108 96 76 135 13 -14 -80 -12
3892 -12 137 -197 136 129 -117 -64 166 -140 -348 -260 189 -112 -45 -62 -76 184 -231 0 6 106 231 85 251
3915 251 -36 77 183 -259 164 76 150 12 -56 53 73 60 26 -101 -90 -404 -122 -237 -97 -175 16 -176 -259
3938 -259 -116 -52 120 138 95 8 -18 232 305 -7 -132 -107 -59 22 192 185 8 -21 324 180 -33 11 -257 -41
$$ packed form
3772h3J58j5q2J2M5J02j41j88L26k38j9J42NQ5p4J40j93l8L05k22R0J7J42k30
3796D6L1p9N3Q6l08J66k16K53k74J89k25L05j13m3K17j32j08K01j64R1N5p9J39
3819I1j33J39N6p8l6K21k70J37j35p9J72r9pJ73j21j15j5J27j50K0j0qL9R1J57
3844A67j21J89l25J90k21P0q3P0L6J7K21jo8l07J07M9Q6N5j20J4P9r3j33r4R8
3869a18K25r2j02J85k69J37j25K88l1l30K42M04m02mj28J2K04k0N9j22k7o6O8
3892a2J49l34L33pk46N3K30l06k08Q8M49l01O7j7j4K60m15K31OJ00J25j46J66
3915B51k87J13J06m42M23q8P4j38o8J09K0j3l4j27J1l14K82j15J40p8J91j92q3
3938b59J43O4J72J8m3q7k6K50P3l12j25K5M8Q1J70pj77k9L45j44k13M4k68K16
$$ plain form
3962 -41 -95 95 -179 -141 61 -208 -302 129 255 -73 78 97 50 157 154 36 -270 47 178 95 103 69 207 -211
3986 -211 -116 153 -21 -256 72 95 69 -120 77 -27 130 -83 74 232 39 -57 200 19 -10 -50 -22 -299
4008 -299 -90 71 14 223 96 -107 -85 -141 196 318 -55 -2 97 35 23 -186 -59 74 88 -123 106 -121 -186
4031 -186 -59 -424 11 -100 145 67 -317 5 -8 54 96 -5 288 -125 110 129 -89 -254 36 51 77 291
4053 291 -177 -72 -91 -93 -35 -63 -169 55 -306 150 -174 -140 -29 112 71 5 -109 82 118 -77 201 69 43
4076 43 105 221 -176 262 -190 69 16 224 -126 -174 -257 106 -23 123 -107 2 -143 -56 -193 -64 117 -64
4098 -64 -72 274 241 -254 -232 4 37 200 -22 415 33 -333 -171 -35 202 168 -38 -137 70 -202 69 -55 -137
4121 -137 39 -26 36 -152 -202 26 -40 138 -117 -40 77 -74 -150 -149 29 119 24 48 -59 -130 20 147 18 289
$$ packed form
3962d1n4J90k74L8K02k69r4M31J26l28J51J9m7J07lj18l06L17J31q3Ql4J38m18
3986b11R5K69j74k35L28K3k6j89J97j04J57k13J57J58j93r6K57j81k9m0K8k77
4008b99K09J61n7K09j27k03K2n6L37J22l73N3R9o2j2k09J27J33J4k11K29k27o5
4031a86J27l65M35j11K45p8l84L22j3O2M2j01K93m13K35J9k18j65K90J5K6K14
4053B91m68J05j9kN8k8j06K24l61M56l24L4J11J41m1o6j14J91L6j95K78j32k6
4076D3O2J16l97M38m52K59n3K08l50m8q3L63j29J46k30J09j45Q7j37J29J81j81
4098f4qL46l3m95K2K36L3J63k22M37l82l66J62J36K37l4k06r9K07k72K71j24q2
4121a37J76o5O2j88n0K28o6J78k55P7J17j51p6JJ78R0r5K4j07p1J50J27j29K71
$$ plain form
4145 289 -27 146 -132 -228 -144 177 -137 -287 -115 -292 -362 -232 -31 67 -21 -44 69 -281 -155 -97 162 -101
4167 -101 -18 129 -27 47 34 156 -172 -35 71 -30 70 -22 140 168 5 29 -68 -134 -72 -145 -117 168 75 -10
4191 -10 -163 -199 -8 132 -277 -37 -208 55 185 93 128 -25 50 172 -96 119 -97 -11 63 149 -75 -13 130
4214 130 339 -69 9 173 -50 -53 -163 -99 -150 -55 -60 157 -78 46 37 -95 16 -54 228 473 101 70 88 -68
4238 -68 -167 -37 -170 191 -379 -134 -9 98 7 -174 -109 -130 -185 68 -6 -44 105 34 -10 172 -29 183 289
4261 289 116 51 2 -2 26 -262 152 274 -51 44 -60 -219 -123 165 -117 -53 -135 25 -286 -191 70 -153 -154 28
4285 28 -37 19 -103 91 -46 -85 49 116 79 29 166 -49 10 -158 269 33 145 -10 187 97 -1 36 344 -52
4309 -52 -76 -123 -110 49 62 -84 -131 50 -28 225 2 -137 -388 -87 70 6 164 -119 170 157 -47 19 117 12
$$ packed form
4145B89l16J73k78r6Q4L21l14j50J72j77p0J30K01R8q8k3J13l50J26N8K59k63
4167a01Q3J47j56P4j3J22l28J37J06j01J00r2J62K8j63K4r7o6O2p3K8K85r3q5
4191a0j53l6J91J40m09K40j71K63J30r2L5j53P5J22k68K15k16Q6P4Q6k24O2J43
4214A30K09m08P8J64k23lj10O4n1R5nK17k35J24rj32J11p0K82K45l72l1J8j56
4238f8r9J30j33L61n70K45J25J07r1j81O5k1n5K53p4l8J49p1m4J82k01K12J06
4261B89j73o5m9mK8k88M14J22l25R5j04j59R6K88k82O4q2J60l11R5K61k23jJ82
4285B8o5N6j22J94j37l9J34O7l7n0J37k15N9j68M27k36J12j55J97r0r8L7L08l96
4309e2k4m7J3J59J3j46m7J81p8K53k23j39k51L01J57o4J58k83K89j3k04O6R8j05
$$ plain form
4333 12 -97 -67 -219 10 172 112 171 85 -7 115 -326 49 100 -71 -106 19 -69 45 -39 149 -86 139 164 211
4357 211 -12 22 198 -13 -18 -13 130 57 103 -311 -261 -20 134 169 125 45 -163 -18 -92 -65 33 68 8 221 -79
4382 -79 55 -266 202 -6 62 34 105 118 -30 205 51 -32 -31 -112 -47 39 218 189 64 -51 47 -103 -111 -18 -5 248
4408 248 -45 -112 -87 -13 104 200 122 -93 -83 -5 -88 -6 27 60 225 128 198 32 67 77 5 -2 287 -138 -106 75
4434 75 -156 -97 -9 52 -163 -91 -281 -175 49 161 -112 137 58 343 160 116 -26 45 -131 -68 113 73 -124
4457 -124 262 72 210 -25 136 -52 17 37 -205 140 -111 -50 149 -52 -135 248 -137 -36 -32 153 38 -50
4479 -50 -172 118 77 -100 -27 70 -57 -106 132 364 35 -167 -144 -40 59 -159 -121 -8 -160 -279 139 47 140
4502 140 -199 115 -6 32 -9 85 -24 -88 -38 -365 -110 262 378 -11 102 87 99 74 -73 -60 32 -129 11
$$ packed form
4333A2j09L0j52K29J62o0N9q6r2J22m41L75N1j71l5J25q8J14q4J88k35K25K5M7
4357B11k23L4J76k11nNJ43p3M6m14N0K41J54L5m4q0k08J45p4K7R8L5o0K13l00
4382g9J34l21M68k08O8k8P1J3j48K35j54q3Jq1O5Q6J79k9j25j15R8j50qR3J3K53
4408B48k93o7K5P4J17R6p8k15J0P8q3Q2L3L3J65r7P0j66L5J0p2pK89m25L2J81
4434G5k31N9Q8O1k15P2j90J06K24J12k73K49p9K85j83m4j42P1j76O3J81m0j97
4457a24L86j90J38k35J61j88O9K0k42L45k51O1J99k01q3L83l85J01MJ85j15q8
4479e0j22K90m1j77P3R7j27m9K38K32l29k02K3J04R9k18L8J13j52j19M18r2R3
4502A40l39L14j21L8m1R4j09o4N0l27K55L72J16l89J13j5J2k5j47J3R2j61J40
$$ plain form
4525 11 179 67 142 205 -125 267 37 -61 -67 -43 254 -99 -160 94 -104 36 -113 -9 -84 116 179 -113 0
4548 0 -59 -142 147 170 174 -145 34 -226 19 126 -151 -107 -162 -124 -62 24 -116 -65 27 -206 71 -147 -107 -135 -205 -104
4574 -104 159 74 -56 29 133 -77 -61 39 25 -121 -58 35 138 -91 121 -83 46 121 202 -119 -325 -30 34
4597 34 87 20 -54 -45 17 -75 142 90 21 -67 -100 -132 189 275 128 69 -119 89 -43 37 279 109 -77 -121 79 173
4623 173 -203 95 67 72 -130 -141 -142 -188 -23 -38 116 228 -68 109 35 78 14 -138 -235 89 -3 124 283 122
4647 122 122 172 15 122 100 -97 33 -12 3 101 -366 -56 136 -30 -114 -96 -366 8 3 8 -14 11 193 -50 147
4672 147 -190 184 277 167 -30 258 70 -16 140 -255 -117 36 17 153 -37 -113 3 -258 -87 -287 -44
4693 -44 260 64 -15 69 98 -122 -123 169 26 191 -93 111 25 -181 -124 87 51 84 -87 -72 -111 -120 -134 13 130
$$ packed form
4525A1J68j12P5O3l30L92k30r8oK4K97l53o1K54j98J40j49J04p5K00O3k92J13
4548@n9q3K89K3Ml19J79k60K45J07k77M4n5L8O2Q6j40N1R2k33K77k18M0k8p0J01
4574a04K63q5j30Q5J04k10J6J00j4j46O3R3J03k29K12k04J29P5Q1l21k06K95O4
4597C4N3o7p4RO2r2K17n2o9q8l3l2L21Q6j47n9j88K08j32Q0K42j70j86m4K00R4
4623A73l76K98k8Nk02j1jm6J65j5J54J12k96J77p4M3o4j52r7L24r2J27J59j61
4647A22%N0j57J07k2j97J30m5J5R8m67L10J92j66q4J8k70L74nNk2K5J82k43J97
4672A47l37L74R3j10j97K88j88q6J56l95J38J53j9J36j90p6J16k61J71k00K43
4693d4L04j96p9Q4K9k20jK92j43J65k84K04q6k06N7K11l6L3j71J5l9rj4J47J17
$$ plain form
4718 130 -81 -34 -65 -55 122 -39 96 -21 -153 56 -39 107 83 -12 28 79 -67 -117 -256 100 -174 -86 -29 -23
4742 -23 120 -150 111 48 -222 -71 99 237 -199 111 102 132 167 23 97 42 -25 -193 111 47 -38 -74 96 89 -70
4767 -70 111 166 100 66 -28 -50 -248 107 -46 168 -257 -105 99 -56 0 169 -223 -143 -162 92 9 -111 -86 -109
4791 -109 115 123 82 354 132 -30 218 -157 -10 -6 -52 -194 -82 167 206 -174 -170 162 -118 166 111 -6 -119
4814 -119 -138 131 -81 -63 -71 126 -99 -262 -247 -46 -83 68 180 11 43 -88 163 160 -219 -55 286 216 -37
4837 -37 169 62 223 120 -150 176 -97 -55 96 -51 39 24 -57 -269 -136 -79 -81 17 -155 -20 32 143 -36
4860 -36 18 -19 71 -33 -197 59 -93 212 -136 -89 -161 5 85 -104 -59 -182 -294 -97 -187 158 66 -142 -29
4883 -29 -285 196 -81 267 122 -4 -33 -156 84 -93 14 -23 -40 106 -4 44 -51 5 12 -49 -76 186 65 94
$$ packed form
4718A30k11M7l1J0J77j61J35j17j32K09r5J46k4r5M0N1j46n0j39L56k74Q8N7O
4742b3J43k70K61o3k70J51J70J38m36L10rL0L5j44P4n5o7j68L04o4q5l6J70pj59
4767g0J81N5o6l4r4k2j98L55j53K14m25J52K04j55N6J69l92Q0j9K54q3j20K5k3
4791a09K24Qm1K72k22j62K48l75J47Mm6j42J12K49L9l80ML32k80K84n5j17j13
4814a19j9K69k12J8qJ97k25j63J5K01l7J51J12j69L2j31K51ll79J64L41p0k53
4837c7K06j07J61j03k70L26k73M2J51j47R0j5q1k12J33N7kR8j72J35N2J11j79
4860c6N4l7R0j04j64K56j52L05l48M7p2J66Q0j89M5j23j12J97r0L45r2k08J13
4883b9k56M81k77L48j45j26k9j23K40j77J07l7j7J46j10M8r5N6Po1k7K62j21K9
$$ plain form
4907 94 62 -89 -152 34 -139 97 -28 -124 -8 -37 -376 -113 -41 321 -72 17 53 -61 63 158 57 43 60 -18
4931 -18 107 -62 354 165 149 80 -94 222 66 -197 -47 31 -88 -59 34 172 -85 -13 99 5 -118 -98 58
4954 58 -85 -232 164 21 -104 170 112 25 -94 40 19 -187 73 284 -117 59 95 -256 114 231 -184 -56
4976 -56 182 -144 139 -193 -56 -232 -34 66 -125 -159 100 242 -203 -11 -69 -230 -184 67 -83 -44 -43 39 169
4999 169 41 75 50 56 -219 -100 -108 33 -52 54 -74 10 -15 89 -43 -5 -90 87 87 52 -17 -141 -108 176 -40
5024 -40 20 21 3 13 107 56 -179 -96 -165 -234 185 -37 -62 104 -36 -109 -188 -114 50 -39 -12 199 -177 -46 91 115
5050 115 -5 135 -17 64 -299 -129 95 -210 -124 -118 130 0 -180 -30 26 120 -60 -205 -244 -248 186 316 -63
5073 -63 -18 61 -118 128 -68 105 -58 -142 -224 63 -120 36 -36 -92 144 57 71 334 92 -63 3 131 110 -179
$$ packed form
4907I4l2j51o3J86j73K36j25r6J16k9l39K63P2L62l93Q9L6j14J24R5j01j4J7p8
4931a8J25j69M16j89j6o9j74L16j56k63J50P8j19K9R3J38k57P2J12r4j23K0J56
4954E8j43j47L96j43j25K74n8q7j19J34k1k06K60K11m01J76L6l51L70J17m15J28
4976e6K38l26K83l32J37j76J98J00j91l4K59J42m45J92n8j61M6K51j50L9JQ2J30
4999A69j28L4k5Ok75J19qJ41q5J06j28Q4k5J04j32L8q5J77%l5o9j24L3K84k16
5024d0O0Jj8J0R4n1k35Q3o9o9M19k22k5J66j40p3p9P4J64q9K7K11l76J31J37K4
5050A15j20J40j52Q1l63J70K24l05Q6OK48j30j80J50N6R4j80j45l9mM34J30l79
5073f3M5P9j79K46j96J73j63q4q2K87j83J56p2n6K36q7J4K63k42j55O6J28k1k89
$$ plain form
5097 -179 -14 16 -96 95 84 -8 -122 24 -245 22 68 -101 -151 1 -66 11 -267 134 219 -75 -152 -83 -6 -156
5121 -156 19 59 186 -94 76 113 191 64 13 -110 15 17 5 51 -228 -51 160 -13 3 -14 77 -65 -272 -211
5145 -211 -154 68 -149 -222 -143 176 94 -172 47 85 -251 188 -251 238 -8 79 -16 -160 -34 -219 -58 1 -48
5168 -48 166 -110 -114 65 -49 -123 190 81 230 259 40 78 -104 38 350 200 183 9 -87 -33 57 18 267 151
5192 151 -306 14 68 -44 -130 -54 -55 223 59 -5 13 -87 -113 -83 -3 11 -38 223 233 26 140 67 36 -125 42
5217 42 32 72 -132 -44 20 -50 -291 -205 -147 142 -360 16 -106 42 22 144 -140 -53 -68 -53 36 80 -11 147 -39
5242 -39 38 -91 -225 -3 -299 86 -57 -87 135 -169 255 -28 146 122 -68 -16 -155 -136 -31 17 218 201 -295
5265 -295 -77 94 -126 74 158 -5 -182 105 -108 -61 -48 47 -138 -75 51 36 -27 -147 26 -39 177 51 -118
$$ packed form
5097a79J65L0j12J91j1r2j14J46k69K67M6j69n0J52o7P7k78M01Q5k94p7O9P7j50
5121a56J75M0J27k80J70L7P8j27n1j23J25Kj2M6k79J77K11j73J6j7R1j42k07O1
5145b11N7K22k17p3P9L19q2k66K19L8l36M39m39M89k46Q7r5j44J26j85J61N9m9
5168d8K14k76mJ79j14p4L13j09J49K9k19L8j82J42L12j50j7j74r6N4R0l9K49j16
5192A51m57L20N4j12q6P6jK78j64o4J8j00k6L0Q0J4m9K61J0k07J14p3l1j61J67
5217D2j0M0k04Q8O4p0k41Q6N8K89n02L76j22J48k0J22k84Q7j5J5Q9M4r1J58j86
5242c9P7j29j34K22k96L85j43l0K22l04M24k83J74k4j90N2j39J9J05M8K01j7m96
5265b95K18J71k20K00Q4j63j77K87k13M7J3R5j85O3J26j5o3j20J73o5K16j26j69
$$ plain form
5288 -118 -92 -1 -69 -137 -204 166 64 -263 8 -2 -148 -15 35 -210 -213 -134 -188 -11 236 45 127 140 55 28 161
5313 161 31 0 -200 27 156 67 -139 5 -14 -122 17 -201 -19 43 138 -1 75 39 230 -31 -167 73
5335 73 -105 385 -305 12 -46 -181 65 -163 89 139 124 10 -153 58 -49 133 -126 118 -226 142 -10
5356 -10 -49 -394 348 63 130 -46 -24 -2 -143 169 5 53 176 -83 96 -180 -109 257 77 178 9 77 40
5379 40 146 -57 244 38 15 -116 179 108 31 158 -102 -111 -99 199 -129 -50 161 -9 -72 -20 108 -167 354
5402 354 48 -1 74 17 47 -34 -264 -228 -25 -127 -93 -114 -61 56 220 -36 42 257 113 101 166 -28 79 -206
5426 -206 -223 -34 268 -28 -40 52 -196 -117 0 366 333 109 362 -96 19 -90 -30 190 -23 -74 234 46
5448 46 -76 -186 -194 -82 -105 202 99 -123 27 -102 120 -119 -308 18 -14 132 94 45 -137 163 55 361
$$ packed form
5288a18K6R1o8o8o7L70j02l27K71j0j46J33N0k45lP9n4J77K47j91Q2J3q5k7J33
5313A61j30l1k00K27J29q9k06J44j9j08J39k18J82O2R5j39P6l6J91k61j36K40
5335G3j78M90o90L17n8j35K46k28K52N0j5j14j63K11j07J82k59K44l44L68j52
5356a0l9l45P42k85O7j76K2K2j41L12j64M8J23k59J79k76P1L66j80J01j69O8l7
5379D0J06k03L01k06k3j31K95p1p7J27k60rJ2K98l28P9K11j70o3N2J28k75N21
5402C54l06m9P5n7L0q1k30L6K03j02L4k1N3J17J64k56P8K15j44j2O5j94J07k85
5426b06j7J89L02k96j2R2k48P9J17L66l3k24K53m58J15j09O0K20k13n1L08j88
5448D6j22j10qJ12k3L07j03k22J50j29K22k39j89L26l2J46l8m9j82L00j08L06
$$ plain form
5470 361 -33 141 107 -84 -90 211 -23 187 -20 41 121 179 -3 309 275 -463 110 -225 -321 -36 -92 89 55
5493 55 16 -104 -3 -23 -58 102 110 75 -222 -164 153 -40 231 55 -211 11 96 7 -162 262 -35 175 233 -170
5517 -170 87 -260 -219 19 15 0 127 -31 -25 -141 -177 171 168 35 62 -132 -99 179 -143 181 -121 8 114 -14
5541 -14 43 -107 -58 62 -92 -68 91 55 32 129 -232 110 211 -132 -89 -76 -165 -129 -94 104 -23 -43 46 -47 98
5566 98 -43 241 157 -11 102 199 -59 -71 -70 -98 130 -37 -85 -206 -50 -51 74 122 156 193 -41 20 87 -105 -97 -94
5592 -94 198 -163 -49 -19 -72 168 -185 93 74 -47 182 -83 -77 57 22 -254 -150 -96 -153 193 -14 -55 -216
5615 -216 -299 145 272 -46 41 156 -37 9 120 151 94 188 407 -383 94 269 52 29 105 29 63 -124 -251
5638 -251 -323 -68 -84 134 62 -155 -32 -76 34 -138 -19 148 110 -270 90 83 103 -297 34 121 86 28 -89 32
$$ packed form
5470C61l94J74l4j91oL01k34K10k07O1Q0N8j82L12l4p38N73l35r6K85n6J81l4
5493E5l9j20J01k0l5J60Ql5k97N8L17j93K71j76k66K22Q5q9j69M24k97K10N8m03
5517a70K57l47M1K38mj5J27j58Oj16l6L48lj33K7j94L3K78l22L24l02J29J06j28
5541a4N7j50M9J20j54K4J59l6k3R7l61L42J01l43M3J3q9L6L5J98j27k0Q9r3J45
5566I8j41K84q4j68J13R7k58j2Jk8K28j67m8j21J56jJ25M8L4L7k34O1O7j92QL
5592i4K92l61J14L0n3K40l53K78j9j21K29k65OJ34l5k76J04N4n7L46k07m1j61
5615b16q3M44J27l18Q7J15j93M6J11L1n7R4K19p90M77J75k17k3P6p6L4j87j27
5638b51p2K55j6K18p2k17J23m4J10j72J19J67l8l80L60pK0m00L31Q7l5n8j17J21
$$ plain form
5662 32 -63 128 55 -84 -116 -60 -261 102 176 43 326 -63 51 -59 -82 186 8 46 45 -179 165 -113 123
5685 123 -21 40 6 0 -30 176 115 -18 -24 -182 100 59 212 167 -185 77 109 30 136 40 360 177 -63 238
5709 238 99 47 37 116 190 8 66 -189 -18 27 73 -37 -126 -43 104 -16 203 -196 168 2 -164 198 54
5732 54 -262 -151 107 -106 12 86 42 -190 84 229 150 -47 -78 176 105 -256 -82 74 147 124 68 -3 25 144
5756 144 127 93 75 -12 -78 -14 -85 -43 79 229 255 33 -106 58 15 151 10 -3 23 -73 180 -50 64 -122
5780 -122 119 4 -215 92 -101 20 -32 25 -94 154 15 60 -18 -102 -79 -57 -81 134 141 186 78 24 -212 -25
5804 -25 127 -152 -165 -199 135 -36 160 22 99 -93 19 45 -49 -50 -166 -19 54 -76 40 88 -34 105 160 -102
5828 -102 220 75 -47 -356 21 -55 39 45 -178 -34 99 89 -203 -55 50 306 -115 -74 84 -34 -76 173
$$ packed form
5662C2r5J91p3j39l2N6k01L63P4j33K83l89J14j10k3K68j78L8jk24L44k78K36
5685A23j44O1l4ol0K06o1j33oj58K82m1J53m5l52K62L2p9J06r6L20j83k40L01
5709B38j39n2j0P9P4j82N8k55J71M5M6j10q9Q3J47j20K19l99L64j66j66L62j44
5732E4l16J11K58k13J18P4m4k32K74J45p9j97l1K54p1l61J74J56P3k3n6p1K8J19
5756A44j7l4j8q7o6O4p1M2J22J50K6k22j39J64m3J36j41j3K6r6K53k30J14j86
5780a22K41j15k19L07j93J21n2N7j19K48j39M5p8q4K3K2k4K15PM5j08n4k36J87
5804b5J52k79j3l4L34j71J96j38P7j92J12K6r4jj16J47P3j30J16M8j22J39N5k62
5828a02L22j45j22l09L77p6R4Ok23J44J33j0k92J48J05K56m21M1J58j18m2K49
$$ plain form
5850 173 -115 117 -54 345 -191 -58 158 -27 354 8 30 129 166 368 -4 -110 185 -169 0 -69 -209
5871 -209 41 -210 -14 -122 117 -94 -147 -74 55 18 -194 -17 14 50 -249 113 131 50 -68 -166 137 129 -49
5894 -49 -18 63 126 -23 -152 -176 7 75 70 -85 104 117 171 -38 -80 227 -147 33 -45 63 -21 -162 -67 124 79
5919 79 -180 -196 -82 -11 -85 145 -57 -228 8 104 -65 47 -61 -96 85 -175 144 -190 -124 36 -94 -153 3
5942 3 -30 -206 2 185 -63 125 62 -65 -94 99 129 57 10 -101 -161 45 151 -89 -158 -135 48 4 78 173 46
5967 46 -17 -58 141 154 0 120 -60 108 82 -79 65 -130 57 -251 -233 -174 -108 -19 -53 277 108 148 101 204
5991 204 175 70 -192 -18 6 47 25 -126 146 112 -59 79 -63 -63 41 -156 92 -107 -88 -64 -17 111 52 79
6015 79 -11 -63 -54 -111 -69 132 -85 -157 -56 -195 95 195 -106 -62 -114 -69 166 181 -13 22 163 76 19 -23 36 -71
$$ packed form
5850A73k88K32j71L99n36J33K16j85L81l46K2R9L7K02l72j06K95l54J69o9j40
5871b09K50k51J96j08K39k11n3P3J29l7k12J77L1L6k99L62J8q1j18r8L03qj78
5894d9L1Q1O3j49j29k4J83O8nj55J89J3N4k09m2L07l74J80p8J08q4j41R5J91m5
5919G9k59j6J14P1p4K30k02j71K36R6j69J12j08l5J81k60L19l34O6J60j30n9J56
5942Cl3j76K08J83k48J88o3j27k9J93L0p2m7j11o0K06J06k40o9K3J83m4P4R5j27
5967D6o3m1J99J3j54J20j80J68k6j61J44j95J87l08J8N9O6Q9l4L30j69M0m7J03
5991B04k9j05k62J74K4M1k2j51K72l4j71J38j42%J04j97K48j99J9K4M7J28n9K7
6015G9r0n2Rn7M2K01k17p2J01j39K90J00l01M4n2M5K35J5j94L5J41q7n7m2N9j07
$$ plain form
6041 -71 40 -115 39 57 18 -33 157 -98 161 48 -22 -4 116 -105 -159 86 118 287 -72 -11 118 -69 -93
6064 -93 -33 172 -200 61 -5 -44 -192 -30 49 -39 95 60 22 53 143 240 141 50 -7 -104 -21 -148 144 -83 149
6089 149 -44 18 20 57 -69 -229 -70 33 -257 -213 -61 170 -30 -265 50 35 15 90 -400 132 -126 -135 151
6112 151 148 -92 -191 174 92 155 -40 -57 149 -62 -26 119 213 24 -155 -206 -229 7 -52 171 24 -313 -35 47
6136 47 43 -96 -19 -7 -149 255 51 -215 164 -169 -45 175 -287 -23 84 75 -70 122 -56 -58 143 141 -14 27
6160 27 -91 138 -55 278 -83 -101 189 52 55 4 39 -115 -104 -44 273 -84 -5 90 363 31 62 -79 -49 68
6184 68 -183 65 -78 -264 -29 -30 104 17 81 -12 147 -59 286 43 92 -50 -138 2 101 29 -140 54 -216
6207 -216 -194 145 -104 160 -2 141 74 52 -3 -79 -120 244 130 89 -30 58 245 184 -67 94 4 168 92 43
$$ packed form
6041g1J11j55J54J8l9n1J90k55K59j13p0J8J20k21n4K45L2J69l59O1J29j87k4
6064i3O0K05l72K61o6l9j48J62P9q8J34l5l8L1R0R7r9r1n7r7Q3j27K92k27K32
6089A49j93O2KL7j26j60J59J03k90M4J52K31k00k35L15j5k0P5m90N32k58rK86
6112A51lk40r9L65q2O3j95j7K06k11L6J45R4j89j79n1k3K36n9K23j47l37K78Q2
6136D7mj39P7J2j42M04k04k66L79l33J24K20m62K64J07rj45J92j78kK01kj55M1
6160B7j18K29j93L33l61j8K90j37Ln1L5j54J1O0L17l57P9R5K73l32L1j41L0J17
6184F8k51K48j43j86K35jJ34q7O4r3J59k06L45k43M9j42q8J40R9p2j69J94k70
6207b16K2L39k49K64j62J43o7k2n5p6m1L64j14m1j19Q8J87o1k51J61r0J64p6m9
$$ plain form
6231 43 125 -24 26 0 -61 142 3 -164 34 175 109 -22 79 34 -122 -101 7 -92 149 183 8 221 -62
6254 -62 133 -21 153 -100 -33 11 -36 186 -257 30 181 250 -51 -108 154 -7 -177 -53 -13 -104 -21 -129 -160
6277 -160 136 25 -77 31 -68 130 85 -86 -69 29 186 -88 72 125 -267 -211 -278 -86 -51 -18 -1 137 -45
6300 -45 27 -92 -110 -17 93 -131 -179 -151 61 -239 18 -134 317 12 -58 104 -84 -70 -140 -175 27 -47 -38 -2 39
6325 39 -35 47 36 98 -45 -122 -27 -73 57 -47 -131 -45 -4 30 213 -56 -98 -204 24 119 -19 144 -93 7 -90
6350 -90 -98 -38 -47 183 120 78 70 138 256 -56 79 -99 -239 -34 -9 91 58 79 -42 161 -73 73 -116 129 -59
6375 -59 21 -37 -168 -34 -109 155 -127 -100 -76 42 -297 -72 -83 20 -171 7 89 154 -153 -48 -31 -24 -239 33
6399 33 -105 130 -282 159 12 72 97 36 179 89 -183 82 150 -38 -149 -50 216 204 -174 -126 9 24 -123
$$ packed form
6231D3Q2j49N0k6o1K03j39j67J98J41o6j31J01m5j56K1J08r9K41L4j75K13k83
6254f2J95j54J74k53O7M4m7K22m43K87J51O9l01n7K62j61j70J24M0r1Q3j08l1
6277a60K96j11j02J08r9J98m5j71J7R8J57k74J60N3l92N6o7J92L5L3J7J38j82
6300d5P2j19j8R3J10k24m8K8K12l00K57j52M51l05p0J62j88J4p0l5K02p4RL6M1
6325C9p4Q2j1O2j43p7R5m6J30j04q4Q6M1L4J83k69m2j06K28R5j38J63k37J00r7
6350i0qO0rK30o3m2qO8J18l12J35j78j40K05K5J00l3K1j21K03k34J46j89K45j88
6375e9Q0n8j31J34p5K64k82K7K4J18l39K25j1J03j91J78Q2O5l07J05J7Pk15K72
6399C3j38K35m12M41j47O0K5o1J43r0k72K65O8j88j11R9K66j2l78M8J35J5j47
$$ plain form
6422 -123 144 33 126 -21 -36 -34 -23 -11 23 284 132 6 169 45 148 121 -44 81 56 -39 -217 -130 46 91
6446 91 62 125 -268 93 10 -26 -63 -41 72 20 77 -260 -158 14 114 -77 -88 222 12 281 -9 48 227 -123
6470 -123 -274 33 -21 -39 8 109 223 239 -147 127 -20 -202 92 -74 -56 101 87 -80 68 -239 200 -57
6492 -57 48 30 -296 -45 153 75 20 -216 -130 -169 125 120 -166 79 -70 -34 -130 113 179 -117 12 -28 97 112
6516 112 29 -97 282 183 168 -35 -106 -129 -38 11 98 54 -199 -50 137 72 -129 29 76 112 64 -229 50 49 -157
6541 -157 27 2 -92 71 -121 49 -150 -94 96 -56 160 115 71 -14 -42 -78 -14 16 -156 -43 142 -5 -3 41
6565 41 -122 123 145 45 103 -251 107 -81 202 106 48 -8 -76 -39 47 78 120 -49 -103 137 -1 -51 -137 -45 -61
6590 -61 76 150 -34 34 -54 143 21 -198 67 11 123 -104 297 33 35 -195 -98 -5 -12 329 200 8 176 109
$$ packed form
6422a23K67j11R3j47j5KJ1J2L4K61j52j26J63j24J03k7j65J25k5r5j78Q7J76M5
6446I1k9O3l93L61q3l6l7K2J13n2N7l37J02J72J00j91j1L10k10K69k90N7J79l50
6470a23j51L07n4j8M7J01J14J6l86K74j47j82K94j66J8J57j4j67J48l07M39k57
6492e7J05j8l26K51J98p8n5k36Q6l9K94nk86K45j49L6r6K43O6k96J29m0J25J5
6516A12q3j26L79r9j5k03p1k3R1M9Q7m4k53J49J87o5k01J58M7L6m8k93K79jk06
6541a57J84k5r4J63j92J70j99N6J90j52K16m5m4q5k8l6O4L0j72J13J85j47KM4
6565D1j63K45K2j00N8l54L58j88K83r6n8n6o8L7Q6L1M2j69n4K40j38n0q6R2j6
6590f1J37P4j84O8q8J97j22k19K65n6J12k27M01k64Kk30R7R3pL41j29j92J68o7
$$ plain form
6614 109 100 -28 -187 -54 -63 -15 -18 102 211 36 -176 -41 88 228 -189 -25 295 -45 47 64 -87 13 -150
6637 -150 110 -11 3 -189 -70 -55 -37 178 -6 -166 180 62 6 -74 163 -36 -24 -99 -11 -128 35 237 34
6660 34 160 288 45 76 -215 -28 116 -27 100 -130 16 -151 35 11 -34 -45 131 -136 -220 -87 -70 -106 162
6683 162 129 102 -136 41 130 57 -228 -99 118 104 -107 -58 223 -6 71 -123 1 175 69 -13 -359 51 207
6706 207 -305 208 42 -203 -108 5 -91 -59 -160 -15 22 -76 20 -67 158 120 -100 67 195 -99 15 52 -104
6729 -104 68 -51 308 -426 -137 -59 62 113 -130 -158 -102 12 -5 67 -167 100 66 77 -226 105 52 147 -115
6752 -115 -56 139 17 200 -119 48 94 -5 -47 -2 -55 -72 9 -15 10 -71 -21 117 -20 6 77 3 -212 50 7
6777 7 -131 -127 96 211 27 263 -60 -80 159 31 119 -78 101 221 216 -236 -113 -203 -125 95 -106 169 -238
$$ packed form
6614A09rj28j59J33rM8lJ20J09j75k12J35J29J40m17J64L20l40R2J7j51J00j63
6637a50K60j21J4j92J19J5J8K15j84j60L46j18n6q0K37j99J2p5Q8j17J63K02k03
6660C4J26J28k43L1k91J87J44j43J27k30J46j67J86k4m5j1J76k67q4J33J7l6K68
6683A62l3k7k38J77Q9p3k85J29K17j4k11M9K81k29P7j94J24J74j06q2l46M10J56
6706B07n12N13j66k45R5J13r6L2j01J45L7r8R6q7K25l8k20J67J28k94J14L7j56
6729a04J72j19L59p34K89P8J21N1k43k8N6J14j7P2k34K67l4J1l03L31n3R5k62
6752a15N9J95j22J83l19J67M6r9m2M5n3j7Q1k4K5q1N0J38j37K6P1p4k15K62m3
6777Gj38MK23J15j84K36l23k0K39j28Q8j97J79J20nm52J23r0P8K20k01K75m07
$$ plain form
6800 -238 104 222 -7 59 38 -79 -35 -114 -35 -60 -119 -65 -228 -53 -83 -120 -14 115 -138 -88 -21 147 -40 -337
6824 -337 143 74 26 -28 -51 -82 -125 -8 -94 -145 -32 -61 116 -60 181 121 219 -101 1 -179 118 157 -161 -90
6848 -90 -70 -59 166 -154 112 -13 63 -46 -89 9 58 -57 128 174 120 -127 34 -12 -63 201 47 -123 -174 -150
6872 -150 102 -23 58 -11 79 -23 -113 70 21 113 97 90 103 -142 88 -121 -103 99 50 6 -24 -66 145 87 148 256
6898 256 32 -107 64 286 150 244 182 -159 28 -23 -48 198 97 153 -116 134 -110 -138 123 53 200 -72
6920 -72 -7 118 63 99 128 -35 -127 11 -193 -150 28 -38 -199 -146 79 -147 -42 -98 24 45 86 31 -101 -205
6944 -205 -76 -33 24 -28 -22 -97 -316 -365 112 -163 -193 53 -26 -142 -30 -263 -124 -198 -30 65 -194 30 19 -21
6968 -21 225 31 194 39 61 -49 -68 13 -202 21 -81 -64 -387 -104 -74 61 -174 135 2 -27 -74 -10 -21
$$ packed form
6800b38L42J18k29O6k1j17M4p9P9k5n9N4j63J75l0l7J06J29k53N0O7J68j87k97
6824c37M80o9m8n4k3l1m3J17q6n1J13k9J77j76K41o0R8l20J02j80K97L9l18P1
6848i0K0J1K25l20K66j25P6j09m3R8M9j15J85M6n4k47J61m6n1K64j54j70n1K4
6872a50K52j25Q1o9R0j02r0J83m9R2j6pJ3k45K30k09J8K02m9m4l0m2K11n8O1J08
6898B56k24j39J71K22j36R4o2l41J87n1k5K46j01N6k69K50k44k8K61p0J47k72
6920g2O5J25n5L6K9j63r2J38k04M3J78o6j61N3K25k26J05n6J22K1M1n5j32j04
6944b05J29M3N7n2Op5k19m9M77k75l0K46p9j16J12k33J39p4J68R5k59K24j1m0
6968b1K46j94J63j55K2j10j9Q1k15K23j02J7l23K83L0J35k35L09j33k9m7O4j1
$$ plain form
6991 -21 -64 178 -18 -102 -99 91 -5 57 20 83 28 -162 -158 79 253 -219 -76 -156 212 -78 165 -98 93 114 -16
7016 -16 303 -133 16 60 5 165 104 18 -170 119 -53 -50 122 -164 211 117 -4 -89 -113 -3 -40 131 49 165
7040 165 119 -103 -121 -18 -179 241 -131 248 133 -115 35 -146 -216 58 -1 63 37 61 121 81 -133 -53 -31 -39
7064 -39 -299 -189 89 -33 -34 183 25 45 -67 70 -107 -99 21 51 14 115 -139 47 -83 -148 -42 -86 46
7087 46 -174 154 -176 -325 -43 138 130 166 261 40 -232 -179 127 84 -182 182 -6 -120 -219 -71 104 -204 72
7110 72 199 31 -128 -207 -95 262 -116 57 94 -72 258 -18 -52 155 -20 -144 58 -153 191 -134 -68 -14
7132 -14 24 -132 -48 92 -15 -196 66 -57 -21 -127 -110 183 -30 -329 238 36 -83 -5 401 -102 -183 45
7154 45 221 -85 100 -243 43 -116 60 -34 27 -39 113 -173 -238 28 9 133 -39 125 14 69 -67 -50 -63
$$ packed form
6991b1m3K42j96q4LJ90r6O2l7O3n5j90MK37J74m72J43q0L68k90K43k63J91K1j30
7016a6L19m36J49M4n5J60o1q6j88K89j72LJ72k86L75r4j21q5k4J10l7J71q2J16
7040A65m6k22j8J03j61M20l72L79j15k48J50j81p0K74n9O4k6K4O0m0k14Q0K2q
7064c9k60J10K78j22jK17j58K0j12J37j77QJ20L0l7J01k54J86j30o5J06m4J32
7087D6k20L28l30j49K82J81qL6R5k21k72N3L06m3k66L64j88j14r9J48J75l08K76
7110G2J27j68j59p9J12L57l78J73L7j66L30k76l4K07j75j24K02k11L44l25O6N4
7132a4L8j56Q4J40j07j81K62j23L6j06J7K93k13k99N67k02j19P8M06n03q1K28
7154D5J76l06J85l43K86j59J76r4O1o6J52k86o5K66j9J24j72J64j11N5j36J7j3
$$ plain form
7177 -63 66 418 207 -88 -237 -68 167 -156 50 -2 216 231 -162 -123 -45 -266 255 93 -227 85 109 -63
7199 -63 243 71 93 139 17 -196 135 -62 -211 162 -169 60 -236 -26 202 109 104 113 -10 -135 108 10 94
7222 94 -130 142 59 210 -105 -53 -121 134 -98 36 -128 -100 117 22 -277 204 179 -161 -103 -80 -166 99 113 117
7246 117 -153 -112 -90 25 -175 93 -59 187 -30 -257 -182 -162 -183 -157 90 -90 -19 -156 -71 87 -59 -390 -83
7269 -83 -129 -28 144 31 -28 186 176 -63 -21 16 39 -123 -98 42 -114 -24 -77 -149 232 75 -14 32 176 -230
7293 -230 169 335 80 -6 115 -45 37 8 -91 -23 90 243 -50 -120 238 88 211 159 152 97 -112 -213 -153 -59
7317 -59 126 -30 126 14 8 -220 55 -203 118 57 -66 11 -106 -143 -18 -85 71 205 131 -90 -117 -96 -279
7340 -279 50 124 126 -20 -99 -76 39 -102 251 -162 13 108 202 -70 -216 -74 -36 -224 -129 141 -23 102 75
$$ packed form
7177f3J29L52k11k95j49J69K35l23K06n2K18J5l93L9P8k21N21j62l20L12K4j72
7199f3L06j72K2M6j22k13L31j97j49L73l31K29k96K10K28r3nRj23j25K43r8Q4
7222I4k24K72q3J51l15N2o8K55k32J34j64K8K17r5k99M81k5l40N8K3q6K65J4M
7246A17k70M1K2J15k00K68j52K46k17k27P5K0k1K6K47j80P1j37Q5J58j46l31L07
7269h3m6J01J72j13n9K14j0k39M2L7K3j62K5J40j56R0n3p2L81j57q9M6J44m06
7293b30L99J66k55q6J21j60Q2k9r9O8J13J53k93p0L58j50J23n2pn5k09j01O0R4
7317e9J85j56J56j12ok28K75k58L21o1j23P7j17l7J25o7J56J34p4k21k7K1j83
7340b79L29P4Kj46p9K3J15j41L53m13J75R5R4k72j46J42L8j88R5K70j64J25k7
$$ plain form
7363 75 -76 -281 -165 244 -195 -9 3 -170 -54 55 -300 25 -84 -11 -42 -59 52 186 242 48 -42 -7 -48
7386 -48 -61 -97 171 47 -180 -86 -212 -104 129 96 -36 96 95 -126 -27 107 161 239 96 -37 180 130 -2 -151
7410 -151 361 -25 -103 -80 124 42 -105 47 -139 -41 73 -37 -15 6 56 -103 81 -34 146 81 39 -48 85
7433 85 -36 160 152 171 -2 62 252 -57 -154 -207 285 -123 21 -86 33 -136 -101 -73 56 84 -98 7 -40 -37
7457 -37 -166 -190 -106 85 -9 -9 -65 -21 127 12 -8 2 230 50 -1 52 94 241 40 28 -97 213 26 -53 57
7482 57 -31 -245 208 23 -48 -189 -46 -168 -321 85 115 -253 145 -12 -15 -39 141 35 117 59 -209 -165 -214 81
7506 81 -27 -158 136 0 95 177 -79 -60 81 31 -145 186 -55 -233 -192 -208 126 55 -46 163 169 -221 77
7529 77 -25 -156 -57 -122 135 280 145 206 64 -9 85 -42 -85 -78 155 154 -110 164 18 45 -92 -144 62 7 -131
$$ packed form
7363G5j51k05J16M09m39J86J2j73J16J09l55L25j09P3l1j7J11J34N6j94r0L5m1
7386d8j3l6K68j24k27R4j26J08K33l3j32J32jk21R9J34N4P8j43j33K17n0j32j49
7410a51N12l86p8K3K04q2j47J52j86R8J14j10K2K1N0j59J84j15J80o5m2q7J33
7433H5j21J96qJ9j73O4J90l09r7n3M92m08J44j07J19j69L5K8J29K8j82J05m7L
7457c7j29k4Q4J91r4%n6M4J48j15k0J0K28j80n1N3M2J47k01j2j25L10j87p9J10
7482E7q8k14M53j85p1j41J43j22j53M06L0l68L98j57lk4J80j06Q2n8k68M4m9K95
7506H1j08j31K94j36R5Q2k56J9J41n0j76L31k41j78M1j6L34p1j01K09Ol90K98
7529G7j02j31R9o5K57J45j35O1j42p3R4j27m3PK33jk64K74j46K7j37n2K06n5j38
$$ plain form
7554 -131 -147 -145 -63 201 180 184 102 -143 98 -67 5 105 -171 -179 89 -81 -150 -18 -47 -127 107 -26 -218 -84 4
7579 4 141 56 -43 -81 83 -193 -260 -184 92 -198 -24 23 -168 47 68 5 166 85 -5 -42 94 97 -14 24 135
7604 135 -79 -46 -149 257 77 -215 -33 150 -33 -131 2 81 -71 -28 232 -62 -62 -5 265 -28 59 -97 76
7627 76 -65 8 -21 -114 14 -60 45 87 -151 -20 -156 36 184 -263 172 11 87 -78 55 49 248 4 -102
7650 -102 35 -106 -22 -145 -36 -75 102 148 92 -35 -16 237 36 98 -160 231 25 75 107 -45 -320 21 72
7673 72 186 158 36 -92 -177 -276 70 181 -70 14 -257 -89 -8 8 -254 -125 -18 -48 -42 175 52 83 13 3
7697 3 92 111 -170 113 -35 117 -168 219 -53 13 -242 -155 26 28 104 179 -20 -77 77 -88 -49 151 116 -167
7721 -167 44 198 108 -140 -34 23 -63 126 162 -61 58 -93 50 -267 -78 -146 -126 -84 -87 -67 130 -222 -14
$$ packed form
7554a31j6KQ2K64k1Mq2k45K41j65P2J00k76qK68j70o9J32k9q0K34j33j92J34Q8
7579DJ37q5r9l8J64k76o7P6K76k90J74M7j91K15K1o3J61q1r0l7J36Lj11L8J11
7604A35k14L3j03M06j80k92J82J83j83r8J33P9j52M3K60k94%N7K70k93Q7j56J73
7627G6j41P3k9r3J28p4J05M2k38J31j36J92J48m47M35j61P6j65J33oJ99k44j06
7650a02J37j41Q4j23J09l9J77M6n6j27J9K53k01O2k58L91k06N0L2j52k75L41N1
7673G2J14k8j22j28q5r9L46J11k51Q4k71J68Q1J6k62J29J07l0OK17j23L1p0j0
7697CQ9J9k81K83j48J52k85L87k72O6k55Q7J81KP6P5j99n7J54j65L9K00l5k83
7721a67K11J54r0k48J06N7q6J89L6k23J19j51J43l17J89o8K0M2lK0J97l52K08
$$ plain form
7744 -14 -173 9 -105 84 294 64 197 166 -87 -40 111 131 -131 -46 -114 -181 29 86 95 53 138 -45 2 -190
7768 -190 -319 150 -53 -31 44 -69 74 0 156 -44 -28 -59 -4 -69 -73 1 67 77 154 -144 110 180 91 78 189
7793 189 -198 172 -79 30 308 70 -58 -236 52 5 -165 -3 -285 -64 327 55 19 144 144 78 79 227
7815 227 -272 -147 -283 199 -138 -33 -84 5 5 115 -144 -225 116 -110 18 156 54 -90 33 -135 120 -84
7837 -84 -75 83 -133 33 115 53 115 -49 -43 108 -20 57 -108 67 125 125 83 -104 42 -6 -27 123 -205 -250 8
7862 8 -20 -53 202 236 79 67 -141 -78 -94 -157 192 -34 -131 -102 -124 139 151 44 92 -213 -148 -93 -195 -84 -84 -87 19
7889 19 -100 80 23 -65 66 81 -26 168 -59 28 -9 -19 114 59 -58 11 79 92 -75 -37 148 86 -114 107
7913 107 113 59 -1 -45 94 143 166 -8 -102 46 -24 31 46 161 99 -18 -197 -185 -8 22 115 108 93 -32 -1 -244
$$ packed form
7744a4j59J82j14J89K10k30J33l1k53M7J51K0k62Q5o8o7K10N7Rm2Q5j83M7j92
7768a90j29M69k03K2P5j13J43p4J56k00J6l1N5o5mP4O6J0P7k98K54P0q9j3J11
7793A89l87L70k51J09K78k38j28j78K88m7j70J62k82K21L91k72l6J25%o6JJ48
7815B27m99J25j36M82l37J05n1Q9%J10k59q1L41k26J28J38j02j44J23j68K55k04
7837h4RJ58k16J66Q2o2O2j64OJ51j28P7j65J75N8%m2j87J46m8k1J50l28m5K58
7862Hk8l3K55L4j57j2k08O3j6o3L49k26r7K9k2K63J2j07M8l05O5N5j02J11%lJ06
7889A9j19J80n7q8J31J5j07J94k27Q7l7j0J33n5j17O9O8J3j67L8J85o2k00K21
7913A07On4o0m4J39M9K3j74r4J48p0N5J5J15o2j17j79J2J77L0R3pj5j25L1k43
$$ plain form
7939 -244 -88 121 -15 9 -28 100 3 -178 118 82 -160 5 108 -31 -57 -33 123 42 -13 -63 -70 142 301 -20
7963 -20 171 211 17 -124 249 143 -142 -65 -5 -93 -225 181 156 53 14 -15 -64 69 319 87 66 95 -192 -40
7987 -40 111 -67 114 115 -4 -121 -231 67 6 97 225 12 -120 16 128 193 -233 57 -85 5 -72 -135 284
8010 284 114 78 -183 20 -154 -529 -57 125 -194 28 -190 -64 -96 -66 -88 207 -167 4 -34 -117 159 251
8032 251 51 15 -194 -78 122 189 -127 115 42 44 13 179 33 -24 141 -7 84 -7 151 -285 72 -89 -82 -67
8056 -67 119 -104 -51 3 -20 -29 -205 27 -125 185 360 211 119 -267 -84 153 74 5 9 -57 -155 -255 -43 176
8080 176 -136 100 -48 66 -121 -51 207 103 -324 -138 -127 228 190 -237 142 1 194 204 -115 -38 -31 93
8102 93 -116 274 -77 95 123 -25 144 161 13 268 -69 -245 -13 -187 172 77 -29 -311 37 -23 -60 66
$$ packed form
7939b44J56K09j36K4l7J28r7j81K96l6k42J65J03j39k6K4J56q1n5n0pK12J59l21
7963b0J91M0j94j41L73j06k85P7O0q8j32M06k5j03l9k9m9J33K50k32k1K9k87J52
7987d0J51j78J81Jj19j17j10K98o1R1J28k13j32J36J12O5m26K90j42R0p7o3M19
8010B84j70l6k61K03j74l75M72J82l19K22k18J26l2L0k2K95l74J71l8q3K76R2
8032B51k00l6k09J16K00O7l16K42p3Kl1J66j46n7J65j48R1r1J58m36L57j61PJ5
8056f7J86k23N3N4k3rj76K32j52L10J75j49r2l86J83K37p9o9Mo6r8j00K12K19
8080A76l12K36j48J14j87P0K58j04m27J86J1L55l8m27L79j41J93J0l19P7PJ24
8102I3k09L90l51J72K8j48J69J7j48K55l37j76K32j74L59r5j06k82L48o0l7J26
$$ plain form
8124 66 96 -8 80 164 59 74 -69 -52 -131 61 57 32 27 -55 -5 66 117 -129 245 13 66 -23 -38 -32 -96 -84 -77 138
8152 138 -81 -61 -72 -255 -7 50 101 -46 114 -359 -237 1 305 -146 227 -104 134 93 213 -43 -2 -71
8174 -71 -163 -242 81 103 -33 -321 -21 144 -97 -4 -14 -133 198 23 17 293 -20
$$ packed form
8124F6L0j04Q8Q4j05J5j43J7p9J92mk5nq2N0P1N1k46L74k32N3q9j5Oo4J2PK15
8152A38k19K0j1j83K48N7N1j47J60m73J22K38L04m51L73l31K38m1J20k56M1o9
8174g1r2p9L23K2j36k88L00J65k41R3j0j19L31j75oK76l13
8191b0
$$ Imaginary data points
##PAGE= N=2
##DATA TABLE= (X++(I..I)), XYDATA
$$ plain form
0 0 0 0 0 0 0 0 0 0 0 0 0 0 0 -8 8 -8 8 -16 16 -16 24 -24 32 -37 40 -48 56 -64 76 -85 97 -111 125 -141 158
35 158 -181 201 -225 250 -281 313 -345 382 -422 468 -515 569 -628 689 -761 836 -923 1017
53 1017 -1124 1244 -1379 1535 -1716 1931 -2185 2493 -2884 3386 -4060 5019 -6473 8952 -13936
68 -13936 27780 -144637 -455349 61301 376151 22640 -269126 -39443 152778 55345 -35748
79 -35748 -36399 -80199 5089 178825 78715 -215102 -154586 193668 205586 -136847 -204014 67470
91 67470 161104 -18604 -108729 -29967 35809 52254 39053 -64891 -119701 34819 153401
102 153401 -696 -141351 -14504 109015 7283 -69411 13954 33237 -26949 23165 61699
113 61699 -58306 -95313 76309 126295 -64915 -122150 54231 89507 -56132 -49008 65642
$$ packed form
0@%%%%%%%%%%%%%qJ6j6J6k4L2l2M0m8N6o9P7q8J04j20J40j61J82k08K36k66K99
35A58l39L82m26M75n31N94o58P27q04Q90r83J084j197J317j450J597j759J940
53A017k141K368k623K914l251L647m116M678n377O270p446R079j1492J5425k2888
68a3936M1716j72417l10712N16650L14850l53511k91766K29683J92221r7433r1093
79c5748o51m3800Q5288J73736j00110k93817O0516L48254J1918l42433o7167K71484
91F7470R3634j79708r0125P8762O5776J6445j3201j03944n4810J54520J18582
102A53401j54097j40655J26847J23519j01732p6694Q3365J9283o0186N0114L8534
113F1699j20005l7007J71622M9986j91210n7235J76381L5276j45639P124J14650
$$ plain form
124 65642 6869 -86705 23005 96516 -65591 -121548 88902 142670 -93306 -159756 69199
135 69199 146955 -44495 -108490 35123 68657 -25081 -23318 23955 -11348 -18464 55024 33313
147 33313 -79407 -47149 86164 57103 -70889 -51405 49212 29018 -39759 -12116 23377
158 23377 -11358 -10481 27540 -9512 -52891 9766 62526 -8315 -58335 12561 43963 -23969
170 -23969 -26676 41294 22257 -44138 -9810 52059 3393 -50541 9523 52354 -10422 -40667
182 -40667 10627 18776 -20333 2686 37158 -23091 -61109 26250 69167 -32673 -79194 28000
194 28000 80215 -23808 -79306 9237 61009 5521 -29036 -8178 536 5512 28123 8907
206 8907 -41596 -14274 57656 26225 -58585 -34944 51711 42204 -33961 -37303 12099 16797 19
$$ packed form
124F5642n8773r3574J09710P3511j62107n5957K10450N3768k35976o6450K28955
135F9199P7756j91450o3995J43613L3534r3738J763M7273l5303p116P3488k1711
147C3313j12720L2258J33313k9061j27992J9484J00617k0194o8777K7643L5493
158B3377l4735Q77L8021l7052m3379O2657N2760p0841n0020P0896L1402o7932
170b3969k707O7970j9037o6395L4328O1869m8666n3934O0064M2831o2776l0245
182d0667N1294Q149l9109K3019L4472o0249l8018Q7359M2917j01840m6521J07194
194B8000N2215j04023n5498Q8543N1772n5488l4557K0858Q714M976K2611j9216
206H907n0503K7322P1930l1431q4810K3641Q6655r507p6165l342M9402M698j6778
$$ plain form
219 19 1093 -12398 -22444 12728 33711 -18213 -51261 12458 58021 -4489 -54554 -4260 42065
232 42065 9140 -23803 -1856 13553 -152 3157 8093 -11964 -9364 25027 19598 -26499 -25217
245 -25217 25207 23695 -23388 -18060 19361 7073 -21998 -5800 16571 -3765 -16523 9502
257 9502 10660 -18499 -11142 19200 10265 -16184 -4581 16587 123 -13325 8389 15262 -6782
270 -6782 -7661 11695 5932 -13345 -1861 18261 972 -17729 303 11522 -6615 -11472 7576
283 7576 7382 -14037 -8213 11573 -655 -14881 3846 15170 -6022 -16314 6195 15506 -5160
296 -5160 -8759 9534 7532 -5579 -1977 7137 1860 -2256 7044 4030 -11671 -4336 14093 4032
310 4032 -14855 -5589 12748 1324 -16852 -3940 11442 20 -9400 -1324 1952 -3971 -669
$$ packed form
219A9J074j3491j0046L5172K0983n1924l3048O3719M5563o2510n0065N0294M6325
232D2065l2925l2943K1947J5409j3705L309M936k0057K600L4391n429m6097J282
245b5217N0424j512m7083N328L7421j2288k9071J6198K2371k0336j2758K6025
257I502J158k9159P357L0342q935k6449J1603K1168j6464j3448K1714O873k2044
270f782q79J9356n763j9277J1484K0122j7289j8701J8032J1219j8137m857J9048
283G576j94k1419N824J9786j2228j4226J8727J1324k1192j0292K2509R311k0666
296e160l599J8293k002j3111L602R114n277m116R300l014j5701P335J8429j0061
310D032j8887R266J8337j1424j8176J2912J5382j1422r420Q076L276n923L302
$$ plain form
323 -669 7045 -930 -7573 4767 9442 -4593 -6945 8142 11036 -3486 -7595 5129 6266 -2970
337 -2970 -1113 4341 -214 -4157 432 2080 -4985 -3518 5571 286 -10152 -3499 6473 602 -7917
352 -7917 -1485 6446 -469 -5669 967 4278 1237 1362 2060 -409 -1400 3906 6050 -1661 -2998 4322
368 4322 4156 -2581 -4312 1684 3496 -2172 -2817 -366 -3619 -2718 2638 1401 -5542 -5886 3180 4762
384 4762 -4784 -5325 2531 5241 1762 -2666 -2734 1601 6349 6016 -2052 -6191 2625 9505 2864 -6878
400 -6878 -4861 6254 7979 -3301 -9866 -3236 6561 6578 -5343 -11953 -2952 8152 5544 -7574
414 -7574 -10822 2645 9705 1700 -7899 -6425 5044 10743 3179 -7446 -7738 5897 15014 2282
428 2282 -12864 -6083 11685 12750 -6535 -14339 843 12209 4705 -8597 -11216 -841 9066
$$ packed form
323f69P714p975o643J2340M675j4035k352J5087K894j4522m109J2724J137r236
337b970J857N454m555l943M589J648p065J467R089n285j0438O653R972n871q519
352g917O432P931o915n200O636L311l041J25O98k469r91N306K144p711j337P320
368D322j66o737j731N996J812n668o45K451l253R01N356j237o943l44R066J582
384D762r546n41P856K710l479m428o8M335M748l33q068m139Q816O880o641r742
400f878K017J1115J725j1280o565O630R797J7j1921o610R001J1104k608j3118
414g574l248J3467P060q005r599J474J1469N699p564j0625k92J3635R117j2732
428B282j5146O781J7768J065j9285p804J5182J1366p504j3302k619J0375R907
$$ plain form
441 9066 6030 -7104 -14804 -1483 14180 7212 -12622 -14274 6761 19162 1271 -18066 -8367
454 -8367 15086 17316 -4732 -16178 -1002 14698 10225 -6058 -12969 -1060 13597 9232 -8792
467 -8792 -15907 -603 15833 7194 -14322 -17366 4515 19512 1749 -20420 -9936 13302 12490
480 12490 -6988 -12537 -29 8970 7754 1194 -8694 -8138 8322 17312 1114 -17922 -7200 18755
494 18755 15677 -12269 -19556 3728 19562 3314 -16047 -10387 5153 10268 3265 -9163 -13643
507 -13643 -909 16132 9549 -16162 -18820 10520 23780 -78 -24197 -10186 21584 21260 -9821
520 -9821 -22642 622 23334 10787 -15318 -15397 6243 16607 5021 -12292 -13927 2449 16238
533 16238 6928 -16691 -19136 8588 22946 -1429 -25328 -9825 20594 15232 -13986 -16932 5327
$$ packed form
441I066l036j3134p700J3321J5663o968j9834j652K1035J2401j7891j9337R699
454h367K3453K230k2048j1446J5176J5700m473j6283o911J1909J4657m365j8024
467h792p115J5304J6436q639k1516l044K1881J4997j7763k2169J0484K3238q12
480A2490j9478n549J2508Q999j216o560r888N56J6460Q990j6198j9036J0722K5955
494A8755l078k7946p287K3284J5834j6248j9361N660J5540N115p003j2428m480
507a3643J2734J7041o583k5711k658K9340J3260k3858k4119J4011L1770l24l1081
520i821j2821K3264K2712j2547k6105p9K1640J0364j1586j7313j635J6376J3789
533A6238r310k3619k445K7724J4358k4375k3899J5503L0419n362k9218k946K2259
$$ plain form
546 5327 15179 3861 -6536 -6220 -1046 7280 12313 -960 -16646 -3942 19638 13739 -15612 -18971
560 -18971 8778 19906 -1134 -17717 -8184 9200 10597 -2911 -12289 -8344 5045 12902 1344
573 1344 -14723 -10398 10499 17668 -2957 -19936 -4949 19760 16083 -11479 -20345 4699 24009
586 24009 6257 -19264 -12950 12866 17144 -4272 -15927 -4653 9292 9792 -3456 -14254 -7966
599 -7966 9814 13897 -6185 -20503 -1787 19286 7739 -16303 -12633 11288 15078 -3845 -11141
612 -11141 -607 7992 6089 -610 -4789 -3553 4031 9362 700 -9943 -3706 8072 6077 -5939
626 -5939 -8704 927 6386 560 -5484 -4751 230 3291 557 -2373 -2865 -619 3259 3256 -1251 -3852
642 -3852 -767 5534 5782 -2349 -5693 1349 8666 3768 -7021 -5228 6070 6110 -3317 -6356 -221
$$ packed form
546E327R852j1318j0397L16N174Q326N033j3273j5686J2704K3580n899k9351l359
560a8971K7749J1128k1040j6583R533J7384J397j3508r378L945J3389P857j1558
573A344j6067M325K0897P169k0625j6979J4987K4709l677k7562q866K5044J9310
586B4009j7752k5521O314K5816M278k1416j1655J1274J3945N00j3248j0798O288
599g966J7780M083k0082j4318J8716K1073j1547k4042L670K3921L790j8923p296
612a1141J0534Q599j903o699m179J236P584N331q662j0643O237J1778j995j2016
626e939k765R631N459n826o044P33M981L061k734k930m92K246L878lm507k601
642c852L085O301K48q131l344P042P317m898j0789J793J1298M0r427l039O135
$$ plain form
657 -221 3786 705 -2188 -3667 -3156 1959 4317 -2331 -6902 -1300 5600 2808 -5258 -3883 3734 4490
673 4490 -143 -3056 -477 3391 2660 336 -844 -524 1987 3253 217 -2666 -1172 2410 1566 -2878
689 -2878 -2194 519 -158 -675 -1134 -1619 -1410 -122 635 -459 -1693 -265 538 947 1110 -621 -796 1465
707 1465 3035 1171 -1993 -134 3396 2516 -1325 -2348 631 3188 300 -2830 -1612 735 1148 -623
723 -623 -3269 -1993 864 1286 -799 -3422 -1547 2265 1216 -1647 -1795 633 3114 1094 -1378 -691
739 -691 1909 3107 636 -1922 7 2513 2137 -814 -2774 514 2827 -21 -2705 -1446 1254 1287
755 1287 -2175 -2582 -421 1073 -212 -1925 -1992 758 1408 -323 -1084 -9 1909 1680 -151 -43 1059
772 1059 2013 1222 -537 164 1408 949 171 -1023 -190 1007 116 -1219 -1550 -420 658 -841 -2107
$$ packed form
657b21M007l081k893j479N11N115K358o648m571N602O900k792q066J375P617P56
673D490m633k913K579L868p31k324j180L20K511J266l036k883J494L582q44m444
689b878O84K713o77n17m59m85K09J288P57j094j234J428Q03M09J63j731j75K261
707A465J570j864l164J859L530q80l841j023K979K557k888l130J218K347M13j771
723f23k646J276K857M22k085k623J875L812j049k863j48K428K481k020k472O87
739f91K600J198k471k558J929K506l76k951j960L288K313k848k684J259K700L3
755A287l462m07K161J494j285j713o7K750O50j731p61J075J918k29j831J08J102
772A059R54p91j759P01J244m59p78j194Q33J197q91j335l31J130J078j499j266
$$ plain form
789 -2107 -562 135 -153 -832 -1287 189 1028 113 -397 -188 994 1515 24 -132 880 1546 750 -247
807 -247 292 1479 529 -554 -240 -31 80 -781 -655 -237 -1071 -417 -441 -1214 -448 -363 -88 -317 -1042 29
827 29 502 29 218 596 506 866 715 932 481 201 1249 1206 -132 -378 254 810 -40 -909 -529 -435 -357
848 -357 63 -1386 -2007 -239 814 -647 -1900 -1095 1274 788 -1067 -553 213 1118 1458 222 -435 -70
866 -70 1926 2272 -1037 -1486 1450 2717 173 -2280 -593 1638 466 -1107 -1248 -1191 97 1052 -1180
883 -1180 -2606 -1207 1660 812 -2284 -1610 1180 786 106 -424 -337 -4 1555 2042 -194 -2205 1102
900 1102 3772 527 -3164 -895 3386 1331 -2651 -977 630 -345 -84 441 -1177 -3378 193 3538
916 3538 -1013 -5145 -356 4228 1071 -4062 -2111 3158 2718 -1107 -1039 328 1317 2162 1036 -961
$$ packed form
789b107J545O97k88o79m55J476Q39r15n10K09J182N21j491j56J012O66p96r97
807b47N39J187r50j083L14K09J11q61J26M18q34O54k4p73P66Q5K75k29p25J071
827B9M73m73J89L78r0L60j51K17m51k80J048m3j338k46O32N56q50q69L80R4P8
848c57M20j449o21J768J053j461j253Q05K369m86j855N14P66R05L40j236o57L65
866g0J996L46l309m49K936J267k544k453J687K231j172j573j41N7J288R55k232
883a180j426J399K867q48l096O74K790l94o80n30Q7L33J559M87k236k011L307
900A102K670l245l691K269M281k055l982J674J607r75K61N25j618k201L571L345
916C538m551m132M789M584l157n133J951N269m40l825O8J367R89Q45j126j997
$$ plain form
932 -961 -1292 1443 3407 77 -2926 -1080 2077 2295 -1356 -3837 -1088 2883 1830 -3114 -4433 1140
948 1140 3883 -1285 -4187 -194 2376 503 -860 788 -23 -1601 2014 4516 -1936 -4967 2605
963 2605 7541 -439 -7381 372 7585 453 -5893 -954 3883 335 -2554 585 -183 -3785 -33
978 -33 4423 -897 -6654 -886 6863 1351 -7062 -2593 6016 3838 -3342 -3256 2472 3552 389 -1061
994 -1061 -725 322 1602 1681 -309 -1594 -912 1889 2019 -1503 -3639 -1236 3866 2092 -4900 -4387 3198
1011 3198 4400 -3214 -5261 2094 4639 -2005 -2783 2382 1195 -2642 897 4976 -974 -5615 2927
1026 2927 7790 -1820 -7683 1971 7780 -852 -6991 508 5355 -1203 -3881 783 992 -3091 -690
1041 -690 3396 -832 -5546 288 5571 -278 -5853 -796 5480 2094 -3570 -1680 2715 2250 59
$$ packed form
932i61l31K735J964l330l003J846L157K18l651k481K749L971j053m944j319N573
948A140K743n168k902L993K570j873j363J648q11j578L615K502o452l031P572
963B605M936p980o942P753P213p132o346M939M837l548k889L139p68l602L752
978c3M456n320n757N768P749n512q413M469Q609k178p180Q6N728J080l163j450
994a061L36J047J280P9j990j285O82K801J30l522k136K403N102j774o992N13P585
1011C198J202p614k047P355K545o644p78N165j187l837L539M079n950m641Q542
1026B927M863r610n863R654N809q632o139P499M847o558k678M664K09m083K401
1041f90M086m228m714N834N283n849n575N057O276l386n664J890M395m65k191
$$ plain form
1056 59 -1017 -385 1184 2103 653 -1510 -847 1227 569 -425 -110 -1561 -1351 1571 1831 -2883 -3791 2320
1074 2320 3869 -3512 -4722 2433 3720 -2281 -2896 2494 2133 -2361 -15 3602 -201 -3182 2122
1089 2122 5159 -1289 -4904 2032 5439 -1795 -4723 1456 3368 -1473 -2675 1396 319 -2950 -232
1104 -232 2334 -2048 -3240 2006 3155 -2570 -3411 1857 2539 -1163 -1041 1330 578 570 867 117 -1373
1121 -1373 393 2679 625 -2018 208 2054 -450 -2142 -168 866 -967 -1104 1259 -475 -2641
1136 -2641 243 2016 -1352 -2800 1065 2766 -1522 -2148 1968 1626 -1774 -390 2734 468 -2014
1151 -2014 983 3009 -1102 -2305 2050 2302 -2103 -1764 2315 1016 -2858 -640 1898 -1103 -2323
1166 -2323 1265 1474 -2068 -2236 1773 1182 -2617 -1251 2334 626 -1818 240 2137 -327 -1239 1750
$$ packed form
1056E9j076O32J569R19j450k163O63K074o58r94L15j451K10K922K60m714r08O111
1074B320J549p381j210P155J287o001o15N390l61m494K346L617l803k981N304
1089B122L037o448l615O936L407p234k928O179J912m841j202M071j077l269K718
1104b32K566m382j192N246J149n725q41N268O82l702J22K371p52qK97p50j490
1121a373J766K286k054k643K226J846k504j692J974J034j833j37K363j734k166
1136b641K884J773l368j448L865J701m288o26M116l42l400J384L124k266k482
1151b014K997K026m111j203M355K52m405L39M079j299l874K218K538l001j220
1166b323L588K09l542j68M009n91l799J366L585j708k444K058J897k464r12K989
$$ plain form
1182 1750 1408 -1510 -247 2350 536 -1859 214 1994 -245 -2276 447 1337 -1461 -1097 1473 70
1198 70 -2208 -519 1947 -1090 -2221 1296 1793 -1458 -1055 1735 942 -1380 350 2365 126 -1141
1214 -1141 1268 1876 -1065 -974 1714 1340 -1502 -723 1853 24 -2157 230 1225 -917 -2346 535
1230 535 1038 -1786 -1341 1511 119 -2024 -431 1617 78 -1829 580 1812 -734 -353 1654 1013
1246 1013 -991 -112 1883 435 -1500 367 1466 -1180 -1186 860 460 -1336 -833 867 -400 -1849
1262 -1849 36 1114 -814 -1300 695 1047 -828 -992 1232 364 -834 589 1428 270 -462 1057
1278 1057 1475 -692 -673 1637 699 -1208 -48 1146 -145 -1417 -6 819 -878 -1413 812 72 -1371
1295 -1371 -812 904 137 -1654 93 1245 -282 -1033 1088 971 -539 -203 1512 936 -798 254
$$ packed form
1182A750l42k918J263K597j814k395K073J780k239k031K723Q90k798L64K570j403
1198G0k278J689K466l037j131L517M97l251M03K790p93k322J730K015k239j267
1214a141K409O08k941R1K688l74k842P79K576j829k181K387R95k142j429K881
1230E35N03k824M45K852j392k143J593K048j539j907K409J232k546L81K007o41
1246A013k004Q79J995j448j935J867J099k646oK046m00j796N03J700j267j449
1262a849J885J078j928m86J995L52j875j64K224q68j198J423Q39j158p32J519
1278A057M18k167J9K310r38j907J160J194j291j272J411Q25j697n35K225p40j443
1295a371N59J716p67j791J747J152j527p51K121j17j510L36J715n76j734J052
$$ plain form
1311 254 1642 139 -845 150 595 -296 -1018 200 295 -1153 -349 402 -626 -934 -210 538 -456 -1018 334
1330 334 664 -658 -379 355 438 -144 239 566 -19 -136 990 833 -297 141 685 599 -468 -401 591 -109
1350 -109 -796 -121 104 -668 -293 85 -240 -1132 -920 596 -147 -838 -117 197 285 164 85 122 -25 392 682
1371 682 -60 -122 551 607 -37 -191 181 447 19 -183 -300 -551 -80 104 -435 -792 -897 -67 220 -893
1391 -893 -688 316 280 73 -335 179 634 324 269 225 290 376 693 798 286 -451 365 1015 40 -523 -455 773
1413 773 142 -1170 -804 137 -255 -422 -705 -95 -268 -567 -19 -151 -624 -38 596 670 -379 -578 775
1432 775 1114 -3 -265 446 1053 389 -357 -25 496 212 -191 66 -387 -349 -133 319 -280 -866 -572 281
1452 281 246 -616 -1225 161 865 -291 -988 346 1264 203 -557 256 743 -47 125 947 450 -418 86
$$ packed form
1311B54J388j503r84R95M45q91p22J218R5j448Q04P51j028l08P24P48r94n62J352
1330C34L30j322K79P34Q3n82L83L27n85j17J126j57j130M38N44q6j067O7R92p00
1350a09o87O75K25p72L75L78l25q92K12J516p43o91P21L14Q8j21p9L7j47M17K90
1371F82p42o2O73N6o44j54L72K66m28k02j17k51M71J84n39l57j05Q30K87j113
1391h93K05J004l6k07m08N14M55l10n5m4O5Q6L17J05n12p37Q16O50r75n63O8J228
1413G73o31j312L66R41l92j67k83O10j73k99N48j32m73N86O34P4j049j99J353
1432G75L39j117k62P11O07o64p46L32N21k84m03K57m53L8K16M52n99n86K94Q53
1452B81l5q62o09J386P04j156o97J334R18j061p60Q13M87p90J72Q22m97q68N04
$$ plain form
1471 86 939 418 -1166 -563 1234 437 -1453 -587 589 487 -1249 -885 634 -10 -838 62 238 -277
1489 -277 -925 482 906 -589 -685 991 1463 -108 -665 519 1501 139 -681 196 755 367 -326 -506
1507 -506 294 -279 -449 -164 63 -289 -946 -1 663 -701 -1536 575 985 -255 -929 133 1393 359
1525 359 -1119 248 1084 340 -417 540 918 -267 -196 1257 697 -1338 -441 1282 858 -1534 -974 1130
1543 1130 95 -1469 -658 503 -48 -819 -90 388 -546 -153 316 300 -392 -161 431 1014 172 -511 528
1562 528 805 159 -587 -139 317 489 -182 -312 -208 321 -162 -456 -191 -136 -413 -226 317 22 -729 -424
1582 -424 759 -9 -961 -25 1233 201 -812 110 1155 111 -469 689 660 -343 -343 746 417 -788
1600 -788 -293 1061 261 -1095 -195 688 -154 -1057 -73 437 -491 -627 478 151 -518 -208 289 105 -676
$$ packed form
1471H6Q53n21j584O03J797p97j890Q66J176j02j736L64J519o44q28R00J76n15
1489b77o48J407M24j495r6J676M72j571n57J184R82j362q20Q77N59l88o93j80
1507e06Q00n73j70K85K27l52o57R45O64j364q35K111M10j240o74J062J260j034
1525C59j478J367Q36p44p57R57L78j185P1J453n60k035Q97J723m24k392N60K104
1543A130j035j564Q11J161n51p71P29M78r34L93M69j6o92K31N92N83q42o83J039
1562E28K77o46p46M48M56J72o71j30J04N29m83k94K65N5k77J87N43k95p51L05
1582d24J183p68r52R36J258j032j013R22J045j044n80J158k9j003%J089l29j205
1600g88M95J354q00j356R00Q83q42r03R84N10r28j36J105l27o69L10M97j84p81
$$ plain form
1619 -676 323 1168 294 -91 584 502 347 -57 310 286 -449 325 256 -768 -705 179 9 -701 -225 371 -332
1640 -332 -865 -194 -26 -895 -231 362 307 -575 90 901 416 -475 244 615 -257 -226 475 532 -98 -317 666
1661 666 99 -892 175 833 -202 -842 -219 656 -399 -836 203 271 -605 -224 287 -149 -894 86 738
1680 738 -281 -171 747 643 -88 -150 717 343 -215 196 696 164 -592 538 166 -223 -316 224 41 -597
1700 -597 -423 216 -590 -592 69 139 -436 -479 415 302 -637 40 702 -21 -285 493 642 -16 -307 636 608 -189
1722 -189 225 419 134 -378 -194 518 -521 -497 16 179 -576 -459 -64 -67 -539 -256 295 -108 -536 227 442
1743 442 -411 -164 432 370 -231 296 721 254 -242 546 543 -57 -399 526 492 -430 -439 513 -228 -406 -85 54
1765 54 -263 -828 121 190 -497 -223 388 -202 -504 206 22 272 -532 361 493 4 25 440 81 -273 122
$$ packed form
1619f76R99Q45q74l85O75q2j55m04L67k4p35P74o9j024O3Q84j70p10M76N96p03
1640c32n33O71J68q69O64N93n5q82O65Q11m85q91P19L71q72L1P01N7o30k19R83
1661F66n67r91J067O58j035o40O23Q75j055m37J039O8q76L81N11m36p45R80O52
1680G38j019J10R18j04p31o2Q67l74n58M11N00n32p56J130l72l89r3N40j83o38
1700e97J74O39q06kO61P0n75m3Q94j13r39O77O62p23k64P78J49o58k91R43k8p97
1722a89M14J94k85n12J84P12j039K4N13J63p55J17L95lm72K83N51m03m28P63K15
1743D42q53K47N96o2o01N27M25m67m96P88lo00l42R25l4r22rR52p41j78L21J39
1765E4l17n65R49O9o87K74O11n90l02P10j84K50q04Q93J32m89K1M15l59l54L95
$$ plain form
1786 122 774 135 -754 201 297 -529 -559 62 58 -424 -406 433 -315 -800 318 300 -528 -471 161 557 -600 -428
1808 -428 652 275 -203 263 844 194 -23 498 732 7 -417 542 242 -431 -457 190 -80 -613 -432 92
1828 92 -123 -439 19 -144 -640 -90 102 186 -386 167 652 -196 -156 514 346 51 1 477 172 -361 660
1849 660 438 -51 -329 427 519 -402 -503 173 136 -834 -187 342 -102 -627 -139 253 -306 -551 483 694
1869 694 -263 -39 696 503 -232 55 542 242 -156 155 304 138 100 390 138 -288 -138 -171 -506 -359 -16
1890 -16 101 -388 -266 -107 -465 -490 177 195 -473 -418 391 621 -222 -229 597 431 -268 9 381 246 -226 384
1912 384 785 -278 -609 48 107 -364 -630 25 235 -307 -399 -203 208 -316 -468 -107 60 -54 -19 15 191
1933 191 -172 98 472 150 237 107 293 515 188 52 -53 419 37 -54 61 590 -200 -506 -159 -45 -201
$$ packed form
1786A22O52o39q89R55R6q26l0O21mm82J8Q39p48m85J118j8q28N7O32L96j157J72
1808d28J080l77m78M66N81o50k17N21K34p25m24R59l00o73k6O47k70n33J81N24
1828I2k15l16M58j63m96N50J92Q4n72N53M85q48M0O70j68k95n0M76l05n33J021
1849F60k22m89k78P56R2r21j01O76l7r70O47N29m44n25M88L92n59k45J034K11
1869F94r57K24P35j93p35K87M87l00l98L11J49j66l8K90k52m26J50l3l35J47L43
1890a6J17m89J22J59l58k5O67J8o68N5Q09K30q43pQ26j66o99K77L72j35m72O10
1912C84M01j063l31O57N9m71k66O55K10n42r2J96M11n24j52L61J67j14L5L4J76
1933A91l63K70L74l22Q7j30J86K22l27j36j05M72l82r1J15N29p90l06L47J14j56
$$ plain form
1954 -201 -498 -179 321 -113 -453 142 -52 -566 -455 273 467 71 -309 814 282 47 -249 199 672 -79
1974 -79 -425 437 390 -273 -286 445 6 -585 -394 515 182 -578 -376 306 -5 -489 -490 327 158 -530 69 288
1996 288 388 -409 152 501 -57 -359 273 699 -188 -433 301 515 -161 -396 109 213 -303 -317 -377 -284 -298
2017 -298 -569 11 -31 -209 -119 -312 -188 -240 -250 322 263 -262 -338 94 593 -89 -372 643 437 178 -178 163
2039 163 191 25 -88 154 65 -574 -239 114 218 -565 -631 276 -104 -705 -497 467 296 -616 -112 619 181
2060 181 -561 311 640 -21 -197 183 569 -19 -161 308 289 -256 -74 -106 263 -278 -276 126 -76 -395 -392 -67
2082 -67 -91 -314 -145 15 -147 -151 -8 52 -198 112 -54 -104 -7 207 3 -31 682 167 -377 320 661 -94 -436
2105 -436 -32 139 -491 -644 224 75 -795 -261 552 70 -591 -44 480 272 -424 92 131 -88 -410 81
$$ packed form
1954b01k97L19N00m34l40N95j94n14J11P28J94l96l80J123n32k35k96M48M73p51
1974g9l46Q62m7o63j3P31m39n91J91R09l33p60K02O82l11m84jQ17j69o88N99K19
1996B88J00p97N61L49n58l02O32M26q87k45P34K14o76k35N05J04n16j4o0R3j4
2017b98k71N80m2j78R0j93J24n2j0N72n9n25p6M32M99o82k83J015k06k59l56L41
2039A63K8j66j13K42q9o39L35L53J04p83o6R07l80o01K08R64j71r12N04P31m38
2060A81p42Q72L29o61j76L80L86n88j42M69j9n45J82l2L69n41KM02k02l19LL25
2082f7k4k23J69J60j62mJ43O0k50L10j66n0R7K14k04l4P13n15n44O97L41p55l42
2105d36M04J71o30j53Q68j49q70N34Q13m82o61N47N24k08o96N16L9k19l22M91
$$ plain form
2125 81 552 43 -243 486 629 -190 -204 301 592 -276 -254 239 -83 -568 69 -147 -295 -51 205 -470 -282
2146 -282 -172 84 -255 -139 193 -428 -152 194 476 -106 -158 442 418 -176 255 466 55 -227 -1 247 147
2167 147 -535 142 380 -201 -472 -103 244 -314 -483 5 95 -636 -221 446 -177 -250 91 443 -219 -334 139
2188 139 459 -12 373 476 217 -157 -77 235 259 120 191 -6 -313 64 179 -201 -503 -78 -172 -668 -376
2209 -376 10 -23 -331 -241 363 182 -271 146 223 24 -369 282 461 163 -119 180 474 -130 -125 454 153 -450
2231 -450 195 184 -62 -361 336 144 -343 -315 54 -119 -626 -257 253 -225 -340 276 232 -167 -106 319 84
2252 84 -94 67 506 15 -10 130 338 -188 -45 -16 200 -403 -74 131 -142 -429 27 123 -86 -152 -316 134
2274 134 -311 -374 174 134 -275 -21 257 -32 -6 134 436 76 227 294 172 -65 65 50 173 -99 109 292
$$ packed form
2125H1M71n09k86P29J43q19j4N05K91q68K2M93l22m85O37k16j48K44K56o75J88
2146b82J10K56l39J16L32o21K76L46K82n82n2O00k4n94M31K11m11k82K26K48j00
2167A47o82O77K38n81k71L69L47n58j69M88R0p31M15O67o23p3L41L52o62j15M73
2188A39L20m71L85J03k59l74Q0L12K4j39P1j97l07L77J15l80l02M25r4m96K92
2209c76L86l3l08R0O04j81m53M17P7j99l93O51J79k98k82K99K94o04NN79l01o03
2231d50O45j1k46k99O97j92m87K8L69j73n07L69N10m78j15O16m4l99O1M25k35
2252H4j78J61M39m91k5J40K08n26J43K9K16o03L29K05k73k87M56R6k09o6j64M50
2274A34m45o3N48m0m09K54K78k89K6J40L02l60J51O7j22k37J30j5J23k72K08J83
$$ plain form
2296 292 -249 -290 337 -221 -301 -47 -59 -166 -131 -31 17 -651 -216 50 86 21 -508 320 223 -127 170 440 401
2319 401 181 216 485 149 -92 183 -64 -214 79 -185 -155 -133 -12 -101 -128 -240 -49 -170 -25 192 -55 -137
2341 -137 -59 -142 107 89 -166 218 376 66 244 187 7 117 37 137 -42 -62 205 149 -171 -151 -82 42 -438
2364 -438 -131 99 -364 -571 -401 41 49 55 -52 159 -40 -193 182 38 58 272 211 88 -32 148 98 70 141
2387 141 -28 -211 240 53 -175 33 -218 -89 -187 -468 -33 -15 -176 -16 -65 328 184 -181 616 153 15
2408 15 -74 398 222 -86 -72 439 215 87 355 411 -4 -306 27 50 -183 -338 117 201 -139 -369 4 -73
2430 -73 -144 -206 366 112 -155 -118 -55 441 117 -150 275 -33 181 43 155 353 192 201 142 -24 -337 -75 -39
2453 -39 -180 -217 -477 160 -70 -15 -224 -2 134 -232 -368 104 121 -313 -134 224 308 -75 -128 311 241 107
$$ packed form
2296B92n41m1O27n58q0K54j2j07L5J00M8o68M35K66L6o5n29Q28r7l50K97K70l9
2319D01k20L5K69l36k41K75k47j50K93k64L0K2J21q9k7j12J91j21J45K17k47q2
2341a37P8q3K49j8k55L84J58l10J78n7j80J10q0J00j79k0K67n6l20K0O9J24m80
2364d38L07K30m63k07J70M42QOj07K11j99j53L75j44K0K14o1j23j20J80n0k8P1
2387A41j69j83M51j87k28K08k51J29r8k81M35J8j61J60m9L93j44l65P97m63j38
2408A5q9M72j76l08J4N11k24j28K68N6m15l02L33K3k33j55M55Q4l40k30L73p7
2430g3p1o2N72k54k67L7O3M96l24k67M25l08K14j38J12J98j61Rn9j66l13K62L6
2453c9j41l7k60O37k30N5k09K22J36l66j36M72J7m34J79L58Q4l83n3M39p0j34
$$ plain form
2475 107 -117 394 183 -158 140 180 112 -220 -37 107 107 -353 71 222 -253 -376 -50 -41 -337 -197 -331 66
2497 66 -83 -89 63 268 -66 136 218 351 220 -22 357 155 13 -240 361 101 13 -76 190 175 -213 141
2519 141 87 52 -258 -421 -105 -60 -13 16 -46 -102 -18 -83 180 200 -28 -10 -17 246 265 -76 128 466 76 107 96
2544 96 236 -149 -209 58 -27 -301 -142 136 1 -312 -382 290 45 -409 -82 251 -134 -97 34 232 12 -262
2566 -262 131 284 93 400 162 216 267 34 -49 49 -82 264 -38 67 96 -142 178 -219 -200 6 -111 -41
2588 -41 103 -243 -364 -185 114 -93 -157 200 370 -43 126 197 107 55 232 252 274 322 49 433 130 -134 211
2611 211 115 -23 -347 50 451 -270 -237 162 -123 -408 -68 -50 -122 -196 62 214 -83 -137 157 374 202 328
2633 328 245 2 253 49 20 97 -81 159 -84 94 -155 -160 -347 27 -116 7 -444 -166 320 208 -293 -120
$$ packed form
2475A07k24N11k11l41K98M0o8l32J83J44%m60M24J51m75j23L26Rk96J40j34L97
2497F6j49oJ52K05l34K02Q2J33j31k42L79k02j42k53O01k60q8q9K66j5l88L54
2519A41n4l5l10j63L16M5M7K9o2n6Q4o5K63K0k28J8pK63J9l41K04L38l90L1j1
2544I6J40l85o0K67q5k74J59K78j35l13p0O72k45m54L27L33l85L7J31J98k20k74
2566b62L93J53j91L07k38N4N1k33q3R8j31L46l02J05K9k38L20l97J9K06j17P0
2588d1J44l46j21J79K99k07o4L57J70m13J69P1r0n2J77K0K2M8k73L84l03k64L45
2611B11r6j38l24L97M01p21L3L99k85k85L40J8p2p4K58J52k97n4K94K17j72J26
2633C28q3k43K51k04k9P7j78K40k43J78k49nj87L74j43J23m51K78M86j12n01J73
$$ plain form
2655 -120 73 -306 -410 63 216 -74 72 232 96 -164 -70 449 145 -106 193 315 -52 -326 118 591
2675 591 -174 -431 -97 -18 -145 -328 -132 -143 -77 -291 108 58 -197 61 137 13 -25 393 400 260 -54 -57 -74 -264
2699 -264 241 143 -76 -6 305 -36 -230 -111 -133 -206 -163 40 -105 -154 -334 245 34 -274 -201 357 311 -254 -135
2722 -135 540 74 -49 270 48 311 -152 191 284 -272 88 298 -297 -247 -222 -183 98 -419 13 -237 -57
2743 -57 -31 67 -164 -167 -140 -13 -114 -272 -90 186 -215 -19 172 170 -245 135 80 -40 228 212 129 121 189 200 23
2768 23 -96 77 99 -42 -277 202 146 -31 -76 -130 -39 -296 -280 181 -96 -114 96 425 -268 21 167 169 148 29
2792 29 60 47 -54 -3 -106 -69 -22 -150 328 100 159 71 -47 -344 157 -60 -233 -439 108 -71 -476 3 50
2815 50 47 135 -60 151 143 -67 81 371 -83 -251 260 162 -83 -63 -47 -81 -220 -137 81 -288 -283 -7 79 -167 -167
$$ packed form
2655a20J93l79j04M73J53k90J46J60j36k60R4N19l04k51K99J22l67k74M44M73
2675E91p65k57L34P9j27j83J96j1O6k14L99n0k55K58P6j24l8M18Pj40l14lj7j90
2699b64N05r8k19P0L11l41j94J19k2p3M3K03j45m9j80N79k11l08P3N58m6n65J19
2722a35O75m66j23L19k22K63m63L43R3n56L60K10n95N0K5L9K81n17M32k50J80
2743e7K6R8k31lK7J27j01j58J82K76m01J96J91km15L80n5j20K68j6q3qO8J1j77
2768B3j19J73K2j41k35M79n6j77m5n4R1k57J6M61k77j8K10L29o93K89J46Kk1j19
2792B9L1j3j01N1j03L7M7j28M78k28N9q8j18k97N01k17j73k06N47j79m05M79M7
2815E0lQ8j95K11qk10J48K90m54j68N11r8k45K0J6l4j39Q3K18l69NK76Q6k46%
$$ plain form
2840 -167 16 20 -371 -18 37 -159 68 128 116 -91 129 299 125 -125 50 340 125 129 35 165 36 -126 60
2863 60 -163 29 -180 216 -84 -184 188 226 -217 -248 118 35 -243 7 195 -14 -153 -14 -26 156 50 221
2885 221 178 168 94 -118 105 -41 2 306 -41 -188 -142 -58 -110 -187 -28 -137 -20 -117 56 -235 -86 -118 -108 56
2909 56 122 -100 194 116 39 536 -13 79 106 169 -147 2 -4 185 -114 -65 58 -68 -121 -108 131 -55 -115 54
2933 54 -48 -87 -161 -42 -13 -49 -177 202 -30 -345 -58 -27 202 -183 34 277 68 199 53 69 213 148 -128
2956 -128 -26 117 -272 -1 -293 -38 203 -191 -197 -290 23 13 -219 10 8 85 104 240 -141 168 18 6 -48
2979 -48 -206 247 391 77 -53 138 92 -84 -253 -190 -30 -305 -98 -22 -192 71 -106 -148 -215 -184 -146 -85 -15
3002 -15 -310 -172 -129 7 172 68 100 173 246 100 154 154 66 -8 177 180 197 -30 283 159 -165 -116 -30 18 -125
$$ packed form
2840a67J83Ml91L53N5j96K27O0j2k07K20J70j74k50J75K90k15Mr4J30j29j62J86
2863F0k23J92k09L96l00j00L72L8m43l1L66q3k78K50J88k09j39J39j2J82j06J71
2885B21m3j0p4k12K23j46M3L04l47j47M6Q4n2p7J59j09J17r7J73k91J49l2J0J64
2909E6O6k22K94p8p7M97n49R2K7O3l16J49oJ89k99M9J23j26n3J3K39j86o0J69
2933E4j02l9p4J19K9l6j28L79k32l15K87L1K29l85K17K43k09J31j46J6J44o5k76
2956a28J02J43l89K71k92K55K41l94or3L13j0k32K29kP7J9J36l81L09j50j2n4
2979d8j58M53J44l14j30J91m6j76j69O3J60k75K07P6j70K63j77m2o7L1L8O1P0
3002a5k95J38M3J36J65j04L2P3P3j46N4%q8p4J85LJ7k27L13j24l24M9Q6M8j43
$$ plain form
3027 -125 -262 39 -60 -52 -15 202 258 -185 -216 26 -135 44 25 -25 82 -127 286 -27 93 76 -15 41 247 -45
3051 -45 -143 15 85 -170 -354 -60 -38 -96 -163 -22 2 -218 -246 53 244 -48 197 223 319 111 150 277 297 -18
3075 -18 39 90 274 50 -73 335 -184 -114 20 -11 92 -52 -206 -15 -197 -118 -127 149 -233 -228 -297 -155 123 -50
3099 -50 67 -18 191 -117 224 360 -106 -85 89 203 -124 -34 99 127 178 -258 -37 121 -190 -211 65 -146
3121 -146 -83 -93 4 -192 -46 -187 -95 303 -157 26 -134 -95 -117 -61 119 18 14 65 137 -6 64 146 -11 178
3145 178 192 -219 132 216 38 111 -66 -103 -43 -132 166 -185 122 6 17 71 195 -425 -45 151 -106 -62 127
3168 127 55 26 -296 170 261 188 -3 210 -22 -191 -277 -125 150 -292 66 104 -293 -241 -217 110 -48 -21 69
3191 69 -84 -104 49 176 -47 -137 -111 110 284 174 108 78 197 34 -238 118 170 -162 -189 -43 -6 204 -315
$$ packed form
3027a25j37L01r9QL7K17N6m43l1K42j61J79j9n0J07k09M13l13J20j7r1N6K06k92
3051d5r8J58P0k55j84K94K2n8o7J41K4k20k8K99J91k92K45K6R6k08L9J27K0l15
3075a8N7N1J84k24j23M08n19P0J34l1J03j44j54J91j82P9rK76l82No9J42K78j73
3099e0J17q5K09l08L41J36m66K1J74J14l27R0J33K8N1m36K21J58l11k1K76k11
3121a46O3j0R7j96J46j41R2L98m60J83j60L9k2N6J80j01mN1P2j43P0Q2j57J89
3145A78J4m11L51Q4j78P3j77l7O0q9K98l51L07j16J1N4J24o20L80J96k57M4J89
3168A27p2k9l22M66R1p3j91K13k32j69q6J52K75m42L58L8l97N2K4L27j58K7R0
3191F9j53k0J53J27k23r0K6K21J74j10o6l0J19j63k72L56N2l32k7J46L7K10n19
$$ plain form
3214 -315 -1 -154 -134 -116 -184 128 -65 93 213 -24 -13 8 82 -138 -205 167 359 106 -192 138 238 -40
3236 -40 -149 -45 196 67 -169 100 48 -132 21 144 -161 -403 -205 -172 179 75 -152 242 -47 142 3
3257 3 120 128 126 175 54 120 108 29 117 118 -38 154 -186 -21 216 65 -250 18 118 -170 -125 -255 -153 108 98
3282 98 100 -422 -308 91 190 -171 -64 8 211 69 -184 191 1 31 -194 105 233 114 -167 297 46 -121
3304 -121 248 62 -162 88 20 171 -255 -75 75 132 100 -56 -142 64 123 14 -119 -79 9 118 -80 76
$$ packed form
3214c15L14j53K0J8o8L12j93J58J20k37J1K1P4k20o7L72J92k53k98L30J00k78
3236d0j09J04K41j29k36K69n2j80J53J23l05k42J98L3L51j04k27L94k89J89j39
3257CJ17QkM9j21O6j2p9Q8Jj56J92l40J65K37j51l15K68J00k88M5j30J02K61j0
3282I8Kn22J14L99R9l61J07P2K03j42k53L75j90L0k25K99J28j19k81M64k51j67
3304a21L69j86k24K50o8J51m26J80J50N7l2j56q6K06N9j09j33M0Q8J09j98J56
$$ [...]
8191b08
##END NTUPLES=NMR FID
##END=
