##TITLE=1H_Pr et-pe-dep
 CDCl3
 8 sc, 
 27.10.2021
##JCAMPDX= 6.0         $$ Bruker NMR JCAMP-DX V2.0
##DATA TYPE= NMR FID
##DATA CLASS= NTUPLES
##ORIGIN= UXNMR, Bruker Analytische Messtechnik GmbH
##OWNER= root
$$ XWIN-NMR		Version 3.5
$$ Wed Oct 27 13:52:20 2021 Russian Standard Time (UT+4h)  she@DPX200
##.OBSERVE FREQUENCY= 200.1313468511
##.OBSERVE NUCLEUS= ^1H
##.DELAY= (6, 6)
##.ACQUISITION MODE= SIMULTANEOUS
##.ACQUISITION SCHEME= undefined
##.AVERAGES= 8
##.DIGITISER RES= 18
##SPECTROMETER/DATA SYSTEM= spect
##.PULSE SEQUENCE= zg30
##.SOLVENT NAME= CDCl3
##.SHIFT REFERENCE= (INTERNAL, CDCl3, 0, 15.7039)
##AUDIT TRAIL= $$ (NUMBER, WHEN, WHO, WHERE, WHAT)
$$ ##TITLE= Audit trail, XWIN-NMR		Version 3.5
$$ ##JCAMPDX= 5.01
$$ ##ORIGIN= Bruker BioSpin GmbH
$$ ##OWNER= she
$$ F:/spectra/data/she/nmr/H-F/1/audita.txt
$$ ##AUDIT TRAIL=  $$ (NUMBER, WHEN, WHO, WHERE, WHAT)
(   1,<2021-10-27 13:50:54.81 +0400>,<she>,<DPX200>,
      <created by zg, POWCHK disabled, PULCHK disabled
       configuration hash MD5:
       00 E9 B6 7A A2 85 ED C7 34 08 36 98 17 FE 4E 26
       data hash MD5: 16K
       74 6E F5 2A 02 55 01 51 E1 C6 41 6D C4 B1 ED 11>)
$$ ##END=
$$ 
$$ hash MD5
$$ 49 24 A6 A8 14 D3 7C 87 4F 25 2C A5 8C D3 CE B3
##$RELAX= 
##$RELAX= 
##$RELAX= 
##$RELAX= 
##$RELAX= 
##$RELAX= 
$$ Bruker specific parameters
$$ --------------------------
##$DU= <F:/spectra>
##$EXPNO= 1
##$NAME= <H-F>
##$PROCNO= 1
##$TYPE= <nmr>
##$USER= <she>
##$AMP= (0..31)
100 100 100 100 100 100 100 100 100 100 100 100 100 100 100 100 100 100 
100 100 100 100 100 100 100 100 100 100 100 100 100 100 
##$AQSEQ= 0
##$AQ_mod= 1
##$AUNM= <au_zg>
##$AUTOPOS= <>
##$BF1= 200.13
##$BF2= 200.13
##$BF3= 200.13
##$BF4= 200.13
##$BF5= 200.13
##$BF6= 200.13
##$BF7= 200.13
##$BF8= 200.13
##$BYTORDA= 1
##$CFDGTYP= 0
##$CFRGTYP= 5
##$CHEMSTR= <none>
##$CNST= (0..31)
1 1 145 1 1 1 1 1 1 1 1 1 1 1 1 1 1 1 1 1 1 1 1 1 1 1 1 1 1 1 1 1 
##$CPDPRG= <>
##$CPDPRG1= <>
##$CPDPRG2= <>
##$CPDPRG3= <>
##$CPDPRG4= <mlev>
##$CPDPRG5= <mlev>
##$CPDPRG6= <mlev>
##$CPDPRG7= <mlev>
##$CPDPRG8= <mlev>
##$CPDPRGB= <>
##$CPDPRGT= <>
##$D= (0..31)
0 1.2 0 0 0 0 0 0 0 0.06 0 0.03 0 0 0 0 0.0002 0 0 0 0 0 0 0 0 0 0 0 0 
0 0 0 
##$DATE= 1635328254
##$DBL= (0..7)
120 120 120 120 120 120 120 120 
##$DBP= (0..7)
150 150 150 150 150 150 150 150 
##$DBP07= 0
##$DBPNAM0= <>
##$DBPNAM1= <>
##$DBPNAM2= <>
##$DBPNAM3= <>
##$DBPNAM4= <>
##$DBPNAM5= <>
##$DBPNAM6= <>
##$DBPNAM7= <>
##$DBPOAL= (0..7)
0.5 0.5 0.5 0.5 0.5 0.5 0.5 0.5 
##$DBPOFFS= (0..7)
0 0 0 0 0 0 0 0 
##$DE= 6
##$DECBNUC= <off>
##$DECIM= 32
##$DECNUC= <off>
##$DECSTAT= 4
##$DIGMOD= 1
##$DIGTYP= 9
##$DL= (0..7)
0 120 120 120 120 120 120 120 
##$DP= (0..7)
150 150 150 150 150 150 150 150 
##$DP07= 0
##$DPNAME0= <>
##$DPNAME1= <>
##$DPNAME2= <>
##$DPNAME3= <>
##$DPNAME4= <>
##$DPNAME5= <>
##$DPNAME6= <>
##$DPNAME7= <>
##$DPOAL= (0..7)
0.5 0.5 0.5 0.5 0.5 0.5 0.5 0.5 
##$DPOFFS= (0..7)
0 0 0 0 0 0 0 0 
##$DQDMODE= 0
##$DR= 18
##$DS= 0
$$ [...]
##$SUBNAM2= <"">
##$SUBNAM3= <"">
##$SUBNAM4= <"">
##$SUBNAM5= <"">
##$SUBNAM6= <"">
##$SUBNAM7= <"">
##$SUBNAM8= <"">
##$SUBNAM9= <"">
##$SW= 18.0517286264689
##$SWIBOX= (0..15)
0 0 2 0 0 0 0 0 0 0 0 0 0 0 0 0 
##$SW_h= 3612.71676300578
##$TD= 16384
##$TD0= 1
##$TE= 0
##$TE2= 300
##$TE3= 300
##$TEG= 300
##$TL= (0..7)
0 120 120 120 120 120 120 120 
##$TP= (0..7)
150 150 150 150 150 150 150 150 
##$TP07= 0
##$TPNAME0= <>
##$TPNAME1= <>
##$TPNAME2= <>
##$TPNAME3= <>
##$TPNAME4= <>
##$TPNAME5= <>
##$TPNAME6= <>
##$TPNAME7= <>
##$TPOAL= (0..7)
0.5 0.5 0.5 0.5 0.5 0.5 0.5 0.5 
##$TPOFFS= (0..7)
0 0 0 0 0 0 0 0 
##$TUNHIN= 0
##$TUNHOUT= 0
##$TUNXOUT= 0
##$USERA1= <user>
##$USERA2= <user>
##$USERA3= <user>
##$USERA4= <user>
##$USERA5= <user>
##$V9= 5
##$VALIST= <valist>
##$VCLIST= <CCCCCCCCCCCCCCC>
##$VD= 0
##$VDLIST= <DDDDDDDDDDDDDDD>
##$VPLIST= <PPPPPPPPPPPPPPP>
##$VTLIST= <TTTTTTTTTTTTTTT>
##$WBST= 1024
##$WBSW= 4
##$XGAIN= (0..3)
0 0 0 0 
##$XL= 0
##$YL= 0
##$YMAX_a= 97494
##$YMIN_a= -126346
##$ZGOPTNS= <>
##$ZL1= 120
##$ZL2= 120
##$ZL3= 120
##$ZL4= 120
##$ABSF1= 10
##$ABSF2= 0
##$ABSG= 5
##$ABSL= 3
##$ALPHA= 0
##$AQORDER= 0
##$ASSFAC= 0
##$ASSFACI= 0
##$ASSFACX= 0
##$ASSWID= 0
##$AUNMP= <proc_1d>
##$AZFE= 0.1
##$AZFW= 0.1
##$BCFW= 1
##$BC_mod= 2
##$BYTORDP= 1
##$COROFFS= 0
##$CY= 11.3945322036743
##$DATMOD= 1
##$DC= 2
##$DFILT= <>
##$DTYPP= 0
##$F1P= 2.36226072786647
##$F2P= -0.459571619588291
##$FCOR= 0.5
##$FTSIZE= 0
##$FT_mod= 4
##$GAMMA= 1
##$GB= 0.15
##$INTBC= 1
##$INTSCL= 1
##$ISEN= 128
##$LB= 0.24
##$LEV0= 0
##$LPBIN= 0
##$MAXI= 10000
##$MC2= 0
##$MEAN= 0
##$ME_mod= 0
##$MI= 1.114404
##$NCOEF= 0
##$NC_proc= 0
##$NLEV= 6
##$NOISF1= 3.799351
##$NOISF2= 2.8
##$NSP= 1
##$NTH_PI= 0
##$NZP= 0
##$OFFSET= 15.70392
##$PC= 1
##$PHC0= -15153.75
##$PHC1= 14.80082
##$PH_mod= 1
##$PKNL= yes
##$PPARMOD= 0
##$PSCAL= 0
##$PSIGN= 0
##$REVERSE= no
##$SF= 200.130013532006
##$SI= 16384
##$SIGF1= 3
##$SIGF2= 2
##$SINO= 400
##$SIOLD= 16384
##$SREGLST= <1H.CDCl3>
##$SSB= 0
##$STSI= 0
##$STSR= 0
##$SW_p= 3612.71676300578
##$SYMM= 0
##$S_DEV= 0
##$TDeff= 0
##$TDoff= 0
##$TI= <>
##$TILT= no
##$TM1= 0
##$TM2= 0
##$TOPLEV= 0
##$USERP1= <user>
##$USERP2= <user>
##$USERP3= <user>
##$USERP4= <user>
##$USERP5= <user>
##$WDW= 1
##$XDIM= 8192
##$YMAX_p= 0
##$YMIN_p= 0
$$ End of Bruker specific parameters
$$ ---------------------------------
##NTUPLES= NMR FID
##VAR_NAME=  TIME,          FID/REAL,        FID/IMAG
##SYMBOL=    X,             R,               I
##VAR_TYPE=  INDEPENDENT,   DEPENDENT,       DEPENDENT
##VAR_FORM=  AFFN,          ASDF,            ASDF
##VAR_DIM=   8192,          8192,            8192
##UNITS=     SECONDS,       ARBITRARY UNITS, ARBITRARY UNITS
##FACTOR=    0.0002768,     1,               1
##FIRST=     0,             0,               0
##LAST=      2.2672688,     0,               0
##MIN=       0,             -126346,         0
##MAX=       2.2672688,     97494,           0
$$ Real data points
##PAGE= N=1
##DATA TABLE= (X++(R..R)), XYDATA
$$ [...]
1735Gr7j34M65K7k10K9Q3o6J59p4O6l5j60J76k05j71K13J87j26n91M44p0N2j85
1759b16Q6l8l80N81j49q6N6p7K81lk01K84J47l42N2K18j24m4J86R8j12k50L28
1782B95q5Kj61j23K89k11k12J00p8J60n3r0J70j98j87K15r2J85L25k5j61o9K38
1805B34L6k70P5K38j90J41J22l43K99l24L0j26k68N71l61K1P8k47P0Q6m1M7m4
1828a66j18J49K14j53o9K91k23Q1j82M27j02k10K29J35j96l4K63n8j48j25P4m36
1850c57J37p0J86Q8k95m9L06j60N1Q2L3j83pK41K7K5j5M01j35k77K05m4p8p9L3
1875F6J93j93NJ97l08J73l06K73o1m59L93N8k16kmK99j77k02J72K3r0M55l1k06
1899E2M7m4J55J69l47K05R2j12M7j22rQ5l03J56k07j30L99j85j89j1J99n8L04
$$ y = [7, -90, -224, 241, 268, 58, 87, 170, 104, 263, 189, 255, 220, 60, 236, 31, -140, 73, 260, 134, -457, -13, -83, -31, -216, -130, -168, -548, 33, -116, -202, -146, -223, 58, 55, -146, 138, 285, -57, -5, 213, 89, 45, 231, 329, 217, -33, 295, 210, 212, 51, -72, 217, 6, -206, -106, -184, -24, -77, -167, 3, -195, -382, -167, -259, -74, 251, 226, 65, -4, 234, 270, 0, 75, 313, 123, 264, 386, 43, 342, 18, 48, -78, -346, 225, -136, -115, -37, -284, -214, -128, -169, -122, -166, -284, -135, 79, -74, -143, 148, -75, 6, -176, 251, 149, -61, 168, 303, 107, 73, 336, 278, 130, 5, 79, -357, -220, -290, -104, -16, -311, -360, -54, -214, -163, -81, -48, -231, -238, 3, 30, 55, 40, 441, 306, 29, 234, 190, 112, 33, 66, 259, 66, 71, 268, -40, 133, -173, 100, 39, -420, -27, 31, -185, -187, -191, 108, -69, -271, -99, -76, -166, 289, 258, 52, 99, 55, 210, 379, 32, 237, 329, 217, 264, 142, 133, 218, -85, 71, -136, -266, 133, -52, -241, -252, -53, -111, 193]
1922A93l33j5j00J08K27j76J21J01l53K21J59K51j03j03j48K71Qk18J9k02K08
1943A36j40j71K04o5k71K43P1r7l86J93M02m81J21L95p1k0J8n0jL45k21L6r2K06
1967C04k42M9Qk53K30k55J15kP3l49K59J73l20J11k60L86l32QM19j18o8n6p1J61
1991c0q2J54L59j35nJ9n0j08rq4O9q1n3N9J9j25J44k27o5R8n3j05L13k38J16k40
2017c40K92K85k24j78J62L73m24K94N1K5k90R6K26j76m5r5J58K03m00O5J33j82
2039Ij51j96K14J63k90RJ15PJ21k0j92K23j58p9K51n9lj60J14L15j89r9Q7J74
2063B06n4j73M7j1O6k96K62l0q6m4K08L3j44j60J68K5l70L54j20J9M9K5J69k69
2087a26O8J24P9N1m73L55p5p6L7M67m68j00L65q3N1l19N1J61j88J69k10j81J67
$$ y = [193, -140, -155, -255, -147, 80, -96, 25, 126, -227, -6, 153, 404, 301, 198, 50, 321, 329, 111, 130, -72, 136, -4, -175, 29, -36, -307, -64, 7, -90, -476, -283, 119, -362, -241, 154, 83, 63, 81, 31, 30, 375, 154, 190, 98, 304, 62, 111, 119, -134, 96, -159, -44, -46, 27, -322, -63, 110, -210, -99, -359, 27, -305, -297, 122, 4, -64, -120, -191, -30, -112, 42, 401, 266, 261, 280, 230, 122, 113, 29, 98, 17, -36, 23, 42, -83, 61, -166, -231, -133, -186, -291, 22, -216, -100, -340, -48, 237, 13, -165, -3, 370, -54, 240, 291, 316, 26, 122, 348, 172, 127, 32, 190, 393, -7, 58, 191, 9, -142, -338, -124, 39, -251, -242, -127, -120, 1, -19, -211, 12, -146, -225, 26, -33, -36, -196, -82, 233, 44, -55, 32, 206, 152, -21, 26, 15, 81, -215, 47, 17, -69, -113, 95, 128, -16, -176, -8, 17, -353, 1, -119, -100, -51, -26, 143, -126, -58, 66, 145, 196, -277, 78, 3, -73, -36, 431, -37, -137, 228, 145, 196, -123, -72, 89, -99, 70, -140, -321, -154]
2110a54k92N17k06O9qJ07j12m0J79j05p6K07J93J94k72J22m71J2K65J16L6k86
2132eM04l49J50l27J71j93k08m2K14q1K6J08M16k37O0j42K13l84l7K80L06k44
2154I9K62j30rj82L52l41p1J99o9J02l9K7q8k25j29K13oJ47k45l3j9j87K22K32
2178H2pj28J67j75K02j39mL43k65K12n9l0k9k21K69ol27P0K28l63J87j53N4J68
2202G6j97nQj09l2K80O9k02Q9K8J16k08L09j40j04L75k71jJ36K7k04K8j31K69
2226B06p8j40k9Pj33q3j28K53k94L36J92k84j00P6o0M27m67J11K26j08M8K83L0
2249B91j35j71NK05l18L04N9OK0j96l4r0k20J2L02p6j70L18l64J96k19j67L88
2272e4j75O6R0lM6K40j91o7K6J88k1n9K48j09l05K74J7q1k05J96j83MO3j34J0
$$ y = [-154, -446, 71, -135, -66, -74, 33, -79, -119, 60, -45, -121, 86, 279, 473, 201, 323, -148, -136, 129, 245, 281, -5, 399, 50, 200, -127, 44, -149, -357, -399, -185, -266, -240, -132, 284, 47, 107, -35, 178, -206, -243, 37, 343, 99, 361, 231, 222, 40, 392, 51, -20, 179, 110, 212, 173, 200, 112, -113, -242, -29, -35, 112, -133, -166, -185, -372, -150, 82, 75, -53, 114, -61, 141, 2, -2, 341, 76, 288, 229, 199, 170, -51, 218, 212, -115, -45, 183, -180, 7, -146, -92, 76, -121, -126, -118, -227, -259, 21, 90, -112, -23, 5, 121, -87, 222, 82, -22, 353, 82, 81, 217, 244, 40, 68, -63, 206, 128, -12, -41, -34, -167, -250, -378, -125, -419, -83, 109, -175, -275, -199, -259, 168, -299, -188, 38, -70, -22, 261, 291, 156, -15, -10, 195, -123, 181, 240, 246, 266, 70, 36, -54, -274, -262, 40, -36, -206, 112, -252, -56, -275, -442, -54, -229, -163, -73, -76, -30, 210, 19, -48, -22, 166, 145, 86, 334, 225, -80, 194, 211, 130, -75, 121, -62, -58, 5, -129, -119]
2297a19p9K43k74J52l54L48l4q2JK63K44j93m2J09J50k14j33L64l01j1J46q3k39
2320a38K24j50J02k62j07L74l29K32J72j62j26P8j89J78Pr3J80N0q3j03L47o8
2342A34k06J82J08q2j76K95r5j07p7O7J10k10n0J97o5o9l4j11K03k30M6K14j77
2365a33L8m7O9kO9n7K18k26J65Q8J12k89k9L40l46L19j40j39n4M06k56k09K09
2388A06J2k78K43k86LJ60j72J21q6P9k12L20J62j32j10JK94k67J65J40m2n6l9
2411A26N3j58J66j07Ok63J45J59r7j21j8K01j54k28J78j21o4K34P6k03J52j67
2433b05L67l90K27J58l66L25j73K05q9m7m2K44j11K09l14R8O0l95L29j15k71R8
2455a98L14k09K40p6m31K91o7K46J19l91K21j73L11k19M26k68L95k25l07J48q8
$$ y = [-119, -198, 45, -229, -77, -431, -83, -117, -199, -198, 65, 309, 116, 74, 183, 333, 119, -14, 350, 49, 38, 184, 101, -138, 86, -64, 38, -224, -331, 43, -286, -54, 118, -44, -170, -92, -281, -103, -96, -189, -9, 41, -42, -145, 202, 134, -72, 110, 218, 136, -40, 255, 160, 53, -24, 43, 153, -57, -107, 90, 25, -44, -78, -189, 14, -216, -170, 44, -133, -95, -142, -73, -75, -6, -63, 155, -71, 94, 182, 294, 5, -24, 316, -30, 289, 149, 10, -44, 362, 106, -103, 106, 118, -160, 83, -203, -200, -40, -212, -91, -177, -98, -310, 10, 172, 40, -70, -69, 225, -42, 123, 263, 221, 165, 126, 179, 21, 187, 80, 86, -177, -32, 127, 30, -91, -109, 92, -62, -290, -112, -233, -297, -63, 13, -190, -38, -205, 162, -228, -1, 157, -209, 116, -57, 148, 59, 12, -30, 214, 103, 312, -2, 96, 156, -239, 90, -25, -296, -198, 116, -93, 147, 71, -360, -69, -136, 110, 229, -162, 59, -114, 197, -22, 404, 136, 531, 306, -1, 147, 59]
2476E9J06J13k25r9o0J26O1m5O3k28J64j73J11oN8Q5j81m9K45r4j35J22P1L15
2500D04o70L63Q9J79k82J01j43n0J14j09k5Q8r3r6J43k22L15k48j12K3J21L9j48
2523b19k23M51n2J84J05l41J84o8m5J80M4n1oM2l5j98r8L04j00Q7k88j20K30k89
2547c22L59mj62K4k20R5M25k56j24K01K59m18J92j08J9Q8K28j67j1m2R5l9M3K31
2571C86m10K51o1k74L15j1k02J32l49K51j10J5j05j83K76L58l93j13Q6K69j92
2592f4J46j29J19o4j88J62J36j25L17k03j2q1K6J7l69K61K18o0k48K83l27J87
2614Bj14J84o6r2j4p5J84j65K35R1J5k30L7r0J61O5j87k41N40j50M8j07o0n2P3
2639hj10M2p8k7K37k64KK32j99j9l5J65Q0j15P9M8P2o3o6L06m74j28O43P3l29
$$ y = [59, 165, 278, 53, -46, -106, 20, 81, 36, 99, -129, 35, -138, -27, -33, 25, 110, -71, -120, 125, 31, -104, 18, 89, 404, -266, 97, 186, 365, 83, 184, 41, -9, 105, -4, -29, 59, -34, -130, 13, -209, 106, -142, -254, -231, -110, -71, -219, -442, 9, -43, 141, 246, -95, 89, 21, -24, 156, 200, 149, 143, 185, 150, -48, -146, 158, 58, 145, -143, -263, -33, -322, 37, 33, -129, -105, -325, -230, 195, -61, -185, 16, 275, -143, 49, -59, -40, 48, 276, 109, 98, 56, 151, 112, 155, 386, -24, 227, 166, -108, 207, 196, -6, 126, -223, 28, -82, -67, -172, -355, -79, 279, -114, -227, -141, 128, -64, 82, -47, 72, 8, -180, -18, 118, -7, 310, 107, 95, 14, 40, 57, -312, -51, 167, 107, -141, 142, -185, 2, -112, 72, 6, -86, -100, -175, 9, -156, 79, 170, 185, -45, -8, -98, 63, 128, -59, -300, 240, 90, 138, 31, -29, -81, -8, -118, -76, -154, -181, 56, -208, -206, 26, -173, -192, -227, -62, 18, -97, -18, 30, 102, 39, -27, 279, -195, -323, 320, 393, 64]
2664F4J23L1j33l64K66K02j33K7k7j82R6j17l2J69k03K8M06k70l7o2J2%J14J24
2688A02k43R3o0j6K07q2L09k75k5K73k68k6O1k33K08j77J87J00l55O2K03j65M5
2711g5j67J92NK45l30L33l10J83J68j37K98l02J51k61k12J56O5J28J45j09m00
2732b34J45m9l7Q5p2L9j49J99J58j99nq5K35Q0j98J07m6j84J38Q9Q6L8j71P6M5
2757I1K3j68R8%j71l0K43k1j83J54r6M4P6o4l50J43J67j13R9M9P7l00K88P8k78
2782a44R3J08j71J44M8q1J51j72J84K1j45J71j94K04k35j36n3K59l3K4j11M4Q2
2805E8k99J25L9j68n3L16J23k98J46l6OL37m01J95j44J70j03K0j88L61l20J52
2827C8L3j16J30k48L13q9j58oJ41Pl34J17J1K3j37J07M53m48K24J64l06k7J72
$$ y = [64, 187, 218, 85, -279, -13, 189, 56, 83, 56, -126, -30, -147, -179, -10, -213, -185, 221, -49, -86, -148, -136, -136, -22, 102, -141, -48, -108, -124, 83, 1, 310, 35, 10, 283, 15, -11, 50, -183, 25, -152, 35, 135, -220, -158, 45, -120, -75, -242, -50, -45, 200, -130, 203, -107, 76, 244, 107, 405, 103, 254, -7, -219, -63, 2, 130, 275, 166, -234, -89, -138, -175, -90, -162, -123, -272, -73, 85, -114, -119, -204, 31, 111, -87, 20, -26, -210, -72, 17, 103, 141, -30, 46, 91, 114, -54, 44, 44, -127, -157, 86, 65, -118, 36, -60, -16, 60, -4, -354, -211, -44, -157, -58, -9, 68, -232, 56, 134, -144, -51, 57, -114, 30, 78, -3, 148, -24, 160, 181, 36, 207, 13, 217, -18, -154, -207, 52, 19, 43, -68, -24, 58, -241, -116, -77, -245, -298, 18, 141, -157, -11, -47, -41, 296, -105, 90, -54, 116, 13, 33, -155, 206, -114, 38, 71, -45, 85, -163, 150, 61, -97, -103, 38, 45, -289, -172, -161, -138, -275, -168, 285, -163, 61, 225, -81, -108, 64]
2850F4K82k17n3L1K02k42k94K2K96k82K39K3j14j86K18m4l9J0%o4l9nL03l56K04
2875d1J2j03J42K43k31J7J00k46M46k43j81R3J88k17rk9J00k51r0K21J02J64l87
2898b00J80P9l1K34k57J52rj74l6K56m56L21n3RK35j14J16k33j54KJ05K22j37
2921E7m1j70J20J37j75J25j39K46j79J64k32M5J44r9J17n4k25J45L3Q3p3K9J76
2944B34m56M60k42J26j14l91N23J39m0l9j76r1R5j22J00j47L35j65j60K08j55
2965g8j4l0j88L13m4J70j36L35l93L26k98n2K36o5j19J88J15j82J19k53J26p5
2987Aj0l7j34RK24q6j4J30k05K35j40N0J61k30p8K41k6l7j50n9L28j30NR8O7J6
3013B29j72m51M95No5J06k24N5r3J61J03l3j23j0j01j54J04K3O1p2K04J74k04
$$ y = [64, 346, 129, 76, 107, 309, 67, -227, -205, 91, -191, 48, 71, -43, -229, -11, -55, -94, -84, -84, -148, -187, -192, 111, -245, -41, -29, -132, 10, 253, 22, 39, 139, -107, 339, 96, -85, 8, 196, -21, -30, -59, 41, -210, -300, -79, 23, 187, -200, -20, 59, 28, 262, 5, 157, 148, -26, -62, 194, -262, 59, 6, 15, 250, 136, 252, 19, -135, -133, -28, 194, 57, 16, -154, -34, 103, -72, 53, -86, 160, -19, 145, -87, -42, 102, 3, 120, 66, -159, -14, 19, 102, 29, 58, 234, -222, 238, -4, 122, 8, -383, 140, 279, 239, 200, 24, -67, 28, -94, 6, -141, 194, 29, -131, 77, -78, -92, -122, -310, 3, -41, 129, -7, 328, -65, 261, -37, -89, 147, 82, -37, 151, 266, 84, 203, -50, 76, 1, -9, -46, -180, -171, 53, -33, -47, 83, -122, 113, -27, 23, 184, -46, -124, 117, 91, 54, -96, -155, 173, 43, 48, 146, 213, 229, 57, -394, 101, 106, 41, 147, -77, -22, -115, 46, 149, 116, -7, -17, -118, -272, -168, -145, -84, -156, 48, 222, 18]
3036A8o7J36J14l05Q9J43r4K0j05j3k8R8K99k29J22m27J94L8k34K27PO1k63Q8
3060a11m6K3J35k4j3q8J46q6K02k6N3j04m6l6J02m9m8J60j03J2K16j67j76K06
3084A32K4l67L69l08Q3R7K05j08j3k6j74k13M89j66j36N3k5J9P3J85o3j54r2O7
3108d9Q2K07m5k51K58j25j30R4j9j56J58k78K32k01K16J7j74J30p6n8K8l0P0L56
3132B56k51K28l70K28p6K16j42j55Q1K09j88OJ60j96K1j03p2K53l04J15l1L4J86
3155A05j26L9j43j59J98N1J82j01k32J48J0K40k76J99Jl16N23k88k43J39M8N2
3177E1j75o4L83o6k42J23L1j32R3r9L9J27l52L12J4K45m04J44K09k51K5J22p8
3200E5k39J75J26q8Q8O2m34J81p5J20k59rK65j08J17K2j62Q7j58J31J36J62q3
$$ y = [18, -49, 87, 201, -104, -15, 128, 34, 54, -51, -64, -92, 6, 305, 76, 198, -229, -35, 3, -231, -4, 3, 64, -199, -111, -157, -134, 1, -23, -36, -124, 22, -64, 138, 112, 165, 61, 15, -21, 81, 32, -16, 144, 41, 53, 269, 102, -74, 132, 156, -211, 158, -150, -67, 30, 235, 127, 114, 88, -86, -299, 190, 24, -112, -59, -84, -65, 8, 193, 130, -24, -116, -49, 33, 240, 195, -56, 202, 77, -53, 41, 22, -134, 24, -254, -22, -223, -7, 10, -164, -34, -110, -168, -140, -170, -100, 256, 5, 233, -137, 91, 15, 231, 89, -66, 15, 224, 36, 42, 202, 6, 27, -76, -148, 105, -199, -84, -115, -81, 105, -21, 18, -125, -284, -86, -35, 147, 46, -186, -38, -28, 212, -64, 135, 136, -180, 343, 55, -188, -49, -1, 51, -124, -188, 195, 129, -113, 10, 41, -91, 2, -97, -58, 69, -283, 29, 43, 288, -116, 28, 237, -14, 11, 133, 55, -184, -9, 117, 29, 117, 179, -255, -74, -149, -29, -288, -297, -32, -140, -23, -1, -163, -76, -234, -103, 33, 195, 112]
3223A12l6P5q6r7J92j29P6%m6O1o5o2j01J06J5J22k86K85j90k45L34j06l1K83
3247A81j95j76K80J30k79J36l3n2K72j89j14NK92k24P5pj97j1J3K03Q6Pr1l00
3271a88K36J67k17k7kl4J2J80L2k18j76J65p5M48l59K05k60k9R8J30P4j25N7j3
3295H1M0j17K61k7l32J65Qq8Q4R8j47j82J06J80J62m44J01J32k28K43l25L75m23
3318b77K9M2O9J93j8k83L81j12j5J37j98J63L8R2j22k90q0K29M1l53K99P2j0l29
3342c02L44j71q0Q6j35K52j83J31j14K72j27J44O5L1k62O1N9q6J42l3j39J65j88
3365f8L05l63J71j1p0J03K7m21O3J23K04j68o4R6J09j3Pl2j2J31j5l2J94k8k56
3390b0o5N8R4l43J90o1k5K78K1k28J03L4j69j46L75k79O1K34j11O4j76J25N8k1
$$ y = [112, 76, 151, 65, -32, 160, 31, 107, 107, 61, 122, 57, -5, -106, 0, 15, 137, -149, 136, -54, -299, 35, -71, -102, 181, -14, -190, 90, 220, -59, 77, 44, -8, 264, 75, -39, -34, 258, 34, 109, 102, -95, -106, -93, 110, 196, 203, 112, -188, 48, 215, -2, -29, -31, -65, -53, 127, 159, -59, -235, -70, -145, 303, -56, 149, -111, -140, -42, 88, 162, 37, 94, 81, 121, 4, 265, 238, -94, 71, 79, -9, 75, 173, 26, -156, -50, 130, 292, -152, -51, 81, -147, 96, -229, 146, -277, -248, -206, -137, 56, 38, -245, 136, 24, 9, 146, -52, 111, 149, 241, 119, -171, -251, -22, 19, -334, -35, 37, 27, -302, 42, -129, -209, -123, -258, -6, -189, -58, -172, 100, -27, 117, 182, 213, -49, 12, 71, -15, 127, 94, -45, 120, -68, 237, -126, 45, 34, -36, 67, 94, -327, -264, -141, 63, -105, -169, -73, 36, 23, 30, -2, -14, 117, 102, 70, 264, 236, -20, -85, -27, 67, -276, -86, -147, -172, 106, 127, -101, 2, 36, -133, -279, 96, -183, -122, 112, 1, 65, -111, 14, 72, 51]
3414E1O5j55q4M26k76J3n3J44j43K28j52J03k8M8o9j06O2k11J40p0J06l70J71
3437a60j14L64n2j53J34P0J96l44J55j71L6K15oj76K9k64L30j78J32l0J75j71
3459A7q5J01pj2j06J9o9m7J04l3j29L57n8j32P4p5Q2N9j05J78J40k83J1p6R5q6
3485f6J14R0j10Q7r9M4K17j98j08N5j14J20j08K46m47K75j76o3L04l07J51j99
3507b92J53O8P9qJ29J96n26Q2L2K46j04R2j38j47n5J98j61m9J14J28m0r6n5l7
3531a91J05k64L76N5k65p6J79j62N00m59J32J02P8R9l70N8P7K1J67j78L28p4k44
3554fQ9M7j94J3J18r4R3j53jL7j5k21L18r4J13r4q0Q8K09k04K75j49k78J70j93
3579b06K41k23J46K87l18L48k94O4lk7O0j73j45L57l35K5J49J75M7l26K02j06
$$ y = [51, 116, -39, -123, 303, 27, 40, -13, 131, -12, 216, 64, 167, 139, 187, 118, 12, 74, -137, 3, -67, 39, -331, -160, -274, 90, 38, -115, 19, 89, 285, -59, 96, -75, -39, 176, 170, -6, 23, -241, 89, -89, 43, 13, 188, 17, -68, 33, 26, 14, -92, -73, -142, -189, -85, -118, -247, 110, 52, -80, -6, -81, 1, 60, -45, 133, 273, -10, 1, -75, 20, -66, 48, 138, 28, 115, 16, 60, 277, 79, -29, 26, -88, 32, -76, 170, -277, -2, -178, -241, 63, -244, -93, -292, -139, -71, 8, 0, 129, 325, -201, -119, -87, 159, 55, 147, 9, -138, -193, 5, -156, -205, -91, 37, -3, -99, -154, -191, -86, -350, 26, 81, -184, -260, -81, -243, 257, -202, -70, 32, 110, 209, -161, -103, -26, -5, 162, -16, 312, 238, -6, 83, 130, -64, -51, 67, -27, 66, -87, -88, -51, -66, -287, 31, -63, 50, -44, -124, -36, 173, -31, 244, 95, -183, -13, -206, 35, -188, -42, 245, -73, 275, -19, 45, 42, 15, 75, -98, -243, 114, -221, -196, -47, 128, 175, -151, 51, -55]
3601e5R2q9K65l09%K34J2j22J6j09J79L5l74m2K45J48J5r5p5l89K46n8J94j38
3625a74oJ89j63J76n0L9p1P7N1q0N3mk01J95L13l36P4K1P0k66N0N7j04rj8j05
3651b22K34J69j56R3j66P4%O0j04k13L6J47K7J55j71Q7K0p6K3K4m5J65j31j58
3675a28K37pJ30L1j71J25l11J4R8O8l91K11R4O7j93p2J38K1j25N5N3R9j06qJ65
3700I4M6N6j88k9k4K41j93R0O4P9j3pj08j59J76n9m0mK23j14j88k8Q8k3j9o4L17
3727B14j56J44k39J22J4j80K57LJ19m33L62j30oj68Q7J6J5J15k54M0m4L7J33M9
3751A17j24j97J51J22k53M37l82K02p1j14j37K55j1j5j46K81k2Lj7m29K86Nj12
3774a71J42K7k5k09L41p5m9K18j77j86K19lj34J10k4j60J66l9j57j9M74k89j23
$$ y = [-55, 37, -52, 213, -96, -96, 138, 150, 28, 44, -65, 114, 149, -225, -267, -22, 126, 141, 46, -29, -418, -172, -230, -36, -174, -180, 9, -154, 22, -28, 11, -60, 17, 68, -12, 41, 37, -164, 31, 344, 8, 82, 103, 173, -93, -43, 14, -90, -99, -117, -222, 12, 181, 25, 118, -48, 26, 26, 86, -18, -231, -195, -48, -21, 134, -37, 50, 70, -6, 17, 41, -4, 161, 30, -128, 109, 102, 232, 263, 92, 217, -94, -80, 18, 86, -305, -94, 0, 67, -126, -198, -60, -39, -164, -109, -56, 43, -63, -71, 94, 140, 196, 8, -21, -45, 196, 3, 93, 157, 236, 223, 216, 108, -51, 125, 66, 26, 22, 245, 131, -57, -85, 3, -20, -39, -103, 214, 58, 202, -37, 85, 99, -81, 176, 179, 298, -135, 227, 97, 91, -77, 10, 26, 41, 156, -98, -58, -102, -65, 68, 117, -7, -204, -53, 69, -184, 253, -129, 73, 2, -112, -249, 6, -5, -20, -166, 115, 93, 96, 79, -350, -64, -59, -171, -29, -2, -27, -236, 105, 30, -19, 199, 22, -164, 55, 52, -82, 28, 4, -156, 10, -29, -186, -205, 269, -20, -143]
3797a43M09j55l00J22J96j05Lp2K99l77K00j34M5n4j76K72O4k32mn1r3J6K36m5
3821g9oK58j64R8k37O4K29k75J6J05j50J11K58j22MK3J70l14J95j58j93n3J12
3844a08J44j28K9Q8r7j1O0K12p9l96L75O5j26k49J34J49m0k46M28Oj20k11K12
3867I1j42m7M0j22J00l1%O6J87k02j02o6J49J16j53J4J82J1n9k16L63k39J76j13
3891CN0K22k23m9Q7j08j22J47K83q3l79K27P2K09k06j15j22p4J35j0R9M5k1k61
3915a94J95n2J09L7j70K7O0Q5m5jJ1j55J84J01k69J85k82K34P6Mo2J0l05J6J35
3940f6K8q2j70J25J07K92j57j5n5K47j20J08k22m8j71L28R5oj07K27l7l67j06
3963a72N9j62L23J74j68r7j02j30J86K55J11l21J79m13K22J17M9k94K10K10l44
$$ y = [-143, 266, 111, -189, -67, 129, 24, 27, -45, 254, -123, 77, -57, -12, -66, -242, 30, 94, -138, -142, -193, -286, -270, -34, -79, -85, 173, 9, 107, -130, -66, 163, -112, -96, 9, -141, -30, 228, 106, 110, 133, 303, -11, 184, 26, -167, -220, -108, 36, -92, -63, 25, -72, -83, -23, 189, 110, -286, 89, 154, 28, -221, -87, 62, 22, -224, 204, 210, 90, -121, 91, -51, -98, -58, -180, -80, -111, -111, -45, 142, -60, -162, -228, -79, 37, -116, -102, 80, 91, 32, -184, 179, -60, 116, 3, 53, 275, 52, 3, 90, -18, -140, 7, 290, 207, -172, 55, 127, 336, 130, 15, -107, -181, -46, -56, 43, 88, 67, -194, 1, -51, 58, 95, -75, -48, 12, 97, 52, 51, 62, -93, 91, 192, -77, 108, -174, 60, 136, 140, 78, 88, -217, -201, -66, -38, -120, -290, -165, -58, 234, 77, 62, 7, 254, 134, 242, 20, -28, -199, 129, 224, 218, 111, 338, 301, -66, -172, -113, -275, 48, 222, 54, -43, -145, -275, -89, 166, 277, -44, 135, -278, -56, 61, 110, -184, 26, 236, -108]
3984a08J6J33L1k63O63m97k7J95j2n2J10k06K50l40J61k6J90l33O8j58J62J46
4006A03j84p1J25Q6j50J13m3o0K46k45L27k06q3m0J1J58q7r6J88J46r6k05J91
4029A28k21L74k95QK28l35j8r5L68j49K28k15P6k84J39j58K58L3k73J88K16k30
4051b9m7K49j15Jk7J59j09lk11P2J04k57L69j81J36j22p1J33n0l07K43j34q4L25
4075D4K0j02m6J22p9L1p6J77O4j38J62J07m17J84o6L7Q1j13J62k17j05J76k70
4098b62J42k4M42j63o3j48j90L34J8j04j10n1j4J85M10j62k50O3R1O2j27p0K6
4121C5k47J93p7J13Q9k59J5k3Q7o9j58K77n6J94l06L00o9J05Nm94L81j13R2J55
4145A70K53l92j0R5m7mN6Ml9m0l03J22K85l23Q8p3K77M2k92M7Q4L1j52rK5J93
$$ y = [-108, -92, 41, 72, -191, 472, -25, -52, 143, 131, 79, 189, -17, 233, -107, 54, 28, 218, -115, -47, -205, -43, 103, -81, -152, -27, 59, -91, 22, -21, -81, 165, -80, 247, 41, -42, -82, -71, 87, 0, -96, 92, 238, 142, -63, 128, -93, 281, -14, -6, 222, -113, -131, -226, 142, -7, 221, 6, 82, -202, -63, -221, 37, 70, -203, -15, 201, -29, -76, 173, 58, 59, 32, 191, 82, 79, -132, -60, 44, -213, 156, -25, 111, -11, -82, 51, 1, -306, -63, -197, -281, 44, 64, -38, -84, 38, -41, -10, -86, 91, 155, 17, 179, 286, -131, 53, -13, 24, 105, -8, 154, -63, -168, 8, -262, -120, -144, 298, 135, 72, -76, -266, 68, 86, -18, -128, -179, -193, -8, 402, 240, -10, 53, 144, 206, 79, 9, 35, -212, -19, -96, 17, 106, -153, -138, -161, -74, -143, -301, -24, -80, 114, -192, 108, 39, 144, 149, -345, 36, -77, 15, 170, 423, 31, 21, 116, 69, 65, 121, 125, 86, 46, -257, -135, 150, -173, -85, -158, 119, 161, -131, -84, 0, 31, -121, -130, -105, 88]
4171H8n6k8oq0Q7J04m2j8J20k31K02j36n9l6K71k01n4J22N5l2Nj04L9J34k97L43
4197A90k62J22l09M18k35j1J75q0n9OM10l23Q6j65p1K91l87J75N0P0p3P2k50K10
4221E0J44l86K59J52j31k17J52J00J1k32k0J21J05j36l9K25l03Q2J68r7J89j76
4243B1o3m9J57J09j08q1j56J79K59j54l51J59q9k01L61j26J12r7p9K52j17pj0
4266g9J81j63J01j1j14k2J99J20j82K45q7n0j20K62j87ko0J01j54j72J8J15R9
4289C8p1j36J26K02m0k08J47K3p9o9l5KJ35L5N7j52j54L65J4p1j98o3K8J93l83
4314b94J83J43P2M2l0k13Q2k8KJ56p7K4p9Q9j01j16J84j73J43j53L73k00J84n9
4338A54j47j10Q2pJ78j31J44l52Q5L6M3J07k32R8J20J21j18K53m42K91m32L20
$$ y = [88, 32, 4, -2, -82, 5, 109, 67, 49, 169, -62, 140, 4, -55, -91, 180, -21, -75, 47, 102, 70, 75, -29, 10, 144, -153, 190, -72, 50, -259, 159, -76, -87, 88, 8, -51, -45, 365, 42, 128, -37, -108, 183, -204, -29, 21, 91, 18, 90, -160, 50, 194, -192, 67, 219, 88, -129, 23, 123, 134, -98, -118, 3, 108, -28, -67, 158, -145, -63, 105, 8, 197, 21, -42, -91, 66, 175, 67, -14, -170, 9, 268, 114, -237, -78, -167, -368, -7, -133, -21, -118, -197, 55, -62, -69, -79, 102, -61, 40, 29, -85, -107, 92, 212, 30, 275, 188, 138, 18, 280, 93, 91, 31, 132, -22, -194, -176, -61, 38, -33, -169, -43, 159, 119, -89, 58, 81, 2, -67, -102, -100, 35, 70, 127, -25, -179, 186, 200, 129, -69, -132, -104, 89, -294, -111, 32, 104, 146, 116, -97, -15, -43, -41, 115, 38, 62, -17, 72, -29, -145, 39, -134, 9, -144, 229, 29, 213, 154, 7, -103, -21, -28, 150, 19, 163, -189, -104, -68, -25, 82, -150, -52, 68, 189, 71, 324, -118, 173, -259, 61]
4360F1k7Q3L4k31pP5K73l44P5J48ql46L12l3j7mk20J76j79K3m3L51k71K70j22
4385B9J06J5o6k85J14J46k83P7N8j31J70J87l44N9K09O3l20L21ok14OK41j84j75
4409b07L72j16J06l00R2L5j35O9P7J19k53n9M1Q2j51L27j5QP7l55K74Q1k1K5j6
4434A57j21j24R4m3l7rJ6K43l56L28l08K3j06l0J20N8J35j37n7M5m1M9J64j97
4458a34L45k19j16j09L20q8o9R5j16P0K2K09l9j36J38m2k61K97k02r7j20R6R9
4481e7J92Rm7j44n2Q8l7J13Q2j57q4Q4j0M4J90j80P0o8k33L78j58j5J03J06m12
4506a95K05J26j39KP0k15N9K21k9l39J85p0j11K00r6J7P7J97o2k58n6K94n2k9
4530Bp8J58n3j8J06m5j89J5q1J72n3J48Q0k44k4O8l42K48k6J89l25J12J91l4J47
$$ y = [61, 34, 117, 151, -80, -87, -12, 261, -83, -8, 140, 132, -214, 98, 65, 48, 44, -176, 0, -179, -156, -199, 152, -119, 151, 29, 135, 150, 84, -201, -87, 59, -224, -147, -89, -220, -50, 137, -207, -148, 61, 124, -196, 125, 119, -95, -89, 152, -32, -207, 165, 49, 155, -145, -53, -18, -153, -84, -7, 112, -141, -200, -159, -77, -228, 99, 84, 92, 169, -186, 88, 169, 148, 173, 157, 36, -88, 6, -37, -74, -83, -67, 176, -180, 148, -160, -137, -243, -273, -153, -95, 40, -97, -154, -109, -150, -101, 63, -134, 211, -8, -124, -233, 87, -1, -70, 25, -91, -21, 1, 210, 171, 35, 173, 131, -130, 167, -35, -132, -252, -156, -57, 135, 144, 97, -47, -99, -11, -48, 65, 147, -10, -94, -10, -20, 24, 214, 34, 104, 36, -197, 181, 23, 8, 111, 217, -195, 10, 136, -3, -1, 69, -146, -87, 134, 105, -234, -49, -119, -230, -30, -126, -109, -32, 165, 103, -155, -211, 83, 31, 2, -76, 82, 29, 11, 117, 72, -117, -102, -183, -11, -64, 84, 164, -80, -104, -36, -378, -130, -156, 33, -292, -180, 11, -23, 124]
4555A24k36L05j32pK06j55j07Q9j75k6J54K0p0O9L3l86Q6J91l7k5n3M51o27J81
4579a27M5o2J74m7J5j55M3K63j60K75j22j77n2P6o5j15j4N83m31r3n8L81k74M4
4603e3J4L6Q6k01N5K26j17k87J12J92qP8l52L82P9k30M7O1j11R2Nj60pK8Q2O1
4629A10o7l53oK86O6j16R2M1j15k6J07M9m63M19l49K24J31j13j8J30j74j07K89
4652C7J30l17M22j81r7K15k17J57j49l8Q0j69j7lj05K69J55j12L2p6j66P1j17
4675a96J15L78j16l09N5k62M25j31K50n5k65J7J89r6Oj39J48J29l32O1L51m19
4697a96L13q4L02m0l99Q9O5k4K1j29Q6K57m10N74j87k02R4l20L17p1kp9q1J60
4721E4l8j37J69J41m02J9K37l7j72M48j01m47J98j87O0L10j95L2j90K07J92J36
$$ y = [124, -112, 193, 61, 54, 260, 105, -2, 87, -88, -114, 40, 60, -10, 59, 92, -294, -208, -17, -54, -79, -132, 319, -308, -127, -82, -144, 30, -17, -2, -157, -114, 149, -11, 264, 142, -35, -87, -11, -76, -191, -205, 378, -53, -146, -204, 177, -97, -53, -39, -3, 83, -118, -63, 163, 46, -241, -129, 63, 55, 133, -219, 163, 242, 12, 59, 120, 9, 101, 106, -54, -61, -33, 49, 110, 43, -310, -316, -30, 36, -80, 12, 53, -62, -88, 19, 68, -395, 24, -325, -101, 30, -83, -101, 29, -145, -252, 37, 167, -150, 272, 91, -6, 209, -8, 149, 0, -38, 42, -127, -144, -147, -252, 17, 172, 60, 92, 16, -150, -79, -196, -81, 297, 181, -128, -73, -335, 90, -41, 209, 154, -111, -94, 95, -1, 5, -134, 14, 143, -189, -128, 223, -196, 117, 33, 335, 295, -104, -15, 50, 26, 47, -82, 4, 261, -149, 425, 238, 36, 130, -190, 127, 56, 54, -25, -106, 54, 16, -121, 48, 189, -213, -194, 43, 6, -166, 282, 181, -266, -68, -255, -195, 115, -80, -48, -238, -31, 161, 297]
4743B97m81J31J1Lk3J68j53K05k33K36k66K39o5l50L30q6J28j61J07j53J72m19
4765c63K51lO8L4r0J62j22o4j33M19j90n9J11K08l05K42j36P5k8K4j64K81m72
4788b54L07M1l68J9L06K7J5j89K2M2M3Q0k78j1J52PK19j07mJ42k25p7J30n5Q7
4813G1p5n4K69j23K5P8r6j94J3r2J1K06p8P9P3k95K6Q1J60q0K1M87l58k51K04
4838A08N7k13K06k77J36q0L9K94l64j30L2J2J96M1k20N2j05L85k93O8r5J40K16
4861B05n0Q4k74J3j19k0K62N7J0k89J99p4J95l38J88J60k68N0j25K96l3q9N7Q7
4885A84k09k5l7L08k82j71K30j61P4J52j38R9o6q9K51k16J10M0l4j01L4M1L6R0
4909A20qn3Nj72J58n3q3J39O8n2k55J75J01k55J77K19k41J27j62Q0j48N2J53j62
$$ y = [297, -184, -53, -42, -39, -62, 106, -47, 158, -75, 161, -105, 134, 69, -281, 49, -37, 91, -70, 37, -116, 56, -363, -112, -115, -47, -13, -103, 59, -63, -127, -260, 159, -31, -90, 21, 229, -76, 166, 30, 105, 77, 101, -63, 218, -254, 53, 94, -274, -255, 51, 78, 93, -96, -74, -32, 11, 91, -187, -198, -46, -39, 180, 73, 69, 211, -14, -91, 39, -16, 71, -4, -58, 211, 88, 113, 191, 95, -99, -86, -178, -167, 39, -39, 40, 113, -182, -156, -75, 85, 5, 26, 513, 155, -96, 108, 165, -48, 158, -119, 17, -63, -24, 270, -94, -224, -192, -180, 16, 57, -163, -111, -216, 169, -124, -56, -151, -11, 205, 155, 239, -35, -22, -141, -161, 101, 158, 168, -121, 78, 4, 199, -139, 49, 209, -59, -9, -134, 162, 129, 40, 97, 184, -25, -50, -87, 221, -61, -232, -2, -163, -89, 63, -75, 24, -42, -131, 120, -96, 14, 54, 20, -81, -47, -6, 30, 120, 112, 59, 64, -108, 50, -3, -86, 53, 121, 69, -186, -11, 90, -165, 12, 231, -10, 117, -45, 35, -113, -61, 92, -70]
4933g0Q6k12K16N4k67J28J82k7q7KJ38M3k45K94m09J13M1K1j90J03J80N9j58k1
4957b6j88L44L0k40K20j77O3J65j90J30R1j17J79n51K12m6M5K67k09n1Q5J6k0
4980C2Q9o8k41k6K56p1j61R6M2o7J81j88L46j81j02J62j3p7J91j95k7J05n0k30
5004a97oK21K40l50N1M4n0m3p1K75k91K71ok26K09J03l90M79l83m3K66j99J98
5027A02j38q7K67Pl51J71J51k55Q2K21k9j19l08L44j12k29K62J54K3p0j04j13
5049a31q5K34j83L44j56K6l2j17K9L80o4j53pJ58p6J68k47j26j40K09P3k9Q3k20
5073f2L03K1m31J78l1k40J36J40K7j48J63l1O3k08N8J45q5N7j7k28K34l9O1J03
5097A69k93K46O7j53p1K00j06j56K47j3Q2k23o0j09J20K12l02J40k2J82n11K27
$$ y = [-70, 16, -196, 20, 74, -193, -65, 117, 90, 3, 5, 143, 186, -59, 235, -174, -61, -20, 1, -189, -86, 94, 153, -5, -26, -214, 130, 160, -80, 140, -37, 26, 191, 1, 131, 222, 105, 284, -267, -55, -101, -56, 211, 2, -49, 36, 52, 32, 121, 53, -188, -214, 42, -29, -190, -94, -52, -119, 62, -126, 220, 39, -63, 99, 86, 9, 200, 5, -22, 83, 33, -197, -203, 18, 258, -92, -41, 3, -47, -90, -161, 114, -177, 94, 88, -138, 71, 174, -216, 263, -120, -163, 103, -96, 102, -36, -123, 144, 151, -200, -29, 122, -133, -51, 170, 141, 22, -286, 58, -54, -283, -21, 133, 156, 86, -18, -131, -216, 18, -165, 179, 23, 49, 17, -100, -71, 309, 245, 92, 85, 243, 167, 335, 88, -38, -178, 31, 104, 75, 158, -62, 241, 262, -169, 9, -22, -262, -126, 14, 41, -107, 56, 25, 88, -120, -62, 83, -2, 55, 38, -190, 44, 5, 66, 169, -124, 122, 189, 36, -35, 165, 59, -97, 150, 137, 219, -4, -64, -173, -53, 159, -143, -3, -25, 157, -354, -127]
5119a27O4K25k1k87J71Q4mP2k59J17R2j70L4l9J3o1J81J91k98J10m2j03L5o3k48
5144c33L89o0j25J32KL0j56m1L7K02J86L9r5l22J50p8J90j2L1m0j51M4j23J27
5168B3j21K25k26P2m3J04j66J25Q2l3k58J08j05K99K1l05K91o4p6J08K07m05K56
5191A19j60J36j91J74Rm9N5k52J17j26K25l07J67j81J09J82L4J4k53K67k9j9r9
5214e8J32r1L25k53qN3q5J02n5R3k95J52J31o8j65L2R4n1nO1j26J15Jj22J69K3
5240A01j74L26j64J6j25M5j58L9J28j65K04j01K48l39K97K6p6o2n1k31K65m1k55
5263b47K50P3k53K77N2k6ok52R2k7q8L2k0L54k16j73J30J73k12K12l1j49Q8J77
5287B10l57N3L10k29Q3q5j1M9K3m8l2k3L7R4p7R0k48m1J36J91j78n1Q6j14K91
$$ y = [-127, -63, 162, 141, -146, 25, 109, 105, 177, -82, 35, 127, -43, -9, -48, -35, -96, 85, 276, -22, 88, 46, -57, -22, -85, -333, 56, -4, -129, 3, 5, 35, -121, -162, -125, 77, 263, 302, 207, -115, 35, -43, 147, 135, 166, 126, -25, 19, -104, 23, -98, 127, -99, -27, -70, 34, -132, -7, 75, 42, -216, -108, -213, 86, 107, -198, 93, 29, -47, 61, 268, -137, 119, -41, 95, -96, 78, 87, 38, 93, -159, -42, -168, 57, -250, -83, -264, -155, 27, 61, 75, -178, 89, 60, 41, -58, 74, -17, 308, 55, 47, 100, 15, 117, 62, 155, -140, 12, 143, 75, -90, -58, 36, -15, -20, 41, -85, 30, 31, -91, 78, 101, -73, 253, 89, 105, -20, 25, -133, -94, 34, -131, 73, -28, 220, -119, 178, 204, 128, 66, 15, -216, 49, 8, -247, 3, 76, -177, 100, 152, 126, 120, -132, -40, -67, -155, -123, -143, 211, -5, -178, -48, 125, -87, 125, 94, -55, 33, 210, -147, -94, 216, -13, 70, -15, -26, 23, 46, -2, -34, -57, -20, 74, -3, 87, -161, -202, -66, 125, -53, -104, -18, -132, 159]
5312A59j9Nj70no2J94j24M4J7o3K2m11L70J1l9L1N6J3o2K19j58J07j08n7P2L9
5338H1O1k57l3P8K13l03K49L2k18O4J50j34lk4P8qK7K7k21pJ29p7k27M87k11j6
5364f3J37k83O3J40l68K73r8L88j50m8J65j77J44j52J34j68Q7o1o8J60r5J87K00
5387C47k37n3q5J09o8K5k79K60qK39k04Rj36j49J30L31m66K00J16k18j4K32j4
5410F7Q9J38r3l0j32n0r1K26j46LJ42j48j33N1J63n0j56K8L0K22k09k8l7J39j09
5435a14Q8J90k9J03j16O5k8m2N2k08k6K70j39j80j6J32j52J40J4k96J60L11j37
5458D2l59K90L5p6k5J41l83M27j40P7m1P5k63L13q1n6K86l55j08M28k95J34o6
5481@J0j22O1n5j18K50j20Q3L06k82Jq2J88J24l44L8J53l1J15q7q3p4K00j74M4
$$ y = [159, 140, 145, -25, -30, -92, 102, -22, 22, 39, -24, -2, -413, -43, -32, -71, -40, 16, 29, -33, 186, 28, 135, 27, -30, 42, 81, 142, -115, -148, -70, 143, -160, 89, 121, -97, -33, 117, -17, -20, -44, 34, 26, 53, 80, -141, -148, -19, -96, -323, 164, -47, -63, 74, -209, -146, -6, -374, -101, -199, 189, 39, -9, 156, -21, 123, -29, 105, -63, 24, -37, -105, 55, -40, 147, 347, 110, 57, -28, 81, 13, 38, -241, 19, 11, 250, 46, 55, -81, -230, -100, 231, -235, -35, 81, -137, -151, 81, 67, 156, 294, 201, 171, 39, -11, -102, 124, -22, -19, 123, -25, -158, -107, 56, 6, -150, -122, -92, 130, -79, -107, -144, -5, -114, -26, 164, 135, 238, 122, 187, 159, 117, 169, -39, -65, 205, 66, -114, -130, 2, -150, -10, 4, -292, -132, 179, 42, -317, -27, 8, -68, -93, 48, -335, 92, -48, 29, -12, 63, -200, 113, 32, -24, 262, -93, -201, 227, -68, 66, 0, 10, -112, -51, -106, -224, 26, -94, -11, 295, 13, 14, -68, 120, 244, -100, -62, 91, 60, 175, 88, 5, -69, 131, -43, 1]
5506AJ87qj62n5j33J63q3L8k10J85M5O8j66J32j01J53J76m50K70k81L52k04O4
5529a9j23K43J53j46n9j38J28l5J51J4k7k14%K07n5J92l09k6J66j33J26j6n1j44
5553a15O4K27O9l02R8j08j51R0j54K96qK7J82N5j34n9j09L6n5K88k99J40P1l74
5577b25J31q4J39j51L00l71J41j20K2P7K63r1j8Q5r6j30j2K45J8J8J62j34q6l5
5601D8o2M8J33l9l40J24J83k31N2N0qk88N02j76k06J9L98l03K0K21l35J84Q0j1
5625F3k62J68O4m2nr7K44j87L12j61j02j43J87K8j50m9K90m4J8j41o5N2k46P0
5649a98O1J27J27l22L29K64m39J11k50K04RJ7j57J83q0J55k93K7J49l85K19N5
5671h7K54k83K63l10M46j93j31J22k20O1K13j54q9P1O1n5M2O1ML5k00J08J39P3
$$ y = [1, 188, 180, 18, -37, -170, -7, -90, -52, -262, -77, -32, 36, -130, 2, -99, 54, 230, -220, 50, -231, 121, -83, -19, -142, 101, 254, 108, 49, -89, 39, 4, 155, 169, 142, -72, -72, 135, 80, 272, -37, -63, 103, -30, 96, 80, 29, -115, -51, 176, 245, -57, 41, -67, -218, -128, -282, 14, 6, 33, 215, 270, 136, 77, -32, 4, -51, 237, -62, 78, 149, -225, -94, -178, -39, -190, 110, -261, -120, -240, -218, -141, 122, 31, 13, 98, 2, -128, -140, 105, 123, 141, 303, 169, 83, 48, -14, 34, 167, 128, -212, -88, 95, -136, -84, -34, -42, -330, 172, -4, -210, -191, 207, -96, -76, 145, -190, -6, 74, 63, -199, -31, 33, -9, -14, -111, 133, -54, 258, 97, -5, -148, 39, 67, -83, -132, 158, 114, 132, -9, -74, -22, -268, -198, -137, -10, 117, -205, 124, 388, -51, 60, -190, 14, 23, 40, -117, 66, -14, 141, -152, -125, 24, -361, -142, -87, 167, -116, 147, -163, 283, 90, -41, 81, -139, -78, 135, -19, -108, -37, 24, -31, 11, 72, 76, 111, -89, 19, 158, 231]
5695B31k28Q6m68N73k0m2k59q8L62k54K83j45n4R3o1j35K37r9K13r9j1J51l59
5718i3k9J12%L0l85J15K96k96K89k25J95nJ10l7j46J09o5J08k27o9L53pk45K19
5742A07k46j80N06j56j12j29J29rQ3J92j68q8j0L31k6k83r1L86l39J48J75k66
5764d6J4Kp2J07J15j49ROO3m1j16J04o7N7r7J44M7J49k13k1K13P8j95j02J02j0
5790H1o2P3J63L1l81Q3M6l6Oj44J01K81l07M3o1o8K88l02Q1r6L8P9J98j44j3K0
5816bJ76n01M90k19j12J52K6j40L55j90j64L06j27k08j25M13j19k44J1K27L0J10
5838A45l13j15K08L3o1P5k2O0j04J71j2Pk14M3K80l08L5j1L93k73j70P7j13M2
5862a47J90J77j78k1k26J09o2J65lk25o5L48j51K95l47J93k78M0K97q3P1j98J34
$$ y = [231, 3, 89, -379, 194, 174, 132, -127, -215, 147, -107, 176, 31, -23, 70, 9, -126, 111, 12, 225, 126, 115, 266, -93, -122, -10, -10, 20, -365, -250, 46, -250, 39, -186, 9, 4, 114, 77, -69, 40, -25, 83, -144, -213, 140, 133, -112, 107, -139, -319, 187, 31, -81, -210, -81, -90, -7, 185, 17, -71, -81, 250, 224, -59, -150, 236, -103, 45, 220, -46, -32, -30, -102, 5, 120, -29, -20, -14, 49, 8, -108, -4, -71, -14, -111, 33, 80, 229, 16, -5, 208, 286, 91, -11, 91, 81, 19, 92, 255, 286, -95, -12, 34, -2, 4, -140, -39, 242, -65, -22, -83, -151, 137, -165, -84, -180, -142, -63, 135, -9, -22, -2, 174, -327, 163, -56, -168, -16, 10, -130, 225, 35, -129, 177, 50, -158, -283, 130, 11, -233, -222, 5, 35, 145, -168, -283, -75, -42, -103, -28, -50, 10, -94, 77, 65, 72, -142, -99, 181, -127, -92, -103, 290, 17, -153, -76, -189, -147, 43, 220, 42, 21, -205, -96, -158, 7, 4, -221, -286, 62, -89, 206, -141, 52, -226, -186, 111, 28, 99, -99, 35]
5885C5O1j4N3O1j32j57N3J76m44J79L39k97K67l46J23N4Q1j93j02J7L09rk34K09
5909H9j71J53k29K70pn15L59J13j15R3K3Q7j83j09J51n4L63q2k34J7Pq7L39l66
5933h8J20m2o6J90j58m1K33j95j97L01J32k68N6J10mq1l0K12j01Mk25J65p1j42
5957a86K41k85K94%j6J7jL6j94JN8q2J18L20l61j02K07J4j89K6K96m4J9l77K78
5982H8j20J04J3k32K10rj42j13P6Q2j38K1kNL05k19q4J03J77J4l70O9K9K21o2
6007B6K00m6k43L29l78J58J27m26K22j8nK75k67O2J55k41K26J2j14k45n9K83m1
6030hq4J67j50N9K7J9J1j31Q4k07J64J9J25j8O2l7j14J68k41J94p8J44k90R4j9
6055d0M0m8l6J50r7k1Q6k39M11j66O5q5j14mK42k99K81j60J60k05K07l90L72m91
$$ y = [35, 96, 82, 135, 196, 64, -93, -40, 136, -308, -129, 210, -87, 180, -166, -43, 11, 92, -101, -203, -186, 123, 114, -120, 89, -82, 71, -158, 112, 105, -410, -51, 62, -53, 40, 63, 150, -33, -142, 9, -45, 318, 236, 2, 19, 26, -61, 278, -88, 32, -10, -76, 114, -44, -85, 148, -47, -244, 57, 189, -79, -23, 87, 83, 2, -28, 184, 83, 87, -138, 27, -44, -186, 55, -230, 64, 64, 48, 65, 64, 100, -94, -93, -35, -117, 1, 321, -40, -142, 65, 79, -110, -84, 212, 168, 187, -190, 88, -32, 72, 85, -147, 63, 54, -88, -201, -125, -43, -181, -160, -162, -157, 148, -71, -155, -52, 125, 139, -231, -162, -133, 88, 26, 226, 180, -63, 266, -112, 46, 173, -253, -31, -49, -54, 221, -46, 16, 171, -70, 156, 168, 54, -191, -250, 33, -8, -92, 75, -75, -16, 11, 30, 41, -90, -6, -213, -49, -30, 95, 77, 139, 102, -12, 156, -85, 109, 31, 175, -115, -21, -40, 0, -48, -84, 66, -31, -52, 34, -205, 206, 40, 105, 20, -94, -98, 144, -155, 126, -34, 126, -79, 128, -262, 110, -381]
6079c81L31L8j69K31m8j95k8M25k14K3j48J78j2k01M8M8Q0K02k4l38J91L3n6J42
6103A56J06k93J01o6j10M31p6r1k67K42j07K33p4l60k61K40J97N1j74J33K82m80
6125a87Q1P3k0K7jP7n9k32M65l52P4M9j07K0J51R1j47P0J72l79J86k78J47rq2
6150a70K13j82J30j17PP6k5k5m7j68J06L26k4l9L15l16n6K26j83O7k02Q5P2J5
6174H4j03P8o2J16r7j03R9j1RQ4k7l5L1P8j78k73L99R0k96M7J09q1k9r1K77%k97
6201a82J90q4O7J6p0K41n5j16qK58j97l6j11Q7J16l64J76n4K06Qm5J41k89n6K79
6226A18q5r5j15M88j96j82r5M93m59K39P8k31Rj32K81J01j28k9j03M2k00K72j72
6249a01K03j59J13j07J03j00m8K99K6k07J35n7J87l38J33j23O8K9k35L37n20J01
$$ y = [-381, -50, -12, -181, 50, 2, -193, -221, 204, -10, 13, -135, 43, 31, -170, -122, -74, 6, 208, 184, -154, 37, 70, 14, 156, 262, -31, 70, 4, -106, 325, 249, 158, -109, 133, 26, 259, 185, -175, -436, -196, 1, 52, -122, 11, 293, -187, -106, -33, -53, -26, -27, 50, -9, -241, 224, -128, -54, -5, -112, -92, 59, 150, 3, 73, 245, -134, 52, -226, -79, -88, -170, 43, -139, -9, -126, -119, -43, -68, -93, -140, -308, -202, 124, 100, 61, 376, 60, 4, 230, 47, 114, -88, -3, 69, 84, -19, 59, -3, 113, 16, -87, 12, 1, 10, 94, 67, 32, 63, 141, -37, -310, 89, 179, -117, -70, 39, -42, -71, -162, 115, 115, -182, 8, -76, -9, 7, -63, 178, 123, 7, -1, 257, 60, 24, -87, 0, 116, -248, -72, -126, 80, 88, 43, 184, -105, -161, 118, 33, -62, -177, 311, 115, -67, -162, 331, -128, 111, 189, -42, -33, -165, 116, 217, 89, 60, -43, -1, -201, 71, -101, 102, -57, 56, -51, 52, -48, -96, 203, 229, 22, 157, 100, 287, -51, 82, -41, 27, 56, -179, 158, -362, -261]
6271b61M2J50p2q4L95K5k83O5J43l19M24k26K0j95J66q0K06k15O7J58j29j42Q9
6294e6K20L3R0j66k60J65j19N4j3j23j1K14K08k47j56J54rj02K72k64kN8Q2l02
6318b80M81j65o8r8J97j67L49k88m7j2N2L4J50j18k68N93k60k8q3j0j47J58P3
6341D8QJ09k88k2m1J27O0k30J75N2Q3j53J64M6o0K87m03J18j54J34L3j46J60N4
6365A61j55r4K49k42j78N20l97K30k91K15Q7j2k49K6K72L2k03J1m5J14p9m2Q3
6388A3K15N0k13l22P3K83j78J69k17p9R5J49M9k91L21Nk59K88j71J46j39jJ63
6411A49j32O5K3k9N1k23%r9K46J67J44l99p6J41J16j48m2N5L7j01K9k5l6k12K56
6436d3J08l6j28j9M9J02P4r3j10J02m2L0m8J79j70m6L4q2J54l3m5J8P6K53l93
$$ y = [-261, -219, -69, -141, -225, 170, 195, -88, -23, 120, -199, 225, -1, 19, -176, -10, -90, 116, -99, -32, 126, -3, -145, -56, 164, 197, 287, 121, -139, 26, -93, -39, -52, -175, -186, 28, 236, -11, -167, -13, -22, -124, 148, -116, -118, -60, 22, -280, 201, 36, -32, -130, 67, -100, 249, -39, -86, -98, -46, -12, 138, 20, -248, 345, 85, 57, -26, -36, -183, -25, 48, 56, 165, -123, -145, -186, -59, 1, -229, -54, -2, 81, -72, 92, 138, 78, 365, -38, 80, -74, 60, 93, -53, 107, 161, 6, -88, 161, -81, -259, 261, -136, 94, -197, 18, 105, 93, -156, -130, 142, 174, -29, -18, -63, 51, -28, -70, 13, 228, 278, 65, -257, -184, 99, -79, 90, -127, -206, -111, 38, 87, -204, 117, 122, -137, 151, -20, 126, -13, -14, 149, 17, 82, 105, 76, 127, -96, -96, -195, 51, 218, 362, -37, -113, 28, 144, -4, -46, 9, 46, -55, -26, -51, -87, -299, -43, 65, 29, -99, -118, -69, 33, 107, 14, -96, 6, -36, -6, -54, 125, -45, -91, -57, -139, 15, -18, -63, -45, 31, 284, -109]
6461a09n7K7K11q5nK31k91R2N8l48K02m5K44%l31K01k16M43k24Q6j85K95j9l31
6485a56R2K66j38J09N8j74J68j52j3L29l82j02J02j16N4J35j02o6L0n5M2k8N7
6508d2p8J81N6n3j54K98P3l41R6J18l15J23J47K5j1j22N0j41J49J6Q4k56J33j92
6532a56j02J92J17m8K9j07J46k3J00k14L5K63l04J45l8j7J29N6n97M60J0l4J14
6555A56J7k45o0J05j31K28J86k77Lj86K02k5J31J6k29K63j40k03K77j6k09K89
6577A52k06K61r7k13L55k51K1k9j6J24l2K0j95Nm5O6LJ85j54j57K41L2j8j74o4
6602a86L09j67j11J2R3M2j52K36k80L43O9j70LN0o3m9q4LK18k12K31j65O8P5q8
6627B5o9j74o6J10L20Ll0m3k82N7K23l43L68j37L39k98n2l0N2J04j84L5K14k06
$$ y = [-109, -166, -139, 72, -13, -18, 213, -78, 14, 72, -276, -74, -119, 125, 125, -206, -5, -221, 222, -2, 84, -101, 194, 175, -156, -64, 202, 64, 173, 231, 57, 225, 73, 60, 389, 7, -95, 7, -109, -55, 80, -22, -88, -58, -113, -71, -99, -42, -120, 61, 117, 64, -90, 208, 281, -60, 36, 154, -161, -38, 109, 134, 123, 1, 51, -90, 59, 75, 159, -97, 36, -156, -258, -66, 51, 3, 32, -75, 71, 48, 148, -66, -31, 232, -72, 73, 35, 18, 147, 203, -394, 66, 76, 42, 156, 173, -72, -132, -27, -158, 70, 256, -21, -18, -204, -2, -27, 104, 120, -109, 154, 14, -189, 88, 72, -137, 152, -54, 207, 110, -103, 252, 1, 22, -7, -23, 101, 69, 89, -106, -101, -146, -80, -77, 108, -46, -203, 38, 70, 52, -122, -186, 123, -44, -155, -143, -50, -8, -160, 76, -204, 139, 208, 38, 41, 91, 28, -21, -105, -102, 116, -96, 135, -30, 38, 113, 25, -44, -218, -284, -174, 146, 149, 119, 76, -206, -149, 74, -269, 99, -38, 301, 3, -49, -79, -27, 77, -107, -72, 142, -64]
6651f4L46k7k97q1j58M25j97q1O8q4r7J50K0J05J58m6l07K47Mj26O0KJ6m0O2m40
6677c82L32J20J34k42J5J24q7k54K81j69j02K21MPj21J14K2J7q5J04j40Q3J58
6700A54J30n41P2L44j11N6j99J32o4l1K30k84O3n0q4J59mJ85m23K39J94r1q2J11
6724A05Q3l93K63p5K16n00M52l47K47j03m9J46J6J8K03q2q5lj16J39j42j1j2O2
6748C2J99k69R1j28K4r0L0Q5L2j90p0M16j16M8k12K82K8k08k01qJ60J67j15O3
6772E0N3%k34J2k41L46J23j79Q4k62L19n7k67K47J4k13P4K00m6j6J42k61J05J5
6796Hj93K47Q9j89q1R4K21j9k67K46j40j93L04j45K45k89m4J44k83J77J50K6o2
6819D6j63J06J06m49K50J39l26L33k4J31K3k00R3p0q4Q7J40l2J4J54m27K51q1
$$ y = [-64, 282, 255, -42, -123, -281, 144, -53, -134, -66, -150, -247, -97, -77, 28, 186, 140, -167, 80, 84, -42, 18, 20, 36, -4, 58, -382, -50, 70, 204, -38, -23, 101, 14, -240, 41, -128, -230, -9, -5, 2, -119, -5, 17, 34, -51, 53, -87, -4, 154, 284, -257, -185, 159, 48, 104, -95, 37, -27, -58, 172, -112, -49, -99, -183, -24, -28, 157, -266, -27, 167, 76, -6, 105, 188, -205, 58, -17, 199, -301, 151, -196, 51, -52, -101, 45, 61, 79, 282, 200, 115, 112, -4, 135, -7, -18, -30, 32, 231, -38, 53, -75, -51, -141, -111, -26, 6, -184, -254, 162, 46, 94, -118, 164, 192, -16, -217, -225, -65, 102, -13, 50, 103, 103, -131, -119, -360, -14, 109, -70, 14, -248, 71, 14, -253, -6, 8, -205, -131, 69, 23, 7, 149, -112, -7, 8, -185, 62, 151, -38, -119, -25, 196, 177, -90, 156, 16, -177, 127, -18, 227, -62, -106, 38, -245, -68, 82, 108, 46, -117, -11, 95, -354, -104, 35, -291, 42, 18, 149, 172, -28, 65, -5, -89, -2, 138, 106, 120, 274, -153, 98, 17]
6842A7o0J29J5k58M7K85p0q1n9J65n0L2k02N8n4L40k50p3K3J54Q5l18R8K88n07
6867b46L03m1l4K20n4k78L37k67L4J88m59M25J0j04m7o8j3L0j92K40N1j40j06
6890b11K87n7R0o8l3n1j08L06j49L6j75L44j97L22k98j26M2J04j53M1J27q2J08
6913I9j66J5r9N2l3M9J60j55K24q7p9K05k95J24N9j27L42k72Q8j05j06J30k09
6936a86J46j59L15L7j00j2p9K04m69J79p5L10k23J2J2J81j57K6n2r3J30N4k9j07
6960a35K26r4K8nO4j88K07k17K38m2q5j02K5J41n4J65j05n5j01j58K65K03l25
6983a04J2J93J43Oj33k30P8o0J48J66l38q7M70j95J27j75J5O4M7j70j50J02JJ14
7007D4j80J01J42j37n6N7J86k83k1K02K1o1J43j16om4L4k13K90J6M9k27K6J54
$$ y = [17, -43, 86, 101, -157, -110, 175, 105, 24, -35, 130, 80, 112, -90, -32, -86, 254, 4, -69, -46, 108, 193, -125, -27, 261, -246, 57, 16, -18, 202, 148, -130, 207, -60, -26, 162, -297, 128, 138, 34, -13, -81, -94, -64, -256, -16, 35, -105, -211, 76, 19, 109, 41, 8, -43, -151, 155, 6, 42, -133, 211, 14, 336, 38, -88, -46, 58, -95, -54, 73, -9, 99, -67, -52, -151, -99, -132, -83, 77, -78, 146, 59, -20, 185, -110, 14, 73, -54, 288, 16, 104, -1, -107, 23, -186, -40, -199, 116, 153, 53, 41, -38, 166, -303, -124, -199, 111, -112, -100, -88, 93, -64, -38, -90, -183, -53, 1, -28, -135, 91, -3, 25, 20, 84, -104, 103, -114, 124, 82, -3, -105, -80, 61, 7, 172, 67, 12, -89, -247, 18, 221, -104, -92, 101, 244, 250, 117, -113, -35, -95, 53, 219, -119, -206, 264, 69, 196, 21, 36, 100, 147, -23, -173, -71, -70, 44, -136, -35, 107, -30, -86, -29, 157, -126, -147, 55, 76, 15, 158, 42, 36, -8, 26, -187, 103, 119, 168, -59, -33, 121]
7031A21Pk28j30L14N8j08J60k75J62qp1K32n40J40J50Q7k5l6p1K21k64N7L7r1
7055a01J48P5L6p0k60L43l3J12j33N6k76j15K97o3L3J05l5j21K2nK60n3j16j11
7079eK73r6j99l0Q5j6o6J02p0J24Q2j46k4j13L10p8m9q0r3r4K45N4k69K74J0K1
7105A52j55k05K41O3kN4k30r7l0M36l84Q0K11J94j60m3n3k37K48r1O7k29K44k86
7129b12M9J56J61k96J32j46j1L84k35j64J84j20L05j77j31J87k53M5J17j2J62
7150A25J55k81J94k48K1J49o4J7J33l25N1k18K15J06N2l18K17J31m24M64k02k1
7172g1r2J03j85J04K00k8m7j07m1J55j35P7K30K8l88K71r5K12k15j18Q6k6P1j33
7196a44pN0J01K3P9J01k10J03j45n2J98l06K92q3j53K1L8J54j12J90j11k87K25
$$ y = [121, 128, -100, -230, 84, 142, 34, 194, -81, 81, 73, 2, 234, -306, -166, -16, 71, 46, 10, -61, 160, -104, -47, -10, -101, 47, 122, 158, 88, -172, 171, 138, 250, 117, 173, -103, -218, 79, 16, 49, 154, 119, -2, 20, 15, 275, 222, 106, -5, 268, 172, -27, -57, 28, 12, -54, 48, -22, 102, 184, 38, 14, -99, 211, 133, 84, 4, -89, -183, 62, 116, -153, 121, 131, 152, -3, -208, 33, 96, 94, 148, -82, -179, -209, 227, -157, -77, 134, 328, 168, 125, 72, -165, 83, -8, 59, -170, 74, -212, -163, -7, 154, -142, -10, -156, -167, 217, -18, -182, 2, -118, 187, 10, -121, 66, -187, -142, -25, -37, 125, 280, -1, 193, -55, -34, 115, 51, 68, 201, -124, -73, -291, -76, 30, 82, -236, -19, 112, -312, 152, -50, -71, -163, -60, -245, -141, 59, 31, -16, -123, -164, -9, -144, -67, 163, 191, -197, 74, -21, 191, -24, -142, -56, -82, -11, -144, -151, -101, 0, 23, 102, 203, -7, 96, -49, -101, 97, -209, 83, 0, -153, -132, -94, 60, -52, 138, 27, -260, -35]
7219c5K20k41J63P0j50qk15J53m9K80k57NL94k55M3j35n0K44j91K22o9r0j53K63
7243A59n3Q0j87P3MJmqK62l04l6q1J13j25J46P9k55JK74k72L22k17J33O4k65L30
7269B34k59J75k20J46J49j79K28n57M69k60j80J44K67k0j13R0j28J84j11l6J0
7290C3P7OR5m66K77j27k9L02j16J0o9j89J10M8L4J85k04Q2N6k9QP6j12N1j75J12
7316D6k05jQ4q4j01K79J37k16k1J53j54j20N4j87L79m8j07L2J04P4o8k70K53l0
7340a7L9Ok5qj36J55J28q2M3k44J99k06P4p4J25O1j48P9j71L19R2o9o1J23j40
7365F2L00k48j64lK9k89J35L76k89J92L2l9n4K09l35J08j73L2m7K69k61K21K3
7388H6j0j6r8k06K62rj4J29q9L2K04J31n89M35j75j28m0N2J51j2J45j52l1J63
$$ y = [-35, 185, -56, 107, 177, 27, 19, -196, -43, -92, 188, -69, -64, 330, 75, 118, -17, -67, 177, -14, 208, 139, 49, -104, 159, 106, 186, -1, 72, 76, 77, 73, 65, 327, 23, -13, -94, 19, -106, 40, 119, -136, -135, 139, -133, 189, -28, 105, 169, -96, 234, -25, 150, -70, 76, 225, 46, 274, -283, 186, -74, -254, -110, 157, 137, 24, 114, -14, 170, 59, 23, 33, 110, 116, 211, -255, 22, -105, -134, 168, 52, 62, -7, -196, -86, -38, -4, 181, -23, 59, 115, 86, 94, 170, 58, 109, -66, 46, -159, -160, -76, -160, -261, 18, 155, -61, -82, 71, -83, -203, -149, -336, 43, -5, -112, -80, 24, 98, 30, -240, 13, -17, 22, 28, 3, -5, -141, 14, 142, 60, 103, -141, 58, -148, -74, -148, -23, 38, -110, -31, -202, 117, 209, 140, 79, 202, 62, 362, 114, -50, -53, -24, -313, -178, 198, -91, 101, 133, 94, 40, 249, -86, 22, -151, -119, -166, 103, -158, 63, 86, 76, 60, -38, -244, 18, 9, -5, 124, 35, 67, 271, 402, -187, 248, 73, -55, -95, -43, 108, 96, 241, 89, 58, 221]
7412B21l73K08k1J8j00J74j53K6l7JK0J16j76J39m7j81J32j9Q5l0j56K69j17K3
7436B2L7nK48l43Q1q6n8J80Q5r2j04J36k10o4J79p2r6J46lo7j0J97j9L3mk54J67
7463B4K8l0J3k87K03K49j47LJ03l15K11j33j00K40j97L68l55O7O9j68J60Q8j78
7486h4kK24J07k57O5j26J39Rp7k5p1J4K77n2q1j81K66r9l3j49J24O9k41L21j37
7511@N5k77J93J69k56J92M4l63K89j15k7N1N7j74L25j87J86j47N7q6J22j51J90
7534A47Q7j10L0j46OK65k91o5j22J3J31l7J50j61n1O8q0K09j14j50K95j84J56
7557D6j64J08M9J90k14j63K25j04j96K10r2J2k46J63J93J78Q7l92Q4J64m9L2k58
7580a37K86j58j84L39l33l7M68k09l7J08j08j03J29L1j10N5N4j4n2J03j88j57
$$ y = [221, -152, 56, 35, 53, -47, 127, -26, 0, -37, -36, -16, 100, -76, 63, 16, -165, -33, -52, 33, 3, -153, 116, -1, 22, 59, 54, 302, -41, 40, -46, -104, 76, 161, 69, -35, 101, -109, -173, 6, -66, -162, -16, -19, -86, -96, 101, 82, 115, 111, -143, 24, 52, 22, 35, -252, -49, 200, 53, 56, 159, -156, 55, -78, -178, 62, -135, 233, -122, -55, 14, -154, 6, 94, -84, -86, 138, 245, -12, 53, -73, 66, 75, -2, -27, -98, -84, 193, 141, 60, -121, 145, 46, 13, -136, -12, 57, -184, 137, 0, 55, -222, -29, 140, -116, 76, 120, -243, 46, -69, -96, -45, 12, -162, 163, -24, 162, 15, 72, -14, 108, -43, 147, 234, 124, 154, 8, 14, 279, -12, -77, -199, -186, -55, -92, 58, -103, -154, -86, -166, 43, -71, -221, 74, -110, 46, -118, -10, 39, 229, 15, -148, 77, -27, -223, -13, -105, -93, -339, -176, 17, 195, 282, -110, -26, 138, 89, 121, -137, 149, -9, -193, 146, -187, -224, 244, 35, -2, 106, -2, -105, 24, 55, -55, 0, 54, 40, -12, 91, -97, -254]
7602b54J96p3K26M6k44K25K8j57R4n2j92M25k28q0j5j73L13j10OO7L6r2O0k8J15
7627A39j49J24k76J24J72P5k51o5N3o2O8J05j12Lj10L22k17kM7l35N17k79l8K17
7651G0j6k2M3J82l14j31K08L32l56o9J76k55K28K7k4k6J7k89J98Q3lO1k95J1M93
7676C29m38L2J00J3r4J3J64K6j37p1Jl6J58j93K4R2j30L0J66K08k00p6oL2K11
7701B18k39j28K35j12m0NK52k87K05l25L33r4n2J67j41N0n4J97k97J96k3j10j51
7724a95K28j77J10N4j65p3L16l1j13q0J94k50R7r0L41J4j9k36K41o9j6j4q9j72
7748a94J91Lq3N8J46j75J87n6Ok43j12L18j43J66j36p0N8Q9K09k43j5n3J4L57
7772B79k18K13k3j22L5q5q0L9K0j18L6L0k44L86j52Q4j18j23M9K02j21J57j08
$$ y = [-254, -58, -131, 95, 141, -103, 122, 150, -7, 87, 35, -157, 268, 40, -40, -55, -228, 85, -25, -19, 48, 84, -8, 52, 24, 139, -10, 114, -162, -38, 134, 209, -42, -107, -54, -116, -48, 57, -55, -52, -162, 160, -57, -59, -12, -347, 170, -109, -147, 70, 54, 32, 75, 257, -57, -188, 20, 352, -4, -73, 103, -152, 76, 103, 79, 53, 70, -219, -21, 62, 59, 120, -175, -164, 329, -109, -77, 23, 36, -58, -45, 119, 145, 8, -63, -62, -98, 60, -133, -109, -17, -147, -117, 49, 257, 57, -19, -25, 7, 218, -21, -149, 86, -26, -66, -61, 191, -96, 109, -216, 117, 23, -29, 138, -3, 47, -7, 190, -107, 89, 66, -44, -195, 33, -144, -34, 20, -145, -218, 98, 67, -46, -126, 68, -182, -85, -175, 166, 180, 161, -75, 166, 97, 81, 67, -22, -194, -3, 0, -83, -25, 121, -54, 133, 77, 83, -160, -272, 46, -97, 69, -67, -137, -79, 10, 219, -24, -39, -92, -78, 279, 61, 274, 251, 129, 164, 79, -1, 38, 58, -60, -24, 6, -238, 148, -4, 80, -38, -161, -112, 90, -31, 126, 18]
7795A8RN1j65K7j38rJ67k09J85J68j95J76J65k93j7J45L0q4K86k73l52K13J86
7818I1j38Lk38J04K67L4j13k16K81k9Q5K67m20j35J27l0O1p4r1J89J51j12L41
7841D05l72K33k50N3m40M11j23L4M0N9j05L2K06K2k28K98n30J21K10k4Nj9j83
7864a45o5K00L71l15j63J96m7J50l8K07k27j64J80j24oj27L54j26j04k10J47P1
7886A5N9k61J44K34k60p6M5nK2N8j37N7J46k1M1M4j25K67k28ro6N6o1M6K57k47
7912er1J4R6l9k1J95L4J1k15j22M2L9n5J66k8J11K37m38kmK81j57j43J65j23J21
7938F9r7Q3N7k62M67n00M26l87ONK04j20J96n8k05PR9K4j42J78j87KJ70j11P6
7963@j82J54J42j62L6K3R2J23j41j25QK33n23J62M84l87pJ26R5k83m5K37R3l21
$$ y = [18, 27, 78, -87, -60, -198, -207, -40, -249, -64, 104, -91, 85, 250, -43, -60, 85, 115, 31, 317, 44, -308, -95, 91, -47, -44, -282, -178, 89, 123, 10, -206, 75, 46, 131, 398, -22, -157, -30, -60, 1, -73, -164, 25, 176, 64, 405, 33, 266, 16, 69, -371, 40, -83, -49, -9, 50, -55, -23, 183, 205, -23, 275, -255, -134, 76, 52, 57, 38, -145, -210, -10, 361, 46, -117, 79, 32, 182, 144, 351, 124, -40, 140, 16, 10, -117, 237, 111, 7, -203, -56, 15, 74, -187, -43, 191, -69, -145, -100, -105, -83, -25, -162, -105, 41, 20, 61, 105, -20, 247, 19, 10, -56, 0, -61, -15, 242, -5, -96, -82, 14, -25, -46, 149, 183, 194, -21, -143, -101, -62, -117, 49, 21, 132, 369, -69, -71, -75, 206, 49, -94, 71, -52, 69, -28, 55, 112, -150, 317, -183, 243, -144, -138, -133, 71, -49, 147, 89, -116, -109, -10, 14, -128, 50, -137, -135, 35, -76, 0, -182, -28, 114, -48, -12, 11, 103, 226, 85, -40, -32, 201, -322, -160, 324, -63, -70, 56, 151, -132, -177, 60, 153, -168]
7987a68L5K15l46L35j54J34J9j50K3N9j42nK63l67J3K13K53m10K67j55N1J66j93
8010d4J30j55j57r6J80L22k99Qj80J95P5l8J05k09m6N9L41k19K80j1k55q0J09
8033A5N9j64J25k70K72o5j42J8RM31n42qO9R2J48L0l26J14J64j38K3L3J66j1J8
8058A20M1l59L44l27K08K40m67Q2k4L46l09J48Oj6l5j5L27j84m4l60J60n2J47
8081b3M3j65j40n4M28j71R8l7Q8q5j97L62q1L2l25K28K55l27J17p2j15L02m36
8104b75K43k09L25m9k62J36j15J71J08j13j44J48oR7P2Jj19J55l79L64j59K9j71
8127a52K65l4L41k71k25PPL6L2j12J42n2n7P8k45J71o3O5K45j90M4j82r2M9M8
8152a45J59J44l6o2j8K1J34l30L41k36nK53K0j82N1k0j93J57k4j51J57J0J80k84
$$ y = [-168, -133, 82, -264, 71, -83, 51, 70, -80, -57, 2, -140, -145, 118, -249, -236, -23, 230, -180, 87, -68, -17, 149, -44, 86, -69, -226, -322, -142, 180, -119, -111, -291, -96, -21, -59, 46, -163, -209, -150, 191, -28, 252, 241, -14, -94, 15, 74, -90, 35, -235, 37, -28, -170, -152, -143, 288, -254, -262, -193, -101, 47, 77, -249, -135, 29, -109, -86, -53, 113, 102, 120, 161, -198, 146, -181, 27, 267, -200, -118, -142, 204, -105, 43, 49, 33, -2, -17, 310, 126, 82, -278, -118, -170, -23, 20, -145, -285, -339, 89, -82, 16, -21, 67, -18, -215, 147, 66, 98, -227, 1, 256, -71, 46, -26, -141, 161, -275, -32, -241, 84, 35, -227, -91, -206, -35, 73, -40, -184, -36, -42, 55, 127, 128, 9, 164, -215, 149, -10, 19, -152, 113, 79, 420, 149, -76, -69, -62, -26, 6, -106, 36, -16, -73, 5, -240, -69, -132, -67, 178, -12, 32, -150, -242, -193, -145, 14, 158, 122, 60, 42, 63, 197, -133, 208, -28, -33, 220, 240, 58, 109, 89, -104, 53, 29, -122, 35, 45, 225, -59]
8176e9r2n1M41m96J69k3j46L38n5j99K81rj20N6j9
$$ y = [-59, -151, -202, 239, -257, -88, -111, -257, 81, 26, -173, 108, 99, -21, 35, 16]
8191A6
$$ Imaginary data points
##PAGE= N=2
##DATA TABLE= (X++(I..I)), XYDATA
0@%%%%%%%%%%%%%%%%%nJ3j6J6j6J6j7K5l2L2l8M6n0N8o6P4q6R6j07J21j36J52
39H0j69J87k09K33k57K84l15L48l82M19m61N09n62O19o83P55q36R29j037J161
59F13j310J491j709J988k358K864l610M825p103J2783n2351q2469J46086P7754
73I7494r2289o9039N9476M5744k8170k7671N680J728J9737K5451k5711n7590J2473
86c2687P4546O826p7427j6271N8866J4685m0368j3203K2788J2608n262l760j7400
99a6059j2737L4275L2074l3674l8848K5044L6314j8708k2426K0360R456j6862
111a791L581N372j6246J330K7556K043l6084j0657L5208R110l1162j185K6202
124A3277r565k8858J7763L0009k7662k3818L9945J7342m7910j7149N0147K4714
$$ y = [0, 0, 0, 0, 0, 0, 0, 0, 0, 0, 0, 0, 0, 0, 0, 0, 0, 0, -5, 8, -8, 8, -8, 8, -9, 16, -16, 16, -22, 24, -26, 32, -34, 40, -46, 50, -57, 64, -72, 80, -89, 98, -111, 122, -135, 149, -166, 182, -200, 219, -242, 267, -295, 324, -359, 396, -440, 489, -548, 613, -697, 794, -915, 1073, -1285, 1579, -2031, 2794, -4309, 8474, -43877, -126346, 19740, 97494, 5205, -63834, -4358, 41386, 13216, -14455, -8775, -7047, 12690, 38141, 12430, -45160, -32687, 41859, 48685, -28742, -45013, 13853, 28538, -11830, -25033, -2245, 10363, 5101, 1341, -16059, -28796, 5479, 37553, 3879, -34969, -9925, 26389, 7681, -14745, 5615, 15071, -1791, 1790, 7162, -9084, -7754, 19802, 21845, -14239, -24896, 10312, 19422, -11740, -12925, 13277, 3712, -25146, -7383, 22626, -5036, -28854, 11091, 28433, -19477, -36626, 13521, 38235]
136C8235m4118k4171L6610J6079k6572n619J9460J215j2601K019L759j2040M689
149c055J9655q657k2398N260J8033n090j6776Q957J5665j4710j3235J5796P271
162F716j2447P35J3252n317j5358R006J4594q539o430R526J133j1079r32J4507
176I367J400j4802P68J1502q008q315Q722O537q761m278Q636l842j2318J0987
190b405J4980j2747j6257J0588J8394j0367j7593J4358J6771j3362j2828P979
202b489R461j283m004P75k490j424O855k14q332J344Q672k152j2358n19J3481
217E323p63j0777L062M903o017k280P400K941q543p48J0157k657r544N620J0382
232H459k780j0433J673R509l179m331M934J98m308O82J636j941k464M731K706
$$ y = [38235, -5883, -30054, 6556, 22635, -3937, -9556, 9904, 11119, -1482, 537, 4296, -7744, -3055, 16600, 7943, -14455, -9195, 8838, 3748, -13028, -4071, 11594, -3116, -16351, -555, 6716, -5731, -4996, 8256, 2939, -12419, -3413, 11181, 2642, -3788, 5738, 6871, -4208, -5140, 9367, 10767, -4035, -3267, 8235, 227, -8088, 634, 7171, -1590, -5868, 2768, -1074, -13392, -2405, 12575, -172, -16429, -5841, 12553, 2186, -15407, -1049, 15722, 2360, -10468, -2489, 6972, 5689, 1685, 2460, -30, -1454, 5401, 5187, -3145, -1801, 6871, 4719, -7639, -8158, 5323, 4560, -6217, -3155, 1748, -4269, -6549, 851, 3792, -4751, -5499, 4658, 2001, -7543, -1923, 8459, 5679, -4754, -3081, 6428, 3249, -1082, 3852, 4050, -258, 424, 2060, 119, -2345, 2386, 5092]
247E092q951m465Q866K916o939k630P284K033r590L55R080j225m685K310K571
262B022k531j586M856K370m835o81M481j892l134J949L263j393m631J787J283
277A328l685R00L851k680l915J083M151k199m913N187M499n657l410M589L531
292B660j948k467L649N83k825J471J461j168J057O00j509k350N26L834j627l977
308b030K127J143k673j520J653K460k724k494L664q32k645K269K855r61l014J561
324a161L878k619j519M328K98k660l17J507R90j878J43K212k577k287K199Q17
340A354j821j077J065J232l849p30M058k87k255j26J527Q51k084M72L020r54k89
357A07R16n40L17P81M56K75j548K09J040j264J86j30l19K34r22q49K64o40J477
$$ y = [5092, -3859, -8324, 542, 3458, -3481, -6111, 1173, 3206, -6384, -6029, 3051, 1826, -2859, -549, 2022, -509, -2095, 2761, 5131, 296, -385, 4096, 2204, -930, 1019, 4282, 2889, -1742, 45, 1328, -2357, -1457, 2394, -286, -4201, -3118, 1033, -1166, -6079, -892, 3607, -2050, -5460, -871, 2660, 712, -1755, 1894, 2477, -348, 1123, 2584, 1416, 2473, 3073, 1564, -786, -260, 3574, 1947, -2030, 97, 1240, -1433, -2953, -1300, 1160, -1564, -4058, -394, -1226, -3871, -1602, 1253, 292, -2722, -1161, 2717, 98, -1421, 2907, 3205, 545, 228, 1735, 2725, 847, 990, 3202, 625, -1662, 537, 1354, -467, -1544, -479, 753, -3096, -3826, 232, -55, -2310, -2436, -909, -58, -2142, -1670, 1350, 396, 107, 1023, 483, 800, 1581, 2037, 2312, 764, 973, 2013, 749, 935, 805, 486, 720, -202, -1051, -787, -1427, 50]
376E0o74k255J59J849M41r83j469K368J727k097l0M88R84J644p90j397j16J495
394A394K137j828k511K079J056j023j486j143J977Q43k245j038l24J194P89r10
410a039q43m33O03K064j188j475J692R50P29l67j379N40J706J413n49l020N37
427e9K891k50j731j831P77K621j296k451l83N51K011m94l183k26J252K677K4m756
445c856k08N028J300k824k941K367M597l39l873j157K433M084j193m531J28K451
461A466K125j533m240J43M009P37l553l626L074L589k242k758j19J508J953q76
477c43j674P04J241J070n36j446P35O64J333J110k620j447K940Q71j055j478l96
494c27J566m97j88q85j257Q86Q30k98j054k322J222M472j942m319O52M714J546
$$ y = [50, -624, -2879, -2720, -871, -430, -1413, -2882, -514, 1213, -884, -914, -426, 558, 2202, 1412, 15, -101, 1394, 3531, 1703, -808, 1271, 2327, 1304, -182, -1325, 652, 1495, -750, -1788, -2112, -918, -129, -1039, -1882, -2315, -1712, 352, -836, -2311, -619, 331, 1060, 693, -686, -146, 1560, 2973, 2424, -596, -59, 2832, 2582, 851, -980, -203, 2418, 1122, -1329, -1712, -1161, 850, 356, -2827, -3053, -1801, 876, 900, -3856, -4064, 964, 2264, -560, -3501, -1134, 3463, 3124, -749, -1906, 527, 4611, 3418, -1113, -985, 1466, 3591, 2058, -2182, -2039, 1970, 2707, -846, -4472, -1398, 2191, -51, -2809, -2928, -1420, 533, -343, -2017, -1313, -72, 998, 462, -984, -249, 415, 1748, 2858, 238, -1209, 1731, 2602, 1547, 69, -327, 1239, 742, 554, -331, -1588, -702, 128, -170, -1224, -3546, -2324, 2148, 206, -4113, -3461, 1253, 2799]
511B799m223k190M036K193o12k212j603K673K892o80l082k279L283M211l201n310
527c305Q36N560P69o433k175N248J812l229k700J569K533o06j015j68m06J192
543e18J704o32r60l98K033J917k262k171K313J625n60k031j22J187j93o48l16
560c2j86k7m74k94J645j699j998K105J734j278k431P01L702p29k267O9J777J364
578A682q15j113L92O45J062P73k513j750K768L286k615n221J362N949j437n955
594c500J61M581O23l746k049L133J518j215p28p04J356J100o06M8r49N63K978
611B564n97k606rK590J141k610j707K404P88q29j307j146J556J142k333q45R75
628h29Q21m71j465O74Q15j71j07k63l9J618m90J47j74k03J452qr70M5P91M07q65
$$ y = [2799, -1424, -3614, 422, 2615, 2003, -209, -1812, 861, 3753, 3073, -9, -2288, 995, 5206, 2005, -3305, -2469, 3091, 3860, -2573, -4748, 500, 2312, -917, -3617, -2048, 485, -121, -1136, -1304, -1710, -518, 1186, 554, -406, -804, 1229, 3146, 884, -1287, 1026, 2651, 2091, 60, -62, 1125, 932, 284, -32, -218, -245, -719, -1013, 632, -1067, -3065, -960, 774, -504, -2935, -2234, 1468, 739, -1528, -1459, 318, 1682, 867, -246, 146, 791, 1853, 2626, 113, -1637, 1131, 4417, 1802, -3419, -2057, 3892, 2455, -3500, -3339, 1242, 1865, -1881, -3930, -797, 721, -494, -1222, -1926, -570, 530, -76, -28, -977, -414, 2564, 1967, -639, -648, 1942, 3083, 473, -1234, 1170, 1958, 1129, -178, -1324, 232, 1374, -959, -1804, -829, -8, -479, -1944, -1270, -455, -626, -733, -996, -1035, 583, 93, 240, 66, -137, 1315, 1307, 337, 382, 1173, 1580, 715]
649G15r60J752m2k299N12J427m96j676o41K101m79j660L03J056j43m42l64Q61
667d75N35p05j2O67L40M18k81j16L21K27M28m65o11J084l91m56K90p12L8j73k50
688b99K35m18m43R78q37q43O16L79K28q15Q0J492l95n67M49J17O18K7m31N91j98
709E64N99J8o63O3L31j84p7q73K62L49r96j40J19J01j6n66k45J320n52k99M24
730d61j65N30j52j27P54qkJ7N08M72o64j24Q73o67o70J00M61J01p01p52J000l84
752f1q25J72r4L18K0p64O10M7j08K38O9J62L03k33Q50n01j80R69j25m73M15nK08
775A012l95j31M90m36k55K28o78k66Q4m49M88p12r2O42k98j78L91j18L31J58m03
796e87N65K0K63K24K7M33Ln91N84k88n6J31n66N7J92j97j11m55k39N69p04j28
$$ y = [715, -245, 1507, 1465, -834, -322, 1105, 609, -1067, -1708, 393, -86, -1746, -1443, -387, -530, -972, -1336, -475, 60, -645, -657, 10, 350, 768, 487, 371, 692, 919, 1347, 882, 271, 1355, 964, 508, 798, 86, 124, -49, -299, -64, -482, -925, 53, -784, -1627, -1011, -632, -404, -1219, -1139, 353, -42, -609, -160, -43, 575, 602, 171, 762, 564, 1163, 1181, 518, 581, 912, 728, 651, -222, 40, 389, -607, -747, -628, -527, -543, -1109, -1354, -34, -586, -885, -461, -626, -96, -248, -375, 379, 371, 369, 386, 894, 1366, 702, 578, 1451, 784, 114, 214, 675, 776, 75, -677, 323, -61, -886, -714, -808, -490, -470, -1234, -624, -577, -685, -447, -378, -216, 87, -146, 704, 203, 23, 992, 867, 394, 809, 804, 1012, 617, 486, 976, 540, 285, 513, -165, -431, -347, -796, -308, -1020, -1112, -470, -768, -946, -555, -673, -342, -184, -587, -22, -2, 261, 485, 512, 945, 948, 357, 941, 653, 597, 728, 162, 219, 411, 214, 103, -352, -591, -22, -726, -854]
818h54J35j49L93l36k8O98m17k1L34J37K43j81R6Q09k29l48K66J02J36l13l9M78
840I12k38o92L15l21o1l22K6L45o93l49N63J88n81k13O44N98q15j83Q32K09n0
861A14n7K08M11m51L54N56n45l57Q88q3n60m64J51O96p46p04L85j55p5r2m36M33
883e29o5M4K10m75J18Q56l89J90q1n6N35K83j70K3k86N51M90j164J60L93K54r7
905G95j499J072L64p02r7n78K28l83J8K36k62m55J199J79j077K36P68N96l50j033
925g45P88P91k55q1j57J68M37m86J57j84n75P96l92m04J79m9j82l8j81j42k89
946h44K04P53j201N2Q81K44k07m17L85R24r19k24J036j23n31L99N56l0j452P49
966B35J646j538j285P75J101o68j240K42J283j140n69Q13K13l21m26O42K40r09
$$ y = [-854, -719, -868, -475, -811, -839, -141, -558, -579, -245, -108, 135, -46, 50, 859, 630, 282, 548, 650, 786, 473, 434, 912, 674, -18, 297, -24, -85, -407, -381, -36, -729, -1078, -515, -327, -908, -1121, -477, 121, -694, -877, -45, 164, 114, 57, 265, 676, 225, 579, 1135, 590, 233, 1121, 1038, 478, 14, 165, 861, 115, -589, -204, -359, -434, -526, -962, -529, -594, -550, -340, -815, -697, 159, -230, -40, -121, -177, 358, 641, 471, 494, 208, 759, 1249, 85, 245, 638, 892, 795, -704, 368, 732, 30, -67, -645, -417, -800, -782, -546, -808, -1263, -64, 115, -962, -726, 42, 638, 288, -745, 43, 834, 579, 498, 341, 509, 946, 460, 617, 433, -142, 654, 262, -142, 37, -12, -194, -232, -413, -555, -844, -640, 113, -1088, -1036, -155, 89, -118, -535, -150, 774, -145, -369, 667, 544, 13, 412, 968, 938, -514, 235, 1881, 343, -942, -167, 934, 266, -974, -732, 551, -589, -1158, -345, -132, -453, -879, -237, 3, -906]
984i06K76J201k82q85P90O68J37j336J75J485l10p11P6K28K71o05n10K08M81m72
1004b1k16p73J031n40o51R14j9l91j28M61M20m82m43J344K52j034o9J206N31j710
1024c18r0K088n34j500P21Q81l73j484K28J683j177j409R37J006r82n93M03Q78
1042C65j112n52J307L4q39Q6J280p1j185N33J231o55j049J206N18k49p25J27N30
1061G80l98k41J29n64M05N30j117K8K5K74k14o28M77N37o50R0L33J37J40q8K87
1082B72l71l8R99N25j759K04J209K22j126n80J390l12q04L57L86p23k21K12K85
1101A27o28o81R94M5p22j19J171j25j075L39J371p14r29J517M2p38K35M73J86
1120G69n58l00R66r4o05K8J25k7o87N84j9r51jR24m40p24K04P28k97l59K85P72
$$ y = [-906, -630, 571, 289, -596, 194, 862, 999, -337, -162, 1323, 1013, 302, 378, 606, 877, 272, -238, -30, 451, -21, -237, -1010, 21, -519, -1170, -256, -275, -666, -794, -333, 87, -395, -838, 506, 758, -276, -345, 861, 1392, -318, -408, 1680, 1146, -354, 367, 1248, 875, -609, -381, 1302, 125, -1284, -347, 659, -323, -916, -513, 365, -747, -1299, 8, 42, -797, -711, 569, 498, -687, -154, 1077, 422, -627, 579, 1097, 848, 123, 250, 780, 382, 141, 270, -294, 111, 641, -476, -448, -423, -149, -363, -991, -514, 23, -627, -537, -204, -67, 73, -15, 272, -99, -137, 862, 1387, -372, -168, 1041, 1263, 137, -443, 947, 635, -169, 188, 574, -149, -370, -158, 127, -501, -1182, -188, -143, -865, -984, 187, 62, -1013, -674, 697, -17, -946, 571, 613, -125, 110, 583, 769, 211, -89, 877, 783, 178, 206, 331, 304, -383, 201, 182, -769, -770, 154, -286, -1010, -806, -78, -375, -734, -449, 323]
1142C23o92p4N83r9p0J98N85m27k39N13K48p79j27O98k93l23R1m0K64p92K02K20
1164c0m45l39O30J12p09P9J086l69r21Q61N01o44j63O52K38l03n07R14j82l87
1184G4L54J95j24o39J79Q34n99n57K09O26j226J35M17j75j50j89O99m85m93P98
1204a17K27o95L50M59L0l98J57Q70n23l51M90M62n92l63L87L64q64r3J035p10
1224A25r32N44M53j41q26K92O11o12k24N06K62n53j46N56J20p56P95O84p25N0
1244H3K09K85k96j37J90J76m80K51K53n22k96m8L82l61k08N44q1q48Q11j54k22
1265d69N8M95m42J31k36O40j47k98L71O74j97o51J97N44k50m43O09j69n55K7K89
1286A78L9m22j07N04k80q29O61K74n32k7nN56l55o8M19j94J28J90J43N8k65K0
$$ y = [323, -369, -443, 140, 41, -29, 169, 754, 327, 88, 601, 849, 70, -57, 641, 348, 25, 116, 76, 340, -452, -250, -30, -475, -814, -184, -72, -781, -702, 384, 15, -906, -45, 456, -188, -351, 301, 539, 236, -271, 643, 461, 74, 428, 623, 499, -140, 39, 873, 274, -283, -74, 552, -674, -539, -122, -297, -447, -636, 63, -422, -915, -117, 110, -585, -235, 224, 254, -144, 13, 883, 360, 9, 499, 961, 369, 6, 393, 757, -107, -200, 835, 125, -807, -263, 190, 49, -777, -485, 126, -486, -710, -204, 58, -495, -641, -85, 35, -721, 74, 758, 33, 83, 292, 577, 281, 144, 334, 510, 30, 281, 534, 12, -284, -332, 50, -311, -519, 25, -56, -904, -93, -247, -469, -411, 84, -358, -227, -463, 177, 30, -268, 103, 777, 580, -71, 126, 670, 420, -23, 586, 417, -138, -111, 178, 217, -205, -312, 192, -88, -917, -256, 18, -514, -541, -546, 10, -345, -413, 6, -188, -60, 130, 273, 331, 66, 86]
1308H6L85J1l69M02o2l15M51j15k03n91J54M26q00K75N5jJ56m24L75k24j47R7
1330c78O09l97j07K64K94j64j61KP16m57J32K45j06j37l0Rj57j77P9L76n13K45
1352A87l74j54J93p8r5O6l01L80j29q3M58J16l28K0L57oj12L8K87l4j72J04M62
1375H02m68j8k36O6j10j35J17oj15r8j48N01m59l48O13k84j11m2J80K32k28M45
1397A50N3J34n83K84K16K78k28j00M44k03k97J53o1k2k67k01M47j77l52j23L85
1418g0k78N0M2K26k85l28L73M04k01O8m5L65k24j26M28k45k6L73k94K31k08j93
1440C7M21j14j36k04J79k12K33k86M8j82J13l11J16K26j12j73L46k9Q5l15J35
1461a35M57o1k94N99k30l14M02Rp1j1m81J36L11k87j02r5K91k39q0P5K05n06J62
$$ y = [86, 471, 482, 113, 515, 453, 138, 589, 474, 271, -320, -166, 260, -540, -265, -210, -211, -55, -479, -104, -328, -475, -378, 231, -166, -273, -9, 285, 121, -40, -38, 678, 221, 353, 598, 492, 355, 325, 334, 177, 0, 79, 455, -58, 187, -187, -341, -148, -226, -321, -255, -556, -176, -305, -388, 70, 186, -142, -122, 235, 229, 117, 155, 442, 408, 236, 340, 802, 334, 316, 80, 146, 36, -99, 18, 12, -103, -201, -349, 152, -307, -655, -42, -326, -437, -479, -299, -67, -295, 150, 203, 337, -246, 38, 254, 532, 304, 204, 648, 445, 148, 301, 240, 218, -49, -250, 197, 20, -332, -455, -70, -348, -298, -256, -30, -315, -643, -270, 134, -67, 1, -44, 321, 97, -29, 399, 154, 128, 501, 207, 438, 230, 37, 458, 344, 208, 4, 183, -29, 204, -82, -34, -216, -103, -414, -298, -72, -184, -357, -11, -40, 45, -270, -135, 322, 261, -33, 566, 336, 22, 424, 433, 362, 351, -130, 6, 317, 30, -72, -167, 124, -115, -195, -120, 85, -421, -259]
1484b59j64R5J32j2q0K96l72J87K13N3l3N2R6L20k37k80K79l2L97l74k55J76J53
1507C51o47M55j42j89l13J34L30l36j14J38M40l32M3J02L62l74k41O04Q6j08l32
1528h3K61L14m54J31J99O1n43K83J19Q2k52n5J30j73k09k85K72J79k77k2L08j32
1550a46l65M50L8j01O8k41N91k03j34J35Q2J10l1Kj21K10l14o0L36m2k94j57L36
1573A49l17k2J94j36j61L5p6K89J0l56J90K48j51m1K71k7O6j33M37o2j82j62M43
1596E06k39n4rK41l26q0l3Q7k37j13M0K19l34j28L00k96N0L37j02J85k97J04N55
1619C76m96k6L35j10J72j59J11K28k32q2K55k63j26P2mj07r1k3R3M2k02J27j29
1642b39j55K70n4J11l36K78j46L37oL26n66J60J08R2O5N4k4m5LN2O4k77o9k01
$$ y = [-259, -423, -328, -196, -208, -288, 8, -364, -177, 36, 89, 56, 108, 204, 524, 287, 7, 286, 254, 651, 277, 22, 198, 351, -296, 159, 17, -172, -485, -351, -21, -357, -471, -333, 107, -225, -182, -80, 282, -92, -333, 271, 357, 249, -83, 178, 492, 38, 169, 368, 429, -114, 169, 288, 370, 118, 63, 193, 20, -189, -474, -202, -23, -300, -322, -14, -146, -511, -61, -23, -124, -56, -297, 294, 91, -43, 92, 174, 284, 253, 255, 134, 344, 30, -30, 306, 264, -30, -187, 149, -168, -190, 4, -132, -293, -258, -334, -45, -35, -391, -201, 47, -104, -145, 126, 99, 165, 32, 469, 407, 225, 63, 506, 267, 213, 204, 445, 119, 39, 6, 93, -144, -257, -217, 2, -332, -460, -160, -456, -406, -69, -171, 14, -283, -179, 376, -120, -146, 189, 79, 251, 92, 203, 431, 199, 117, 372, 109, -17, 55, 51, -56, -147, -170, -77, -35, -237, -110, -239, -394, -124, -178, -67, -403, -125, -271, 66, 60, 386, -180, -20, 88, 180, 245, 299, 275, 230, 233, 285, 349, 72, 3, -198]
1666a98J23K01m05K98p0m29J66J27k10j48K27K27P4m42O29k25J00N3J49J55k14
1687A88j23M47k45k16K61k1j1k58l7M27k96l5O3k40j64RK51l08K8O4L81m58J48
1710a45J13k42J55K37k18O7J75J04L07m05j53M42j65k46N5k76N64l76r9L0J45
1731F9k61K99k31J85m15L8K84k32NM8J90q2J5jJ19J3J85l16L99k6j09k12K72P3
1755C09o4j14j30J52K1j16k03J09j1j06O2J84l79L2J84r7j66K33J23L9k30K84
1777A16N6j25rn5K82O6K3j48J95l15Q0J06l7k93J07K61k93k95J81K57l96O4r1
1800b63j65L52k75K11Mk6j39L46Q6m8l68L81l7l5k6K40n8P1J57O3j52l31j45K18
1824F1k61K08k8K8k0k46K57k29o0L57k95l04L06n9J19rM86k57J57r2J5j05P6K90
$$ y = [-198, -75, 126, -279, 19, -51, -480, -314, -187, -397, -545, -318, -91, -17, -459, 170, -55, 45, 98, 247, 402, 188, 65, 512, 267, 51, 312, 291, 280, 22, -15, 412, 116, 81, 144, -96, -260, -251, 0, -308, -280, -216, 165, -293, -145, -32, -274, -119, 118, -100, -33, 142, 246, 553, 148, -5, 437, 272, 26, 81, -195, 369, -7, -106, -76, 69, -192, 107, -124, 61, -354, -316, -32, -264, -259, -211, -21, -103, -88, -89, 30, 43, 228, -88, 311, 285, 176, -36, 236, 309, 245, 131, 1, 153, 174, 58, -145, -36, -47, -153, -91, 93, -286, -254, -70, -167, -333, -100, 23, 62, -168, 116, 172, 47, 38, -17, 265, 331, 354, 206, 401, 86, 166, 272, 235, -58, 49, 310, 17, -278, -97, 160, -236, -172, -263, -428, -76, -351, -140, -136, -162, -301, 45, 131, 83, -285, 96, 59, 24, -2, 238, 180, 251, 408, 471, 319, -12, -157, 61, -200, 8, -20, 8, -12, -258, -1, -230, -290, 67, -228, -532, -226, -285, -166, -175, 311, 54, 211, 119, 134, 29, 105, 395]
1848C95l41K4j00J31J00j24q9J72j72j90K23k88N9l01J79O5L9j8L24k64j71M30
1870H3J90q7k49R7J71j56p1K38m5P8j83R4l1R5l66M60k55m9j51J19p2j44K14n7
1894g7j30l8M0j74J65J06m4J76l51K04J53K25L5j46j7P2j6n7R7q9K08k79m3J20
1918A40J4o4K37n19J75k56K02j64l2P8p2JL7J32N5L13j12m01K30kP3J23j12K89
1942C65k85k9M50m23j03K31k97n5J68k97K07J05j36J2k70L35k59k5M8P3K6J8q5
1965b26J00L11n21M88o6N6j41K03n4J85k56Q6Q7j39J96m59K08N8J07k97J94l60
1987b40mm8K72j82K4j45L39k09o6N22n44L36n8n8J15PJ15j4K4Q6k02Qp2J74k94
2012a14K63k69j97J00Q7J75K30l48%j37J20m0j40Q7M1K52j37m0P8k13J71jPL0
$$ y = [395, 54, 78, -22, 109, 209, 85, -4, 168, -4, -194, 29, -259, -200, -501, -322, -257, -218, -236, 88, -176, -347, 83, 273, 186, -63, 34, 205, 49, -22, 216, 171, 249, 66, 160, 129, 224, -142, 318, 63, 14, -137, -18, -90, -234, -20, -77, -207, -245, -205, -379, -214, -108, -152, 24, -327, -123, 30, 255, 290, 144, 127, 199, 183, 126, 223, 134, 342, 63, 20, 140, 154, 90, 327, -192, -17, -273, -71, -235, -267, -189, -261, -260, -223, -91, -36, 277, 165, -236, -6, -8, 65, 188, 76, 365, 80, 51, 501, 78, -25, 206, -91, -146, 22, -275, -68, 37, -99, -87, -357, -22, -281, -306, -258, -185, -159, -141, -226, -126, 185, -336, 152, 86, 142, 1, 204, 150, 335, 79, 165, 252, 113, 309, -150, 58, 116, 223, -74, 120, -240, -244, -292, -20, -202, -178, -323, 16, -193, -259, 263, -281, 55, -3, -61, 54, 61, 176, 162, 186, 272, 70, 78, 6, 180, -114, 149, -120, -317, -217, -130, 45, 275, -73, -73, -210, -90, -130, -270, -183, -142, 110, -27, -67, 11, -202, -31, -32, -25, 5]
2036EL19o3j41Q8r7R8n1m2j11J50k37q7P6q6L7m8J14j3l07J36J68Pj5J13k5R1
2062G9q7K37j53J55M4k87K17R8o32N08J22j5k53j79K92p7pj15k8Rk15K50J14k20
2086a43j9K18k60K6NJ34J30j01J7J22k31Q0M08l32J34J76m05K07j91J84q1J5j56
2109f3j10M7J63j16M5L16m78j4K08j95n7J37J54m4j71J24K83k86J02J13q3J12
2131A87k24K84n3j19j58K38j88N5j05j7J70j63J3O0o0m8j15J33RO2J21j40l6K80
2155A86l17K19%J23N7r7k02L94l30J77rj98P1j95J86k96R4J86j99R5J91l15j7
2178a96O1P8O5j55j3K33M3j46j72J80R7q4K33n4k31K39p2K62l80l8L4J80r5l26
2202b57L45O4k39N2m6l9j74R8K24k09K8p0J60J8L31l09j37k6J2O9N0L5J28j63
$$ y = [5, 324, 261, 120, 208, 111, 209, 158, 116, 5, 155, -82, -169, -93, -179, -142, -190, -76, -89, -396, -260, -92, -85, -100, 13, -12, 79, -8, 229, 76, 231, 275, -12, 205, 303, -329, 179, 301, 286, 33, -146, 146, 69, 62, -53, -81, -72, -287, -37, 77, -143, -162, 56, -204, -178, -173, -39, 91, -10, 7, 129, -102, -22, 386, 54, 188, 364, -41, 166, -25, 159, 78, 93, -63, -173, -126, 37, -79, -34, 282, -196, -210, -2, -197, -254, -117, 37, -7, -178, -54, 229, -57, 45, 158, 75, 187, -37, 247, 194, 75, -83, 155, -33, 22, -83, -100, 70, -93, -80, -20, -80, -128, -243, -110, -101, -39, 82, -58, -94, 186, -131, 88, 88, 211, 268, 171, -31, 363, 33, 210, 201, 3, 74, -121, 65, -231, -137, 49, -150, -55, 136, -179, -196, -135, -57, 8, -147, -160, 73, 116, -30, -202, -22, 75, -9, 224, 170, -61, 178, 106, 368, -12, -50, -16, 164, 69, -257, 88, 152, -87, -35, -81, -120, -294, -196, 28, -181, -153, -223, -63, -45, 286, -23, -160, -186, -174, -105, -55, -20, 108, -55]
2226e5M4K33j46o4J44K17j77j47o9J77j31k89m4L96p7j63k66L97l91K06L45j39
2248Al5j1J7p5J89j99M50k7k61J24k02J45J46l82J77K5j57M5k67R1J95N2r5j00
2272a54o1J76K5o4j15J30k12P5J4L26j79q2K01q9K54J13p4j39J21j53K24rj68
2295A60N6k32R8k00K26j43o9mJ47n06L92l8MJ3M7L8j0r0J8L8J16k15L98l12M48
2320C80j95N9j71j70M37j04qj45P3l16l0L21K07m36p3J49k7l38L23j4J05m30K30
2343a73L1p0k5K55L4m2N7K02m9k8k80L35n3l00K93j74K66k08J8R8j52l24K57m2
2367g4J8J18n5k01j5J87K30k24n7J23n1pN7Kj80K32n4K38j24J06k66J27J22k38
2391A4Q2L1r6l63M78j63J88k24j26j99M48l63L84l29K29J86k46p7K14M3j17N0
$$ y = [-55, -11, 222, 76, 12, 156, 373, 196, 49, -20, 157, 26, -263, -307, 89, 12, -151, -417, -20, -411, -205, 140, 1, -34, -45, -28, -103, 86, -113, 337, 310, 49, 173, -29, 116, 262, -120, 57, 82, -75, -30, -297, -206, -11, 41, -54, -154, -215, -39, -14, -78, -193, -63, -275, -200, -186, 140, -39, -121, 80, -9, 245, 358, 284, 145, 266, 113, 337, 328, 160, 216, -16, 82, -118, 108, -35, -104, -108, 39, -467, -75, -113, -109, -96, -49, -11, -21, -111, -93, -55, 61, -154, 244, -68, 380, 185, 244, 73, -97, 340, 236, 228, 83, 156, -160, -190, 131, 338, -98, -171, -22, -49, -387, -64, -78, 27, -403, -173, -142, -212, -237, 18, 52, 10, 67, 269, 220, 192, -88, 247, 194, -106, 187, 13, 279, 71, 89, 187, 35, -289, -32, -74, -56, 62, 7, -194, -209, -22, 208, -16, -73, 50, -1, -8, 49, 51, -129, 103, 49, 287, 163, 269, 3, 130, 252, 14, 96, 127, 31, -332, 146, -17, 171, -53, -179, -378, 70, -293, 91, -238, -9, 177, -69, -146, 68, 111, -6, 44]
2413D4J22M0k18M15k69JM1p3P3M8j2l17J34O3r3K0l54K09j38K45j09P9j32J49
2437c2j86J7J32j73K38n6L87l09N9p5J37k8K2k41L35j86Ql6l6K64m61K48J10k82
2461a44L1L2k41M47j39k20K82l01Q5K39j17N1O9n4N6k00K05R2k6j41n8L9M1j0
2485A8J16m7k19N4n4r9L12k05Q2Qk1j23J49n07N64p4l12L40l09M63j61J57p8J17
2509A71j13K9J4J48k29j75J49K34j53P1J32k97j40K29oj65J69j82o4r2K57L1k01
2532a83K30j50J18J92l45M5K75k04L23j59J11m2k2k21J52O4k19L0j04J13r6J32
2554D0k92K27J85k17qn4N9j00k1J67j07p1K11K1J73k47P8j47L60k13N9K08l02
2577IJ58k6k8j95Q1J78N0q8l09m4o3O8k7K27o1l8m2L31l37Qj35J39L25m19L14
$$ y = [44, 166, 206, -12, 403, 134, 135, 176, 103, 176, 224, 212, -105, 29, 92, -1, 19, -335, -126, -264, -19, -128, -49, -181, -32, -218, -201, -69, -242, -4, -60, 327, 18, 77, 2, 139, 111, 133, -108, 227, 41, 49, 13, -23, 241, -220, 28, 138, -144, -113, -81, -322, 125, -14, -234, 48, -253, -168, 71, -46, 5, 74, 20, 76, -124, 81, 173, 147, 6, -52, -13, 28, 18, 134, 87, -132, -78, -132, -231, 81, -124, -42, -34, -55, -178, -29, -536, 28, -46, -358, -18, -327, 136, -25, 132, 54, 171, 58, 87, 101, 249, 20, -155, -6, 228, 75, 146, 278, -19, -159, 70, 64, -101, 68, -114, -178, -270, -13, 18, -183, 47, -103, 15, 207, -138, -93, 182, -22, 301, 142, 253, 211, 189, -32, 120, 184, -35, -5, -109, 4, -92, 40, -252, -25, 160, -57, -65, -119, -60, -160, -181, -14, -121, -192, 19, 40, 213, -34, 44, -103, 257, 44, 103, 311, 9, 167, 141, 113, -82, -1, 177, 227, 139, -170, -214, -277, -209, -236, -9, -70, -108, -150, 181, -156, -148, -283, -144, 181, -238, 76]
2602G6J67Q7m69L66k60J00J35j16j62J27O5k09j0P8q4j57K29J53l4j91K2J76n3
2625C6j93k0K15j16l8n7PJ34j63L43n2k46R3J98K3j03R3Nk55J5K08J47j37m78
2649c41K14K19j49K70k06k92j64L04J80p6K81j77j01lJ14Q7j28p5J7L79k65l2
2671E6n3M08k92P3o5n8J40k56J56j66P3k58N2j46j87N95k96J61k31L83J5L0j73
2694c9L7J37m0J32m37J00M64m27R5J34N3j0r6n7J13k9r5J59N4l18Q8m0j05Or9
2719b20J51J19l36J65L41m12Q6M75k87k2R9k66K91j61l1J35R8k7l26J81L21m48
2741g4M0j0nj07J1P4k40N9K11n9K37k08J80m37J44K81k53J76J85j45L0K1o0J45
2765A96j36j6n7K15j0j59j35N6J29L3l0n31J65N14j91q9J9j56J86j7k28QM77j33
$$ y = [76, 243, 330, -139, 227, -33, 67, 202, 86, -76, 51, 116, -93, -103, -25, -109, -266, -37, 116, 82, -109, -87, 89, 36, -157, -177, 38, -78, -116, -173, -166, -32, -195, 148, 96, -150, -57, 141, 164, 61, 154, 159, -96, -81, 127, 274, 137, -341, -127, 92, -57, 213, 7, -285, -449, -145, 35, -41, 240, 63, -38, -41, 73, 160, 32, -43, -26, 353, 88, 56, 3, 411, 119, 192, 127, 69, 209, -47, 109, -57, 16, -242, -190, -336, -523, 72, -224, -63, -294, 89, 104, 134, -39, -2, 135, 95, 227, -210, -110, 354, -73, 22, 156, 209, 199, 103, 46, 159, 130, 35, 194, 248, -70, 18, -22, -127, -121, -220, -69, 50, -286, -121, 220, -192, -106, 369, 82, 60, 159, -107, 184, 23, -8, 127, 225, 198, -128, 53, 374, -74, -34, -44, -49, -156, -145, -71, -311, -252, -41, -100, 137, -71, 109, -328, -184, 97, -156, 20, 205, 60, 90, 111, 51, 196, 60, 44, -13, 202, 192, 33, -102, -46, 83, 116, 86, -445, -280, 234, 43, -46, -27, -183, 3, -14, -242, -234, 243, 110]
2789A10j67K46Q3j56j55L97k54k92K69J84N8m57P3j0q9L07j95j38J63M8j53J20
2811hl7N0j97k95M84k31O3J48L90Qn06jL21k73K65k7n2J6j79N22p9m24O3K53n53
2836b79J88k45L12Q5K0j88K15k5K5Np4j46q1NQ4q3J38j78K94M5j08j97K22N0M8
2861A32L6j41K64l32Q4J6k66J85K80l36J60j10L0j51J38km6P0p4k0J24jk4q8R7
2886B5L4o3M7l2J56P0l84K82L5k16K23j70M18k39m03J77J4O9M7k80K27j33j04
2909b00K01J03k8j70q2J98m4K4o7L07l4o6l1L3k16J28P2q6j83K23l58J74K28l36
2933b10J88n3J08l6j26N2N4j2N1o1J57J64k74P3L9k11m1j38L74K9j0J3j69K86
2957B47l88K81j04j09O5k63M66k38n5R8M1p3o5n3L3j34J29J2N1j4K90j24k46M94
$$ y = [110, -57, 189, 272, 116, -39, 358, 104, -188, 81, 265, 323, -134, -61, -71, -160, 147, -48, -186, -23, 25, -128, -8, -45, 5, -192, -487, -3, -234, -171, -23, 367, 375, -131, -132, 189, -84, 181, 154, 102, 118, -61, 461, 382, -42, 21, 274, -279, -91, -336, -24, 61, 81, -107, 108, 83, 108, 113, 39, -107, -188, -183, -99, -182, -44, -222, 72, 117, 9, -188, 34, 84, 132, 168, 27, 291, -41, 43, 59, -207, -22, 258, -78, 82, -28, 2, -149, -11, -13, -59, 11, -63, -83, 41, 40, 16, -72, 25, 59, -4, 43, 11, 167, 237, -147, 135, 170, -46, 177, 7, 425, 186, -217, -40, -26, 43, 90, -190, 37, -96, -200, 1, 104, 76, -94, -176, 22, -22, 2, -65, 242, 208, 142, 111, 144, -72, 56, 128, 42, -141, 82, -276, -102, 126, -210, -22, -75, 33, -3, -129, -77, -23, -35, 16, -45, 112, 276, 2, 75, 114, -97, -138, -276, 98, 127, 117, 130, -39, 247, -141, 140, 36, -73, -8, -271, 195, -43, -98, 0, 41, -32, -97, -150, -117, -251, -122, -110, -59, -73, 217, 93, -153, 341]
2981C41j37k55L3L72n01J85l0O7n9p2R8q1J41j9l06K28j12r8J93J6j98J91k00
3004b03O2J22r8J23l39L37q9J37J21k70K19J17l31L77l26L21j20p5J06j31Q3k75
3026a32K83p8k51j1L8l0J24J80q8o3Q2qk17J57l45L51k97J79K09J03j31J72k39
3049a2j54K44l7p8n4J61Q7lj07J94l90Ok0J06O8j05l5Mj9j37J52O0M5j07Q0J31
3075H0Q7M8j39j07P1O0K4k88K54RO4k48J87R0j23R8k06j15k7j0K22k58J08M9J15
3100D5k88K72m9j57K04j30K40O1l43K44RK03l06J29Rn2M6K1k21J08j91J38K84
3123B76k99l2j21L09k23K6k96O7J29Q6M65k63k14L9M8j2K6J97l37P3Q0P7p3j69
3147a41J44Q9K8j48K4K28K3l37J31jr4J4k16qL97j48j81Q6N4J38j01J59k88J76
$$ y = [341, 204, -51, -18, 354, -147, 38, 8, 75, 16, -56, 42, -39, 102, 83, -223, 5, -107, -205, -12, 4, -194, -3, -203, -141, -19, -117, 6, -333, 4, -85, 52, 173, -97, 122, 239, -92, 285, -41, 280, 160, 85, 191, 60, 143, -132, 151, 73, -178, -189, -151, -181, -57, 123, 35, -28, 54, 46, -171, -14, -359, -8, -305, -126, 83, 186, 55, 227, -12, -166, 78, 41, -37, -91, 70, 157, 154, 47, 241, -149, -143, -163, -57, 11, -94, -129, -125, -144, -281, -129, -69, -24, -131, -51, 80, 167, 215, 76, -31, 40, 100, 124, -164, 90, 99, 163, -85, 102, 192, 69, 167, -39, -154, -181, -191, 31, -227, -119, -70, 45, -243, 29, -20, -177, 27, -103, 137, 198, -145, 99, 108, 311, 5, 134, 143, 91, 137, 158, -63, 45, -146, -8, 276, -23, -55, -176, 133, -90, -64, -360, -293, -164, -78, 387, 124, -90, -51, -3, -15, 11, 208, -129, -56, 24, 101, 28, -141, 3, 92, 120, -28, -4, 224, 247, -90, 41, 40, -54, -40, -256, -264, 133, -15, -196, -110, -56, 82, -19, 140, -148, 28]
3171B8jj59K24K37k28r4L45k80K70k75J16L6l60M2K84k74P2j25J19k16P8k5K3
3194a63J10L5K4j24J15J2j7j13K78K19m13P0M5Q6k07J35j26K25r8q6M1J0j97j17
3218b56K58k8q3L5k0K07k11J40j00J91p6N8l3k74L83l8M0k6k19m8K04k1o7J02
3242A18P4m8k06p1J32k00J61K30l83K98j48j15l4J89oJ32k70J89j46J85n7j06
3264h2j58K98P3j36K0r8L44m38Q9P7R4L6j13k8k8J76k94J69J16k96L6J39l17K53
3288f8J50j44R5j99J03n6L64k10K3o5J78l34J63Q7k05K42j43n9K44j49l8j73L90
3311A96l0k34J53l20J69j31R0k1k5q7K39p4N2L26m49J08J97k96Q9L13l51J95m3
3334F6l4K01k73K7K30k73j3J13Rk5j75r3L09j31kP3k19J83q3K60l20K42q0K41
$$ y = [28, 27, -132, 92, 329, 101, 7, 352, 72, 342, 67, 183, 219, -141, -99, 185, -89, -17, -142, -23, -239, -161, -186, -163, -53, -18, 6, -118, -3, 9, -8, -121, 157, 376, -37, 33, 78, 164, -43, 92, -34, 191, 93, 7, 48, 58, -139, -256, 2, -26, -109, -74, -94, 113, -98, 42, -58, 133, 57, 115, 82, -192, 191, 153, 193, 167, -52, -100, 104, 83, 16, 118, 192, 144, -62, -133, -1, -201, -40, 190, -193, 105, -43, -158, -192, -3, -9, 123, -147, 42, -104, 81, 24, -82, -240, 58, 131, -5, 15, -83, 261, -177, -88, -11, 83, 119, 6, -22, -50, 126, -168, 1, 117, -179, -143, -4, -321, -68, 82, -62, 33, -166, -63, -119, 245, 35, 58, -7, 171, -163, 0, 87, -118, 124, -19, -78, 166, 17, -21, -194, 196, 166, -68, 85, -235, -66, -197, -107, -128, -153, -240, -1, -75, -23, 303, -146, -38, 159, -137, -48, 265, -86, 109, 66, 32, 233, -40, -13, 217, -56, -69, 44, 53, 28, -147, -240, 69, -62, -64, 9, -210, -27, -110, 150, -170, 72, -8, 233]
3358B33j63M1l53J90K41l02l2J63L34m21L38k05N0j11N8k12m5J53lM1p7j1k35
3381c28M29o5j51J77Lj7J1q5j92K69k45K47P3k91L08k1j83P8l5O5J1J0j13j91
3405b36P8L29k70J90Q4j32m2q6Q7J3j12K0R1Q1j10j86M47k51K19l44J84K18j54
3428A18L6N7j69p1J02j41K21j74k28M12k56P5O7l8M9j51j20j09K70m3OR7J0K6
3452D6Q0k77QO5O1l9Q2n8j09N7J15K88j40j88q6J38N6k25K09J89j96l59j6j7K64
3477e2Kn2J82m21M75m7j82L1oK08P0l49K47j61L01k62K0m3J31q6L20k66R1j65
3501a4P4j20L7q5r8J44m5J35j74J81j3KLj7P6p6P4m2j35L4K08Nk09O3J94k10j08
3528a16J26o9R8J04J03j59r6j55l9K88q8J28l1k13M7R6j90L44l01ML22k75K08
$$ y = [233, 70, 111, -242, -52, 189, -113, -145, 18, 352, -69, 269, 64, 114, 3, 61, -151, -196, -43, -46, -5, -82, -93, -328, 101, 36, -115, 62, 65, 48, 59, -26, -218, 51, -194, 53, 126, -165, 143, 122, -61, 17, -18, 47, 58, 68, -45, -236, -158, 171, -99, 91, 175, 43, 1, -85, 2, 15, -97, -77, 14, 95, -15, -201, 246, -5, 214, -130, 54, 272, 118, 154, 211, 42, -29, 73, -68, 153, -21, -249, 163, -93, -18, 49, 11, 60, -91, -211, -320, -50, -93, -87, 10, 20, 46, 126, -151, -143, -78, -17, -56, 26, -32, -141, -84, 31, 319, 179, -9, -95, 43, 99, -126, 83, 272, 76, -283, -299, -316, -52, -50, -102, 80, -341, 134, 87, -95, -64, -70, 138, 208, -141, 106, -55, 246, -16, 4, -39, 92, 6, 326, 60, 151, -14, 60, -60, -23, -108, -206, -62, -107, 28, -146, 35, 22, 24, 27, 10, 86, 10, 84, 42, -93, -59, 149, 154, -55, 8, 202, -8, -116, 10, -59, 39, 143, 246, 87, -9, -164, -203, 85, -3, 125, 94, -119, -72, 24, -166, 178, -123, -119, 203, -72, 136]
3551A36J1k32K0K05Jj16N1m6k82Q1J54j87j7K23n3k9k01K97l66L27M2j10K9J94
3575A32O7k37J81l60J82J75k53J13L2j51J85J21j36P7n1j61L66k13j5k32K03q8
3597f3J54l03K64O8m45L38P6j34N2j21m6L02qj48q7J3N3k3J20K05j54P8j11j76
3621i6M28j56l40K08K06k53j78j85M49n0k98P6K17J1j51J00o3R3j01J47n5n7O4
3644A6K1Q9j65r5J11j11K51N0lK9P4k41r9J09Q0j11j68p0J15j4J43j67J50q4M2
3669d8J2r9Q0O4J56p2p5p3l7P3O6Q1p2K65j0m15J78k1J28o8o9j99K87r8q1J38
3695I1l10K40J87k37J8m19M97m3j70J0rJ24O8k4N4K20j51K5K7l55K00q2o6K48
3719A43j14J03k3k42L23k04K56j23N3l00j15j9L84r7l10L19k3k10J84op0K79l84
$$ y = [136, 147, -85, -65, 140, 141, 25, 76, 30, -252, -171, -17, -204, -221, 2, -51, -80, -281, 16, -350, -23, 19, -91, -62, 132, 199, -38, 143, -217, -35, 140, -113, 0, 32, -119, 66, 187, 51, 128, 77, -84, 282, 69, 54, -178, 25, -63, 91, -212, 52, 120, -325, 13, 89, -45, 7, -114, -160, 142, 134, -14, -101, -88, -35, -58, 62, 267, 113, 191, 80, -96, 332, 176, -164, 44, 250, -3, -181, -366, 83, 33, -265, -189, 28, 39, -112, -12, -75, 18, -83, 64, 9, -48, 16, 37, 126, -39, -134, -23, -134, 117, 167, 164, 193, 267, 26, -73, 36, 116, 5, -163, -233, -118, -132, 11, -156, -6, -90, -48, -36, -135, -55, 9, 165, 93, 18, -55, -92, -19, 47, 128, 56, 321, 311, -104, 74, 53, 181, 113, 44, -155, 132, 34, -47, 91, -219, 21, 208, -29, -11, -430, 67, 24, -146, -136, -145, -21, 47, 23, 77, 297, 146, 171, 198, -157, 43, -39, -105, 143, 29, 132, 109, -133, 190, -14, 242, 119, 172, -128, -243, -262, 122, 25, -285, 34, 11, -199, -15, -21, -91, 188, -196]
3742a96J83r6L78k17k38J67L9J9M7O7k51K99o4q0k4l07R9J30J71j60qO4j55K65
3766A32O0l13J03J20J81l52L76l68RJ40Q3m08K57K5Q5NJ16l69K83k0j66j29M6
3789a04N9q8K06nk47J36j5J19j7q7k43L87P3m5j16kj06J20K75l14L71m31N4m9
3813f9J49l37J67p6L23Rp7k36P6j68K25J2N8l05J32Q6J46p0k53K05Q1P8q1jm0
3838C4J11O3k09k85L92j59K53j14n6l69M18j61P9j15L7j3j23N1j74K54K06j75
3860e5J04K38j24j69J02K97m27j01K33N4o3k54J99Oj2Kmo8J15j64N9J13mp7J79
3885A79r5j26j13J31j02L2l2J46Q2r9j31J34j56J26J01j77R9J72q2n1R4j91J01
3908D2l5R5l29J85J0p5J26k8Rj19K29k50Q5j5K33n06K11J81K8R7k27J22J17k94
$$ y = [-196, -13, -109, 269, 52, -186, -19, 20, 39, 86, 153, -98, 201, 137, 57, 33, -274, -175, -45, 126, -34, -42, 22, -133, 132, 192, -121, -18, 102, 283, -69, 307, -61, -52, 88, 171, -237, 20, 45, 130, 135, 251, -118, 165, 145, -21, -150, -104, -45, -133, 73, 68, -179, -43, -58, 61, 44, -43, -286, 101, 174, 129, 13, 11, -95, 25, 300, -14, 357, -74, -20, -69, 80, -257, -90, -166, 157, 166, 89, -147, -71, -239, -14, -2, 56, -249, -117, -31, 115, 45, -208, -3, 78, 156, 75, 74, 34, 145, 208, -1, -286, 106, -53, 200, 86, 30, -339, 79, -82, -3, -118, -81, -94, -217, -166, -340, -86, 120, -55, 49, 287, 163, -6, 96, 393, -34, -135, 98, 152, 89, -165, 34, 40, 28, 30, 26, -42, 73, -91, -32, 81, 77, 0, 179, 84, -42, -155, -24, -126, -94, -126, 20, 102, 3, -128, 6, -150, -24, 77, -100, -1, 171, 89, 38, 132, -59, 42, 7, 102, -227, -42, -32, -107, 19, -9, 0, -119, 110, -140, -55, -70, 163, -343, -132, 49, 77, 174, -53, 69, 186, -108]
3932a08K95o1j19J59l11K08K5k45P3O5k1l7j03J07j54qL14j30j67J17K24j16k62
3955b55K35l7MM3M4j09Q4J2J37k57M2J95l8j63N1MM6J11k15M3K63j97L9J5m4k02
3981a49N7J36k56J55q0Q3pK49l63R1L1j5m7L6L12k8m3N9l18J89k30K72j87K53
4005B00l14R0l3J15j99K82l10n8R8O1r4K46j6L21m94K36pk61K78r6N0k62J51J09
4029I3J56j0k56K43j93L9rr3J05j38L2k51K42r2p9K3M9J06J89j70q8L4j87L27
4053G2k86K76j52N4L10p9K8k47N1n4R6q2j5kj73K27J55k06j29o2J86N0j07K28
4077A39l93K32O7j36qo0P2J8J3N4j12K73n7k54J97J56l12K29k56J85J32j76N1
4100E4R4j75j47J56n1j28K15R2j6r9j37J3O9q2K78q0m2K37k56N7n4j10n1m4J76
$$ y = [-108, 187, 126, 7, 166, -145, 63, 88, -157, -84, -19, -40, -77, -180, -73, -227, -235, 79, -51, -218, -101, 123, 7, -255, -20, -57, -53, -10, 34, -75, 9, 21, 158, -99, -57, 138, 100, -63, -12, -8, 38, 149, -66, -23, 240, 43, 82, 97, 53, -149, -92, 44, -212, -57, -137, -54, -61, 188, -175, -84, -53, -68, -115, -79, 233, 205, 162, 221, -97, 92, -138, 134, -53, 200, -114, -24, -57, 58, -141, 141, -169, -227, -129, -68, -162, 84, 68, 389, -105, 131, 124, -137, 141, 45, 95, -167, -16, 93, 249, 239, -17, 226, 33, 72, 63, -30, 75, -63, -31, -282, -40, -132, -211, -188, -139, -33, 156, -14, -102, -68, -255, 72, -214, 62, -90, -36, 274, 195, 223, -24, 27, -27, 69, -13, -28, -30, -203, 24, 179, -27, -156, -218, -32, 18, -89, 139, -254, -22, 45, -91, -99, -159, -87, -69, -56, -2, -114, 159, 102, -152, 45, 201, -111, 118, -138, 47, 179, 3, 54, 148, -27, -174, -18, -69, -197, 18, 110, 94, -5, -142, -129, -60, -142, 136, 56, 14, 251, -5, 52, -2, -112, -163, -207, -31]
4125c1Rj19L31j88N6k30L21j34R1j25j07J02J12K5j62r3J44j58k1J50j06J72j58
4148a19K1N53m93m0R9k94K30J94k03PK47j59J1m1j10M5J0M0j51n9K41nj06L2l7
4173h7R3J31k31k4J67m9m9L69l52K19l56K17Q4Rp2p0J11j83J49j4j52N9J87k06
4197e0J0J0k20K60j95J50J3O8r6J12K00L6l12M9O2N9k7k24O9J45J20j41J38k42
4221fm1o4K91m5p9Nl2m3M4K90k39j09m89M52J47k3q2p6J09r2k10J82M8J93k12
4246h1L47l76J33o1J36K46k96J40l33jM00l59J80r8J67p3j41m6J35J4rj41K8J5
4270g4J6j26M5K39k05O5J39j80K45k8l71L98j75J18L4k20L13p2k75l9K92k36J0
4293h7L8J22k77J72J03j55K94k07j68k2J32L97l23ok4J21j63j0J70p8j77K22R7
$$ y = [-31, -22, -141, 190, 2, 58, -172, 149, 15, 106, -19, -126, -24, 88, 113, -49, -142, 2, -156, -177, -27, -133, 39, -119, -98, 455, -38, -78, 21, -273, -43, 151, -52, -45, 202, 43, 54, 13, -97, -52, -42, -2, -153, -212, 29, 24, -82, -50, -87, 6, 137, -94, -118, 49, 0, -49, 320, -32, 187, -169, 48, 132, 141, 69, -1, 110, -73, 76, 62, -90, -31, 156, -50, -40, -30, -250, 10, -185, -35, -22, 46, -50, 62, 262, 298, -14, 35, 97, 156, 129, -95, -26, 119, 239, 98, 236, -6, -47, -111, 180, 135, 56, 61, 29, -14, 30, 320, 81, -28, -517, -65, 82, 59, -23, -99, 10, -82, -292, -110, -62, 131, -81, 266, -110, 23, -38, 98, 344, 48, 188, -145, -146, 254, -105, 75, -23, 144, 71, -70, -116, 19, 33, 24, -117, -89, -74, -58, -184, -139, 100, -105, -40, 99, -81, 164, 136, -235, 163, -12, 106, 140, -80, 233, 161, -114, -153, 139, -97, -87, -49, 73, -204, -32, 71, -84, 210, 3, -165, -187, -55, 342, 19, 13, -11, 110, -53, -63, 107, 29, -148, 74, 171]
4316A71j39j38L6J55j0j21k4J8j8J16k36J95j17N8J66k68K73j90j89L22j00P9
4338C9rJ43j20K30k63O3j1q8J80j82JJ96j94l8NK6n3K23P6k84J54j75l1J30Lj70
4364a49K81k60J26j06J41J1o9L8J07K56l67L7j71O4L73l55j9J81j25O9k64L9J00
4387f2J77m03K37M3P4k46J41kO9pO8o8j86K82k70K58Q8l41R8J73n2M6l76M23l00
4412a36P1J16j95J67K14m11J32M0o8P4k13J93j46j51M61J8m39L02j21J62Rj58
4434g9O6l4J27m3j8J40j09J47%k8j64K8l4J60k1k64k34K53m3J55M9j6o3j17J0
4459a32O1j85J15K06j35J08k42M55j15k39L07j81N5o3N9m0j3l5J57k18nJ42j11
4482d9K60n5j32k79L59l56M85j20n05M99k60J01q1J73j29J09L0j43o8P5K5N0J37
$$ y = [171, 32, -106, -70, 85, 75, -46, -70, -52, -70, 46, -190, 5, -112, -54, 112, -156, 117, -73, -262, 60, -40, 39, 30, 173, 53, 283, 20, 83, 72, -16, 164, -18, -17, 179, -15, -53, -48, -22, -75, 148, 224, -60, 94, -81, -112, 18, 21, -149, 132, -128, -2, -108, 33, 44, -25, 13, 120, 376, 9, 46, -125, -61, 312, -43, -62, 119, -6, 63, -201, -162, -62, 115, -288, -51, -8, 66, -180, -39, -41, 28, 21, 89, 21, -165, 117, -153, 105, 193, -148, -50, 123, 71, 117, -259, 164, -136, -65, 51, -144, 23, 237, -174, -42, -2, -70, 4, -209, -16, -162, -313, 148, 166, -273, 29, -92, 70, 79, -79, -13, -47, 80, 37, 19, 159, 50, 197, 197, 169, 5, 33, -1, 159, 138, -126, -360, -107, -150, 5, 54, 38, -25, -142, -132, -71, -256, -141, 65, -70, 38, -204, 251, 136, -103, 204, 23, 78, 15, 74, 34, 21, -14, 143, -75, -80, 62, -49, 211, 156, 24, -255, 104, -252, 233, 113, -392, 107, -153, -52, -133, 40, -89, 20, 50, -93, -161, -86, -61, -11, 126]
4505A26j46n5j0L66k02r0J74o6j00R1J63l33K06l4j43l5Q9q3N9q8L7J19j40J87
4529I2p6r8M8lj4J48J31q3Q9l09q6L95l16l3K75R2k3k82J87l25k1K27o7J49k81
4554a84R5k84O47m40mJ5K22p9r5K88Kn9j58K09k40J68p0j06J57j76m7K56j37m9
4578f9K31j65J22j57L8R2l15K14j44r0L79q8j00L27j74l58K00K45j73J22%j28
4600Ij28R3K11k45K16p5Jj28R7k62J96l4r1J24J63j97K7l2K28k34PJ45j92R1J34
4625A24j17l6J63J09N3k99L8K56j88J6J8j25rj2j49J91q0J99k85K36k3p5j78K46
4649G3J93k51P0M5j09j11L64k96L41k35k9q8O7M4P8Ml68L09o2j52M16l38j51J5
4673a71J67j55J05q7O3j39J9K37r1j23J89j19L1J13k36L37j59rJ47j51O1QJ51
$$ y = [126, -20, -75, -85, 281, 79, -11, 163, 97, -3, 88, 251, -82, 124, 90, -53, -88, 1, -82, -23, -111, -74, 45, -95, 92, 16, -82, -34, -37, -51, 97, 228, 145, 234, -75, -161, 234, -82, -115, 160, 252, 229, -53, 134, -191, -212, 15, -52, 97, -184, -89, -373, 274, -166, -170, -155, 67, -12, -107, 181, 183, 124, -34, 175, -65, 103, 33, -73, 84, -92, -139, 117, -20, -69, 162, -3, 119, -38, 0, 92, -223, -9, -153, -243, 136, 48, -52, 275, 101, -257, -57, 188, 15, 137, 137, 9, -119, -26, 185, -60, 156, 81, 82, -46, 51, -211, -15, -49, -140, -16, 147, -50, -23, -55, 173, -61, -54, 91, -101, -10, 124, 7, -29, 134, 243, 296, -3, 35, 291, 103, 119, 137, 12, 3, -9, -158, 33, -47, 152, -133, 103, 80, 5, -173, 73, 266, 15, 85, 130, 21, -90, 274, -22, 319, 84, 55, -33, 34, 78, 156, 160, -208, 101, 39, -113, 303, -35, -186, -171, -4, -159, -54, -141, -78, -217, -198, 39, -52, -175, 14, -105, -74, 39, -197, 140, -19, -28, 119, -32, 29, 37, 188]
4696A88j60J96j90J94k18K39k56J02J18n32N41k59r4J10k50qJ28J02q4k2q1N5
4718a81Q5lO2Lo6J44j12o6K32R1j21O9k07J66l7j34M2N9M1j05o8K60k48K16J6
4743A38j15j76K46l2j74j63K27K25l00K49Nk21J48j54J81n4q6J47o9r1Q8q7r3
4766a61J35p1J41j65O6J93kk19L3K57n6k38J05nL19l11p0j31J67J27j85m8K67
4789A48K1j37p6P4j17K01J23j19k33J53j94j23j13N35l73K86O7j85R1l4P7l4j03
4812f5K50j45J43j27n5L2J6J8j9j38j83J58J41k74J79m8J55k30K42j62M4J91k12
4835h9P9p3J8O3j28J80j25J32m7J51K0j41O2j31J76l48L73k83J72J57O4k63r1
4858g2K19j51N9K13j43oJ9k19P5k6m6N9k19J54k5L11l5k13L3o5Q3J8M8J36j84
$$ y = [188, 28, 224, 34, 228, 10, 249, -7, 95, 213, -319, 222, -37, -131, -21, -271, -279, -151, -49, -133, -155, -236, -181, -96, -99, -37, -34, -100, 44, -68, -134, 98, 189, 68, 137, -70, 96, 59, -75, -33, 26, 67, -38, -106, 154, -94, 122, 138, 23, -153, 93, 61, -113, -276, -49, 176, -124, 125, 130, -91, 57, -97, 84, 30, -56, 91, 22, -69, 19, -68, -161, -26, -97, 44, -121, -55, 138, 136, -83, -50, 207, 151, -87, 18, 13, 332, 21, -49, -180, -13, 114, -71, -119, 148, 169, 32, -44, 30, -87, 114, 237, 118, -115, 38, -156, -279, -392, 143, -230, 56, 123, -62, 29, -5, 72, 38, -65, 185, 40, 183, 56, 1, 33, 49, 67, 48, -90, -273, -115, 26, -248, -69, -117, 38, -192, 50, -112, -68, 123, -89, -10, -83, -65, -2, -130, 50, -75, 57, 10, 161, 181, 40, 102, -29, 147, -201, 172, -111, 61, 218, 282, 19, -72, 147, -4, 55, 268, 125, 119, 138, -81, -6, -32, -78, -19, -238, -84, -109, 202, 167, -46, -13, -78, 5, 23, 71, 207, 23]
4883B3L0M0j55J28k55J26J50j05J20l63K17o2j16L14p4L0k87K27j3J45P2p7o7
4906D8j58M8q0o8M95l50L07j54k12l0M3K87j59Q1M6r6q7N7R6J38l42kJ30m7j3
4931b2J06l17K22r1j68K73j97K54r4r1Q0R4j83R4J39j38J61k8J80l44Q1K3l0M7
4955E1J09k05j35KQ6j68L33J8k06K68j53j07J77j66O3j4R0j24o8L20l46J8O6K54
4979A63k99L05p7j94k35L33k98M68k20J02O0p4k28m9L34k23J45J51j25K37j34
5000A42j29Q6r9Pj7K08k18k5J96q2p2j71J50p8R2K4j72K49l02K57o6J39k43n3
5024a77L9J97m7N2Qk7j32K42m1j41r0L86l1m0n9k44K03q0R5j06O1k33O1q5M56
5049B67l31k9K36j13j61R3J86m84L49J02j78J01j64J11L0j40K90l01K00J69k94
$$ y = [23, 53, 93, -62, 66, -189, -63, 87, -18, 102, -261, -44, -106, -222, 92, 18, 48, -239, -12, -25, 120, 192, 115, 48, -110, -62, -142, -210, 285, -65, 242, 88, -124, -154, -111, 176, 17, 98, 144, 48, -39, 18, 114, 252, -90, -92, 38, -9, -22, 84, -233, -11, -102, -270, 3, -194, 60, -34, -125, -45, 49, -134, -40, 99, -39, 122, 94, 274, -70, 11, 34, 4, 51, 160, -45, -180, -178, -92, -260, 73, 91, -115, 153, 0, -107, 70, -96, -33, -47, 43, -81, -149, 171, -175, -157, -91, 163, -136, 169, 92, -102, -337, -4, -302, 166, -54, 48, 108, 34, -194, -243, 91, -132, 13, 164, 39, 276, 142, 13, 99, 0, 7, -10, 198, -20, -45, 151, 69, -3, -174, -24, -102, -10, 14, -158, 91, -211, 46, -20, 119, -124, -177, -138, 59, 12, 64, 72, 45, -87, 155, 114, -27, -117, 269, 238, 198, 139, -105, 98, 18, 113, 7, 68, -165, -104, -189, 267, -64, -93, 143, 30, -131, -38, 148, -336, 13, 115, -63, 38, -126, -15, 15, -125, 165, -136, 64, 233, -61]
5070f1J96K5l06p2L91q3O1j03n1o7J65k33P4P9P8j75O0O4k89K41j83M07k44k16
5094b42J81n1NK18j80R6P4M8k35m6J68p7n3K42l32J80J18R3k49J43j02O3k52K67
5118G7l1J26k89q3K52j24L11j94R4j14k04K37j56J27J2l8k10J44J25J36j03k0
5140G5r7J64J2j1K6j96j0k58L98r1q5Q9r7J23J71j00j03o7K16R0n02L32K4K3r3
5165C3J6k39M20k58r9M06P1p0j93O8O5k10j4o3KK57l8l91K08j5J6j78L20k19j23
5190b28J36J51J43k69P7pK9j03L0J77rk92L22r3l54K70M5P6j63J11m9r3K01q8
5214B0j6j99L7j87R0L58j20K3J11r3j13nK37K0j44J40j38J40j19J53j67N6M7N5
5238A86l21K08J34l06Lm1L3j53K64k05K50k59J0J39N3k58K92L1l7L7K5k7k23L43
$$ y = [-61, 135, 160, -146, -218, 173, 90, 151, 48, -3, -70, 95, -138, -64, 15, 93, -82, -22, 42, -247, -6, -189, 218, -26, -242, -61, -112, -107, 111, -69, 27, 101, 149, -86, -132, 36, -41, -94, 148, -184, -4, 114, 207, -42, 101, -1, 62, -190, 77, 46, 172, -117, -200, 52, -72, 239, 45, 139, 25, -179, 58, -98, 29, 41, 3, -207, -63, 62, 198, 95, 75, -22, 142, 154, 143, 169, -27, -37, -295, 103, 12, -73, 16, -81, 42, 213, 113, 10, -57, 159, 249, -253, 79, 103, 126, 33, 49, -190, 230, -28, -127, 279, 350, 280, 87, 155, 220, 10, -4, -67, -65, 192, 154, -237, -29, -44, -28, -206, 114, -105, -228, -92, 59, 202, -67, 10, 3, 32, -71, -41, 136, 127, -165, 157, 64, -290, -20, 25, 101, -62, 49, 0, -93, 108, 20, 4, -195, -158, -345, -255, 103, -17, 6, 117, 24, -89, -94, 143, 163, 19, 159, 21, 161, 42, 195, 28, 84, 131, 186, -135, 73, 207, -99, -96, -137, -104, -257, 7, -198, 52, -207, -197, -58, -5, -263, 29, 60, 23, 60, 85, 58, -165, 178]
5262A78j57n0MK05j28J10j50M7n1J04l48O3K77J03k46j06O8k35K72L0J54k90J69
5285B3P0j52J2L01j30k09n5L62k2j1k32K55J0J54l13k17J58j79K97k30J23j3j20
5308a18K03k33j9K51m51L62Q5n0j6j07K29k05K60k21k3K31j47pJ97K8k09j62N9
5331f3O7P9M0j02j21M5J73k8j53m9N9op3J92q3K18j30j71M2N0O1mJ07m32K87l1
5357b6J1p5J43q3J33J60k70p7N7J5K1j66L06j3k13M0K46p0k8J28j89k26p2K48
5381@J15k53J52j19K11l02L25j80K35j06J55p8j98p0J5l5K18j52K47k00J04l76
5403b92K47J00j95J9J45J47k72J61k89J67k3L03k61P8r0mL9p2Q4J72k26J18k82
5426b26J18J10j08J3J52Qr9j9k3l9J42j17r6J95J61l34l9L79k31K40n8l85O16
$$ y = [178, 21, -29, -25, 180, 52, 162, 12, 59, 8, 112, -236, -173, 104, 207, -39, -145, -77, -312, -40, -10, 144, -146, 23, 93, -59, -47, 254, 124, -85, -140, 222, 200, 189, -43, 212, 222, 376, 63, -154, 4, -175, 122, -108, 15, 2, -118, 85, -148, -167, 84, -367, -5, 80, 30, 14, -93, 136, -69, 191, -30, -53, 178, 31, 24, 221, 249, 40, -122, -63, 4, 83, 123, 21, -100, -55, 118, 90, -63, -112, -53, -59, -132, 60, -23, 195, 65, -106, -64, -14, 47, 43, 150, -282, 5, -26, -15, -90, 53, -30, 103, 263, -7, -84, -27, -12, 9, -157, 149, 136, -77, -37, 209, 139, 111, 239, 50, -176, -248, 0, 115, -138, 14, -105, 106, -196, 129, -51, 184, 78, 233, 155, -43, -113, -98, -133, 85, -67, 180, -20, 84, -292, -45, 55, -140, -121, 24, 171, -101, 60, -229, -62, -85, 218, -43, 35, -55, -59, -20, -92, -8, 164, -62, 56, -226, -108, 2, -106, -93, 59, 67, -32, -51, -74, -113, 29, -88, -184, 11, 172, -162, -201, 178, -53, 187, 129, -256, 360]
5449C60l42j05K04k29J43l4M9j52R3J40j48j32L24q2k94J36K37j20n4j10K12k55
5471a59k3j2L27k18R7L2R1Q5j84K66o5j69q8N4l8J46l3k18j8q4J30r8J90L8m5
5496Dk09m9J04j57L15J61l01J81j08l4M9j38L32n3J31l47K53J3l10M33l70L35
5518B35j42r4P8qL3l8o7j14K32m43L69J3j43O9J13m4J73k57J45O3r3K25k51K7
5542H1j47N7J47j2r0O2L18l85K54j59j76J15m4J14m37K27K39k84L4K91j02o9k34
5565b00J31o0O1o7L61k65j65J47j49K58j32J58k35L52j32K32m42M50k17K3l0j67
5587h8o0Q1P8lj68M07l75k1K6O2J96r6K25m16J60j23K71l77L74j13J20j82K21
5610A99n5Jk06O8K69k58j69J11R0R8k58J82l75L14j5j25K53q2k28J99j5J07k94
$$ y = [360, 18, -87, 117, -112, 31, -3, 46, -106, -13, 127, -21, -153, 171, 89, -205, -69, 168, 48, -6, -116, 96, -159, -182, -194, 133, -85, 12, 44, 135, 220, 36, 302, 237, 68, -20, 34, -4, 142, 109, -109, -127, -211, -81, -179, 11, 49, 4, -205, -254, -150, -307, 8, 169, -132, 49, -59, -93, -44, -182, 150, 97, 228, -119, 134, 147, -163, 270, -100, 235, 93, -1, 77, 69, 102, 64, -3, -117, 115, -328, 41, 54, -89, -20, 93, 49, 222, -35, 110, 173, 80, 305, 54, 81, -66, -9, 138, 126, 36, 98, 416, 31, 285, 126, -50, 65, 21, 135, -302, -75, 164, -120, -86, 205, 103, 34, -200, -69, -129, -68, -135, 226, -39, -204, -57, -206, 52, -80, 78, -157, 195, 63, 295, -147, 303, 86, 109, 79, -88, -148, -67, 11, 8, -160, 247, -128, -149, -123, -61, 135, 39, 264, -152, 8, -115, 156, -221, 153, 40, 160, -22, 199, 144, 145, -61, 7, 276, 18, -151, -40, 50, 148, -110, 72, -303, 11, -4, -129, 124, 42, -186, 13, -2, 105, -189]
5633a89j01N65o1k14j22K98k10K89k18L1j01q1L45k10k2j21n3Q4L31l93J49K6
5655B2j90k3K33K28l61m6J57q7J91k75o7K99R9j56J80j23m5K07l11J09k17k1J56
5678d1J08l27L83p3n6q0J69Nj81lK2n6O6M1J74k40M03K04n38J57pn5k06Q0Q8l7
5704@J73j63J45q7L6Q1j47j83J77m0o9J02k2J96k18K9n4m3N1j37K74l75M67k69
5728g6K10j90J73lj81J77J69l32l3K8P2j03Q4J85j18j08K07k32j77J01L76j43
5750H6j78Q0J67k58Q3J61j89J28j1k18K37k52K11R2m8l2P6l9%p9J96k60q1J47
5774A9R5j40k28N38j16k37O4P5k71K07Pp9j77K89M3j12J09l25J87o3K33k52L47
5797B13J21k06l01M14l32J68l8Nl57L24O8m79M69j91M9P2j7j88J17j09R7RJ40
$$ y = [-189, -290, 275, 214, 0, -122, 176, -34, 255, 37, 68, -33, -114, 231, 21, -1, -122, -175, -91, 240, -153, -4, 22, -168, -191, 42, 270, -91, -137, 20, -67, 124, -151, -218, 81, 180, 24, 204, 81, 36, 243, -68, 41, -176, -197, -41, 67, -260, 123, 50, -6, -86, 83, 88, -93, -96, -74, -130, -64, -23, 151, -89, 314, 518, -20, 137, 130, 75, -131, -51, 37, 0, 173, 10, 155, 68, 104, 185, 38, -145, 32, -8, -77, 25, 3, 199, -19, 10, -44, -87, -36, -173, 101, -274, 193, -76, 134, -56, 117, 114, -67, 110, 279, -53, -86, -58, 14, -89, -5, 180, 62, -46, 161, -71, -248, -147, 229, 86, -92, -12, 155, -103, -20, 141, -48, 80, 69, -149, 88, -164, 47, 139, 91, 59, 135, 96, 96, 17, 213, -47, -128, 19, 114, -26, -254, 284, 168, -69, -5, 70, -201, 6, 13, -66, -243, 46, 89, -23, 86, -239, -52, -115, 118, -134, 213, 334, 128, -173, 241, -91, 77, 39, 44, -313, 11, 79, -400, 69, -122, -73, -1, -18, -206, -89, -198, -101, -92, 48]
5820D8O4l04K12K00l70J44k73K40J55l20j46L73K63k49J43l23n1L24j59j10J65
5841B6lp2K63l02K9Pj8k4J6L8o6J57oJ09r2j21J74j3j84J64P7j39N3J16l58L61
5867A92l12J66k77K74Q1L1j19N9J01k52J48o1NJ01j73k58K62k02K07p6m2L09m8
5890A16KM8j33K38k78K2O2j10J63l33J00L06r9j84O3j20J00M0l53J53K17p7j53
5913b10J00j29L53j16k18K69P9q5J20l52L20m1j41P4j53J43m7J50Q3l20J56k43
5935b08J61J34R1j49m4J2J01o0o1P7j40J31j11M68m37o8Q4R8k5o6K9K65j53J2
5959A41j71JJ0k06K02K3K18k62p4J81M4M7l23J86j76J12m5J37j03K61k47M5m5
5982d4L42m67j7J39J98j49j51L00J02k10l2M0jR0r2P2l2j18K09O2k20l42K91j52
$$ y = [48, 112, -192, 20, 220, -150, -6, -279, -39, 116, -204, -350, 23, 286, 37, 180, -143, -194, 130, -29, -139, 26, 23, -49, 214, -88, -59, -52, -70, -94, -78, -40, -106, 51, 45, 154, 62, -59, 115, 102, -82, 82, 159, 20, 73, 189, -169, 192, -120, 46, -231, 43, 124, 155, 36, 95, 196, -56, 92, 31, 36, 137, -36, -294, -32, -234, -27, -103, -145, 164, 116, 118, 166, 33, 271, -7, 15, 77, -33, 130, -203, -103, 203, 104, -80, -17, -137, -37, 3, -350, -197, 20, -57, -210, -110, -239, 114, -2, -220, 49, 128, 43, 163, -189, 131, 90, -51, 23, -130, 13, -34, 116, 199, -121, 35, -208, -47, 87, 178, 29, -15, -3, 98, 38, -23, 54, -86, 45, -66, 402, -35, -103, -19, 79, 54, -12, 17, 282, 129, 141, -30, -29, -19, -225, -23, 0, 218, -44, -118, 63, 107, 154, -169, 17, -159, -47, -92, 45, -58, 203, -44, 1, -44, 298, -169, -186, -47, 151, 2, -149, 151, 253, 43, 11, 51, 50, 140, 48, 120, 88, -30, 179, 241, 21, -321, -30, -182]
6006a82K15lN7m0k12K45q6j10K54j25qJ13k6j97J96j81J87r9n1K0K90k56j5k54
6030b68K51j27L24n12L59M7k22R9QJ85l68L52j21Qp3r0lrM21j83O9k76J80pP2
6055A16p1Q0p6Rj54k06K9L04k8j84P5R7L8q4kj63L29l00K28k01J17K27k96J66
6079E0QJ25k51J97l91M17k07J86q6l10M24l92K01j60K09J3l8R1o6kpl9j47j9J41
6104e3k92L15o4Q0K20j71j26M3K1J38J18l56l2K41k39K55j18J98q6j18KK3p4J93
6128A18k67K20n8k4L7j39O1O2O7p4K48j81J33j09k38J55m4p6N14n06K13j0r0J8
6152C0j70K80m11M45k43L7j87J29L5o4N2J7J78Q8k52KP4j54J71J04J7k42J85P2
6176A93K21l30j13n4q3K05n8K7K46j52j12R5M5k95MJ6J65j27J35n4r7q9J36J58
$$ y = [-182, 33, 30, 87, 47, -165, 80, -6, -116, 138, 13, 5, 118, 92, -105, 91, -90, 97, -2, -53, -33, 257, 1, -14, -268, -17, -144, 180, -332, 27, 74, -148, -49, -41, 144, -224, 128, 7, 15, -58, -148, -151, -160, 261, 78, 147, -129, 51, 44, 116, 45, 125, 49, 58, -96, -302, -273, 31, 3, -181, -106, -9, 29, -55, -57, -220, 109, -191, 37, -164, -47, 180, -116, 50, 58, 183, -68, 129, -262, 155, -52, 134, 48, -262, 162, -230, -29, -189, 20, 33, -5, 86, 20, 18, 11, -28, -175, -194, -53, -345, -30, -94, -14, 206, 35, -91, -48, -27, 111, 229, -127, -159, 82, -157, 98, -20, 178, 92, -26, -24, -1, -75, 118, -149, 71, 13, -11, 26, -113, -52, 10, 77, 3, 251, 70, 203, 94, -144, 11, -33, -109, 405, -101, 112, 102, 12, 30, -140, 140, -271, 174, -69, -32, -219, -90, -55, -119, -67, -50, 128, 216, -36, -34, 40, -114, 57, 161, 178, -64, 121, 193, 414, 84, -29, -83, -166, 39, -19, 8, 254, 102, -10, 85, 130, -165, -161, -145, 20, -107, 28, -26, -123, -212, -76, 82]
6200H2j92J66j19N5j45R4M5k23K34J29k73K59N3k63J15J84l14J42n7J6N6j09k2
6223h7l4J60P1k09k5R7r6r7j44L27l4Q1j9k17L48L5lm88P1L28Q6j71K54r7j51
6248a4J24k36m6K46J81k20l12K14K53j63J8L0j10L5J3k64K63m7o7J46j28J5J88
6271A19k17K91o2j24N4j30J08l1M0m4o0j69K31M0k57L73l69J42j4Q9j95K94l08
$$ y = [82, -110, 56, -63, -8, -153, -59, -14, -237, -3, 126, -147, 112, 165, -98, 17, 201, -113, 29, -28, -12, 44, -65, -87, -121, 39, 110, -99, -124, -27, -123, -220, -364, -37, -71, 10, -9, -226, 122, 157, 154, -334, -263, 65, 151, -20, 234, 137, -14, 110, -126, -172, 74, 255, 35, -277, -63, 190, 27, 45, 75, -35, 0, 13, -251, 12, -35, -102, 44, -84, -69, 119, -98, 193, 131, 7, 61, -69, 39, 8, 48, 4, -56, -225, 6, 46, -211, 162, -207, -65, -79, 10, -185, 109, -199]
$$ [...]
8191a46
##END NTUPLES=NMR FID
##END=
