##TITLE=1H_Pr en-i-2
 CDCl3, 8 sc, 
 4.6.2020
##JCAMPDX= 6.0         $$ Bruker NMR JCAMP-DX V2.0
##DATA TYPE= NMR FID
##DATA CLASS= NTUPLES
##ORIGIN= UXNMR, Bruker Analytische Messtechnik GmbH
##OWNER= root
$$ XWIN-NMR		Version 3.5
$$ Thu Jun  4 11:55:02 2020 Russian Standard Time (UT+4h)  she@DPX200
##.OBSERVE FREQUENCY= 200.1315
##.OBSERVE NUCLEUS= ^1H
##.DELAY= (6, 6)
##.ACQUISITION MODE= SIMULTANEOUS
##.ACQUISITION SCHEME= undefined
##.AVERAGES= 8
##.DIGITISER RES= 18
##SPECTROMETER/DATA SYSTEM= spect
##.PULSE SEQUENCE= zg30
##.SOLVENT NAME= D2O
##.SHIFT REFERENCE= (INTERNAL, D2O, 0, 15.7039)
##AUDIT TRAIL= $$ (NUMBER, WHEN, WHO, WHERE, WHAT)
$$ ##TITLE= Audit trail, XWIN-NMR		Version 3.5
$$ ##JCAMPDX= 5.01
$$ ##ORIGIN= Bruker BioSpin GmbH
$$ ##OWNER= she
$$ F:/spectra/data/she/nmr/H-F/1/audita.txt
$$ ##AUDIT TRAIL=  $$ (NUMBER, WHEN, WHO, WHERE, WHAT)
(   1,<2020-06-04 11:54:00.70 +0400>,<she>,<DPX200>,
      <created by zg, POWCHK disabled, PULCHK disabled
       configuration hash MD5:
       00 E9 B6 7A A2 85 ED C7 34 08 36 98 17 FE 4E 26
       data hash MD5: 16K
       DE 21 45 96 48 EE BE 43 51 08 14 07 91 7C EC 6E>)
$$ ##END=
$$ 
$$ hash MD5
$$ 98 3C EC 99 EE B9 61 9C 53 29 89 C7 7E BE 7A E8
##$RELAX= 
##$RELAX= 
##$RELAX= 
##$RELAX= 
##$RELAX= 
##$RELAX= 
$$ Bruker specific parameters
$$ --------------------------
##$DU= <F:/spectra>
##$EXPNO= 1
##$NAME= <H-F>
##$PROCNO= 1
##$TYPE= <nmr>
##$USER= <she>
##$AMP= (0..31)
100 100 100 100 100 100 100 100 100 100 100 100 100 100 100 100 100 100 
100 100 100 100 100 100 100 100 100 100 100 100 100 100 
##$AQSEQ= 0
##$AQ_mod= 1
##$AUNM= <au_zg>
##$AUTOPOS= <>
##$BF1= 200.13
##$BF2= 200.13
##$BF3= 200.13
##$BF4= 200.13
##$BF5= 200.13
##$BF6= 200.13
##$BF7= 200.13
##$BF8= 200.13
##$BYTORDA= 1
##$CFDGTYP= 0
##$CFRGTYP= 5
##$CHEMSTR= <none>
##$CNST= (0..31)
1 1 145 1 1 1 1 1 1 1 1 1 1 1 1 1 1 1 1 1 1 1 1 1 1 1 1 1 1 1 1 1 
##$CPDPRG= <>
##$CPDPRG1= <>
##$CPDPRG2= <>
##$CPDPRG3= <>
##$CPDPRG4= <mlev>
##$CPDPRG5= <mlev>
##$CPDPRG6= <mlev>
##$CPDPRG7= <mlev>
##$CPDPRG8= <mlev>
##$CPDPRGB= <>
##$CPDPRGT= <>
##$D= (0..31)
0 1.2 0 0 0 0 0 0 0 0.06 0 0.03 0 0 0 0 0.0002 0 0 0 0 0 0 0 0 0 0 0 0 
0 0 0 
##$DATE= 1591257240
##$DBL= (0..7)
120 120 120 120 120 120 120 120 
##$DBP= (0..7)
150 150 150 150 150 150 150 150 
##$DBP07= 0
##$DBPNAM0= <>
##$DBPNAM1= <>
##$DBPNAM2= <>
##$DBPNAM3= <>
##$DBPNAM4= <>
##$DBPNAM5= <>
##$DBPNAM6= <>
##$DBPNAM7= <>
##$DBPOAL= (0..7)
0.5 0.5 0.5 0.5 0.5 0.5 0.5 0.5 
##$DBPOFFS= (0..7)
0 0 0 0 0 0 0 0 
##$DE= 6
##$DECBNUC= <off>
##$DECIM= 24
##$DECNUC= <off>
##$DECSTAT= 4
##$DIGMOD= 1
##$DIGTYP= 9
##$DL= (0..7)
0 120 120 120 120 120 120 120 
##$DP= (0..7)
150 150 150 150 150 150 150 150 
##$DP07= 0
##$DPNAME0= <>
##$DPNAME1= <>
##$DPNAME2= <>
##$DPNAME3= <>
##$DPNAME4= <>
##$DPNAME5= <>
##$DPNAME6= <>
##$DPNAME7= <>
##$DPOAL= (0..7)
0.5 0.5 0.5 0.5 0.5 0.5 0.5 0.5 
##$DPOFFS= (0..7)
0 0 0 0 0 0 0 0 
##$DQDMODE= 0
##$DR= 18
##$DS= 0
##$DSLIST= <SSSSSSSSSSSSSSS>
##$DSPFIRM= 0
$$ [...]
##$SUBNAM2= <"">
##$SUBNAM3= <"">
##$SUBNAM4= <"">
##$SUBNAM5= <"">
##$SUBNAM6= <"">
##$SUBNAM7= <"">
##$SUBNAM8= <"">
##$SUBNAM9= <"">
##$SW= 24.9337058887773
##$SWIBOX= (0..15)
0 0 2 0 0 0 0 0 0 0 0 0 0 0 0 0 
##$SW_h= 4990.01996007984
##$TD= 16384
##$TD0= 1
##$TE= 0
##$TE2= 300
##$TE3= 300
##$TEG= 300
##$TL= (0..7)
0 120 120 120 120 120 120 120 
##$TP= (0..7)
150 150 150 150 150 150 150 150 
##$TP07= 0
##$TPNAME0= <>
##$TPNAME1= <>
##$TPNAME2= <>
##$TPNAME3= <>
##$TPNAME4= <>
##$TPNAME5= <>
##$TPNAME6= <>
##$TPNAME7= <>
##$TPOAL= (0..7)
0.5 0.5 0.5 0.5 0.5 0.5 0.5 0.5 
##$TPOFFS= (0..7)
0 0 0 0 0 0 0 0 
##$TUNHIN= 0
##$TUNHOUT= 0
##$TUNXOUT= 0
##$USERA1= <user>
##$USERA2= <user>
##$USERA3= <user>
##$USERA4= <user>
##$USERA5= <user>
##$V9= 5
##$VALIST= <valist>
##$VCLIST= <CCCCCCCCCCCCCCC>
##$VD= 0
##$VDLIST= <DDDDDDDDDDDDDDD>
##$VPLIST= <PPPPPPPPPPPPPPP>
##$VTLIST= <TTTTTTTTTTTTTTT>
##$WBST= 1024
##$WBSW= 4
##$XGAIN= (0..3)
0 0 0 0 
##$XL= 0
##$YL= 0
##$YMAX_a= 155280
##$YMIN_a= -117511
##$ZGOPTNS= <>
##$ZL1= 120
##$ZL2= 120
##$ZL3= 120
##$ZL4= 120
##$ABSF1= 10
##$ABSF2= 0
##$ABSG= 5
##$ABSL= 3
##$ALPHA= 0
##$AQORDER= 0
##$ASSFAC= 0
##$ASSFACI= 0
##$ASSFACX= 0
##$ASSWID= 0
##$AUNMP= <proc_1d>
##$AZFE= 0.1
##$AZFW= 0.1
##$BCFW= 1
##$BC_mod= 2
##$BYTORDP= 1
##$COROFFS= 0
##$CY= 11.3945322036743
##$DATMOD= 1
##$DC= 2
##$DFILT= <>
##$DTYPP= 0
##$F1P= 16.9975609425685
##$F2P= -3.02152046262296
##$FCOR= 0.5
##$FTSIZE= 0
##$FT_mod= 4
##$GAMMA= 1
##$GB= 0.15
##$INTBC= 1
##$INTSCL= 1
##$ISEN= 128
##$LB= 0.24
##$LEV0= 0
##$LPBIN= 0
##$MAXI= 10000
##$MC2= 0
##$MEAN= 0
##$ME_mod= 0
##$MI= 1.114404
##$NCOEF= 0
##$NC_proc= 0
##$NLEV= 6
##$NOISF1= 3.799351
##$NOISF2= 2.8
##$NSP= 1
##$NTH_PI= 0
##$NZP= 0
##$OFFSET= 15.70392
##$PC= 1
##$PHC0= -9796.148
##$PHC1= 16.20082
##$PH_mod= 1
##$PKNL= yes
##$PPARMOD= 0
##$PSCAL= 0
##$PSIGN= 0
##$REVERSE= no
##$SF= 200.130013532006
##$SI= 16384
##$SIGF1= 3
##$SIGF2= 2
##$SINO= 400
##$SIOLD= 16384
##$SREGLST= <1H.CDCl3>
##$SSB= 0
##$STSI= 0
##$STSR= 0
##$SW_p= 3612.71676300578
##$SYMM= 0
##$S_DEV= 0
##$TDeff= 0
##$TDoff= 0
##$TI= <>
##$TILT= no
##$TM1= 0
##$TM2= 0
##$TOPLEV= 0
##$USERP1= <user>
##$USERP2= <user>
##$USERP3= <user>
##$USERP4= <user>
##$USERP5= <user>
##$WDW= 1
##$XDIM= 8192
##$YMAX_p= 0
##$YMIN_p= 0
$$ End of Bruker specific parameters
$$ ---------------------------------
##NTUPLES= NMR FID
##VAR_NAME=  TIME,          FID/REAL,        FID/IMAG
##SYMBOL=    X,             R,               I
##VAR_TYPE=  INDEPENDENT,   DEPENDENT,       DEPENDENT
##VAR_FORM=  AFFN,          ASDF,            ASDF
##VAR_DIM=   8192,          8192,            8192
##UNITS=     SECONDS,       ARBITRARY UNITS, ARBITRARY UNITS
##FACTOR=    0.0002004,     1,               1
##FIRST=     0,             0,               0
##LAST=      1.6414764,     0,               0
##MIN=       0,             -117511,         0
##MAX=       1.6414764,     155280,          0
$$ Real data points
##PAGE= N=1
##DATA TABLE= (X++(R..R)), XYDATA
0@%%%%%%%%%%jQj4J4j5K3l0L0l7M5n3O0o8Q3r7J11j26J42j60J82k07K33k61K93
34A55l28L66m07M52n02N57o18O87p61Q42r32J031j144J273j419J586j781K009
52A066k286K626l055L621m398N545p438J1261l3450J09039O8183j46502j00246
65i6034N7969J12163k7245j16465l1845J10377R4691l0911j02633l7958M3059
76b4832M5562o792k2954J284K5444J2500j0488k5526k4294p953K9944N0561J3186
89E5642n0886m7902K2022N6883m146o4556k2140P0929O9192l9425j01616j7264
101g3267Q7164N8759n2003p2077K1140Q1205J5271p9362o1272M1538Q0623J2889
113F0608o2599l8549L2834M3696j2419n1023j2259M2554M0763j0710l8400j7849
$$ plain form
0 0 0 0 0 0 0 0 0 0 0 0 -1 7 -7 7 -8 15 -15 15 -22 23 -30 30 -38 45 -52 59 -67 75 -85 97 -110 123 -138 155
34 155 -173 193 -214 238 -264 293 -325 362 -399 443 -489 542 -602 671 -748 838 -943 1066
52 1066 -1220 1406 -1649 1972 -2426 3119 -4319 6942 -26508 82531 150714 4212 -96034
65 -96034 -38065 74098 46853 -69612 -101457 8920 103611 72700 -29933 -67891 -24832
76 -24832 20730 13938 -9016 -7732 17712 30212 19724 -5802 -30096 -38049 -8105 42456 55642
89 55642 4756 -43146 -21124 35759 31613 -32943 -55083 15846 85038 45613 -56003 -73267
101 -73267 13897 72656 20653 -51424 -30284 50921 66192 -13170 -74442 -32904 47719 60608
113 60608 -1991 -40540 -7706 35990 23571 -27452 -39711 2843 43606 32896 -5504 -23353
125b3353J1488J4363L952j920n729k671R226J4668p144l3727j8610K8107M6102
138C4752o77m6097k2858L2229L5066k0289m7818l894N1149L6197k9258n2831j526
151c5855M3967K2838l0500l4886J7006M1951O194l8648k9104J9336L3882j126
163A5055k4258q403J5955J2379q726j2445l138Q421Q220R60m15n878q688J91J2989
178B219P168j0500j1711N606J7768J687j9837j5793J4142K3981L573k2256j5153
191a9106J3197K0200l658k3297o485K0777J8348j0039k0128k685J7370M079r378
204h05o134Q051P190k441q013k25L345l7l403K087Q053K098p618o692K619P649
220E724O37o886l216O212P848k606j0105l464P935O306m059n993Q62N745Q99l199
$$ plain form
125 -23353 -11865 2498 6450 4530 -1199 -3870 5356 20024 12880 -20847 -39457 -11350 34752
138 34752 34075 -12022 -34880 -2651 32415 12126 -35692 -39586 11563 47760 18502 -34329 -35855
151 -35855 8112 30950 450 -34436 -17430 24521 30715 -7933 -37037 -17701 16181 15055
163 15055 -9203 -17606 -1651 10728 2002 -10443 -13581 -5160 3060 4020 3605 -2273 -10961 -10770 2219
178 2219 9387 -1113 -12824 -7218 10550 12237 -7600 -23393 -9251 14730 18303 -3953 -19106
191 -19106 -5909 14291 10633 -12664 -19149 1628 19976 9937 -10191 -12876 4494 8573 -805
204 -805 -6939 1112 8302 5861 -2152 -2377 968 931 -2472 -385 7668 9766 2148 -4544 -1925 5724
220 5724 6361 -525 -3741 2471 10319 7713 -2392 -5856 2079 8385 4326 -1667 -805 4940 5839 2640
236B640n046J370L925J979j339j370q43j249J570K849k266l581J533L175Q66k484
252A729m374J225M567J973l770m411L76N420J764n530l501K139P689J200p278
267g82o318M001O763Ln882m827N216O522o56q447l640L736O641P72m644n313K503
284d352N536J912o793m499L739N280L023n189m814J488N157J131m648l918K111
299d836M683J798l398l525J00M774K898m080l269J451K806J049j564l372O35K932
315i18K500j608k705j324M232K138j938k723j41K551K116j981k717M84L279J523
331B768j496l811J831K506N23j657k440K658J836J83j551j839J517K015j136j989
347h2M71K856O04k208r89j92J550k95q2j210K493L22n07j360j007J790L27j88
$$ plain form
236 2640 -2406 -1036 2889 4868 3529 2159 1316 67 1637 4486 2220 -1361 172 3347 4213 1729
252 1729 -2645 -1420 3147 5120 1350 -3061 -2685 2735 4499 -1031 -4532 -2393 5296 6496 -782
267 -782 -7100 -3099 3664 3667 -2215 -7042 -1826 4696 4040 -4407 -8047 -4311 2330 3102 -1542 -6855 -4352
284 -4352 1184 3096 -3697 -8196 -4457 823 3846 -1343 -6157 -4669 488 1619 -3029 -6947 -4836
299 -4836 -153 1645 -1753 -5278 -5178 -404 2494 -1586 -4855 -3404 -598 451 -1113 -4485 -3850 -918
315 -918 1582 -26 -2731 -4055 177 2315 377 -2346 -2487 64 2180 199 -2518 -2034 1245 2768
331 2768 1272 -2539 -708 1798 2321 664 -1776 882 2718 2901 1350 -489 1028 3043 1907 -82
347 -82 389 3245 3849 1641 652 460 2010 1715 1633 423 2916 3238 2731 1371 364 2154 2481 2293
365B293m45p07J760l1j296m28l84J236K53j86M07r26m50L80J321k622n48P35J889
384B251m66j456q33R64K135j281j202r82J048J299l92j025k339J983K617q80l539
401b098q44L755m25n28k681O6L015M15j641j958P56K001J10q35l66r77J170J38
419i27K2k630O98K357N75j007j032M42K75m11j9l63m86J452K04n79k84n13J41
438b085J459R8j165j81J97J927j328K20j54P31L19K48k08r06J006r87J807r86
456A2k94L74K0N84p12J79L78k74K2Q60m62m00p41J087J159J19j862j563K608J533
476B627q40j806L98Q19J768l86p42k421K602P23M45j807k083K449K093r6k919
493H24l11J57K622j210j884k23K322l23J23m88k476M20L184K37j898j370M87K355
$$ plain form
365 2293 1848 1141 2901 2870 1574 1146 762 1998 2251 2065 2472 1546 1096 1476 2797 175 -373 362 2251
384 2251 1785 329 -504 460 2595 1314 112 -870 178 1477 1085 60 -2279 -296 2321 1441 -2098
401 -2098 -2942 813 388 -140 -2821 -2755 260 675 -966 -2924 -2168 -167 -57 -892 -1258 -2235 -1065 -927
419 -927 -905 -3535 -2837 -480 95 -912 -1944 -1502 -1227 -1638 -1657 -2020 -2506 -1054 -850 -1429 -1713 -2226 -2085
438 -2085 -626 -528 -1693 -1874 -1677 250 -1078 -858 -1012 -281 38 286 78 -828 178 -809 998 12
456 12 -282 92 112 696 -16 163 541 267 289 1149 687 287 -454 633 1792 1911 49 -1514 1094 2627
476 2627 1787 -19 379 1198 2966 2580 1838 -583 2019 2742 3187 1380 -703 1746 3839 3743 824
493 824 513 670 3292 2082 198 -25 2297 1974 2097 1609 -867 -447 2737 2974 1076 -294 193 2548
511B548L19k814j267J458K279K61k748j276J991J471j743r12k578L162K306j125
527A332k928j53K475J954k642k243N80J858J285j907k077J505Q96M60q18j816
543b239M51N50J289r61j415K55Q98N22k21l56k185J871J574m76k254n39J781K872
561A417k166j114j551K794K387k795l793J841L705K192n054l574M217M472p55
576B223o839j883O866N463l604p905P70P114K651l387n890L91O146K288l480m064
592c140M38L850L514k441l867m79K424J944P29k221l557P20O523J484l581p132
608d792J083Q778L167p621p203M343J0368J389j0827p414P900J0426k034j1235
622c672m688J0043R301m732j3009n74J2537O134q800r498K594J0242K634p889
$$ plain form
511 2548 2867 53 -1214 244 2523 2784 36 -1240 751 2222 479 -433 -3011 151 2457 1332
527 1332 -1596 -1749 726 2680 38 -2205 -1625 233 1518 -389 -2466 -961 -65 395 -423 -2239
543 -2239 -1788 -1238 51 -910 -2325 -2070 -1172 -650 -871 -1227 -3412 -1541 33 -443 -2697 -3236 -1455 1417
561 1417 -749 -1863 -3414 -620 1767 -1028 -4821 -2980 725 2917 -2137 -5711 -1494 2978 2223
576 2223 -4616 -6499 367 5830 2226 -5679 -4909 2205 4856 1469 -4421 -4030 2116 4404 924 -3140
592 -3140 -2702 1148 4662 2221 -1646 -2125 299 2243 2972 751 -2806 -2086 4437 5921 2340 -4792
608 -4792 -3709 5069 8236 615 -6588 -2245 8123 9512 -1315 -8729 -829 9597 7563 -3672
622 -3672 -8360 1683 10984 6252 -6757 -7331 5206 11340 2540 -6958 -4364 5878 8512 623
636F23p721K787Q856K042o637m452J419O624J998j924m816m088M595P446n93p313
652a154p381N246R708L512j2412j0628P697J5762P75j6196j0224J1455J6606k948
666I818j8090q734J6703J4887o602j9179k304J4904J1479r651j5164Q43J4282
679C192N330q516q955J274Q988L490m675n783m67M616M505n77m474m466J983O392
695A857L091m479q962J750J1204N353r878j2958O117J5574L436j5602j1745J0828
709d414J6754o52k0034p237J4440J5661p263j6751l268J5059J1574q472j5205
722i808O49J3009N865o129j0539J708Q458M403n771n173M29L267K801J575k642
737B102n112m36N579N918m863q972j198J1849O228q493j1933K362J5436M535j2605
$$ plain form
636 623 -7098 -4311 4545 6587 -50 -4502 -3083 3541 5539 3615 -1201 -5289 -694 6752 6159 -1154
652 -1154 -8535 -3289 6419 9931 -2481 -13109 -5412 10350 11125 -5071 -15295 -3840 12766 9818
666 9818 -8272 -17006 -303 14584 7982 -11197 -13501 1403 12882 3231 -11933 -11090 3192
679 3192 8522 6 -8949 -7675 1313 4803 128 -5655 -6122 -1506 2999 2422 -2052 -6518 -4535 1857
695 1857 4948 469 -8493 -6743 4461 9814 -64 -13022 -6905 8669 12105 -3497 -15242 -4414
709 -4414 12340 11688 -8346 -15583 -1143 14518 7255 -9496 -12764 2295 13869 5397 -9808
722 -9808 -9159 3850 9715 3586 -6953 -5245 3213 7616 1845 -3328 -2899 368 3169 4744 2102
737 2102 -3010 -3446 2133 8051 3188 -5784 -6982 4867 11095 2602 -9331 -6969 8467 13002 397
752C97j1186P149J3552J953j3950r307R313J3463k387j4836l695J1171R152n219
766E570j1675k26J0043L627n643o277J844M945J017k497j219j62J65J388J528
781B428K67m624j455K619N707k139o480k429N663O929l183p227k631P873O156
796G474n326r927J448R919K797q051n516L101P487J867q646k292N247M224k995
811H11m802J869K782l07j947p59J783J080r98j799J033K180j532j959J031K754
827A220k33k637j317K988K521k225l181N17M427N19m106k195K031N054k334m255
843c206M03N044K69k860k202J513L444o74k675N37J579J48q08j187P92J382j69
860A330k116N14J454l34r94q29J857J478o07k768P89R61K077k042k425J363L389
$$ plain form
752 397 -10789 -3640 9912 11865 -2085 -11392 -2079 11384 8997 -5839 -9534 1637 10789 5570
766 5570 -6105 -6331 3712 7339 1696 -4581 -2737 2208 3225 728 -491 -653 -488 900 2428
781 2428 2695 -1929 -3384 -765 4942 2803 -3677 -6106 -443 6486 3303 -3924 -6555 1318 7474
796 7474 2148 -7779 -6331 3588 6385 -1666 -7182 -4081 3406 5273 -3373 -5665 -418 3806 811
811 811 -3991 -2122 660 353 -1594 -2353 -570 510 -488 -2287 -1254 926 -606 -2565 -1534 1220
827 1220 987 -1650 -2967 21 2542 317 -2864 -2347 2080 2599 -1507 -3702 -1671 3383 1049 -3206
843 -3206 -2803 2241 2510 -350 -2552 -1039 2405 1731 -944 -407 1172 1320 512 -675 117 1499 1330
860 1330 -786 -272 1182 848 -146 -975 882 2360 1753 -1015 -226 735 2812 770 -1655 -292 3097
877C097j096k087j78J324R48r54j812O49J419j118Q18m67m53k49M23R92K9j015
895B70K09J21j61R0K7q90J50R06Q01o22j162l0Q96R28j993j131Q34J691r6j986
915a148R7J358P87j298o09J13P25N62k74o94n53P9J057K27j792n0L56O85J01j411
935a682K90R71k42k7j56M2J73k0N94j075J76m41O07J299q14j284K15J472j72r06
955i80j41O24M6l42j07L88N0m25R22k10l14K69L71l94Jl13L79M60k16l10J67L94
977C19j90o16M12M21j20k31j27M43L29n12k86M37K81j20k45M09m39k59Q97N1m52
998D02m06K65Q50l63l14R3J68M42k33n02k73N07K79K83l05o20J73P52K43j469
1018b8l21P64J388p26p93k51N63P23o06n24k93O10L00k11k05q15P82J65K89p37
$$ plain form
877 3097 2001 -86 -264 1060 2008 1054 -758 -109 1310 192 1010 543 90 -159 264 1256 1285 270
895 270 479 600 439 529 556 -334 -184 722 1523 901 -261 -291 605 1533 -460 -1591 -757 934 838 -1148
915 -1148 -1051 307 1094 -204 -813 -700 25 587 313 -381 -934 -855 202 429 -1363 -1413 -1057 -372 -271 -1682
935 -1682 -1392 -421 -663 -690 -846 -804 -631 -651 -57 -1132 -956 -1397 -790 509 -305 -1589 -1374 98 -74 -980
955 -980 -1121 -497 -451 -793 -900 -512 -462 -887 35 -175 -489 -220 151 -243 -242 -555 -176 284 68 -242 -75 319
977 319 129 -487 -75 346 226 -5 -132 311 640 128 -158 279 560 440 195 604 165 -94 803 854 402
998 402 -4 261 1111 748 434 527 695 1137 904 402 129 636 915 1198 893 273 446 1198 1441 -28
1018 -28 -349 415 1803 1077 284 33 596 1319 713 189 -104 506 806 595 390 -425 357 522 811 74
1038G4o16K61J012n2q41j01l79N87M52m64j00l18J22Q66n79p03j62R88P39q72
1058h6j151M56J010K13j224l52J52O32J03p14j88L83K87L61l89m42j48P16O63
1077B82r25k76M47M48k92m44K9l8K47L82m02o06Q8O39N65m41n18m2P93M79p43
1098c28l63J49M75J20j02k55j13O0O23K42o07Q4j93Q05q5q44j25L72P73M4q72
1119a40P7M65K76j51K5p92O00K43O5m53k88N46M87k02M0q71O44L08k88k25L05
1140F71q1k32J25M16k69n78J55P39J44p77n16K95J170j78r40l92O53O28rj033
1160il46L18Q36k62r08j44O87O50m45q30J63M34L68o35n71K44O39j9l14j75K71
1181d8j50k78N91n00K2m16M62M41j60p80k16O43R63p45j003j2R13O54p04r35J27
$$ plain form
1038 74 -542 -281 731 679 -162 -263 -642 -55 397 -67 -167 -485 -363 503 -76 -779 -941 47 786 -86
1058 -86 -1237 -781 229 442 -782 -1134 -982 -350 -247 -961 -1149 -766 -479 -118 -507 -949 -1097 -381 282
1077 282 -643 -919 -472 -24 -316 -760 -731 -769 -522 -140 -542 -1148 -1060 -421 144 -297 -815 -857 -64 415 -328
1098 -328 -691 -542 -67 53 -49 -304 -417 -357 266 508 -99 -15 -208 597 512 -332 -457 -85 688 732 -140
1119 -140 -63 402 678 527 552 -240 360 603 668 215 -73 473 960 758 798 -73 571 879 591 366 671
1140 671 590 358 483 899 630 52 207 946 1090 313 -203 92 1262 1084 144 -248 405 1033 1024 -9
1160 -9 -355 -37 799 537 -371 -515 172 822 377 -453 -290 144 512 -123 -694 -450 189 170 -144 -319 -48
1181 -48 -198 -476 115 -385 -363 -779 -317 124 -36 -816 -1032 -389 574 -171 -1174 -1186 -273 381 -323 -1258 -1131
1202a131J241O30j666n45N51J412j78j275k27N01J081l95r39j86J030L35o88k15
1220f64j6J61N82k66n25K15N69j65ml30l6LN4L31K35l06k21L51L71l23k69j73
1242d26O23Q05r66n10K29Q29L26o05q35N41P97L45r22q51R55J003o82n83l48R31
1262F56N89l49j075n7J104K11o10o11K61M02L77k59q40N25Q2L14m50j08M6K90
1282D98l7J23k71n93N67J61K1j41j84l2J94K03l96m8m06O85L17l24j013K14J048
1303E86L37j014r35P47J300m71j356M4J151M81m08j173l97J433P24j470j056N16
1321i61J260K07j129l76M96Q25q7q94K06o7O08m44j70M15k54qj37M38K4m05l76
1342h29J22R91m07o48k40J131L76n65q23j14J488J51j080j016P88J447P8j638
$$ plain form
1202 -1131 110 740 -926 -1471 -920 492 314 -961 -1188 -687 394 -1 -940 -1126 -96 239 -449 -664
1220 -664 -680 -519 63 -203 -728 -513 56 -109 -113 -443 -479 -476 -422 -91 144 -162 -383 -32 339 16 -253 -426
1242 -426 197 1002 36 -474 -245 584 910 305 -530 11 808 1153 231 -620 335 1338 656 73 -275 656
1262 656 1245 896 -179 -236 868 1079 469 -142 119 521 898 639 -201 324 406 720 270 162 208 498
1282 498 461 584 313 -280 287 448 469 328 144 112 306 509 113 65 -341 344 661 337 -676 -462 586
1303 586 923 -91 -1026 -279 1021 550 -806 -762 389 870 462 -711 -1108 325 1049 -421 -1477 -961
1321 -961 299 506 -623 -999 -503 322 235 -659 -453 -520 88 -356 -526 -111 -365 -373 -510 -72 -48 -453 -829
1342 -829 -707 284 -123 -771 -1011 120 496 -69 -892 -1006 482 633 -447 -1463 -675 772 850 -788
1360g88q37J187J421n72j179j79J320N42p73j097O82Q05J81o85p01N99P68m56
1378B38o87K16M18P8m35L02N06l93k30l12J070J97r37n66N93R97j94j226P0J079
1398G84J55l08j169J2J405N57q22j070K21J264m65o41m6N18M22o20k43O9M63n
1418D81p07J81R27m2n39m43M47K45k01o33K90O76k87p25J0P77N56r39j008Q33
1438a01N38k41r06O9M84J165j058j077K44J224M33j158q45O49J090R1j412k21
1456a032R29N97n32r59M99N34K22q66j36N72j37k52p1L32M82n35m01L65O07k24
1476fn09l23O64O53n52p36q4J158K94o54p99M82Q69j02r03k96R72M21o82m86M3
1497e76O64J02k84m0J30j78M33m08K05J90o4J63j95K03O5m92j06K50K56r9k95
$$ plain form
1360 -788 -1625 -438 983 411 -768 -947 373 915 142 -955 -273 532 713 28 -673 -74 694 238
1378 238 -449 -233 185 263 -172 130 636 243 13 -299 771 968 31 -535 58 1055 861 -365 -295 784
1398 784 939 631 -538 -526 879 1436 614 -456 -235 1029 564 -77 -123 395 817 197 -46 23 486 481
1418 481 -226 -45 882 840 301 -142 305 550 349 -284 6 682 395 -330 -320 457 1013 74 -934 -101
1438 -101 437 196 -710 -641 -157 1008 -50 -1127 -883 341 774 -384 -1229 -580 510 601 -811 -1032
1456 -1032 -103 494 -38 -997 -498 36 258 -608 -744 -172 -309 -561 -632 -300 182 -353 -754 -389 218 -6
1476 -6 -515 -838 -174 479 -73 -809 -893 265 559 -95 -894 -412 457 355 -548 -844 128 549 -133 -619 -576
1497 -576 88 190 -94 -134 -4 -182 251 -157 48 238 174 337 142 345 410 -82 -188 62 318 219 -76
1518g6j64P41K72p46k18K52P60k05p26o1M21N00k95o89M26L01K1k53j58L67j39
1539C31m2J14l67M56j49K0k35K82j33j22j75K21J25l95J27L8J53J56l22l19L14
1560G8N40k85n79l4P48l95m04J18J90J6k46J05l25M90J60j69m7m1j26K23n8j35
1582a76n4K2L1k1K69q2k20k94L66J20k59Q3j49M34m1m91n1J87J15N5m25J68N07
1605I4o9p3l11k04O2M24r7m5J08K42k44J13k14n3J74n6J09l37J22J61j54K00j26
1628a74j3N9n2J95Qq9o9J60J89j4n89K96M32k77r1k98O27l5J24j06k40J42J15
1651C00j87r4j93L14L68j15k61r1N78l53m40L65o0K11k39j72O23J50l89O4j07
1672B72q6J01j4o3J9j25J01Q5j54j17j79L15N7k10K96j02j11O4K9L16k14l68P0
$$ plain form
1518 -76 -240 501 773 27 -191 61 821 616 -110 -171 250 750 455 -234 192 493 514 261 103 470 331
1539 331 289 403 36 492 343 363 128 410 277 155 -20 201 326 -69 58 96 249 405 83 -236 78
1560 78 618 333 -246 -280 468 73 -331 -213 -23 -7 -253 -148 -473 17 177 8 -39 -80 -206 17 -41 -176
1582 -176 -230 -208 -177 -198 71 -11 -231 -525 -159 -39 -298 -215 -364 70 29 -462 -513 -326 -211 -156 -581 -413 94
1605 94 25 -48 -359 -563 -501 -77 -174 -219 -111 131 -113 0 -214 -267 -93 -149 -40 -377 -255 -94 -248 -48 -174
1628 -174 -187 -128 -180 15 23 -66 -135 25 214 200 -389 -93 339 62 -29 -327 300 265 389 283 43 185 300
1651 300 113 19 -174 140 508 393 132 41 619 266 -174 191 131 342 103 -69 554 704 315 379 272
1672 272 186 287 273 210 229 104 205 290 136 19 -160 155 212 2 298 196 85 149 178 494 280 -88 -18
1695a8K95K0k58l45K12M08l79l50K73J45J03l16J24N1J2j33M9l7j2O9j07k5K38
1718A9j28N6p6K25k23j17j47r2j03L31P7k44L03p8P7j46Pj18J52J56l05J00p6
1741c50L56j23j34q8K61m9K16k34l3J01J04J8r8j16J46j89Q6k59L40K50n63p6
1763d34L30J32q6j40M60k81j07J70J05ol02K50K18J1nn4k11J26j32L0L1J36o4
1786A77N4j45o6K70l83M55k2j41n5l8J23O7k14J24J5r2J72p1q9j1N4K73j35n39
1810b17M29j18K91l67K57n3rm14K70K07P9l93K9j13L64j53k47M50J52l49k25p8
1832b08K86k9K58j60m39L39P7k06J35k28R7L49l03l33L35R0j50q8MMk80K4J22
1855c04M24l43j53l9J61K64P0m76K57l02L13m02l6K71J53J72P2k26P3O4n9n49
$$ plain form
1695 -18 277 297 39 -306 -94 314 -65 -415 -142 3 106 -210 -86 -35 -23 -156 -107 -144 -156 -87 -194 -219 19
1718 19 -109 -53 -129 96 -127 -244 -391 -483 -586 -255 -178 -422 -119 -197 -120 -266 -259 -377 -225 -69 -374 -274 -350
1741 -350 6 -117 -251 -339 -78 -127 89 -145 -178 -77 27 45 -53 -169 -23 -212 -126 -385 -45 205 -358 -434
1763 -434 -104 28 -58 -198 262 -19 -126 44 149 143 -159 91 309 320 315 261 50 176 44 74 105 241 177
1786 177 231 86 20 290 -93 362 340 199 144 106 229 296 82 206 221 129 301 230 141 130 184 457 322 -217
1810 -217 212 94 385 18 275 222 213 -201 69 276 355 -38 -9 -122 242 89 -158 292 444 95 -130 -208
1832 -208 78 49 307 147 -292 47 124 -82 53 -175 -78 271 -32 -365 -30 60 -90 -178 -174 -170 -450 -426 -304
1855 -304 120 -223 -376 -415 -254 10 80 -396 -139 -441 -128 -530 -566 -295 -142 30 102 -124 -51 13 -46 -595
1877e95M77K82k33j31k91L33K76j20j65j32M30k48l12L20K20l33O4L13j76K6K04
1898B09n01Q1M55n3j9l01m9M51o7j90J47K77j3l44J17j50K68j82j01K2j63O86
1920E80l95l33L29L15k18k94o5M00l1l2n41M37j39J78N8j53K62k25pj01k78M90
1942B37l34KJ47L29j56j69J31j8K78l04k17k63N49M7j48m63K59J43m4q7j21M03
1964B01j82m4j2j18q6K90O0l51m4R3M87k1o67J9J44L56l26j03L7L50m77p3J20
1987c47J81O9k39K09O7j52j08p3K96P8n8l68J86L26j71j17k45K55Q7J71k30j79
2009c62M22j80J72l77j70O86k09j63o3j06M59k35K8J7K06o4j79j46L66M7j03L2
2031G8l69N06J93n12J55n6K19o2l69J2K24K68m3k18J91J60k54r5O2J93k33M7j67
$$ plain form
1877 -595 -118 164 -69 -200 -491 -158 118 -2 -167 -299 131 -117 -429 -109 111 -222 -158 155 -21 5 209
1898 209 -292 -211 244 191 172 -129 -178 273 206 16 163 440 427 83 200 50 318 136 35 57 -106 580
1920 580 185 -148 181 496 278 -16 -81 319 288 256 -285 152 13 191 249 96 358 133 126 25 -253 237
1942 237 -97 -95 52 381 225 56 187 169 447 143 -74 -337 212 259 111 -352 -93 50 6 -81 -202 201
1964 201 19 -25 -37 -155 -241 49 109 -242 -286 -193 294 273 -394 -375 -231 125 -201 -304 -267 83 -394 -467 -347
1987 -347 -166 -97 -336 -127 -60 -212 -320 -393 -97 -19 -77 -445 -259 67 -104 -221 -466 -211 -124 47 -183 -362
2009 -362 60 -120 52 -325 -495 191 -18 -181 -244 -350 109 -126 -98 -81 125 61 -118 -264 102 149 46 78
2031 78 -291 215 408 -104 51 -5 214 152 -217 -205 19 287 244 26 217 377 123 28 90 283 50 97 -70
2054g0K00J9J41k43j70N12j07q3j1r7K73l8l52O9L13k18j56q0K77n0j4l79N34
2077B70j16J13k0j66j24M69j48m58p8K06J46K38o26L17j27K77p1l00L14k61J43
2098bN9m9j62J0j6L6K79l31k28J37N6J53j36J3J58N1k69Jl05K34N32k3l08jO4
2123d7p5k59N5J7K42O7j24j27O3L98k33k2J5k4K2P2m6k48K17J87l45J23r2R4q7
2148a57N6J99j6Pk37L69k66L9J31j59M9J0l0k90K59K06K6j77j07K79l2j72J75
2171A62j86R0J68k59k0K2O0L16j29j61j33L95q6j84N6q7O4Q3j20p9J0K52k43j7
2195b6J10k11o6N12r0M3l65M1M43j39q4l94K52N6K30l26p6L30o3O8j29O0j13K23
2219B86o9k56j16M36p0Pn13J23K61j69L26l6l99J13r6K74K88m81j64m0K86M9k29
$$ plain form
2054 -70 130 149 290 47 -123 389 282 199 188 91 364 326 -26 43 356 138 -18 -98 179 129 115 -264 270
2077 270 154 267 247 81 -43 426 278 -180 -258 -52 94 332 -294 23 -104 173 102 -198 116 -145 -2
2098 -2 57 8 -154 -144 -160 -124 155 -176 -404 -267 -211 -58 -194 -181 -23 28 -241 -240 -545 -311 221 198 -110 -111 -47
2123 -47 -122 -381 -326 -309 -67 0 -124 -251 -188 210 -23 -45 -30 -54 -32 40 -6 -254 -37 150 -195 -72 -164 -70 -157
2148 -157 -101 98 82 89 -148 221 -45 -6 125 -34 15 25 -5 -295 -36 170 196 19 -88 191 159 -13 162
2171 162 -24 66 234 -25 -45 -23 37 353 224 63 -70 325 239 55 111 24 88 171 51 -28 -18 234 -9 -26
2195 -26 84 -127 -193 319 229 272 -93 -52 391 252 168 -226 26 82 312 -14 -90 240 177 245 116 176 63 286
2219 286 217 -39 -155 281 211 218 -295 -172 89 -80 246 210 -189 -76 -172 102 390 -91 -255 -295 -9 40 -189
2242a89l1J22q%k3k22N09q6j9j92K50kN0l56P2j98K17j54K81j19k07L22n0M3j18
2267a08K06j43l14L01K18l4K5k68K13j0k03j50N22k53P5j39m0N4K27k56M2j44
2289a79K61k73J67J33m3j07J47Q2l37L11j93O6m5M72n73Q9J01K5L20m23L37l32
2311FKQ0L24l83L27Rk88J17K8K29l53J83l00J76j09J99Q8l79L9p6L93k70l24N12
2335B30Q7j90J56n58n0M94j43j3P6q5j31J41J26j17r9k6K86j33m87L30J56P4j72
2358d8l1j03jK62j43J82k43j0J65p5j1j55K63j05m1R5j56J18J28j8J6j19m1j65
2382b36K93l43K85j72N13j21m45K99k53K36k84N0j27J92J06j6j97J26K80l09K82
2403A59j82j29k05M31j18j29j57L27O5j74K34j60K33r6k05Q8j82o6J75K58j23
$$ plain form
2242 -189 -220 -98 -106 -106 -129 -351 158 72 53 -139 111 109 159 -197 -125 -323 -106 -260 21 -98 -305 17 -33 10 -108
2267 -108 98 -45 -359 -58 160 126 151 -117 96 86 -117 -267 255 2 77 -62 -102 -48 179 -77 -35 -179
2289 -179 82 -191 -24 109 66 -41 106 188 -149 162 -31 35 -10 462 -111 -22 79 104 424 1 338 6
2311 6 8 88 412 29 356 365 77 194 222 451 98 281 -19 157 48 247 335 -44 -5 -81 312 42 -282 230
2335 230 317 127 283 -275 -325 169 26 13 89 4 -127 14 140 23 -76 -102 184 51 -436 -106 50 124 -48
2358 -48 -79 -182 -183 79 -64 118 -125 -135 30 -45 -56 -211 52 -53 -94 1 -155 -37 91 73 89 -30 -71 -236
2382 -236 57 -286 -1 -173 340 219 -226 73 -180 56 -228 -178 -305 -113 -7 -23 -220 -94 186 -123 159
2403 159 -23 -152 -357 74 -44 -173 -330 -3 62 -112 122 -38 195 99 -106 -18 -200 -266 -91 167 44
2424D4k73L13j46L07j88K0j34K77k11J43l10J8J32j4nJ69j46L02m14J58L83p2
2446C53l74J47m2J03l30K08K01K09k16j64J5l16K03K85j12k91L09l38J86J79m18
2467b03K57qL13l80r7L21j30m11L02L5J3jJ05l24L27j6L29k23q0p9q4N8J55q7
2491I2m44M32k25L90Qn80J1K81K36k17k34K8K36j6k29j28J50k3K21j50mL8Q2O3
2515A8k10jo5N49p0q8k01Qj29K44l00j49J90J47k30J63k36K45J43n0k86p9L70
2538a7LM46m20l04J24J56j52qp2j65M41K60J5k98J2J79j68K20m11j56O31r3j70
2561E3n4J97J2k63J35JJ8JR3l9nJ0l23N57j97m81K5L07K98n4m80K18K15j34o0
2586E0L0J17J19k92J13o6K9j24L03k89O1J23j46j22J93j81Q5K41k71j08N6L24
$$ plain form
2424 44 -229 84 -62 245 57 77 -57 220 9 152 -158 -140 -8 -22 -27 142 -4 298 -116 42 425 353
2446 353 -21 126 84 187 -143 65 266 475 259 95 110 -206 -3 282 170 -121 188 -150 36 215 -203
2467 -203 54 46 359 -21 -118 203 73 -338 -36 -1 12 11 116 -208 119 103 432 209 129 50 -34 24 179 92
2491 92 -352 80 -145 245 253 -327 -316 -35 201 -16 -250 -222 14 -2 -231 -359 -209 -232 -11 -161 -165 -127 -45 18
2515 18 -192 -193 -258 291 221 133 -68 -60 -189 55 -245 -394 -204 -57 -287 -124 -360 -115 28 -22 -308 -387 -17
2538 -17 -14 432 12 -292 -168 -12 -164 -172 -244 -409 32 292 307 9 21 200 32 252 -159 -315 316 223 53
2561 53 -1 196 208 -55 80 81 99 100 193 154 149 159 -164 393 196 -285 -260 47 345 291 -189 29 244 110 50
2586 50 80 197 316 24 137 71 100 -24 279 -10 51 174 28 -94 99 -82 3 244 -27 -135 -79 245
2608B45q1k03K6k42L32J76o4j60O2k9j66P2J25p4j61J10K23N5k40k83qL07J86
2631B08m9j13j11m7Q5j09P3j16J11L1j67J01J22k41J63N1j39L87n27J03P0k06
2653c20K36l08L73J56L9k79k08K41N6N3j44K22l03J21j5j34K37Q6l32O4L79j93
2675B7n4J56l92K40K22l60JL0PM09R1n43J60R0n6J08L8j36L8r7j54L14q6pJ50
2700A96j11k14K25k96K44J79K6l77J15J52J2j8k54L98j42J39j47l14K53L83O1
2721E10m65o0o9j00O46k04j25J34k68K47l4m48J66L20p0J9j01j54J75k38K33r4
2743B0N7N7J26q3k08j5n9K04K12l82O4k89O76k81j78k14L43K88k44k17l56P64
2765B85k35j84j20m9k3N64j91q1j99R6L18ko56K99J23Q5m2kk00k47N09K07k33
$$ plain form
2608 245 164 -39 -13 -255 77 253 189 29 91 62 -104 -32 93 19 -142 -32 191 246 6 -277 -285 22 208
2631 208 159 46 -65 -112 -27 -136 -63 -179 -68 -37 -204 -103 19 -222 -59 -8 -147 240 -287 -184 -114 -320
2653 -320 -84 -392 -19 137 176 -103 -311 -70 -14 39 -105 117 -186 -65 -80 -214 23 109 -223 -159 220 27
2675 27 -27 129 -263 -23 199 -161 -160 -130 -123 286 377 -166 -6 84 28 136 174 38 76 -21 -175 139 53 46 196
2700 196 85 -129 96 -200 44 223 249 -128 -13 139 151 133 -121 277 135 274 127 -187 66 449 510
2721 510 45 -15 -84 -184 462 258 133 267 -1 246 212 -236 -70 250 180 199 98 -56 119 -119 114 20
2743 20 77 134 260 177 -31 -46 -105 99 311 -71 -7 -296 380 99 -79 -293 50 338 94 -123 -479 285
2765 285 50 -134 -254 -303 -326 238 47 -34 -233 -137 181 179 -477 -178 -55 30 -12 -14 -214 -461 48 255 22
2788B2m64J03M97m8j27l9j32K41L53k59m48k71M11N11l54l99J14M31O7k58J5n8
2810i2M01J02o03L6J21K78P8j10m00K6L07l10K51m02J75J12K46q7J66l41K9M48
2832D31k85k16OL1K55J80m87n1p4M53J5k72ol60P17N7l58l70L66J66J97m35J25
2855H5O0K09k40j45l0J47J69l13K34m19J03L00Qj27j71k3K99P9J2k69m64L68L92
2878B64l27k25N5N19J91m66j94l10N44K38l69k04k68N58N80p39K9j61P2K91k6
2899E2k28J10J68RN0m44Q8M14R7l6l49j15J98J59Q2k79j57L2K87o1N5m20K42L3
2923a3J14m60J35j93N38J22o91L5L40M16j92k38j70J47P1K48l37j71J54j4L56
2944A97k79J83l30O49l19J97m54K73l08N09k90L7n67L22P05k53m25q4M82K2J39
$$ plain form
2788 22 -442 -339 158 110 -17 -56 -188 53 406 147 -301 -572 -161 350 -4 -403 -289 142 209 -49 -34 -92
2810 -92 309 411 -192 -156 -35 243 321 211 -189 -163 144 -166 85 -317 -142 -30 216 129 295 -46 -17 431
2832 431 146 -70 -64 -33 222 402 -85 -136 -210 243 258 -14 -20 -380 337 394 36 -334 32 198 395 -40 85
2855 85 145 354 114 -31 -61 86 255 -58 176 -243 -140 160 168 41 -130 -153 146 225 237 -32 -496 -128 264
2878 264 -63 -288 -233 286 477 11 -183 -493 51 289 -80 -284 -552 6 586 -153 -124 -285 -213 78 52
2899 52 -176 -66 102 111 161 -283 -195 219 316 280 -69 -184 14 173 255 -24 -181 -149 138 77 132 -288 -46 -13
2923 -13 101 -359 -224 -417 121 243 -448 -413 -73 343 151 -87 -257 -110 -39 209 -128 -299 -145 -159 197
2944 197 -82 101 -229 420 101 298 -156 117 -191 318 28 65 -502 -180 525 272 -153 -237 245 267 406
2965D06m28J17j90K62k3k45JK73K11o0n80q1M13L42k88j72J4j66L35m3j37J08
2987F9J7J88j09l22K62j52M88l1o77K16L1J59K43j99k70oJ44q9m9k39K49L45M8
3010C16o45K48K64j87K12l53L7J10Q3k7l45J65L05r9r1j98K16k0j03K22k20J74
3032F4j28m8M4J71K1l81K0J22M6k08L4K09K12k83l2j33p8M90k27p8k01L37J70
3055A43j34k82L94J59m63j81J2L07PK12l22jK75K5l34M18k78o4j1L09j89j01j
3078a00J57N1m7j98K49j02N4l1Q6J31m7j08q5R7j14q9J99J15k30J77k06K5K42
3101B26m78N04l3j41K24j96k67L27m5k33J30Q0j27Q3p2J47n14K03N3M16k14k37
3123a64Q0O5J0L46k57l77M5L16K8l74L87L2k84L08l32P6J13j5J35k36O6j10M2
$$ plain form
2965 406 -22 95 -95 167 144 -101 -100 173 384 324 -256 -337 76 418 130 -42 -28 -194 141 98 -39 69
2987 69 86 274 165 -157 105 -47 441 410 -267 -51 -20 139 382 183 -87 -93 51 -38 -87 -326 -77 268 316
3010 316 -329 -81 183 -4 208 -145 -108 2 85 58 -287 -122 183 84 -7 -205 11 -9 -112 110 -110 64
3032 64 -64 -112 -68 103 124 -257 -237 -115 -69 -277 -243 -34 178 -105 -137 -270 -348 142 -85 -163 -364 -27 143
3055 143 9 -273 121 280 -183 -364 -352 -45 -38 174 -148 -149 126 151 -183 235 -43 -107 -118 191 2 -99 -100
3078 -100 57 108 61 -137 112 10 64 33 119 250 203 95 10 107 -7 -96 103 218 -12 165 -41 -16 226
3101 226 -252 252 219 78 302 106 -161 166 121 -112 18 98 -29 54 -18 129 -385 -182 -129 287 73 -164
3123 -164 -84 -19 -9 337 80 -297 -252 64 92 -282 105 137 -147 161 -171 -95 18 3 138 -98 -32 -142 -100
3146a00K89K78o23P3k12M40k05K26m64K48L47r9j76k38L16j25J89l85j83K17L81
3167A94j06k79P6k6K67K3m43L50l13L89j81K5j23R1J22K1r3j76J0J30J30j54j44
3190b10j14N18k62K58k38J64j98J11p1K2j86M9K05r2n5J50K14l3m20K45J46j67
3212C6q6j41J86m4J81k78N64l33k94L04k59K47n9k91K28K66q6j00n5J14P0k21
3234e1J47l17J21N80j89l50j43K93j1l44K52J21r3J75j44k76L00l6J62k32L17
3255B82k90J37K47l46J23j62o4P5L0Q2p4n3K79j87n6J9m2J5J25j56k84J09O5N1
3279g5N6j24K40j36k36K4O1K56Q1j04l92k6M09J24k46K8K05l87M18k28J0J27p4
3302A1k52J3L20M3k15J53l35L99p6J2l68L50j60M9k1m0K00j9J8k51K73r0Q2j39
$$ plain form
3146 -100 189 467 -156 -83 -295 145 -60 166 -298 -50 297 198 22 -216 100 -25 164 -221 -404 -187 194
3167 194 88 -191 -115 -141 126 149 -294 56 -257 132 -49 -24 -147 -56 66 87 -6 -182 -172 -42 88 -66 -210
3190 -210 -324 194 -68 190 -48 116 -82 29 -42 -20 -206 -157 48 -44 -99 51 265 232 -188 57 203 36
3212 36 -50 -191 -5 -49 132 -146 418 85 -209 95 -164 83 24 -267 -39 227 141 41 -14 100 170 -51
3234 -51 96 -221 -100 480 291 -59 -202 91 80 -264 -12 109 16 191 47 -229 71 35 197 -35 282
3255 282 -8 129 376 30 153 -9 -73 2 32 114 40 -13 266 79 23 42 0 15 140 -16 -300 -191 -126 -75
3279 -75 -19 -143 97 -39 -275 -251 -190 66 147 43 -349 -375 34 158 -88 -60 145 -242 176 -52 -42 85 11
3302 11 -241 -228 92 135 -80 73 -262 137 61 73 -295 55 -105 -56 -77 -117 83 64 82 -169 104 14 96 -43
3326d3K04k10J47R1l46K39J7j38m0M9M42l48j21j52L22J0J52j64qrp9q4j08K15
3350C8r9K63l72K00oj60J76p2K72O7k44K16k20k2p3J65l46L64R5j75n9PK23k43
3374eJ08k61K30J88k22J5q1R7lj97K30j67K18n3j34o1L86m1j34K1q3J29q8k09
3398a17lK71j52j51L4R3K01P8l63k6M81k37l45l0K05K7J30l23K0L89k72M4P9P
3422D0j03j16K09j18o1r2J8J68l34M18j10K11k57K40l06K15j89J56J16j90P3l9
3444e1K81l33QJ29J26k26J20L0j66K4J99j08l01P8K17r5j72J84J2k1J02p0j87
3467b20J44J72l88L79Q6k1r8K0M9k38K7O4J88J32k61j77N95l93L82m10k21M68
3489B79k83M60n45J46J32n8p5k63J18J1L18L9k25r6J19J47k3j25j52M61k42n2
$$ plain form
3326 -43 161 -49 98 189 -157 82 99 -39 -79 -30 412 64 -57 -209 113 123 275 111 103 94 15 -69 -177 38
3350 38 -61 202 -170 30 24 -136 40 -32 240 307 63 279 59 37 -36 129 -217 147 242 67 8 15 238 -5
3374 -5 103 -158 72 260 38 53 -28 69 66 -131 99 -68 150 97 -37 -98 288 247 113 134 51 180 92 -117
3398 -117 -120 151 -1 -152 -118 -25 176 254 -109 -135 346 109 -236 -266 -61 -34 96 -227 -207 182 -90 -46 33 40
3422 40 -63 -179 30 -88 -149 -241 -223 -55 -389 29 -81 130 -127 113 -193 22 -167 -11 105 -85 -12 -51
3444 -51 230 -103 -95 34 160 -66 54 84 -82 -58 141 33 -268 -190 27 -68 -240 -56 -44 -65 37 -33 -220
3467 -220 -76 96 -292 87 173 152 54 74 123 -115 -88 -24 164 296 35 -142 453 60 442 32 -189 279
3489 279 -4 456 -89 57 189 131 56 -207 -89 -78 240 279 54 -42 77 224 201 76 -76 385 143 91
3511I1j74N6j42M42n9r9L7J03m42P7N03m96K9k04O15k39k95l2J89N0k46K07OK06
3535A83p6k39P5P4j23K61k06r2q3M37Q0l84J44q3J92Q4j75j91L35j59or2k80N02
3559A78LJ32m37N8Qn8J93K62m56l6P2K22r4m02K05j11J78J70m41n9M69L52l67
3582D1q3j13P6L39j18j91n05K99M61j17p3l3p2K34k67k59Q3M38J40ro02K52k07
3605b86J24K05n8J84j15L27k74l6L6j42J26M25o90j56N23j03K10m12K2k8L93k21
3627E4J21l88J03L30k78K3n6O9K98l90K27k94L50J52j19j41j90j12K63K65k47
3648D0j02o2J90K19j85k57n0K24j40J94J2j50J13P2j39q4j6J92L27j80k16j36
3670a34M20J24o83R9M7O25m44j87J9O9J28k5Pk04k03J89J72m0j83j17M22k1J57
$$ plain form
3511 91 -83 -27 -169 273 214 115 152 255 -187 -110 393 -103 -74 -278 337 98 -197 -229 -40 10 -236 -29 -23 183
3535 183 107 -132 -57 17 -106 155 -51 -143 -226 211 291 -93 51 -32 160 244 69 -122 213 54 48 -44 -324 178
3559 178 181 313 -124 -66 -58 -116 77 339 -117 -153 -81 141 47 -355 -150 -261 -83 87 -354 -413 56 408 41
3582 41 -42 -155 -79 260 142 -49 -554 -255 206 89 16 -17 -89 145 -122 -381 -298 140 280 271 -331 -79 -286
3605 -286 -162 43 -15 169 54 381 107 71 107 -35 91 516 -174 -330 193 90 300 -112 -90 -118 275 54
3627 54 175 -213 -110 220 -58 -35 -91 -22 276 -114 113 -181 169 321 202 61 -129 -241 22 287 40
3648 40 -62 -124 66 285 100 -157 -207 17 -123 71 83 -67 46 118 -21 -105 -121 71 398 218 2 -134
3670 -134 286 410 -273 -174 -127 498 54 -133 -114 -45 83 58 65 -139 -342 -153 19 -21 -204 -321 101 80 237
3693B37l36J07l53M54l5k74j18L72J26m90K78k37M94j76J81j69m11M96pOl41K64
3715F8p3Rk04K05L5pN0q7j44J39n6Q4R5k74N9PQ0M6j02J43l28K93M89k30m43L03
3741A57J13m76K46p8J08J26l63L74m17K55k29J2L68l78j86K10k0L62k84mL72J85
3763D53k83L11K46l49m08J43j64jN67K92j306R70n95P86p45N0k96J98M42p07M25
3784B9J45j83l24Q30m3p7n57K96N35r35L78n68L28K58J58j38kj9o3R5n15K20l36
3807d88O18j96jL40k47n42K6O65l18L88n72K44J12L03o7o98P91J05r18N12rl15
3829b67m17Q21m49N07j45K88M6k21M4m67N82J26L5o71N47k54k08l71P45k9M81
3850G23kk76n96j43M05Rj24l60j05N63p64M36N92K05o64O09l23K08l74K79o75
$$ plain form
3693 237 -99 8 -345 109 74 -200 -318 54 180 -310 -32 -269 225 49 230 61 -350 146 139 145 -196 68
3715 68 -5 4 -200 5 40 33 83 -4 -148 -9 -65 19 114 -160 -101 -94 -14 32 -70 73 -255 38 527 297 -146 157
3741 157 270 -206 40 -38 70 196 -167 207 -210 45 -184 -172 196 -182 -368 -158 -178 184 -100 -104 268 453
3763 453 170 481 727 378 -30 113 -51 -52 515 807 -499 471 -124 662 -83 -33 -329 -131 311 -396 29
3784 29 174 -9 -333 497 454 377 -180 116 651 -284 94 -474 -146 112 270 132 130 111 48 143 -372 -152 -488
3807 -488 130 -66 -67 273 26 -516 -490 175 -143 245 -327 -83 29 332 265 -433 358 463 -455 57 48 -267
3829 -267 -684 137 -312 195 50 338 384 163 207 -260 322 448 483 -188 359 105 -103 -474 271 242 723
3850 723 721 445 -151 -294 111 120 -4 -364 -469 94 -670 -234 358 563 -101 508 185 393 19 298 -377
3871c77L27L64o84M97L45n83k0K04j45j90J45n37J311m48L79o47n5L75J37o35
3891b37N3J23n40O09L98j7L9n60L34k90n61Q89p57O94nk78K48k3J9L55k39k52
3913BL7P4N09n24m0L96j100K95K11oj79M69j92n80L52J507p92l6j91k60n25O38
3935F5n68J468n60J66l96J1k39p6J40J68k13k29m78n0J092l38P3L36p65l45O25
3956a13k34M17l23Q65j16k63L91q63L22L73Q5j848J967m09j103J221N1l65J67
3975B22L48l83M64j080N37J90l2q72M93O97n24p23O58j3K4L37o18K97j06M6L29
3996B91pm52l05R19p06J98Q0o1j66k64M68Q37j098M40k4K96n17j50Q94l05k78
4017I0P6J03k64p50N41K13j38N19j02J5l79M18n42N04k65o82M06j88Q69q52O10
$$ plain form
3871 -377 -50 314 -370 127 472 -111 -131 73 -72 -262 -117 -654 657 209 588 -59 -114 261 398 -237
3891 -237 -184 -61 -601 8 406 389 428 -132 202 -88 -649 240 -517 177 172 -106 142 119 138 493 254 2
3913 2 39 113 622 98 58 454 -646 -351 -140 -146 -325 144 -48 -628 -276 1231 439 403 212 -48 -573 65
3935 65 -503 965 405 571 175 186 -53 -129 11 179 -34 -263 -741 -791 301 -37 36 372 -393 -738 -113
3956 -113 -347 70 -253 612 496 233 624 -239 83 456 541 -1307 660 251 -852 369 420 55 222
3975 222 570 187 651 -429 108 298 266 -606 -113 584 60 -663 -5 -18 6 343 -275 22 -84 -38 291
3996 291 284 -168 -473 446 -260 -62 18 -43 -209 -473 -5 832 -266 174 150 446 -71 -221 673 368 90
4017 90 166 269 5 -745 -204 9 -129 390 288 303 -76 342 -200 304 39 -643 -237 -425 444 -408 202
4038B02k55j34N73Kj38k17k48J56L43l45q6K27j36j26p2M62l88K57l4J84k67r6
4060a36M32j15J84j83J40n02j25P85p47jR2N0QP9j4J81k49L63n36N14J15N0K02
4083E87p9l56l32K82Q3J62m92R7K65L41r50O79n40r3O53Lq80P37l70K98L17n04
4105i2M12m91K29m78L69J89l70L17k45j14O8J51k58L78l37L36K13j41l96M07j42
4126Ej90L76k28M05o19J92j29M33o07q1N90j03L03j92j29m26M11J66n55N50n4
4147A18k31L72j01j01K7l22J10k73M23K09k30K27j25L24o00K66jJ30j00m8j56
4168h2K89m50j2P11p03N85o02J32K11j87J24m00M90j05j50K82k35j4rK37k45N3
4190h0L6j6k7J15q3M39o44N00j52j37j01K80k34j28J16J50L4l7P3j42j56L10j38
$$ plain form
4038 202 -53 -187 386 388 250 33 -215 -59 284 -61 -147 80 -56 -182 -254 208 -180 77 43 227 -40 -136
4060 -136 296 181 365 182 322 -180 -305 480 -267 -268 -176 -126 -118 -39 -53 128 -121 242 -294 220 335 385 587
4083 587 508 152 -180 102 185 347 -145 -48 217 558 -392 287 -253 -346 307 310 -570 167 -203 95 412 -92
4105 -92 320 -171 58 -420 -51 138 -232 85 -160 -274 -206 -55 -313 65 -272 64 277 136 -260 147 5
4126 5 -185 191 -37 368 -251 -59 -188 245 -362 -443 147 44 347 155 26 -400 11 177 -378 172 118
4147 118 -113 259 158 57 84 -238 -128 -401 22 231 1 228 103 427 -173 93 92 222 122 74 -82
4168 -82 207 -243 -255 456 -247 338 -264 -132 79 -108 16 -384 106 1 -149 133 -102 -116 -125 112 -133 -80
4190 -80 -44 -60 -87 28 -55 384 -260 240 88 -49 -150 130 -104 -232 -116 34 68 31 104 -38 -194 116 -22
4213b2R0l05K1J56P4q7J96j01j39J96L7O9k65q1Q6L50l96K12l25K37P4L5m41J56
4237a73K88j74J27k10j25M58j1j29j56K9J21k01K68k6j6K16m08r6K95j16j14L05
4259A52P3l48R7J21p6kO4l6l16M61K4j28l9r0J69j4j90j72K29m1J01n9KJ19K33
4284C34n11N6J03j02K38m95J07O4K99o8j38ql6J3K91Jk33J80j25j8M4o0K6J24
4308H6j47J4K4j68r0K44Q9R3m6l39N01p3o1k7o0j54J56L56m51o5n3n2L40j48K60
4333B29K1m19J77p4J58k11K32k40j25J69K10j00k85q8K14l2O03n06j29Q3o7M21
4355B41l46J53p6j21K71l32K51k45R0K28k06J37J16j69L25n2q1j56j78J65K96
4376C11j90j97J60L7K01k77j84K27M2K33l15j09J19J58J59j31l08J58M0j84j89
$$ plain form
4213 -22 68 -237 -216 -60 14 -73 123 22 -117 79 116 185 -80 -161 -75 275 -121 91 -234 3 77 112 -329 -173
4237 -173 115 -59 68 -142 -267 191 180 51 -105 -76 45 -156 112 86 70 286 -122 -218 77 -39 -153 152
4259 152 225 -123 -26 95 19 17 81 45 -271 190 214 86 47 -43 126 112 -78 -250 -21 -62 39 -20 -18 101 334
4284 334 -177 -121 -18 -120 118 -377 -270 -206 93 25 -113 -121 -157 -144 147 148 -85 95 -30 -48 -4 -64 -38 86
4308 86 -61 -47 -23 -191 -281 -37 52 145 99 -240 261 188 127 100 40 -114 42 398 -53 -118 -171 -223 117 -31 229
4333 229 250 -169 8 -66 92 -119 113 -127 -252 -83 127 27 -258 -346 -132 -164 439 -67 -196 -113 -180 241
4355 241 -105 48 -28 -149 122 -210 41 -204 -114 114 -92 45 161 -8 317 265 184 28 -150 15 311
4376 311 121 -76 84 121 322 45 -139 88 130 363 48 -61 58 216 375 244 -64 94 134 -50 -239
4397b39J75P3j31J92l1j04LL64k22Ol8K38l21k4J65L71k94M4mm76L18o2K2J14
4421A39j40n0J67m3j20J97k93M70k36p8K16m03J7L24j96o3J80M4q4j93L49k37
4443c3m9J74M2k58l7K14Q5j56Q5j60J23j93K41pl60M02k09l8L34l10P7K74%l25
4467h4m1q3K74k40k0M16n86M46J38l33K13j43L3o4J61K2k53k34J70K08l31P0K91
4490C0J29k81J06j9k43M90j47n7j2L68j67j90l9M6K93On10L87M4j35k20L4P2R2
4514G7j88j83K97r9J07j03l5J93O4m00p9N06r4j55K56k41J22l23L70q6j39M7p5
4537a61J7n8P2K47m77M68R7j23k42K99k69K41K6j71L4l6rl5K13l24K67o7l07L34
4561C6kk77j34L42o4J18Q9k70J48k9K41k11K19k01j43j43K32N0k19K31R5m3n8
$$ plain form
4397 -239 -64 9 -122 70 39 -65 -62 302 80 86 48 286 -35 -59 106 477 183 227 223 -253 65 3 25 139
4421 139 -1 -51 116 73 -47 150 -143 327 91 13 229 -174 -157 167 -29 -92 88 132 48 -145 204 -33
4443 -33 -82 92 134 -124 -161 53 138 -18 67 -93 30 -163 78 71 -289 113 -96 -134 200 -110 -33 241 241 -84
4467 -84 -125 -208 66 -174 -194 222 -364 82 220 -113 100 -43 -10 -74 87 109 -144 -378 -208 0 -331 -261 30
4490 30 159 -122 -16 -35 -278 212 65 8 -4 364 197 7 -32 14 307 313 -197 190 234 99 -121 -87 -15 77
4514 77 -111 -294 3 -96 11 -92 -127 66 130 -270 -349 157 63 -92 164 -77 45 -278 92 6 -133 -86 -161
4537 -161 -144 -202 -130 117 -360 108 205 82 -160 139 -130 111 137 -34 0 -36 -45 -80 133 -191 76 9 -298 36
4561 36 34 -243 -377 -35 -99 19 108 -162 -14 -43 198 -13 206 5 -138 -281 -49 1 -218 13 108 65 7
4584Gn9r8J06j19j9J6L05p7M5k18J43J48j36j33n0K76k78J39m4J72m6j44K51r5
4608I2j58P4m9n6RJ7Q0J1L93n10J68N7J33j08J07j32nK31k19j04L5K3J55l30k5
4633a11J17R6j2j25J87r1k25L26p8r4j06R0L0k32K26J50l4k41p8L73k99P3k2J94
4657A14J78k20k1p0J8L05l05j54L05k04o6M9NL39k09j88P8N3q5pJ62O3m7j23L1
4682AK55k24M4Q7j97O7J7J08j20j00L4N6pl15M85m28R4J5J3O5P4j49J75J54j87
4707A7N3j36J36j49K43q7p2J60o3k33L40k11j71L52j01ln4Lr3K35l19N5K10q0
4731C2j29K99q1j87j87K01Q3N5p7k28K57k58J71j8K8j25K81m9k3k70Q9k6j0L16
4755A44j66r4M73n81J30J33j70J18J30j15R9J22k97LK53k08kn4o7M2P2M1j51N36
$$ plain form
4584 7 -52 -150 -44 -163 -182 -166 139 62 107 -111 32 180 44 -89 -139 137 -141 -2 -46 126 80 -64 187 92
4608 92 -66 8 -41 -97 -88 -71 9 20 413 -97 71 128 261 153 260 128 123 354 135 31 66 89 244 -86 -111
4633 -111 6 102 90 -35 152 61 -164 162 84 -10 -116 -26 4 -228 -2 148 114 -127 -205 168 -131 -58 -80 114
4657 114 292 72 51 -19 -1 304 -1 -155 150 -54 -120 -71 -66 273 64 -124 -46 7 -78 -85 77 140 93 -30 1
4682 1 256 32 76 163 -34 33 50 158 38 -62 -28 28 21 -294 191 -237 -143 -128 -115 -50 24 -125 50 204 17
4707 17 70 -66 70 -79 164 77 5 165 102 -131 209 -2 -173 179 78 75 21 24 -69 166 -153 -98 112 32
4731 32 -97 202 121 -66 -253 -52 31 86 9 -219 38 -220 -49 -67 -39 -164 117 68 45 -225 -136 -162 -172 144
4755 144 -22 -116 357 -224 -94 39 -131 -13 117 2 101 223 -74 -71 182 -26 -28 -82 -149 -107 -35 6 -145 391
4779C91j86l06K19j79j8M2MJ63L0j3L4K45n42K58J0l22L01J14k20K9k41N25l14
4802B4o7J03L33l18q0r1J8J28r0J87l23K96m19M34o8r9j5J15j42R6Q5R2k09J4
4826DN4l70L27L0j03j38PJ94q5K81j54p3j14N6N4N7J36k36J14K2o1k09J66K18
4850A77j45m7J98j97Q0j42K48p9K19k53j75J05kJ58l48L3M72k37o5j00N8L0j36
4873a48n8K87L1J64l68J24q8j0ooK67j76Lk70J75o6M82k04l07K53J07m34O1L81
4897A94k53J1L76n60J13K57r0K5k46Pp1M74k82k01M37l11K71l4J0l1L7r5J2J26
4921A76j26j99K19q0m4K17j55Q7m2Q3k5r4j17O8k20L40l17J59Q5K0p4J70j04n2
4945b5J4K2n7J50K5k35K20j80M2j6n9O2J61P5j55k29K80m7j39N6k5p7L52k86K2
$$ plain form
4779 391 205 -101 118 -61 -79 -37 -33 130 160 147 181 426 -116 142 152 -170 131 245 25 54 -187 338 24
4802 24 -43 60 393 75 -5 -96 -78 50 -40 147 -176 120 -299 135 67 -32 -47 68 -74 22 107 199 -10 4
4826 4 58 -312 15 45 -58 -196 -189 5 -80 201 47 -26 -140 -84 -30 27 163 -73 41 63 2 -207 -41 177
4850 177 32 -15 183 -14 66 -76 172 93 312 59 -116 -11 -13 145 -203 -170 302 65 0 -100 -42 -12 -148
4873 -148 -206 81 112 276 -92 32 -56 -66 -72 -78 189 13 16 -254 -79 -145 337 133 -174 79 186 -248 -187 194
4897 194 -59 -48 328 -232 -119 138 48 73 -173 -166 -237 237 -45 -246 191 -120 151 117 127 96 133 38 50 176
4921 176 50 -149 70 -10 -54 163 8 95 53 136 111 17 -100 -32 -252 88 -229 -70 15 35 -39 131 27 -25
4945 -25 -11 11 -46 104 129 -106 114 -66 -24 -40 -99 -37 124 199 44 -185 95 48 -91 -35 -60 -137 215 -71 -49
4970d9N5K47j07k57L02ok41p6P7J69j44j15J62p2L33o36M04J88m14K72k29J38
4992AR7j2j3j43J02J00o8j20n1J36j66J87k7J04l11K90n9j52J6m2J54j33o1J27
5016d4l1J00j29m2K12j9K7K76l86J9P2O8j56j32N5K41k10J78j34l26N35J03l15
5039c8K41l38J52j97J84k0J21R1l43J28r7j9J62j42J51j09K23q9j37L4O9P8j01
5062Dk44J03N98n89J70J58n02L06O1K53m42JK38J72m9m66M26J01m39l0K65k18
5084a23l5p5J84k71K60q5K2L25k42n4K69l39J13J99J11j90j14P1j23l8mj8r1J06
5108a42R9q1j88J49K16J6m09N10k82L43j91r0j57n0K36K53k19J5r2L99k90j22
5130g7JK29k69M03m78LK09j13K20k01L78j66o1J35m83L05K2p7J36m09K63k66N70
$$ plain form
4970 -49 6 253 146 -111 191 185 -56 -132 -55 114 -30 -145 17 -55 278 -358 46 234 -180 92 -137 1
4992 1 98 86 73 -70 32 132 64 -56 -107 29 -137 50 23 127 -184 106 47 -105 -89 -131 23 -110 -171 -44
5016 -44 -75 25 -104 -146 66 47 74 350 -36 -17 55 123 -33 -165 -110 131 -79 99 -35 -361 174 277 -38
5039 -38 203 -135 17 -180 4 -16 105 196 -147 -19 -116 -135 27 -115 36 -73 150 61 -76 -42 27 105 4
5062 4 -240 -137 461 -128 42 200 -302 4 65 318 -124 -123 115 287 238 -228 198 299 -140 -170 95 -123
5084 -123 -158 -233 -49 -320 -60 -145 -123 202 -40 -94 175 -164 -51 148 259 69 -45 26 -97 -135 -139 -157 -248 -142
5108 -142 -43 -124 -312 -163 53 69 -340 170 -112 231 40 -50 -207 -257 -21 232 13 28 -64 335 45 -77
5130 -77 -76 153 -116 287 -191 -188 21 -92 128 -73 305 139 78 213 -270 35 57 -20 116 -293 -30 -296 274
5153B74l13Q7K1j60p6k3L42l69K64l93N84k23OQ1m28K08J46k2j92J96j38K68k74
5176a34l9M6O7M09m86O2K2j7j00K10k52L06p3j19p2L23J5j18j83K28p9j04L32
5199B44p5k11n6K75j94j81K52j00L0j23J38J75n53J47L42m8p4j06K1n6L97m44
5221b00j01M01J45k73O8k18qK9k7K85o13O54k56K38J9k17J56N2k34jL7j59K36
5244A3p5J2J01j36J57O5j58K02m7j03K66m42j85L09J6j10K29K64n44K50q8Q3j93
5267a14p6R0L23k79O2J74k36J48j16r3L05j85J19K92l30K02j46p6k16K6K18j07
5289a5J72k62Q2M2Q8K00l64J1n0J82m4m9OR1j40J73M1k72P2J78k40j21K60k71
5313b30J97l7L37k11l40J88J4J31l0J10k1k3Q4k75K72j06P8r1M0j24J91l01R9
$$ plain form
5153 274 -39 48 69 -91 -167 -190 152 -217 47 -346 238 15 21 102 -326 -118 28 6 -186 10 -128 140 -134
5176 -134 -173 -127 -60 349 -137 -75 -53 -70 -170 40 -212 94 21 -98 -170 153 168 50 -133 95 16 -88 244
5199 244 169 -42 -98 177 -17 -198 54 -46 -16 -139 -1 174 -379 -232 110 62 -12 -118 -97 -153 244 -200
5221 -200 -301 100 245 -28 40 -178 -186 -157 -184 101 -512 142 -114 124 143 -74 82 134 -100 -101 -64 -223 13
5244 13 -62 -50 51 -85 72 137 -21 181 134 31 297 -145 -330 -21 -5 -115 114 378 -166 84 -4 79 -114
5267 -114 -190 -100 223 -56 6 180 -56 92 -24 -117 188 3 122 414 84 286 140 64 -152 -126 92 -15
5289 -15 157 -105 -23 19 107 307 -57 -46 -96 86 42 -7 -1 90 -50 123 164 -108 -36 142 -98 -219 41 -230
5313 -230 -33 -70 267 56 -284 -96 -82 49 19 129 108 85 169 -106 166 60 138 47 87 -37 154 -147 -48
5336d8J26K10j62l20J58k7j9j12J45J06j30P4o5k19J48N67m96j4k33N47l96l0
5358a90M3K1J89j43p3K62Mj66k02J72j07K0K54q1j63K49j44J05O1q4O6LL4j13
5382A7K35m25K88j49l5j50J13J28j61J10r0o3L1P2J45J3Rk05k3K61J3j56J91j55
5406A4j63Q0R4J05j8J04j37K8p1k0J16l09J78K32j03p6K61k92k06K89j73j26L81
5429A88j66L4j47K54K83k54L2k64Q2L98n76P1J68p0q8J85k97m0J98J35M4J10j33
5452A47k88j5J95Q4k68j34K85J60k05J62j09n1M24m47m8q6K00L90k72l3k69PK26
5475E5q3Ol5J6q0J21M6m6j54L28l80J14J77K13j87j43K56k45Ll3N1J43J63l27
5499b1L9m3j54q3J89j19o1M45k70M6K69j28l02O7J27l16N25k33J94j03J67l95
$$ plain form
5336 -48 78 288 126 -194 -36 -63 -82 -194 -49 57 -73 1 -64 -283 -135 432 -64 -78 -311 236 -160 -190
5358 -190 -147 -126 63 -80 -153 109 113 -53 -255 -83 -190 -170 84 3 -160 89 -55 50 111 27 93 96 130 17
5382 17 252 -173 115 -34 -69 -219 -106 22 -139 -29 -119 -182 -151 -79 66 79 88 -117 -140 121 134 -22 169 14
5406 14 -149 -69 25 130 112 216 79 107 36 16 132 -177 1 233 130 54 315 23 -183 106 -67 -193 188
5429 188 22 56 -91 163 446 192 224 -40 42 440 -136 -65 103 33 -55 130 -167 -207 -9 126 170 280 147
5452 147 -141 -156 39 123 -145 -279 6 166 -39 123 14 -37 387 -60 -108 -194 6 396 124 91 -178 -171 55
5475 55 -28 -22 -57 -41 -121 0 46 0 -154 174 -206 -92 85 298 111 -32 224 -21 -18 -51 0 143 306 -21
5499 -21 18 -25 -179 -262 -73 -192 -253 192 -78 -32 237 109 -193 -126 1 -315 210 -23 171 68 235 -160
5521a60K79k02k37J16J57J17k79L46l69M26k03j44k02O12l38M25J04m34R5Rk06
5542h8l7J53J23O2j18k69R6l3J03n7K5J66j86K77l73M09j40L23l30k0j73K08k96
5565a75K04o4J83L9o2k37J21K13k11r2L84m80K62k25M01j35l93N2L15k40m1K59
5587G8k48K18l4l62L57P0r9m6P7r4J11O8l78N7K53n5o1K84k76O9j2k0OQ5k71J18
5613a05J06p4K61m36K74k67Q2J24J68j78R3p3j84K25J41o9p2p3R7j58l5J27K9
5636CJ49l29O6q2J95Q3k29K03K9j69J88r7r5o2J61M6l18p7M08m0k1k8J4p0j19
5661a91N03m23J70k10R9K41k91O3j25J63L4K77k45rM63l61J21j41j74k29M27k86
5683a24J22J60k05L54j54j72n9L3j08K09m6K64j65k32j20O1J76n6n8J37j15m8
$$ plain form
5521 -160 119 -83 -320 -204 -47 70 -209 137 -232 194 -9 -153 -355 257 -81 344 448 14 109 118 -88
5542 -88 -125 28 151 213 95 -174 -78 -111 -8 -65 -40 126 -60 217 -156 253 113 436 106 86 -87 121 -175
5565 -175 29 -35 148 187 125 -112 9 222 11 -81 303 -177 85 -140 261 126 -267 -215 100 -140 -181 78
5587 78 -170 48 14 -348 9 79 -20 -66 11 -83 28 96 -282 -225 28 -27 -88 196 -80 -11 -23 -43 -37 48 -223 -105
5613 -105 1 -73 188 -248 26 -241 -159 -35 133 -45 48 -25 -209 16 157 88 16 -57 40 -118 -153 -26 3
5636 3 152 -177 -111 -193 2 85 -144 59 88 -81 107 10 -85 -147 14 60 -258 -335 73 33 12 -16 -2 -72 -191
5661 -191 312 -111 59 -151 -52 189 -102 -39 -164 -1 33 310 65 56 519 158 279 138 -36 -265 162 -124
5683 -124 -2 158 -47 307 153 -19 -78 -45 -153 56 10 274 109 -123 -243 -182 -6 -62 -120 17 -98 -146
5705a46N8r3L24o5R7m27L49k38J38r0j5l04N85m93M79m01K21n3q8J14n8K08k56
5728a54J55k9K93j42m6j9k09K00J33O5l38N6n5J70n3l17O15l22j13J12k9p0K11
5751A14l82J89o9L41k3k51J45K4k29L64k29m2J6j10m4J59J41l92M2J89J79j58
5773b6rm9L9R9j42M7j88J26J92k51J62jK37k40Q3K26k9k20P9mN4j64J70j82k7
5798a8J05N3m9K23p74N96M9N8l95L19r2j53J96L6Q9m09K25J97k93jN8O0k50K36
5822F6K7k34QJ50J24j46N3j64K71o4J54j49ol67j0L43k39L24k99K95K03l21J00
5845A19Lk09q2K24j78n8Q7J43m8o7J93j69l6L15j54k39k65K10L01k16o5L56j49
5868A6P4l13J90n8j67L64l51K65J89m38J33k63N16j33k27K23J13L6k65K35j91
$$ plain form
5705 -146 -88 -181 143 78 175 -252 97 -141 -3 -93 -108 -412 173 -320 159 -242 -21 -74 -162 -48 -106 102 -154
5728 -154 1 -28 265 123 77 58 -151 49 182 247 -91 -35 -90 80 27 -290 325 3 -110 2 -27 -97 114
5751 114 -268 -79 -148 193 170 -81 64 88 -141 223 -6 -48 -32 -142 -186 -27 114 -278 -236 -47 132 -26
5773 -26 -35 -84 -45 54 -88 -41 -229 -103 89 -162 0 -1 236 -4 79 305 276 56 135 131 185 21 191 9 -18
5798 -18 87 140 91 314 -460 136 185 243 -152 167 75 -78 118 154 243 -166 59 256 -37 -38 20 80 -170 66
5822 66 93 -141 -133 17 141 -5 48 -116 155 91 245 96 90 -277 -287 56 -183 141 -158 137 340 19 119
5845 119 122 -87 -169 55 -123 -181 -94 49 1 -66 127 -42 -78 237 83 -156 -421 -211 90 -126 -191 165 16
5868 16 90 -223 -33 -91 -258 106 -245 20 209 -229 -96 -359 157 24 -203 20 133 169 -96 139 -52
5889e2J76k54J77j93K64l74J60l5N5K53k04R3l6m5P3k5l7j05J43K57j67j11J41
5912A54j03O0l61Q7L23J5Qk52P6O2n2r3l2J53L10m35q8M3J72m8pJ92l25J14L4
5937GJ96j11k66kJ08o5M05O2n01J98j05J01j02J4n5%K20m6j18L69n9m55K49p6
5961c2J78l52K28M6k77N59k63J62l53K50L1j29q8J24J38k04p3O9l14K12o5K82
5983A29%l68J71j31L2L37l00R2j82K06j16J60j31q4kK48P2n9k59K32k07L59l44
6006a45J58K17l36k08J33L46kk41J48k88J22n5L2k11M01j68J09L88k98R9j8l93
6028b10M43j89M2Q4j38M2k79J33R0L9p1K02j02L8j77KOK20l97P3J56j1P8k55M17
6053B36j85n6J60j74K27k32j03J17L6j2k90L04r6J72j66K3J3O7O1p2k15M41k02
$$ plain form
5889 -52 124 -130 47 -146 118 -256 -96 -131 -76 177 -27 66 30 -15 58 33 -4 -109 34 291 124 13 154
5912 154 51 111 -250 -163 160 175 183 -69 7 69 17 -76 -108 45 355 -80 -168 -125 47 -1 -8 184 -141 -27 7
5937 7 203 92 -174 -176 -68 -133 272 334 -167 31 -74 27 -75 -61 -116 -116 104 58 -60 309 250 -205 44 -32
5961 -32 146 -206 22 68 -209 350 87 249 -104 146 177 48 -40 84 222 18 -55 14 -300 -88 -153 129
5983 129 129 -239 -68 -199 -167 170 -130 -38 -220 -14 -130 30 -101 -185 -187 61 133 74 -185 47 -160 199 -145
6006 -145 13 230 -106 -314 -181 165 163 -78 70 -218 -96 -151 -119 -330 71 -97 12 400 102 201 183 -210
6028 -210 233 44 86 170 32 74 -205 -72 18 57 -14 188 86 124 -53 -51 -45 175 -222 -149 7 -4 74 -181 236
6053 236 51 -5 155 -19 208 -24 -127 -10 26 14 -276 28 -68 104 -62 -39 -26 41 102 30 -185 256 54
6076E4l9lJ28J07l38K66o0J36k52q1M8J92k59q2K91N7k84l0K92m3M2j20J05K8
6100A55j18J46p2j05J27Nn09J83J05l8M37j08k59l49M73K8j35J4k41K14j03L82
6122B32l44P4j32j00K17K16l21L55j90j01m2l1L8J17N6m9Nl70J15J82p4k2J21
6145d8K26j52n0j34K55p9l3N4k8Q2j60L2K70L6k38l10L35k01J45L5m33M06k2m7
6169e9J23k87P7L55k45J20k13K79q9l07k2M58m7l1m8o1K62j34o6K0J29nl91P8
6193a04j3j64O30n22K66j25q1P0O3q9K34L0l07J60m8k6R9k17R0R0l11L13p1K62
6217B29j01J88m44j98J66N2K92l42K76k20P2o1KL21k33K03l54j14K78k53J37J33
6239B9jj63J17L4k38K79k90K02j04J60J56J9o5k41J70n1p2K58r2J23j40n0J47
$$ plain form
6076 54 15 12 140 247 -91 175 115 251 -1 -82 -34 158 -101 -183 108 165 -119 -149 143 100 142 22 127 155
6100 155 37 183 111 6 133 138 -371 -188 -83 -121 316 208 -51 -400 73 101 -34 -20 -261 -47 -150 232
6122 232 -112 -38 -170 -270 -53 163 -158 197 7 -94 -136 -167 -129 -12 44 -5 0 -370 -255 -73 -147 -169 -48
6145 -48 178 26 -24 -158 97 18 -15 39 11 93 -67 -35 235 271 33 -277 58 -143 2 37 -396 10 -12 -59
6169 -59 64 -223 -146 209 -36 84 -129 150 61 -246 -268 190 143 112 64 3 265 131 65 85 214 209 -182 -104
6193 -104 -117 -281 349 -173 93 -32 -113 -43 20 -69 165 195 -112 48 0 -26 73 -144 -54 36 -275 38 -33 229
6217 229 128 316 -128 -326 -160 -108 184 -158 118 -102 -30 -91 -89 232 -1 202 -152 -266 12 -241 -104 29
6239 29 28 -135 -18 16 -222 57 -233 -31 -135 25 181 200 135 -106 64 13 -59 199 107 230 90 40 187
6262A87l09K07j06N7k58L12n40N27J54n09K72j05J72k66J80K6K13k59m2J40j41
6283h8Q2o1r5L34k71lJ14l15M25j85M8k59K13J64j89O3k37K12J04L0l4l7n7l69
6307d11M04J3k2k4R8p2J28k13J2PK8RJ31j92N1j42M80o5j0m05K06J62m02L74m36
6332b91J84J11j25J14j0k8J88m21L72q4J28m15K44K4J2J98j14k79K72r4m5J83
6354A24l18J47j21K64j32N1j14M3K67k45J36m2j72j16r0R5J30l33L68L18j74l3
6376E3k86L70j25O1L7j08k77K58J45j07K6M0j75l8K02j13r0J4PK80k65J50n0j58
6400a49L65q1Q8l87P4O1O5J02k12p2J56q8k4J88q4J54rj52N4LL6m00L40p3%J29
6426H4m9j6K57k29k3j30J34j7k37J56J94k58J38j20j43L42j64M14k89p8j23L40
$$ plain form
6262 187 -122 85 -21 36 -222 90 -450 77 231 -278 -6 -111 61 -205 -25 1 214 -45 -87 53 -88
6283 -88 -6 -67 -162 172 -99 -102 12 -303 122 -63 -15 -274 -61 103 -86 -23 -260 -48 56 86 52 15 -42 -411
6307 -411 -7 6 -16 -40 58 -14 114 -99 -87 -80 -52 -43 88 -104 -53 -195 285 220 210 -195 11 173 -229 145 -291
6332 -291 -107 4 -121 -7 -17 -45 143 -278 94 10 138 -277 -33 -9 3 201 87 -192 80 -14 -59 124
6354 124 -194 -47 -168 96 -36 15 -99 -56 211 -34 102 60 -112 -228 -318 -223 -93 -426 -58 260 86 53
6376 53 -233 137 12 73 110 2 -275 -17 128 21 47 87 -88 -126 76 -37 -127 -113 -106 174 -91 59 9 -149
6400 -149 216 135 223 -164 -90 -29 36 138 -74 -146 10 -78 -102 86 2 156 147 -5 49 52 88 -312 28 -45 -45 84
6426 84 35 19 276 47 24 -106 28 11 -226 -70 124 -134 4 -116 -259 83 -81 333 44 -34 -157 183
6448A83k66K37j35j00o1J80J12l61K36k00J98j41R5j1p5Q7J81k51L01J09j66j58
6470fK4L4m5q9k8R0j15J14K07m84L33k69L38M2m82L62j49J98P3k7L9m14N09k56
6494aP5M5j98K6P6J11k48J01K65n11N8K22oN3L7j91k60M31j70J41k64L08k76J36
6518d0N6%j18j36K76m5J40k4j0j75j52J38J24R3j05j0J18J17k55K38l03J60P3
6541A60l64J74P2j37L81%m30O7r4K98J3l33J10Jm3K24Qr5p0N3J36p1j99M7K08
6566A16Mk63pJ61J38l8j17J1k7j32K38J45j71J7k66K3J68q0K47kl74M58l40K93
6590B02k91k30K21J28o5%J37j8nj42R3L4K97l33K21l06K09l57J69p8m1J49j29
6613a35J25p4N6Q3j23l14J65P4j4M0L06j94k10M59j77J42l29J09N2P4r3l80R8
$$ plain form
6448 183 -83 154 19 -81 -142 38 150 -211 25 -175 23 -118 -23 -34 -109 -22 159 -92 209 318 152 -6
6470 -6 18 52 7 -82 -110 -20 -135 -21 186 -298 35 -234 104 146 -336 26 -123 75 148 121 160 -254 255 -1
6494 -1 74 119 -79 -53 23 134 -114 -13 252 -259 -201 21 15 68 105 -86 -346 85 -85 56 -208 100 -176 -40
6518 -40 16 16 -102 -238 38 -7 133 109 99 -76 -228 -90 34 127 22 12 130 247 -8 230 -73 87 160
6541 160 -204 -30 42 -95 286 286 -144 -77 -171 127 140 -193 -83 -82 -125 99 107 12 -58 -5 131 60 -139 -92 116
6566 116 120 -143 -150 11 149 111 -6 5 -22 -154 84 229 58 75 -191 -168 0 -80 167 165 -209 249 -91 202
6590 202 -89 -319 -98 30 -35 -35 102 84 79 -63 30 64 361 28 249 -57 152 -205 -36 -114 -155 -6 -135
6613 -135 -10 -84 -28 55 -68 -382 -217 -143 -157 -117 189 -5 -215 244 67 209 -120 -11 41 115 22 -358 -260
6636b60L63j31R6L3Q1l64J50J4j5Q8q4R0j36K30k39k8L63j22r8J68n59J80L56
6659A76j47N9k52K43l28K45M55j09m05K05k29k2J07q6L6j02P8r2J14j02j10K66
6681@R6J27n01L41j72J48k98N13r5L0q8J59k27R5j85P1K1k01J66NJ15Nj4j67K23
6706A67k19j2q9J45MJ67j09J12j11M16n68K07K49m84K81j15O5o6J71k06P3l01
6728b23N09k27k35K60m8k92L08NN1K8l1k83J71l9j78J19l8K67j97L89r9l79M0
6751a22j26K29K55l42q8J8M36l38K20n00M64j32k12K90j66K64j17kr1K45n00L29
6773A4M4j65j55K07j27K27j36L24jj13J99n18J41J71oj38Q3L3j19L89l94J46j0
6796I6p8l27K27m5L52n9j65Kj08O9j04R2n6J38M2qj26N1j91J80J28K38j95j71
$$ plain form
6636 -260 103 -28 68 101 182 -182 -32 -18 -33 55 -29 61 -75 155 -84 -112 251 129 31 199 -360 -180 176
6659 176 29 88 -164 79 -249 -4 451 342 -63 142 -87 -109 -2 -88 -52 -154 -76 -168 -54 -156 -266 0
6681 0 96 223 -278 63 -109 39 -259 254 159 189 101 260 33 128 -57 14 35 -166 0 5 120 125 111 -56 167
6706 167 -52 -64 -153 -8 -4 163 54 166 55 471 -97 110 359 -125 156 41 106 40 211 5 78 -223
6728 -223 286 59 -176 84 36 -256 52 57 108 136 105 -178 -7 -46 -224 -105 -143 124 -73 316 217 -162 -122
6751 -122 -248 -19 236 -106 -194 -176 260 -78 142 -358 106 -26 -238 52 -114 150 33 31 -60 185 -315 14
6773 14 58 -107 -262 -55 -182 45 -91 233 232 119 318 -200 -59 112 106 -32 51 84 -35 354 -40 106 96
6796 96 18 -309 -82 -127 225 166 1 3 -105 -36 -140 -48 -104 34 76 68 -58 -7 -198 -18 110 348 153 -18
6820a8J77r3n4n6l5J89Rj88J34j93Q1k06M01j54P2Kq4Q4K16n49J92J63Ln09K43
6845a73L24j35J54k16J40m6m5K99k61L9k49J09j9R5n2L72j81l9Kl93K75K21q4
6868A37j07K1K76n00J85R5j02Q7j45K78o76M50m6r8j11J84J47n71Q47n15K25j43
6890h2j29L28k06p3r9L43o0M1j89j65N87k1l78L8m1J8L7k18K22r3M53m77P6K83
6914A95k01N6K4j20J76m88P95m28K1K13M8k68p4L03k00j68l5K5m8L27j22L7k97
6937b29L53j99N60l87j11KJ9p4J65o6q8j82O3J26K47k74M2l44Q47l50j09rL09
6960C11m27K4K01j48J09k8k4L9k44j49M6M4K14J35j67J23J58j99j76K92l11N3
6982a24K15p95P95O4k77K96j08P4j40K7r2oO2O7j0j90j00M05l71J02J06l1n4j99
$$ plain form
6820 -18 159 66 12 -44 -79 110 119 -69 65 -128 -47 -253 148 -6 66 68 -16 68 284 -265 -73 90 93 -416 -173
6845 -173 151 16 170 -46 94 48 3 302 41 80 -169 -60 -79 16 -36 336 155 116 118 -275 0 221 137
6868 137 30 51 327 -173 12 107 5 92 -53 225 -451 -1 -47 -145 -256 -72 75 -496 351 -164 61 -82
6890 -82 -211 117 -89 -162 -261 82 22 63 -126 -291 296 275 -103 -65 -106 -88 -51 -269 -47 -140 313 -164 -88 195
6914 195 -6 50 74 -46 130 -358 437 9 30 243 291 23 -51 252 52 -116 -151 -126 -174 153 31 68 -229
6937 -229 124 -75 485 98 -13 -11 8 -66 99 33 -55 -237 -174 -48 199 -75 -33 -377 470 120 11 2 311
6960 311 -116 -92 109 -39 70 42 18 57 -187 -336 -290 -246 -32 103 -64 59 217 18 -158 134 -177 -124
6982 -124 91 -704 91 155 -122 174 66 140 0 27 -65 -71 -9 58 48 -142 -242 163 -208 -106 0 -31 -85 -284
7006b84K46j06k1K7J97j81M8R0J04j27K5k4Q1j39N9Q4k8j54J38l8o0J58n0L41
7030C86m83k1K61j71Q5k78K06j27O9K44k11K52n09KL33q0j71k3J73lL7J34j46
7053d1J94k23j3L41m62J75j16K31k60j08K99Q3j80L58l41O0N9o2J79m0k45L65
7075B53k38Q1j61Q1N4j26L54j72j36l7K66k68J86Nj43O01m96J06k82Q9k18J01
7097a00n3M39l27NK85m71L24m56K71m7K81l2j32j85J75K85n23K59J21l3j8j69
7119a01K07k57k6O7J97j1j90j59K73r3M9j11L75j89J1r0j21K79o1j27J44K90m39
7142h3J05Lk07m5L66J01m8p8j68R7J72k03j68KK60l45K64k87K34l1J15O9j58J49
7166A16j74L3M3r9J22l68L83Q8l65M1m9L75k71j06K14n7O2K2r3M33l23j67J79
$$ plain form
7006 -284 -38 -144 -165 -138 59 -122 -74 16 120 -7 18 -6 75 -64 -5 79 51 -103 35 -3 -63 95 45 386
7030 386 -97 -118 143 -28 57 -221 -15 -142 -73 171 -40 212 -297 -295 38 -42 -213 -236 -63 -66 -29 105 -41
7053 -41 153 -70 -83 258 -204 -29 -145 86 -174 -282 17 100 -80 278 -63 -3 56 -6 173 133 -112 253
7075 253 15 96 -65 16 70 -56 298 126 -10 -47 219 -49 137 142 -1 600 104 210 -72 17 -201 -100
7097 -100 -153 286 -41 -36 249 -222 102 -354 -83 -130 151 119 -13 -198 -23 262 -261 -2 119 86 68 -101
7119 -101 106 -151 -177 -110 87 76 -114 -273 0 -93 -44 -155 220 31 42 -48 -169 110 49 -78 66 356 -83
7142 -83 22 25 -182 -227 139 240 192 114 -54 43 215 12 -156 -154 106 -239 25 -262 -28 -59 56 125 -33 116
7166 116 -58 -25 18 -81 41 -327 56 144 -221 -180 -229 146 -125 -231 -17 -74 -12 10 -83 350 27 -140 39
7189C9J1r3P7m9k65P5J21j13Q1J46J16m24M0K97o5j33J98J5pl66N20r1j69M0m32
7214d31L58J23K7l6P4q4K54k05p8l1J10j57j51N08l63L05j56J64m15K91k1k06
7236a20L4j02K61j53J34j25J10L52m45j95M04j5m70J53K90l14L43j48j05j79L00
7257A0l7M2L3J35K3j13m0P8k54J37q0lk9K1J83k21J69K73m44J56L7l86M43j74
7281d1P8l7J12j44P6j11j52R7L48j91j31Q1j39j1J73M2o5j31L34j11k15j03L21
7304H0J23k79l5M8R6p2Q0K9%J91k54P8l52L04n6L3j16j71L93o1j02L03k44m8j32
7329a64M47j10j14j96J84j7j13K40j67l7l4j1j80K61J07J31l29l8M0rkk9J17P
7353a6q7k4K81l93L00j43K16l22K77l61J57L89n07J33J33m3j64R6J48P3l64L59
$$ plain form
7189 39 50 -43 34 -15 -280 -205 -84 -197 -116 30 146 -278 -238 59 -6 -139 59 74 67 -299 221 130 -39 1 -431
7214 -431 -73 50 77 41 115 31 285 80 2 -29 81 -76 -227 281 -82 223 67 231 -184 107 86 -120
7236 -120 -86 -188 73 -80 54 -71 39 391 -54 -249 155 140 -330 -177 113 -201 142 -6 -111 -290 10
7257 10 -27 15 48 183 206 93 53 131 -123 14 -66 -69 -98 -77 106 -115 54 327 -117 39 76 -310 133 -41
7281 -41 37 0 112 -32 44 -67 -219 -122 226 35 -96 -15 -154 -165 8 50 -15 -146 188 77 -138 -241 80
7304 80 203 -76 -111 -63 33 -39 41 70 70 261 7 85 -267 37 -19 14 -102 -273 120 59 -43 260 16 -32 -164
7329 -164 283 173 59 -137 47 30 -83 157 -10 -47 -81 -92 -272 -11 96 227 -102 -140 -100 -109 -111 -140 -23 -16
7353 -16 -103 -127 154 -239 61 -82 134 -188 89 -272 -115 274 -233 -100 33 -10 -174 -78 70 143 -221 138
7375A38J2k12j22K8L1J10L2l01K01J45k37J32j03L31j87j92M5J5O3o5J27j79J09
7398g9K93l66j81J96k%L12k45N2K35j75k47L67n43K80J59K00j67o9k33K46M8Q
7421H9l2l14K93P0j21K38k09k55N2K96j38K13k41l51N62j46K58o45M03J39l19
7442a58J09J09P9l27J67k45N00q2J94m3m52o5O12r92J500j563P87q8p21m90R35
7463b34K32j052R23M37r92M24L66J58M47o85l4j07J5l96J195p25K44k09j42R2
7483d3M9M34l03n06L69n34O08k28M29k22m5m08P1M29j02J15l70k58J136o19j65
7504a63J77o0J89J37l36O6N51m36k18o4L83R5n15j21NM23k91L46j98j07K38n3
7526D8m43J72J41L7l15J77L08k85J00o8J61K6k90J12J37k83O5j17O15q6NP8K53
$$ plain form
7375 138 150 -62 -184 -156 -125 -15 17 -284 -83 62 -175 -43 -146 185 -2 -194 -149 -134 -71 -136 -9 -188 -79
7398 -79 214 -152 -333 -137 -139 -139 173 -72 -20 215 40 -207 160 -383 -103 56 256 89 20 -213 33 81 89
7421 89 57 -257 36 106 -15 223 14 -241 -189 107 -31 182 -59 -410 152 6 264 -381 22 161 -158
7442 -158 -49 60 139 -188 -21 -266 234 152 346 303 -149 -214 398 -594 906 -657 130 42 -679 -1169 -234
7463 -234 -2 -1054 -131 306 -686 -262 104 262 709 24 -10 -117 -102 -498 697 -28 216 7 -135 -43
7483 -43 6 440 137 -369 0 -534 74 -154 275 53 8 -400 -329 100 -2 113 -257 -515 621 2 -163
7504 -163 14 -46 143 280 -56 10 561 125 -93 -157 226 321 -194 -315 -310 113 -178 168 -30 -137 101 48
7526 48 -395 -223 -82 -45 -360 -183 125 -160 -60 -128 33 59 -231 -119 18 -265 -200 -317 298 212 217 295 548
7549E48n77k4M79p29M06J62l90l8M89l82J97j01k4m9K26m47M34Qj20m75N52J3
7571A58k88J82J4R3M1r17Q35q3L69m04j08J62m4J1M64o85R75n37p24N48j47J22
7593C7j30M58m35m14M60m09P25K26m94N76p70L24K90m38n3n4n0k9o0N43M05k87
7615D21K80q92j91P17l36k75M02k18J9j70M38L84p47o20K6J448o00k89L60j55
7635Bl46P30r07L35M47L75n5j167M95j21l53J192L11n86m34N39m52M91l63N96
7655G29r50O48j754N41J141j199J240J30o1q60l48J325j235J395o9j114j9N65
7673A05J293p06j707J821k96k93j21J44l17K13J017j277M11R0p83J032l08M84
7691H02r90J39N71j188N51l80O85m71N41l33k9oP30o62O96m09L59j378J11P38
$$ plain form
7549 548 -29 -53 426 -303 103 265 -125 -163 326 -56 141 40 16 -33 193 -254 180 188 68 -407 145 158
7571 158 -130 52 66 159 200 -717 118 35 404 0 -108 54 10 21 485 -200 775 238 -486 62 -85 37
7593 37 -93 365 -70 -484 -24 -433 292 518 24 600 -170 154 444 6 -47 -101 -151 -180 -240 303 708 421
7615 421 701 -191 -382 335 -1 -276 126 -92 -73 -243 195 579 -168 -788 -762 686 86 -203 157 2
7635 2 -344 386 -521 -186 261 636 581 -586 -91 -212 -565 627 938 352 -82 457 5 496 133 729
7655 729 -221 427 -1327 -786 355 -844 396 526 465 -395 -743 582 -653 742 673 -441 -460 105
7673 105 1398 692 -1015 806 510 217 96 240 -77 136 1153 -124 287 377 -406 626 318 802
7691 802 -188 -49 522 -666 -115 -495 190 -281 260 -73 -102 -108 622 -40 656 247 606 -772 -661 77
7711G7M4O47q60Q46n52o54K45Q26o76M81k26O05j563Q87m7K61p23N77p01M91j92
7732b07k38M33L01k76k89N69P6n81J1K52J70l0L02k68q0o74O33Jn06P52K60n47
7754F4k88L41J82o08p1J078q70M5N68J80p57n62K43P23J28n97L27o83J84M60K42
7775C29q0J9o41J92Q44Q8l45l21O73m1p31Q21m1o43l02PL90m86KO04J54n56j02
7798a66L58K21p15O71l09P98m71n65P3l98L53j48O00n38L00j61L13j046m98J984
7818F56j284J132n72j32L65l82J050ln09J80m50L92j46o4l59o89O97N16l70k9
7838al35L25L50q47J82k39Q81j106J244o08M76l98j81o4J48l0J38j84l09O24K14
7859B80j128M85n9J33j03N80k85m24J020j197P20r6j26k24L82M93l4r23K18o01
$$ plain form
7711 77 121 768 -92 754 202 -452 -207 619 -57 424 198 803 -760 127 80 341 -382 195 -506 -15 -207
7732 -207 -445 -12 289 13 -276 293 369 -212 -201 51 221 191 493 225 145 -529 104 105 -401 351 611 64
7754 64 -224 117 299 -309 -380 698 -172 -127 441 621 -136 -698 -455 268 396 -201 126 -557 -373 87 329
7775 329 249 268 -373 -181 663 751 406 85 758 717 -14 807 766 123 -179 -172 218 -268 -266 338 492 -64 -166
7798 -166 192 413 -302 369 60 858 387 -178 -105 -503 -150 -298 302 -236 64 -97 216 -830 -1328 656
7818 656 -628 504 -68 -200 165 -217 833 830 321 501 51 443 297 233 -126 -815 -118 398 28 -1
7838 -1 -336 -11 339 -508 -326 -565 316 -790 454 -154 322 -76 -257 -321 -173 -203 -65 -249 -558 66 280
7859 280 -848 -363 -422 -289 -392 188 -97 -521 499 -698 22 -74 -200 -424 -42 451 417 -506 -288 -889
7879h89Q60o6M01p76J53P08m52lj48P45m16J13k86k82j52P25q8M34q74M36m53
7900c10P02O7RM49j237j33M88M01p3j61j32n24M27j53J13L17k99k12L63j06J13
7921A09O2k1k58J43r8j63M30l61r0M08l05K29r4K02o03K38L73j57o4n06l9O44
7943G9j23j80L41p18L97n2J83k04M04n74N74j55o9J86J14k0J37j52k62l21N05
7964I0j14K37l85n7M06j23l13L41j29q0J1K93l74M83L3m48q5J89L26l4l97J23
7986gnM35o46M03j00k2k28N4J28o9j45J55J91m20K46J61j6K37l39j92J96J74r5
8009I6J84l87L22l83K13k1n1J75k52J90r9j49O9K58m01K41j03J26M4k69K06J04
8031A13l7P7k96J96o3J55j28J40M4j91k36K46J71M1k17l3K5ln4J30oj0n9l59L03
$$ plain form
7879 -889 -29 -95 306 -470 -317 391 -61 -64 -212 533 117 230 -56 -338 -490 235 147 581 -293 143 -310
7900 -310 392 459 468 917 -320 -453 35 436 363 202 70 -454 -27 -180 -67 250 -49 -261 102 -4 109
7921 109 171 150 -108 35 -63 -226 204 -157 -247 161 -144 85 -9 193 -410 -172 201 44 -20 -526 -565 79
7943 79 -44 -224 117 -601 -204 -256 -73 -277 127 -447 127 -28 -97 89 203 183 320 168 -94 -415 90
7964 90 -24 213 -172 -229 177 54 -259 82 -47 -127 -116 177 -197 286 319 -129 -214 -25 301 267 -130 -7
7986 -7 -12 423 -223 180 80 58 -170 -116 12 -57 -202 -47 144 -276 -30 131 115 352 13 -179 17 191 96
8009 96 280 -107 215 -168 45 24 -27 148 -104 86 -13 -162 -93 165 -236 5 -98 28 72 -197 9 113
8031 113 76 153 -143 53 -10 145 17 157 201 10 -226 20 191 232 15 -18 7 4 -50 80 74 64 5 -354 -51
8056e1J03O8J68l79j7J25Kj78R7K80j88k24L01j74M2j01P4J65o4j42M67l50O6
8079I0j00l01K47K03r0J34j59j64L6n2R5O5r5J15J07q1K5k60K21n9M8j82N6j05
8103b06K76p3r0J08m3j27L14l3j84j93M16j32j34p1j5K74J1j94MQ6K96j65j2j77
8127f4j42L35o8J9L0k18L1J11P9m6L12k46k08L03o0j45j42M01j90j55M3J92j1
8150A61n48M22N81k19m42j65L0K0K00Lq1J39k2Q2m72L65J18k43k04j5K10n2oj37
8174b75L36r4M8k5J12j03J54k73J79j41j80J55L64m01O8R2M0
$$ plain form
8056 -51 52 120 288 -91 -108 17 19 -159 -62 218 30 -194 107 -67 -25 -126 -52 113 49 -93 374 24 90
8079 90 -10 -311 -64 139 49 183 24 -140 -104 -156 -61 4 -91 24 131 50 75 -185 36 -23 25 -157 -101 -206
8103 -206 70 -3 -93 15 -28 -155 159 126 -58 -251 165 33 -101 -172 -187 87 98 -96 -92 -6 290 125 113 -64
8127 -64 -206 129 61 80 110 -108 -77 34 113 67 379 133 -75 228 168 23 -119 282 92 -63 -20 172 161
8150 161 -387 35 616 397 -45 -210 -180 -160 40 43 -38 101 79 161 -311 54 172 -71 -275 -290 -80 -132 -138 -275
8174 -275 61 -33 15 -10 102 -1 153 -120 59 -82 -262 -107 257 -144 -76 16 56
8191E6
$$ Imaginary data points
##PAGE= N=2
##DATA TABLE= (X++(I..I)), XYDATA
0@%%%%%%%pJ5j6J6j6K0k8L4m2N0n8P1q5J00j16J33j53J76k01K29k60K96l37L79
31B00m25M77n34N97o67P43q26R17j017J127j247J378j526J692j876K083k318K588
49A366k900L267l704M236m901N761o924Q592j1198J5878k6906J00031P2682j97778
63d2498p5013Q4132J18644m8113j06382k374J23903O3816p2890j14007o668P2607
75d843N1732j9729l0884J157K2798K865k1532k4524o156J3391L5145L0835j1581
88C8674n5938l5025L6628N4825j2443n8065q506P0466M5485n9785r1436J1898
100f3222R6803M2043o8451o7631L4692P7037m787q3573l9899O5449P7770j4449
112E1782p6398k9259M7236M1897k3397m7319J333M9517K9110k8752m5212n066
$$ plain form
0 0 0 0 0 0 0 0 0 -7 8 -8 8 -8 12 -16 18 -24 26 -32 39 -46 54 -62 71 -82 94 -107 122 -138 158 -179 200
31 200 -225 252 -282 315 -352 391 -435 482 -535 592 -655 723 -803 889 -987 1096 -1222 1366
49 1366 -1534 1733 -1971 2265 -2636 3125 -3799 4793 -6405 9473 -17433 82598 155280 -42498
63 -42498 -117511 -33379 85265 37152 -69230 -71604 52299 116115 43225 -70782 -77450 -4843
75 -4843 46889 27160 -3724 -2567 20231 23096 1564 -22960 -29116 -15725 19420 50255 38674
88 38674 -17264 -52289 -15661 39164 26721 -31344 -39850 30616 76101 16316 -75120 -63222
100 -63222 33581 75624 7173 -60458 -25766 51271 46484 -37089 -76988 -11539 66231 51782
112 51782 -24616 -53875 -6639 35258 11861 -35458 -34125 15392 44502 15750 -29462 -34528
124c4528K5041J9606q75q510n066p28O188O444j1081k3316k977L3542L4976j5948
138B2768m8453j3837L9534L0335k7556m0148J0533N0749K0856m3063m6009J1274
150c3017N0933J4782l9115k7485K4761L9455p018m2277j8851L0341L4053p526
162A9036l1098o124K2282J0173j2699j2683K572J2167O266l283m712p390k861
175h354M656J1992M515j3115j0189J0813J4574l980k0806o222J7985K1442n985
188A7326k5003j0612J8501J8339r864j9826J008K1539J1400j6015k0618K193J9940
201H308M865j2477n569R290O232p164p387P57N248L133l998P87N619j50q709n580
217f795N881Q387k238p082j196N406O169n767r567q29J0663M969o337o583J929
$$ plain form
124 -34528 -9487 10119 9244 734 -4332 -5060 1128 7572 -3509 -26825 -29802 3740 38716 22768
138 22768 -25685 -39522 12 30347 2791 -37357 -26824 23925 44781 1718 -44291 -33017
150 -33017 17916 32698 -6417 -33902 -9141 30314 23296 -18981 -37832 -7491 26562 19036
162 19036 -12062 -18186 4096 14269 1570 -11113 -8541 3626 9892 6609 1897 -5493 -8354
175 -8354 -3698 8294 12809 -306 -10495 318 14892 10912 -9894 -16116 1869 23311 17326
188 17326 -7677 -18289 212 18551 8687 -11139 -10131 11408 22808 6793 -13825 -11632 8308
201 8308 13173 696 -4873 4417 10649 3485 -3902 -3145 2103 5236 1238 2025 7644 7494 -1215 -6795
217 -6795 -914 7473 5235 -1847 -3043 2363 8532 2765 -6802 -7631 3032 8001 1664 -4919 -2990
232b990N216J926m893l629J767M968m53j970j612p29l78K492J756k816k229R09
248b665K800P68k955l340J215N326J221m538m642J918O636p20m949k762L346P266
264C925j114q484m115O015P550j885p080j377N434M529j288r057j148O225N923
279D053j312p285j389K864O314j506n836k962N571O615j741n479m133L376O391
294C541O39m852m203M550M687K60n839l041K934N138J574n325k932L584L036j97
310C554k350k857J216L114J539k028l144L80L763N91j034l963P15L359J476l378
326I53j182Q67L500K8k885j688J788L029j424k211k153K558M051j758k606o95
342A72K80K357j188j528N52K866o01k928m53J072J578j447J42j408J762M55q03
$$ plain form
232 -2990 2226 4152 -741 -4370 -2603 2365 1912 -58 -1670 -2399 -2777 -285 1471 -1345 -3574 -2665
248 -2665 135 903 -2052 -5392 -4177 1149 2370 -2168 -6810 -4892 1744 1024 -3925 -6687 -3341 3925
264 3925 2811 -5673 -9788 -3773 3777 1892 -5188 -6565 -1131 3398 2110 -6947 -8095 -1870 4053
279 4053 2741 -4544 -5933 -3069 3245 1739 -4097 -7059 -1488 5127 3386 -2093 -6226 -2850 3541
294 3541 4180 -672 -4875 -325 4362 4622 -1217 -4258 -1324 3814 5388 63 -2869 715 3751 3554
310 3554 1204 -1653 -437 2677 4216 2188 -956 -576 3187 3778 2744 -1219 -504 2855 4331 953
326 953 -229 638 4138 4166 1281 -407 1381 4410 2986 775 -1378 1180 5231 3473 867 172
342 172 452 2809 1621 93 645 3511 2910 -18 -471 601 2179 732 874 -534 1228 1683 880
359H80k708Q06J856L40j096j055O68R65l08p93j020m4J462M68k261J95O42m76
377a479N74j65r40j09Q28M44L9k779M32J269J993n65l381O38K129M46Q4j821j091
396c454K207J054k46l729J164K883K09k500r02J258J148K435l499j137J847J042
412b20j01j267j89J55J232J783j933j384J017J741l10j693M77J006J50Q34q55
429D43m01j04L77J004l18p15J51m17J120K77p24j72O04P84n7j362J221k07L97
448A901M22q71j002J136L14o3l36p41J121R7J39o28j97J405j085q42J085n31m23
467I01k00J274P37o69p09k430J563L025j247k517O5J796J31m97J0j915M45K171
485A934k48k461k4J290K472j990j773j559K513J620m62k862R5J848P38j308q48
$$ plain form
359 880 -1828 -1022 834 1174 78 -977 -309 656 348 -445 -1465 -1509 -47 421 -1840 -1645 -1003 -1479
377 -1479 -905 -1070 -2010 -2119 -1291 -847 -808 -3587 -3155 -1886 107 -458 -3839 -3201 -1072 -626 -542 -2363 -3454
396 -3454 -1247 -193 -439 -4168 -3004 -121 88 -2412 -3314 -2056 -908 1527 -1972 -3109 -1262 -220
412 -220 -321 -1588 -1777 -1622 -390 1393 -540 -1924 -907 834 524 -1169 -692 314 464 1298 443
429 443 42 -62 315 1319 1001 286 437 20 1140 1417 693 521 1125 1909 1852 490 1711 1504 1901
448 1901 2323 1452 450 1586 1900 1837 1501 760 1881 1978 2117 1489 1292 2697 1612 770 1855 1324 901
467 901 701 1975 2712 2043 1334 -1096 467 3492 2245 -272 -207 1589 1720 1223 1233 -682 -237 1934
485 1934 1686 -775 -799 491 2963 973 -800 -2359 154 1774 1312 -1550 -1455 393 1131 -177 -1025
502a025j484M42L252j843j773K9J075J436K25j681j876K294K071j707k604K16
518b953J443J397n49k234n84K208K424k344k326Q2K669J613l073o13N23K406N37
535F26k254j506J482K307J77k493o74R03Q35R98p31j557L65Q42J868k030n45N24
553h63O92J998j037k369o84K990J217j490k192Q55K707J857l418l695L272L970
569C810j426l809j912N614L395k163o875m13O648M003m437o791J808P280K147
584F879n960m702L082N750L13m212m579L144M379R18l137k993k0K773K569j190
600C014l674k036L488L359J927o814n191M777P613q5p744n739O145Q820j426j1010
616d576m728R894R006m509j2736k34J1874O596r753j0108K928J2156L786j0408
$$ plain form
502 -1025 -2509 -2067 1185 -658 -2431 -2402 -1327 109 334 -1347 -3223 -929 1142 -565 -3169 -2953
518 -2953 -1510 -113 -662 -2896 -3480 -1272 1152 -1192 -3518 -3436 -767 846 -2227 -2840 -2317 89 626
535 626 -1628 -3134 -1652 655 832 -1661 -2335 -1432 -597 401 -330 -1887 -1522 -680 1188 -842 -1387 -863
553 -863 -171 1827 790 -1579 -2263 727 1944 454 -1738 -883 1824 3681 263 -3432 -160 3810
569 3810 2384 -1425 -3337 2277 5672 3509 -3366 -3779 2869 6872 2435 -4356 -2548 4732 6879
584 6879 919 -3783 -701 5049 5362 1150 -3429 -285 4094 5012 1875 -1118 -1138 1635 4204 3014
600 3014 -660 -2696 792 4151 6078 -736 -5927 -1150 6463 6378 -1366 -7105 -960 7860 6434 -4576
616 -4576 -9304 590 9596 5087 -7649 -7883 3991 10587 834 -9274 -6346 5810 9596 -812
630h12r984O123J0312J930j0677o291N961R003k62p780m915M702N804L64m974
645a496l804l72N494N377k417q055m097P013R008k71j2656n980J0022J2815l100
660G481j7883m653J4742J4305p663j8829k297J8730J1673j1551j7432J939J8571
673G133O602j3530j2482M745J4769L271j2039q140O211R180J355q082m230J937
687c300N498K349k131m539k122L818L981J538o965n287N408Q182J853j1242p937
702a0896Q264J4407j144j6332p180J3604J4045n838j8292l239J7048J1623j0394
715E676j7591J717J7480Q192j3491j3186M818J4694L559j0209r249L525J0960
728F895P01o930n325K960L626J557q1l417l349J316M975L353m681q925K369J0854
$$ plain form
630 -812 -10796 -4673 5639 7569 -3108 -9399 -3438 5565 5303 -2477 -7392 -2690 3114 3478 -1496
645 -1496 -5300 -5672 -178 5199 2782 -5273 -9370 -2357 6651 6380 -6276 -12256 -2234 10581 7481
660 7481 -10402 -15055 -313 13992 6329 -12500 -14797 3933 15606 4055 -13377 -11438 7133
673 7133 13735 205 -12277 -7532 7237 10508 -1531 -9671 -3460 5720 7075 -1007 -5237 -3300
687 -3300 2198 4547 2416 -2123 -4245 -427 3554 5092 -1873 -7160 -1752 6430 8283 -2959 -10896
702 -10896 -2632 11775 10631 -5701 -12881 723 14768 8930 -9362 -12601 4447 16070 5676
715 5676 -11915 -10198 7282 15474 1983 -11203 -6385 8309 11868 1659 -7590 -4065 6895
728 6895 7596 666 -4659 -1699 1927 3484 3403 -14 -3363 -2047 2928 6281 1600 -7325 -4956 5898
744E898M386j0242r869N652J2234K081j3572p963Q133J3488j334j5330o070J2811
758C03J1617o445j3975j870J2850P161p962j0047J934J0134K356o524p033M758
772b743N296L58m202j537P88P73J577R15j484k675j143K873M440k215o102j202
788f283Q283L661m195q113K08Q778M005o460p861L425R314J161q358m957O833
803e59O096j551p815k059O427L712l841m572J254N801j074l347j18K995Q38k561
819c74j387K931L14k216m59J189K407k156k14j273K907K186k973k874O18N004
835C630l17m685q18M357K348k195m494J204L667J694l611l193L003J946K5k975
851d14m48K417Q52j687p19P29J378j150o69K75J9J042j715K30J267l10k37j839
$$ plain form
744 5898 10284 42 -9827 -4175 8059 10140 -3432 -11395 -3262 10226 8892 -6438 -12508 303
758 303 11920 5475 -8500 -10370 2480 9641 1679 -8368 -6434 3700 6056 -468 -7501 -2743
772 -2743 2553 2911 -1291 -2828 -2040 -1267 310 1225 -259 -2934 -4077 -1204 3236 1021 -5081 -6283
788 -6283 2000 5661 1466 -6647 -6439 2339 6344 -116 -7977 -4552 4762 5923 -2435 -7392 -559
803 -559 5537 3986 -3829 -5888 539 4251 410 -4162 -2908 2893 1819 -1528 -1646 1349 2187 -374
819 -374 -1761 1170 1484 -732 -1191 -2 2405 249 35 -1238 1669 3855 882 -1992 -1374 3630
835 3630 3313 -1372 -2190 2167 4515 2320 -2174 -970 2697 4391 780 -2413 590 2536 2561 -414
851 -414 -862 1555 2407 720 1 730 2108 958 289 564 583 1625 -90 140 1407 1097 860 -979
869i79R64J436R56k302j628J567K532j873k877R58J837J161j405r48l79J288Q22
886A130r84p57k11O11L73n09J045k582P78J279j35J61k77j584Q46N82R0m24j716
905b284J475J371P7j615j015J495J737j134j967p97K504J093j251j053m12J353
921d23N42k56r91K8P95O36o53q67o10J197J505o49q91o93J577M56j010m23nM10
941c25J46Q39k80j234J409L16l94m07p25K83J405K2j139j46L96M66n78L99k14
960B39Q80m2o87K95m29L24N68n71l69j39J071R7j59r12K19Q00n60n31O93N2K37
981A076l97l22R91n98j69k2k65J0K67l14L85O2j12l7Pj09p94O64N12l18p56j9
1003b58M78L59m31k56j11J74O76l85l58j48l33J031J21j314k33J284K82q10q09
$$ plain form
869 -979 -15 1421 2377 75 -1553 14 2546 673 -2204 -1246 591 1752 347 -601 -980 308 1130
886 1130 146 -611 -822 -211 162 -347 698 -1884 -1106 173 38 199 -78 -1662 -816 -234 -144 -568 -2284
905 -2284 -809 562 639 -976 -1991 -496 1241 107 -1860 -2657 -153 940 -311 -1364 -1776 -423
921 -423 119 -137 -1128 -1100 -305 331 -322 -1189 -1799 -602 903 254 -637 -1330 247 703 -307 -730 -735 -325
941 -325 -179 660 380 -854 555 871 477 70 -655 -372 1033 1055 -84 -230 166 632 54 453 239
960 239 1119 1077 390 685 256 580 1148 577 208 69 1140 1237 1078 166 385 1185 625 94 787 839 1076
981 1076 679 357 1348 750 581 559 294 304 571 257 642 704 592 555 562 453 -341 323 835 517 -239 -258
1003 -258 220 579 148 -108 -219 -45 631 246 -112 -260 -593 438 559 -755 -988 296 578 -232 -1041
1022a041K96R40k5l38o16k38N58L64j62o33j18M28O79m1n56p66P94K62j37n44
1042h94k7L3P52q3m63k84o0Q27N5m09p62K97J008K18o88j202O30J574l91j066
1062i35j70O77N91J98p46m97N56N02N5o18l44L83J033m46m03l51P05P88l49j239
1082f10M56N05K4J61k03n32M09M45m4l72o1l30J068J55p63m66N26K48J86k67l8
1103D97J74k12O46l61m35j91L25L67kq16K3L14Q30m51p07l2P89p1j79m31k77M10
1125B10P06k05m77k85M14K2lj70k18L16L26l67l28j07M33k98k4L65o47J30j08
1146c15Q21k38n94j96K12N97J55p45o01L32R35k50r27j31N23N18l67p30j74J123
1166e2O0o59o12L01P03l7k97l73M40L73k13k33m6L9o2O8N09On93j95P35k2m95
$$ plain form
1022 -1041 -745 195 170 -168 -784 -1022 -464 -100 -262 -895 -1013 -585 94 53 -503 -1269 -475 -213 -350 -894
1042 -894 -921 -888 -136 -219 -682 -966 -1026 -199 -144 -553 -1315 -1018 -10 208 -480 -1682 -1052 522 131 -935
1062 -935 -1105 -428 163 361 -385 -882 -326 176 231 -387 -731 -348 685 239 -164 -515 190 978 629 -610
1082 -610 -154 351 375 536 333 -199 210 655 611 239 178 -152 916 1071 308 -158 368 616 802 535 497
1103 497 671 459 1105 744 309 118 443 810 808 -8 15 329 1159 708 1 -31 758 687 508 77 -200 210
1125 210 916 711 234 -51 363 385 382 212 -6 310 636 269 -59 -166 267 -31 -55 310 -337 -207 -315
1146 -315 506 268 -326 -522 -310 287 442 -303 -904 -572 363 113 -814 -945 -422 96 -271 -1001 -1175 -52
1166 -52 8 -651 -1263 -962 -259 -296 -593 -966 -526 -153 -366 -599 -645 -606 -668 -600 -91 -85 -678 -873 -138 -160 -655
1189f55J57l62Q85M17q73n73L71J176K47p90j103L28J190M59j203q52J074J018
1207I11l80j051l22J116Q39n14r96j1J038K16l74q82N31M21j73L08l71k7J71L01
1227G51m27j5k06J27L3P14k37n96J60K25L75m69m48J79M92M32k97r42N64N39j27
1248H27p46n82P37Q86n12j056o6R20R86p70j005o7R48K27k71r25J24R11L87o81
1268B72j037N80N25K45o06l17J65K88J69m96k63J86K13L42l22l06j70L61mJ3L0
1289a32m05J56J75L12p12l72M5R75K52r99n41Q41P64K3j243o44J360O16o44j033
1309a206j1J426L45p33j172J79J509L80j537m97P52Q60K16j404k73R42N53l4q97
1328f02l00Q30J83j95m02K59P5K01k30L19q1k69j05K57P76m32q57J36R56N37n81
$$ plain form
1189 -655 -498 -860 25 442 -431 -1004 -633 543 790 0 -1103 -775 415 874 -329 -1181 -107 911
1207 911 531 -520 -842 274 1113 599 -397 -408 630 846 472 -410 121 542 369 677 306 279 450 751
1227 751 324 309 103 230 263 977 740 144 304 529 904 435 -13 166 658 1090 793 -149 415 954 827
1248 827 81 -501 236 1122 610 -446 -512 408 1394 624 -381 -448 500 727 456 -469 -345 566 953 272
1268 272 -765 -185 340 585 -21 -338 -173 115 284 -212 -475 -289 -76 266 -56 -362 -532 -171 -175 -162 -132
1289 -132 -537 -381 -206 106 -606 -978 -933 42 294 -705 -1246 -405 359 382 -861 -1505 -145 471 -173 -1206
1309 -1206 -1217 209 554 -179 -1351 -1172 337 717 -820 -1317 -565 295 511 -893 -1166 -224 329 295 -602
1328 -602 -902 -72 111 -84 -486 -227 -152 49 -181 138 57 -212 -317 -60 716 284 -573 -437 519 1056 475
1349D75j162J25J386L12j214p86J050J422p41j374j27J100J004p44j224J51J287
1366I40N10j365q08J215O76j48j406J33O61N27k49p11R4N48n0l55k80P84l31n69
1386a84K64N77q8l89n91N99J054p34j037k16J200L67p88p05M90R79m3j254l20
1405h19O67N62k74q48L7Q51K00n53n74J95J012k44r32JQ69L00r93n40O29O91o80
1426d43l06K84O65j02q62k24P81N09p35l42M17P64l30r56j0Q35P02r31j029N65
1446g48J130L52j395n55J123P94k18j454N7J143L30p43o64L55Q77j19o99j1L76
1465f9kq7j36Q14j80m60k44L85P50m01n76j25O06J73j17m36N1L16P76r48p53R32
1487B69P11l11j220K78O93N52m57n21l0O42k04n42J88M64k21m8l22M25J14j97
$$ plain form
1349 475 -687 -562 824 1136 -78 -864 186 1608 867 -507 -634 466 1470 726 -498 -347 940
1366 940 1450 85 -723 492 1168 1020 -386 -253 408 935 686 -25 69 617 567 212 -68 716 385 -184
1386 -184 80 657 569 180 -411 188 1242 508 -529 -745 455 822 34 -671 -181 798 755 -499 -819
1405 -819 -152 410 136 -712 -675 176 376 -177 -751 -556 456 212 -720 -719 150 450 -543 -1083 -454 237 -443
1426 -443 -749 -465 200 98 -764 -988 -207 302 -433 -775 -358 406 76 -880 -890 -55 647 -284 -1313 -748
1446 -748 382 734 -661 -1216 -93 701 483 -971 -914 229 559 -184 -848 -493 384 265 -434 -445 -69
1465 -69 -71 -158 -294 520 340 -120 -364 21 771 370 -206 -331 275 448 331 -105 -54 262 1038 90 -663 269
1487 269 980 669 -551 -273 420 972 515 -6 -36 606 402 -140 48 512 291 243 -79 346 460 263
1507B63j44J81M7q0k28r2O19J24k78n14K80J49K75p11l00L77O59k67q52n7Q90
1528C41q2j07j39j80M96j61l11J84K11j2n19L36M7m30L39l68L65k13L61n28k8
1549c98K93K41Qo84J54M04m02l51K94K80J33n5m29n9P08k36m67K52n5L13j71j30
1571c57r1R3L40k85L5J6J48P8J50l48K95m02K31j72j54K19J0l6J59Q2j20k1p0
1594b00M03k49r2jn4N93k94l18Q7L81J18m11r4K21K06k4j11k66nM58l2k20K71
1617C67k09k2J07l53ON85k26q8j5n4mJ52o3K98k36j4O7J31q2m4Pl16M15J11n54
1642c4l5L51K18m24Q1j48J92KJ49k43j80O00l78l79J88J46J49J15o19M4N37j18
1664B14j86j19K52o2P0o20K57K08o4k55J97j78J71M4j40L19j99J70n51L43j72
$$ plain form
1507 263 119 300 347 267 39 -53 566 690 412 -102 178 327 602 -109 -409 -32 627 360 -492 -549 341
1528 341 259 152 13 -167 329 168 -143 41 252 240 -279 57 104 -326 13 -355 10 -203 158 -370 -398
1549 -398 -105 136 144 -540 -386 18 -384 -735 -441 -161 -28 -83 -512 -571 137 -99 -566 -314 -369 -56 -227 -357
1571 -357 -448 -355 -15 -300 -265 -249 -101 -23 127 -221 74 -328 -97 -269 -423 -204 -194 -230 -71 11 -109 -130 -200
1594 -200 203 -46 -138 -139 -193 400 106 -212 -125 256 374 -37 -131 90 296 272 161 -105 -110 348 316 96 367
1617 367 158 136 243 -110 -104 481 255 167 152 98 94 246 183 481 245 231 298 429 347 303 310 -6 409 520 -34
1642 -34 -69 282 500 76 157 9 201 203 352 109 -71 529 151 -228 -40 106 255 370 -249 -205 332 214
1664 214 28 -91 161 99 169 -451 -194 14 -50 -305 -108 -286 -115 -71 -211 108 -91 79 -472 -129 -301
1685c01j35K2J26j3M1K37j74j95K57M4l4n7m12M49K00k58l4q9J16j03Q2J76k23
1708b78J41q3o3K91o8Nj14NN8J81k88J4Q4K15j03k2k75L74K8l15j78J02N39j30
1732A20k30j00N34k30o6k01N0L06J22j10n3j04j10LL63j80j66J88L6r7J85J5j47
1755A28m7J13l05L12J56j10J3j13K3MJ01K54j70j91l6J23P0j93NJK49k63M6k53
1779h3K68j4k18J20J25j77M1J58Q8m46L02J4k72K14k8M0o2k27K9nj91l5L24L5
1803@k37N3j6L32M8l38l0J66j02L17n92K74o3j70L97l0j3k83l07N64q7j50j14
1826c81K44j13q0J44j50L13j18N4k49M64o65M65j22j99K24j60K05j26p1K1M9K10
1848d1j04m3L69n56K83j34J03K61o61K73L15m1J42m63K78j06J52k89Q7L40K36
$$ plain form
1685 -301 -436 -414 -288 -301 -260 -23 -197 -392 -135 -91 -125 -182 -594 -145 55 -203 -237 -326 -210 -313 -231 -55 -278
1708 -278 -137 -220 -283 8 -60 -55 -169 -164 -106 75 -213 -199 -115 100 -3 -25 -300 74 102 -213 -391 -289 250 120
1732 120 -110 -210 324 94 28 -173 -123 183 305 195 142 38 -72 -69 294 114 -52 136 172 75 260 275 128
1755 128 81 194 -111 201 357 247 260 147 170 174 275 529 359 168 132 255 325 132 137 138 387 124 170 -83
1779 -83 185 171 -47 73 198 21 62 220 308 -138 164 178 -94 120 92 132 70 -157 -128 -133 -324 -359 -35 0
1803 0 -237 -184 -200 132 180 -158 -188 -22 -124 193 -399 -125 -188 -358 39 9 -4 -287 -594 -30 -117 -267 -381
1826 -381 -137 -250 -330 -186 -336 -23 -141 -87 -336 128 -537 -72 -194 -393 -169 -329 -124 -250 -321 -300 -251 -41
1848 -41 -145 -188 181 -375 -92 -226 -123 138 -523 -250 65 24 166 -297 -19 -125 27 -262 -175 165 401
1869D01m01M8j87K06K41R8l34j16N89J15p51L5J71K21k50j62K58p1K69l30j70
1890a20J69K64j48l58O21j12j90k41Q3J10K36j06M8K2k08Q9j3n3KK68m81j71M56
1913A67K26j96k08r7L7O76n09k75k42O37r6j43k75K89J03r1m77K69J68o5K29l72
1935b45J52K14M2l56O1J19l45L82k14j45L19m73J30R9K03k19M6j90K08K77k36
1956a71j81J92L66k98l12R9J6L16ln51N09J40k54K30n45J05N9K64l98K45k4J75
1978b1k84P2J07L51k63j68j11L4O14m09J4m8L13j32k55P1J15K36l35m9Q2L84j63
2001A55k87j01L06L11k49j20J63J87o2o13L39P0J49J50l29q8L35K16p47L31P6
2022A92J18J61m7m39K08M1o5km3J94p7k72j2r6K63K30o16L14K29L6k73l1M6K39
$$ plain form
1869 401 0 48 -139 67 308 406 72 -44 545 660 -91 -56 115 336 86 -76 182 111 380 50 -120
1890 -120 49 313 165 -193 428 316 126 -115 -32 78 314 208 256 278 70 159 146 93 95 363 -118 -289 167
1913 167 393 197 -11 -108 -71 605 96 -179 -421 216 120 -23 -298 -9 94 3 -474 -205 -37 -102 127 -245
1935 -245 -93 121 163 -193 -132 -13 -358 24 -190 -335 -16 -489 -359 -260 -57 -276 -230 -420 -212 65 -171
1956 -171 -352 -160 206 -92 -404 -305 -289 27 24 -527 -18 122 -132 98 -447 -342 -283 -19 -417 -172 -196 -21
1978 -21 -305 -233 -126 225 -38 -206 -317 -283 331 -78 -64 -112 201 69 -186 -115 0 236 -99 -148 -66 318 155
2001 155 -132 -233 73 384 135 15 178 365 303 -310 29 99 248 398 69 -19 316 532 -215 116 192
2022 192 310 471 424 -15 193 234 169 167 124 318 241 -31 -43 -139 124 354 -262 52 281 317 44 13 59 298
2046B98k04J3j24K51N0j95k40J0N23m88mQ6M1K25k41l2j40K33J7k2k1Q5q5m9k01
2071b14L59j57R5j20l64K93J73r1j34N6J58k61l76O51k32M49k36l95k80M41K56
2092G1j12l57K80J9K9k55r3M29j09k69R6K25N5k15j20J48n1K59j01K03m95O11
2114B48n31K22j7J79L5n01j39P32n1Ll71L88k30K49k59j71K51K35kl63m9K77j21
2137A4K27k29J21%n8J4r2L42m05J45m8J64k05J70n30M66K80k75K3j15L51r1p4
2160A95l41L00J14m38J54j30M01K15j23l04J20J94K1n02n5K30J8K34k54k6m7J65
2182A41P2J21j94q6q2J68j36J2q0P0k35R5m7Q7k80L31J88l10j01QL84J13k92l0
2206h3Q6L16k15l18j93J4N73j33m66J52K53Q6r1O3l77J45J5N1jj80N20k63J21
$$ plain form
2046 298 94 107 -17 234 284 89 -151 -141 382 -106 -110 -24 17 242 1 -31 -171 62 79 57 36 121 36 -13 -214
2071 -214 145 -12 83 -37 -401 -108 65 -26 -160 -104 54 -207 -583 68 -164 285 49 -346 -626 -185 71
2092 71 -41 -398 -118 -99 -70 -325 -418 11 -98 -367 -271 -46 9 -206 -326 -178 -229 30 -71 132 -363 248
2114 248 -283 -61 -78 101 136 -365 -504 228 177 180 -191 197 -33 216 -43 -214 37 272 270 -93 -142 135 14
2137 14 241 12 133 133 75 89 -3 339 -66 79 31 195 -10 160 -370 96 376 101 124 9 360 269 195
2160 195 -146 154 268 -170 -16 -146 255 470 347 43 163 357 378 -124 -179 51 69 303 49 23 -24 141
2182 141 213 334 140 54 -28 140 4 16 -64 6 -229 -134 -181 -94 -374 -43 145 -165 -266 -258 126 239 -53 -83
2206 -83 3 319 104 -214 -407 -393 180 47 -419 -267 -14 72 -19 44 -333 -188 -173 -122 -123 -303 217 -46 75
2229G5k1k12Q6P6J8j33L10k99K84l27P7k84K82K74p67L51p1K91l1L3j65O6j38
2252b25M50Ol79J78k37L33J71k67m45O18j27K05k37l29O45k12j05L2J64r6n6r6
2274iK47m12K51oR4O8k54P0J1J64p7K7j41O1Q4R1k34K72m03j5O2J08J00j12J99
2299B46j53r4k22J87R1J13l7J6j24o5K48q7j77K10J19j9N4l20J28n4r6q0K88P7
2323B49L8m4m50J65j24l2M13j60j66K40j78J34j81j30N6J36j83kL12j18k95N00
2345A80Ln21K5M7j04N03j56q1j0RJ74j42j37L63j40k65L76n63L52L71l72J79j18
2368b7j82J95L5k52Q0L2NK2n2J68j26n1O6l7R2K3O5j29L35j52n2j30j49M10j51
2393C8j68K07r5l8P4N6j19K78L8l06k8L10j4j50J47j34N5k14K83n0j79L34k69
$$ plain form
2229 75 54 -158 -72 4 22 -111 199 -100 184 -143 -66 -350 -68 206 -561 -210 -281 10 -21 12 -153 -87 -225
2252 -225 225 231 -148 30 -207 126 297 30 -415 203 76 281 44 -285 360 148 43 75 239 143 87 -9
2274 -9 238 -174 77 71 165 233 -21 49 60 224 147 174 33 94 178 269 35 307 -96 -111 -49 59 159 47 246
2299 246 93 -1 -223 -36 55 168 131 147 23 -42 206 119 -58 152 271 252 306 -14 114 60 -36 -116 172 249
2323 249 287 243 -207 -42 -166 -198 215 55 -111 129 -49 85 -96 -226 -170 -34 -217 -219 93 -25 -320 180
2345 180 183 -338 -313 -266 -370 133 -23 -104 -114 -105 69 -73 -210 153 13 -252 124 -439 -87 284 -88 91 -27
2368 -27 -209 -14 21 -231 -151 -119 -114 -92 -144 24 -102 -153 -87 -124 -32 -9 56 -73 262 110 58 -72 -221 189 38
2393 38 -130 77 -18 -56 18 74 -45 233 271 -35 -63 247 233 83 230 96 151 -63 220 170 -9 325 56
2416E6j1Q1p6j05K23J88J9j45l56L31J59n3k44j48K19K97n91M24k03J34M3j76
2438F6M4j51K03j78M9j07J10J63j35m7m3m0P9j10K51m7k18q0Q6M48l01Km52L38
2462g0N5r4j19j5M96m38R9o5k3P9J61l46J44K36O9j24j93K89k59j24R3j47L17
2485B1j12j7l7Q5l54J60J42J91j92on2n4L21j86K95n17K2M97J17q08K28M03k10
2508f3K15j42k16K50K3q2l37K38M94m32M31k70n7L4K3j73j31L43m4j32J36J5j79
2531e6k03K47L28j10k39O0K55j04q7l7j29K70j37k9R4l57O52l28j43j03K31K31
2553C06K1l48l56N85L06k87m21L81j64j12L38l1k6R3k73K03n7j60j28N35n49L34
2575A90j13p0k10K39k5k67L91J8j57J25l63oK99o9K78o00K95K75k44l6Q1j05P1
$$ plain form
2416 56 45 126 50 -55 168 356 375 230 -126 205 364 311 67 -81 138 435 -156 268 65 199 242 66
2438 66 110 -41 162 -16 33 -74 36 199 64 17 -26 -66 13 -97 154 107 -111 -191 -105 343 42 44 -408 -70
2462 -70 -15 -109 -228 -243 253 -185 -86 -151 -174 -95 66 -280 -136 100 169 45 -148 141 -118 -242 -149 -296 21
2485 21 -91 -108 -145 -60 -414 -254 -112 79 -113 -119 -171 -225 96 -90 205 -312 -290 207 324 -484 -256 147 -63
2508 -63 152 10 -206 44 67 -15 -352 -114 380 -52 379 109 52 86 109 -64 -195 148 104 -28 108 123 -56
2531 -56 -259 -12 316 206 -33 27 282 178 91 54 -75 195 58 29 123 -234 418 90 -53 -156 75 306
2553 306 327 -21 -377 208 514 227 -194 187 23 -89 249 218 192 285 12 215 158 -2 -130 405 -144 190
2575 190 77 7 -203 36 11 -256 135 153 -4 121 -242 -248 51 -18 260 -340 -45 230 -14 -50 31 -74 -3
2598cl60J32k06K79N0J30k95J12K39M2n75K23L86m31K11q6J63j50k7J34o6l7n03
2621f38M03M17k67K43j99j64n8j46L24J31j56J77Lo1k15J74l4J28q4j69L27k02
2643f6r3J18J85k35L44k86K44k35M4KP1o6R6J37j85J56j92J61l6o7j50J43n9j62
2667a31l3P2M30l46j84N33k90J93m26L17M1j32J05J09j78j05k23L38o9J63k34
2688e0L41J10m78J22j30J89n1J38k12R9j79M8L37k43qj93M99N6k77q7J51j56K64
2711B90o13R0N19j32k06j20j12L84J88k63pJ6l00J35J98k28m2M5L33k20m1l24
2733d10M37o5J26l03K72l60J58k2l8p1J54L46j06J3k40J86k43J96Pl40J98K88
2755A83l6j32l91K62L36j96k68j82J63L32r1n6j05J57L89m64P6o6J69K43k00M6
$$ plain form
2598 -3 -363 -231 -437 -158 -108 22 -273 -161 78 120 -455 -232 154 -277 -66 -152 11 -139 -166 -32 -98 -135 -638
2621 -638 -235 182 -85 158 -41 -205 -263 -409 -85 46 -110 67 70 9 -206 -32 -66 62 -22 -191 136 -66
2643 -66 -159 -41 144 -91 253 -33 211 -24 20 22 93 27 123 260 75 231 39 200 164 97 -53 90 31 -131
2667 -131 -164 -92 338 -8 -192 341 51 244 -182 135 176 44 149 258 80 -25 -248 90 21 184 -50
2688 -50 291 401 -77 45 -85 104 53 191 -21 78 -101 -53 284 41 33 -160 339 395 118 31 182 26 290
2711 290 -323 -233 286 154 -52 -172 -284 100 288 25 18 34 -266 -131 67 -161 -203 -158 175 -45 -86 -410
2733 -410 27 -38 88 -215 57 -303 -145 -167 -205 -276 -122 224 118 131 -109 77 -166 30 37 -303 -105 183
2755 183 147 15 -376 -114 222 26 -242 -424 -261 71 -20 -76 -181 -24 365 -99 -23 -89 80 323 123 169
2777A69l06J47P5j95K63n13L49M7o4J64n77M1M50L3o3j27n7M28N7p4l86k7L61
2800A95N1k25p0L2L10J19o2n47j34L41L62n02q2K99r1L20l14n8q9M58j98k53R6
2823d2l9L73j99L20o02K6J11K43J06n12Q2R2K34j18o6k49K96K61o8m90k30L25
2845a46M00j21k69m89P33M1nn05J04N10nj44l86L0P6L30L0k24j94k4N56J22r26
2868e06K72J05K38K34m54j85K85j6j77K40n08L16K6J29M8j04k10K33M25m89o4
2889a62J52K6k3j34k20q5Q27Rn92l9K84J37l43Q8P6k8qK38l15N0o5O7L66p3l36
2914a03k44L28K88L5p0l66LL69r0n59J90L77K98m30j12j58M72J59j34r3n57L45
2936e2L61ok02r6L5J22P5k13k15L25k4K46m11j60J26K70K66l11n6J33J27k06k04
$$ plain form
2777 169 -137 10 85 -110 153 -360 -11 36 -28 136 -441 -400 50 83 20 -107 -164 264 321 247 -139 -166 195
2800 195 246 21 -49 -17 293 412 350 -197 -331 10 372 -130 -212 87 -4 316 2 -56 -145 313 115 -138 -42
2823 -42 -81 292 93 413 -189 -163 -52 191 297 -215 -133 -41 193 75 9 -240 56 317 249 -241 -471 -146
2845 -146 254 133 -136 -625 108 149 144 -361 -257 253 248 104 -282 -252 -176 154 184 -40 -234 -258 298 420 -506
2868 -506 -234 -129 109 343 -111 -296 -11 -27 -204 36 -472 -156 -130 -1 47 -57 -267 -34 391 -98 -162
2889 -162 -10 16 -7 -141 -361 -446 381 390 -202 -241 43 180 -163 -75 1 -27 -35 203 -112 -62 -127 -60 306 233 -103
2914 -103 -347 -19 269 304 234 -132 -129 240 150 -409 -219 158 456 26 -86 -244 228 387 253 160 -397 -52
2936 -52 309 303 101 5 40 162 237 24 -191 134 110 356 -55 -215 -89 181 447 136 80 213 340 134 -70
2959g0j2M4K95K33n56l45R7K13K38k00m54M61J38K22m33l8Q0L83j8n06J56m4L26
2982B10o1j23j53J07k8K7j16m21L23K93K61K6n29k32J89K51K99m36j63K57R0K2
3004I3m43J18K05M83l11m74N3L98l6j89l11p9M82Q1n2o23M56%J05Mm4J64J97q0
3028A97k04j10m4J89k2l1K71k07l1kK67l54k7j56M59r4ro7j20L78P4n71%M60q7
3053A59J09J9m23J62L65k77j72k4J43J68k40k13J51K32j68l11J13M19j58N9K51
3074C64j39j22j41K65k8N6l47K41Q9j41m2n2k8N8J85l74j33L17j82K48j08k7N9
3097A8o9j94K97j42J66J97k85K5Q0l5l2j65r8M64m23Kk1L12p6K26l47j73J23K36
3121H6k8q0l3P4J7J50j63k24Q1K14R6l42L24m41K46k79K1K8J55k08M14k59r9K28
$$ plain form
2959 -70 -82 -38 257 490 -66 -411 -314 -101 137 -63 -517 -56 82 304 -129 -167 -87 296 278 -228 -72 -116 210
2982 210 149 26 -127 -20 -48 -21 -137 -558 -235 58 319 345 -184 -416 -227 24 323 -113 -276 -19 71 93
3004 93 -350 -232 -27 456 145 -329 -276 122 86 -103 -414 -493 -11 70 18 -605 -149 -149 -44 -40 -84 80 277 197
3028 197 -7 -117 -161 28 6 -25 246 39 8 6 273 -81 -108 -264 195 101 92 25 -95 283 357 -214 -214 246 159
3053 159 268 287 -136 26 391 114 -58 -82 61 229 -11 -224 -73 159 -9 -320 -207 212 54 113 364
3074 364 225 103 -38 227 199 255 -92 149 238 97 55 3 -25 33 218 -156 -289 28 -154 94 -14 -41 18
3097 18 -51 -245 52 -90 76 273 -12 13 93 58 26 -139 -237 227 -196 -194 -215 97 21 247 -100 -273 -150 86
3121 86 58 -22 -55 19 36 186 23 -201 -120 94 190 -152 172 -269 -23 -302 -281 -253 -98 -306 108 -151 -250 -22
3145b2L7J62l76k24L57L4J06o5kJ35pj09k57J37j23M74l05J82j70p4M58j83j09
3168E6j69J02J18j5mJ24k37Q5n6J13k0j60L18l9k09L4k84L28J84n15J10J3M6N56
3192D79j77l5o14M85r6J02m88L81K87j01j36k25K3N6K02k01P5R4J28l21n1l1J15
3215d9Q6J20J21j31k67L99j02j09j64L9l6M09k24J30l53L15l09M01k14m59K35
3236a62L97k82l4K35j41K37k17j01K67M8j90j7J41k51K10j14K45m66L88k95q8
3257a90L87k26j09K76l18L14N5r7k79j8R9J03K05j46k1l0l5k76K50Q6J48k60J69
3280H7k3M0j5l92P3m9L74m4m53L52P2l34L94j74R7N6l10m0L10j74K27J68k51J65
3304A56j98p4K68P6m24J55R8j09K4L51o00Q4P1K77l8J43l92J44K14n32q6K47K21
$$ plain form
3145 -22 15 177 -199 -423 -66 -32 74 9 7 142 135 26 -231 -94 -217 257 -48 134 -36 -110 348 165 56
3168 56 -113 -11 107 92 88 212 -25 60 4 117 97 -63 255 216 7 41 -243 85 269 -246 -136 -123 -77 479
3192 479 302 267 -347 138 42 144 -344 37 324 223 87 -138 -115 -59 143 -58 17 111 239 -82 -133 -164 -49
3215 -49 37 157 278 147 -120 279 177 68 -96 -57 -93 316 92 222 -131 184 -125 276 62 -397 -162
3236 -162 235 -47 -81 154 13 250 33 -68 199 247 57 40 181 -70 140 26 271 -195 193 -102 -190
3257 -190 197 -29 -138 138 -180 134 189 92 -187 -205 -106 -3 202 56 35 5 -30 -306 -56 30 178 -82 87
3280 87 64 104 89 -303 -230 -279 95 51 -402 -50 22 -312 82 -92 5 61 -249 -289 21 -153 74 242 -9 156
3304 156 -42 -116 152 228 -196 -41 57 -52 -28 323 -277 -193 -122 155 117 260 -132 12 226 -306 -392 -145 76
3327G6k57K42k99M02j45o9J68k31J17K25m77J27K52J63K84m89j9J47j68r2K9J60
3349A46R5l55L32l74J10N8Q8k41K98k02O6n17N00M3K4q2n4J66k87K16p4K0R2l26
3373b58M52m54R0K54j38R6K2L07n40M64n81M79J11m90K09J04o4j81J42j47J09
3394a4l0j80K76o9J31j04o7M8J77J7j29l15M23K28l82k53k7K29K46k31l61L19
3416f8O12n68j57m6L84m17K71j84R4M27j17pl47PJ14k78M11j9k1L0l55M34m71
3439b71K71J04j00j16M28j64l69M6N0N6N8k39P2M14j51m06L52QK30k32k8j09k4
3462a20K81n5j19j46K32J22k57K02l73L05J03n3k40J3K33j17J62j52j56J68J8
3483E1j31K00J9l00K77Jk01K5k35J92M45k41P6k42J18J9pk82j53M96j1K2l37n0
$$ plain form
3327 76 -181 61 -238 164 19 -50 118 -113 4 229 -248 -121 131 294 578 89 70 217 49 -43 -14 146
3349 146 241 -114 218 -156 -46 12 100 -141 157 -45 21 -496 4 47 71 -11 -65 101 -186 30 -44 -24 68 -258
3373 -258 194 -260 -170 84 -54 42 64 371 -169 295 -286 193 304 -186 23 127 63 -118 24 -123 -14
3394 -14 -44 -224 52 -17 114 10 -57 -9 168 185 56 -259 164 392 10 -243 -270 -41 205 -26 -387 -68
3416 -68 544 -24 -181 -227 157 -260 11 -173 -79 348 231 224 -123 -116 -2 -280 131 112 91 121 -234 200 -271
3439 -271 0 104 4 -112 316 152 -217 -171 -121 -65 -7 -246 -174 240 89 -317 35 43 273 41 13 -96 -120
3462 -120 161 106 -13 -159 73 195 -62 140 -233 72 175 122 -118 -105 128 11 173 21 -135 33 51
3483 51 -80 120 139 -161 116 117 -84 -59 -294 -102 343 102 178 -64 54 73 66 -216 -369 127 116 138 -199 -249
3507b49K76j45K01k07J90j34n0J67j10Q1K3L17k36k72J01j78M57Kj49m09N96l07
3529c5J52j31n29O24NJ72n11J10K99j76P6J83o11O02J8j40j08l23K14J81K7j11
3551a2r6j07M77m70O3J22k04J94L11o36q2K33K5j0M03j20j17j99N21k80j60r8
3573b42L31J59j54l21N3L06J69j85k79K78J8K90j17m14M21k09K5k13J38l28M02
3594A28o0J38j79j27K64K29k95j08J54J33j71p1J29j29k32J80K79nr4l19M62j31
$$ plain form
3507 -249 27 -118 83 -124 66 -68 -118 49 -61 20 43 360 124 -148 -47 -225 232 234 85 -324 272 -35
3529 -35 117 -14 -543 81 86 258 -253 -143 156 -20 56 239 -372 230 248 108 0 -323 -109 72 99 -12
3551 -12 -108 -215 262 -208 -145 -23 -227 -33 278 -358 -440 -207 -182 -192 211 91 -26 -225 296 16 -144 -242
3573 -242 89 248 94 -227 -174 132 301 116 -163 115 133 423 306 -108 313 104 129 -84 54 -274 128
3594 128 68 206 27 -100 164 393 98 -10 144 277 106 35 164 35 -197 -17 262 257 163 -156 306 175
$$ [...]
8191a48
##END NTUPLES=NMR FID
##END=
