##TITLE=1H_Pr en-T
 CDCl3, 8 sc, 
 26.8.2020
##JCAMPDX= 6.0         $$ Bruker NMR JCAMP-DX V2.0
##DATA TYPE= NMR FID
##DATA CLASS= NTUPLES
##ORIGIN= UXNMR, Bruker Analytische Messtechnik GmbH
##OWNER= root
$$ XWIN-NMR		Version 3.5
$$ Thu Aug 27 11:39:59 2020 Russian Standard Time (UT+4h)  she@DPX200
##.OBSERVE FREQUENCY= 200.1315066352
##.OBSERVE NUCLEUS= ^1H
##.DELAY= (6, 6)
##.ACQUISITION MODE= SIMULTANEOUS
##.ACQUISITION SCHEME= undefined
##.AVERAGES= 8
##.DIGITISER RES= 18
##SPECTROMETER/DATA SYSTEM= spect
##.PULSE SEQUENCE= zg30
##.SOLVENT NAME= CDCl3
##.SHIFT REFERENCE= (INTERNAL, CDCl3, 0, 15.7039)
##AUDIT TRAIL= $$ (NUMBER, WHEN, WHO, WHERE, WHAT)
$$ ##TITLE= Audit trail, XWIN-NMR		Version 3.5
$$ ##JCAMPDX= 5.01
$$ ##ORIGIN= Bruker BioSpin GmbH
$$ ##OWNER= she
$$ F:/spectra/data/she/nmr/H-F/1/audita.txt
$$ ##AUDIT TRAIL=  $$ (NUMBER, WHEN, WHO, WHERE, WHAT)
(   1,<2020-08-27 11:38:58.64 +0400>,<she>,<DPX200>,
      <created by zg, POWCHK disabled, PULCHK disabled
       configuration hash MD5:
       00 E9 B6 7A A2 85 ED C7 34 08 36 98 17 FE 4E 26
       data hash MD5: 16K
       87 56 93 ED 00 C4 9A 31 86 F2 B7 93 B9 38 1C 16>)
$$ ##END=
$$ 
$$ hash MD5
$$ E9 A9 F1 5C F0 DD 3A 42 D7 AE D7 EF 95 92 40 4B
##$RELAX= 
##$RELAX= 
##$RELAX= 
##$RELAX= 
##$RELAX= 
##$RELAX= 
$$ Bruker specific parameters
$$ --------------------------
##$DU= <F:/spectra>
##$EXPNO= 1
##$NAME= <H-F>
##$PROCNO= 1
##$TYPE= <nmr>
##$USER= <she>
##$AMP= (0..31)
100 100 100 100 100 100 100 100 100 100 100 100 100 100 100 100 100 100 
100 100 100 100 100 100 100 100 100 100 100 100 100 100 
##$AQSEQ= 0
##$AQ_mod= 1
##$AUNM= <au_zg>
##$AUTOPOS= <>
##$BF1= 200.13
##$BF2= 200.13
##$BF3= 200.13
##$BF4= 200.13
##$BF5= 200.13
##$BF6= 200.13
##$BF7= 200.13
##$BF8= 200.13
##$BYTORDA= 1
##$CFDGTYP= 0
##$CFRGTYP= 5
##$CHEMSTR= <none>
##$CNST= (0..31)
1 1 145 1 1 1 1 1 1 1 1 1 1 1 1 1 1 1 1 1 1 1 1 1 1 1 1 1 1 1 1 1 
##$CPDPRG= <>
##$CPDPRG1= <>
##$CPDPRG2= <>
##$CPDPRG3= <>
##$CPDPRG4= <mlev>
##$CPDPRG5= <mlev>
##$CPDPRG6= <mlev>
##$CPDPRG7= <mlev>
##$CPDPRG8= <mlev>
##$CPDPRGB= <>
##$CPDPRGT= <>
##$D= (0..31)
0 1.2 0 0 0 0 0 0 0 0.06 0 0.03 0 0 0 0 0.0002 0 0 0 0 0 0 0 0 0 0 0 0 
0 0 0 
##$DATE= 1598513938
##$DBL= (0..7)
120 120 120 120 120 120 120 120 
##$DBP= (0..7)
150 150 150 150 150 150 150 150 
##$DBP07= 0
##$DBPNAM0= <>
##$DBPNAM1= <>
##$DBPNAM2= <>
##$DBPNAM3= <>
##$DBPNAM4= <>
##$DBPNAM5= <>
##$DBPNAM6= <>
##$DBPNAM7= <>
##$DBPOAL= (0..7)
0.5 0.5 0.5 0.5 0.5 0.5 0.5 0.5 
##$DBPOFFS= (0..7)
0 0 0 0 0 0 0 0 
##$DE= 6
##$DECBNUC= <off>
##$DECIM= 32
##$DECNUC= <off>
##$DECSTAT= 4
##$DIGMOD= 1
##$DIGTYP= 9
##$DL= (0..7)
0 120 120 120 120 120 120 120 
##$DP= (0..7)
150 150 150 150 150 150 150 150 
##$DP07= 0
##$DPNAME0= <>
##$DPNAME1= <>
##$DPNAME2= <>
##$DPNAME3= <>
##$DPNAME4= <>
##$DPNAME5= <>
##$DPNAME6= <>
##$DPNAME7= <>
##$DPOAL= (0..7)
0.5 0.5 0.5 0.5 0.5 0.5 0.5 0.5 
##$DPOFFS= (0..7)
0 0 0 0 0 0 0 0 
##$DQDMODE= 0
##$DR= 18
##$DS= 0
##$DSLIST= <SSSSSSSSSSSSSSS>
$$ [...]
##$SUBNAM2= <"">
##$SUBNAM3= <"">
##$SUBNAM4= <"">
##$SUBNAM5= <"">
##$SUBNAM6= <"">
##$SUBNAM7= <"">
##$SUBNAM8= <"">
##$SUBNAM9= <"">
##$SW= 16.880792210976
##$SWIBOX= (0..15)
0 0 2 0 0 0 0 0 0 0 0 0 0 0 0 0 
##$SW_h= 3378.37837837838
##$TD= 16384
##$TD0= 1
##$TE= 0
##$TE2= 300
##$TE3= 300
##$TEG= 300
##$TL= (0..7)
0 120 120 120 120 120 120 120 
##$TP= (0..7)
150 150 150 150 150 150 150 150 
##$TP07= 0
##$TPNAME0= <>
##$TPNAME1= <>
##$TPNAME2= <>
##$TPNAME3= <>
##$TPNAME4= <>
##$TPNAME5= <>
##$TPNAME6= <>
##$TPNAME7= <>
##$TPOAL= (0..7)
0.5 0.5 0.5 0.5 0.5 0.5 0.5 0.5 
##$TPOFFS= (0..7)
0 0 0 0 0 0 0 0 
##$TUNHIN= 0
##$TUNHOUT= 0
##$TUNXOUT= 0
##$USERA1= <user>
##$USERA2= <user>
##$USERA3= <user>
##$USERA4= <user>
##$USERA5= <user>
##$V9= 5
##$VALIST= <valist>
##$VCLIST= <CCCCCCCCCCCCCCC>
##$VD= 0
##$VDLIST= <DDDDDDDDDDDDDDD>
##$VPLIST= <PPPPPPPPPPPPPPP>
##$VTLIST= <TTTTTTTTTTTTTTT>
##$WBST= 1024
##$WBSW= 4
##$XGAIN= (0..3)
0 0 0 0 
##$XL= 0
##$YL= 0
##$YMAX_a= 345732
##$YMIN_a= -363297
##$ZGOPTNS= <>
##$ZL1= 120
##$ZL2= 120
##$ZL3= 120
##$ZL4= 120
##$ABSF1= 10
##$ABSF2= 0
##$ABSG= 5
##$ABSL= 3
##$ALPHA= 0
##$AQORDER= 0
##$ASSFAC= 0
##$ASSFACI= 0
##$ASSFACX= 0
##$ASSWID= 0
##$AUNMP= <proc_1d>
##$AZFE= 0.1
##$AZFW= 0.1
##$BCFW= 1
##$BC_mod= 2
##$BYTORDP= 1
##$COROFFS= 0
##$CY= 11.3945322036743
##$DATMOD= 1
##$DC= 2
##$DFILT= <>
##$DTYPP= 0
##$F1P= 16.9975609425685
##$F2P= -3.02152046262296
##$FCOR= 0.5
##$FTSIZE= 0
##$FT_mod= 4
##$GAMMA= 1
##$GB= 0.15
##$INTBC= 1
##$INTSCL= 1
##$ISEN= 128
##$LB= 0.24
##$LEV0= 0
##$LPBIN= 0
##$MAXI= 10000
##$MC2= 0
##$MEAN= 0
##$ME_mod= 0
##$MI= 1.114404
##$NCOEF= 0
##$NC_proc= 0
##$NLEV= 6
##$NOISF1= 3.799351
##$NOISF2= 2.8
##$NSP= 1
##$NTH_PI= 0
##$NZP= 0
##$OFFSET= 15.70392
##$PC= 1
##$PHC0= -9971.804
##$PHC1= 10.20092
##$PH_mod= 1
##$PKNL= yes
##$PPARMOD= 0
##$PSCAL= 0
##$PSIGN= 0
##$REVERSE= no
##$SF= 200.130013532006
##$SI= 16384
##$SIGF1= 3
##$SIGF2= 2
##$SINO= 400
##$SIOLD= 16384
##$SREGLST= <1H.CDCl3>
##$SSB= 0
##$STSI= 0
##$STSR= 0
##$SW_p= 3612.71676300578
##$SYMM= 0
##$S_DEV= 0
##$TDeff= 0
##$TDoff= 0
##$TI= <>
##$TILT= no
##$TM1= 0
##$TM2= 0
##$TOPLEV= 0
##$USERP1= <user>
##$USERP2= <user>
##$USERP3= <user>
##$USERP4= <user>
##$USERP5= <user>
##$WDW= 1
##$XDIM= 8192
##$YMAX_p= 0
##$YMIN_p= 0
$$ End of Bruker specific parameters
$$ ---------------------------------
##NTUPLES= NMR FID
##VAR_NAME=  TIME,          FID/REAL,        FID/IMAG
##SYMBOL=    X,             R,               I
##VAR_TYPE=  INDEPENDENT,   DEPENDENT,       DEPENDENT
##VAR_FORM=  AFFN,          ASDF,            ASDF
##VAR_DIM=   8192,          8192,            8192
##UNITS=     SECONDS,       ARBITRARY UNITS, ARBITRARY UNITS
##FACTOR=    0.000296,      1,               1
##FIRST=     0,             0,               0
##LAST=      2.424536,      0,               0
##MIN=       0,             -363297,         0
##MAX=       2.424536,      345732,          0
$$ Real data points
##PAGE= N=1
##DATA TABLE= (X++(R..R)), XYDATA
$$ [...]
$$ plain form
1775 79 -260 227 148 -650 77 219 -498 -192 -46 -203 -255 126 9 -19 -71 83 13 9 -18 -84 -35 -216 -195 -129
1799 -129 -291 198 -191 -447 39 353 -281 72 132 -432 -57 232 -29 19 474 -34 -110 -27 11 -121 402 -223
1821 -223 165 -138 -156 317 22 -214 264 255 -208 584 144 -213 71 87 -252 -39 446 -190 118 166 -235 3
1843 3 186 284 -175 128 129 129 83 281 29 -131 -88 109 -57 -33 444 -89 -431 184 130 -246 114 211 -251 -4
1867 -4 182 -60 -348 87 -67 -316 -164 61 -265 -153 -44 -18 -334 -100 321 -103 -147 28 -299 -319 231 135
1889 135 -420 188 290 -478 -237 238 -165 -144 125 118 -113 102 192 -108 -326 118 384 -282 21 587 -123
1910 -123 -242 585 -160 -194 514 87 -202 374 256 -192 330 119 -198 -24 123 -19 185 -11 40 344 -171
1931 -171 -50 160 -316 -11 328 -399 -92 549 -53 -289 490 -161 -519 496 -147 -310 167 59 -326 191
$$ packed form
1775G9l39M87p9p98P27J42p17L06J46j57n2L81j17k8n2J54p0mk7o6M9j81K1O6
1799a29j62M89l89k56M86L14o34L53O0n64L75K89k61M8M55n08p6Q3L8j32N23o25
1821b23L88l03j8M73k95k36M78rm63P92m40l57K84J6l39K13M85o36L08M8m01K38
1843CJ83R8m59L03J%m6J98k52j60M3J97j66K4M77n33l42O15n4l76L60R7m62K47
1867dJ86k42k88M35j54k49J52K25l26J12J09K6l16K34M21m24m4J75l27k0N50r6
1889A35n55O08J02p68K41M75m03K1K69pk31K15R0l00k18M44K66o66L03N66p10
1910a23j19Q27p45l4P08m27k89N76j18m48N22k11l17J74J47j42K04j96N1L04n15
1931a71J21K10m76L05L39p27L07O41o02k36P79o51l58J015o43j63M77j08l85N17
$$ plain form
1951 191 32 81 164 -334 -93 158 -543 -34 318 -407 176 378 -277 -157 447 -53 -423 431 -176 -163 489
1972 489 -291 -240 309 -296 -92 397 -32 -174 502 -88 -172 452 -190 -27 434 -369 145 461 -145 -51 452
1993 452 -598 -1 595 -409 -92 820 -211 -41 604 -292 -469 638 -50 -407 400 62 -98 361 -10
2012 -10 16 149 -83 32 243 -335 267 143 -341 50 374 -577 156 517 -594 146 662 -531 -345 608
2032 608 -459 -427 689 -329 -568 277 36 -305 68 -88 54 -219 -401 378 41 -470 626 191 -622
2051 -622 442 432 -673 217 596 -625 1 788 -409 -238 675 -38 -325 547 132 -277 151 318 104
2070 104 -6 -64 376 -161 -312 586 -253 -639 888 454 -901 453 512 -824 254 758 -539 -248 774
2089 774 -314 -185 159 151 -180 -169 15 -129 -317 47 433 -395 -226 455 -506 -554 529 170 -919 698
$$ packed form
1951A91j59M9Q3m98K41K51p01N09L52p25N83K02o55J20O04n00l70Q54o07J3O52
1972D89p80N1N49o05K04M89m29j42O76n90q4O24o42J63M61q03N14L16o06R4N03
1993D52j050N97N96j004L17R12j031J70O45q96j77J107o88l57Q07l38j60M59l71
2012a0K6J33k32J15K11n78O02j24m84L91L24r51P33L61j111P40N16j193J86R53
2032F08j067L2J116j018k39Q45k41l41L73j56J42k73j82P79l37n11J096m35q13
2051f22J064j0j105Q90L79j221O26P87j197J71R13p13k87Q72m15m09M28J67k14
2070A04j10n8M40n37j51Q98q39l86J527m34j355J354N9j336J078N04j297K91J022
2089G74j088J29L44ql31J1J84j44j88L64L86q28J69O81r61m8J083l59j089J617
$$ plain form
2109 698 70 -657 414 429 -726 165 498 -447 -259 138 78 -189 -73 -158 66 -231 88 230 -392 -148
2129 -148 421 -446 -142 400 -462 -443 551 91 -233 543 337 -542 331 284 -410 158 20 -202 374 29 -170
2150 -170 -9 21 117 188 38 174 0 -281 76 303 -459 -139 507 -545 -96 652 -151 -135 645 -9 -361
2171 -361 260 192 -269 378 -72 -418 319 253 -168 74 -40 206 70 -247 94 -104 -574 -128 -31 -663 44
2192 44 662 -554 -307 563 -333 -168 519 -101 -678 255 54 -320 7 -170 -150 -42 62 -31 -266 -50 263
2213 263 193 -224 299 352 -414 437 400 -553 266 598 -251 65 533 98 -186 446 271 -308 421 75 -104
2234 -104 4 -27 96 17 -4 79 60 -337 37 -63 -408 146 296 -489 206 437 -457 -99 285 -162 -394 603
2256 603 -257 -200 266 -103 -244 123 100 -58 -219 -125 70 -151 -24 -127 13 -244 216 19 -358 208 348
$$ packed form
2109F98o28p27J071J5j155Q91L33r45J88L97o0k67J16q5K24k97L19J42o22K44
2129a48N69q67L04N42q62J9R94m60l24P76k06q79Q73m7o94N68j38k22N76l45j99
2150a70J61L0R6P1j50J36j74k81L57K27p62L20O46j052M49P48q03J6P80o54l52
2171c61O21o8m61O47m50l46P37o6m21K42j14K46j36l17L41j98m70M46R7o32P07
2192D4O18j216K47Q70q96J65O87o20n77R33k01l74L27j77K0J08J04r3k35K16L13
2213B63p0m17N23N3p66Q51l7r53Q19L32q49L16M68m35k84O32j75n79P29l46j79
2234a04J08l1J23p9k1Q3j9l97L74j00l45N54J50p85O95K31q94L58L84m47k32R97
2256F03q60N7M66l69j41L67k3j58j61R4J95k21J27j03J40k57M60j97l77N66J40
$$ plain form
2277 348 -357 -38 641 -265 -81 182 -224 -256 200 -138 -163 331 -165 -60 91 56 -155 -14 17 78 134 -109
2299 -109 65 148 -98 234 431 -184 -42 43 -67 20 114 192 -94 378 68 -210 -82 197 -182 254 217 -165
2321 -165 115 231 232 55 -22 149 238 -93 -104 184 168 -296 28 -197 12 339 -274 -66 11 -261 -278 74 13
2344 13 -109 -161 60 -92 -158 36 -3 0 -83 177 -41 -275 -31 64 -133 -31 226 -193 -49 150 -122 8 88
2367 88 35 -109 289 -45 2 -291 9 183 -150 168 233 -209 -187 163 -163 7 332 100 -137 109 -136 -7
2389 -7 15 -13 139 220 58 145 311 384 -12 309 -224 74 71 -55 107 230 -170 -153 112 -139 202 393 -378
2412 -378 -208 93 -214 -175 88 -108 -222 352 -107 -270 108 -226 225 325 -9 -275 78 -58 -101 203 -113
2433 -113 -138 -89 -11 -87 321 -243 -197 34 -61 -196 200 -195 -143 544 41 -444 584 184 -131 412 92 -214
$$ packed form
2277C48p05L19O79r06J84K63m06l2M56l38k5M94m96J05J51l5k11J41L1O1N6k43
2299a09J74Q3k46L32J97o15J42Q5j10Q7R4P8k86M72l10k78J28K79l79M36l7l82
2321a65K80J16Jj77p7J71Q9l31j1K88j6m64L24k25K09L27o13K08P7k72j7L52o1
2344A3j22n2K21j52o6J94l9Lq3K60k18k34K44R5j97J02K57m19J44J99k72J30Q0
2367H8n3j44L98l34M7k93L00J74l33L18O5m42K2L50l26J70L25k32k37K46k45J29
2389gK2k8J52Q1j62Q7J66P3l96L21n33K98lj26J62J23m00J7K65k51L41J91p71
2412c78J70L01l07L9K63j96j14N74m59j63L78l34M51J00l34k66L53j36m3L04l16
2433a13k5M9P8p6M08n64M6K31r5j35L96l95N2O87n03m85J028m00l15N43l20l06
$$ plain form
2455 -214 185 338 -236 -72 149 -42 113 46 -20 116 -231 138 283 -232 39 714 -370 -144 623 -432
2475 -432 -263 509 31 -163 206 162 -355 292 493 -275 269 -57 2 -160 102 68 -185 -238 207 -108 -659
2496 -659 242 -13 -607 -109 524 -616 -119 226 -87 -268 423 -69 -415 102 242 -251 -39 230 0 -250
2516 -250 -248 213 -236 -110 465 48 -462 461 227 -369 445 517 -369 -151 758 -388 -560 639 34 -69
2536 -69 255 111 -285 16 88 -245 -210 9 21 -198 -173 349 -5 -165 325 65 -268 311 148 -434 278 354
2558 354 -355 75 368 -120 -127 66 -66 -188 87 194 -127 76 -76 -74 -309 -70 356 -180 -343 155 70 -166
2580 -166 381 -24 -806 451 34 -370 90 316 -216 123 26 -429 112 46 -110 -41 -145 53 51 -108 24
2601 24 263 -266 -55 491 -243 -335 475 21 -328 549 -38 -301 520 164 -376 386 166 -170 79 131 -300
$$ packed form
2455b14L99J53n74J64K21j91J55o7o6J36l47L69J45n15K71O75j084K26P67j055
2475d32J69P72m78j94L69m4n17O47K01p68N44l26N9j62K62l4k53n3M45l15n51
2496f59R01k55n94M98O33j140M97L45l13j81O91m92l46N17J40m93K12K69k30k50
2516b50KM61m49J26N75m17n10R23k34n96Q14P2q86K18R09j146j72J199o05j03
2536f9L24j44l96L01P2l33L5K19J2k19K5N22l54j60M90k60l33N79j63n82P12P6
2558C54p09M30K93m88pJ93j32j22K75J07l21K03j52Kk35K39M26n36j63M98q5k36
2580a66N47m05p82J257m17m04M60K26n32L39r7m55N41o6j56O9j04J98kj59J32
2601B4K39n29K11N46p34r2Q10m54l49Q77n87k63Q21l56n40P62k20l36K49N2m31
$$ plain form
2622 -300 -50 33 19 -187 80 102 -186 -340 -156 251 -323 95 335 -561 -32 485 -85 -181 461 -38 -527
2643 -527 505 84 -240 31 150 -193 -53 5 -321 -244 161 -65 146 -19 -34 -166 -179 -88 273 42 112 380
2665 380 -243 -209 279 -11 -310 472 0 -191 182 33 -271 181 -30 -94 93 -70 -42 95 -9 278 14
2686 14 -157 289 125 0 344 95 -213 80 395 -297 -131 307 -371 -130 495 -123 -177 293 -75 37 207
2707 207 -5 54 167 2 132 -22 184 -14 -36 -99 6 269 -219 -2 110 -240 -221 360 -32 -202 172
2728 172 -120 -62 -84 130 -202 137 66 -281 -66 -130 93 166 -278 73 17 -149 106 -19 -180 47 230 -135
2750 -135 103 281 -85 -40 104 -117 -8 62 -60 45 110 -109 29 -123 52 -100 -321 -132 9 248 -103
2771 -103 10 34 -117 -76 33 -207 1 -136 62 191 53 115 -60 266 -10 -190 9 58 82 -97 230 90
$$ packed form
2622c00K50Q3j4k06K67K2k88j54J84M07n74M18K40q96N29N17n70r6O42m99m89
2643e27J032m21l24K71J19l43J40N8l26P7M05k26K11j65j5j32j3R1L61k31P0K68
2665C80o23L4M88k90k99P82m72j91L73j49l04M52k11o4J87j63K8J37j04K87k64
2686A4j71M46j64j25L44k49l08K93L15o92J66M38o78K41O25o18n4M70l68J12J70
2707B07k12N9J13j65J30j54K06j98k2o3J05K63m88K17J12l50J9N81l92j70L74
2728A72k92N8k2K14l32L39p1l47K15o4K23P3m44L51n6j66K55j25j61K27J83l65
2750a35K38J78l66M5J44k21J09P0j22J05O5k19J38j52J75j52k21J89J41K39l51
2771a03J13K4j51M1J09k40K08j37J98J29j38O2j75L26k76j80J99M9K4j79L27j40
$$ plain form
2793 90 261 -147 111 -176 138 -88 -70 -364 146 -50 109 61 -58 -114 133 43 -139 103 149 44 167 -104
2815 -104 -296 -52 2 -87 -51 22 -232 58 144 -170 -51 16 135 -42 -205 93 38 -127 29 87 0 -76 137
2838 137 -22 21 209 18 76 -16 -10 131 104 -154 -76 32 194 42 -270 -147 -155 28 -33 -237 187 94 120 140
2862 140 -148 -101 88 -140 -29 123 27 -63 55 -110 72 -118 -42 -192 -201 -37 21 118 204 128 -46 -56 21 -95
2886 -95 20 62 61 -73 -81 -122 95 -177 78 -33 76 237 21 -167 -143 -66 -33 93 -38 43 138 40 76 -189 -13
2911 -13 128 -3 82 118 124 4 177 142 112 76 -75 150 74 8 -47 -188 105 -213 107 46 -293 136 -188 -109
2935 -109 -13 66 -65 -69 -2 156 -132 44 -39 -144 -130 128 -9 214 28 -238 37 -14 117 159 327 -4 5 -15
2959 -15 -15 -6 -195 -290 169 -235 -122 111 351 121 -37 131 56 101 -203 -108 -104 93 -238 -276 44 34 -46 -73 -73 -120
$$ packed form
2793I0J71m08K58k87L14k26J8k94N10j96J59m8j19n6K47r0j82K42M6j05J23k71
2815a04j92K44N4q9L6P3k54K90Q6l14J19O7J19j77j63K98n5j65J56N8q7p6K13
2838A37j59M3J88j91N8r2OJ41k7k58P8J08J62j52l12J23qJ83o1k04M24r3K6K0
2862A40k88M7J89k28J11J52r6r0J18j65J82j90P6j50rJ64N8R7Q6p6j74j0P7j16
2886i5J15M2jj34qm1K17k72K55j11J09J61k16j88K4P7L3J26j31Q1R5r8L6k65J76
2911a3J41j31Q5L6Oj20J73l5l0l6j51K25p6o6n5j41K93l18L20o1l39M29l24P9
2935a09R6P9j31mO7J58k88J76q3j05J4K58j37K23j86k66K75n1J31M2J68l31Rk0
2959a5%Rj89r5M59m04J13K33K40k30j58J68p5M5l04R5MJ97l31l8L20j0q0k7%m7
$$ plain form
2985 -120 -44 -90 132 75 -150 -48 88 -2 -67 -243 57 -234 91 80 125 120 28 -30 -106 -191 112 19 -38 -147 -27
3010 -27 -117 -82 -54 25 145 -23 -20 -42 169 -22 140 154 262 71 4 81 95 -12 34 107 -24 -86 129 -92 117
3035 117 -225 41 137 -29 -51 30 -49 53 -45 262 -144 138 114 -94 -222 58 -40 -72 56 149 -210 228 160
3058 160 -104 -52 41 -41 149 12 -218 -143 65 24 -19 99 -76 -130 -77 239 -68 173 48 -16 -44 -122 -3 -189
3082 -189 80 201 -76 -151 -12 16 -177 49 8 14 48 139 -87 120 124 109 200 17 217 -170 60 -70 54 -221
3106 -221 119 -18 95 -48 98 -103 272 220 -21 185 -27 -31 -64 19 28 -17 -32 -82 -91 -33 365 -91 -143 88 115
3131 115 -116 -126 84 146 -338 182 264 55 98 306 -94 -81 139 -196 -85 -11 -143 -2 138 12 -278 -56
3153 -56 177 166 -32 -84 32 99 18 218 -115 30 240 96 -512 -78 319 -237 199 84 -38 -36 46 -19 -111
$$ packed form
2985a20P6m6K22n7k25J02J36r0o5j76L00k91L25j1M5nr2n8p6q5L03r3n7j09J20
3010b7r0L5K8P9J20j68Lk2K11j91J62J4J08j91o7P7J4j07M6P3j31o2K15k21K09
3035A17l42K66R6j66k2Q1p9J02r8L07m06K82k4k08j28K80r8l2J28R3l59M38o8
3058A60k64N2R3q2J90j37k30P5K08m1m3J18j75n4N3L16l07K41j25o4k8p8J19j86
3082a89K69J21k77p5J39K8j93K26m1OL4R1k26K07Mj5R1j83K00l87K30j30J24k75
3106b21L40j37J13j43J46k01L75n2k41K06k12ml3Q3Rm5j5n0rN8L98m56n2K31K7
3131A15k31j0K10O2m84N20Q2k09M3K08m00J3K20l35J11P4j32J41J40j26k90K22
3153e6K33j1j98n2J16O7q1K00l33J45K10j44o08M34L97n56M36j15j22KQ2o5r2
$$ plain form
3176 -111 -133 32 26 19 216 108 -169 169 44 225 -53 -119 84 -50 -83 107 -236 -99 163 -145 -89 315 -273
3199 -273 -190 20 -94 123 86 -136 -79 -89 46 220 -259 -323 30 9 49 235 12 96 -159 -140 -53 73 6 -123
3223 -123 -178 -170 -184 69 261 -200 -227 77 -9 20 143 -236 17 189 38 -263 -38 -65 -212 -2 15 253 35
3246 35 -323 195 -66 -61 2 143 -9 89 302 -363 -45 16 94 157 146 -139 -243 214 45 -214 60 -12 -25 8
3270 8 -82 -54 3 -106 155 -205 -176 43 17 -161 -32 79 56 138 -179 27 206 292 -123 -111 123 41 11 72 -166
3295 -166 317 -10 -7 -161 -119 70 145 -77 -126 47 -88 -49 67 207 -73 186 -8 -296 220 104 50 -11 -14
3318 -14 49 310 -40 -2 -190 109 150 -31 -22 183 28 -201 -61 -126 171 -82 162 32 -156 8 108 -72
3340 -72 296 -6 -105 -30 -130 -285 27 -72 -64 -63 30 68 167 -62 98 24 -215 98 163 -258 -262 32 -50 -164 108
$$ packed form
3176a11k2J65opJ97j08k77L38j25J81k78o6K03j34l3J90l43J37K62l08N6M04n88
3199b73Q3K10j14K17l7k22N7j0J35J74m79o4L53k1M0J86k23Q4k55J9Q7J26o7j29
3223a23n5Qj4K53J92m61k7L04q6K9J23l79K53J72j51l01K25k7j47K10J7K38k18
3246C5l58N18k61NO3J41j52R8K13o65L18O1P8O3j1k85j04M57j69k59K74p2j3L3
3270Hr0K8N7j09K61l60K9K19k6j78J29J11k3Q2l17K06J79Q6m15J2K34q2l0O1k38
3295a66M83l27Lj54M2J89P5k22m9J73j35L9J16J40k80K59j94k88N16j16n4o1l
3318a4O3K61l50L8j88K99M1j81RK05j55k29J40o5K97k53K44j30j88J64J00j80
3340g2L68l02r9P5j00j55L12r9QJR3L8R9k29J60p4k39L13O5m21mK94q2j14K72
$$ plain form
3365 108 -106 -252 221 -14 -66 168 102 -359 269 168 -342 28 242 -109 -116 -76 -87 43 -17 180 46 -45 38
3388 38 -184 -32 -34 149 -64 -141 291 -224 -212 0 -1 -93 19 -254 -300 -164 94 127 146 209 106 -4 109 -68
3412 -68 11 154 131 75 -136 -60 244 18 -24 229 -51 102 89 -29 56 224 39 -121 221 148 -20 -4 -107
3435 -107 -185 -61 -50 5 90 226 -163 -63 -172 33 104 -62 -76 -123 -241 -47 241 -53 -38 -78 3 -32 50 -131
3459 -131 -35 -118 146 -132 -199 -225 34 52 -44 0 -35 258 -251 -176 -36 269 -182 76 177 36 222 120 4
3482 4 171 -12 234 -27 -82 13 -154 -33 -167 -41 -71 183 -9 -28 38 -108 179 121 -14 83 34 32 -22 -14 -164
3507 -164 -62 -119 -263 240 67 -154 -69 -71 189 166 248 -5 -357 130 43 -87 220 65 115 -5 32 321 -40
3530 -40 -112 398 -113 -6 13 57 41 280 34 29 -228 -50 -16 -243 -42 -134 -137 138 -105 -55 95 6 16 -40 -193
$$ packed form
3365A08k14j46M73k35n2K34o6m61O28j01n10L70K14l51pM0j1J30o0J97j34r1Q3
3388C8k22J52kJ83k13p7M32n15J2K12jr2J12k73m6J36K58L3J9O3j03j10J13j77
3412f8P9J43k3n6k11P6L04k26m2K53k80J53j3j18Q5J68j85j60L42p3j68J6j03
3435a07p8J24J1N5Q5J36l89J00j09K05P1j66j4m7j18J94K88k94J5m0Q1l5Q2j81
3459a31R6q3K64k78o7k6K59J8r6M4l5K93n09P5J40L05m51K58J01j41J86j02j16
3482DJ67j83K46k61n5R5j67J21j34J26l0K54j92j9O6j46K87n8j35R7m9kn4Qj50
3507a64J02n7j44N03j73k21Q5kK60k3Q2k53l52M87q7j30L07j55N0j20L7K89l61
3530d0p2N10n11J07J9M4j6K39k46nk57J78L4k27K01r2lK75k43N0J50q9J0n6j53
$$ plain form
3555 -193 -123 40 77 -61 3 -153 170 -24 -148 56 -5 97 215 27 24 211 170 93 105 96 -19 101 -159 86
3579 86 286 80 116 -111 24 34 90 46 -141 121 -69 -222 -26 -115 -87 -54 222 54 93 80 62 -7 -57 -189
3603 -189 -43 -153 -91 -161 -161 134 -74 -1 137 -67 -170 28 181 -109 -270 113 -260 50 -36 -23 -50 89 -109
3626 -109 137 40 -178 -141 -196 -56 66 136 -120 -88 -128 -83 71 -120 251 33 28 -143 -21 241 -167 -72 58
3649 58 -143 14 342 -55 -111 84 -12 35 193 -171 -33 23 -18 -87 43 -38 51 -87 129 113 77 -142 257 -45
3673 -45 -167 37 -85 -159 -33 166 49 -56 233 183 135 191 -28 79 -32 159 -125 73 33 -15 30 -198 125
3696 125 160 -79 -204 -16 -152 166 40 -64 144 -101 -214 192 -72 -107 -64 -72 -188 -235 62 44 -49 -79 -272
3719 -272 -44 243 1 -11 89 -142 137 -117 292 144 -41 106 6 163 14 296 -36 77 136 252 -158
$$ packed form
3555a93P0J63L7j38O4j56L23j94j24K04o1J02J18j88lJ87m1p7J2rj15J20k60K45
3579H6K00k06L6k27J35J0N6m4j87K62j90j53J96q9K8L3K76j68L9j3j8o9n0j32
3603a89J46j10O2p0%K95k08P3J38k04j03J98J53k90j61L83l73L10q6J3k7J39j98
3626a09K46r7k18L7n5J40J22P0k56L2m0M5J54j91L71k18nj71J22K62m08R5J30
3649E8k01J57L28l97n6J95r6M7J58l64J38N6m1o9J30q1Q9j38K16j6l6k19L99l02
3673d5j22K04j22p4J26J99j17j05K89n0m8N6k19J07j11J91k84J98m0m8M5k28L23
3696A25L5k39j25J88j36L18j26j04K08k45j13M06k64l5M3qj16m7K97j8r3l0j93
3719b72K28K87k42j2J00k31K79k54M09j48j85J47j00J57j49K82l32J13N9J16m10
$$ plain form
3740 -158 172 101 -10 24 35 113 -12 40 -58 247 -48 -47 25 128 -40 -122 29 -126 57 -88 -196 -84 -30 187
3764 187 -106 -188 -149 71 -52 16 -111 -80 -217 -116 94 6 108 -145 -82 -77 -285 -146 -45 -170 -96 -6 -89 -180
3788 -180 -52 -41 124 -84 231 -90 48 -188 -104 133 -68 -33 -153 202 5 -89 -218 119 -101 -58 -113 -108 55
3811 55 -56 75 -126 -188 296 -155 -83 -75 -20 421 129 -123 -346 -79 -171 -227 82 103 254 151 -47 -18 171
3834 171 11 31 -92 -1 102 60 -152 111 159 -15 -223 -14 -16 -46 243 243 129 29 -8 -217 -106 152 -176
3857 -176 94 -136 32 54 -148 161 -107 -23 -65 -247 -142 -134 -57 155 -16 -35 59 -5 37 -105 140 -162 54
3880 54 21 -46 -177 -100 -47 -262 368 -43 146 -142 -84 112 -30 -36 173 221 -57 -70 22 2 60 -199 -8 176
3904 176 21 -40 -11 -176 -126 -98 -111 84 -54 -108 166 -218 4 48 -274 -121 -13 -287 176 -29 -109 -42 -150
$$ packed form
3740a58L30p1j11L4J1P8j25N2r8L05k95JP2J03j68q2J51j55J83j45j08J12N4K17
3764A87k93q2L9K20j23O8j27L1j37J01K10q8J02k53O3Nk08J39J01j25P4R0q3r1
3788a80J28J1J65k08L15l21J38k36Q4K37k01L5j20L55j97r4j29L37k20M3n5NJ63
3811E5j11J31k01o2M84m51P2QN5M41k92k52k23K67r2n6L09K1J51j03j98K9J89
3834A71j60K0j23R1J03m2k12K63M8j74k08K09kl0K89%j14j00l7k09J11K58l28
3857a76K70k30J68K2k02L09k68Q4m2j82J05QP7K12j71j9R4o4M2j42K45l02K16
3880E4l3o7j31P7N3k15O30m11J89k88N8J96j42oK09M8k78j3R2k0N8k59J91J84
3904A76j55o1K9j65N0K8j3J95j38n4K74l84K22M4l22J53J08k74M63k05q0O7j08
$$ plain form
3927 -150 36 -347 -87 72 -25 -150 118 113 -162 -179 -148 -147 77 11 -229 -186 39 -239 -82 135 17 -83 75
3950 75 160 -263 -130 -167 66 186 -110 56 57 -51 214 -23 151 89 -67 70 -23 231 -71 25 -21 274 -89
3973 -89 -17 -1 82 -53 9 -92 -376 -191 41 -47 -7 -139 152 114 -142 83 -141 -60 -269 -1 391 163 39
3996 39 91 30 -80 -88 -98 80 -63 -26 174 -77 209 245 -2 26 95 -116 -10 -20 74 174 48 67 134 -55 177
4021 177 71 71 -112 -98 78 -275 -65 -10 -59 -90 -285 -104 -59 291 176 -22 -46 -36 -113 310 142 -20 -100 16
4045 16 -4 -49 158 53 121 -117 274 23 237 150 27 29 36 -77 -8 -224 16 -83 -256 -63 -14 -65 -103 -312 167
4070 167 138 -84 -107 -2 147 -146 -27 -176 114 -10 -81 -24 55 -120 87 -139 31 176 -106 -257 299 -14
4092 -14 -88 -25 -159 -15 2 300 153 -67 -114 -186 118 156 2 106 -65 111 261 17 179 -83 50 209
$$ packed form
3927a50J86l83K60J59r7j25K68nk75j7L1JK24o6k40M3K25k78J57K17j18j00J58
3950G5Q5m23J33l7K33J20k96J66Jj08K65k37J74o2j56J37r3K54l02R6m6K95l63
3973h9P2J6Q3j35O2j01k84J85K32q8M0j32K91l8k56K25k24Q1k09K68L92k28j24
3996C9N2o1j10qj0J78j43L7K00k51K86L6k47K8O9k11J06j0R4J00j26J9O7j89K32
4021A77j06%j83J4J76l53K10N5m9l1j95J81M5L50j15j98k4J0p7M23j68j62q0J16
4045A6k0m5K07j05O8k38L91k51K14q7j23KPj13O9k16K40r9j73J93M9n1l8k09M79
4070A67k9k22k3J05J49k93J19j49K90j24p1N7P9j75K07k26J70J45k82j51N56l13
4092a4p4O3j34J44J7K98j47k20m7p2L04L8j54J04j71J76J50k44J62k62J33J59
$$ plain form
4114 209 109 131 34 124 57 -210 -33 90 20 232 78 135 52 -104 22 -25 -46 -169 114 -107 20 33 -54 31
4138 31 -88 1 20 -96 -103 -171 104 54 9 132 -76 -88 -47 203 -29 -141 11 -181 -251 10 -158 -136 -96 -53 -56
4163 -56 59 -46 1 168 -24 -37 -316 -76 290 52 64 13 -230 11 35 -23 68 -119 -114 21 -34 153 28 -143
4187 -143 171 -63 -76 155 22 27 57 -101 -3 111 -177 154 -98 -73 -115 -110 -241 116 -43 -93 -47 -167 -175 77
4211 77 148 -57 269 6 81 50 147 -45 165 -78 -46 -182 -10 91 -92 -208 -25 -247 16 -2 189 -268
4233 -268 -138 1 -86 -177 14 91 -176 -45 -51 -222 -25 -64 -114 68 -161 -108 -138 -187 -174 -50 -177 69 -26 -120
4257 -120 81 -19 62 83 89 -38 43 140 -3 -124 157 102 -5 53 276 29 20 66 53 95 173 -152 94 166 -15
4282 -15 131 43 -28 -89 -76 120 182 164 77 -46 -192 3 173 -100 -77 -84 201 -95 -83 74 -251 143 185 132 -46
$$ packed form
4114B09j00K2r7R0o7k67J77J23p0K12j54N7q3j56J26m7k1j23K83k21J27J3q7Q5
4138C1j19Q9J9j16po8K75n0m5J23k08j2M1K50k32j12J52j92p0K61j68K2M0M3l
4163e6J15j05M7J67j92j3k79K40L66k38J2n1k43K41K4n8R1j87NJ35n5J87j25j71
4187a43L14k34j3K31j33NL0j58R8J14k88L31k52K5m2Nj31L57j59n0M6j20qK52
4211G7P1k05L26k63P5l1R7j92K10k43L2j36J72J01j83j16J83k22K63j8J91m57
4233b68J30J39q7r1J91P7k67J31oj71J97l9n0J82k29N3l0m9J3J24j27K46r5r4
4257a20K01j00Q1K1Oj27Q1R7j43j21K81n5j07N8K23k47rM6j3M2P8l25K46P2j81
4282a5J46q8p1o1J3J96O2j8q7j23j46J95J70k73K3pK85k96J2J57l25L94M2n3j78
$$ plain form
4307 -46 -233 -154 132 110 125 193 -17 -80 -29 -17 -60 166 -335 148 -179 -134 24 321 -117 -230 90 -31 90
4330 90 -41 7 6 157 179 15 49 104 -4 -176 18 87 158 6 114 -173 -102 -64 64 207 154 -69 -67 -37 -188
4355 -188 -184 31 7 21 33 145 48 26 -88 -77 -37 -23 100 258 -65 96 270 118 -41 -118 11 57 -123 -127 -85
4380 -85 -51 -25 -27 -70 266 58 -68 -134 117 118 56 -49 9 -191 19 8 -8 46 -37 -182 1 103 -55 -266 -198
4405 -198 -164 -278 -230 -24 -103 22 13 -132 -304 -55 -134 170 147 -237 -84 -163 39 60 -180 -226 -294 -51 -40 -1
4429 -1 -109 32 84 -108 103 181 131 -156 -134 158 196 408 -28 -195 97 93 -134 -86 -93 172 -38 93 -150 45
4453 45 -192 44 -151 -30 -4 -61 39 -53 283 66 132 94 -109 46 79 37 -94 163 -208 72 -129 -193 118
4476 118 32 69 -188 -44 -155 -2 -4 -180 -60 63 -66 12 -15 -170 -83 -45 -49 80 287 -112 94 28 139 212
$$ packed form
4307d6j87P9K86k2J5O8k10o3N1J2m3K26n01M83l27M5J58K97m38j13L20j21J21
4330I0j31M8jJ51K2j64L4N5j08j72J94O9P1j52J08k87P1L8J28J43n3k23KL0j51
4355a88MK15k4J4J2J12r7k2j14J1M0J4J23J58l23J61J74j52j59p7J29M6j80mM2
4380h5L4K6km3L36k08j26o6K51Jo2j05N8k00K10j1j6N4q3j45J83J02j58k11O8
4405a98L4j14M8K06p9J25rj45j72K49p9L04k3l84J53p9K02K1k40m6o8K43J1L9
4429aj08J41N2j92K11P8n0k87K2K92L8K12m36j67K92mk27M8pK65k10J31k43J95
4453D5k37K36j95J21K6n7J00r2L36k17O6l8k03J55L3m2j31K57l71K80k01o4L11
4476A18q6L7k57J44j11J53kj76J20J23j29P8k7j55Q7L8mJ29K07l99K06o6J11P3
$$ plain form
4500 212 10 -66 -67 5 -92 179 268 35 44 -53 158 -91 -77 143 -39 -24 168 138 125 -104 98 -78 96 110 30
4525 30 229 86 66 -28 63 18 137 -67 132 -157 135 -117 -55 100 47 96 15 -307 -134 70 125 -232 236
4548 236 60 -32 199 73 -134 -30 151 -35 216 -38 -82 226 43 0 104 -189 -182 92 218 5 -28 253
4570 253 -42 151 -96 -129 -108 -118 -72 -28 -21 -57 296 169 267 -44 223 181 5 131 -120 112 25 165 97 -147
4594 -147 8 384 -101 43 -12 -98 -222 269 106 -263 -83 -185 -170 -68 -122 -85 -87 -72 101 157 -293 -98 152
4617 152 -210 169 104 -146 -184 330 -91 -225 -207 -115 -201 73 -142 47 8 -106 -135 -291 20 -25 325 -124 88
4640 88 -148 -125 6 -241 -149 -64 167 161 1 195 -261 17 20 -398 90 -27 -255 78 -45 213 -47 136 162
4663 162 -154 101 92 42 11 -6 129 81 91 -24 53 -165 135 -58 -160 -49 -42 -82 201 90 51 0 -33 -115 19
$$ packed form
4500B12k02p6jP2r7K71Q9k33Rr7K11k49J4K20j82J5J92l0j3k29K02j76J74J4q0
4525C0J99j43k0r4R1m5J19k04J99k89K92k52O2J55n3M9q1l22J73K04N5l57M68
4548B36j76r2K31j26k07J04J81j86K51k54m4L08j83m3J04k93PK74J26k13l3K81
4570B53k95J93k47l3K1j0M6M4Pl6L53j27R8l11K67m2j76J26k51K32q7J40o8k44
4594a47J55L76m85J44n5q6j24M91j63l69J80j02J5J02n4L7kJ5J73N6m50J95K50
4617A52l62L79o5k50l8N14m21j34J8R2q6K74k15J89l9j14k9j56L11m5L50m49K12
4640H8k36K3J31k47R2Q5K31oj60J94m56K78Lm18M88j17k28L33j23K58k60J83K6
4663A62l16K55rn0l1j7J35m8J0j15P7k18L00j93j02J11Pm0K83j11l9n1l3q2J34
$$ plain form
4688 19 -23 101 -60 -108 -10 12 -82 93 116 -7 35 -244 -119 24 117 -112 -110 -77 -51 -75 106 -32 -102 54 203
4713 203 -316 -169 -53 17 25 45 -131 -285 73 -198 -114 -45 -15 -27 27 142 56 -114 -42 18 -107 -206 53 -13 -26
4738 -26 -36 -4 -101 103 58 -7 31 79 -208 -121 185 105 11 164 45 126 -12 -2 -168 158 60 56 -147 -40 85
4763 85 -16 -1 222 138 -105 385 142 144 -91 58 -16 183 -66 -87 162 87 -165 4 -46 -67 -21 77 -155 193
4787 193 55 141 -135 -57 -108 -107 26 0 201 81 131 14 57 16 -141 -92 -212 98 112 -80 -77 60 55 -65 -8
4812 -8 89 -40 79 -38 -12 -244 -68 78 -162 -118 110 71 187 52 -263 -43 -48 13 11 43 -47 -15 -137 -67 39
4837 39 121 132 187 354 39 -78 -119 168 94 72 -159 -137 -107 42 -169 134 -140 129 220 49 -215 -10 -67 -62
4861 -62 -4 93 -47 -79 59 -23 -1 -46 3 -258 60 -45 57 -156 43 -175 -95 -219 70 58 -147 -192 142 -156
$$ packed form
4688A9m2J24j61m8R8K2r4J75K3j23M2k79J25J43R3k29KL3K6k4J81j38p0J56J49
4713B03n19J47J16P0QK0j76j54L58k71Q4O9L0j2N4J15q6j70P2O0j25r9K59o6j3
4738b6j0L2r7K04m5o5L8M8k87Q7L06q0r4J53j19Q1j38J0j66L26r8mk03J07J25
4763H5j01J5K23q4k43M90k43Kk35J49p4J99k49k1K49p5k52J69n0k1M6R8k32L48
4787A93j38Q6k76P8n1JJ33k6K01j20N0j17M3m1j57M9j20L10J4j92LJ37nj20N7
4812hR7j29J19j17K6k32J76J46k40M4K28l9J16j35l15K20nO1kL2r0L2j22P0J06
4837C9Q2J1N5J67l15j17m1K87p4k2k31K2L0J49k11L03k74K69R1j71k64K05n7N
4861f2N8R7j40l2J38q2K2m5M9k61L18j05J02k13J99k18Q0j24K89j2k05m5L34k98
$$ plain form
4885 -156 -56 92 -78 -30 71 158 23 22 -52 -43 -104 44 161 -112 66 150 78 36 3 96 40 -39 14 110 82 55
4911 55 -21 -57 115 -108 -36 12 -176 -70 252 -292 11 34 374 2 -169 62 29 181 41 105 92 -7 279
4934 279 66 -222 260 -54 82 16 -14 165 12 158 29 -158 92 -92 -7 -31 -131 -187 -142 -9 -143 -1
4956 -1 -246 220 22 -12 -16 -253 -91 212 125 -340 -72 201 117 167 -108 -87 -46 -133 86 -119 42 232 -313 -127
4980 -127 188 12 -209 57 -203 -12 -36 78 -126 130 -138 -21 -11 11 69 142 -1 -20 -182 -54 -226 65
5002 65 -63 114 -1 184 -111 -86 238 -129 51 243 -9 53 225 -125 86 90 -176 -113 16 -32 -42 231 -76
5025 -76 -202 -103 -376 85 -239 -188 -141 158 -63 -179 37 124 237 63 35 -110 8 -274 -113 115 101 191 211
5048 211 90 -193 -70 149 75 -339 -171 -56 71 31 -31 -54 -118 -52 112 57 -21 -43 163 40 -209 -78 -78 -128
$$ packed form
4885a56J00J48j70M8J01Q7j35jp4Ro1J48J17k73J78Q4p2m2l3R3n6p9N3R6k8k7
4911E5p6l6J72k23P2M8j88J06L22n44L03K3L40l72j71K31l3J52j40O4j3r9K86
4934B79k13k88M82l14J36o6l0J79j53J46j29j87K50j84Q5k4j00n6M5J33j34J42
4956ak45M66j98l4mk37J62L03q7m65K68K73q4N0k75K1M1q7K19k05J61J90n45J86
4980a27L15j76k21K66k60J91k4J14k04K56k68J17J0K2N8P3j43j9j62J28j72K91
5002F5j28J77j15J85k95K5L24l67J80J92k52O2J72l50K11Mk66O3J29m8j0K73l07
5025g6j26R9k73M61l24N1M7K99k21j16K16Q7J13j74k8j45J18k82J61K28j4R0K0
5048B11j21k83J23K19p4m14J68J15J27m0o2k3o4O6J64n5p8k2K06j23k49J31%n0
$$ plain form
5072 -128 137 -78 -48 141 153 116 -57 -53 113 -258 6 152 26 149 -53 -81 77 212 73 18 125 73 -145
5095 -145 -104 117 38 73 77 101 113 -132 -18 -127 44 103 -84 -171 104 233 90 127 -9 54 248 -173 -126 -210
5119 -210 130 -78 -5 64 53 54 -47 -62 -97 -95 -148 16 150 -83 109 -136 50 -51 9 -122 -42 189 -348 -93
5143 -93 34 -161 12 -72 134 19 39 18 -179 -174 -139 -9 90 -112 237 -33 -3 202 49 -95 235 68 53
5166 53 -148 -122 225 -104 -54 114 -95 -178 10 -226 -48 -24 130 -265 -16 9 -326 -135 -6 -122 -88 -41 -26
5189 -26 13 140 -4 -37 2 -28 -67 -14 -48 198 29 204 -7 -1 -118 -204 -106 -76 36 -55 -77 21 79 -304 -88 -6
5215 -6 46 7 -207 -131 -206 109 -138 -132 -91 -31 23 9 198 181 80 228 -143 -138 43 3 -25 57 -20 130 -212 206
5241 206 161 162 -103 -73 -202 -42 138 56 116 -72 30 -47 -28 -38 5 -65 -64 -101 233 246 -32 -48 -230 -132 117 74
$$ packed form
5072a28K65k15L0J89J2l7j73MJ66l71K64J46j26J23k02k8J58J35j39n5J07n2k18
5095a45M1K21p9L5MK4J2k45J14j09J71N9j87q7K75J29j43L7j36O3J94m21M7q4
5119b10L40k08P3O9j1Jj01j5l5Kn3J64J34k33J92k45J86j01O0j31Q0K31n37K55
5143i3J27j95J73q4K06j15K0k1j97NL5J30R9k02L49k70L0K05j53j44L30j67j5
5166E3k01K6L47l29N0J68k09q3J88k36J78K4J54l95K49K5l35J91J29j16L4M7J5
5189b6L9J27j44l3L9l0l9N3l4K46j69J75k11Oj17q6R8L0J12r1k2R8N8l83K16Q2
5215fN2l9k14P6p5L15k47OM1O0N4j4J89j7j01J48l71NJ81m0k8Q2p7J50l42M18
5241B06m5Jk65L0j29J60J80q2O0j88J02p7J9j0M3p0Jl7L34J3k78j6j82R8K49m3
$$ plain form
5267 74 103 68 -9 -179 182 158 40 -52 -109 251 -37 -95 84 -165 -134 0 -123 177 -2 318 96 -35 -91
5290 -91 172 -111 72 -39 -266 -181 -23 48 -157 38 38 63 81 119 -142 140 0 -97 -229 -84 -64 59 -47
5313 -47 72 -62 88 -172 -249 102 -22 -2 158 62 111 -119 -12 132 167 -5 17 75 108 19 -195 -119 103 121
5337 121 52 189 -130 -1 -43 -128 116 200 -14 -43 23 -33 -256 97 98 -57 -51 -74 -199 3 -11 30 51 111 -143
5362 -143 93 -85 70 49 -65 86 -72 -135 -209 -21 48 -45 -99 -100 166 19 209 46 71 124 268 67 -215
5385 -215 -22 109 -19 -89 122 0 -34 142 0 -89 87 32 -112 152 118 115 -108 -36 -157 -215 120 0 -185
5408 -185 35 -31 267 -83 -111 270 -114 165 -197 -113 -138 -41 -106 182 32 -144 229 214 147 176 -206 187 0
5431 0 -334 142 257 129 -328 -152 -45 -354 283 -296 -38 93 109 -127 -191 -31 133 -19 -38 100 121 -18
$$ packed form
5267G4K9l5p7j70L61k4j18r2n7L60k88n8J79k49L1J34j23L00j79L20k22j31n6
5290i1K63k83J83j11k27Q5J58P1k05J95%K5J8L8k61K82j40r7j32J45K0J23j06
5313d7J19j34J50k60p7L51j24K0J60r6M9k30J07J44L5j72K2N8L3q9k14P6K22J8
5337A21o9J37l19J29m2q5K44Q4k14k9O6n6k23L53Jj55Ok3j25K02j4M1K1O0k54
5362a43K36j78J55k1j14J51j58o3p4J88O9r3n4jK66j47J90j63K5N3J44k01k82
5385b15J93J31j28p0K11j22l4J76j42q9J76n5j44K64l4lk23P2j21n8L35j20j85
5408a85K20o6K98l50k8L81l84K79l62Q4k5R7o5K88j50j76L73j5o7K9l82L93j87
5431@l34M76J15j28m57J76J07l09O37n79K58J31J6k36o4J60J64j52j9J38K1j39
$$ plain form
5453 -18 -9 103 223 71 -67 -23 -51 133 -92 193 165 -59 -113 -130 -232 63 -198 -25 17 -234 -86 63 79
5476 79 74 -38 -95 70 32 -166 -6 120 -65 69 179 -78 -36 109 18 26 54 -205 -159 -176 -138 -157 -58 -128 153
5501 153 -203 49 -19 228 -140 -75 -142 83 44 58 -137 -109 226 -80 -111 -36 -232 -115 -183 -9 131 -70 65
5524 65 -25 142 178 -52 135 83 -160 183 -131 -240 -163 7 273 -70 -128 -20 85 -231 -37 -66 -28 101 -1
5547 -1 -151 159 -8 192 -81 -8 -329 -67 -83 -361 -21 -126 73 -130 42 160 1 -39 242 -95 6 155
5569 155 -160 -67 -197 -268 -130 141 115 -40 -25 -234 -159 90 -118 -75 -360 186 194 -113 111 -125 -71 68 -66
5592 -66 -89 -5 93 -227 203 -54 -11 28 -57 129 -39 68 141 -55 20 146 17 96 -196 -24 118 164 105 317
5616 317 -11 1 21 219 -135 -211 35 63 23 85 -119 15 49 59 -88 -123 -111 160 255 -46 -99 5 -166 -35
$$ packed form
5453a8RJ12J20j52j38M4k8J84k25K85k8k24n4j7j02K95k61J73M2k51J48J49J6
5476G9nj12n7J65l8j98J60J26j85J34J10k57M2J45r1QK8k59M6j7L8j9R9p0K81
5501A53l56K52o8K47l68O5o7K25l9J4j95K8L35l06l1P5j96J17o8J74J40k01J35
5524F5r0J67L6k30J87n2k43L43l14j09P7J70K66l43n8J08J05l16J94k9L8J29j02
5547aj50L10j67K00k73P3l21K62j6k78L40j05J99k03J72J18j59m0K81l37J01J49
5569A55l15R3j30p1J38K71k6j55J5k09P5K49k08M3k85N46Ql07K24k36N4J39j34
5592f6k3Q4R8l20M30k57M3L9q5J86j68J07P3j96P5J26j29P9k92J72J42M6n9K12
5616C17l28J2K0J98l54p6K46K8m0O2k04J34L4J0j47l5J2K71R5l01n3J04j71J31
$$ plain form
5640 -35 -35 219 -74 30 120 11 -215 109 62 -232 53 83 -21 323 -314 34 230 -267 -16 75 -128 -177 22
5663 22 -56 -192 19 220 -306 209 -101 77 300 120 190 127 122 50 -347 -236 55 104 122 209 97 66 36 -19
5687 -19 27 -3 48 136 103 -179 62 158 -64 -72 68 79 18 12 -43 -11 269 -99 -52 128 16 33 13 16 0 -216 72
5714 72 207 -137 17 -102 209 209 92 -67 -66 231 -30 19 95 -170 90 87 -90 -50 15 -25 15 -19 -123 30 -205
5739 -205 25 -195 -110 -52 -92 -120 -133 -272 86 -323 -32 -104 64 62 -83 28 -152 -60 -64 6 -129 -225 78 140 -73
5764 -73 -100 -169 -75 172 -176 -47 -219 -112 -58 101 -287 -101 53 145 29 -26 179 -25 -89 -45 10 -73 -111 -4
5788 -4 10 -88 -95 289 -56 208 53 -154 32 -105 97 -10 272 -108 -4 247 102 -161 -222 -96 -161 -13 36
5811 36 160 -39 18 89 -45 208 9 -15 -301 -128 37 -178 11 136 61 125 76 -100 106 171 199 36 60
$$ packed form
5640c5%K54k93J04R0j09k26L24m7k94K85L0j04L44o37L48J96m97K51R1k03m9J99
5663B2p8j36K11K01n26N15l10J78K23j80P0o3np2l97J11K91M9J8Q7j12l1l0n5
5687a9M6l0N1Q8l3k82K41R6k22qJ40J1o1on5L2K80l68M7J80j12J7k0Lj6k16K88
5714G2J35l44J54j19L11%j17j59JK97k61M9P6k65K60lj77M0O5m0M0l4j04J53k35
5739b05K30k20Q5N8m0k8j3j39L58m09K91p2J68kj45J11j80R2mP0j35r6L03O2k13
5764g3k7o9R4K47l48J29j72J07N4J59l88J86J54R2j16n5K05k04o4M4N5q3l8J07
5788dJ4r8pL84l45K64j55k07J86j37K02j07K82l80J04K51j45k63o1J26o5J48M9
5811C6J24j99N7P1j34K53j99k4k86J73J65k15J89J25p5O4m9j76K06O5K8j63K4
$$ plain form
5834 60 11 65 18 25 -81 -9 22 16 -182 -65 -25 -122 -65 73 67 -186 29 2 -227 -125 84 231 -98 84 18 -191
5860 -191 111 -205 -122 -3 -74 -241 113 178 -167 -137 161 74 -161 83 13 218 -137 67 185 19 14 41 -93
5883 -93 44 -23 23 -199 -177 146 -124 93 -7 -64 -178 -172 -84 247 -220 -125 90 -56 363 86 16 -33 -71 58
5907 58 -75 -13 -21 174 7 -60 110 35 -158 -117 -50 141 -59 -215 25 -150 15 -204 95 -111 -102 31 -303
5930 -303 -49 97 -98 17 207 99 101 136 -38 -116 -85 38 -58 21 43 3 226 23 -76 -41 91 60 49 49 -222
5955 -222 -118 133 -147 -16 -147 56 88 187 86 239 -137 -242 64 301 -42 -62 -11 127 63 -302 -42 -23
5977 -23 188 4 162 -7 -106 -23 23 -70 130 196 -67 -2 71 -98 -145 -10 -70 134 6 -107 -51 -82 113 12
6001 12 156 17 154 -33 -68 -75 -174 89 -103 -116 57 69 -31 48 -143 -43 -37 65 -3 115 -179 35 -29 51
$$ packed form
5834F0m9N4m7Pj06P2L1oj98J17M0r7N7J38ok53K15k7k29J02K09J47l29J82o6k09
5860a91L02l16Q3J19p1j67L54O5l45L0K98q7k35K44p0K05l55K04J18j66nK7j34
5883i3J37o7M6k22K2L23k70K17j00n7j14OQ8L31m67R5K15j46M19k77p0m9l8J29
5907E8j33O2qJ95j67o7J70p5j93M1O7J91k00j56K40j75J65k19K99k06RJ33l34
5930c03K54J46j95J15J90j08KL5j74p8L1J23r6P9K2m0K23k03r9L5J32l1j1%k71
5955b22J04K51k80J31j31K03L2R9j01J53l76j05L06K37l43k0N1J38o4l65K60J9
5977b3K11j84J58j69r9Q3M6r3K00O6k63O5P3j69m7J35o0K04j28j13N6l1J95j01
6001A2J44j39J37j87l5pr9K63j92j3J73J2j00P9j91J00OJ02o8J18k94K14o4Q0
$$ plain form
6025 51 161 -193 44 -37 -147 45 -114 -93 -28 -71 169 2 -202 37 -55 58 -140 28 -54 96 70 158 177
6048 177 12 64 131 135 -151 -164 -165 76 205 -291 48 -186 -16 145 -146 12 -90 61 -37 77 -108 52 -73
6071 -73 -103 266 21 46 18 65 -43 -42 -13 -25 91 114 33 -11 -31 11 15 -54 -204 377 -52 -9 81 119 148 227 50
6098 50 -135 -133 79 -135 -104 -65 -356 153 268 -118 -109 179 265 -106 80 43 31 -80 85 -177 25 300 -45
6121 -45 -73 8 42 -103 -26 111 142 -30 -64 -102 -72 -24 151 97 -215 167 117 -18 77 250 -249 -73 -201 -22
6145 -22 -12 120 141 139 61 -231 -116 6 9 11 -75 48 53 1 -79 -111 11 -260 -88 -157 -116 33 -2 -33 -10 -74 -135 200
6173 200 135 5 -35 -158 104 -59 -68 -201 -16 142 91 -26 109 160 -66 252 38 176 -247 41 -12 77 1
6196 1 -57 -128 33 -60 -58 -185 -117 -17 82 132 -101 98 96 4 84 -50 80 137 -104 -35 -216 30 -18 -40 -278 -45
$$ packed form
6025E1J10l54K37q1j10J92j59K1O5m3K40j67k04K39r2J13j98J68q2J50k6Q8J9
6048A77j65N2O7Mk86j3jK41J29m96L39k34J70J61k91J58j02J51r8J14j85J60j25
6071g3l0L69k45K5k8M7j08JK9j2J16K3q1m4k0M2Mo9j50N81m29M3R0L8K9P9j77
6098E0j85KK12k14L1L9k91N09J15l86RK88Q6l71J86l7j2j11J65k62K02K75l45
6121d5k8Q1L4j45P7J37L1j72l4l8L0M8J75n4l12L82n0j35R5J73m99J76j28J79
6145b2J0J32K1kp8k92J15J22LKq6J23Nn2q0l2J22k71J72o9M1J49l5l1K3o4o1L35
6173B00o5j30m0j23K62j63rj33J85J58n1j17J35N1k26L18k14J38m23K88n3Q9p6
6196An8p1J61r3Kj27O8J00R9N0k33J99kr2Q0j34J30N7k41O9j81K46m8k2k38K33
$$ plain form
6222 -45 53 -97 124 99 -48 -7 -85 -40 -97 85 -43 146 -94 -153 186 -124 -100 -32 141 41 -38 -48 206 -72
6246 -72 -120 -49 -45 -38 -102 59 -1 -167 45 -202 -68 63 134 137 -170 -48 213 -32 -73 124 50 86 -159 -21 -97
6271 -97 -173 91 17 -137 61 -85 73 -71 5 46 -74 119 170 -178 -46 191 -73 -42 -33 32 50 168 -18 -10
6295 -10 -25 4 -64 76 -31 -54 208 -83 15 -38 -140 -118 157 -17 72 86 125 -9 92 73 -223 -36 -59 45
6319 45 -85 52 -49 -136 -85 -5 58 -2 -101 89 241 -99 -8 133 334 -156 165 -121 53 156 111 -302 45
6342 45 252 -23 -232 -38 -131 -98 -145 35 -208 7 -232 103 13 71 -215 138 -177 -185 77 -120 7 87 61
6365 61 -6 -176 64 -68 -17 -78 -144 -90 -8 117 -104 -77 -22 256 17 226 -79 12 110 -110 165 32 -51 17
6389 17 98 80 -140 59 257 147 -105 101 146 119 -116 133 146 -183 92 103 17 49 66 -48 63 225 -180
$$ packed form
6222d5R8j50K21k5j47M1p8M5n7J82j28J89k40n9L39l10K4O8J73j00p9j0K54k78
6246g2m8P1MPo4J61o0j66K12k47J34J31P1Ll07J22K61k45m1J97p4L6k45J38p6
6271i7p6K64p4j54J98j46J58j44P6M1j20J93N1l48J32K37k64L1RO5J8J18j86Q
6295a0j5K9o8J40j07k3K62k91R8n3j02K2K75j74Q9J4L9j34J01j9k96J87k3J04
6319D5j30J37j01q7N1Q0O3o0r9J90J52l40R1J41K01m90L21k86J74J03m5m13L47
6342D5K07k75k09J94r3L3m7J80k43K15k39L35r0N8k86L53l15qK62j97J27Q0k6
6365F1o7j70K40j32N1o1o6N4Q2J25k21K7N5K78k39K09l05R1R8k20K75j33q3O8
6389A7Q1j8k20J99J98j10k52K06M5k7k35K49J3l29K75J1q6L2J7j14J11J62m05
$$ plain form
6412 -180 158 106 -111 -144 181 -28 -65 4 -27 -87 -304 100 98 -168 -65 188 -30 -19 103 -347 25 186 -84
6435 -84 -81 -46 174 -190 50 -99 97 126 -58 -41 168 2 -82 143 81 43 88 40 24 9 41 -74 -30 -119 -32 16
6461 16 -183 105 182 -25 95 268 85 143 -46 98 -133 10 78 44 94 -177 -303 97 75 -350 -72 139
6483 139 41 156 117 195 -32 61 -44 136 -257 71 -146 23 66 117 192 83 -11 -15 6 -127 79 -89 -39 -20
6507 -20 109 -224 -217 79 121 133 -119 43 -97 -50 48 -105 -18 -30 146 -105 140 -425 128 -6 270 -142 -10
6530 -10 -153 -61 -208 46 81 -138 122 -88 77 106 47 110 -88 -91 216 -15 -21 -89 135 -81 34 -118 -83 177
6554 177 -106 37 54 112 -28 94 -258 -67 -123 -4 239 8 55 39 164 -27 -79 31 30 -30 -93 182 56
6577 56 147 76 -136 -111 -165 73 -41 203 108 -100 -58 -67 35 123 -210 102 -112 -9 37 -111 -30 8 54 -176 -182
$$ packed form
6412a80L38n2k17l3L25k09l7O9l1o0k17M04kk66J03K53k18J1J22m50L72J61k70
6435h4LL5K20l64K40j49J96K9j84J7K09j66q4K25o2l8M5m8j6j5L2j15M4q9Q7M8
6461A6j99K88P7k07J20J73j83N8j89J44k31J43O8l4N0k71j26M00k2m25K78K11
6483A39r8J15l9P8k27R3j05J80l93L28k17J69M3N1P5j09r4mK1j33K06j68N0J9
6507b0J29l33PK96M2J2k52J62j40M7R8j53Q7j2J76k51K45n65N53j34K76m12J32
6530a0j43R2j47K54L5k19K60k10J65K9n9O3j98lL07k31oo8K24k16J15j52L5K60
6554A77k83J43J7N8j40J22l52J91n6J19K43k31M7j6J25j91n2J10jo0o3K75j26
6577E6R1p1k12K5n4K38j14K44r5k08M2rJ02Q8l33L12k14J03M6j48Q1L8M6k30o
$$ plain form
6602 -182 -85 178 210 148 -249 -97 -68 117 51 -40 34 54 -26 -138 138 -14 -70 -33 -13 127 9 48 -44 93 -113
6627 -113 43 30 51 54 66 -207 -124 169 228 -34 15 -45 43 62 -140 -128 -100 -122 60 -113 -117 187 40 141 7
6652 7 -22 62 -98 136 -116 -131 146 -157 7 38 4 -171 49 -163 -66 -72 65 307 -158 -139 34 102 -74 151
6676 151 170 62 -69 -41 -225 60 94 266 163 -105 -56 -69 116 295 129 14 180 34 192 92 161 -296
6698 -296 32 -60 123 -64 12 -207 -293 45 -125 125 183 8 -34 -26 188 229 121 -141 0 59 214 47 13
6721 13 -39 -14 -4 -72 85 -171 55 58 -59 183 -143 34 -235 -89 -49 39 -3 293 181 -12 -290 141 -11
6744 -11 -125 -149 -72 -58 -81 -31 -200 -68 100 22 -267 -46 -110 46 60 105 18 -135 20 -64 -143 85 130 -52 -116
6769 -116 173 -183 -99 -113 161 24 33 5 35 85 -43 20 -2 -248 89 75 -153 -192 273 60 -14 -168 -37 131
$$ packed form
6602a82R7K63L2o2l97J52K9J85o6r1P4K0q0j12K76j52n6L7K0J40j18L9r2J37k06
6627a13J56j3K1LJ2k73Q3K93N9k62M9o0Q8J9k02J2K8k2J82j73mL04j47J01j34
6652Gk9Q4j60K34k52j5K77l03J64L1l4j75K20k12R7oJ37K42m65J9J73O8j76K25
6676A51J9j08j31K8j84K85L4J72j03k68M9j3J85J79j66j15J66j46J58j00O9m57
6698b96L28r2J83j87P6k19q6L38j70K50N8j75m2QK14M1j08k62J41N9J55j67l4
6721A3n2K5J0o8J57k56K26Lj17K42l26J77k69J46M0Q8m2K96j12j93k78M31j52
6744a1j14k4P7J4k3N0j69J32J68p8k89K21o4J56J4M5q7j53J55q4p9K28M5j82o4
6769a16K89l56Q4j4K74j37Rk8L0N0j28O3k2k46L37j4k28l9M65k13p4j54J31J68
$$ plain form
6793 131 -31 -43 -41 340 -192 73 172 -86 100 -298 -115 203 -30 -6 16 -101 -270 87 -8 -126 -45 -138 -59
6816 -59 19 180 91 -59 -18 114 -19 -207 -11 -86 -258 -16 -80 -146 -12 -268 19 3 -12 -124 -129 93 -53 -298
6840 -298 77 38 -292 -88 -107 -76 24 73 -112 198 135 119 -126 -211 116 175 50 -91 58 165 4 14 -167
6863 -167 -279 39 -206 127 40 -49 -106 -65 9 -202 39 68 -27 179 -62 -40 38 115 62 -73 -99 202 -97 -88 22
6888 22 208 -7 -91 235 147 -38 291 105 243 -15 -9 102 -30 272 30 -199 -90 221 -188 -51 -53 -110 -62
6911 -62 60 -161 167 67 -208 -10 -44 -115 -107 127 149 59 129 68 -7 -49 -91 15 177 -53 111 97 -218 192
6935 192 -117 166 106 -35 69 -124 -191 193 -30 21 192 -46 237 -10 -255 38 46 -325 34 -202 71 126
6957 126 182 226 297 207 122 101 -136 -132 -254 -57 -27 91 50 -96 0 46 -189 72 -112 6 112 33 -51 88 -76
$$ packed form
6793A31j62j2KL81n32K65R9k58J86l98J83L18k33K4K2j17j69L57r5j18Q1r3P9
6816e9P8J61q9j50M1J32j33j88J96p5j72K42o4o6J34k56K87j6j5j12nK22j46k45
6840b98L75l9l30K04j9L1J00M9j85L10o3j6k45q5L27N9j25j41J49J07j61J0j81
6863a67j12L18k45L33q7q9n7M1P4k11K41K9r5K06k41K2P8P7n3j35k6L01k99RJ10
6888B2J86k15q4L26q8j85L29j86J38k58OJ11j32L02k42k29J09L11m09J37kn7M8
6911f2J22k21L28j00k75J98l4p1QK34K2r0P0o1p5m2m2J06J62k30J64j4l15M10
6935A92l09K83o0j41J04j93o7L84k23N1J71k38K83k47k45K93Ql71L59k36K73N5
6957A26N6M4P1r0q5k1k37Mj22J97L0J18m1j46R6M6k35K61j84J18J06p9q4J39j64
$$ plain form
6982 -76 32 -75 -28 -47 68 156 -117 -111 122 -105 -162 163 -303 -49 171 56 6 43 -353 274 -76 -40 54 72
7006 72 -35 122 -301 214 -44 18 -89 -284 66 -47 196 88 -24 148 -184 133 -45 -98 70 -95 15
7027 15 -165 52 -266 -2 233 -54 -54 66 69 -163 -116 -45 180 -82 -81 229 37 206 95 7 233 272 94 -97
7051 -97 265 55 -49 -50 190 131 -29 127 -154 -29 201 184 -43 -47 14 97 -142 -87 216 52 -73 -259 140
7074 140 -235 -128 214 8 108 39 -43 -286 158 0 26 -215 86 -3 291 8 -155 9 -50 -68 -25 149
7096 149 22 -50 -73 64 -264 -68 -129 -45 -216 -111 -41 208 16 -181 88 184 -72 126 -87 61 70 -310 51
7119 51 -12 -64 217 253 142 -52 -46 -76 -66 -153 -124 -178 103 -31 -28 61 115 -44 40 -41 -95 -159 103 -122 97 -198
7145 -198 92 40 -86 -130 39 2 156 -41 21 -63 237 308 -186 -31 13 192 58 95 131 134 -85 9 -12 -170
$$ packed form
6982g6J08j07M7j9J15Q8k73OK33k27n7L25m66K54K20j15n0L7l96O27l50L6R4J8
7006G2j07J57m23N15k58O2j07j95L50j13K43j08j12J72l32L17j78n3J68j65J10
7027A5j80K17l18K64K35k87%J20Lk32M7P1K25k62JL10j92J69j11q8K26L9j78j91
7051i7L62k10j04jK40n9j60J56k81J25K30j7k27mO1Q3k39N5L03j64j25j86L99
7074A40l75J07L42k06J00o9q2k43M44j58K6k41L01q9K94k83j63J64n9j8M3J74
7096A49j27p2k3J37l28J96o1Q4j71J05P0K49j92j97K69R6k56J98k13J48Rl80L61
7119E1o3n2K81L6j11j94Ol0J0q7K9n4K81j34LQ9N4j59Q4q1n4o4K62k25K19k95
7145a98K90n2j26m4J69l7J54j97O2q4L00P1m94J55M4J79j34L7L6Lk19R4k1j58
$$ plain form
7169 -170 70 105 93 69 13 -127 -29 -36 -113 48 -167 -70 107 -106 -77 161 72 -127 42 38 53 -68 -188 -135 -12
7194 -12 80 -145 -170 108 57 -104 -5 117 150 -19 -151 -191 -43 -3 44 -107 -200 -252 215 -29 -5 -276 -390 75
7218 75 -180 -194 95 -121 -84 -216 6 -9 -111 -175 81 -58 -55 -220 -114 31 -11 22 14 -68 -3 200 -7 34 179
7243 179 -50 60 -28 45 325 -146 -213 -96 -197 -39 28 -136 60 61 -145 66 114 136 129 -56 -18 45 196 132
7267 132 15 -64 -157 -51 130 -109 37 175 39 -266 26 -192 268 54 -146 -44 33 41 -30 -4 -114 -14
7289 -14 -95 20 -39 -21 95 83 -258 114 12 36 -124 -249 31 -20 -113 -51 -23 -28 115 101 -24 154 32 -39 -66
7314 -66 50 21 79 249 1 -88 -136 -15 -118 -11 -183 -22 -51 10 -71 -170 -23 142 -41 -76 174 71 -134
7337 -134 -75 56 19 -149 -47 75 -29 -95 -99 26 31 -348 141 -65 -525 68 51 170 89 407 -94 190 -17
$$ packed form
7169a70K40L5j2k4n6j40R8pp7J61k15R7J77k13K9K38q9j99J69mJ5j21j20N3J23
7194a2R2k25k5K78n1j61R9J22L3j69j32m0J48M0M7j51r3n2M67k44K4k71j14M65
7218G5k55j4K89k16L7j32K22j5j02o4K56j39Lj65J06J45m2L3qq2O5K03k07M1J45
7243A79k29J10q8P3K80m71o7J17j01J58O7j64J96Jk06K11M8K2pj85L8O3J51o4
7267A32j17p9r3J06J81k39J46J38j36l05K92k18M60k14k00J02P7Qp1K6j10J00
7289a4q1J15n9J8J16j2l41L72j02K4j60j25K80n1r3O2K8nJ43j4j25J78j22p1k7
7314f6J16k9N8J70k48q9m8J21j03J07j72J61k9O1q1r9J47J65j83l5K50j03k05
7337a34N9J31l7j68J02J22j04o6mJ25Nl79M89k06m60N93j7J19q1L18n01K84k07
$$ plain form
7360 -17 -142 219 13 124 206 163 197 -135 -48 -21 116 93 91 -5 19 -43 -214 3 -94 -77 131 76 -351 124 158
7385 158 -81 27 -312 -110 47 89 -47 27 -92 -76 -111 -112 64 8 -178 -25 -188 141 -41 -205 -93 -143 -63
7408 -63 -35 86 -31 20 -186 -25 53 -185 -46 -215 167 33 167 -58 -151 111 98 77 -17 -77 -29 -46 -146 35
7432 35 -140 175 -176 212 -16 78 128 -26 -54 -52 25 118 -287 44 -100 156 -59 -2 -190 42 -50 76 164 -59
7456 -59 69 -5 83 -202 178 74 96 -100 -93 345 251 231 69 -120 119 186 41 87 -109 -17 78 20 -114 -93 -163
7481 -163 -36 45 -131 -245 13 180 158 99 126 70 -41 6 -127 -160 13 49 3 119 60 119 37 80 223 -30
7505 -30 79 -81 248 -141 86 -107 53 -11 129 -69 0 -223 -201 -16 -57 -158 -73 230 -80 44 72 55 31
7528 31 -165 -130 -102 172 -376 -210 -48 290 -242 22 -160 -6 -66 159 105 43 -12 -48 158 -135 -37 -189 9
$$ packed form
7360a7j25L61k06J11Q2m3L4l32Q7K7J37k3kr6K4o2j71K17r7J7K08n5m27M75L4
7385A58k39J08l39K02J57M2j36P4j19J6l5jJ76n6j86J53j63L29j82j64J12n0Q0
7408f3K8J21j17N1k06J61P8k38J39j69L82j34J34k25r3K62j3k1r4o0M8j7j00J81
7432C5j75L15l51L88k28R4N0j54k8KP7R3m05L31j44K56k15N7j88K32r2J26Q8k23
7456e9J28p4Q8k85L80j04K2j96PM38r4k0j62j89K39O7j45M6j96R2R5n8j34K1p0
7481a63J27Q1j76j14K58J67k2n9K7n6j11M7j33l3J73L6m6J16n9N9q2M3J43k53
7505c0J09j60L29l89K27j93J60o4J40j98O9k23K2J85m1j01Q5L03l10J24K8j7k4
7528C1j96L5K8K74n48J66J62L38n32K64j82J54o0K25n4o2n5l6K06k93R8j52J98
$$ plain form
7551 9 -151 -67 55 87 76 40 -79 -16 41 -100 23 68 111 292 -117 -208 -164 134 -153 -85 24 -81 65 -23 -80
7576 -80 -171 10 84 167 71 -85 125 -73 71 16 -144 -128 131 30 -297 -128 85 113 44 -154 -120 -190 109 -231
7600 -231 -31 -176 17 -132 -232 105 -205 -185 12 -7 -145 -172 91 -99 -63 187 -79 -46 40 -46 35 -92 4
7623 4 -163 -7 134 224 20 -55 29 -97 -134 43 57 -108 116 -243 129 67 -160 -60 -115 34 -74 -168 -131 -32
7647 -32 -254 -91 29 -207 38 5 -37 59 104 -149 115 124 -132 -24 -185 -61 122 -19 -15 -43 24 -81 -198 65
7671 65 40 -60 -89 -59 -138 25 -181 66 -116 115 -21 1 85 -52 11 -10 11 39 94 -72 54 105 114 -236 6
7696 6 -68 100 56 -34 -34 68 -117 168 133 103 -31 176 165 -165 127 -69 24 -201 -139 -9 -185 166 -61 212
7720 212 -21 -186 64 -6 -21 35 100 -52 -4 92 119 -108 34 208 101 -287 24 69 86 27 -197 56 -116
$$ packed form
7551Ij60Q4J22L2j1l6j19O3N7j41J23M5M3J81m09r1M4K98k87O8J09j05J46q8n7
7576h0r1J81P4Q3r6j56K10j98J44n5j60J6K59j01l27J69K13K8o9j98L4p0K99l40
7600b31K00j45J93j49j00L37l10K0J97j9j38k7K63j90L6K50k66L3Q6q6Q1j27R6
7623Dj67J56J41R0k04p5Q4j26l7J77J4j65K24l59L72o2k27J00n5J49j08r4L7R9
7647c2k22J63J20k36K45l3m2R6M5k53K64Rk56J08j61J24J83j41Mk8O7j05j17K63
7671F5k5j00k9L0p9J63k06K47j82K31j36K2Q4j37O3k1K1K8N5j66J26N1Rl50K42
7696Fp4J68m4r0%J02j85K85l5l0j34K07j1l30K92j96R3k25O2J30j76L51k27K73
7720B12k33j65K50p0j5N6O5j52M8R6K7k27J42J74j07l88L11M5J7n9k24K53j72
$$ plain form
7743 -116 -195 91 -115 -123 196 -353 247 91 343 3 12 1 -19 -97 209 5 -58 -19 -44 159 49 218 11 -178
7767 -178 34 -313 90 134 11 75 119 175 176 -68 31 365 11 154 40 140 45 -199 38 163 42 -24 12
7790 12 54 152 194 103 -2 38 -50 -22 46 122 -193 -61 20 109 158 106 74 -71 115 7 -99 -170 22 61 69 -128
7816 -128 15 -13 37 -239 -131 -73 86 -158 58 257 48 -125 45 -150 -106 219 -15 133 136 79 -31 -126 139
7839 139 86 -69 -91 188 108 139 -38 315 -240 173 63 24 -240 101 -57 24 -168 12 57 -97 -30 -30 -16 -164
7863 -164 -110 27 222 -147 -45 -128 -110 -172 117 -84 -164 45 -159 -150 53 -11 81 126 -88 77 15 -38 87 -264
7887 -264 28 282 235 -274 -69 -120 -100 26 4 27 -38 -220 -47 136 87 -19 76 23 -125 52 21 -90 171
7910 171 -336 92 2 46 -21 236 -9 -179 71 19 207 -171 33 -109 -185 19 -228 91 -271 180 -19 73
$$ packed form
7743a16p9K86k06qL19n49O00j56K52l40Rj1k0p8L06k04o3L9k5K03j10J69k07j89
7767a78K12l47M03M4j23O4M4N6Jk44R9L34l54J43j14J00r5k44K37J25j21o6L6
7790A2M2R8M2r1j05M0q8K8O8P6l15J32Q1Q9M9n2l2j45J86j08j06p1J92L9Qj97
7816a28J43k8N0k76J08N8J59k44K16J99k09j73J70j95M4L25k34J48Ln7j10r5K65
7839A39n3j55k2K79q0L1j77L53n55M13j10l9k64L41j58Q1j92J80M5j54O7%J4j48
7863a64N4J37J95l69J02q3J8o2K89k01q0K09k04RK03o4R2M5k14J65o2n3J25l51
7887b64K92K54m7n09K05n1K0J26k2K3o5j82J73J83m9j06R5n3j48J77l1j11K61
7910A71n07M28r0M4o7K57k45j70K50n2J88l78K04j42p6K04k47L19l62M51j99R2
$$ plain form
7932 73 33 7 130 -59 110 -186 81 -135 205 -154 -28 94 -140 189 -7 -9 -197 -113 62 18 152 -179
7954 -179 -11 -39 66 239 5 2 15 -3 -14 -23 -72 104 -56 170 -19 13 12 -120 0 -123 -13 -40 -187 223
7978 223 -29 -2 -55 -17 67 -3 88 196 426 -127 -135 -42 49 -30 -51 -219 -213 -70 127 -97 -20 -149 -140 91 -106 90
8004 90 -112 -53 -149 -30 58 36 -193 -81 -110 16 -48 82 62 -51 56 -71 -9 45 -40 28 -163 259 22 -51
8028 -51 35 -225 71 -37 46 173 -14 -81 31 48 80 171 -37 55 195 62 -286 -39 -29 123 89 -2 -120 35
8052 35 -150 -112 11 -49 44 -21 114 134 206 18 -73 -164 -48 -100 161 78 73 -39 -117 -96 -37 96 -97 52 69 -60
8078 -60 150 -276 -71 85 -121 -129 -61 -29 30 260 61 -82 -89 237 -60 128 111 -117 51 32 81 129 73 -63
8102 -63 11 -3 -179 -62 -84 -131 248 -183 -72 -44 69 114 -62 165 199 119 192 -51 -38 -40 34 -180 -70 -87 -15
$$ packed form
7932G3m0k6J23j89J69k96K67k16L40l59J26J22k34L29j96kj88Q4J75m4J34l31
7954a79J68k8J05J73k34lJ3j8j1rm9J76j60K26j89L2jj32J20j23J10k7j47M10
7978B23k52K7n3L8Q4p0R1J08K30n53qR3R1p9k1j68OJ43J97k24P7j29RK31j97J96
8004I0k02N9r6J19Q8k2k29J12k9J26o4J30k0j13J07j27O2N4q5O8j91M22k37p3
8028e1Q6k60K96j08Q3J27j87o7J12J7L2R1k08R2J40j33l48K47J0J52l4r1j18J55
8052C5j85L8J23o0R3o5J35K0P2j88r1r1J16n2K61q3nj12p8K1N9J33j93J49J7j29
8078f0K10m26K05J56k06qO8L2N9K30j99j43pL26k97J88j7k28J68j9M9M8n6j36
8102f3P4j4j76J17k2m7L79m31J11K8J13M5j76K27L4q0P3k43J3kP4k14J10j7P2
$$ plain form
8127 -15 -65 172 -69 122 -124 -11 -81 -213 234 -146 -125 45 -36 -66 10 26 171 -44 -93 -62 -34 -8 -101 21
8151 21 11 -166 52 -27 -25 -28 -42 36 -102 129 -6 53 162 165 89 39 -43 -12 -47 -50 -257 239 -108 79 86 -93 21
8178 21 79 223 187 116 100 -5 135 -1 70 -273 -35 99 20
$$ packed form
8127a5n0K37k41J91k46J13p0j32M47l80K1J70q1l0P6J6J45k15m9L1K8K6r3J22
8151B1j0j77K18p9Klj4P8j38K31j35N9J09Lp6n0q2L1l5lk07M96l47J87Pj79J14
8178B1N8J44l6p1j6j05J40j36P1l43K38J34p9
8191B0
$$ Imaginary data points
##PAGE= N=2
##DATA TABLE= (X++(I..I)), XYDATA
$$ plain form
0 0 0 0 0 0 0 0 0 0 0 0 -8 8 -8 16 -16 17 -24 32 -40 48 -56 64 -74 88 -104 121 -143 162 -186 216 -244 281
32 281 -316 359 -403 454 -512 573 -639 711 -791 879 -975 1080 -1193 1318 -1455 1602 -1765
49 -1765 1946 -2144 2361 -2603 2873 -3174 3517 -3907 4357 -4878 5498 -6245 7163 -8327
63 -8327 9852 -11950 15017 -19924 29006 -51196 214457 130182 -363297 200533 120693 -267472
75 -267472 121074 218816 -212918 -37352 136033 -37834 -25429 66023 13215 -40754 -72098
86 -72098 100660 97463 -164905 1858 166307 -181773 -37360 264695 -158415 -183218 266221
97 266221 -46730 -212455 227311 24164 -259656 128423 114523 -176603 28746 90892
107 90892 -112005 -23493 77014 -1795 -46598 -27012 46440 11101 -82687 59440 66134 -151373
$$ packed form
0@%%%%%%%%%%qJ6j6K4l2L3m1N6p2Q8j04J20j38J62j92K25k64L05l48M02m60N25
32B81n97O75p62Q57r66J085j212J350j502J670j854K055k273K511k773L057l367
49a765L711m090M505m964N476o047O691p424Q264r235J0376j1743J3408j5490
63h327J8179k1802K6967l4941M8930q0202K65653q4275m93479N63830p9840l88165
75b67472L88546R7742m31734J75566J73385j73867J2405R1452n2808n3969l1344
86g2098J72758l197k62368J66763J64449l48080J44413L02055m23110k4803M49439
97B66221l12951j65725M39766k03147k83820L88079j3900k91126K05349O2146
107I0892k02897Q8512J00507p8809m4803J9586P3452l5339r3788J42127O694k17507
$$ plain form
119 -151373 15484 151373 -129339 -46630 168605 -100063 -97657 180696 -23520 -134811
129 -134811 116834 26454 -116697 68055 59554 -84511 1857 51320 -17269 -12159 18489
140 18489 18869 -19027 -25402 54506 16425 -72126 37927 50060 -86597 21523 87123 -87000
152 -87000 -19773 101322 -55373 -40273 93565 -30047 -61396 67116 5977 -50434 30190
163 30190 14142 -31211 5649 18249 1022 -13249 -4823 25213 -9221 -27422 38914 1252
175 1252 -56228 37492 28679 -65587 22159 46585 -65910 2985 62032 -51340 -19440 55894
187 55894 -32877 -29349 43680 -13096 -29752 20495 -455 -12717 3192 -731 5139 -10285 -11239
200 -11239 26434 -10519 -32091 35776 -128 -47816 38631 18240 -57459 27211 35835 -52659
$$ packed form
119a51373J66857J35889k80712Q2709K15235k68668K406K78353k04216j11291
129a34811K51645r0380j43151J84752q501j44065Q6368M9463o8589N110L0648
140A8489L80l7896o375P9908l8081q8551J10053J2133j36657J08120O5600j74123
152h7000O7227J21095j56695J5100J33838j23612l1349J28512o1139n6411Q0624
163C0190j6048m5353L6860J2600j7227j4271Q426L0036l4434j8201O6336l7662
175A252n7480R3720q813r4266Q7746K4426j12495O8895N9047j13372L1900P5334
187E5894q8771L528P3029n6776j6656N0247k0950j2262J5909l923N870j5424r54
200a1239L7673l6953k1572O7867l5904m7688Q6447k0391p5699Q4670Q624q8494
$$ plain form
212 -52659 11946 44030 -41952 -6236 41757 -22669 -14058 28907 -7203 -11066 13577 3178
224 3178 1667 -1623 -194 17231 -7853 -11216 29695 -7062 -26766 35603 4062 -37274 32288
237 32288 15702 -41394 23033 25025 -36751 9522 25086 -27054 -482 19704 -14521 -4255
249 -4255 9010 -4927 242 -2009 -1409 7392 -9974 -4971 15459 -13004 -12596 20776 -9968 -19914
263 -19914 22173 -2879 -24477 18788 4461 -24098 12239 8156 -20624 5435 8367 -14098
275 -14098 1565 5161 -7397 1323 689 -2124 4432 -4425 -1043 8322 -7271 -2685 11790 -8523
289 -8523 -5202 13772 -5967 -6944 14542 -2421 -7894 12464 550 -7662 8248 2072 -5550 4887
303 4887 2744 -3013 2521 2120 193 2259 359 1635 2649 -1801 1514 4008 -3602 -292 5402
$$ packed form
212e2659O4605L2084q5982L5716M7993o4426Q611M2965l6110l863K4643j0399
224C178j511l290J429J7425k5084l363M0911l6757j9704O2369l1541m1336O9562
237C2288j6586n7096O4427J992o1776M6273J5564n2140K6572K0186l4225J0266
249d255J3265j3937N169k251O00Q801j7366N003K0430k8463M08L3372l0744r946
263a9914M2087k5052k1598M3265j4327k8559L6337m083k8780K6059K932k2465
275a4098J5663L596j2558Q720o34k813O556q857L382R365j5593M586J4475k0313
289h523L321J8974j9739r77K1486j6963n473K0358j1914q212J5910o176p622J0437
303D887k143n757N534m01j927K066j900J276J014m450L315K494p610L310N694
$$ plain form
318 5402 -3785 -1751 6231 -2964 -3209 6253 -1415 -4037 4112 -96 -3493 1713 -249 -2526 -270
333 -270 -259 -445 -1023 -1324 825 -755 -2444 561 76 -3025 -938 1001 -2907 -2593 1744 -1209 -3573
350 -3573 1743 534 -3994 782 1783 -3250 -680 1965 -1861 -1455 1231 -503 -1194 -81 969 237
366 237 -1220 1164 1880 -2064 139 3213 -1844 -1713 4057 -311 -2764 3798 1874 -3240 2537 3261
382 3261 -2369 845 3650 -1251 -759 3242 377 -1356 2216 1584 -434 440 1783 729 -1067 968
398 968 2302 -1992 -333 3355 -1388 -1950 3674 -848 -3497 3593 475 -3803 2116 1733 -3559 -21
414 -21 2181 -2406 -2263 2048 -354 -3792 768 1784 -4149 -858 3155 -3028 -3088 2946 -994 -4534
430 -4534 1453 1053 -4156 -654 2583 -2445 -2621 2513 539 -3576 370 3261 -2576 -2432 4029 -160
$$ packed form
318E402r187K034P982r195k45R462p668k622Q149m208l397N206j962k277K256
333b70J1j86n78l01K149j580j689L005m85l101K087J939l908L14M337k953k364
350c573N316j209m528M776J001n033K570K645l826M06K686j734o91J113J050p32
366B37j457K384P16l944K203L074n057J31N770m368k453O562j924n114N777P24
382C261n630L214K805m901M92M001k865j733L572o32k018Q74J343j054j796K035
398I68J334m294J659L688m743n62N624m522k649P090l118m278N919l83n292L538
414b1K202m587J43M311k402l438M560J016n933L291M013o183o0O034l940l540
430d534N987m00n209L502L237n028j76N134j974m115L946K891n837J44O461m189
$$ plain form
446 -160 -4870 3579 3480 -6033 1256 6975 -5039 -2176 8317 -2123 -4920 7505 1233 -5829 4877
461 4877 3486 -4259 1034 3959 -854 -1345 1916 2767 -1389 -2079 4918 1087 -6119 4432 5264 -8066
477 -8066 1104 8890 -7374 -3636 10332 -3529 -7691 8709 962 -9471 4857 4453 -7727 308
491 308 5004 -4142 -2447 2782 114 -2617 -1157 2556 3 -5054 2053 4306 -7381 -834 8410
506 8410 -6238 -5406 9942 -2515 -8935 8510 2105 -10492 4525 6208 -8879 126 7068 -5010
520 -5010 -3131 5789 -1075 -3421 2243 1569 -1366 -1621 1441 2274 -3604 -1136 5543 -2815 -4929 7605
536 7605 -69 -8156 6910 3608 -9503 3976 6807 -8076 502 8139 -5512 -2089 6995 -1980
550 -1980 -2892 4444 169 -2264 1745 832 -34 -197 -120 2238 -461 -1828 3766 446 -4130 3667 2430
$$ packed form
446a60m710Q449r9r513P289N719j2014K863J0493j0440k797J2425o272p062J0706
461D877j391p745N293K925m813m91L261Q51m156o90O997l831p206J0551Q32j3330
477h066R170P786j6264L738J3968j3861m162J6400p747j0433J4328m04j2180Q035
491C08M696r146J695N229k668k731J460L713k553n057P107K253j1687O547R244
506H410j4648Q32J5348j2457o420J7445o405j2597J5017J683j5087R005O942j2078
520e010J879Q920o864k346N664o74k935k55L062Q33n878K468O679q358k114J2534
536G605p674q087J5066l302j3111J3479K831j4883Q578P637j3651L423R084q975
550a980r12P336m275k433M009r13q66j63P7K358k699j367N594l320m576P797j237
$$ plain form
567 2430 -5694 2746 3947 -5721 1275 4950 -5205 -453 4885 -3964 -1557 3959 -2760 -1913 2701
582 2701 -1368 -1900 942 -817 -996 136 -1237 -51 -878 -1349 1030 -1157 -2147 1908 -819 -2757
598 -2757 2308 -428 -3453 1940 1025 -3751 1645 2025 -3455 504 2465 -2342 -411 2424 -720 -1066
614 -1066 1776 878 -707 147 1873 532 -1560 1534 2184 -2641 1026 4027 -2576 -706 4815 -1402
630 -1402 -2235 4382 487 -2772 2677 1928 -2426 796 2125 -952 -747 1424 892 -1389 -106 1833
646 1833 -945 -2017 2185 234 -3422 1340 2151 -3829 -467 3241 -2602 -2150 3251 -1585 -3145 2497
662 2497 -102 -3281 1001 814 -2181 -642 805 -461 -1349 -239 669 -1046 -1517 1824 -130 -2395
678 -2395 1638 851 -2646 525 2128 -2352 -706 2639 -893 -1566 2440 31 -1798 1286 1075 -1310
$$ packed form
567B430q124Q440J201r668O996L675j0155M752N338q849K407N516o719Q47M614
582B701m069n32K842j759j79J132j373J186q27m71K379k187r90M055k727j938
598b757N065k736l025N393r15m776N396L80n480L959J961m807J931K835l144l46
614a066K842q98j585Q54J726j341k092L094O50m825L667L001o603J870N521o217
630a402q33O617l895l259N449p49m354L222J329l077K05K171n32k281J283J939
646A833k778j072M202j951l656M762Q11n980L362L708n843M52N401m836j560N642
662B497k599l179M282j87k995J539J447j266q88J110R08j715m71L341j954k265
678b395M033p87l497L171J603m480J646L345l532o73M006k409j829L084k11k385
$$ plain form
694 -1310 264 1375 -457 -300 880 543 -322 253 1270 -15 -847 1693 904 -1281 1230 1683 -1639
711 -1639 189 2334 -1399 -410 2602 -919 -1262 1861 -32 -1497 1227 812 -1222 517 810 -476
727 -476 -177 436 -101 -543 -229 662 -332 -1206 718 303 -1621 168 1042 -1942 -568 1995 -2128 -1372
745 -1372 1968 -1372 -1865 1652 -492 -1891 1210 -53 -1281 403 222 -881 -235 -123 553 -615
761 -615 -898 754 -15 -1641 935 891 -1946 322 1768 -1663 46 1949 -1314 -712 2088 -165 -1055
778 -1055 1781 159 -973 1223 641 -411 524 270 339 -154 -4 900 604 -612 1237 1010 -1073 1041
796 1041 1180 -1455 487 1411 -1334 344 1311 -742 33 892 -940 114 481 -405 -41 20 -601 368
814 368 -200 -817 438 -258 -982 476 -65 -1199 517 -69 -1391 166 150 -1406 338 217 -1245 218
$$ packed form
694a310J574J111j832J57J180l37q65N75J017j285q32K540p89k185K511M53l322
711a639J828K145l733R89L012l521l43L123j893j465K724m15k034J739K93j286
727d76K99O13n37m42L14Q91r94q74J924m15j924J789Q74k984J374K563m123P56
745a372L340l340m93L517k144j399L101j263j228J684j81j103O46J12O76j168
761f15k83J652p69j626K576m4k837K268J446l431J709J903l263O02K800k253q90
778a055K836j622j132K196n82j052R35k54O9m93J50R04k96j216J849k27k083K114
796A041J39k635J942R24k745J678R67k053P75Q59j832J054L67q86L64O1o21R69
814C68n68o17J255o96p24J458n41j134J716n86j322J557j6j556J744j21j462J463
$$ plain form
832 218 200 -1159 354 161 -1365 685 320 -1385 703 30 -1274 579 179 -1151 499 298 -700
849 -700 411 452 -657 280 284 -427 244 384 -302 736 325 -228 855 628 -729 736 621 -615 921
868 921 694 -726 658 871 -808 694 1095 -871 422 1115 -602 60 758 -442 84 601 -413
885 -413 70 216 -293 260 -227 -97 576 -212 -190 313 -346 -823 710 -323 -1251 342 8 -1267 618
904 618 329 -1425 230 380 -1297 -6 229 -1134 -59 21 -809 -13 -156 -632 624 -677 -436 827
922 827 -832 -825 1492 -1138 -1091 1817 -1103 -1134 2330 -648 -1183 1936 -309 -1100 2161 -216 -1361 1649
940 1649 -119 -793 1470 -270 -381 1781 -486 22 2068 -783 -99 2605 -1419 -662 2935 -1499
956 -1499 -685 3354 -1713 -1222 3989 -1617 -1496 3424 -1491 -1810 3599 -1358 -1897 2913 -1570 -1553 2535
$$ packed form
832B18j8j359J513j93j526K050l65j705K088o73j304J853m00j330J650k01r98
849g00J111M1j109R37Mp11O71J40o86J038m11n53J083k27j357J465j15j236J536
868I21k27j420J384K13j679J502M01j966J293O93j717O62O98j200N26N17j014
885d13M83J46n09N53m87J30O73p88K2N03o59m77J533j033r28J593l34j275J885
904F18k89j754J655J50j677J291K35j363J075Q0q30P96j43m76J256j301K41J263
922H27j659PK317k630M7K908k920l1L464k978n35L119k245p91L261k377j145L010
940A649j768o74K263j740j11K162k267N08K046k851O84K704m024P57L597m434
956a499Q14M039n067M91N211n606J21M920m915l19N409m957n39M810m483J7M088
$$ plain form
973 2535 -1785 -1429 2356 -2033 -1069 2584 -2303 -889 2620 -2789 -951 2924 -2743 -1102 3553 -2919
989 -2919 -1708 3616 -2821 -2015 3664 -2448 -2156 3486 -2238 -1859 3203 -1892 -1624 3317 -1605 -1050
1005 -1050 3034 -1923 -399 2910 -2425 69 3092 -2862 225 3575 -3055 41 4065 -2945 -201
1020 -201 4324 -2595 -928 4309 -2377 -1289 3728 -1447 -1432 2869 -886 -572 2328 -978 -31 1769
1036 1769 -1772 559 1661 -2690 885 1994 -3407 973 2801 -3857 514 3629 -3606 -501 3549
1051 3549 -3015 -1175 3202 -2293 -1268 2202 -1386 -791 1126 -1297 140 557 -1486 816 -54 -2591
1067 -2591 1670 155 -3231 2260 1142 -4074 1684 2272 -4224 1073 2972 -3533 73 3061 -2717
1082 -2717 -486 2423 -1466 -654 1869 -743 286 694 -1033 1140 83 -1320 2536 -160 -2305
$$ packed form
973B535m320L56L785m389R64L653m887J414L509n409J838L875n667J641M655o472
989b919J211N324o437Q06N679o112K92N642n724L79N062n095K68M941m922N55
1005a050M084m957J524L309n335K494L023n954L087L350o630L096M024p010K744
1020b01M525o919J667N237o686J088N017n175J5M301l755L14K900l306R47J800
1036A769l541K331J102m351L575J109n401M380J828o658M371L115p235L105M050
1051C549o564J840M377n495J025L470l588N95J917k423J437M17k043K302q70k537
1067b591M261j515l386N491j118n216N758N88o496N297J899o505L606K988n778
1082b717K231K909l889Q12K523k612J029M08j727K173j057j403L856k696k145
$$ plain form
1097 -2305 2932 237 -2948 3045 1381 -3630 2927 2091 -3546 1688 2644 -2772 623 2309 -1863
1112 -1863 303 1817 -1012 458 1028 -292 986 -251 -650 1650 -949 -1437 2480 -831 -2388 3089
1128 3089 -355 -3028 2966 391 -3485 2125 888 -3421 1024 1028 -2822 828 617 -1922 359 163
1144 163 -1194 834 -710 -1065 1366 -1370 -1084 1681 -1747 -1463 2503 -1320 -1682 2546 -816 -2460
1160 -2460 2586 -21 -2197 1948 319 -1940 1549 369 -1561 1337 194 -844 1596 -330 -547
1175 -547 1481 -789 -173 1831 -1170 -581 2273 -1325 -499 2695 -556 -585 2506 -689 -937 2294 -254
1192 -254 -1081 1590 -255 -699 1243 -148 -577 1074 -477 -362 953 -724 -247 1005 -936 -325 1158
1209 1158 -1449 -668 1233 -1395 -626 1666 -1225 -1059 1523 -1002 -922 1093 -728 -940 741 -408
$$ packed form
1097b305N237k695l185N993j664n011O557q36n637N234R56n416L395J686m172
1112a863K166J514k829J470N70j320J278j237l99K300k599m88L917l311j557N477
1128C089l444k673N994k575l876N610j237m309M445Ml850L650k11k539K281j96
1144A63j357K028j544l55K431k736K86K765l428K84L966l823l62M228l362j644
1160b460N046k607k176M145j629k259L489j180j930K898j143j038K440j926k17
1175e47K028k270O16K004l001N89K854l598Q26L194l251k9L091l195k48L231k548
1192b54q27K671j845m44J942j391m29J651j551J15J315j677M77J252j941O11J483
1209A158k607P81J901k628P69K292k891J66K582k525Q0K015j821k12J681j149
$$ plain form
1225 -408 -572 590 -481 -394 366 -710 282 571 -708 280 645 -1439 305 1097 -1171 0 988 -696
1243 -696 -60 1235 -750 -202 1354 -331 -298 1010 -249 -315 556 -61 -108 682 -238 370 578 -464 656
1262 656 620 -910 551 804 -1008 709 708 -1257 300 1219 -939 17 925 -583 -237 857 -275 -498
1280 -498 538 -384 -228 289 -389 143 123 -405 547 52 -980 347 219 -1506 0 439 -1650 311
1298 311 871 -1221 70 1110 -1079 -254 757 -1025 -240 647 -619 -207 429 -683 104 236 -476
1315 -476 482 264 -343 596 103 -749 695 342 -578 799 425 -850 582 885 -575 192 1255 -493
1333 -493 -15 710 -340 -78 773 18 186 289 -65 168 131 -165 697 166 -385 654 76 -524 610
1352 610 96 -498 561 394 -858 175 465 -790 21 330 -269 -320 37 -269 -418 -357 -1 -176 -512
$$ packed form
1225d08j64J162j071Q7P60j076R92K89j279R88L65k084J744P92k268J171R88j684
1243f96O36J295j985N48J556j685L3J308j259o6Q71o17m7P90r20O08K08j042J120
1262F56l6j530J461K53j812J717jj965J557R19k158R56R08j508L46J094j132k23
1280d98J036r22J56N17o78N32k0n28R52m95j032J327j28j725J506M39k089J961
1298C11N60k092J291J040k189Q25J011j782P85Q87j266M12O36j112P87J32p12
1315d76R58k18o07R39m93q52J444l53r20J377l74j275J432L03j460P67J063j748
1333d93M78P25j050K62Q51p55J68J03l54K33l7k96Q62n31n51J039n78o00J134
1352F10n14n94J059j67j252J033K90j255Q11L09n99n1L57l06j49O1L56j75l36
$$ plain form
1371 -512 -77 334 -606 -190 595 -671 -451 454 -339 -563 464 -290 -494 505 85 -556 385 349 -647 57
1391 57 -89 -125 -139 -358 -114 85 -359 208 299 -783 129 688 -567 87 726 -552 -202 730 151 -435
1411 -435 1027 41 -362 738 199 -281 527 348 -353 151 179 -115 266 -198 186 107 -399 190 573 -520
1431 -520 -137 995 -774 -327 1122 -848 -454 1032 -513 -656 994 -219 -440 684 -497 -845 4
1448 4 35 -373 80 -171 -359 107 -475 167 -16 -922 20 639 -789 -142 826 -1042 -295 930 -505 -528
1468 -528 1034 -240 -838 957 -131 -881 801 -174 -441 349 259 -158 245 -53 281 178 -256 460 532
1487 532 -757 67 692 -686 214 859 -730 -56 1074 -568 -473 805 -137 -474 612 -20 -392 390
1505 390 197 -302 248 -29 247 -157 -361 575 64 -667 541 43 -757 441 612 -1095 -52 468 -930
$$ packed form
1371e12M35M11r40M16P85j266K20R05p93k24J027p54k04R99m20o41R41l6r96P04
1391E7j46l6j4k19K44J99m44N67R1j082R12N59j255O54O39j278L50R32n79n86
1411d35J462r86m03J100n39m80Q08j79p01N04K8k94L81m64L84p9n06N89L83j093
1431e20L83J132j769M47J449j970L94J486j545j43J650j213k21J124j181l48Q49
1448DL1m08M53k51j88M66n82O42j83r06R42O19j428O47R68j868P47J225j435k3
1468e28J562j274n98J795j088p50J682r75k67P90r0m17M03k98L34j03m34P16P2
1487E32j289Q24O25j378R00O45j589O74J130j642R5J278r42l37J086o32l72P82
1505C90j93m99N50k77K76m04k04R36n11p31J208m98q00J198J71j707J043N20j398
$$ plain form
1524 -930 -257 851 -812 -342 500 -365 -233 182 -255 -197 -11 -87 82 -213 -278 335 -268 -554 431 -121
1544 -121 -502 457 314 -712 501 316 -659 274 700 -763 68 719 -287 -81 419 -97 -241 263 -128
1563 -128 195 -61 115 90 -48 -91 488 -66 -79 705 -263 -374 698 -70 -817 572 349 -576 213 487
1583 487 -565 17 572 -74 -2 418 -165 -69 129 152 314 -176 -243 216 101 -396 604 -440 -404 494 -167
1604 -167 -588 486 86 -775 456 273 -612 5 410 -264 12 502 -70 -84 221 122 -20 -78 -13 -11 -118
1625 -118 193 555 -275 -137 712 -81 -358 450 17 -619 464 110 -529 61 259 -314 -49 577 -426
1644 -426 -184 542 10 87 250 328 36 38 381 317 -226 16 304 -221 -181 452 -31 -491 363 -30 -578 50
1666 50 358 -472 104 75 -276 -116 165 -271 -65 179 -293 61 132 -3 135 -27 -251 20 -65 7 515 4
$$ packed form
1524i30O73J108j663M70Q42q65J32M15m37N8J86p6J69k95o5O13o03k86R85n52
1544a21l81R59j43j026J213j85r75R33M26j463Q31O51j006K06N00n16j44N04l91
1563a28L23k56J76k5j38m3N79n54j3P84r68j11J072p68p47J389k23r25P89K74
1583D87j052N82N55o46P2M20n83R6J98K3J62m90o7M59j15m97J000j044L6Q98o61
1604a67m21J074m00q61J231j83q85O17M05o74K76M90n72j4L05r9j42n8O5Kj07
1625a18L11L62q30J38Q49p93k77Q08m33o36J083l54o39N90J98n73K65O26j003
1644d26K42P26n32P7J63P8k92KL43o4n43K42K88n25M0O33m83m60Q54l93n48O28
1666E0L08q30N76k9l51J60K81m36K06K44m72L54P1j35J38j62k24K71q5P2N08n11
$$ plain form
1688 4 -164 421 141 -306 323 182 -335 248 161 -218 33 -114 -48 -338 141 -22 5 -158 -89 259 -243 83
1710 83 219 -32 -323 170 60 -240 295 -467 -59 459 -69 -255 412 231 -89 205 4 -180 142 258
1730 258 -151 40 -80 -427 91 60 92 180 -93 25 7 112 -109 411 120 24 92 -390 25 368 -374 -165
1752 -165 154 0 -215 205 134 -141 -34 -229 -374 68 -396 -9 116 -24 23 92 -85 93 79 -458 43
1773 43 176 -188 -191 106 -205 -167 234 -286 -269 11 68 -240 250 -128 -290 40 283 -122 -40 -6 -94 -208 -120
1796 -120 145 26 -220 -1 340 -214 225 277 -161 41 -39 -219 2 296 -110 -93 465 72 -252 246 158
1817 158 92 65 86 191 3 381 13 -46 48 243 63 -162 196 348 -153 -136 246 -409 2 276 74 -255
1839 -255 -35 -109 -149 104 251 -279 69 243 -95 -118 -295 -362 -100 -240 70 -147 -121 -152 -63 -330 -123 70
$$ packed form
1688Dj68N85k80m47O29j41n17N83q7l79K51j47O6k90M79j63K7j63O9L48n02L26
1710H3J36k51k91M93j10l00N35p62M08N18n28j86O67j81l20K94k01j84L22J16
1730B58m09J91j20l47N18l1L2Q8k73J18j8J05k21N20k91r6O8m82M15L43p42K09
1752a65L19j54k15M20p1k75J07j95j45M42m64L87J25j40M7O9j77J78j4n37N01
1773D3J33l64lK97l11L8M01n20J7K80N7l08M90l78j62L30K43m05Q2L4q8j14Q8
1796a20K65j19k46K19L41n54M39N2m38K02q0j80K21K94m06J7N58l93l24M98q8
1817A58o6k7K1J05j88L78l68n9R4J95j80k25L58J52n01J7L82o55M11K74k02l29
1839b55K20p4m0K53J47n30L48J74l38k3j77o7K62j40L10k17K6l1Q9k67K07J93
$$ plain form
1861 70 -112 33 439 -232 -446 219 -66 -121 287 -137 -262 171 180 152 -274 12 221 -11 11 211 85 -118
1883 -118 -63 25 -179 227 438 -327 5 511 -334 166 332 23 22 116 273 49 -109 232 -103 134 0 301
1905 301 -186 -389 268 35 -220 496 61 -417 471 126 -523 192 279 -354 -39 -10 -183 -135 153 124 37 -52
1927 -52 -86 48 -210 41 242 -107 -310 314 -306 -391 610 124 -399 277 206 -768 52 306 -452 159 133
1948 133 -384 171 -45 -260 66 76 53 256 -389 -116 392 40 -115 630 -180 -680 649 139 -231 369
1968 369 256 -252 337 184 -280 453 -19 -156 261 40 -372 273 111 -27 300 -145 -74 271 -33 -14 327
1989 327 -86 -97 427 -259 -283 574 -165 -429 488 50 -45 577 -94 -578 221 -152 -239 396 -80 -539 37
2010 37 224 -141 -1 -157 -91 -144 -296 -186 423 -178 -105 363 -308 -172 570 -353 -202 946 -562 -536 754
$$ packed form
1861G0j82J45M06o71k14O65k85n5M08m24j25M33Rk8m26K86K09k32K2K00j26k03
1883a18N5Q8k04M06K11p65L32N06q45N00J66l09jR4J57k24j58L41l35K37j34L01
1905C01m87k03O57k33k55P16m35m78Q88l45o49P15Q7o33L15K9j73M8K88k9q7q9
1927e2l4J34k58K51K01l49k03O24o20q5J001m86n23O76p1r74Q20K54p58O11k6
1948A33n17N55k16k15L26J0k3K03o45K73N08l52j55P45q10n00J329n10l70O00
1968C69j13n08N89j53m64P33m72j37M17k21m12O45j62j38L27m45P1L45l04J9L41
1989C27m13j1N24o86k4Q57p39k64R17m38r5O22o71m84P99l73q7O35m76m59N76
2010C7J87l65J40j56O6n3j52J10O09o01P3M68o71J36P42r23J51J148j508K6J290
$$ plain form
2031 754 -165 -924 539 240 -574 153 244 -352 105 66 55 -123 -144 153 93 -361 462 370 -796 232 731
2052 731 -528 234 853 -227 -499 814 -57 -599 853 381 -379 243 385 -368 210 295 165 -130 -90
2071 -90 216 19 -538 423 135 -702 388 518 -903 -3 765 -894 -282 613 -491 -529 600 -120 -441
2090 -441 132 158 -403 -14 103 7 -385 -332 174 -244 -514 452 -83 -581 553 162 -840 114 326 -640
2110 -640 -12 601 -599 -189 652 -437 -175 485 -167 -115 255 89 -220 -53 -164 438 51 9 558 119
2130 119 -83 643 74 -401 333 97 -570 210 370 -352 370 483 -410 -195 363 -488 -296 283 -63 -44
2150 -44 175 -137 188 255 -229 55 -107 -129 217 -297 -424 537 -145 -295 364 17 -169 244 221 -503 80
2171 80 133 -607 220 249 -319 -87 278 13 -326 -83 86 -191 -138 47 21 -306 73 187 -444 -38 427 -361
$$ packed form
2031G54r19p59J463k99q14P27R1n96M57l9j1j78k1K97o0m54Q23r2j166J028M99
2052G31j259P62O19j080k72J313q71n42J452m72p60O22J42p53N78Q5j30k95M0
2071i0L06j97n57R61k88q37J090J30j421R00P68j659O12Q95j104l8J129p20l21
2090d41N73K6n61L89J17r6l92N3N06m18k70R66n35m98J134l91j002R54K12r66
2110f40O28O13j200M10Q41j089K62O60o52N2L70j66l09J67j11O02l87m2N49m39
2130A19k02P26n69m75P34k36o67P80J60p22P22J13q93K15N58q51J92N79l46J9
2150d4K19l12L25O7m84K84j62k2L46n14j27R61o82j50O59l47j86M13k3p24N83
2171H0N3p40Q27K9n68K32L65k65l39K43J69k77N3J85k6l27L79J14o31M06M65p88
$$ plain form
2193 -361 -319 800 11 -436 464 211 -395 173 416 -482 201 671 96 399 121 -55 50 34 217 385
2213 385 -282 28 279 -571 86 428 -389 -182 686 -316 -391 527 -154 -56 436 19 -651 121 198 -336 172
2234 172 1 -251 -29 -113 -11 -23 -47 133 283 -482 36 285 -341 -63 450 -372 -570 400 -417 -314 252
2255 252 239 -188 217 -59 -236 65 100 -220 113 9 -104 230 175 -53 230 -2 132 119 -64 1 191 119
2277 119 12 515 -288 -407 314 49 -416 47 34 -72 167 205 -65 97 307 48 -151 -29 -1 32 -112
2298 -112 243 83 -181 409 405 27 47 248 -100 -99 -17 52 -104 187 -213 -449 94 176 -258 100 127 -100 -122
2321 -122 -51 129 98 243 173 -220 -312 -122 257 -247 -14 172 -265 -187 318 -186 -233 222 -245 17 -67 44
2343 44 -8 257 157 380 -27 -105 158 -6 -56 224 -101 -214 -77 237 -148 171 8 -137 47 41 -118 -189
$$ packed form
2193c61M2J119p89m47R00k53o06N68K43q98O83M70n75L03k78j76J05j6J83J68
2213C85o67L10K51q50O57L42q17K07Q68j002p5R18o81R8M92m17o70P72P7n34N08
2234A72j71k52K22q4J02j2k4J80J50p65N18K49o26K78N13q22j98R70q17J03N66
2255B52j3m27M05k76j77L01L5l20L33j04j13L34n5k28K83k32J34j3j83O5J90p2
2277A19j07N03q03j19P21k65m65M63j3j06K39L8k70J62K10k59j99J22K8L3j44
2298a12L55j60k64N90ml78K0K01l48JQ2O9j56K91m00k36N43Q2m34L58K7k27k2
2321a22P1J80l1J45p0l93r2J90L79n04K33J86m37P8N05n04m7M55m67K62q4J11
2343D4n2K65j00K23m07p8K63j64n0K80l25j13J37L14l85L19j63j45J84oj59p1
$$ plain form
2365 -189 208 -151 170 -36 242 370 115 -33 348 -105 -62 320 -65 -225 208 -62 -206 352 -73 -75 127
2386 127 112 -432 108 205 -236 -51 -154 -172 28 -69 -81 -147 -335 -310 12 -70 -188 79 43 -228 27 -304 66
2409 66 78 -230 -55 303 14 -337 142 330 -93 246 -12 -356 459 157 -156 -1 26 -497 126 37 -455
2430 -455 47 61 -247 354 438 -48 247 130 -39 336 -69 -7 385 -24 -415 267 -103 -227 250 238 -514
2451 -514 143 171 -170 84 138 -497 -133 127 -277 121 -17 -246 -14 -268 -116 346 -280 -78 251 -240 -504
2472 -504 334 -13 -446 361 11 -801 213 73 -465 -247 236 -420 -225 218 210 -93 55 38 -126 -291 117
2493 117 328 -576 198 338 -386 -201 445 -131 -461 267 132 -401 315 402 -175 177 356 -136 -143 72 125
2514 125 -223 -11 144 -252 -85 425 306 -436 159 349 -277 -120 692 -438 -301 629 -41 -159 555 350
$$ packed form
2365a89L97l59L21k06K78J28k55j48L81m53M3L82l85j60M33k70j44N58m25kK02
2386A27j5n44N40R7m41J85j03j8K00r7j2o6j88K5L22q2j18K67l6k71K55l31L70
2409F6J2l08J75L58k89l51M79J88m23L39k58l44Q15l02l13J55K7n23O23q9m92
2430d55N02J4l08O01Q4m86K95j17j69L75m05O2L92m09l91O82l70j24M77j2p52
2451e14O57K8l41K54N4o35L64K60m04L98j38k29K32k54J52M62o26K02L29m91k64
2472e04Q38l47m33Q07l50q12J014j40n38K18M83o56J95M43ql03J48j7j64j65M08
2493A17K11r04P74J40p24J85O46n76l30P28j35n33P16Q7n77L52J79m92pK15N3
2514A25l48K12J55l96J67N10j19p42N95J90o26J57Q12j130J37R30o70j18P14k05
$$ plain form
2534 350 -265 -33 78 -329 -61 288 246 22 105 61 -3 -67 -78 -21 -587 264 115 -434 149 280 -467 -205
2556 -205 389 -490 -338 272 -338 -225 168 -142 -349 82 -12 -90 0 4 -38 100 34 72 13 -48 253 263 -341 226
2580 226 303 -447 202 556 -476 242 375 53 11 447 -128 -40 85 -195 -93 213 49 -64 82 -187 295
2601 295 9 -195 356 -139 -246 181 -147 -382 296 185 -708 362 294 -556 107 147 -429 -26 208 -191
2621 -191 27 256 43 184 64 -240 75 -103 -176 187 -175 -130 469 -296 -261 316 131 -346 236 346 -413
2642 -413 199 126 -377 38 160 72 160 209 -124 19 392 144 48 -127 14 42 -114 -70 373 -117 -67 491 -51
2665 -51 -466 496 -78 -256 406 180 -215 356 335 -344 89 421 13 165 147 80 81 -166 51 -73 -46 133
2687 133 258 -138 -30 86 -256 -306 240 -35 -179 250 -10 -293 96 86 -308 83 147 -258 235 334 -65
$$ packed form
2534C50o15K32J11m07K68L49m2k24Q3m4o4o4j1N7n66Q51j49n49N83J31p47K62
2556b05N94q79J52O10o10J13L93l10k07M31r4p8R0Mm2J38o6L8n9o1L01J0o04N67
2580B26P7p50O49L54j032P18J33l22m2M36n75Q8J25k80J02L06j64j13J46k69M82
2601B95k86k04N51m95j07M27l28k35O78j11q93J070o8q50O63M0n76M03K34l99
2621a91K18K29k13J41j20l04L15j78p3L63l62M5N99p65L5N77j85m77N82J10p59
2642d13O12p3n03M15J22q8Q8M9l33J43L73k48r6j75J41K8j56M4M43m90N0N58n42
2665e1m15R62n74j78O62k26l95N71k1o79M33L32m08J52j8o7Jk47K17j24K7J79
2687A33J25l96J08J16l42n0N46k75j44M29k60k83L89j0l94L91O4m05M93R9l99
$$ plain form
2708 -65 -43 205 -162 176 -175 18 138 -51 -255 13 -130 -293 322 98 -53 378 -183 -162 254 272 -110
2729 -110 -9 -115 -169 163 334 -102 32 -105 93 -133 140 17 -17 -89 -121 264 69 35 32 206 65 102 -63
2752 -63 -150 41 -36 -84 90 -24 -307 52 -209 249 44 160 -171 292 90 179 244 -40 14 -69 -176 78 1
2775 1 -284 -275 109 -167 283 -132 -240 -23 3 224 78 -103 67 -151 30 -80 -58 -1 27 -47 -22 148 77 -129
2799 -129 32 69 118 -29 -77 -50 -46 76 -95 6 76 22 30 165 -138 159 214 135 -7 190 134 -128 -138 333 -154
2824 -154 -42 -30 19 -48 143 38 -233 -3 49 -9 227 13 73 -82 -3 27 -157 -170 -39 116 5 -13 71 -189
2848 -189 60 148 -136 -94 -64 -19 151 210 -48 310 47 80 -200 150 47 258 -102 -107 153 6 184 -94 20
2871 20 121 170 66 -28 49 -63 148 -24 -34 8 5 -26 -70 76 69 -128 -4 -21 -64 -228 158 46 188 81 106
$$ packed form
2708f5K2K48l67L38l51J93J20j89k04K68j43j63O15k24j51M31n61K1M16J8l82
2729a10J01j06n4L32J71m36J34j37J98k26K73j23l4p2l2L85j95l4lJ74j41L7j65
2752f3q7J91p7m8J74j14k83L59k61M58k05J16l31M63k02Q9O5k84N4q3j07K54p7
2775Ak85RL84k76M50m15j08K17K6K21j46j81J70k18J81j10K2N7K8p4K5J70p1k06
2799a29J61L7M9j47m8K7MJ22j71J01P0n4QJ35l03K97N5p9j42J97n6k62j0M71m87
2824a54J12J2M9o7J91j05k71K30N2n8K36k14O0j55P9L0j84j3J31J55j11j8Q4k60
2848a89K49Q8k84M2L0M5J70N9k58L58k63L3k80L50j03K11l60nK60j47J78k78J14
2871B0J01M9j04r4P7j12K11j72j0M2ll1m4J46pj97J24j7m3j64L86j12J42j07K5
$$ plain form
2896 106 -160 347 -58 -189 -2 -431 46 170 177 -149 59 -185 -194 24 -66 106 -15 127 -94 -15 -209 331
2918 331 25 -26 -50 70 7 -9 186 -106 -71 -64 186 -103 -267 45 -144 -136 36 90 157 -96 -40 -27 -38 77 -117
2943 -117 -105 219 36 -140 -6 -85 -98 145 -89 -134 -190 45 54 149 -61 67 -197 75 -6 33 -81 176 65
2966 65 -218 51 89 63 -99 -130 25 -161 -85 25 -111 -85 42 -203 162 118 146 32 -87 35 92 79 82 34
2990 34 -41 92 36 127 50 137 64 24 25 97 -154 85 226 -137 113 -22 -89 137 -76 -8 102 30 25 -112 267
3015 267 185 116 45 219 -45 197 157 -30 -68 54 -55 151 0 108 -69 -32 62 -69 191 185 -216 11 -58
3038 -58 -65 -173 5 53 106 -30 169 96 280 -70 82 92 -125 -63 -39 -89 27 194 150 -36 159 -124 -22 -80
3062 -80 -56 -107 81 182 -236 276 -99 -118 -23 151 86 18 184 -38 -29 63 15 97 -240 -23 159 47 206 70
$$ packed form
2896A06k66N07m05j31J87m29M77J24Pl26K08k44rK18r0J72j21J42k21P9j94N40
2918C31l06n1k4J20o3j6J95k92L5PK50k89j64L12j89QJ72N4O7k53N6J3j1J15j94
2943a17J2L24j83j76J34p9j3K43k34m5n6K35RR5k10J28k64K72q1L9j14K57j11
2966F5k83K69L8k6j62l1J55j86P6J10j36K6J27k45L65m4K8j14j19J22N7j3Lm8
2990C4p5J33n6R1p7Q7p3m0JP2k51K39J41l63K50j35o7K26k13O8J10p2nj37L79
3015B67q2o9p1J74k64K42m0j87l8J22j09K06j51J08j77L7R4j31K60om01K27o9
3038e8pj08J78M8N3j36J99p3J84l50J52J0k17O2K4n0J16J67m4j86J95k83J02n8
3062h0K4n1J88J01m18N12l75j9R5J74o5o8J66k22RR2m8Q2l37K17J82j12J59j36
$$ plain form
3086 70 -7 58 37 -184 -125 -165 126 -112 -20 271 -76 90 124 -211 64 -104 73 30 47 -55 43 -94 -201 16
3110 16 -136 -144 -74 -97 4 -28 -90 -126 47 147 -56 -92 43 -184 -16 104 -39 -250 -207 -23 -388 -264 -2
3133 -2 104 -187 45 59 -311 22 109 -187 -56 55 -34 59 -11 100 -264 -105 105 -212 -43 185 -29 -153
3155 -153 47 52 -1 -3 -38 183 196 32 256 -59 156 207 -141 23 129 -149 -98 43 -147 -199 -89 44 -141
3178 -141 105 188 -129 54 236 -99 -136 -104 13 139 -92 40 -93 -183 -78 -34 37 -32 27 -34 153 197 56
3201 56 -153 355 61 -135 -8 125 -74 -231 67 -274 -12 64 91 143 -73 -126 -37 68 68 -88 -52 -151 316
3224 316 -136 -119 57 -233 -35 -6 -34 -210 191 146 -170 190 326 -4 168 -14 -89 27 4 -23 47 -29 41
3247 41 -75 54 78 222 169 -81 328 79 -137 144 -165 -220 71 84 33 -81 21 84 -81 -79 -78 -44 -47 98 -172
$$ packed form
3086G0p7O5k1k21N9m0K91k38R2K91l47J66L4l35K75j68J77m3J7j02R8j37j07K17
3110A6j52qP0k3J01l2o2l6J73J00k03l6J35k27J68J20j43k11M3J84l65J24K62
3133bJ06k91K32J4l70L33Q7k96J31J11q9R3p0J11l64J59K10l17J69K28k14j24
3155a53K00Nn3kl5K21J3j64K24l15K15N1l48J64J06k78N1J41j90n2J10J33j85
3178a41K46Q3l17J83J82l35l7L2J17J26k31J32j33r0J05M4P1o9N9o1J87M4j41
3201E6k09N08k94j96J27J33j99j57K98l41K62P6K7N2k16n3Q9J05%j56L6r9M67
3224C16m52J7J76k90J98K9k8j76M01m5l16L60J36l30J72j82p5J16k3k7P0p6P0
3247D1j16J29K4J44n3k50M09k49k16K81l09n5K91J3n1j14J02O3j65KJL4lJ45k70
$$ plain form
3272 -172 -119 169 -49 -107 29 123 -75 190 148 40 212 41 -189 92 98 -410 -79 88 -5 176 77 -147 46
3295 46 -185 -1 -106 -50 46 -146 -52 -9 151 128 148 161 259 23 95 113 32 186 73 -115 125 281 -12 104
3319 104 124 10 89 -76 -116 -17 193 166 202 -97 0 -32 -31 -45 97 -207 -205 88 164 34 100 116 -265 49 262
3344 262 -87 -39 288 -133 -288 -62 -150 138 91 -90 186 15 64 -17 25 4 124 80 -36 88 13 41 52 -68
3368 -68 -137 142 -70 27 -149 53 137 -32 19 -100 114 193 -127 -17 21 267 109 156 -96 -5 5 93 250 72
3392 72 27 152 22 -104 56 7 54 56 204 -221 -181 105 116 58 -106 135 122 -151 91 17 129 166 -19 -184
3416 -184 -6 -153 -19 -43 139 66 -186 236 47 -120 49 108 -224 -155 -196 -161 26 -107 38 -69 137 -39
3438 -39 188 168 92 -155 -136 16 49 -136 -219 97 9 -41 117 187 -182 -155 30 -60 -221 44 34 -99 101 -72
$$ packed form
3272a72N3K88k18n8J36R4j98K65m2j08J72j71k30K81On08L31J67r3J81r9k24J93
3295D6k31J84j05N6R6j92R4M3J60k3K0J3R8k36P2J8q1J54j13j88K40J56k93J16
3319A04K0j14P9j65m0R9K10k7L6k99R7l2Jj4J42l04KK93P6j30O6J6l81L14K13
3344B62l49M8L27m21j55K26q8K88m7j81K76j71M9q1M2k1J20m4j16J24p5K8J1j20
3368f8o9K79k12R7j76K02Q4j69N1j19K14P9l20J10L8K46j58M7k52R1J0Q8J57j78
3392G2m5J25j30j26J60m9M7KJ48m25M0K86J1n8j64K41j3k73K42p4J12L7j85j65
3416a84J78j47J34k4J82p3k52M22j89j67J69N9l32O9m1L5J87j33J45j07K06j76
3438c9K27k0p6k47J9J52L3j85q3L16q8n0J58P0l69K7J85r0j61K65j0j33K00j73
$$ plain form
3462 -72 155 -220 171 -20 111 12 254 277 -90 -92 -272 37 56 -214 -26 -92 -56 43 115 -183 3 118 -90
3485 -90 -138 194 137 151 55 -170 53 -164 -446 77 -66 71 299 142 -69 -155 -197 -143 -12 26 -154 241 64
3508 64 -52 165 44 77 152 143 -253 367 157 58 23 -58 -291 193 4 -144 -148 71 -95 0 124 -11 62 -123
3532 -123 6 319 211 -171 58 -154 14 44 -181 205 54 -86 90 49 42 -10 12 59 -15 30 -40 -140 130
3555 130 9 64 4 126 -212 -64 -67 22 5 -20 -88 96 -86 -61 229 186 19 -169 1 52 24 16 -327 104 -36
3580 -36 -164 287 -169 -69 28 151 -9 115 -6 95 -62 86 -175 289 272 -233 17 248 -95 -135 -47 -248
3602 -248 106 163 -3 45 -186 149 -34 20 -91 31 -48 -106 190 -199 -13 66 88 -133 177 -153 129 171 -109
3625 -109 -87 52 170 -58 162 -41 0 82 -164 130 36 -160 -193 -50 86 -78 -58 -220 -159 112 -149 83
$$ packed form
3462g2K27l75L91j91J31r9K42K3l67kj80L09J9k70J88o6L6R9P2k98J86J15k08
3485i0m8L32n7J4r6k25K23k17k82N23j43J37K28j57k11q6m2N4J31L8j80L95j77
3508F4j16K17j21L3P5rl96O20k10r9l5q1k33M84j89j48mK19j66R5J24j35P3j85
3532a23J29L13j08l82K29k12J68L0k25L86j51j40J76m1pn2K2M7p4M5p0j00K70
3555A30j21N5o0J22l38J48lQ9j7k5o8J84j82K5K90m3j67j88J70N1k8ql43M31j40
3580c6j28M51m56J00R7J23j60J24j21J01j57J48k61M64j7n05K50K31l43m0Q8k01
3602b48L54N7j66M8k31L35j83N4j11J22p9n8K96l89J86P9K2k21L10l30K82M2k80
3625a09K2J39J18k28K20k03M1Q2k46K94r4j96l3J43J36j64K0j62O1K71k61K32
$$ plain form
3647 83 174 -69 -155 132 -152 28 -40 -39 -141 251 -73 -177 102 138 185 207 -66 104 -74 -167 49 -84 -65 -6
3671 -6 -28 -282 153 142 -24 -112 108 -67 -262 137 43 -99 122 -57 -164 -100 -141 42 -50 -55 114 103 91 -103
3695 -103 17 -15 31 180 -51 -21 3 -98 -82 182 -150 -167 -110 42 94 -62 185 -45 66 57 37 -119 107 -9
3719 -9 26 164 124 -61 70 -42 -79 -209 188 74 -116 272 212 -50 106 -3 -243 -388 295 -69 -19 16 -236
3742 -236 37 -73 -121 -145 -122 -123 -133 53 -131 -51 81 -129 -34 -123 -160 120 -192 -19 165 -5 -101 44 -25 219
3766 219 81 123 28 193 -173 96 15 230 204 -40 163 137 -13 224 138 6 212 105 -86 141 -50 154
3788 154 0 -101 16 34 -132 27 155 -104 48 49 -180 19 -106 159 -64 153 92 -47 88 -111 72
3809 72 -26 -41 -121 227 -41 192 126 38 -135 -216 16 127 -106 -79 -199 -118 166 -55 -251 64 35 -103 37
$$ packed form
3647H3R1k43q6K87k84J80o8Jj02L92l24j04K79L6M7K2k73J70j78r3K16j33J9N9
3671fk2k54M35j1j66q8K20j75j95L99r4j42K21j79j07O4m1J83r2nJ69j1j2j94
3695a03J20l2M6J49k31L0K4j01J6K64l32j7N7J52N2j56K47k30J11rk0j56K26j16
3719iL5J38m0j85J31j12l7j30L97j14j90L88o0k62J56j09k40j45O83l64N0L5k52
3742b36K73j10m8k4K3jj0J86j84Q0J32k10R5q9l7K80l12J73J84j70r6J45o9K44
3766B19j38M2r5J65l66K69q1K15k6k44K03k6j50K37q6j32K06j07j91K27j91K04
3788A54j54j01J17J8j66J59J28k59J52Jk29J99j25K65k23K17o1j39J35j99J83
3809G2r8j5q0L48k68K33o6q8j73q1K32J11k33K7j20Q1K84k21j96L15k9j38J40
$$ plain form
3832 37 -87 -103 78 16 88 -48 -147 -99 -15 0 -111 -92 -234 -163 -4 38 226 -135 195 104 -57 -29 221 -50
3856 -50 -152 42 -113 225 114 19 -123 -59 26 59 254 -162 -38 -162 27 55 -20 -44 -168 -21 95 -39 179
3879 179 145 172 262 42 -126 -78 201 171 -215 1 10 -4 -46 -31 -67 59 180 145 -123 -25 -19 165 -75 155 91
3904 91 85 234 212 -137 -125 211 -99 -351 -176 110 19 126 -207 -102 72 4 -139 73 104 10 -14 281 -3
3927 -3 54 205 -25 266 -67 -71 -79 289 -6 32 -57 120 -79 47 92 101 98 -147 213 -220 -116 166 85 -19 83
3952 83 87 -114 -45 153 -292 -104 -242 -135 66 -30 74 -12 -238 101 8 -257 -41 159 135 73 185 38 -138
3975 -138 -324 47 -32 -12 -229 -270 13 -53 -137 85 78 -71 -15 -206 -74 190 62 -153 222 37 112 -116 200
3998 200 -217 36 -5 -69 112 95 -43 17 -55 26 -32 -26 73 -115 131 -122 -313 -155 -57 -69 35 35 -129 116 -116
$$ packed form
3832C7j24j6J81o2P2j36r9M8Q4J5j11J9j42P1J59M2J88l61L30r1j61K8K50k71
3856e0j02J94j55L38j11r5j42O4Q5L3J95m16J24j24J89K8p5k4j24J47J16j34K18
3879A79l4K7R0k20j68M8K79l0l86K16Rj4m2J5l6J26J21l5k68R8OJ84k40K30o4
3904I1oJ49k2l49J2L36l10k52J75K86r1J07l33J05J74o8j43K12L1r4k4K95k84
3927cN7J51k30K91l33mqL68k95L8q9J77j99J26M5Rlk45L60m33J04K82q1j04J02
3952H3Mk01O9J98m45J88j38J07K01r6J04q6k26L39r3k65K16K00k4o2J12j47j76
3975a38j86L71p9K0k17m1K83o6q4K22pj49N6j91J32K64j28k15L75j85P5k28L16
3998B00m17K53m1o4J81j7j38O0p2Q1n8OR9j88K46k53j91J58R8j2J04%j64K45k32
$$ plain form
4023 -116 -205 124 -35 -3 -121 79 95 30 -132 -43 -44 2 -115 88 -68 -173 41 -11 112 -329 6 -152 -104
4046 -104 -80 -20 24 59 182 42 106 -36 -69 -206 47 21 76 -51 66 -172 113 4 -75 137 161 13 134
4069 134 117 20 49 -87 -153 -256 109 -67 63 115 279 -163 137 -42 -198 22 -357 136 159 -49 -36 71
4091 71 -36 170 -187 43 -302 30 -117 -27 -81 -153 226 83 -164 66 -44 94 244 155 -129 -56 18 -116
4113 -116 323 105 -126 -104 -47 -21 -117 95 -258 -88 170 -84 -90 -93 -135 -206 62 -21 121 14 151 -127 -111 -94
4137 -94 131 -19 -178 -8 -142 168 85 -80 -192 -12 -41 -337 -267 76 -61 69 205 -10 -135 118 7
4158 7 -126 204 -48 -215 99 90 110 64 -32 -36 174 134 21 -70 105 23 247 -258 186 71 -38 -161 -5 -4 -339
4183 -339 -51 81 -57 -99 -57 20 155 15 -4 -149 119 19 67 57 9 32 -17 -194 146 120 149 -76 82 106
$$ packed form
4023a16q9L29j59L2j18K00J6o5j62Q9jM6j17K03j56j05K14n2J23m41L35j58M8
4046a04K4O0M4L5J23j40O4j42l3j37K53k6N5j27J17k38K85j09p9K12K4j48J21
4069A34j7r7K9j36o6j03L65j76J30N2J64m42L00j79j56K20l79M93K3k08J3J07
4091G1j07K06l57K30l45L32j47R0n4p2L79j43k47K30j10J38J50q9k84P3P4j34
4113a16M39k18k31K2N7K6r6K12l53J70K58k54olm2p1K68q3J42j07J37k78J6J7
4137i4K25j50j59J70j34L10q3j65j12J80k9k96P0L43j37J30J36k15j25K53j11
4158Gj33L30k52j67L14rK0m6r6mK10m0j13r1J75q2K24n05M44j15j09j23J56Jl35
4183c39K88J32j38m2M2P7J35j40j9j45K68j00M8j0m8K3m9j77L40k6K9k25J58K4
$$ plain form
4207 106 -25 -31 60 30 -62 55 -177 -127 23 168 -122 -77 -211 -102 88 -73 16 -92 105 -80 10 -66 -43 109
4231 109 -247 27 55 -182 74 74 -22 99 -25 42 -93 -176 91 -205 145 -4 10 40 -138 -254 -213 -27 -274
4254 -274 48 21 280 17 -9 -8 -16 -137 76 9 -23 -207 70 12 78 174 11 12 247 -115 -206 -95 164 73 -6
4279 -6 -63 60 3 69 145 -57 161 20 -6 -121 82 97 93 17 45 21 79 19 224 27 -160 -47 -114 -26 120 87
4305 87 -39 109 158 -146 -220 14 -39 -55 125 34 80 260 142 147 -39 -117 -13 107 108 -148 -22 -11 91 -141
4329 -141 -159 36 -41 -116 -96 93 -55 -238 -40 148 10 136 -38 59 255 332 -67 -9 -131 -101 -105 -147 107 25
4353 25 40 214 196 31 144 17 -106 48 28 -36 216 120 -109 -56 59 10 -3 5 -85 -141 -42 1 -254 149 48
4378 48 -19 -1 -131 -14 22 -106 260 149 -47 11 0 -85 74 -359 62 119 23 17 -144 44 78 -144 50 -7
$$ packed form
4207A06j31oR1l0r2J17k32N0J50J45k90M5j34J09J90j61Q9j08J97j85R0p6K3J52
4231A09l56K74K8k37K56%r6J21j24O7j35q3K67k96L50j49J4L0j78j16M1J86k47
4254b74L22k7K59k63k6Jqj21K13o7l2j84K77n8O6R6j63JK35l62r1J11K59r1p9
4279fn7J23n7O6P6k02K18j41k6j15K03J5mp6K8k4N8o0K05j97j87J13o7Q8J46l3
4305H7j26J48M9l04p4K34n3j6J80r1M6J80j18Nj86p8J04J20Jk56J26J1J02k32
4329a41j8J95p7p5K0J89j48j83J98J88j38J26j74R7J96P7l99N8j22L0mm2K54q2
4353B5J5J74j8j65J13j27j23J54k0o4K52r6k29N3J15m9j3Qr0n6R9M3k55M03j01
4378D8o7J8j30J17L6j28L66j11j96N8j1q5J59m33M21N7r6oj61J88L4k22J94n7
$$ plain form
4402 -7 344 109 -115 -98 -163 57 -2 -158 -38 71 -140 -12 27 -108 -42 -2 -145 51 -108 199 -101 21 103
4425 103 -44 144 357 -111 -224 126 21 44 -8 4 -141 -84 99 54 116 24 322 -132 165 -23 110 -84
4447 -84 19 91 -19 129 -83 -39 138 65 -71 -60 286 0 -137 -113 14 -317 1 38 -185 -106 -172 9 -42
4470 -42 -139 6 301 55 -124 -95 65 52 85 93 243 30 10 -146 160 190 -48 -49 -168 127 146 19 -35 -48 -22
4495 -22 -75 23 57 73 155 -40 -119 152 63 210 26 98 51 146 -136 138 142 16 218 162 -105 34 -63 -201 -52
4520 -52 -20 -25 -83 117 -103 -72 -74 178 362 197 -132 43 167 69 -87 -197 -136 33 150 -226 -86 -136 -152 -106
4544 -106 59 -52 147 -163 -247 -33 150 -269 -16 -102 -145 -95 71 -202 180 72 -112 108 -388 75 -61
4565 -61 2 -282 2 146 62 156 272 -96 70 349 41 -131 -85 -96 -32 -36 -58 28 -350 -83 82 -109 -67 57
$$ packed form
4402gL51k35k24J7o5K20n9j56J20J09k11J28L9j35O6M0j43J96j59L07l00J22Q2
4425A03j47J88K13m68j13L50j05K3n2J2j45N7J83m5O2r2K98m54K97j88J33j94
4447h4J03P2j10J48k12M4J77p3j36J1L46k86j37K4J27l31L18L7k23P9o6J81n1
4470d2r7J45K95k46j79K9J60j3L3QJ50k13k0j56L06L0k38jj19K95J9j27n4j3K6
4495b2n3R8L4J6Q2j95p9K71q9J47j84P2m7R5k82K74Mj26K02n6k67J39r7j38J49
4520e2L2nn8K00k20L1kK52J84j65l29J75J24r8j56j10O1J69J17l76J40n0j6M6
4544a06J65j11J99l10q4K14J83m19K53q6m3N0J66k73L82j08j84K20m96M63j36
4565f1O3k84K84J44q4R4J16l68J66K79l08j72M6j1O4mk2Q6l78K67J65j91M2J24
$$ plain form
4589 57 -112 11 116 -122 -140 132 138 -158 83 7 112 212 -45 -224 -130 176 -73 271 234 -246 -165 102 41
4612 41 282 66 16 -18 -106 115 44 -165 -277 -5 -58 -283 99 106 -335 49 68 -235 -42 -6 10 124 289 62
4636 62 -201 108 -55 140 -59 100 108 50 -112 140 -20 41 228 -34 126 -54 -144 -43 194 -63 -80 -156 -194
4659 -194 -56 66 -15 88 -22 -6 36 -166 -43 -101 23 106 29 46 81 85 -97 -104 -178 169 -104 211 70 -10 12
4684 12 66 -210 -199 76 14 -197 -56 44 3 104 255 20 -57 -113 -117 105 57 -118 85 -58 -13 47 261 -1
4708 -1 135 -293 120 15 -252 -54 267 163 -258 95 -145 18 94 66 -224 42 1 32 154 -208 -9 7
4730 7 -136 54 -11 132 -5 -51 97 27 -34 -36 9 67 105 -72 24 223 12 239 -136 -267 -9 95 68 110 -79
4755 -79 64 -77 -87 283 38 -61 91 -200 -61 245 -195 -252 -41 65 91 -205 4 -47 166 25 -3 -11 49
$$ packed form
4589E7j69J23J05k38j8K72Ok96K41p6J05J00k57j79R4L06k49L44l7m80Q1K67o1
4612D1K41k16n0l4q8K21p1k09j12K72n3k25L82Pm41L84J9l03J93L6J6J14J65k27
4636F2k63L09j63J95j99J59Qn8j62K52j60O1J87k62J60j80r0J01K37k57j7p6l8
4659a94J38J22q1J03j10J6M2k02J23n8J24Q3p7J7L5Mj82pp4L47k73L15j41q0K2
4684A2N4k76J1K75o2k11J41J00m1J01J51k35p7n6mK22m8j75K03j43M5O0K14k62
4708aJ36m28M13j05k67J98L21j04m21L53k40J63P6k8k90K66m1L1J22l62J99J6
4730Gj43J90o5J43j37m6J48p0o1kM5N8L8j77R6J99k11K27l75j31K58J04k7M2j89
4755g9J43j41j0L70k45r9J52k91J39L06m40n7K11J06K6k96K09n1K13j41k8qO0
$$ plain form
4778 49 103 -143 -9 99 -151 13 35 1 1 -107 -97 -23 48 -16 46 -209 -67 87 -183 108 23 193 236 92
4802 92 48 -53 -38 -144 72 -23 142 -53 99 71 -180 -92 14 -86 55 -142 91 -42 66 173 170 -7 -216
4825 -216 6 61 -36 -100 -35 14 211 1 -68 254 -132 -142 -4 113 -142 -84 -28 -143 -95 -42 -6 -143 -102 79
4849 79 -57 207 49 -33 -106 46 -18 -391 -309 -119 280 14 142 -167 -5 -143 -27 -111 115 164 228 -3 -2
4872 -2 24 -75 104 188 37 -1 -53 153 118 45 156 -103 -25 120 27 2 107 -233 -123 136 -6 -86 68 16 127
4897 127 175 36 14 -139 142 132 -39 112 -89 -17 -139 -204 105 335 -167 -115 -128 -71 -285 -19 221 45 -47
4920 -47 -40 -212 139 -11 -48 -94 -119 -64 -45 25 62 -1 112 68 -202 119 141 -16 25 -152 2 -85 93 -79 -261
4945 -261 23 283 40 29 69 -148 83 89 230 -121 16 195 -354 77 118 153 162 -140 0 -143 -28 116 -67
$$ packed form
4778D9N4k46J34J08k50J64K2l4%j08J0P4P1o4O2k55J42J54k70K91q5J70M3j44
4802I2m4j01J5j06K16r5J65j95J52k8k51Q8J06j00J41j97K33j33J08J07lj77k09
4825b16K22N5r7o4O5M9J97k10o9L22l86j0J38J17k55N8N6j15M8N3L6j37M1J81
4849G9j36K64j58q2p3J52o4l73Q2J90L99k66J28l09J62j38J16q4K26M9O4k31J
4872bK6r9J79Q4j51l8n2K06l5p3J11k59P8J45r3k5J05l40J10K59j42q0J54n2J11
4897A27M8j39k2j53K81j0j71J51k01P2j22o5L09K30n02N2j3N7k14K66K40j76r2
4920d7Pj72L51j50l7m6k5N5J9P0L7o3J13m4k70L21K2j57M1j77J54q7J78j72j82
4945b61K84K60k43j1M0k17K31OJ41l51J37J79n49M31M1L5Rl02J40j43J15J44j83
$$ plain form
4968 -67 -3 -4 44 298 294 -127 -9 -247 235 -39 86 80 -8 -101 0 30 -185 25 -84 -232 -66 98 -53 124
4992 124 -102 -127 -142 -47 -5 -53 35 11 -302 -141 208 128 6 4 146 81 -50 213 171 20 -75 50 -28 241 154
5017 154 43 121 32 -109 -64 149 -81 72 -85 -134 233 -99 223 -27 108 110 -76 -57 102 -31 -5 -74 155
5040 155 -190 142 17 100 1 117 88 23 -30 -67 212 109 251 54 28 -13 68 -77 145 -25 -13 -139 113
5063 113 -110 32 137 -45 76 169 -131 61 -154 70 -62 -346 98 -65 -145 -351 -104 -265 148 64 -39
5084 -39 -287 -10 -133 68 -196 -67 20 185 -83 -225 8 -212 268 60 24 -111 5 -38 105 77 142 89
5106 89 -23 -138 -235 -19 -110 35 -133 -79 -4 -76 90 22 252 222 159 39 159 -45 88 2 -72 -212 20 170
5130 170 84 24 52 -99 -115 -8 149 274 -75 -111 -77 204 -145 0 161 -9 -40 -49 -16 281 21 -91 146
$$ packed form
4968f7O4jM8K54mm21J18k38M82k74J25oq8r3J01L0k15K10j09j48J66J64j51J77
4992A24k26k5j5R5M2m8Q8k4l13J61L49q0j22kJ42o5j31K63m2j51r5J25p8K69q7
5017A54j11P8q9j41M5K13k30J53j57m9L67l32L22k50J35Kj86J9J59j33K6o9K29
5040A55l45L32j25Q3r9J16k9o5n3l7K79j03J42j97k6m1Q1j45K22j70J2j26K52
5063A13k23J42J05j82J21R3l00J92k15K24j32k84M44j63q0k06K47j61M13q4j03
5084c9k48K77j23K01k64J29Q7J65k68j42K33k20M80k08l6j35J16m3J43k8O5n3
5106H9j12j15r7K16r1J45j68N4P5p2J66o8K30l0o3j20J20k04J33q6p4j40K32J50
5130A70q6o0K8j51j6J07J57J25l49l6L4K81l49J45J61j70l1rL3K97k60j12K37
$$ plain form
5153 146 -51 -138 -10 34 -55 -44 69 122 -294 -26 77 29 151 -117 -157 -47 -212 -47 46 -134 -232 26 -50
5176 -50 -28 -126 20 -118 -39 -131 -44 -3 -18 -102 -82 108 -153 49 -33 -58 25 -209 26 73 -47 75 -1 143 180
5201 180 -139 188 -61 112 86 -95 -106 -99 -27 111 40 -52 68 -20 -58 -194 -96 -104 -203 142 -23 -78 -117 -11 87
5226 87 64 -193 -49 -26 105 -278 -71 136 146 -3 -186 -53 200 -119 49 15 12 -137 22 -190 38 35 -167
5249 -167 -100 105 18 114 -115 19 57 367 -165 -44 -63 97 5 -33 -179 -54 -47 2 88 -145 195 88 147 -81
5273 -81 -202 379 90 -32 -9 162 27 5 91 174 69 -135 -28 -49 54 -124 22 -8 145 -6 37 96 57
5296 57 -127 57 -172 112 240 -126 -139 158 87 122 72 -87 165 -88 -64 168 212 -75 101 90 -64 -12 92
5319 92 -151 -118 27 -39 -194 7 -74 -134 98 -30 113 115 132 -203 146 9 61 -34 -13 43 5 -54 264 -219 -23
$$ packed form
5153A46j97q7J28M4q9J1J13N3m16K68J03m8J22k68m0J10j65J65R3j80r8K58p6
5176e0K2r8J46j38P9r2Q7M1j5q4K0J90k61K02q2k5Q3k34K35M7j20J22p6J44L7
5201A80l19L27k49J73k6j81j1PP2J38p1r2J20q8l8j36R8qr9L45j65n5l9J06R8
5226H7k3k57J44K3J31l83K07K07J0j49j83J33K53l19J68l4lj49J59k12K28lk02
5249a67O7K05q7R6k29J34L8L10n32J21j9J60r2l8j46J25PM9Q6k33L40j07N9k28
5273h1j21N81k89j22K3J71j35k2Q6Q3j05k04J07k1J03j78J46l0J53j51M3N9l9
5296E7j84J84k29K84J28l66j3K97p1L5n0j59K52k53K4K32M4k87J76j1j54N2J04
5319I2k43L3J45o6j55K01q1o0K32j28J43KJ7l35L49j37N2r5K1N6l8n9L18m83J96
$$ plain form
5344 -23 115 86 -37 -46 -242 -200 95 73 -115 -117 96 -64 44 -56 191 -21 60 134 -72 -226 -40 -8 96 -151
5368 -151 -51 27 -59 -84 -126 -50 -158 89 174 -165 14 -110 11 104 18 -208 19 11 103 -129 124 -67 -23 -9
5392 -9 81 -40 190 264 10 207 81 -205 178 234 -20 26 -64 -134 -144 94 -73 -54 -218 -28 -10 -102 -141 -85 -146
5417 -146 57 132 -42 60 167 153 13 119 -83 69 -21 -56 64 143 -35 -89 -42 372 63 -179 7 126
5439 126 -94 144 8 -128 -88 84 69 -153 126 161 43 -284 79 18 153 -20 227 -196 -92 133 -200
5460 -200 -15 -45 174 -83 -141 162 -67 -145 -352 -90 80 -107 -41 -97 77 -99 220 109 44 89 -92 -138 -100
5483 -100 133 -180 -65 -383 64 -83 17 171 -85 8 -133 -50 -215 -156 -44 73 56 49 124 75 266 25 -50
5506 -50 145 -32 17 -14 -85 -85 -31 126 -46 116 -104 63 44 -59 90 -51 133 -110 -196 22 37 251 -146
$$ packed form
5344b3J38k9j23rj96M2K95k2j88kK13j60J08j00K47k12Q1P4k06j54J86L2J04k47
5368a51J00P8q6k5m2P6j08K47Q5l39J79j24J21R3q6k26K27qR2k32K53j91M4J4
5392iR0j21K30P4k54J97j26k86L83N6k54M6r0p0j0K38j67J9j64J90J8r2l9N6o1
5417a46K03P5j74J02J07j4j40J06k02J52r0l5J20P9j78n4M7M14l09k42J86J19
5439A26k20K38j36j36M0J72j5k22K79L5j18l27L63o1J35j73K47m23J04K25l33
5460b00J85l0K19k57n8L03k29p8k07K62J70j87O6n6J74j76L19j11o5M5j81m6L8
5483a00K33l13J15l18M47j47J00J54k56R3j41Q3j65N9J12J17j7pP5m9J91k41p5
5506e0J95j77M9l1p1%N4J57j72J62k20J67j9j03J49j41J84k43q6K18J5K14l97
$$ plain form
5529 -146 51 -82 402 39 37 -127 -54 20 -70 30 0 -30 -6 130 -328 -4 37 30 -233 -103 75 5 -69 -149 -127
5554 -127 29 -96 -122 -87 -133 -323 122 9 14 17 -6 -5 -331 57 -4 79 -84 -32 -24 -121 3 -43 -49 -162 -106 -156 -181
5581 -181 54 -13 52 -233 92 -46 281 -91 -43 278 146 161 33 141 70 133 136 101 122 151 -107 182 -71 267
5605 267 -288 58 133 72 7 -165 -16 42 -84 -17 29 -39 -32 -15 -70 -98 -91 264 -272 -61 -8 -142 6 33 -69
5630 -69 57 -21 -119 16 106 -143 120 -244 -158 -121 -171 -84 -76 129 67 -51 13 -43 7 -1 132 -105 -37 71 42 66
5656 66 83 198 5 289 -94 -138 140 -95 21 151 -17 6 93 223 110 24 12 179 176 -26 -135 -64 69
5679 69 136 -56 31 -68 164 -96 -35 236 -21 24 -87 7 99 -93 -31 -219 -37 -4 -6 -113 110 -165 216 -23
5703 -23 82 -9 -66 18 -11 -66 -42 -16 141 294 -40 114 43 -85 122 -269 -129 156 -27 176 -18 -245 89
$$ packed form
5529a46J97j33M84l63kj64P3P4r0J00l0l0K4J36m58L24M1pk63J30J78p0p4q0K2
5554a27J56j25k6L5m6j90M45j13NLk3Jl26L88o1Q3j63N2Qr7J24m6oj13N6n0k5
5581a81K35o7O5k85L25j38L27l72M8L21j32J5j28J08p1O3Ll5K1K9k58K89k53L38
5605B67n55L46P5o1o5j72J49N8j26O7M6o8PJ7n5k8PL55n36K11N3j34J48K7j02
5630f9J26p8r8J35R0k49K63l64Q6L7n0Q7QK05o2j18O4n6N0qJ33k37O8J08k9K4
5656F6J7J15j93K84l83m4K78k35J16J30j68K3Q7J30j13q6j2J67lk02j09P1J33
5679F9O7j92Q7r9K32k60O1K71k57M5j11R4R2j92O2j88J82L3kj07K23k75L81k39
5703b3J05r1n7Q4k9n5K4K6J57J53l34J54p1j28K07l91J40K85j83K03j94k27L34
$$ plain form
5726 89 -117 12 119 40 -225 124 69 -31 26 157 60 -162 -198 -192 11 176 181 -110 -105 102 93 -15 151 30 148
5751 148 -181 42 -180 7 7 66 -3 -61 139 44 -155 51 73 71 236 7 -121 -127 38 -26 -259 287 148 -155
5775 -155 -61 71 -214 67 -148 -118 -296 -95 174 -83 11 319 -159 -81 168 -50 252 -14 -143 -28 12 -12
5797 -12 120 15 -222 158 0 73 -123 -107 -29 89 58 -134 -29 222 83 20 104 275 26 109 -78 12 -175
5820 -175 -11 -96 230 84 -246 139 64 34 -108 135 130 123 145 61 -107 63 164 16 247 -44 235 -256 -81
5843 -81 87 43 -178 -44 66 -130 122 1 -195 -46 -67 -39 33 -16 107 129 251 37 159 -157 -96 40 100
5866 100 7 100 158 -88 35 183 -267 110 -17 -47 -113 156 113 34 -83 -77 213 -58 -35 87 -190 165 -94
5889 -94 308 -131 38 -75 47 120 78 123 -213 -65 -42 200 -47 -57 153 -155 372 146 23 -51 125 97 -98
$$ packed form
5726H9k06J29J07p9k65L49n5j00N7J31r7k22l6OK03J65Nk91NK07rj08J66j21J18
5751A48l29K23k22J87%N9o9n8K00r5j99K06K2kJ65k29j28oJ65o4k33N46j39l03
5775a55R4J32k85K81k15L0j78K01K69k57R4L08m78P8K49k18L02k66j29J15M0k4
5797a2J32j05k37L80j58P3j96J6P8J18l1j92J05K51j39o3Q4J71k49Q3j87R0j87
5820a75J64q5L26j46l30L85p5l0j42K43npK2q4j68J70J01j48K31k91K79m91J75
5843h1J68m4k21J34J10j96K52j21j96J49k1K8P2m9J23K2J22k14J22l16O1J36O0
5866A00r3R3N8k46J23J48m50L77j27l0o6K69m3p9j17OK90k71K3J22k77L55k59
5889i4M02m39J69j13J22P3m2M5l36J48K3K42k47j0K10l08N27k26j23p4J76k8j95
$$ plain form
5912 -98 204 10 41 291 43 -30 -125 -135 15 171 175 12 129 -76 -47 109 -162 54 -94 -211 -159 -60 -217
$$ packed form
5912i8L02j94L1K50k48p3r5j0J50J56Mj63J17k05K9J56k71K16j48j17N2R9j57
$$ [...]
8191c2
##END NTUPLES=NMR FID
##END=
