##TITLE=1H_Pr en-C
 CDCl3, 8 sc, 
 26.8.2020
##JCAMPDX= 6.0         $$ Bruker NMR JCAMP-DX V2.0
##DATA TYPE= NMR FID
##DATA CLASS= NTUPLES
##ORIGIN= UXNMR, Bruker Analytische Messtechnik GmbH
##OWNER= root
$$ XWIN-NMR		Version 3.5
$$ Thu Aug 27 12:37:47 2020 Russian Standard Time (UT+4h)  she@DPX200
##.OBSERVE FREQUENCY= 200.1315066352
##.OBSERVE NUCLEUS= ^1H
##.DELAY= (6, 6)
##.ACQUISITION MODE= SIMULTANEOUS
##.ACQUISITION SCHEME= undefined
##.AVERAGES= 8
##.DIGITISER RES= 18
##SPECTROMETER/DATA SYSTEM= spect
##.PULSE SEQUENCE= zg30
##.SOLVENT NAME= CDCl3
##.SHIFT REFERENCE= (INTERNAL, CDCl3, 0, 15.7039)
##AUDIT TRAIL= $$ (NUMBER, WHEN, WHO, WHERE, WHAT)
$$ ##TITLE= Audit trail, XWIN-NMR		Version 3.5
$$ ##JCAMPDX= 5.01
$$ ##ORIGIN= Bruker BioSpin GmbH
$$ ##OWNER= she
$$ F:/spectra/data/she/nmr/H-F/1/audita.txt
$$ ##AUDIT TRAIL=  $$ (NUMBER, WHEN, WHO, WHERE, WHAT)
(   1,<2020-08-27 12:36:46.70 +0400>,<she>,<DPX200>,
      <created by zg, POWCHK disabled, PULCHK disabled
       configuration hash MD5:
       00 E9 B6 7A A2 85 ED C7 34 08 36 98 17 FE 4E 26
       data hash MD5: 16K
       57 02 96 8E C3 F1 47 B8 32 BD 63 26 2A BA 1D 26>)
$$ ##END=
$$ 
$$ hash MD5
$$ 0C 63 6E 56 E4 BD B9 E3 00 D1 52 5B 13 36 0E E5
##$RELAX= 
##$RELAX= 
##$RELAX= 
##$RELAX= 
##$RELAX= 
##$RELAX= 
$$ Bruker specific parameters
$$ --------------------------
##$DU= <F:/spectra>
##$EXPNO= 1
##$NAME= <H-F>
##$PROCNO= 1
##$TYPE= <nmr>
##$USER= <she>
##$AMP= (0..31)
100 100 100 100 100 100 100 100 100 100 100 100 100 100 100 100 100 100 
100 100 100 100 100 100 100 100 100 100 100 100 100 100 
##$AQSEQ= 0
##$AQ_mod= 1
##$AUNM= <au_zg>
##$AUTOPOS= <>
##$BF1= 200.13
##$BF2= 200.13
##$BF3= 200.13
##$BF4= 200.13
##$BF5= 200.13
##$BF6= 200.13
##$BF7= 200.13
##$BF8= 200.13
##$BYTORDA= 1
##$CFDGTYP= 0
##$CFRGTYP= 5
##$CHEMSTR= <none>
##$CNST= (0..31)
1 1 145 1 1 1 1 1 1 1 1 1 1 1 1 1 1 1 1 1 1 1 1 1 1 1 1 1 1 1 1 1 
##$CPDPRG= <>
##$CPDPRG1= <>
##$CPDPRG2= <>
##$CPDPRG3= <>
##$CPDPRG4= <mlev>
##$CPDPRG5= <mlev>
##$CPDPRG6= <mlev>
##$CPDPRG7= <mlev>
##$CPDPRG8= <mlev>
##$CPDPRGB= <>
##$CPDPRGT= <>
##$D= (0..31)
0 1.2 0 0 0 0 0 0 0 0.06 0 0.03 0 0 0 0 0.0002 0 0 0 0 0 0 0 0 0 0 0 0 
0 0 0 
##$DATE= 1598517406
##$DBL= (0..7)
120 120 120 120 120 120 120 120 
##$DBP= (0..7)
150 150 150 150 150 150 150 150 
##$DBP07= 0
##$DBPNAM0= <>
##$DBPNAM1= <>
##$DBPNAM2= <>
##$DBPNAM3= <>
##$DBPNAM4= <>
##$DBPNAM5= <>
##$DBPNAM6= <>
##$DBPNAM7= <>
##$DBPOAL= (0..7)
0.5 0.5 0.5 0.5 0.5 0.5 0.5 0.5 
##$DBPOFFS= (0..7)
0 0 0 0 0 0 0 0 
##$DE= 6
##$DECBNUC= <off>
##$DECIM= 32
##$DECNUC= <off>
##$DECSTAT= 4
##$DIGMOD= 1
##$DIGTYP= 9
##$DL= (0..7)
0 120 120 120 120 120 120 120 
##$DP= (0..7)
150 150 150 150 150 150 150 150 
##$DP07= 0
##$DPNAME0= <>
##$DPNAME1= <>
##$DPNAME2= <>
##$DPNAME3= <>
##$DPNAME4= <>
##$DPNAME5= <>
##$DPNAME6= <>
##$DPNAME7= <>
##$DPOAL= (0..7)
0.5 0.5 0.5 0.5 0.5 0.5 0.5 0.5 
##$DPOFFS= (0..7)
0 0 0 0 0 0 0 0 
##$DQDMODE= 0
##$DR= 18
##$DS= 0
##$DSLIST= <SSSSSSSSSSSSSSS>
$$ [...]
##$SUBNAM2= <"">
##$SUBNAM3= <"">
##$SUBNAM4= <"">
##$SUBNAM5= <"">
##$SUBNAM6= <"">
##$SUBNAM7= <"">
##$SUBNAM8= <"">
##$SUBNAM9= <"">
##$SW= 16.880792210976
##$SWIBOX= (0..15)
0 0 2 0 0 0 0 0 0 0 0 0 0 0 0 0 
##$SW_h= 3378.37837837838
##$TD= 16384
##$TD0= 1
##$TE= 0
##$TE2= 300
##$TE3= 300
##$TEG= 300
##$TL= (0..7)
0 120 120 120 120 120 120 120 
##$TP= (0..7)
150 150 150 150 150 150 150 150 
##$TP07= 0
##$TPNAME0= <>
##$TPNAME1= <>
##$TPNAME2= <>
##$TPNAME3= <>
##$TPNAME4= <>
##$TPNAME5= <>
##$TPNAME6= <>
##$TPNAME7= <>
##$TPOAL= (0..7)
0.5 0.5 0.5 0.5 0.5 0.5 0.5 0.5 
##$TPOFFS= (0..7)
0 0 0 0 0 0 0 0 
##$TUNHIN= 0
##$TUNHOUT= 0
##$TUNXOUT= 0
##$USERA1= <user>
##$USERA2= <user>
##$USERA3= <user>
##$USERA4= <user>
##$USERA5= <user>
##$V9= 5
##$VALIST= <valist>
##$VCLIST= <CCCCCCCCCCCCCCC>
##$VD= 0
##$VDLIST= <DDDDDDDDDDDDDDD>
##$VPLIST= <PPPPPPPPPPPPPPP>
##$VTLIST= <TTTTTTTTTTTTTTT>
##$WBST= 1024
##$WBSW= 4
##$XGAIN= (0..3)
0 0 0 0 
##$XL= 0
##$YL= 0
##$YMAX_a= 400921
##$YMIN_a= -429507
##$ZGOPTNS= <>
##$ZL1= 120
##$ZL2= 120
##$ZL3= 120
##$ZL4= 120
##$ABSF1= 10
##$ABSF2= 0
##$ABSG= 5
##$ABSL= 3
##$ALPHA= 0
##$AQORDER= 0
##$ASSFAC= 0
##$ASSFACI= 0
##$ASSFACX= 0
##$ASSWID= 0
##$AUNMP= <proc_1d>
##$AZFE= 0.1
##$AZFW= 0.1
##$BCFW= 1
##$BC_mod= 2
##$BYTORDP= 1
##$COROFFS= 0
##$CY= 11.3945322036743
##$DATMOD= 1
##$DC= 2
##$DFILT= <>
##$DTYPP= 0
##$F1P= 16.9975609425685
##$F2P= -3.02152046262296
##$FCOR= 0.5
##$FTSIZE= 0
##$FT_mod= 4
##$GAMMA= 1
##$GB= 0.15
##$INTBC= 1
##$INTSCL= 1
##$ISEN= 128
##$LB= 0.24
##$LEV0= 0
##$LPBIN= 0
##$MAXI= 10000
##$MC2= 0
##$MEAN= 0
##$ME_mod= 0
##$MI= 1.114404
##$NCOEF= 0
##$NC_proc= 0
##$NLEV= 6
##$NOISF1= 3.799351
##$NOISF2= 2.8
##$NSP= 1
##$NTH_PI= 0
##$NZP= 0
##$OFFSET= 15.70392
##$PC= 1
##$PHC0= -9973.25
##$PHC1= 12.40092
##$PH_mod= 1
##$PKNL= yes
##$PPARMOD= 0
##$PSCAL= 0
##$PSIGN= 0
##$REVERSE= no
##$SF= 200.130013532006
##$SI= 16384
##$SIGF1= 3
##$SIGF2= 2
##$SINO= 400
##$SIOLD= 16384
##$SREGLST= <1H.CDCl3>
##$SSB= 0
##$STSI= 0
##$STSR= 0
##$SW_p= 3612.71676300578
##$SYMM= 0
##$S_DEV= 0
##$TDeff= 0
##$TDoff= 0
##$TI= <>
##$TILT= no
##$TM1= 0
##$TM2= 0
##$TOPLEV= 0
##$USERP1= <user>
##$USERP2= <user>
##$USERP3= <user>
##$USERP4= <user>
##$USERP5= <user>
##$WDW= 1
##$XDIM= 8192
##$YMAX_p= 0
##$YMIN_p= 0
$$ End of Bruker specific parameters
$$ ---------------------------------
##NTUPLES= NMR FID
##VAR_NAME=  TIME,          FID/REAL,        FID/IMAG
##SYMBOL=    X,             R,               I
##VAR_TYPE=  INDEPENDENT,   DEPENDENT,       DEPENDENT
##VAR_FORM=  AFFN,          ASDF,            ASDF
##VAR_DIM=   8192,          8192,            8192
##UNITS=     SECONDS,       ARBITRARY UNITS, ARBITRARY UNITS
##FACTOR=    0.000296,      1,               1
##FIRST=     0,             0,               0
##LAST=      2.424536,      0,               0
##MIN=       0,             -429507,         0
##MAX=       2.424536,      400921,          0
$$ Real data points
##PAGE= N=1
##DATA TABLE= (X++(R..R)), XYDATA
$$ [...]
$$ plain form
2076 1672 -4957 2150 2844 -4663 440 3710 -3453 -747 2671 -1847 -1269 997 -348 -388 -59 541
2092 541 1176 -1330 -121 2858 -2016 -1350 3925 -1425 -2691 4218 -306 -3387 3944 854 -3940 3026
2108 3026 2070 -3363 1409 2250 -2322 103 1677 -1045 39 631 385 252 -664 886 1379 -2042 216
2125 216 2510 -2780 -769 3162 -2441 -1970 3718 -1595 -2456 3438 -139 -3023 2460 321 -2739 1225
2141 1225 193 -1869 344 110 -625 214 -556 231 342 -1525 825 590 -2640 587 1632 -2918 207
2158 207 2395 -2623 -269 2903 -1903 -988 2960 -1197 -1365 2301 -696 -1613 1229 -215 -830 837
2174 837 8 230 885 -103 1176 238 -1264 1324 461 -1923 1634 1094 -2392 1293 2029 -2170 742
2191 742 2205 -1941 0 2024 -1559 -753 1567 -847 -210 1208 -438 -39 413 -85 784 -449 -887
$$ packed form
2076A672o629P107O94p507N103L270p163K706L418m518N78K266j345m0L29O00
2092E41O35k506J209K979m874O66N275n350j266O909m524l081P331l090m794O966
2108C026r56n433M772Q41m572K425J574k722J084N92k46j33r16J550M93l421K258
2125B16K294n290K011L931n603M71N688n313q61N894l577k884N483k139l060L964
2141A225j032k062K213k34p35Q39p70P87J11j867K350k35l230L227J045m550L125
2158B07K188n018K354L172m806R15L948m157j68L666k997r17K842j444o15J667
2174H37q29K22O55r88J279r38j502K588q63k384L557n40l486L685P36m199K912
2191G42J463m146J941K024l583Q06K320k414O37J418j646L99M52m98Q69j233m38
$$ plain form
2208 -887 530 -887 -1350 1396 -449 -1903 1564 473 -2237 1313 881 -2497 554 1231 -1988 -207
2224 -207 896 -1422 -425 707 -998 -479 254 -63 116 -403 -22 510 -696 -558 1046 -823 -923 1330
2242 1330 -53 -1227 1552 422 -1465 1403 747 -1430 708 704 -1251 281 830 -539 147 493 160
2259 160 321 245 257 543 -393 230 928 -829 -329 1127 -545 -565 1460 50 -687 1331 166 -1100
2277 -1100 920 456 -1218 255 342 -566 -37 324 -248 191 233 131 -266 -377 270 -18 -849 100 198 -1122
2297 -1122 -320 751 -977 -557 864 -317 -703 840 -48 -956 73 -250 -687 -83 100 59 -302 88
2315 88 158 -78 -123 480 -20 -540 407 158 -746 243 776 -786 341 1302 -565 -20 1066 -246 -379
2334 -379 717 -257 -422 433 255 -167 -113 449 692 69 29 1040 -260 -673 765 -92 -1169 509 237
$$ packed form
2208h87J417j417m63K746j845j454L467j091k710L550m32l378L051O77l219J781
2224b07J103k318R97J132j705N19P33l17J79n19L81N32j206J38J604j869j00K253
2242A330j383j174K779j130j887K868o56k177K138mj955J532N49j369O86L46l33
2259A60J61p6J2K86r36O23O98j757N00J456j672k0K025j410p37K018j165j266
2277a100K020m64j674J473Q7r08N29L61n72M39M2j02l97j11O47k88q31R49R8j320
2297a122Q02J071j728M20J421j181l86J543q88r08J029l23m37O04J83m1l61L90
2315H8P0k36m5O03n00n20R47k49r04R89N33j562J127R61j867N45J086j312j33
2334c79J096r74j65Q55j78m22N4N62K43o23m0J011j300m13J438q57j077J678k72
$$ plain form
2353 237 -1210 668 831 -963 146 755 -656 -232 360 -523 -458 -118 -231 -156 -151 -279 324 -461 -122 960
2373 960 -714 -896 1140 -487 -1321 940 -245 -1477 843 672 -1222 876 721 -1164 396 464 -805
2390 -805 102 269 -402 29 28 40 642 -275 125 1140 -558 -123 1474 -571 -694 1520 -603 -1068 1657
2409 1657 -223 -1078 1708 543 -1152 1264 600 -896 849 535 -828 380 -83 -366 364 -252 319
2426 319 709 -582 238 940 -1045 -190 1157 -1495 -639 1662 -1291 -788 1373 -952 -968 1704 -349
2443 -349 -1332 1249 -446 -1434 621 -181 -1089 167 -69 -67 132 -493 531 218 -812 601 565 -1472
2461 -1472 451 977 -1974 298 1657 -1771 -90 2039 -1068 -534 2049 -1035 -951 1440 -47 -589
2477 -589 804 376 -184 97 362 660 -305 -339 1483 -94 -1092 1690 35 -1855 1548 897 -2099 1230
$$ packed form
2353B37j447J878J63j794J109O09j411M24N92q83O5L40j13P5Nj28O03p85L39J082
2373I60j674j82K036j627q34K261j185j232K320j71j894K098j55j885J560O8j269
2390h05R07J67o71M31jJ2O02r17M00J015j698M35J597k045j23K214k123m65K725
2409A657j880q55K786j165j695K416o64j496J745l14j363J208m63k83P30o16N71
2426C19L90j291Q20P02j985Q55J347k652Q56K301k953N03K161k325j6K672k053
2443c49r83K581j695r88K055q02r08J256k36KJ99o25J024l13j030J413l6k037
2461a472J923N26k951K272J359l428J681K129l107N34K583l084Q4K391j487n42
2477e89J393m28n60K81K65K98r65l4J822j577r98K782j655j890L403o51k996L329
$$ plain form
2495 1230 1496 -1983 486 2056 -1748 -397 1556 -859 -875 550 -156 -675 8 221 305 -900 296
2512 296 1193 -1254 -693 1798 -1139 -1734 2097 -250 -2612 2214 533 -2940 1176 1066 -2506 359
2528 359 1460 -1744 -428 910 -455 -671 82 408 339 -936 875 1171 -1656 67 2053 -1910 -709
2545 -709 2886 -1166 -1727 2977 -488 -2116 3007 184 -2029 2138 873 -1580 949 860 -695 20
2561 20 376 133 154 -516 714 563 -1377 1231 1595 -2372 564 2333 -2477 -170 3032 -2138 -1262
2578 -1262 3176 -1163 -1689 2323 -540 -1996 1501 174 -1198 506 -52 -511 -78 -577 854 -204
2594 -204 -1429 1363 263 -2323 1503 689 -2804 991 1773 -2994 278 2477 -2579 -528 2577 -1662
2610 -1662 -1077 2012 -707 -1056 1524 -362 -467 631 -101 451 -213 -519 1439 -254 -1201 2010 -61
$$ packed form
2495A230K66l479K469J570l804J351J953k415j6J425p06n19O83K13Q4j205J196
2512B96Q97k447N61K491k937n95L831k347k362M826j681l473M116j10l572K865
2528C59J101l204J316J338j365k16P53L26o9j275J811K96k827J723J986l963J201
2545g09L595m052n61M704l465j628N123k823k213M167j265k453K529q9j555P15
2561B0L56k43K1o70J230j51j940K608L64l967K936J769m810K307L202n170Q76
2578a262M438m339n26M012k863j456L497j327j372J704n58m59M33m99J431j058
2594b04j225K792j100k586L826q14l493L795P82m767L272K199n056K051L105m239
2610a662N85L089k719l49K580j886j05J098p32N52o64l06J958j693r47L211k071
$$ plain form
2627 -61 -2022 2069 906 -2758 2146 1639 -2675 1549 2311 -2461 346 2202 -1717 -104 1639 -820
2643 -820 -412 709 -295 6 -311 56 826 -694 -386 1846 -1218 -1161 2450 -948 -2122 2449 6
2660 6 -2706 2098 747 -2706 1369 1462 -2502 513 1088 -1629 87 567 -811 -340 -175 -91 246 -876
2678 -876 520 1026 -1543 -330 1934 -1703 -835 2284 -1350 -1262 2657 -700 -1837 2438 144 -1773
2694 -1773 1674 679 -1750 644 663 -585 324 120 -164 229 -335 578 487 -1179 844 1256 -1481 746
2712 746 1528 -1777 -130 2126 -1491 -574 1896 -771 -1237 2047 -360 -1040 1301 90 -877 569
2728 569 -68 -99 173 -209 87 67 -661 704 117 -1228 652 503 -1452 525 1086 -1912 343 1317
2746 1317 -1393 -398 1218 -1126 -565 1105 -730 -663 647 -470 -357 318 -288 69 -239 -356 295 -226
$$ packed form
2627f1j961M091j163l664M904n07m314M224P62m772K807J856l919J613J743k459
2643h20M08J121j004L01l17L67P70j520L08K232l064N7L611l398j174M571k443
2660Fk712M804j351l453M075R3l964L015N75k717J716M80j378M71J65Q4L37j122
2678h76J396N06k569J213K264l637Q68L119l634Q8L919l357j137M275k294j917
2694a773L447r95k429K394J9j248R09k04k84L93n64R13r1j666K023M12k737K227
2712G46P82l305J647K256l617R17K470k667m66L284k407o80K341j211r67J446
2728E69o37l1K72l82K96k0p28J365n87j345J880j49j955J977N61k998K255R74
2746A317k710R95J616k344N61J670j835O7J310j117J13O75o06L57l08j17O51n21
$$ plain form
2764 -226 -577 880 -91 -711 782 193 -950 676 601 -1066 853 825 -797 368 932 -520 44 760
2782 760 -52 8 283 -102 72 123 -44 273 -380 -298 911 -62 -518 614 -457 -741 820 -264 -953
2801 -953 693 -48 -1129 428 189 -685 -17 62 -511 5 122 -256 -73 -34 -586 126 -388 -299 129 -581
2821 -581 -251 209 -369 -386 452 -440 -528 679 -123 -571 345 -192 -502 516 124 -358 472 273 -221 351
2841 351 81 -258 228 95 -64 113 -156 393 126 -126 193 436 -168 354 756 -170 34 605 -162 -93
2861 -93 910 -180 -316 748 -224 -253 394 211 -524 97 -73 -229 -90 461 258 -371 -349 315 -177 -287
2881 -287 55 2 -585 4 308 -720 -60 394 -584 -426 451 -465 -508 243 -257 -465 73 271 -138 -222 501
2902 501 -96 -357 129 134 -476 -226 368 -160 -359 342 -213 -514 543 526 -551 268 570 -77 -146 484 225
$$ packed form
2764b26l51J457r71o20J493n89j143J626p5j667J919k8j622J165N64j452N64P16
2782G60q12O0K75l85J74N1j67L17o53Q2J209r73m56J132j071k84J561j084o89
2801i53J646p41j081J557k39q74O68P9n73N16J17l78J83L9n52P12n14Q9M28p10
2821e81L30M60n78j7Q38q92q8J207q02m48R16n37l10J018l92m82Q30j99m94N72
2841C51k70l39M86j33j59J77k69N49k67k52L19K43o04N22M02r26K04N71p67O9
2861i3J003j090j36J064r72k9O47j83p35O21j70j56J39N51k03o29K2O64m92j10
2881b87L42n3n87N89L04j028O60M54r78J58Q77r16m3P51n00k08N38J98m09q4P23
2902E01n97k61M86No10K50N94n28j99P01n55l01J057j7j077Q19L02o47o9O30k59
$$ plain form
2923 225 -173 369 197 -10 133 596 139 -113 548 408 -475 242 482 -434 -73 816 -49 -323 612 328
2943 328 -217 109 174 -428 201 377 -384 -451 -24 268 -352 -144 128 -112 -645 252 -52 -561 78 161 -608
2964 -608 -240 555 -318 -244 238 -364 -623 303 7 -462 -184 256 -263 -275 166 -112 -249 23 183 -308 -369
2985 -369 338 -108 -400 616 74 -523 284 705 -428 -42 694 -297 -130 443 -95 -239 504 307 -157
3004 -157 -40 347 24 89 84 406 -158 -164 808 192 -666 663 343 -778 397 536 -1161 -40 575 -419
3024 -419 -42 634 -442 -128 281 -243 -110 -41 -95 -102 -40 112 232 -137 -14 396 -442 -431 650 -299 -629
3045 -629 517 -32 -917 397 281 -705 115 648 -502 201 602 -430 -62 278 -236 -199 4 53 -25 20
3065 20 155 367 -359 161 589 -334 67 990 -115 -302 690 -54 -143 792 350 -417 650 336 -691 325
$$ packed form
2923B25l98N42j72k07J43M63m57k52O61j40q83P17K40r16L61Q89q65k74R35k84
2943C28n45L26O5o02O29J76p61o7M27K92o20K08K72k40n33Q97l04n09O39Q3p69
2964f08L68P95q73P4M82o02k59R26k96m69K78M40n19j2M41k78j37K72J60m91o1
2985c69P07m46k92J016n42n97Q07M21j133L86P36r91J67N73n38j44P43j97m64
3004a57J17L87l23O5nL22n64oR72o16q58J329l20j121J175J39j697J121O15r94
3024d19L77O76j076L14M09n24J33O9n4pO2J52J20l69J23M10q38J1J081r49l30
3045f29J146n49q85J314j16r86Q20N33j150P03M01j032L68L40n14L7K03M9p8M5
3065B0J35K12p26N20M28r23M01R23j105j87R92p44q9R35m42p67J067l14j027J016
$$ plain form
3085 325 519 -433 279 611 15 -35 142 108 -77 -34 103 126 -434 164 644 -438 -4 539 -673 -521 828
3106 828 -212 -619 663 -68 -592 326 143 -610 167 247 -673 -281 -22 -127 -283 -120 223 -411 -475 427
3126 427 85 -733 457 129 -781 159 729 -708 -241 934 -258 -469 971 -122 -496 444 301 -300
3144 -300 167 407 -147 -66 771 246 -253 -252 520 -376 -321 826 222 -623 458 651 -801 227 784 -574
3164 -574 52 954 -649 -408 914 25 -441 188 151 -444 30 178 -168 -43 -49 342 -122 -213 730 -396
3184 -396 -650 277 -31 -1026 329 301 -1123 273 711 -832 -204 392 -556 -550 287 -341 -496 145 50 -299
3204 -299 -51 149 -70 -252 -32 394 -593 -269 572 -321 -611 779 -78 -593 509 430 -682 354 743
3223 743 -714 -147 800 -99 56 506 -7 -88 179 404 3 -220 153 301 -302 -43 707 -405 -178 835
$$ packed form
3085C25J94r52P12L32n96n0J77l4j85M3J37K3n60N98M80j082M34N43j212J52J349
3106H28j040m07J282p31n24R18j83p53P77Q0r20L92K59j05j56J63L43o34o4R02
3126D27l42q18J190l28r10R40N70j437M67J175j192k11J440j093l74R40j43o01
3144c00M67K40n54Q1Q37n25m99JP72q96N5J147o04q45J081J93j452J028N57j358
3164e74O26R02j603K41J322q89m66O29l7n95M74J48l46J25oL91m64r1R43j126
3184c96k54R27l08r95J355k8j424J396M38j543O28N96r48OQ37o28j55O41r5l49
3204b99K48K00k19j82K20M26r87L24Q41q93k90J390q57n15J102p9j112J036L89
3223G43j457N67R47q99J55M50n13q1K67K25m01k23L73J48o03K59P50j112K27J013
$$ plain form
3243 835 -277 -598 487 -147 -530 586 87 -476 378 366 -761 80 312 -209 -307 68 -108 -80 39 356
3263 356 -91 -118 21 22 -688 371 247 -967 -166 450 -471 -302 718 -402 -312 585 -272 -541 214 -84
3283 -84 -473 260 240 -199 206 158 -148 -54 -64 484 -38 -316 375 254 -292 311 529 -442 346 829 -317
3304 -317 83 889 -164 -212 685 -390 -541 393 -46 -148 271 -222 -75 136 62 283 -198 -313 241 -100
3324 -100 -375 327 -115 -775 570 379 -821 133 371 -652 -50 490 -304 -24 84 -433 -235 138 -217
3343 -217 -45 82 -235 -22 -41 -197 -78 -292 -224 13 -435 -367 265 -47 -414 452 331 -412 371 378 -530 154
3365 154 257 -330 69 271 -220 74 291 -3 182 118 253 348 -345 54 338 -4 -109 457 -108 -189 471
3386 471 -220 -279 670 -295 -531 408 259 -570 75 52 -465 351 -49 40 134 190 -26 127 -411 -175 130 -569
$$ packed form
3243H35j112l21J085o34l83J116m99n63Q54j2j127Q41K32n21r8L75j76K8J19L17
3263C56m47k7J39Jp10J059j24j214Q01O16r21J69J020j120R0Q97q57k69P55k98
3283h4l89P33k0m39M05m8l06R4j0N48n22k78O91j21n46O03K18r71P88M83j146
3304c17M00Q06j053m8Q97j075j51R34m39j02M19m93J47K11p4K21m81j15N54l41
3324a00k75P02m42o60J345j91j200R54K38j023O02N40p94K80J08n17J98L73l55
3343b17J72J27l17K13j9j56J19k14O8K37m48O8O32l12l67Q66j21p43P83Pr08O84
3365A54J03n87L99K02m91K94K17k94J85o4J35R5o93L99K84l42j05N66n65q1O60
3386D71o91n9R49r65k36R39j49q29O45k3n17Q16m00Q9R4N6k16J53n38K36L05o99
$$ plain form
3408 -569 -93 261 -677 66 745 -245 -280 306 -223 -248 361 -278 -567 161 -246 -209 57 -93 -206 141 150 233
3430 233 126 -258 121 -113 -134 180 -105 -274 62 273 -282 153 448 -318 230 474 -329 -82 391 -99
3450 -99 -192 195 231 97 36 -33 222 315 -90 470 -43 -174 345 58 -288 538 95 -291 332 233 -308 464
3472 464 345 -431 9 191 -462 -167 15 -288 133 167 -230 291 -120 -149 151 -94 -157 233 -101 -645 195
3493 195 -156 -499 321 -31 -771 542 158 -478 88 -199 -633 145 -50 -320 277 68 -133 93 -108 192
3513 192 372 -101 -214 240 -169 -183 387 -219 -75 607 -191 -8 408 -163 -3 448 23 -206 411 219
3533 219 -133 548 15 -220 413 -153 -19 233 -226 60 218 -260 203 163 -379 50 201 -344 -129 191
3553 191 -612 80 419 -553 -196 262 -250 -372 91 -149 -172 144 13 132 84 -214 67 142 -614 28 -156
$$ packed form
3408e69M76L54r38P43O79r90l5N86n29k5O09o39k89P28m07L7K66j50j13L47RQ3
3430B33j07l84L79k34k1L14k85j69L36K11n55M35K95p66N48K44q03K47M73m90
3450i9r3L87L6j34o1o9K55R3m05N60n13j31N19k87l46Q26m43l86O23r9n41P72
3472D64j19p76M40J82o53K95J82l03M21L4l97N21m11k9L00k45o3L90l34n44Q40
3493A95l51l43Q20l52p40J313l84o36N66k87m34P78j95k70N97k09k01K26k01L00
3513A92J80m73j13M54m09j4N70o06J44O82p98J83M16n71J60M51m25k29O17j92
3533B19l52O81n33k35O33n66J34K52m59K86J58m78M63m0n42M29J51n45K15L20
3553A91q03O92L39r72L57M58n12j22M63k40k3L16j31J19m8k98K81P5p56O42j84
$$ plain form
3574 -156 -472 132 36 -466 202 63 -572 124 553 -413 121 216 -603 180 79 -260 93 -100 -260 204 163
3595 163 -488 364 -118 -251 353 109 -321 429 -71 -430 388 -9 -494 469 151 -374 420 101 -246 99
3615 99 8 -353 238 -92 -234 273 -208 -133 147 -131 -281 416 -46 -481 194 -427 -485 309 -185 -589 309
3636 309 -416 -386 450 -170 -348 476 55 -359 173 -295 -23 -102 -97 -304 186 -110 176 159 -204 -125 166 -97
3658 -97 -163 450 -235 -52 349 -207 -364 654 -176 -358 469 -196 -100 49 34 -332 380 -84 113 246 76
3679 76 7 289 -28 376 84 -81 231 273 -376 302 387 -600 368 430 -340 -27 328 -361 -124 126 -354 -86
3701 -86 317 -208 105 -129 42 60 31 -57 -121 -314 -36 71 -209 -282 21 -170 -597 385 24 -455 85 242
3723 242 -493 191 168 -370 -89 161 -346 117 -116 -189 -131 399 -46 62 122 2 112 -136 -251 264 -124
$$ packed form
3574a56l16O04r6n02O68j39o35O96M29r66N34R5q19P83j01l39L53j93j60M64m1
3595A63o51Q52m82j33O04k44m30P50n00l59Q18l97m85R63l18n25P94l19l47L45
3615I9r1l61N91l30j42N07m81P5K80k78j50O97m62m35O75o21n8P94m94m04Q98
3636C09p25L0Q36o20j78Q24m21m14N32m68K72p9Nk07M90k96K86j7l63P9K91k63
3658i7o6O13o85J83M01n56j57J018q30j82Q27o65R6J49j5l66P12m64J97J33j70
3679G6o9K82l17M04k92j65L12M2o49O78Q5r87R68O2p70L13L55o89K37K50m80K68
3701h6M03n25L13k34J71J8k9q8o4j93K78J07k80p3L03j91m27R82l61m79N40J57
3723B42p35O84k3n38K81K50n07M63k33p3N8N30m45J08O0j20J10k48j15N15l88
$$ plain form
3744 -124 -159 431 273 -416 254 178 -260 607 177 -327 472 217 -159 330 87 -301 197 123 89 77 -58 235
3766 235 -67 25 -60 75 -210 -195 285 -383 -192 175 -262 -176 326 -277 -201 158 -83 -543 74 -97 -331 40
3788 40 -57 -277 27 -389 -31 10 79 18 -15 -230 -27 186 -68 104 271 -419 -135 136 43 51 279 -147 -564
3811 -564 73 -150 41 251 56 -32 33 269 -53 -76 151 250 301 -31 -28 11 -102 131 124 -176 418 152 -228
3834 -228 -134 401 -313 -5 224 -253 79 305 -56 -40 -86 -167 71 -83 -15 16 61 1 369 -27 -292 162 -76
3857 -76 -333 23 90 -305 -140 194 -189 -80 -9 -103 51 107 -192 -36 168 -266 26 -63 -197 -101 -191 -58 73
3880 73 -59 -136 241 -23 -69 223 -64 -128 34 233 -221 99 74 62 100 25 7 50 -4 107 -38 -274 23 76
3904 76 -220 90 283 -137 262 683 84 -20 90 -328 -296 392 -18 -291 316 230 -97 72 -54 -234 140
$$ packed form
3744a24l5N90j58o89O70p6m38Q67m30n04P99k55l76M89k43l88M98p4l4j2j35K93
3766B35l02R2q5J35k85J5M80o68J91L67m37Q6N02o03P6L59k41m60O17j71k34L71
3788D0r7k20L04m16L58M1O9o1l3k15K03K13k54J72J67o90K84K71r3QK28m26m17
3811e64O37k23J91K10j95q8O5K36l22k3K27R9N1l32LL9j13K33pl00N94k66l80
3834b28R4N35p14L08K29m77L32K26l61J6m6q1K38j54O8L1M5o0L68l96k65M54k38
3857g6k57L56O7l95J65L34l83J09P1r4J54N6k99J56K04m34K92q9j34R6r0J33J31
3880G3j32p7L77k64m6K92k87o4J62J99m54L20k5j2L8p5j8M3n4J11j45k36K97N3
3904G6k96L10J93m20L99M21n99j04J10m18L2O88m10k73O07q6l27J69j26j80L74
$$ plain form
3925 140 4 -132 44 -252 130 -76 -237 60 -30 -432 -208 180 -373 -41 421 -208 -149 317 -300 -256 430
3946 430 106 -207 219 -165 -117 147 167 -11 5 112 269 173 -390 22 218 -183 38 284 -61 4 401 -317
3968 -317 45 372 -192 30 448 0 40 394 20 -290 183 39 -207 308 305 234 150 -197 438 115 -345 -9
3990 -9 240 11 371 249 -206 -41 -116 -374 253 97 -374 -48 289 -50 -247 110 -184 -30 101 -230 34
4011 34 -258 45 225 -336 -325 47 -233 -197 336 -148 -371 80 -273 -174 -11 31 -169 -158 103 -466 182 148
4033 148 -210 150 108 81 45 -55 -117 -19 -250 112 247 -318 -91 356 -241 14 144 -204 -3 425 -57 -464
4055 -464 150 108 67 121 287 -250 148 -62 -450 173 -225 -78 -10 -382 -156 298 -137 189 175 -320 -190 236
4077 236 -189 100 423 -320 -99 266 -313 -234 144 236 -160 52 91 -87 101 114 54 3 -32 -104 111 -218 312
$$ packed form
3925A40j36j36J76k96L82k06j61K97r0m02K24L88n53L32M62o29N9M66o17M4O86
3946D30l24l13M26l84M8K64K0j78J6J07J57r6n63M12J96m01K21K46l45O5L97p18
3968c17L62L27n64K22M18m48M0L54l74l10M73j44k46N15lp1q4l47O35l23m60L36
3990iK49k29L60j22m55J65p5k58O27j56m71L26L37l39j97L57k94J54J31l31K64
4011C4k92L03J80n61J1L72k80L6N33m84k23M51l53R9J63M2k00J1K61n69O48l4
4033A48l58L60m2k7l6j00o2R8k31L62J35n65K27M47n97K55J30l48K01M28m82m07
4055d64O14m2m1N4J66n37L98k10l88O23l98J47O8l72K26M54m35L26j4m95J30M26
4077B36m25K89L23p43K21L65n79P9L78R2l96K12L9j78J88J3o0n1l5p2K15l29N30
$$ plain form
4100 312 25 -475 -12 193 -32 72 523 -185 23 275 -71 60 383 -40 -153 357 -6 67 194 161 -10
4121 -10 104 177 52 45 5 11 96 -9 288 166 -154 271 100 -114 125 237 -360 250 432 -226 -63 418 -335
4144 -335 -186 154 -105 -286 213 -35 -66 -91 -96 -211 -140 175 194 -109 13 160 -226 -363 189 -20 -401 23
4166 23 -28 -432 10 156 -75 -66 90 -8 -10 214 33 -116 77 -189 -53 60 -117 -17 205 -34 64 12 62
4189 62 407 125 281 352 203 -131 141 192 -115 213 25 -155 145 119 -216 -58 7 381 42 198 -25 9
4211 9 -27 57 43 -142 -1 401 -304 -173 99 -50 -188 126 -7 10 87 79 -134 70 -3 23 94 27 -111 -32 114
4236 114 3 268 -108 -24 -223 -180 -243 288 257 111 -177 -150 -101 204 -229 58 144 -405 -225 152 -156 -298
4258 -298 -40 228 -94 76 263 134 -62 74 -27 -83 -42 -10 -22 -3 82 -150 235 240 213 0 66 123 -82 265
$$ packed form
4100C12k87n00M63K05k25J04M51p08K08K52l46J31L23m23j13N10l63P3J27l3j71
4121a0J14P3j25pm0OQ5j05K97j22l20M25j71k14K39J12n97O10J82o58J63M81p53
4144c35J49L40k59j81M99k48l1k5nj15P1L15J9l03J22J47l86j37N52k09l81M24
4166B3n1m04M42J46k31RJ56r8kK24j81j49J93k66J36J13j77J00K22k39R8n2N0
4189F2L45k82J56P1j49l34K72N1l07L28j88j80L00k6l35J58O5L74l39J56k23L4
4211Il6Q4j4j85J41M02p05J31K72j49j38L14j33J7P7qk13K04p3K6P1o7j38P9J46
4236A14j11K65l76Q4j99M3o3N31l1j46k88K7M9L05m33K87Q6n49J80L77l08j42
4258b98K58K68l22J70J87j29j96J36j01n6M1L2j2J9Q5k32L85Nk7k13O6N7k05L47
$$ plain form
4282 265 259 7 21 101 -113 -116 -18 -41 -134 326 211 -59 -101 60 65 47 -118 -103 -343 120 31 -14 -236 -180 136 -129
4308 -129 11 -139 -223 -141 154 -32 -234 26 -33 31 212 -96 -135 149 42 -197 -130 -208 -10 231 -15 74 35
4331 35 123 191 -33 87 54 -107 -228 195 -14 -112 344 -49 48 58 210 74 -89 79 -164 251 175 80 -34
4354 -34 -39 -160 145 50 -119 134 -67 51 -75 -350 -196 191 -192 -128 -292 -120 -80 -192 -32 -130 144 68 -103
4377 -103 38 213 -13 -185 11 197 29 -261 11 -74 -216 -147 177 83 -228 108 -225 -305 114 -83 17
4398 17 -102 -239 55 80 -58 71 136 -18 -76 122 -22 -13 50 216 107 49 -245 217 309 -28 56 25 -281 256
4422 256 -128 -151 287 20 1 139 -199 62 -154 -113 -5 30 119 -121 -4 156 -52 109 -18 25 140 -9
4444 -9 -55 107 -2 -250 175 -97 -68 201 -120 -161 92 48 31 155 -113 0 146 -1 15 182 -468 116 70
$$ packed form
4282B65ok52J4Q0k14lR8k3r3M60j15k70m2J61Nj8j65J5k40M63q9m5k22N6L16k65
4308a29J40j50q4Q2K95j86k02K60n9O4J81l08l9K84j07k39O7p8J98K41k46Q9l9
4331C5Q8O8k24J20l3j61j21M23k09r8M56l93R7J0J52j36j63J68k43M15p6r5j14
4354c4nj21L05r5j69K53k01J18j26k75J54L87l83O4j64J72M0j12J60r8K74p6j71
4377a03J41J75k26j72J96J86j68k90K72q5j42O9L24r4l11L36l33q0M19j97J00
4398A7j19j37K94K5j38J29O5j54n8J98j44RO3J66j09n8k94M62R2l37Q4l1l06N37
4422B56l84k3M38k67j9J38l38K61k16M1J08L5Q9k40J17J60k08J61j27M3J15j49
4444im6J62j09k48M25k72K9K69l21m1K53m4j7J24k68J13J46j47J6J67o50N84m6
$$ plain form
4467 70 -3 -49 74 -222 -259 208 -89 -87 75 -179 -278 133 -249 13 -123 24 -372 -123 29 134 152 -105 272
4490 272 -76 58 341 200 -156 59 182 -77 -79 190 -150 125 262 -147 57 335 36 40 10 -136 79 -14
4512 -14 -106 134 -180 -158 124 -82 -243 -39 -283 -304 228 -56 16 180 -103 -243 78 10 -356 46 124 -143
4534 -143 71 -8 -110 32 61 -24 -183 119 -264 150 140 -174 241 -88 -262 317 -238 -381 147 -76 -230
4555 -230 203 -56 116 373 195 -9 133 67 -55 194 176 170 -90 -164 11 223 -248 228 77 99 -80 147
4577 147 6 -52 66 -139 -122 188 1 -192 236 -156 -201 173 10 -172 278 -117 -205 8 -76 -18 134 -94
4599 -94 -13 -206 -70 48 180 -212 -19 237 -202 45 312 -286 53 125 -227 -248 135 -251 24 247 149 -181
4621 -181 70 -202 -83 154 94 131 -129 9 135 21 -81 51 -25 -20 199 77 -106 -29 150 -201 88 496
$$ packed form
4467G0p3m6J23k96l7M67k97KJ62k54r9M11l82K62j36J47l96K49J52J05J8k57L77
4490B72l48J34K83j41l56K15J23k59kK69l40K75J37m09K04K78k99Ml0j46K15r3
4512a4r2K40l14K2K82k06j61K04k44k1N32k84P2J64k83j40L21o8l66M02P8k67
4534a43K14p9j02J42K9q5j59L02l83M14j0l14M15l29j74N79n55j43N28k23j54
4555b30M33k59J72K57j78k04J42o6j22K49j8ok60p4J75K12m71M76j51K2j79K27
4577A47j41n8J18k05J7L10j87j93M28l92m5L74j63j82M50l95q8K13q4N8J52k28
4599i4Q1j93J36J18J32l92J93K56m39K47K67n98L39P2l52k1L83l86K75K23r8l30
4621a81K51k72J19K37o0L7k60J38J26j14j02J32p6NK19j22j83P7J79l51K89M08
$$ plain form
4643 496 -37 96 202 -137 -218 -80 -67 -59 199 142 175 161 168 162 -58 66 70 264 -279 -5 120 -235 48 306
4667 306 38 194 93 -44 111 137 -260 6 251 -189 -8 190 -110 69 13 -7 9 67 236 40 -91 -123
4689 -123 285 -58 -327 78 -111 -127 177 125 -106 -78 105 -289 192 130 -20 20 148 -112 352 199 41 49
4711 49 -107 52 -47 -132 -16 4 -2 28 -49 -57 82 328 158 6 303 -35 -180 24 114 -86 -87 -156 -161 -94 110 95
4737 95 176 10 -3 -3 227 192 -106 18 -334 -215 -62 55 46 -353 -81 101 51 -177 17 -120 -76 -36 136 33
4761 33 262 33 -167 10 266 -115 -23 -121 -210 66 86 -265 179 -111 -25 69 20 -209 -82 -97 144 150 -141 103
4785 103 -1 -75 -122 26 22 31 -4 207 37 -68 136 133 -56 245 77 68 -86 15 150 -62 29 -52 -69 -25 153
4810 153 112 144 43 -183 6 -47 180 -102 -88 -11 -59 60 254 -118 -89 -51 -16 -197 -31 228 11 0 120
$$ packed form
4643D96n33J33J06l39q1J38J3QK58n7L3j4Pok20J24MJ94n43K74J25l55K83K58
4667C06k68J56j01j37J55K6l97K66K45m40J81J98l00J79n6k0J6N8J69j96j31l2
4689a23M08l43k69M05j89j6L04n2k31K8J83l94M81o2j50M0J28k60M64j53j58Q
4711D9j56J59r9q5J16K0oL0p7qJ39K46j70j52K97l38j45K04R0k00jo9nO7K04j5
4737I5Q1j66j3%K30l5k98J24l52J19J53J17rl99K72J82n0k28J94j37M4M0J72j03
4761C3K29k29k00J77K56l81R2r8q9K76K0l51M44k90Q6R4m9k29J27j5K41Ok91K44
4785A03j04p4m7J48mRl5K11j70j05K04lj89L01j68rj54J01J35k12R1q1j7M4J78
4810A53m1L2j01k26J89n3K27k82J4P7m8J19J94l72K9L8L5j81J66K59k17j1J20
$$ plain form
4833 120 123 118 92 -46 -150 46 100 -154 53 195 39 -155 148 -37 36 10 -8 37 -126 -141 291 -4 -91 11
4857 11 76 -31 188 132 185 -56 210 -96 -71 -5 -82 -104 -51 -2 26 -59 -319 -141 -154 20 10 -4 -37 -12 192 -159
4883 -159 28 18 -34 84 -351 -126 225 231 -230 45 -17 -36 35 -188 -139 199 -78 129 -53 -216 -310 -78 -169
4906 -169 -106 25 232 -19 183 -109 -117 -162 -34 -206 -81 -153 -75 162 2 111 281 118 -334 -28 80 76 55
4929 55 85 62 -117 237 111 130 5 -234 125 24 37 -38 -138 106 182 -93 30 208 -103 -348 325 92
4951 92 123 200 -46 21 -38 134 -121 -145 -16 -71 78 229 285 100 80 42 204 -272 126 -305 -225 97 127 -110
4975 -110 -117 92 -58 29 3 49 150 120 -18 -62 -146 -177 -387 48 -4 -94 236 26 194 137 -175 119 -2 -17
4999 -17 107 107 32 162 220 -162 -35 -113 150 -238 -85 -84 131 -113 -34 84 195 8 -55 142 75 37 58 128 38
$$ packed form
4833A20Lnk6j38j04J96N4k54K07J42j56j94L03j85P3k6j8M5j63j5M32k95q7J02
4857A1O5j07K19n6N3k41K66l06K5O6p7k2N3M9K8q5k60J78j3J74j0j4l3K5K04l51
4883a59J87j0n2J18m35K25L51Om61K75o2j9P1k23M9L38k77K07j82j63r4K32r1
4906a69O3J31K07k51K02k92qm5J28j72J25p2P8K37j60J09J70j63m52L06J08mk1
4929E5L0k3j79L54j26J9j25k39L59j01J3p5j00K44P6k75J23J78l11k45O73k33
4951I2L1P7k46O7n9J72k55k4J29n5J49J51N6j85k0l8J62m76L98m31Q0L22L0k37
4975a10pK09j50Q7k6M6J01l0j38m4q4l1k10M35n2r0L30k10J68n7l12K94j21j5
4999a7J24%p5J30N8l82J27p8K63l88J53JK15k44P9J18J11j87o3J97o7l8K1P0r0
$$ plain form
5024 38 -39 142 289 -146 218 211 139 -193 56 -47 -58 32 -76 -135 34 85 -224 -346 -92 17 3 -43 19 8
5048 8 -245 -40 -101 141 -40 104 29 -84 164 -187 -55 -148 -13 -418 32 84 -196 -8 110 57 44 8 -331
5071 -331 19 -21 -8 -33 -220 -69 148 173 59 -79 -104 19 51 203 -153 -5 -50 53 7 -218 -160 -68 210
5094 210 14 139 117 -143 -94 219 194 -158 173 -71 342 95 -175 -112 -16 -50 83 -200 -172 -123 -47 -121 132
5117 132 -43 99 -37 -89 -127 138 226 65 40 7 -57 80 33 104 117 99 -16 -51 34 44 192 -74 185 -189
5141 -189 -89 50 -39 23 99 156 5 -107 -36 -17 199 42 -46 4 134 -57 27 82 -138 115 -144 -158 121 -89
5165 -89 -89 41 89 -39 29 142 7 108 191 -196 203 -103 -288 55 -47 91 -11 244 46 -40 94 -221
5187 -221 51 71 35 130 90 -59 -318 -288 18 -70 -68 -194 65 4 26 109 -402 -130 -100 -353 -9 47 62 91 -71
$$ packed form
5024C8p7J81J47m35L64pp2l32K49j03j1R0j08n9J69N1l09j22K54J09j4m6O2j1
5048Hk53K05o1K42j81J44p5j13K48l51J32r3J35m05M50N2k80J88J18n3j3l6l39
5071c31L50m0J3k5j87J51K17K5j14j38k5J23L2J52l56J48m5J03m6k25N8R2K78
5094B10j96J25k2k60M9L13k5l52L31k44M13k47k70O3R6l4J33k83K8M9P6p4K53
5117A32j75J42j36n2l8K65Q8j61k5l3o4J37m7P1J3j8j15l5Q5J0J48k66K59l74
5141a89J00J39q9O2P6N7j51j12P1J9K16j57q8N0J30j91Q4N5k20K53k59j4K79k10
5165h9%J30M8j28O8J13j35J01Q3l87L99l06j85L43j02J38j02K55j98q6J34l15
5187b21K72K0l6R5m0j49k59L0L06q8Kj26K59o1K2Q3n11K72L0k53L44N6J5K9j62
$$ plain form
5212 -71 288 74 33 -78 151 -28 -22 139 -190 -316 63 -270 -295 63 32 -93 -21 124 -3 -64 42 -215 -10
5235 -10 50 -75 -55 138 211 -60 329 155 158 -75 138 -43 58 -245 288 -17 -152 230 110 -45 33 -28 -101
5258 -101 -168 76 108 79 9 90 64 -108 -46 -169 41 192 -12 -48 -145 114 -16 0 24 -189 23 -53 -41 -150
5282 -150 185 7 -284 -131 -138 -246 -57 -22 -55 171 -41 132 -24 -47 35 284 9 -141 -182 16 132 198 -112
5305 -112 53 87 -54 165 -5 155 133 118 193 -51 91 -48 -104 -110 -130 234 22 -32 49 -196 -166 -6 -183 -177
5329 -177 53 181 -264 -61 -162 -54 205 82 -173 -60 -31 -214 -49 22 -45 -135 -3 -328 -98 -64 -60 -38 -14
5352 -14 74 111 74 -92 37 144 -173 109 53 -169 -6 -115 119 -91 88 49 -10 487 -165 54 327 167
5374 167 -10 -187 -124 -76 2 119 -304 37 -315 47 -7 47 1 -120 99 79 -30 -98 16 205 4 109 25
$$ packed form
5212g1L59k14m1j11K29j79OJ61l29j26L79l33k5L58l1j25P2J45j27o1J06k57K05
5235a0O0j25K0J93P3k71L89j74Lk33K13j81J01l03N33l05j35L82j20j55P8o1p3
5258a01o7K44L2k9p0Q1k6j72O2j23K10J51k04l6r7K59j30J6K4k13K12p6J2j09
5282a50L35j78k91J53pj08J89L5l3K26k12J73j56k3Q2K49k75j50m1J98J16O6l10
5305a12J65L4j41K19j70J60k2j5P5k44J42j39n6ok0L64k12n4Q1k45L0J60j77O
5329a77K30J28m45K03j01J08K59j23k55J13K9j83J65P1o7r0J32l25K30L4MK2K4
5352a4Q8L7l7j66J29J07l17K82n6k22J63j09K34k10J79l9n9M97o52K19K73j60
5374A67j77j77O3M8P8J17m23L41l52L62n4N4m6j21K19k0j09o8J14J89k01J05q4
$$ plain form
5397 25 -6 -83 53 100 148 40 63 -66 1 133 55 18 -43 19 -155 82 35 -65 2 -8 -85 -318 -3 -151 -60
5422 -60 47 -138 41 -22 35 -107 -130 -10 7 202 137 -126 129 -48 -150 -130 -267 -88 35 -178 -124 114 -279
5445 -279 -105 237 -175 -96 269 14 23 39 115 -163 20 27 73 81 132 258 80 -95 -8 143 -214 163 74 32 -17
5470 -17 256 191 14 105 -8 -117 -14 -73 -92 -59 -197 36 -104 43 -79 98 -110 215 69 78 -144 -30 -154
5493 -154 71 -288 124 -11 -135 281 90 30 -51 -57 -239 120 54 69 -133 21 -112 -278 69 109 -74 89
5515 89 -197 52 177 -38 -147 147 129 -39 91 243 79 -11 -58 61 121 106 -85 97 -152 -38 95 76
5537 76 -3 -1 161 -238 161 -91 117 -98 -106 -142 107 89 73 179 69 171 -38 -1 183 -61 7 -27 -20 397 129
5562 129 194 34 -106 184 -61 -174 -166 -199 255 -246 -289 -139 -178 96 27 -125 -181 43 -129 -166 16 76 -37
$$ packed form
5397B5l1p7J36M7M8j08K3j29O7J32p8l7o1O2j74K37m7j00O7j0p7k33L15j48R1
5422f0J07j85J79o3N7j42k3J20J7J95o5k63K55j77j02K0j37J79J23k13N4K38l93
5445b79J74L42m12P9L65k55RJ6P6k78J83PM6QN1J26j78j75Q7J51l57L77q9m2m9
5470a7K73o5j77R1j13j09J03n9j9L3j38K33j40J47j22J77k08L25j46Rk22J14j24
5493a54K25l59M12j35j24M16j91o0q1oj82L59o6J5k02J54j33j66L47M0j83J63
5515H9k86K49J25k15j09K94j8j68J30J52j64r0m7J19O0j5j91J82k49J14J33j9
5537G6p9KJ62l99L99k52K08k15ql6K49j8j6J06j10J02k09L7J84k44O8l4PM17k68
5562A29O5j60j40K90k45j13Ql3M54n01m3J50l9K74o9j52n6K24j72l7J82O0j13
$$ plain form
5585 -37 78 4 67 140 60 14 66 128 185 170 209 -168 150 3 193 283 -20 135 -26 -69 -228 -90 -98 -1 -2 66
5611 66 -213 6 216 -199 74 130 79 100 -72 -47 28 38 -7 155 43 -81 173 5 20 9 -182 -5 73 2
5635 2 84 -136 -125 66 72 148 -79 248 49 -294 1 101 -7 -13 -43 -56 -257 9 -166 -77 133 20 119 79 -240
5660 -240 154 -31 -131 91 128 16 42 -110 -43 146 -48 -71 100 56 -139 231 200 -110 123 108 -203 171
5682 171 35 3 1 105 -115 76 -35 -50 162 -115 -101 51 86 -76 195 -135 -154 -72 -243 17 -14 73 -207
5705 -207 170 77 -67 -84 171 -66 -95 260 -63 -24 -69 80 -81 90 256 78 -298 -74 129 8 -134 208
5727 208 -153 -136 -52 -211 4 -3 124 4 -167 -99 -306 -81 -61 45 83 -1 -75 53 -82 18 137 -28 114
5750 114 44 62 33 -45 -67 27 36 -157 -135 184 -8 -44 137 139 -86 352 72 -306 -73 22 -77 -45 -106 -19 31 108
$$ packed form
5585c7J15p4O3P3q0m6N2O2N7j5L9l77L18j47J90R0l03J55j61m3j59J38qR7jO8
5611F6k79K19K10m15K73N6n1K1j72K5P5J0m5J62j12j24K54j68J5j1j91J77P8p1
5635BQ2k20J1J91OP6k27L27j99l43K95J00j08ol0j3k01K66j75Q9K10j13R9m0l19
5660b40L94j85j00K22L7j12K6j52O7J89j94k3J71m4j95L70l1l10K33j5l11L74
5682A71j36l2kJ04k20J91j11j5K12k77J4J52L5j62K71l30j9Q2j71K60l1Q7k80
5705b07L77r3j44j7K55k37k9L55l23L9m5J49j61J71J66j78l76K24K03j21j42L42
5727B08l61J7Q4j59K15pJ27j20j71O8k07K25K0J06L8q4p4J28j35J00J19j65J42
5750A14p0J8k9p8k2R4Rj93K2L19j92l6J81Kk25M38k80l78K33R5r9L2o1Q7N0P7
$$ plain form
5776 108 91 11 -194 108 10 -224 -12 113 54 -41 -50 -187 -159 114 -73 -240 201 -2 -154 22 -83 -10 -41
5799 -41 270 -141 201 -201 25 152 -54 90 -75 63 31 33 -56 79 -27 326 118 14 -74 -75 -126 -39 189
5822 189 55 -66 -78 199 -61 4 -88 -29 44 201 270 149 -67 91 4 37 2 -35 -11 105 -68 -85 -77 -131 47
5847 47 -82 -87 269 -103 217 198 -62 -12 -132 -124 -155 36 48 123 54 202 128 -109 45 93 -57 60 -47 70
5871 70 -219 168 164 -25 -121 45 -28 -107 -286 121 110 71 26 4 -179 -120 -2 -124 72 201 14 -68 -62 -182 148
5896 148 -195 -40 37 69 85 185 13 -55 -91 -66 71 46 -17 105 92 -72 16 236 -2 117 81 -34 -53 206
5920 206 364 -110 -80 -80 -106 4 29 -178 85 -52 -448 176 -111 30 -64 -133 41 -155 -21 -146 -42 -182
5942 -182 -27 -15 -198 -209 69 212 111 272 -181 -60 87 0 -156 4 -2 -122 -92 73 198 129 130 -168 -150
$$ packed form
5776A08j7q0k05L02r8k34K12J25n9r5rj37K8K73j87j67M41k03j52J76j05P3l1
5799d1L11m11L42m02K26J27k06J44j65J38l2Kq9J35j06L53k08j04q8jn1Q7K28
5822A89j34j21j2K77k60O5r2N9P3J57O9j21k16J58q7L3l5l7K4J16j73j7Qn4J78
5847D7j29nL56l72L20j9k60N0j20Ql1J91J2P5o9J48p4k37J54M8j50J17j07J17
5871G0k89L87mj89r6J66p3p9j79M07j1l9m5k2j83N9J18j22J96J29j87q2Oj20L30
5896A48l43J55P7L2J6J00j72o8l6K5J37k5o3J22j3j64Q8K20k38J19l6j15j9K59
5920B06J58m74L0%k6J10K5k07K63j37l96O24k87J41r4o9J74j96J34j25J04j40
5942a82J55J2j83j1K78J43j01J61m53J21J47q7j56J60oj20L0J65J25o9Jk98J8
$$ plain form
5965 -150 -16 162 -78 87 49 -141 -94 -107 52 -46 256 121 -179 -212 125 14 -103 28 -88 89 -4 94
5987 94 -95 68 -2 -88 76 -104 238 -30 194 61 22 -21 -175 -68 -161 -50 66 -202 36 28 -6 81 168 119
6011 119 67 -60 91 106 -33 51 -7 -34 -6 -28 -29 267 -53 205 -131 -7 128 -8 -12 212 -17 -34 -11 189
6035 189 136 74 171 89 -93 41 302 88 85 -66 -47 105 -139 42 1 276 83 79 78 36 65 179 16 -219 -184
6060 -184 -36 135 -26 25 90 -54 66 165 -124 -13 -198 -39 55 -49 69 115 -194 86 -162 -107 49 9
6082 9 -58 23 231 58 107 -167 -88 34 15 4 -231 68 -124 -69 263 118 27 173 95 -42 -19 78 20 -178 73
6107 73 -69 60 -249 -157 -145 -66 -39 70 347 35 77 9 -233 71 -83 -12 -6 313 41 13 108 75 -106 195
6131 195 100 -9 -143 160 17 -163 100 -164 -76 104 287 -173 136 -85 86 -14 197 -15 -34 14 -93
$$ packed form
5965a50J34J78k40J65l8j90M7j3J59r8L02j35l00l3L37j11j17J31j16J77r3R8
5987I4j89J63p0q6J64j80L42k68K24j33l9m3j54J07r3J11J16k68K38ql4Q7Q7m9
6011A19n2j27J51J5j39Q4n8k7K8k2jK96l20K58l36J24J35j36mK24k29j7K3K00
6035A89n3o2R7q2j82J34K61k14lj51J9J52k44J81m1K75j93mjm2K9J14j63k35L5
6060a84J48J71j61N1O5j44J20R9k89J11j85J59R4j04J18M6l09K80k48N5J56m0
6082Io7Q1K08j73M9k74P9J22j9j1k35K99j92N5L32j45r1J46p8j37K3R7n8j98K51
6107G3j42J29l09R2J2P9K7J09K77l12M2o8k42L04j54P1OL19k72k8R5l3j81L01
6131A95r5j09j34L03j43j80K63k64Q8J80J83m60L09k21J71j00K11k12j9M8j07
$$ plain form
6152 -93 -237 -92 -233 -20 93 -110 -67 -112 -52 -106 33 47 -66 173 -38 -10 242 -8 -114 169 -50 -129 229
6175 229 -159 93 -249 -111 14 -113 65 -70 -22 64 -49 111 -50 -127 -15 -76 37 179 -138 2 157
6196 157 47 -88 57 35 -256 69 172 -6 12 -59 -19 -256 63 40 -233 83 -98 -125 173 -173 242 -120
6218 -120 -216 102 198 166 -18 159 104 59 82 -120 -129 -59 -110 17 -89 -73 56 141 -66 -142 107 -279 -26 -138
6242 -138 -258 20 -285 -231 -24 -17 0 -87 -17 35 113 -175 -14 2 -27 -40 -48 5 1 32 -71 -119 -3 236 62 -86
6268 -86 -194 203 -91 1 -57 -76 -14 267 122 -87 -143 -67 -79 -35 205 39 -33 -299 46 -98 0 57 80 33 39
6293 39 105 -76 -60 -31 303 102 289 206 -38 256 -183 -10 -20 -233 -179 -45 -6 -8 48 -79 128 -93 -18 7
6317 7 107 6 -115 3 87 -16 75 -53 128 -69 -49 14 -131 59 -165 252 -180 31 -177 167 72 43 -81
$$ packed form
6152i3j44J45j41K13J13k03M3m5O0n4J39J4j13K39k11K8K52k50j06K83k19p9L58
6175B29l88K52l42J38J25j27J78j35M8Q6j13J60j61p7J12o1J13J42l17J40J55
6196A57j10j35J45k2k91L25J03j78J8p1M0k37L19k3k73L16j81k7K98l46M15l62
6218a20r6L18R6l2j84J77n5m5K3k02rP0n1J27j06J6J29Q5k07p6K49l86K53j12
6242a38j20K78l05N4K07PJ7q7P0N2P8k88J61J6k9j3qN3mL1j03m8J16K39j74j48
6268h6j08L97k94R2n8j9O2K81j45k09n6P6j2M4K40j66p2k66L45j44R8N7K3m7O
6293C9O6j81J6K9L34k01J87q3k44K94m39J73j0k13N4J34L9kN6j27K07k21P5K5
6317GJ00j01j21J18Q4j03R1j28J81j97K0O3j45J90k24M17m32K11k08L44r5k9j24
$$ plain form
6340 -81 30 140 -43 -52 7 24 -148 -136 267 110 -153 -74 -33 223 55 55 62 -108 -74 -60 -181 -169 18 152 18
6365 18 1 336 197 -170 225 -58 124 98 -7 -40 -43 -126 169 -85 25 -198 45 55 -85 -204 169 32 -65
6388 -65 -157 -52 -183 4 -21 -16 8 94 41 -89 -134 -9 102 -19 -212 177 -301 77 -119 -126 -16 79 -24 -146
6412 -146 231 163 -14 -177 -2 20 -189 -36 -82 12 117 1 87 231 262 -113 41 181 -106 -28 155 68 -25
6435 -25 -55 20 -122 -301 -99 17 -30 17 70 -17 -66 60 93 -360 -28 67 -86 342 17 45 -96 -93 168 107 183
6460 183 13 -43 -199 9 -79 -192 -120 -160 10 -211 13 -155 -122 -12 75 253 -78 131 73 80 -45 19 271
6483 271 213 -32 -116 62 69 143 23 -133 -115 -1 121 -75 -331 20 95 -25 58 -68 -11 -128 72 -225 -17
6506 -17 -22 -146 -115 -39 50 122 10 47 1 -78 198 28 -194 10 111 218 37 9 -15 -194 -91 25 -238 104
$$ packed form
6340h1J11J10j83rN9J7j72J2M03j57k63P9M1K56j68%Pj70L4J4j21J2J87J34j34
6365A8j7L35j39l67L95k83J82k6j05l3lq3K95k54J10k23K43J0j40j19L73j37r7
6388f5r2J05j31J87k5NK4Q6n3j30m5J25J11j21j93L89m78L78j96pJ10R5j03j22
6412a46L77o8j77j63J75K2k09J53m6R4J05j16Q6J44L1l75J54J40k87P8J83q7r3
6435b5l0P5j42j79K02J16m7M7N3q7m9J26L3m53L32R5j53M28l25K8j41LK61o1P6
6460A83j70n6j56K08q8j13P2m0J70k21K24j68L3J10Q7J78l31K09n8Pj25O4K52
6483B71n8k45q4J78PP4j20j56J8J14J22j96k56L51P5j20Q3j26N7j17K00k97K08
6506a7nj24L1P6Q9P2j12L7m6p9K76j70k22K04J01J07j81k8k4j79J03J16k63L42
$$ plain form
6530 104 204 138 -374 -9 -187 -24 20 -16 -116 -236 -1 -72 -57 136 -86 37 67 -108 118 7 -14 174
6552 174 -41 33 220 -46 -123 -41 -36 -31 26 134 40 78 -44 -3 149 28 232 -224 -130 -88 -106 215 -183 -97 91
6577 91 -197 155 -294 -15 41 -109 -190 222 153 -60 38 139 40 -12 304 -235 78 -45 -51 -10 -79 -183 123 -180
6601 -180 -142 169 -97 -115 -315 -79 -124 -127 49 -140 54 -173 13 -78 -229 -94 -170 -136 157 -38 164 -74 14
6624 14 -128 120 -58 77 -133 -116 51 -14 186 87 -39 -34 -54 33 141 -6 184 235 142 57 37 -70 -182 176
6648 176 105 347 -170 -97 -6 -249 -48 20 52 -30 48 207 -92 106 -50 149 -6 -177 -160 -313 -2 28 120
6671 120 -163 103 -148 -220 87 -70 -62 85 36 -2 72 -97 -37 46 -65 -77 -78 94 -160 -15 -73 -230 102 87
6695 87 34 -76 81 -64 264 116 33 19 95 -188 92 200 48 9 274 -46 120 430 91 -115 48 92
$$ packed form
6530A04J00o6n12L65j78J63M4l6j00j20K35p1J5J93k22J23L0j75K26j11k1J88
6552A74k15P4J87k66p7Q2NNN7J08r4L8j22M1J52j21K04m56R4M2j8L21l98Q6J88
6577I1k88L52m49K79N6j50q1M12o9k13R8J01r9n2L16n39L13j23oM1o9j04L06l03
6601a80L8L11k66j8k00K36m5lJ76j89J94k27J86r1j51J35p6L4K93j95K02k38Q8
6624A4j42K48j78J35k10J7J67o5K00r9j26Nk0Q7J08j47J90N1r3q5k0j07j12L58
6648A76p1K42n17P3R1k43K01O8L2q2P8J59k99J98j56J99j55j71J7j53L11L0R2
6671A20k83K66k51p2L07j57QJ47m9l8P4j69O0Q3j11j2jJ72k54J45n8j57L32j5
6695H7n3j10J57j45L28j48q3j4P6k83K80J08j52l9K65l20J66L10l39k06J63M4
$$ plain form
6717 92 -199 159 11 -137 76 -133 108 149 4 126 185 75 -117 84 -48 73 -98 -12 120 -5 60 159
6739 159 56 280 256 -224 90 91 -106 30 157 -157 -141 -122 85 168 -108 -168 33 167 -217 -144 -81 165 131
6762 131 123 185 78 -179 -134 -42 -73 -232 243 -51 100 42 -37 39 32 -235 -148 124 82 -5 132 140 17 -103 -144 -139
6788 -139 -66 118 -2 -173 166 92 108 -27 -14 -2 -128 316 125 -199 -134 338 -60 28 299 -15 31 101 -72
6811 -72 -4 185 1 283 -91 -36 6 12 13 -246 -164 108 200 55 -96 180 -4 195 -77 -85 -15 130 -28 -97 -165
6836 -165 -86 16 -224 28 -14 -199 73 -156 42 62 -95 184 6 -76 -196 254 -77 151 146 35 181 -78
6858 -78 -53 -124 210 231 59 2 53 145 15 74 -80 -71 5 -97 -118 -10 38 13 -45 -135 2 -53 46 -168 222 -70
6884 -70 43 -126 235 -50 78 49 91 -85 -91 25 75 37 -7 -165 -57 -102 -184 209 -7 108 -111 -177 30 -127
$$ packed form
6717I2k91L58j48j48K13k09K41M1j45J22N9j10j92K01j32J21j71Q6J32j25O5R9
6739A59j03K24k4m80L14Jj97J36J27l14J6J9K07Q3k76o0K01J34l84P3O3K46l4
6762A31qO2j07k57M5R2l1j59M75k94J51n8p9P6pk67Q7K72m2q7J37Qj23j20m1N
6788a39P3J84j20j71L39p4J6j35J3J2j26M44j91l24O5M72l98Q8K71l14M6P0j73
6811g2O8J89j84K82l74N5M2OJk59Q2K72R2j45j51K76j84J99k72qP0J45j58o9o8
6836a65P9J02k40K52m2j85K72k29J98K0j57K79j78q2j20M50l31K28nj11J46k59
6858g8K5p1L34K1j72n7N1R2j30N9j54RP6j02k1J08M8k5n8r0J37n5R9k14L90k92
6884g0J13j69L61k85J28k9M2j76oJ16N0l8m4j58J08m5q2L93k16J15k19o6K07j57
$$ plain form
6908 -127 -174 -87 -61 -47 -101 -9 71 30 21 138 62 126 -124 88 39 -308 81 35 -9 -52 2 114 214 216 -133 -2
6934 -2 107 -73 78 54 -68 203 -60 105 -48 -84 190 79 215 -28 168 -202 217 42 101 39 79 -1 330
6957 330 108 67 82 -34 -129 48 -47 -101 -138 90 -131 -174 4 10 -26 6 -196 3 -31 -38 68 -33 105 -151 -62
6982 -62 2 -50 -131 -92 83 -101 -160 128 -102 38 -170 47 48 -159 28 123 -73 -66 -166 -152 11 90 14 -84 126
7007 126 195 -98 -212 -77 -13 128 -41 -67 70 204 -235 58 70 -82 -85 -125 -12 86 88 133 107 -105 77 129
7031 129 145 111 202 117 -7 13 220 65 -210 -205 122 -24 79 -17 -164 309 78 -46 77 53 -20 96 159 -116
7055 -116 -111 68 -318 126 94 -29 -166 -29 -150 104 128 -199 124 -51 -5 -273 16 173 -35 -66 -48 -38 -147
7078 -147 246 -34 19 -38 10 2 16 -86 138 -126 216 25 -204 173 -84 3 141 80 -125 -94 7 176 -52
$$ packed form
6908a27m7Q7K6J4n4R2Q0m1rJ17p6O4k50K12m9l47L89m6m4m3N4J12J00Kl49J31
6934bJ09j80J51k4j22K71k63J65j53l6K74j11J36k43J96l70M19j75N9o2M0q0L31
6957C30k22m1J5j16r5J77r5n4l7K28k21m3J78Ol6L2k02J99l4pJ06j01J38k56Q9
6982f2O4n2q1L9J75j84n9K88k30J40k08K17Jk07J87R5j96Pj00J4J63P9p6r8K10
7007A26O9k93j14J35O4J41j69k6J37J34m39K93J2j52lm0J13R8KM5k6k12J82N2
7031A29J6l4R1q5j24K0K07j55k75NL27j46J03r6j47M73k31j24J23k4p3J16O3k75
7055a16NJ79l86M44l2j23j37J37j21K54K4l27L23j75M6k68K89J57k08l1J8J0j09
7078a47L93k80N3n7M8qJ4j02K24k64L42j91k29L77k57Q7J38o1k05L1J01J69k28
$$ plain form
7101 -52 88 25 -80 109 24 69 157 -85 108 -71 179 -84 163 100 71 168 -9 78 145 -92 208 -166 -145 98
7125 98 -87 -117 -369 -52 -13 225 106 -20 93 180 10 -211 73 277 287 71 -20 67 -337 -166 -70 144 -125
7148 -125 12 186 -12 -127 -102 -65 163 94 -36 -112 16 172 127 -140 96 -36 25 -80 -52 -131 85 62 154
7171 154 -48 175 -29 -49 81 92 246 127 44 67 88 252 94 -49 66 -35 103 221 -47 3 -114 -13
7193 -13 192 -76 128 88 7 -80 -46 21 -206 -281 125 -33 -26 -109 -176 39 278 -89 53 -101 -30 134 -260 -23
7217 -23 -208 -116 9 -110 32 -27 20 -192 -65 28 0 49 -27 -35 -40 58 -80 -76 -78 193 -191 67 -24 43 -185 69
7243 69 -21 -239 -30 -24 -23 40 88 37 -167 34 184 -139 -198 -104 -74 159 -109 -75 120 -99 -100 -182 -59 -58 -326 43
7269 43 57 -161 -9 -192 4 -70 -125 -81 -26 105 -24 360 -10 -113 -201 -151 16 140 33 79 158 89 52 -100
$$ packed form
7101e2J40o3j05J89q5M5Q8k42J93j79K50k63K47o3k9R7j77Q7O7k37L00l74K1K43
7125I8j85l0k52L17L9K38j19j26J13Q7j70k21K84K04J0k16r1Q7m04J71R6K14k69
7148a25J37J74j98j15K5L7K28o9j30p6J28J56m5k67K36j32O1j05K8p9K16k3R2
7171A54k02K23k04k0J30J1J54j19q3K3K1J64j58j43J15j01J38J18k68N0j17J01
7193a3K05k68K04m0q1q7L4O7k27p5M06j58Pq3o7K15K39l67J42j54P1J64l94K37
7217b3j85R2J25j19J42n9M7k12J27R3k8M9p6qnR8j38MkK71l84K58r1O7k28K54
7243F9r0k18K09OJO3M8n1k04K01J50l23n9R4L0K33k68L4J95k19jq2J23Jk68L69
7269D3J4k18J52j83J96p4n5M4N5J31j29L84l70j03q8N0J67J24j07M6P9o9l7j52
$$ plain form
7293 -100 -74 -92 92 11 -322 5 -66 103 83 -59 70 150 73 99 76 139 180 83 -239 37 132 -147 -212 58 77
7318 77 -231 -80 -7 236 76 15 -66 62 15 11 224 41 -140 436 62 -270 -23 -2 2 -55 273 -231 305 -75
7342 -75 2 -4 -73 49 86 96 -150 15 -211 48 136 347 -176 104 -68 37 -84 201 210 22 -220 134 97 -4
7366 -4 39 -244 -50 262 -72 75 -49 60 -273 -56 93 -98 79 49 105 38 -309 42 58 11 11 80 12 52
7390 52 141 23 31 1 -70 79 -77 -78 225 104 -18 -282 109 15 11 138 80 -34 21 192 27 -152 17 8 106
7415 106 18 111 172 221 19 19 156 109 173 29 114 -2 -20 91 126 118 -94 104 -181 -170 59 1 186 -20 166
7440 166 -157 -57 69 -69 -281 77 -66 230 -120 163 -38 -234 -6 246 -105 59 -72 163 240 212 80
7461 80 -59 167 -130 153 4 -95 91 95 -111 11 -69 16 81 227 37 100 -99 -188 -52 49 -69 -227 -195
$$ packed form
7293a00K6j8J84q1l33L27p1J69k0j42J29Q0p7K6k3O3M1r7l22K76R5k79o5K70J9
7318G7l08J51P3K43j60o1q1J28m7mK13j83j81N76l74l32K47K1Mn7L28n04N36l80
7342g5P7oo9J22L7J0k46J65k26K59Q8K11n23K80j72J05j21K85Rj88k42L54l7j01
7366dM3k83J94L12l34J47j24J09l33K17J49j91J77l0N6o7l47L51J6m7%O9o8M0
7390E2Q9j18Ql0p1J49j56jL03j21j22k64L91r4mJ27n8j14N5J71j65j79J69rR8
7415A06q8R3O1M9k02%J37m7O4j44Q5j16j8J11L5qk12J98k85J1K29n8J85k06J86
7440A66l23J00J26j38k12L58j43K96l50K83k01j96K28K52l51J64j31K35P7k8j32
7461H0j39K26k97K83j49r9J86Mk06J22q0Q5O5J46j90O3j99q9J36J01j18j58L2
$$ plain form
7484 -195 -64 -80 -7 -63 42 256 44 13 20 24 -100 -244 19 -135 -81 -107 -95 -44 -107 132 83 227 -171 -12 0
7509 0 129 -51 214 -7 254 -60 28 -75 107 -5 -30 87 93 44 56 -92 37 191 -2 110 12 152 7
7532 7 20 30 182 59 28 76 -13 126 -8 92 76 172 18 106 -124 9 88 36 43 -105 -66 20 122 22 104 5
7558 5 133 -2 -185 100 105 92 76 105 -7 -247 -31 -21 78 16 100 -143 -55 171 -129 -90 189 36 149 115 -125
7583 -125 173 -126 115 -310 56 -151 201 -114 41 -84 38 163 17 211 -157 156 -24 171 35 -53
7603 -53 -122 -43 -66 16 25 -54 -338 -20 -132 31 97 236 -105 144 -101 232 -54 27 51 -144 29 -65 -122 -36 -120
7628 -120 325 197 -64 46 -237 460 -25 -21 -11 139 155 -94 -9 -88 -157 -170 30 215 166 163 -89 263 -124 45
7652 45 89 1 195 -176 -158 156 24 -175 -50 38 6 -65 -4 221 130 -33 -57 240 147 -26 -216 43 50 -119
$$ packed form
7484a95J31j6P3n6J05K14k12l1PMj24j44K63j54N4k6J2N1o3K39m9J44l98J59J2
7509@J29j80K65k21K61l14Q8j03J82j12k5J17Om9J2j48J29J54j93J12r8J40j45
7532GJ3J0J52j23l1M8q9J39j34J00j6R6j54Q8k30J33P9n2Pj48L9Q6J02j00Q2r9
7558EJ28j35j83K85Nj3j6K9j12k40K16J0R9o2Q4k43Q8K26l00L9K79j53J13l4k40
7583a25K98k99K41m25L66k07L52l15J55j25J22J25j46J94l68L13j80J95j36q8
7603e3o9P9k3Q2Rp9k84L18j12J63O6J39l41K49k45L33k86Q1K4j95J73r4n7Q6q4
7628a20M45j28k61J10k83O97m85MJ0J50J6k49Q5p9o9j3K00J85m9lk52L52l87J69
7652D5M4q8J94l71J8L14j32j99J25Q8l2p1O1K25r1j63k4K97r3j73j90K59Pj69
$$ plain form
7676 -119 -140 -140 35 -127 -41 -77 -164 11 258 119 -171 -73 -95 57 27 275 243 -47 -19 262 -3 18 280 -138
7700 -138 -11 51 43 -97 141 134 167 13 -56 116 53 -9 -238 152 5 -40 -158 -18 -43 0 -7 -138 27 -104 -32
7725 -32 -214 84 -132 -8 -273 -64 119 -85 -175 -8 -89 110 -44 -323 -34 -290 -128 70 12 -281 118
7746 118 18 -76 -119 227 -62 196 217 42 -32 -114 205 -64 107 -101 62 -61 -20 -32 -36 123 -10 93 -55
7769 -55 6 -139 -159 199 -27 -173 -203 8 32 215 -97 160 -40 195 -183 72 -25 106 101 -24 4 -31 -57 -100
7793 -100 65 -66 115 -122 90 -230 -229 218 322 151 284 -34 -119 -130 244 15 -16 59 -154 42 100 -134
7815 -134 15 -63 -73 -98 231 267 -90 23 77 -345 -201 117 235 198 -53 -50 -67 -43 57 -76 -126 26 105 72
7839 72 7 -146 -19 64 288 59 32 0 77 -61 42 127 51 -69 -152 158 48 20 -110 187 -226 -91 -12 38
$$ packed form
7676a19k1%J75j62Q6l6q7J75K47j39k90R8k2J52l0K48l2k90K8K81k65K1K62m18
7700a38J27O2qj40K38pL3j54o9J72o3o2k29L90j47m5j18J40k5M3pj31J65j31P2
7725c2j82K98k16J24k65K09J83k04r0J67q1J99j54k79K89k56J62J98n8k93L99
7746A18j00r4m3L46k89K58K1j75p4q2L19k69J71k08J63j23M1j2mJ59j33J03j48
7769e5O1j45k0L58k26j46l0K11K4J83l12K57k00K35l78K55r7J31nj25K8l5k6m3
7793a00J65j31J81k37K12l20JM47J04j71J33l18q5j1L74k29l1P5k13J96N8k34
7815a34J49p8j0k5L29L6l57J13N4m22J44L18J18l7k51Lj7K4J00j33n0J52P9l3
7839G2o5j53J27Q3K24k29k7l2P7j38J03Q5p6j20q3L10j10k8j30K97m13J35P9N0
$$ plain form
7863 38 -102 -163 98 -57 113 -105 51 365 -415 21 97 79 -114 93 180 -31 -219 -19 24 -5 71 -9 97
7886 97 -41 -123 21 154 -69 -70 111 -126 37 9 45 267 -75 13 -98 -75 151 -10 -105 -62 66 102 53 -3
7910 -3 105 76 81 20 -6 12 78 8 71 86 102 138 199 86 56 15 -113 -75 53 -68 -77 -121 -45 54 202 -281 -37 107
7938 107 199 159 35 -20 -352 -14 -111 107 44 -92 204 77 -102 -38 31 -69 -111 -63 161 42 -116 -110 145 57
7962 57 -110 -112 -81 -154 42 101 135 14 147 -208 -84 -68 -172 110 -112 -148 191 -32 270 138 75 -34 -54 -57
7986 -57 -28 -81 1 220 16 210 61 190 135 56 -137 37 -60 -208 115 183 18 -33 112 -89 -257 128 -22
8009 -22 201 208 -42 -148 -74 -120 -88 -167 -8 111 219 -142 -218 -19 -38 -39 191 -55 -248 126 -96 31 -24 180
8033 180 111 40 68 -190 -159 -180 -320 72 232 -71 -19 -81 -62 -153 19 151 -10 32 249 76 -90 -35 88 21
$$ packed form
7863C8j40o1K61j55J70k18J56L14p80M36P6j8j93K07Q7k11j88K00M3k9P6q0J06
7886I7j38q2J44J33k23jJ81k37J63k8L6K22l42Q8j11K3K26j61r5M3J28L6m9n6
7910cJ08k9No1k6J8O6p0O3J5J6L6O1j13l0m1j28L8J28j21rm4P6R9J48m83K44J44
7938A07R2m0j24n5l32L38r7K18o3j36K96j27j79O4O9j00m2M8K24j19j58OK55q8
7962E7j67kL1p3J96N9L4j21J33l55J24J6j04K82k22l6L39k23L02j32o3j09k0l
7986e7K9n3Q2K19k04J94j49J29n5p9j93J74r7j48L23O8j65n1J45k01j68L85j50
8009b2K23Pk50j06P4m6L2p9J59J19J08l61p6J99j9jK30k46j93L74k22J27n5K04
8033A80o9p1K8k58L1k1j40L92J60l03N2o2J9r1J72J32j61M2K17j73j66N5J23o7
$$ plain form
8057 21 -101 148 -23 -127 17 1 -239 -7 -27 35 182 -123 83 133 38 55 -135 -20 -14 -44 -54 103 13 43
8081 43 239 35 64 172 -18 245 157 -153 -117 -119 19 173 262 -76 130 -102 -174 117 -326 17 -59 -111 -64 -142
8105 -142 10 111 221 -48 -116 -17 77 -88 39 -62 1 102 -6 127 11 74 167 212 113 88 -230 47 64
8128 64 -11 211 -16 81 183 -51 -63 251 -128 -111 53 -197 -114 -78 186 231 216 4 -21 -271 13 159 -2
8151 -2 -313 86 -20 -15 -99 -79 -28 -153 279 -1 -28 188 147 63 124 -17 -88 92 143 45 21 -35 12 2 183 -233
8177 -233 -47 125 -13 -85 38 86 59 65 -6 164 -190 40 -53 124
$$ packed form
8057B1j22K49j71j04J44j6k40K32k0O2J47l05K06N0r5J7j90J15Ol0j0J57r0L0
8081D3J96k04K9J08j90K63q8l10L6kJ38J54Q9l38K06k32p2K91m43L43p6n2M7p8
8105a42J52J01J10k69o8R9R4j65J27j01O3J01j08J33j16O3R3M5r9k5l18K77J7
8128F4p5K22k27R7J02k34j2L14l79J7J64k50Q3L6K64M5j5k12k5k50K84J46j61
8151bl11L99j06Nq4K0N1j25M32k80k7K16m1q4O1j41p1J80N1r8k4n6M7j0J81m16
8177b33J86J72j38p2J23M8k7Op1J70l54K30r3J77
8191A24
$$ Imaginary data points
##PAGE= N=2
##DATA TABLE= (X++(I..I)), XYDATA
$$ plain form
0 0 0 0 0 0 0 0 0 0 -1 8 -8 8 -10 16 -16 24 -27 33 -41 49 -64 73 -88 103 -120 138 -161 186 -216 244 -281 323
32 323 -364 411 -461 522 -586 655 -733 815 -909 1008 -1119 1239 -1368 1511 -1666 1837 -2023
49 -2023 2229 -2456 2705 -2982 3291 -3638 4031 -4477 4992 -5592 6300 -7158 8211 -9545
63 -9545 11295 -13695 17209 -22833 33223 -58557 243124 134600 -429507 253697 154577 -325764
75 -325764 119443 221543 -253544 -6534 155710 -83332 -37845 78634 24403 -24680 -87564
86 -87564 103411 109983 -198482 20031 206341 -236664 -41706 311066 -212906 -171244 350209
97 350209 -110495 -242596 318505 -2614 -294678 200424 88698 -228154 83269 92854
107 92854 -147571 5280 79708 -19285 -34490 -18393 67186 2160 -119411 99582 74133
$$ packed form
0@%%%%%%%%jRj6J6j8K6l2M0n1O0p4R0j13J37j61J91k23K58k99L47m02M60n25O04
32C23o87P75q72R83j108J241j388J548j724J917k127K358k607K879l177L503l860
49b023M252m685N161n687O273o929P669q508R469j0584J1892j3458J5369j7756
63i545K0840k4990L0904m0042N6056r1780L01681j08524n64107O83204r9120m80341
75c25764M45207J02100m75087K47010J62244k39042M5487J16479n4231m9083o2884
86h7564J90975O572l08465K18513J86310m43005J94958L52772n23972M1662N21453
97C50209m60704j32101N61101l21119k92064M95102j11726l16852L11423R585
107I2854k40425J52851P4428r8993j5205J6097Q5579o5026j21571K18993k5449
$$ plain form
118 74133 -213286 58893 172274 -221491 -4316 231798 -196259 -78287 265755 -114810
128 -114810 -145841 213373 -38355 -157479 138955 22314 -121833 51836 38701 -42247
138 -42247 5777 19860 30269 -24733 -40389 93603 -1997 -116741 100998 45271 -162104
149 -162104 86868 109114 -173047 40818 151499 -146424 -7574 161332 -105439 -58544
159 -58544 129000 -47773 -66408 76071 -9305 -42743 27071 12201 5488 -14718 -5989 51392
171 51392 -34752 -46361 86901 -28283 -96556 99019 9971 -122791 89082 49184 -130546
182 -130546 60114 79276 -116807 17647 80812 -87635 -14486 64207 -46879 -22154 32283
193 32283 -12211 -3548 347 1913 22914 -31068 -9092 54143 -45641 -37500 77800 -36998
$$ packed form
118G4133k87419K72179J13381l93765K17175K36114m28057J17972L44042l80565
128a14810l1031L59214k51728j19124K96434j16641j44147J73669j3135q0948
138d2247M8024J4083J0409n5002j5656J33992r5600j14744K17739n5727k07375
149a62104K48972K2246k82161K13865J10681k97923J38850J68906k66771M6895
159e8544J87544j76773j8635J42479q5376l3438O9814j4870o713k0206Q729N7381
171E1392q6144j1609J33262j15184o8273J95575q9048j32762K11873l9898j79730
182a30546J90660J9162j96083J34454O3165j68447P3149P8693j11086K4725N4437
193C2283m4494Q663L895J566K1001n3982K1976O3235r9784Q141J15300j14798
$$ plain form
205 -36998 -64042 91617 -8142 -82334 83536 20703 -86451 59018 38414 -78707 26494
216 26494 41506 -52649 5754 31223 -20802 2682 11231 4536 13806 -15545 9060 30548 -37713
229 -37713 -1513 50589 -45880 -20857 68394 -33281 -36960 73783 -14657 -49571 63011 2014
241 2014 -53689 40456 10140 -45749 19135 12480 -25554 7169 5401 -4017 5975 -9880 8081
254 8081 10611 -29110 7320 21031 -41688 -156 35137 -41744 -9744 46598 -31746 -20052
266 -20052 46996 -19992 -28062 36414 -10478 -29544 22209 -3300 -20414 11664 5 -5295
278 -5295 6484 -3601 7072 5050 -14267 11638 7630 -24783 11517 15451 -29344 8995 25623
291 25623 -25727 4119 31322 -20172 -3147 28866 -14383 -8940 20888 -8610 -8661 13888 -2292
$$ packed form
205c6998k7044J55659r9759p4192J65870o2833j07154J45469k0604j17121J05201
216B6494J5012r4155N8403K5469n2025K3484Q549o695R270k9351K4605K1488o8261
229c7713L6200N2102r6469K5023Q9251j01675l679J10743q8440l4914J12582o0997
241B014n5703R4145l0316n5889O4884o655l8034L2723j768r418R992j5855J7961
254H081K530l9721L6430J3711o2719M1532L5293p6881L2000N6342p8344J1694
266b0052O7048o6988q070O4476m6892j9066N1753k5509j7114L2078j1659n300
278e295J1779j0085J0673k022j9317K5905m008l2413L6300L934m4795L8339J6628
291B5623n1350K9846K7203n1494J7025L2013m3249N443K9828k9498n1K2549j6180
$$ plain form
304 -2292 -2127 8311 146 5480 3726 -3755 9787 269 -11777 11133 1754 -17737 11260 7325
318 7325 -18905 10079 13300 -18119 5058 14562 -16072 -2053 11087 -12999 -5517 6434 -7395
331 -7395 -4063 2768 -2550 256 -1617 -1846 3746 -5134 -6006 5780 -6422 -10649 7708 -2781 -12643
346 -12643 9411 2595 -12347 7500 6404 -11333 2687 6539 -9175 -1354 4731 -4252 -1907
359 -1907 2967 1231 1151 768 3847 4014 -2593 2177 6191 -4960 -1483 8574 -3261 -4093 10667
374 10667 930 -5270 10073 4894 -5930 6058 6144 -5375 1189 5199 -3028 -1579 3649 1477
388 1477 -1703 1471 4974 -285 -2291 4490 854 -6128 1513 2745 -7550 -1803 5355 -5324 -4474
403 -4474 6352 -2049 -6357 4497 676 -8356 822 2074 -7483 -3667 3010 -3573 -6255 3215 1590
$$ packed form
304b292J65J0438q165N334j754p481J3542r518j2046K2910r379j9491K8997l935
318G325k6230K8984L221l1419K3177R504l0634J4019J3140k4086P482J1951j3829
331g395L332O831n318K806j873k29N592q880q72J1786j2202m227J8357j0489r862
346a2643K2054o816j4942J9847j096j7737J4020L852j5714P821O085q983K345
359a907M874j736q0l83L079J67o607M770M014j1151L477J0057j1835q32J4760
374A0667r737o200J5343n179j0824J1988Q6j1519O564M010q227J449N228k172
388A477l180L174L503n259k006O781l636o982P641J232j0295N747P158j0679Q50
403d474J0826q401m308J0854l821r032R178J252r557L816O677o583k682R470j625
$$ plain form
418 1590 -7188 666 5298 -6576 -4011 6786 -3894 -7851 5858 1011 -8905 3669 5961 -6650
432 -6650 187 8543 -2733 -3861 6955 1627 -6050 2666 6427 -4364 -2275 9691 1043 -6936
446 -6936 9353 7354 -9883 4457 12927 -9554 -2926 15081 -5287 -8739 14206 1889 -11933
459 -11933 9899 8001 -10949 2311 10520 -6375 -4748 7775 505 -7847 637 7121 -5001
472 -5001 -7838 10102 1868 -15395 7158 10524 -18834 -1006 17549 -16645 -10546 20168 -8502
485 -8502 -17585 17263 725 -20177 10140 7602 -16999 1148 9556 -9309 -5495 5502 256
498 256 -6356 -2235 7478 -1815 -11060 9305 7198 -17493 5080 16538 -18252 -3506 23186 -13200
512 -13200 -12236 24933 -4496 -17969 21000 4263 -18699 12992 10061 -14271 4534 10117 -5991
$$ packed form
418A590q778P854M632j1874K565J0797j0680l957J3709m847r916J2574K292j2611
432f650O837Q356j1276j128J0816n328p677Q716L761j0791K089J1966q648p979
446f936J6289j999j7237J4340Q470k2481O628J8007k0368l452K2945j2317j3822
459a1933K1832j898j8950J3260Q209j6895J627J2523p270q352Q484O484j2122
472e001k837J7940q234j7263K2553L366k9358J7828J8555l4194O099L0714k8670
485h502r083L4848j6538k0902L0317k538k4601J8147Q408j8865L814J0997n246
498B56o612M121R713r293r245K0365k107k4691K2573J1458l4790J4746K6692l6386
512a3200R64L7169k9429j3473L8969j6737k2962L1691k931k4332J8805N583j6108
$$ plain form
525 -5991 -568 5406 2846 -902 -2581 8277 3382 -10817 8186 10424 -16193 3440 17793 -16779
539 -16779 -4117 22036 -12539 -11730 22061 -6111 -16228 17385 652 -16633 10073 4376 -13148
552 -13148 3078 4283 -6535 -1608 797 294 -2496 -5139 4501 21 -11327 5685 4686 -15564
566 -15564 3485 10814 -16687 -1023 15062 -14406 -5966 16678 -9683 -9900 14969 -3984 -10726
579 -10726 10481 1105 -8669 4777 3614 -3699 -273 3075 2904 -2992 -550 8336 -2285 -6051
593 -6051 11940 973 -11139 11663 6429 -14207 8460 11542 -14016 3490 14592 -10524 -2468
606 -2468 13854 -5002 -5632 9554 775 -5670 3008 4292 -1932 -4109 4445 3916 -8746 798 10162
621 10162 -9619 -5832 14248 -6461 -12703 14407 -325 -16974 10785 5527 -16815 4305 9146
$$ packed form
525e991N423N974k560l748j679J0858m895j4199J9003K238k6617J9633J4353l4572
539a6779J2662K6153l4575Q09L3791k8172j0117L3613j6733j7285K6706n697j7524
552a3148J6226J205j0818M927K405n03k790k643R640m480j1348J7012r99k0250
566a5564J9049P329k7501J5664J6085k9468Q440K2644k6361k17K4869j8953o742
579a0726K1207r376r774J3446j163p313L426L348j71n896K442Q886j0621l766
593f051J7991j0967j2112K2802n234k0636K2667L082k5558J7506J1102k5116Q056
606b468J6322j8856o30J5186q779o445Q678J284o224k177Q554n29j2662R544R364
621A0162j9781L787K0080k0709o242K7110j4732j6649K7759n258k2342K1120M841
$$ plain form
634 9146 -12996 -1926 8790 -6562 -5981 4607 256 -5509 -2091 4289 -1783 -8344 5094 5022
648 5022 -12329 1291 11821 -12302 -4645 16014 -8062 -10472 16245 -1451 -13668 12315 4880
661 4880 -12948 6228 8180 -8417 393 7516 -1745 -2542 3507 4581 -2275 -2476 8053 1707 -7962
676 -7962 7626 7090 -11110 3793 12223 -10936 -1467 14883 -7289 -6697 13714 -2490 -9294 9856
690 9856 1750 -8852 4568 3587 -5330 -363 2663 -577 -2975 -756 3480 -3166 -5557 5892 -512
705 -512 -9886 5554 3380 -12041 3223 7219 -12017 -392 9468 -9511 -4105 9169 -5823
718 -5823 -5928 6799 -2273 -5512 3407 191 -2616 106 396 967 -2096 -1227 4578 -2106 -4145 6988
734 6988 -272 -7028 7427 3053 -8560 6255 6137 -8571 3499 8018 -7059 780 7852 -4257
$$ packed form
634I146k2142J1070J0716j5352N81J0588m351n765L418O380o072o561J3438p2
648E022j7351J3620J0530k4123P657K0659k4076k410K6717j7696j2217K5983p435
661D880j7828J9176J952j6597Q810P123r261p97O049J074o856k01J0529o346r669
676g962J5588n36j8200J4903Q430k3159R469J6350k2172N92K0411j6204o804J9150
690I856q106j0602J3420r81q917M967L026l240k398K219M236o646k391J1449o404
705e12r374J5440k174j5421J5264L996j9236J1625R860j8979N406J3274j4992
718e823j05J2727r072l239Q919l216k807K722K90N71l063Q69N805o684k039J1133
734F988p260o756J4455m374j1613J4815j18j4708J2070M519j5077P839P072j2109
$$ plain form
748 -4257 -757 5985 -1521 -377 3754 503 985 928 391 2851 -1705 -1021 5265 -2212 -3254 6703
764 6703 -1306 -5361 6988 491 -7031 5487 2144 -7431 2985 2973 -6690 988 2684 -4797 -426
779 -426 1939 -2801 -489 -520 -1631 611 -2626 -1694 1896 -3770 -2714 3452 -3467 -3249 4873 -2175
795 -2175 -4276 4854 -1295 -5185 3911 -351 -4748 2522 183 -3311 2201 485 -1270 2354 -157
810 -157 124 2496 -1341 295 2981 -2447 196 4194 -2352 -61 5127 -1705 -403 5618 -1157 -1078
826 -1078 4753 -794 -1775 3593 -616 -1317 3100 -672 175 2870 -1050 804 2788 -2484 558 2340
842 2340 -3754 -243 2685 -4038 -380 3569 -3648 -718 3684 -3356 -1676 2765 -3410 -2356 1732
857 1732 -3220 -1767 1173 -2830 -819 1220 -2743 338 809 -3393 1023 737 -4423 1127 998 -5375
$$ packed form
748d257L500O742p506J144M131l251M82n7n37K460m556O84O286p477j042R957
764F703q009m055J2349o497p522J2518l343r575J0416j2r663P678J696p481M371
779d26K365m740K312l1j111K242l237R32L590n666J056O166o919K18Q122p048
795b175k101R130o149l890R096m262m397P270k339l494N512j716j755L624k511
810a57K81K372l837J636K686n428K643L998o546K291N188o832J302O021o775P9
826a078N831n547r81N368m209p01M417l772Q47K695l920J854J984n272L042J782
842B340o094L511K928o723L658L949p217K930M402p040J680M441o175J054M088
857A732m952J453K940m003K011K039l963L081M71m202M416k86n160N550j29o373
$$ plain form
873 -5375 1239 2129 -4733 1489 3509 -3810 1411 3797 -3419 384 2987 -3241 -31 2310 -1961
888 -1961 1301 1533 -915 3153 939 -1034 4251 90 -2239 4874 -518 -3751 5273 334 -4437
903 -4437 5704 1878 -4124 5600 2493 -4440 3952 2061 -4530 2464 916 -3653 2215 -195 -2188
918 -2188 3713 -1315 -1192 4651 -3336 -2091 5420 -5484 -3958 6329 -5965 -5071 7689 -4507
932 -4507 -5544 8348 -2890 -6210 7396 -2640 -6566 5464 -3025 -5492 4362 -3329 -3044 5026
946 5026 -4190 -783 6146 -5799 -213 6930 -7769 -798 8381 -9201 -1565 10362 -8388 -1828
960 -1828 12403 -6825 -2386 12278 -5975 -3763 10555 -5731 -3847 8640 -4937 -1931 7919
973 7919 -4602 1222 7530 -6094 3146 7344 -9030 3309 7482 -11815 3377 9231 -12747
$$ packed form
873e375O614Q90o862O222K020p319N221K386p216L803K603o228L210K341m271
888a961L262K32k448M068k214j973N285m161k329P113n392l233R024m939m771
903d437J0141l826o002R724l107o933Q392j891o591O994j548m569N868k410j993
918b188N901n028J23N843p987J245P511j0904J526J0287j2294Q94J2760j2196
932d507j037J3892j1238l320J3606j0036l926J2030q489k467R854p691K85Q070
946E026r216L407O929j1945N586P143j4699O971R179j7582P636J1927j8750O560
960a828J4231j9228M439J4664j8253K212J4318j6286J884J2487j3577L006R850
973G919j2521N824O308j3624R240M198j6374J2339M173j9297J5192N854k1978
$$ plain form
986 -12747 2954 11433 -12208 2142 12390 -11459 -118 11489 -10537 -1984 9074 -9452
998 -9452 -1404 6921 -7505 1150 5311 -7470 3492 3683 -9379 5121 2229 -12817 6678 2892
1012 2892 -14921 7661 5961 -15077 7481 8594 -14943 5242 9169 -14037 2449 8013 -12002
1025 -12002 1269 6477 -8377 2871 4419 -5880 5649 1330 -5491 8267 -1540 -8017 10462
1038 10462 -2465 -10931 13246 -109 -12437 14381 3041 -13215 12575 5094 -13472 8859
1050 8859 5308 -11920 5605 4627 -8655 4385 2919 -4401 5888 -336 -2034 7675 -4635 -2835
1064 -2835 9634 -8306 -5282 12579 -8289 -7736 15097 -5642 -9874 15497 -2822 -11834 12622
1077 12622 -1058 -12209 8124 -325 -9939 5054 -302 -5088 4401 -2284 -979 4609 -5908
$$ packed form
986a2747J5701Q479k3641J4350J0248k3849J1341J1607k2026Q553J1058j8526
998i452Q048Q325j4426Q655M161j2781J0962J91j3062J4500k892j5046J9495l786
1012B892j7813K2582j700k1038K2558J113k3537K0185L927k3206J6486N564k0015
1025a2002J3271N208j4854J1248J548j0299J1529m319o821J3758r807o477J8479
1038A0462j2927q466K4177j3355j2328K6818j1340j6256K5790p481j8566K2331
1050H859l551j7228J7525r78j3282J3040j466p320J0289o224j698R709j2310J800
1064b835J2469j7940L024J7861k0868N53K2833k0739m232K5371j8319r012K4456
1077A2622j3680j1151K0333q449r614J4993n356m786R489o685J305N588j0517
$$ plain form
1090 -5908 513 5868 -10454 -298 8985 -12223 -1399 12417 -10828 -3262 14794 -7946 -5396
1103 -5396 13789 -6286 -7044 10758 -3807 -6590 7463 -2047 -3239 5353 -1530 1082 4308 -3702
1117 -3702 4084 3780 -7678 4993 5104 -10922 5054 8129 -11572 3935 10962 -10327 2013
1130 2013 11686 -9022 -957 10016 -7092 -2686 6986 -5030 -1458 4748 -3291 1633 2734 -3791
1144 -3791 3955 1068 -6395 5367 -58 -9598 5633 1434 -11054 6300 4139 -10723 5455
1157 5455 5868 -10127 2830 5595 -9300 560 3915 -7347 93 2728 -4707 1921 1413 -3078
1171 -3078 4059 -502 -3904 5362 -2061 -5957 6500 -2033 -7399 7652 31 -7458 8124 2106
1185 2106 -6861 6495 2901 -6875 4319 2450 -5797 3235 1720 -3453 3589 877 -1420 5090
$$ packed form
1090e908O421N355j6322J0156R283k1208J0824J3816k3245P566J8056k2740K550
1103e396J9185k0075p58J7802j4565k783J4053r510j192Q592o883K612L226q010
1117c702P786l04j1458J2671J11j6026J5976L075j9701J5507P027k1289J2340
1130B013R673k0708Q065J0973j7108M406R672j2016L572O206q039M924J101o525
1144c791P746k887p463J1762n425r540J5231m199j2488J7354k161j4862J6178
1157E455M13j5995J2957K765j4895R860L355j1262P440K635p435O628n08m491
1171c078P137m561l402R266p423l896J2457q533n366J5051p621p489J5582o018
1185B106q967J3356l594r776J1194j869q247R032j515n173P042k712k297O510
$$ plain form
1199 5090 -295 -1250 5410 -2527 -2298 5989 -3494 -3627 6914 -2864 -3665 7868 -1291 -4286 7292
1214 7292 -298 -4873 4939 -704 -4971 3092 -930 -3705 2523 -1058 -1516 2982 -1968 -147 3070
1229 3070 -4001 -992 3224 -5668 -1614 3981 -5431 -2018 5326 -4071 -2037 5968 -2893 -2792 4695
1244 4695 -2619 -3054 2867 -2236 -2234 2057 -1661 39 2223 -1345 1529 2092 -2568 1800 1900 -4390
1260 -4390 1582 2657 -5275 1387 4039 -4315 1414 5491 -3300 875 5352 -2793 -551 3636 -2301
1275 -2301 -787 2490 -1555 603 1972 -670 2047 1359 -1391 2755 623 -3177 2557 183 -4919
1290 -4919 2467 1240 -4887 2560 2753 -4409 1641 3080 -4037 400 2133 -3944 -872 1243 -2800
1305 -2800 -505 617 -1569 715 41 -962 1801 -1257 -1956 2153 -1837 -3445 2468 -1372 -3996
$$ packed form
1199E090n385r55O660p937K29Q287r483j33J0541r778q01J1533r159k995J1578
1214G292p590m575R812n643m267Q063m022k775O228l581m58M498m950J821L217
1229C070p071L009M216q892M054N595r412L413P344r397K034Q005q861J01P487
1244D695p314m35N921n103KM291l718J700K184l568K874N63m660M368J00o290
1260d390N972J075p932O662K652q354N729M077q791M175M477q145K242M187n937
1275b301J514L277m045K158J369k642K717o88k750M146k132l800N734k374n102
1290d919P386j227o127P447J93p162O050J439p117M437J733o077L072K115m043
1305b800K295J122k186K284o74j003K763l058o99M109l990j608N913l840k624
$$ plain form
1320 -3996 3104 412 -3655 3457 1590 -3480 2229 1911 -3563 1068 1367 -2604 161 1224 -615
1335 -615 416 790 519 1785 -170 599 2218 -1624 -301 2971 -2082 -1267 4071 -1247 -1493 4692
1351 4692 155 -2173 3895 836 -2817 2199 665 -2563 824 425 -1078 419 416 600 576 -743 1080
1368 1080 790 -2668 683 1142 -3955 247 2088 -3968 -459 3657 -2867 -1341 3751 -2073 -2344 2707
1384 2707 -1529 -2806 1174 -745 -2050 373 -377 -164 -49 -711 1397 -121 -2153 1851 321 -4103
1400 -4103 2271 1367 -4781 1867 3238 -4086 1412 4425 -3512 213 4164 -2627 -817 3353 -1480
1415 -1480 -1389 2092 -377 183 1163 188 1616 428 -668 2754 -341 -2514 3697 145 -3978 3840
1431 3840 1408 -4614 3752 3229 -4918 2457 3771 -4738 434 3363 -3739 -618 2443 -2203 -477
$$ packed form
1320c996P100k692m067P112j867n070N709l18n474M631K99l971K765J063j839
1335f15J031L74k71J266j955P69J619l842J323L272n053Q15N338n318k46O185
1351D692m537k328O068l059l653N016j534l228L387l99j503J497lJ84k4j319J823
1368A080k90l458L351M59n097M202J841o056L509M116o524J526N092n824k71N051
1384B707m236j277L980j919j305K423p50K13J15o62K108j518k032M004j530m424
1400d103O374r04o148O648J371p324N498L013p937L725L951o791J810M170m833
1415a480R1L481k469N60R80r75J428j188j096L422l095k173O211l552m123P818
1431C840k432o022Q366n23q147P375J314q509N172K929p102L121L061m646J726
$$ plain form
1446 -477 1115 -934 399 -312 -827 1910 -2056 -1860 2814 -2523 -3138 4070 -1867 -4619 4854 -313
1462 -313 -5654 4223 1496 -5864 2499 2384 -5280 889 2393 -3446 -170 1693 -1214 41 388 316
1478 316 1206 -1567 485 2612 -3180 -334 4484 -3283 -1842 6006 -2304 -3275 6390 -640 -4564 5597
1494 5597 955 -4502 3699 1844 -3475 1728 2003 -1288 532 889 513 453 -875 1849 1309 -3180
1510 -3180 1800 2820 -4823 719 4746 -5068 -1118 5915 -4022 -2611 6126 -2433 -4096 4507 -875
1525 -875 -4004 2409 179 -2840 593 309 -762 -669 -777 1444 -737 -2806 2786 456 -5306 2685
1541 2685 1988 -6065 1873 4268 -5779 298 5556 -4654 -1323 5512 -2992 -2508 4117 -871 -2451
1556 -2451 2428 439 -833 485 607 1210 -585 -604 2877 -679 -2518 4387 -137 -4283 4791 2013
$$ packed form
1446d77J592k049J333p11n15K737l966J96M674n337o15P208n937k752R473n167
1462c13n341R877k727p360Q363j15p664O169J504n839L276J863k907J255L47p2
1478C16Q90k773K052K127n792K846M818p767J441P848q310r71R665p030l924J0161
1494E597m642n457Q201j855n319N203K75l291J820L57l76o0j328K724n40m489
1510c180M980J020p643N542M027r814L950P033r937J411Q737q559j663Q603n382
1525h75l129O413k230l019L433k84j071R3j08K221k181k069N592k330n762P991
1541B685o97q053P938K395j0047O077N258j0210L331O835q504M84O625m988j580
1556b451M879j989j272J318J22O03j795j9L481l556j839O905m524m146R074k778
$$ plain form
1572 2013 -5194 3709 3456 -5420 2093 4505 -4260 351 4187 -2563 -1193 2980 -1116 -830 1127
1587 1127 179 134 -715 102 1667 -1999 -1054 3481 -2602 -2826 4360 -1707 -4261 4646 -227 -5152 3675
1604 3675 1447 -5506 2120 2202 -4760 459 2132 -3101 -629 1428 -1247 -901 -365 295 40 -1935
1620 -1935 514 2063 -3126 -88 3694 -3304 -1549 4875 -2353 -3034 5573 -1116 -3921 4716 660
1635 660 -3964 2711 1938 -3068 1338 1813 -1419 535 748 445 347 -546 1662 1283 -2360 1540 2592
1652 2592 -3612 1041 3883 -3642 -517 4758 -2836 -1587 4862 -1796 -2709 3840 -522 -2663 2324
1667 2324 195 -1948 837 193 -686 -223 -483 870 -380 -2070 1556 239 -3366 1674 1301 -4348
1683 -4348 699 2513 -4369 -150 3428 -3409 -961 3300 -2078 -1554 2640 -1220 -1409 1345 -267
$$ packed form
1572B013p207Q903k53q876P513K412q765M611L836o750J370M173m096K86J957
1587A127r48m5q49Q17J565l666R45M535o083k24P186o067k554Q907m873m925Q827
1604C675k228o953P626Q2o962N219J673n233K472K057k675L46N36O60k55j975
1620a935K449J549n189L038L782o998J755O424p228o81Q607o689k805Q637m056
1635F60m624O675p73n006M406M75l232J954K13l03r8q93K208l79l643L900J052
1652B592o204M653K842p525L125N275p594J249O449o658r13O549m362k141M987
1667B324k129k143K785o44q79M63k60J353j250j690L626j317l605N040l73n649
1683d348N047J814o882M219L578o837K448M261n378N24M194l860j89K754j612
$$ plain form
1698 -267 -547 214 -294 513 -110 -864 1799 -248 -1707 2604 346 -2474 2599 1193 -3049 2400 2091
1715 2091 -3132 1498 2748 -2419 545 2387 -1501 204 2050 -924 13 1015 -378 681 173
1730 173 -227 1174 -506 -575 2096 -1002 -1432 2319 -631 -2054 2480 112 -2748 2122 512 -2878
1746 -2878 1733 815 -2661 955 819 -2209 44 497 -1252 -286 127 -492 -51 -834 -332 793 -1416
1763 -1416 -581 1258 -1850 -819 1928 -1481 -1278 2309 -1084 -1772 2375 -299 -2020 1883 385 -1818
1779 -1818 1393 604 -1258 575 836 -671 300 209 243 253 -259 609 785 -624 866 1381 -1513 737
1797 737 1841 -1334 -92 2044 -1012 -677 2244 -559 -899 1978 169 -1185 1140 568 -1053 399
1813 399 391 -341 -80 -46 292 -583 -701 787 -100 -1661 970 219 -1892 561 1043 -2128 111 1400
$$ packed form
1698b67k80P61n08Q07o23p54K663k047j459M311k258k820N073j406m242N449l09
1715B091n223M630J250n167K964J842l888J705J846k974R37J002j393J059n08
1730A73m00J401j680o9K671l098m30L751k950j423M534k368k860M870j610l390
1746b878M611r18l476L616j36l028K253M53j749R66M13o19M41p83N02J125k209
1763a416Q35J839l108J031K747l409K03L587l393o88M147k674j721L903j498k203
1779a818L211p89j862J833K61j507R71r1L4J0n12Q68J76j409J490N15k894K250
1797G37J104l175J242K136l056L35K921k803l40K877j809j354K325n72j621J452
1813C99qp32K61L4L38q75j18J488q87j561K631p51k111K453M82l171K239J289
$$ plain form
1831 1400 -1953 -833 1452 -1270 -1205 1166 -720 -1008 462 -25 -800 -158 332 -30 -437 -129 659 -830
1849 -830 -559 1634 -351 -1327 1757 179 -1836 1508 1174 -2052 943 1645 -1352 330 1833 -755
1865 -755 181 1488 44 -190 587 526 204 -520 404 926 -1122 240 1858 -961 -630 2485 -994 -1633
1883 -1633 2337 -339 -2262 1842 409 -2170 964 924 -1693 359 629 -812 -124 -133 60 54 -936 194
1901 194 538 -2246 30 1487 -2602 -346 2638 -2405 -1211 2747 -1553 -1831 2384 -847 -2116 1815
1917 1815 -229 -1756 1144 56 -612 436 -408 440 404 -1238 972 986 -2246 1166 2013 -2806 983
1934 983 2998 -2946 332 3504 -2189 -240 3273 -1476 -986 2619 -948 -837 2079 -315 -101 1030
1950 1030 -418 1016 538 -1503 1364 453 -2591 1828 746 -3199 1973 1947 -3660 1556 2501 -3728
$$ packed form
1831A400l353J120K285k722O5K371j886k88J470m87p75O42M90l62m07L08P88j489
1849h30K71K193j985r76L084j578k015L344l34l226K995P02k997J682J503k588
1865g55R36J307j444k34P77o1l22p24R24N22k048J362J618k819L31L115l479o39
1883a633L970k676j923M104j433k579L134m0k617K052K70j441O88rJ93or90J130
1901A94L44k784K276J457m089K256K984n043J194L958m300k78M215l231j269L931
1917A815k044j527K900j088o68J048q44Q48l6j642K210J4l232L412Q47m819L789
1934I83K015n944L278L172n693J949L513m749M90L605l567J11K916k394K14J131
1950A030j448J434m78k041K867r11l044M419j082l945N172k6n607N216R45o229
$$ plain form
1966 -3728 627 2574 -3326 42 2268 -2414 -632 1595 -1619 -396 846 -1558 563 -318 -1553
1981 -1553 1347 -651 -2298 2264 -664 -3236 2809 6 -3810 2695 1228 -3903 2464 1359 -3965
1996 -3965 1628 1849 -3118 806 1800 -2127 767 1101 -993 975 311 -266 1360 -940 -413 2415
2012 2415 -1592 -993 3488 -1571 -1572 4501 -1066 -2327 4597 -179 -3226 3747 698 -3558 2551 1299
2028 1299 -3080 1194 1240 -1294 517 787 -484 383 -871 356 889 -2505 710 1943 -3633 86
2044 86 3491 -3834 -907 4221 -3184 -2331 4387 -2014 -3213 3622 -688 -3341 2118 189 -2345 770
2060 770 676 -823 -215 -325 1090 -574 -2075 1899 340 -3577 2232 1812 -4221 1653 3577 -4383
2076 -4383 450 4579 -3594 -1203 4348 -2353 -2014 3210 -642 -1692 2100 525 -568 648 704 1174
$$ packed form
1966c728M355J947n900L368K226m682J782K227l214J223J242k404K121q81j235
1981a553K900j998j647M562k928k572O045k803l816O505j467n131O367j105n324
1996c965N593K21m967L924R94l927K894L34k094J968o64n77J626k300N27K828
2012B415m007N99M481n059jO073n567j261O924m776l047O973l049m256O109j252
2028A299m379M274M6k534J811K70j271Q67j254J227N33l394L215J233n576L719
2044H6L405p325K927N128p405Q53O718o401j199O835m310k653N459j929k534L115
2060G70r4j499O08j10J415j664j501L974j559l917N809m20o033N874J924p960
2076d383M833M129q173K391N551o701L39N224l852j050L792j575j093J216N6M70
$$ plain form
2092 1174 -713 -428 2156 -960 -2121 3304 -78 -3547 3524 1698 -4224 2836 2644 -4279 1523
2107 1523 3325 -3481 -322 2989 -2491 -998 2332 -839 -827 831 -58 133 -782 0 1335 -1881
2123 -1881 -1304 2178 -1983 -2029 3265 -1122 -2916 3378 72 -3681 2694 1012 -3493 1542 1522 -3035
2139 -3035 483 1444 -1842 56 1184 -521 449 -224 -126 429 -998 175 1304 -1805 -161 2313
2155 2313 -1660 -688 3276 -1122 -1172 3289 -545 -1991 2924 -224 -2167 1982 501 -1764 1523 868
2171 868 -1081 1086 580 -88 364 -192 389 333 -1284 581 1113 -1925 189 1822 -1733 97 2359
2188 2359 -2025 -618 2331 -1649 -1554 2107 -1212 -1774 1464 -401 -1477 909 -98 -855 444 -334
2204 -334 118 -82 -852 466 -67 -1521 771 393 -1779 1075 1256 -2280 676 1823 -2024 -23 1567
$$ packed form
2092A174j887K85K584l116j161N425l382l469P071j826n922P060j92o923N802
2107A523J802o806L159L311n480J493L330l171J2J658q89J91r15P82J335l216
2123a881N77L482m161m6N294m387j794O294l306l753O375j682m505N035k0m557
2139c035L518R61l286J898J128j705R70o73R8N55j427J173J129l109J644K474
2155B313l973R72L964m398n0M461l834j446M915l148j943M149j481k265L287o55
2171H68j949K167n06o68M52n56N81n6j617J865N32l038K114J633l555J830K262
2188B359m384J407K949l980R5L661l319n62L238j865j076K386j007p57J299p78
2204c34M52k00p70J318n33j454K292l78k172K854J81l536K956J147l847K001J590
$$ plain form
2221 1567 -1661 -797 1587 -908 -744 1492 -100 -164 841 192 174 129 -355 473 -88 -637 946 296
2239 296 -765 1425 666 -1173 1352 1325 -1501 611 1198 -1647 13 1293 -1249 -370 1091 -190
2255 -190 -48 709 50 -137 161 -134 114 -496 -418 423 -653 -677 737 -139 -927 1128 198 -1160 586
2274 586 223 -1649 105 358 -1521 -261 501 -798 -326 517 -276 -137 -17 8 -25 -466 -143 13 -617
2293 -617 -152 479 -252 -421 1015 -64 -457 896 -91 -1021 841 176 -789 610 699 -328 173 1055
2311 1055 217 44 654 495 -213 -12 373 24 -859 487 689 -621 340 1147 -286 11 789 -407
2329 -407 -383 725 -116 -1042 195 169 -350 78 360 -274 -116 -70 248 18 -424 472 -458 -866 225 61
2349 61 -1188 409 916 -1233 229 1067 -787 -530 700 -868 -534 656 -75 -683 256 22 -92 146
$$ packed form
2221A567l228Q64K384k495J64K236j592o4J005o49j8m5m84Q28n61n49J583o50
2239B96j061K190p59j839K525k7k826K112N87k845J660J280k542Q79J461j281
2255a90J42P57o59j87K98k95K48o10P8Q41j076k4J414q76p88K055r30j358J746
2274E86l63j872J754K53j879J260P62j299M72Q43p93J39J20K5l3m41L23J56o30
2293f17M65O31p31j69J436j079l93J353r87r30J862o65r65J399Q9j027N01Q82
2311A055q38j73O10j59p08K01L85l49q83J346K02j310R61Q07j433K97P78j196
2329d07K4J108q41r26J237k6n19M28K82o34J58M6L18k30m42Q96r30m08J091j64
2349F1j249J597N07k149J462Q38j854K57J230j568L34J190p31o08R39k34j14K38
$$ plain form
2367 146 -25 350 -136 -533 681 -148 -810 753 179 -1301 915 778 -1115 842 1073 -1186 375
2384 375 1232 -1116 -124 926 -638 -350 740 -231 66 643 59 925 82 -201 1040 -178 -694 1094
2402 1094 -258 -1248 1303 70 -1446 1232 428 -1661 1072 965 -1755 562 780 -1496 102 714
2418 714 -1258 -58 458 -453 84 -63 -188 325 -429 -429 742 -898 -893 919 -1025 -1165 1614 -414 -1349
2437 -1349 1721 -328 -1552 1335 362 -1527 800 547 -1350 299 468 -1020 403 645 -297 336
2453 336 -133 345 449 -788 170 863 -1364 207 1770 -1289 -47 2139 -927 -1003 2340 -484 -1440
2470 -1440 1914 -70 -1483 1403 295 -1058 604 469 -342 123 138 306 -20 -1070 959 135 -1565
2487 -1565 696 613 -2017 629 1673 -2259 33 2245 -1800 -822 2152 -1102 -1455 1573 -585 -1519
$$ packed form
2367A46j71L75m86l97J214q29o62J563n74j480K216j37j893J957K31k259J561
2384C75Q57k348R92J050j564K88J090r71K97N77n84Q66q43k83J241j218n16J788
2402A094j352r90K551j233j516K678q04k089K733j07k720K317K18k276J598O12
2418G14j972J200N16r11N37j47j25N13p54%J171j640NJ812j944j40K779k028r35
2437a349L070k049j224K887r73j889K327k53j897J649J69j488J423K42r42O33
2453C36m69M78J04j237R58O93k227J571J563l059J242K186l066p6L343k824r56
2470a440L354j984j413K886j108j353J662j35q11M65J5J68l26j050K029q24j700
2487a565K261q3k630K646J044l932K292K212m045R78K974l254l53L028k158r34
$$ plain form
2503 -1519 927 49 -902 75 146 97 -576 -391 948 -770 -1661 1655 -85 -2089 1902 848 -2459
2520 -2459 1533 1702 -2581 395 2064 -1882 -378 1985 -1277 -676 1404 -143 -458 737 362 445
2536 445 -516 75 1413 -1036 -467 2175 -969 -1549 2722 -452 -2413 2635 571 -2781 1807 1533
2552 1533 -2656 819 1685 -1873 -160 1291 -888 -275 503 -156 -43 -378 289 675 -1634 58 1543
2569 1543 -2107 -827 2483 -1891 -1558 2668 -1216 -2238 2748 5 -2683 2047 402 -2550 1087
2584 1087 705 -1900 262 576 -425 128 43 455 393 -1094 445 994 -1832 529 2029 -2228 111
2601 111 2580 -2094 -517 3216 -1235 -1638 3111 -383 -1730 2312 -95 -1732 1216 589 -894 852
2617 852 449 41 206 -256 789 94 -1535 1413 877 -2225 1200 1697 -2612 516 2189 -2631 -70
$$ packed form
2503a519K446q78r51R77P1m9o73J85J339j718q91L316j740k004L991j054l307
2520b459L992J69m283K976J669l946J504K363l262O01K080j547l15J195l75Q3
2536D45r61N91J338k449N69K642l144n80M271l174j961N048k064l352M588k74
2552A533m189L475Q66l558J713J451k179O13P78o59J13l35O67L86k309J692J485
2569A543l650J280L310m374L33M226l884j022M986k743k688M730j645k952L637
2584A087l82k605K162L14j001N53q5M12o2j487J539N49k826K361J500m257K339
2601A11K469m674J577L733m451m03M749l494j347M042k407j637K948o27j483J746
2617H52m03m08J65m62J045o95j629K948n36l102L425M97m309L128J673m820K561
$$ plain form
2634 -70 2951 -2023 -944 2508 -1064 -1318 1793 -626 -1295 992 10 -230 -40 -199 577 -749 -1207
2651 -1207 1203 -657 -1813 1786 55 -2703 1661 907 -3163 1258 1581 -2631 553 1953 -2122
2666 -2122 -584 1988 -1331 -849 1218 -475 -213 636 -13 167 -408 -138 1028 -828 -590 2042 -828
2683 -828 -1270 2476 -243 -1539 2129 326 -2475 1676 1302 -2113 1084 1522 -1708 426 1303 -756
2699 -756 -192 767 -245 276 -82 74 827 -1013 -167 1257 -1136 -626 1733 -1385 -1126 1974 -1007
2716 -1007 -1499 1868 -151 -2050 1320 157 -1880 802 565 -1335 295 219 -705 278 90 -374 149
2733 149 -640 206 534 -1099 173 1040 -1291 50 1413 -1351 -480 1821 -990 -868 1911 -415 -887
2750 -887 1257 -159 -873 774 181 -396 606 -18 135 295 -2 298 328 -283 657 430 -549 696 807
$$ packed form
2634g0L021m974J079L452l572k54L111k419o69K287r82k40J90j59P76j326m58
2651a207K410j860j156L599j731k758M364p54m070M421L23m212L184J400m075
2666b122J538K572l319M82K067j693K62Q49o49J80n75K70J166j856K38K632k870
2683h28m42L746k719j296L668j803k801M151l74l415L197M38l230K134Q77k059
2699g56N64R59j012N21l58J56P53j840Q46J424k393N10K359l118K59L100k981
2716a007m92L367k019j899L370j163k037K682k37j900J630p6r24R83j88m64N23
2733A49p89Q46L28j633J272Q67k331J341J363k764Q71K301k811J22K779k326m72
2750h87K144j416p14J647n93n77J002o24J53J60k97L00L0o11R40k27r79J245J11
$$ plain form
2769 807 -866 588 820 -1111 -201 1135 -827 23 1113 -422 -458 640 -536 -911 468 -204 -134
2786 -134 14 -77 185 -152 -296 389 -256 -671 387 117 -862 312 -74 -1062 162 519 -1040 147 536
2805 536 -571 -331 103 -581 76 265 -390 72 343 -122 452 -278 -140 319 173 -183 547 95 -368 668
2825 668 -41 -345 610 77 -312 616 389 -584 521 463 -687 512 193 -503 273 400 -62 95 316
2844 316 61 86 151 234 286 -68 -64 299 -359 -359 542 -95 -49 471 -144 -144 370 29 -782 216 8 -793 203 203
2868 203 -402 0 -111 -319 -233 -155 -91 -146 -250 59 -81 -199 60 -59 -392 34 140 -447 -267 469 -407
2889 -407 -343 603 -105 -384 153 -9 -363 289 297 -116 -114 231 -28 -108 17 276 -263 -201 509 10 -215 507
2911 507 342 -423 357 588 -269 -17 820 -35 -206 630 306 -177 393 217 -152 -79 401 66 -21 230 439
$$ packed form
2769H07j673J454K32j931R10J336j962Q50J090j535l6J098j176l75J379o72P0
2786a34J48r1K62l37j44O85o45m15J058k70r79J174l86r88J224L57j559J187L89
2805E36j107K40M34o84O57J89o55M62K71m65N74p30J38M59j46l56P30m52m63J036
2825F68p09l04R55n33l89R28k27r73J105n8j150J199l19o96P76J27m62J57K21
2844C16k55K5O5Q3N2l54ML63o58%R01o37M6N20o15%N14l41q11R98k08q01R96%
2868B03o05M02j11k08Q6P8O4n5j04L09j40j18K59j19l33M26J06n87J80P36q76
2889d07O4R46p08k79N37j62l54O52Qm13KL45k59q0J25K59n39O2P10m99k25P22
2911E07j65p65P80K31q57K52Q37q55j71Q36l24m83N70j76l69P3M80l35q7K51K09
$$ plain form
2932 439 -620 75 392 -415 -319 556 -141 -848 392 311 -723 -161 297 -471 -420 100 43 -444 104 173 -83
2953 -83 -264 304 -240 -349 89 122 -333 -76 387 -502 -216 731 -205 -392 541 63 -512 379 485 -585
2973 -585 -17 527 -51 136 255 128 5 15 596 -59 -358 384 635 -477 424 603 -446 47 724 -298
2993 -298 -134 619 90 -520 485 20 -215 321 233 -183 59 84 34 -450 -186 231 -209 -457 533 -16 -631
3014 -631 307 74 -734 75 568 -521 -403 493 -361 -376 832 -474 -313 284 78 -263 -35 70 -106
3033 -106 -208 -47 84 -30 -430 93 -70 -461 558 159 -640 482 217 -791 434 529 -644 275 788
3052 788 -180 -29 607 -135 -343 509 -106 -147 358 255 -164 140 58 443 -38 -56 584 -199 -452 711 95
3073 95 -576 568 199 -693 538 319 -700 46 597 -626 -92 561 -423 -200 347 -359 -237 135 22
$$ packed form
2932D39j059O95L17q07R6Q75o97p07J240q1j034N62M58p68N1N20n7m87N48O9k56
2953h3j81N68n44j09M38L3m55K57M63q89K86R47r36j87R33m78n75Q91J06j070
2973e85N68N44n78J87J19j27j23J0N81o55k99P42K51j112R01J79j049M93O77j022
2993b98J64P53n29o10J005m65k35N36q8m16K42K5n0m84K64M17m40k48R90n49o15
3014f31R38k33q08Q09M93j089J18Q96q54j5J208j306J61N97k06l41K28J05j76
3033a06j02J61J31j14m00N23j63l91J019l99p99J122k65j008J225R5j173R19N13
3052G88r68J51O36p42k08Q52o15m1N05j03m19L04q2L85m81j8O40p83k53J163o16
3073I5o71J144l69q92J231k19j019P46N51j223N34O53r84K23N47p06J22L72j13
$$ plain form
3092 22 -17 -367 73 122 -611 -203 540 -550 -474 350 -350 -410 801 32 -813 726 406 -658 176 300
3112 300 -630 0 472 -303 -376 258 108 -82 -155 391 95 -316 493 311 -703 174 785 -514 -199 852
3132 852 -191 -267 979 231 -449 771 165 -723 231 532 -557 395 437 -283 -5 237 193 -101 -161 227
3152 227 124 -780 309 321 -926 241 694 -820 -186 732 -704 -560 1009 -156 -975 558 -163 -944
3170 -944 332 280 -458 113 214 -284 -173 -275 195 -187 -282 557 39 -744 330 166 -759 108 636 -646
3190 -646 -130 872 -475 -143 853 -144 -612 623 268 -299 -23 591 -95 148 321 122 -187 70 623
3209 623 -339 -454 624 -4 -420 684 605 -688 582 533 -663 -65 706 -379 -368 632 -318 -342 323
3228 323 292 -275 274 312 -139 -213 229 248 -509 -395 206 -402 -569 365 68 -638 523 300 -995 426
$$ packed form
3092B2l9l50M40M9p33M08P43j090P6Q24p00o0J211p69q45J539l20j064Q34J24
3112C00r30O30M72p75p3O34j50j90p3N46k96m11Q09j82j014Q77O11j299L15J051
3132H52j043p6J246p48o80J220o06q88R54L01j089R52M2p20K78K42m4k94o0L88
3152B27j03r04J089J2j247J167M53j514O34R18j436J44J569j165q19J533p21p81
3170i44J276n2p38N71J01m98J11j02M70l82r5Q39n18p83J074j64r25Q67N28j282
3190f46N16J002j347L32R96r97m68J235l55n67K76O14o86K43J73j99l09K57N53
3209F23r62j15J078o28m16J104p9j293J270m9j196N98P71j085J1J000r50k4O65
3228C23l1n67N49L8m51p4M42J9p57J14O01o08j67R34k97p06J161k23j295J421
$$ plain form
3248 426 392 -882 -91 504 -710 -176 478 -352 -273 91 199 -186 28 127 -98 -478 -114 88 -520 -26
3268 -26 571 -206 -526 874 54 -544 754 -2 -411 587 394 -501 341 217 -291 331 432 -173 370 338
3288 338 187 127 -51 -56 169 -90 37 383 -536 316 826 -645 -156 859 -377 -173 539 -436 -447 455
3308 455 -288 -523 258 21 -151 414 111 -308 79 79 -88 -16 -336 8 -97 -561 5 172 -455 97 361
3329 361 -427 -226 506 -686 -249 752 -212 -366 611 -194 -236 522 203 -79 181 127 21 69 -191 114
3349 114 -11 -124 295 247 -200 489 2 -350 443 339 -436 238 516 -546 108 764 -336 -92 341 -54
3369 -54 -121 186 -74 42 303 -42 19 79 -148 239 -149 -301 327 109 -477 678 -24 -717 391 171 -850
3390 -850 -70 181 -570 94 208 -107 -172 203 -306 140 -39 -29 253 -303 24 345 -446 -211 152 -239 -211
$$ packed form
3248D26l4j274P91N95j214N34O54q30P9L64J08l85K14R9k25l80L64K02o08M94
3268b6N97p77l20J400q20n98J298p56m09R98j93q95Q42j24n08O22J01o05N43l2
3288C38j51o0j78nK25k59J27L46r19Q52N10j471M89J015j236K04P12r75j1R02
3308D55p43k35P81k37j72N65l03m19L87%j67P2l20L44j05m64N66J67o27N52K64
3329C61p88K01P32j192M37J001r64j54R77q05m2P58l19k82K60n4j06M8k60L05
3349A14j25j13M19m8m47O89m87l52P93j04p75O74K78j062O54O56j100K44M33l95
3369e4o7L07k60J16K61l45O1O0k27L87l88j52O28k18n86J155p02o93J108k20j021
3390h50P80K51p51O64J14l15o5L75n09M46j79J0K82n56L27L21p91K35L63l91K8
$$ plain form
3411 -211 520 -135 -91 243 67 -426 366 156 -364 316 155 -380 90 203 -211 323 -224 -2 159 -135
3431 -135 82 431 -139 144 155 -186 550 756 -404 -20 748 -387 -197 347 -61 -139 441 -133 118 409
3451 409 40 -114 356 -176 252 105 -47 269 78 -342 115 96 -703 157 -73 -428 17 313 -461 117
3471 117 397 -788 166 290 -337 -143 130 -202 168 321 -165 -169 -90 -235 138 90 -153 37 14 -351 202
3492 202 333 -551 360 411 -751 234 451 -307 122 266 -507 79 287 -464 291 492 -185 213 40 86
3512 86 419 -1 -261 385 -125 -285 426 150 -168 611 -27 -415 294 22 -287 224 48 -396 212 20
3532 20 -264 183 20 -250 184 27 -337 245 -122 -266 -54 -300 -342 374 -287 -132 428 -297 -173 586 -422
3553 -422 -334 401 -75 -372 191 -47 -21 85 -72 -277 364 -166 -129 110 -116 -16 507 -290 33 222 -362
$$ packed form
3411b11P31o55M4L34j76m93P92k10n20O80j61n35M70J13m14N34n47K22J61k94
3431a35K17L49n70K83J1l41P36K06j160L84P68j135J90N44m08p8N80n74K51K91
3451D09l69j54M70n32M28j47j52L16j91m20M57j9p99Q60k30l55M45K96p74N78
3471A17K80j185R54J24o27J94K73l32L70J53m86mP9j45L73m8k43J90k3l65N53
3492B02J31q84R11N1j162R85K17p58M29J44p73N86K08p51P55K01o77L98j73M6
3512H6L33m20k60O46n10j60P11k76l18P79o38l88P09k72l09N11j76m44O08j92
3532B0k84M47j63k70M34j57l64N82l67j44K12k46m2P16o61J55N60p25J24P59j008
3553d22Q8P35m76k97N63k38K6J06j57k05O41n30L7K39k26J00N23p97L23J89n84
$$ plain form
3574 -362 322 616 -388 33 408 -266 -36 566 -429 51 353 -229 -165 432 -128 -54 228 -155 245 216 -125
3595 -125 -68 33 -184 449 112 -387 305 44 -371 425 133 -434 -29 415 -571 84 336 -379 -136 133
3615 133 -514 -300 243 -343 -210 118 -272 154 67 -375 169 -21 -330 143 -104 -531 200 -230 -318 365 202
3636 202 -430 289 196 -546 247 61 -590 485 204 -316 60 277 -98 135 187 -268 418 -22 -69 568 -59
3657 -59 -218 330 -181 -196 576 -31 -191 602 -70 -227 446 31 -242 277 -12 -379 530 142 -215 -32 -258
3678 -258 33 413 -168 -24 302 -282 62 251 -190 87 181 -472 -197 250 -133 -290 189 -149 -334 143
3698 143 -230 -115 203 -77 -171 89 -1 78 158 21 15 53 47 76 -50 -285 270 221 -264 210 259 -296 273 557
3722 557 -354 -68 421 -151 -133 463 -70 -33 272 -137 20 300 121 -65 193 -108 260 38 -335 569 -1
$$ packed form
3574c62O84K94j004M21L75o74K30O02r95M80L02n82O4N97n60P4K82l83M00k9l41
3595a25N7J01k17O33l37m99O92k61m15P96k92n67M05M44r86O55K52p15K43K69
3615A33o47K14N43n86J33L28l90M26q7m42N44j90l09M73k47m27P31m30q8O83j63
3636B02o32P19r3p42P93j86o51J075k81n20L76K17l75K33N2m55O86m40m7O37o27
3657e9j59N48n11j5P72o07j60P93o72j57O73m15k73N19k89l67R09l88l57J83k26
3678b58K91L80n81J44L26n84L44J89m41K77R4o53K75M47l83j57M79l38j85M77
3698A43l73J15L18k80r4K60r0P9Q0j37oL8oK9j26k35N55m9m85M74M9n55N69K84
3722E57r11K86M89n72J8N96n33L7L05m09J57K80j79j86K58l01L68k22l73R04n70
$$ plain form
3743 -1 -144 297 -70 -114 141 246 -429 336 200 -301 56 248 -437 67 213 -303 63 97 -352 -1 167
3764 167 -98 -39 -219 -6 172 -24 -202 324 -40 -57 284 -206 -200 317 68 -498 328 90 -294 46 25 -345
3786 -345 210 -26 -163 68 -106 -28 68 21 -97 134 -118 150 258 -260 -188 387 141 177 253 -37 -151 373
3808 373 -3 -46 300 -36 -79 208 70 -160 146 162 -183 -137 -216 -23 245 -247 121 42 -36 -76 295 -146 -138
3831 -138 178 -349 -125 115 -481 -276 150 -133 -255 16 51 -323 149 -276 -233 -305 -156 85 312 -56 200
3852 200 -192 -214 108 49 -233 131 184 -263 192 254 14 33 301 -138 -55 114 97 -150 213 -11 94 0 -18
3875 -18 296 -133 -128 360 233 -195 29 24 -106 241 50 -314 125 334 -64 -34 272 -180 -57 -30 68 116 244
3898 244 186 49 -11 -89 109 -258 55 151 -286 -234 511 -231 -473 332 137 -343 20 -33 -235 172 105 -329
$$ packed form
3743aj43M41l67m4K55J05o75P65j36n01L57J92o85N04J46n16L66L4m49L51J68
3764A67k65N9j80K13J78j96j78N26l64j7L41m90ON17k49n66Q26k38l84L40k1l70
3786c45N55k36j37K31j74P8R6m7j18K31k52K68J08n18P2N75k46L6P6k90j14N24
3808C73l76m3L46l36m3K87j38k30L06J6l45M6p9J93K68m92L68p9p8m0L71m41Q
3831a38L16n27K24K40n96K05M26k83j22K71L5l74M72m25M3p2J49K41K27l68K56
3852B00l92k2L22n9k82L64N3m47M55O2k40J9K68m39Q3J69j7k47L63k24J05r4j8
3875a8L14m29NM88j27m28K24nj30L47j91l64M39K09l98L0L06m52J23K7R8M8J28
3898B44n8j37o0p8J98l67L13R6m37N2P45p42k42Q05j95m80L63n3k02M07o7m34
$$ plain form
3920 -329 -86 146 -4 -147 -174 -215 287 26 -244 -55 -219 -73 345 -536 -12 335 -297 -248 380 -407 -45
3941 -45 230 29 -172 119 203 -65 320 222 -208 66 -106 14 113 -3 228 202 -69 -77 218 -61 -31 481 -229
3964 -229 52 468 -271 -116 315 134 -210 586 -47 -341 331 148 -93 127 164 -321 -134 -19 83 -93
3984 -93 -157 -45 88 -295 -119 100 -412 181 254 -266 -20 146 -164 -150 359 -316 43 492 -61 -135 285 -108
4006 -108 -124 40 112 -265 -86 54 169 105 -67 110 38 -40 500 281 -375 367 34 -254 184 159 -297 -33
4028 -33 456 56 -34 417 69 65 56 -30 59 -6 129 135 -16 -23 360 86 -323 296 -179 -297 77 99 -280 119 214
4053 214 -424 -143 301 -540 203 48 -40 -23 -32 -25 -85 54 -16 -38 -114 -5 17 9 136 274 -341 11 473 -222
4077 -222 -333 417 13 -203 298 -282 -481 244 281 -255 347 286 -306 37 96 -76 231 48 216 -55 -76
$$ packed form
3920c29K43K32j50j43k7m1N02k61k70J89j64J46M18q81N24L47o32M9O28p87L62
3941d5K75k01k01K91Q4k68L85r8m30K74j72J20R9j16K31k6k71qK95k79L0N12p10
3964b29K81M16p39J55M31j81l44P96o33k94O72j83k41K20L7m85J87J15J02j76
3984i3o4J12J33l83J76K19n12N93P3n20K46J66l10J4N09o75L59M49n53p4M20l93
4006a08j6J64P2l77J79J40J15o4j72J77p2p8N40k19o56P42l33k88M38k5m56K64
4028c3M89m00r0M51l48mrq6Q9o5J35Oj51pL83k74m09O19m75j18L74K2l79L99R5
4053B14o38K81M44q41P43j55q8J7rPo0J39p0k2p6J09K2qJ27J38o15L52M62o95
4077b22j11P50m04k16N01n80j99P25L7n36O02o1n92L43N9j72L07j83J68k71k1
$$ plain form
4098 -76 126 301 -273 387 286 -223 188 329 120 -246 322 79 -266 453 89 -137 5 197 -173 188
4118 188 80 -79 80 62 -222 -14 268 -124 72 -28 97 132 -351 33 79 -444 -71 157 -212 -185 312
4139 312 -282 -291 374 -252 -274 65 -119 -286 140 102 -97 141 143 105 13 -167 5 16 -136 55 -38 -146 72
4162 72 162 -266 86 240 -231 -191 307 56 -65 198 -9 -287 144 -44 63 318 201 44 106 376 97
4183 97 -141 -20 8 70 -60 113 -31 -115 135 108 -216 125 119 -339 44 121 154 -149 250 -214 -197 275 -178
4206 -178 -63 -59 48 118 -64 37 -47 -236 -102 10 -260 -253 30 -60 -48 -4 -56 -248 -197 193 146 31 31 89 -232
4231 -232 13 -116 -23 11 -16 104 42 -80 -113 273 108 70 12 67 69 -280 -96 79 -69 -86 218 93 -216 17
4255 17 176 -109 75 197 -104 241 104 80 162 88 -130 0 21 -3 -45 10 47 71 -42 151 29 90 -180 278
$$ packed form
4098g6K02J75n74O60j01n09M11J41k09l66N68k43l45P19l64k26J42J92l70L61
4118A88j08j59J59j8k84K08K82l92J96j00J25L5m83L84M6n23L73K28l69K7M97
4139C12n94rO65o26k2L39j84j67M26l8j99K38Kl8r2j80J72J1j52J91r3j08K18
4162G2R0m28L52J54m71M0M98k51j21K63k07k78M31j88J07K55j17j57O2K70k79
4183I7k38J21K8O2j30J73j44q4K50k7l24L41om58L83P7L3l03L99m64J7M72m53
4206a78J15MJ07P0j82J01q4j89J34J12k70PK83r0J2M4n2j92N1L90m7j15%N8l21
4231b32K45j29R3L4k7J20o2j22l3L86j65l8n8N5Kl49J84J75j48j7L04j25l09K33
4255A7J59k85J84J22l01L45j37k4Q2p4k18J30K1k4m2N5L7K4j13J93j22O1k70M58
$$ plain form
4279 278 -121 149 164 -268 15 205 -147 53 5 83 -143 29 5 -230 185 -72 29 -50 -165 -85 -35 -31 -51
4302 -51 236 -51 -194 37 -210 -92 214 19 8 395 -64 -56 167 3 132 86 -134 103 152 79 -80 -23 42
4325 42 -38 -112 86 40 -12 -5 129 -240 -219 56 -133 -85 81 -76 -99 -15 161 -373 -134 223 91 -88 -9 -64
4349 -64 27 41 164 -151 27 239 -5 -125 -116 -42 103 146 -145 -35 -196 73 -102 -31 115 -97 -73 232 25
4372 25 -135 -16 26 -240 -77 104 -97 -67 -160 137 283 25 -3 54 -131 -88 -86 -110 -133 -79 -166 28 -43 -72 -45
4397 -45 223 -65 37 63 -29 145 79 -23 204 -18 -54 62 43 -175 162 -155 105 193 159 -43 -86 -23 -14 -41
4421 -41 -5 -124 157 118 -32 151 18 30 91 -72 29 -31 -55 -359 43 -56 -162 25 -118 -104 48 138 -90
4444 -90 123 -263 -293 102 206 -118 -238 -85 -178 -40 158 -228 80 -51 -343 -157 145 -40 42 -51 158 8
$$ packed form
4279B78l99K70J5m32K83J90l52K00m8P8k26J72k4k35M15k57J01p9j15Q0N0Mk0
4302e1K87k87j43K31k47J18L06j95j1L87m59QK23j64J29m6k20K37M9p3j59N7O5
4325D2q0p4J98m6n2PJ34l69K1K75j89M8J66j57k3Q4J76n34K39L57j32j79P9n5
4349f4R1J4J23l15J78K12k44j20RP4J45M3k91J10j61K69j75P1J46k12K4L05k07
4372B5j60J19M2k66J63J81k01L0r3K97J46k58k8N7j85M3Kk4k3N4q7J94p1k9K7
4397d5K68k88J02K6r2J74o6j02K27k22l6J16j9k18L37l17K60Q8l4k02m3O3Rk7
4421d1L6j19K81l9j50J83j33J2O1j63J01o0k4l04M02r9j06J87j43J4J52R0k28
4444i0K13l86l0L95J04l24j20J53r3J38J98l86L08j31k92J86L02j85Q2r3K09j50
$$ plain form
4466 8 -130 17 42 139 -232 -35 78 49 272 130 42 250 111 47 159 100 95 48 132 -51 -43 38 86 168 -296 -71
4492 -71 39 -254 -140 289 -179 134 205 -377 76 -60 -214 -236 143 -139 -151 -149 -76 -30 -96 -15 -128 68 -17 -17
4516 -17 80 -317 279 147 -207 -66 270 -159 47 384 8 -51 216 -21 -163 372 -194 -54 96 -157 -62
4537 -62 279 -13 29 80 51 -9 -94 44 -78 103 -141 47 -71 -330 344 28 -233 235 290 -15 26 108 -414
4560 -414 -12 -11 -164 -94 187 63 108 315 -74 364 -126 39 83 75 -239 -64 119 116 267 151 90 255 -136
4583 -136 -129 227 255 -165 -154 117 -340 46 48 -68 42 -46 -164 -17 -151 -5 -34 -27 -130 133 -60 -75 121 36
4607 36 -74 257 -195 41 -110 120 -140 435 -50 -229 212 109 -305 5 20 1 136 107 26 168 141 -90
4629 -90 56 -30 66 -49 -180 53 262 -132 -81 81 -271 -233 42 -176 -196 266 -145 -22 245 -2 -149 -7
$$ packed form
4466Hj38J47K5R7l71J97J13k9K23j42q8K08j39o4J12n9nm7Q4j83QQ1M8Q2m64K25
4492g1J10k93J14M29m68L13P1n82M53j36j54k2L79k82j2KP3M6o6Q1j13J96q5%
4516a7R7l97N96j32l54J41L36m29K06L37l76n9K67k37j42N35n66J40J50k53R5
4537f2L41k92M2N1k9o0q5J38j22J81k44J88j18k59O74l16k61M68N5l05M1Q2n22
4560d14M02Jj53P0K81j24M5K07l89M38m90J65M4ql14J75J83lJ51j16o1J65l91
4583a36PL56K8m20J1K71m57L86Kj16J10q8j18J47j34J46k9Pj03K63j93j5J96q5
4607C6j10L31m52K36j51K30k60N75m85j79M41j03m14L10J5j9J35k9q1J42k7k31
4629i0J46q6R6j15j31K33K09l94N1J62l52L8K75k18k0M62m11J23K67k47j47J42
$$ plain form
4651 -7 156 -26 -28 116 -202 -115 321 59 -15 -171 -181 -270 -170 -214 207 -79 165 153 -320 -50 -85 -339 40 42
4675 42 114 17 152 -86 -140 -210 -93 -208 -231 -86 192 -208 -130 82 16 -125 160 15 -277 -116 -69 -217 93
4698 93 203 -208 -304 415 -352 2 211 -77 192 -6 -12 -175 7 90 128 -100 -124 -73 -253 151 95 23 -181
4721 -181 36 -160 -59 57 -58 -106 -104 78 -154 -15 0 -108 -116 36 6 -187 43 -155 -55 -181 16 -60 -226
4744 -226 47 2 364 159 54 -9 -185 210 -30 22 188 -86 -287 -2 126 -15 17 231 -40 -73 79 -77
4766 -77 15 7 -241 -184 -10 -88 31 -158 119 267 133 161 62 -121 71 -18 -107 -53 359 161 -253 94 334 -94
4790 -94 197 88 -37 -141 276 -116 -184 -294 56 -49 -131 92 -131 63 -106 295 -389 121 -130 -148 -43
4811 -43 261 -173 -191 60 43 205 125 144 -239 85 325 -150 -136 -93 125 53 -83 130 36 -116 140 -62 92
$$ packed form
4651gJ63j82kJ44l18Q7M36k62p4j56j0q9J00m4M21k86K44j2m73K70l5k54L79K
4675D2P2r7J35k38n4p0J17j15k3J45K78m00P8K12o6j41K85j45k92J61M7j48L10
4698I3J10m11r6P19p67L54K09k88K69j98oj63J82Q3L8k28k4N1j80M04n6p2k04
4721a81K17j96J01J16j15m8KJ82k32J39J5j08qJ52l0j93K30j98J00j26J97p6j66
4744b26K73m5L62k05j05o3j76L95k40N2J66k74k01K85J28j41L2K14k71l3J52j56
4766g7R2qk48N7J74p8J19j89K77J48j34K8r9j83J92q9q9N4M12j98m14L47K40m28
4790i4K91j09j25j04M17l92o8j10L50j05q2K23k23J94j69M01o84N10k51j8J05
4811d3L04m34j8K51j7J62q0J9l83L24K40m75J4M3K18p2j36K13r4j52K56k02J54
$$ plain form
4834 92 -309 285 77 -66 8 -7 37 254 64 -100 20 -116 -137 266 -57 -125 30 1 17 14 95 102 -102 -65 -88
4859 -88 -62 -118 275 209 129 94 138 171 -75 15 -78 -71 113 -101 -57 -134 -32 -33 158 -78 -175 -37 9 14 10 141 35
4886 35 84 105 8 296 -10 -32 163 -167 -63 -106 -215 73 89 4 -41 83 -164 92 192 71 81 62 11 73
4910 73 202 1 73 -195 86 81 225 -73 322 11 -16 -96 -45 -159 -115 70 -109 17 70 229 240 249 -70 -8
4934 -8 58 16 -220 -46 -89 84 118 87 304 -40 150 149 -96 -182 8 58 -66 215 -270 -130 118 209 -129 -47
4958 -47 178 -133 284 -114 233 -8 194 199 -19 109 -121 -268 -14 -55 -205 40 228 279 176 -169 -150 11
4980 11 113 245 -115 -83 35 -207 -89 -135 -114 -93 -38 -23 156 172 20 130 24 0 22 188 -150 270 60
5003 60 -168 -27 0 86 254 362 -14 -133 158 242 57 150 -195 -152 -26 51 -383 90 142 -3 179 285 -51
$$ packed form
4834I2m01N94k08j43P4j5M4K17j90j64J20j36k1M03l23o8J55k9J6lQ1Pk04L7k3
4859h8K6n6L93o6q0l5M4L3k46R0r3PJ84k14M4p7J02jJ91k36r7J38M6NmJ31j06
4886C5M9K1r7K88l06k2J95l30J04m3j09K88J6q5m5J24k47K56J00j21J0j9n1O2
4910G3J29k01P2k68K81nJ44k98L95l11k7q0N1j14M4J85j79J26N3J59J1Rl19O2
4934hO6m2k36J74m3J73L4l1K17l44J90jk45q6J90N0j24K81m85J40K48R1l38Q2
4958d7K25l11M17l98L47k41K02Nk18J28k30j47K54m1j50K45J88N1j03l45J9J61
4980A1J02J32l60L2J18k42J18m6K1K1N5J5J79J6j52J10j06k4K2J66l38M20k10
5003F0k28J41K7Q6J68J08l76j19K91Q4j85R3l45M3J26P7m34M73N2j45J82J06l36
$$ plain form
5026 -51 -40 -279 221 -40 -222 186 -198 -254 -93 -140 -157 67 -98 -145 -49 -246 -77 -31 36 -99 -27 11 -93 -18
5050 -18 -106 47 49 3 13 -20 -95 -99 4 13 -47 119 108 48 161 46 -51 101 102 44 182 -318 70 -256 -36 331
5076 331 73 -62 -63 173 -135 61 221 50 -43 131 -213 -52 -134 58 191 113 157 26 134 -20 -19 52 -74
5099 -74 29 -196 -263 183 11 37 162 116 -194 56 -174 -114 -72 -79 -129 131 -2 -263 5 -152 -121 -95 149 -226
5123 -226 -201 42 88 -169 196 -241 -28 133 -223 25 -230 46 -66 90 -68 -43 162 -49 218 11 -7
5144 -7 69 -66 90 34 69 35 -77 63 -348 64 250 -139 83 0 191 6 213 202 223 86 44 17 89 74
5168 74 75 -486 13 -63 -150 -359 -67 -139 11 -136 -39 -98 7 -129 -117 -61 150 -55 -22 -72 -259 112 -176 54
5192 54 -150 -257 3 102 -86 26 69 76 -135 -31 63 -73 -90 7 42 45 -189 184 133 73 103 52 80 76 136 58 114
$$ packed form
5026e1J1k39N00k61j82M08l84n6J61m7j7K24j65m7R6j97J69M6O7j35P2L8j04P5
5050a8q8J53Km6J0l3p5mJ03Ro0J66j1o0J13j15r7J52Jn8J38n00L88l26K20L67
5076C31k58j35jK36l08J96J60j71r3J74l44J61q2J92J33p8M4j31J08j54JP1j26
5099g4J03k25o7M46j72K6J25m6l10K50k30O0M2pn0K60j33k61K68j57L1K6K44l75
5123b26K5K43M6k57L65m37K13J61l56K48k55K76j12J56j58K5K05k11K67k07j8
5144gP6j35J56n6L5l4j12J40m11M12J86l89K22q3J91j85K07j1K1j37m2k7P2j5
5168G4Jn61M99p6q7k09K92p2J50j47R7n9J05j36J2N6K11k05L3n0j87L71k88K30
5192E4k04j07K60R9j88J12M3Pk11J04R4j36j7R7L5Lk34L73n1o0L0n1K8mO0p8N6
$$ [...]
8191i
##END NTUPLES=NMR FID
##END=
