##TITLE=1H_Pr en-11
 DMSO, 8 sc, 
 3.6.2020
##JCAMPDX= 6.0         $$ Bruker NMR JCAMP-DX V2.0
##DATA TYPE= NMR FID
##DATA CLASS= NTUPLES
##ORIGIN= UXNMR, Bruker Analytische Messtechnik GmbH
##OWNER= root
$$ XWIN-NMR		Version 3.5
$$ Wed Jun  3 10:50:01 2020 Russian Standard Time (UT+4h)  she@DPX200
##.OBSERVE FREQUENCY= 200.1315
##.OBSERVE NUCLEUS= ^1H
##.DELAY= (6, 6)
##.ACQUISITION MODE= SIMULTANEOUS
##.ACQUISITION SCHEME= undefined
##.AVERAGES= 8
##.DIGITISER RES= 18
##SPECTROMETER/DATA SYSTEM= spect
##.PULSE SEQUENCE= zg30
##.SOLVENT NAME= D2O
##.SHIFT REFERENCE= (INTERNAL, D2O, 0, 15.7039)
##AUDIT TRAIL= $$ (NUMBER, WHEN, WHO, WHERE, WHAT)
$$ ##TITLE= Audit trail, XWIN-NMR		Version 3.5
$$ ##JCAMPDX= 5.01
$$ ##ORIGIN= Bruker BioSpin GmbH
$$ ##OWNER= she
$$ F:/spectra/data/she/nmr/H-F/1/audita.txt
$$ ##AUDIT TRAIL=  $$ (NUMBER, WHEN, WHO, WHERE, WHAT)
(   1,<2020-06-03 10:48:52.31 +0400>,<she>,<DPX200>,
      <created by zg, POWCHK disabled, PULCHK disabled
       configuration hash MD5:
       00 E9 B6 7A A2 85 ED C7 34 08 36 98 17 FE 4E 26
       data hash MD5: 16K
       85 A4 40 F3 6D D8 5D 1C 45 66 BD 10 00 B1 88 41>)
$$ ##END=
$$ 
$$ hash MD5
$$ B0 5B E3 87 70 44 1F D2 63 18 0A 61 E4 5E 1A ED
##$RELAX= 
##$RELAX= 
##$RELAX= 
##$RELAX= 
##$RELAX= 
##$RELAX= 
$$ Bruker specific parameters
$$ --------------------------
##$DU= <F:/spectra>
##$EXPNO= 1
##$NAME= <H-F>
##$PROCNO= 1
##$TYPE= <nmr>
##$USER= <she>
##$AMP= (0..31)
100 100 100 100 100 100 100 100 100 100 100 100 100 100 100 100 100 100 
100 100 100 100 100 100 100 100 100 100 100 100 100 100 
##$AQSEQ= 0
##$AQ_mod= 1
##$AUNM= <au_zg>
##$AUTOPOS= <>
##$BF1= 200.13
##$BF2= 200.13
##$BF3= 200.13
##$BF4= 200.13
##$BF5= 200.13
##$BF6= 200.13
##$BF7= 200.13
##$BF8= 200.13
##$BYTORDA= 1
##$CFDGTYP= 0
##$CFRGTYP= 5
##$CHEMSTR= <none>
##$CNST= (0..31)
1 1 145 1 1 1 1 1 1 1 1 1 1 1 1 1 1 1 1 1 1 1 1 1 1 1 1 1 1 1 1 1 
##$CPDPRG= <>
##$CPDPRG1= <>
##$CPDPRG2= <>
##$CPDPRG3= <>
##$CPDPRG4= <mlev>
##$CPDPRG5= <mlev>
##$CPDPRG6= <mlev>
##$CPDPRG7= <mlev>
##$CPDPRG8= <mlev>
##$CPDPRGB= <>
##$CPDPRGT= <>
##$D= (0..31)
0 1.2 0 0 0 0 0 0 0 0.06 0 0.03 0 0 0 0 0.0002 0 0 0 0 0 0 0 0 0 0 0 0 
0 0 0 
##$DATE= 1591166931
##$DBL= (0..7)
120 120 120 120 120 120 120 120 
##$DBP= (0..7)
150 150 150 150 150 150 150 150 
##$DBP07= 0
##$DBPNAM0= <>
##$DBPNAM1= <>
##$DBPNAM2= <>
##$DBPNAM3= <>
##$DBPNAM4= <>
##$DBPNAM5= <>
##$DBPNAM6= <>
##$DBPNAM7= <>
##$DBPOAL= (0..7)
0.5 0.5 0.5 0.5 0.5 0.5 0.5 0.5 
##$DBPOFFS= (0..7)
0 0 0 0 0 0 0 0 
##$DE= 6
##$DECBNUC= <off>
##$DECIM= 24
##$DECNUC= <off>
##$DECSTAT= 4
##$DIGMOD= 1
##$DIGTYP= 9
##$DL= (0..7)
0 120 120 120 120 120 120 120 
##$DP= (0..7)
150 150 150 150 150 150 150 150 
##$DP07= 0
##$DPNAME0= <>
##$DPNAME1= <>
##$DPNAME2= <>
##$DPNAME3= <>
##$DPNAME4= <>
##$DPNAME5= <>
##$DPNAME6= <>
##$DPNAME7= <>
##$DPOAL= (0..7)
0.5 0.5 0.5 0.5 0.5 0.5 0.5 0.5 
##$DPOFFS= (0..7)
0 0 0 0 0 0 0 0 
##$DQDMODE= 0
##$DR= 18
##$DS= 0
##$DSLIST= <SSSSSSSSSSSSSSS>
##$DSPFIRM= 0
$$ [...]
##$SUBNAM2= <"">
##$SUBNAM3= <"">
##$SUBNAM4= <"">
##$SUBNAM5= <"">
##$SUBNAM6= <"">
##$SUBNAM7= <"">
##$SUBNAM8= <"">
##$SUBNAM9= <"">
##$SW= 24.9337058887773
##$SWIBOX= (0..15)
0 0 2 0 0 0 0 0 0 0 0 0 0 0 0 0 
##$SW_h= 4990.01996007984
##$TD= 16384
##$TD0= 1
##$TE= 0
##$TE2= 300
##$TE3= 300
##$TEG= 300
##$TL= (0..7)
0 120 120 120 120 120 120 120 
##$TP= (0..7)
150 150 150 150 150 150 150 150 
##$TP07= 0
##$TPNAME0= <>
##$TPNAME1= <>
##$TPNAME2= <>
##$TPNAME3= <>
##$TPNAME4= <>
##$TPNAME5= <>
##$TPNAME6= <>
##$TPNAME7= <>
##$TPOAL= (0..7)
0.5 0.5 0.5 0.5 0.5 0.5 0.5 0.5 
##$TPOFFS= (0..7)
0 0 0 0 0 0 0 0 
##$TUNHIN= 0
##$TUNHOUT= 0
##$TUNXOUT= 0
##$USERA1= <user>
##$USERA2= <user>
##$USERA3= <user>
##$USERA4= <user>
##$USERA5= <user>
##$V9= 5
##$VALIST= <valist>
##$VCLIST= <CCCCCCCCCCCCCCC>
##$VD= 0
##$VDLIST= <DDDDDDDDDDDDDDD>
##$VPLIST= <PPPPPPPPPPPPPPP>
##$VTLIST= <TTTTTTTTTTTTTTT>
##$WBST= 1024
##$WBSW= 4
##$XGAIN= (0..3)
0 0 0 0 
##$XL= 0
##$YL= 0
##$YMAX_a= 213332
##$YMIN_a= -162984
##$ZGOPTNS= <>
##$ZL1= 120
##$ZL2= 120
##$ZL3= 120
##$ZL4= 120
##$ABSF1= 10
##$ABSF2= 0
##$ABSG= 5
##$ABSL= 3
##$ALPHA= 0
##$AQORDER= 0
##$ASSFAC= 0
##$ASSFACI= 0
##$ASSFACX= 0
##$ASSWID= 0
##$AUNMP= <proc_1d>
##$AZFE= 0.1
##$AZFW= 0.1
##$BCFW= 1
##$BC_mod= 2
##$BYTORDP= 1
##$COROFFS= 0
##$CY= 11.3945322036743
##$DATMOD= 1
##$DC= 2
##$DFILT= <>
##$DTYPP= 0
##$F1P= 16.9975609425685
##$F2P= -3.02152046262296
##$FCOR= 0.5
##$FTSIZE= 0
##$FT_mod= 4
##$GAMMA= 1
##$GB= 0.15
##$INTBC= 1
##$INTSCL= 1
##$ISEN= 128
##$LB= 0.24
##$LEV0= 0
##$LPBIN= 0
##$MAXI= 10000
##$MC2= 0
##$MEAN= 0
##$ME_mod= 0
##$MI= 1.114404
##$NCOEF= 0
##$NC_proc= 0
##$NLEV= 6
##$NOISF1= 3.799351
##$NOISF2= 2.8
##$NSP= 1
##$NTH_PI= 0
##$NZP= 0
##$OFFSET= 15.70392
##$PC= 1
##$PHC0= -9789.895
##$PHC1= 9.800819
##$PH_mod= 1
##$PKNL= yes
##$PPARMOD= 0
##$PSCAL= 0
##$PSIGN= 0
##$REVERSE= no
##$SF= 200.130013532006
##$SI= 16384
##$SIGF1= 3
##$SIGF2= 2
##$SINO= 400
##$SIOLD= 16384
##$SREGLST= <1H.CDCl3>
##$SSB= 0
##$STSI= 0
##$STSR= 0
##$SW_p= 3612.71676300578
##$SYMM= 0
##$S_DEV= 0
##$TDeff= 0
##$TDoff= 0
##$TI= <>
##$TILT= no
##$TM1= 0
##$TM2= 0
##$TOPLEV= 0
##$USERP1= <user>
##$USERP2= <user>
##$USERP3= <user>
##$USERP4= <user>
##$USERP5= <user>
##$WDW= 1
##$XDIM= 8192
##$YMAX_p= 0
##$YMIN_p= 0
$$ End of Bruker specific parameters
$$ ---------------------------------
##NTUPLES= NMR FID
##VAR_NAME=  TIME,          FID/REAL,        FID/IMAG
##SYMBOL=    X,             R,               I
##VAR_TYPE=  INDEPENDENT,   DEPENDENT,       DEPENDENT
##VAR_FORM=  AFFN,          ASDF,            ASDF
##VAR_DIM=   8192,          8192,            8192
##UNITS=     SECONDS,       ARBITRARY UNITS, ARBITRARY UNITS
##FACTOR=    0.0002004,     1,               1
##FIRST=     0,             0,               0
##LAST=      1.6414764,     0,               0
##MIN=       0,             -162984,         0
##MAX=       1.6414764,     213332,          0
$$ Real data points
##PAGE= N=1
##DATA TABLE= (X++(R..R)), XYDATA
0 0 0 0 0 0 0 0 0 0 0 0 -8 8 -8 8 -16 16 -17 24 -24 32 -38 41 -49 57 -65 78 -87 97 -113 127 -143 160 -183
33 -183 201 -227 253 -279 312 -345 382 -426 471 -520 577 -639 707 -785 874 -974 1093 -1231
51 -1231 1393 -1593 1840 -2159 2587 -3192 4123 -5750 9376 -36205 94002 210856 60286
64 60286 -116395 -151653 -17584 108595 132155 45201 -56166 -100711 -45153 54611 109727
75 109727 56892 -51390 -115133 -72089 27884 91829 59596 -33718 -107227 -89849 10370 110238
87 110238 107917 -8657 -125758 -106559 42186 161266 113143 -47407 -143435 -78074 67065
98 67065 138372 68420 -66140 -133373 -70221 53126 108492 44367 -63023 -104959 -53024 33990
110 33990 83171 61907 -12702 -81000 -73969 16977 107847 98969 -9762 -105828 -84886 29951
122 29951 113853 79487 -34409 -110490 -79901 18965 90117 69478 -24220 -106071 -90049 16784
134 16784 108268 84101 -30419 -104793 -61611 43471 99096 62652 -16702 -70507 -59936 7643
146 7643 78678 79604 -3925 -93416 -91798 4048 91289 75847 -24138 -101096 -77102 18702 88039
159 88039 67348 -14723 -76867 -61841 14424 82865 77346 -244 -74254 -68948 9928 79089
171 79089 69371 -6934 -74757 -74091 -6771 65727 72032 313 -80036 -83286 -3226 76691 75407
184 75407 -1131 -71999 -69006 3255 76261 79007 6596 -68990 -70774 3214 74445 69688 -3753
197 -3753 -70784 -67429 -2923 57934 57176 -740 -59768 -65954 -14254 50588 68602 17852 -54807
210 -54807 -73627 -11922 67154 78594 12570 -58617 -63678 -5276 56625 65741 13140 -53299
222 -53299 -72133 -20289 51703 68049 9830 -61671 -72027 -13159 53672 63797 11898 -49309
234 -49309 -60546 -11116 51097 66862 21148 -42461 -61926 -16641 48690 66200 16768 -48700
246 -48700 -64578 -18550 40511 55546 15640 -41894 -63025 -25458 37304 63718 24332 -39845
258 -39845 -61862 -19548 42943 64337 26226 -33816 -58853 -23543 38289 64162 25482 -39819
270 -39819 -65106 -25278 36547 58058 18514 -40737 -60330 -22845 33354 54101 21906 -29884
282 -29884 -52103 -22923 30327 57741 30793 -25264 -54174 -25639 29955 55643 27421 -26795
294 -26795 -55520 -31788 21955 53742 29613 -28178 -60813 -32605 26592 56380 27620 -27288
306 -27288 -52529 -24646 27582 54131 29513 -20820 -47615 -26334 22087 49890 30100 -19535
318 -19535 -50420 -32525 16750 47816 28748 -20277 -50652 -33061 14941 47949 33648 -15245
330 -15245 -49509 -33130 19164 53084 33867 -16522 -46222 -27840 17719 45928 30354 -14149
342 -14149 -45528 -32597 11077 42577 30325 -13436 -45753 -34100 9665 42675 33222 -9435
354 -9435 -42864 -33193 10832 44985 35954 -7441 -42062 -33229 10385 44813 33949 -10886 -43270
367 -43270 -32516 8723 38576 28912 -8803 -39755 -33486 4368 37541 32676 -4987 -37764 -32403
380 -32403 5107 38943 35499 -1589 -35948 -32965 4166 38911 35479 -3164 -38420 -35162 2637
393 2637 36379 32379 -5301 -38319 -33622 2651 34348 30777 -2877 -33058 -30862 1447 33211
406 33211 33878 2395 -30435 -31974 -334 32797 33970 2121 -31538 -34282 -3600 30470 33568
419 33568 1522 -33233 -35261 -2885 31503 32994 1409 -30925 -31326 -1207 30699 31995 3710
432 3710 -26740 -29707 -2940 27599 31786 5181 -26527 -32267 -6756 24934 31275 5153 -27101
445 -27101 -33444 -7768 25029 32263 6788 -26064 -32631 -6121 27241 32984 6761 -24665 -29783
458 -29783 -4974 24946 30456 6827 -23226 -30144 -7860 21549 28955 7403 -22430 -31188 -9973
471 -9973 20352 30097 9351 -20995 -30431 -9448 21564 31635 10394 -19822 -29600 -8669 21541
484 21541 30306 9252 -20564 -29463 -9472 18687 27404 8574 -18847 -28253 -10883 16029 27243
497 27243 11218 -15977 -27851 -11759 16602 29394 13630 -15142 -28403 -12165 16797 29405
509 29405 12978 -16604 -29404 -12344 16126 27623 10511 -17243 -27638 -11763 14678 25380
521 25380 10990 -13968 -25226 -11628 13118 25177 13073 -11011 -24071 -12923 11357 25308
533 25308 14662 -10716 -25836 -15307 10562 25489 14867 -11378 -27222 -16131 11026 26655
545 26655 14307 -12323 -26256 -13027 12545 25094 13561 -10614 -23393 -12151 10890 23270
557 23270 13017 -9255 -21908 -13687 7525 21250 13929 -7780 -22571 -15952 6629 22077 14930
570 14930 -7110 -22244 -15490 6369 22824 16719 -5535 -22258 -15832 7683 23254 15544 -6742
583 -6742 -22593 -15632 6584 21529 14723 -7274 -22010 -14788 6237 20067 14020 -5272 -19338
596 -19338 -14683 4718 19999 15860 -3733 -19111 -14925 4549 19173 15501 -3352 -18596 -15744
609 -15744 2780 18330 15361 -2725 -18651 -16767 1284 18127 16874 -2268 -19412 -17294 2843
622 2843 19818 16472 -3140 -18026 -14939 2837 17502 15472 -1530 -17290 -15505 1564 16812
635 16812 14714 -1460 -16399 -15354 536 15861 15251 -561 -15885 -15015 609 15171 15522 990
649 990 -14253 -15650 -1473 15621 17294 1351 -15778 -16629 -591 15424 15652 158 -15579 -16177
663 -16177 -1120 14564 15237 324 -14444 -14607 -1055 13619 15123 2707 -13127 -15624 -1861
676 -1861 14412 15905 1504 -13916 -14879 -1800 12907 14723 1778 -12829 -15161 -2995 11769
689 11769 14624 2935 -11685 -15243 -3633 12111 16334 3759 -12288 -15003 -2359 12192 14319
702 14319 3001 -10310 -14167 -4713 10134 15056 4750 -11047 -15771 -4715 10872 15193 4044
715 4044 -11366 -15370 -3817 11373 14855 3268 -10191 -13413 -3236 9354 13301 4451 -8661
728 -8661 -13932 -5178 9119 13822 4501 -9108 -13585 -5109 7850 13026 5374 -7705 -13896 -6000
742 -6000 7759 14025 6452 -7496 -14396 -6739 7944 15462 6807 -9064 -15326 -5307 9776 13753
756 13753 4198 -8684 -12981 -4874 7133 12160 4881 -6695 -11821 -5766 6023 11843 6698 -5318
770 -5318 -12193 -6941 6069 13062 7134 -5926 -12372 -6774 4939 11881 7500 -4451 -12977 -8872
784 -8872 5388 13918 7638 -6403 -13589 -6862 6049 12938 6549 -5957 -12154 -6103 5664 11849
798 11849 6288 -5016 -10773 -6407 3776 10766 7284 -3740 -11405 -7673 3905 10866 7388 -3330
812 -3330 -10661 -7735 2820 11087 8551 -2617 -11036 -7905 3241 11286 8409 -2582 -11013 -8414
826 -8414 2547 11401 8334 -3868 -11383 -7339 3469 9754 6663 -2614 -9625 -7415 2336 9935
840 9935 7444 -1832 -9667 -7328 1446 9605 8106 -1231 -9664 -8364 1793 9822 7893 -1656 -9106
855 -9106 -7723 614 8816 8494 -692 -9933 -8951 1051 9459 8251 -1359 -9006 -7608 870 9056
870 9056 8205 -390 -8590 -7893 722 8307 7908 -28 -7677 -8256 -492 7668 8213 -27 -8102 -8079 -160
887 -160 7624 7997 983 -7226 -8552 -704 7763 8143 475 -7781 -7925 -598 6971 7955 837 -7506
903 -7506 -8675 -852 7663 7969 333 -7023 -7574 -1046 6260 7852 1302 -6556 -8095 -1461 6588 8042
919 8042 1557 -5782 -7767 -1909 5981 8040 2004 -6518 -8262 -1481 6139 7622 1593 -5954 -7702
934 -7702 -2322 5911 8137 2238 -6072 -7661 -1859 5660 7368 2365 -5357 -7390 -2529 5335 7790
949 7790 2260 -5215 -7876 -2192 4767 7157 2906 -4751 -7912 -2952 5181 7667 2260 -4742 -7239
964 -7239 -2693 4372 7469 3387 -4501 -7574 -3069 4266 7434 2530 -4143 -7137 -3352 3864 7265
979 7265 3301 -3757 -7261 -3611 4224 6809 3110 -3749 -6756 -3419 3337 7129 3742 -3420 -7046
994 -7046 -3513 3498 6463 3905 -2800 -6768 -3959 2818 6640 3563 -3247 -6367 -3641 2937 6274
1009 6274 3501 -2674 -6319 -3869 2770 6801 4024 -2488 -6265 -3717 2225 6184 4049 -2223 -6515
1024 -6515 -4317 2229 6319 3745 -2165 -5961 -4174 1939 6161 4239 -2043 -6008 -4070 2209 5939
1039 5939 4188 -1749 -5786 -4303 1225 5836 4437 -1691 -6141 -4034 1495 5544 4259 -1365 -5578
1054 -5578 -4369 977 5641 4456 -1065 -5405 -3970 1153 5376 4155 -842 -5232 -4434 1003 5285
1069 5285 4287 -1003 -4916 -4133 636 4918 4413 -349 -5189 -4500 730 5071 4174 -711 -4800 -4291
1085 -4291 318 4618 4749 -318 -4670 -4498 512 4682 4183 -98 -4428 -4345 -69 4325 4400 -81 -4497
1102 -4497 -4336 -56 4240 4372 200 -4008 -4660 -246 4441 4686 136 -4377 -4246 -534 3972 4188
1118 4188 528 -4121 -4612 -406 4197 4104 506 -4076 -4136 -337 3519 4547 715 -3359 -4560 -740
1134 -740 3779 4377 693 -3428 -4250 -1082 3508 4133 1087 -3534 -4522 -633 3464 3950 994 -3295
1150 -3295 -4428 -1464 3154 4359 1075 -3188 -4311 -1408 2810 3896 1259 -2823 -4274 -956 2797
1165 2797 4340 1274 -2805 -4230 -1560 2610 3981 1584 -2884 -4273 -1658 2533 4198 1600 -2436
1180 -2436 -4026 -1814 2236 3982 1710 -2342 -4035 -2063 2357 4080 1701 -2440 -3979 -1743 2069
1195 2069 3976 1788 -2426 -3990 -1719 2419 3871 1435 -1902 -3606 -2209 2053 3570 1963 -1854
1210 -1854 -3722 -1809 1996 3731 1824 -1626 -3381 -2196 1451 3702 2154 -1464 -3648 -2151 1359
1225 1359 3579 2269 -1164 -3473 -1983 1410 3866 1920 -1417 -3660 -2089 1365 3297 2085 -1083
1240 -1083 -3461 -2352 1189 3252 2015 -1194 -3588 -2271 722 3237 2319 -941 -3101 -2230 943
1255 943 3053 2135 -1139 -3000 -2170 538 3261 2301 -744 -3232 -2416 990 2978 2467 -841 -3019
1271 -3019 -2415 398 3217 2417 -568 -2909 -2475 658 2904 2413 -650 -2799 -2718 467 2915 2273 -611
1288 -611 -2863 -2305 414 2631 2358 -576 -2694 -2386 260 2771 2365 -295 -2503 -2367 258 2563
1304 2563 2824 -319 -2586 -2648 -57 2449 2709 49 -2627 -2468 205 2603 2343 -107 -2667 -2038 187
1321 187 2087 2072 97 -2263 -2328 -6 2259 2154 203 -2142 -2226 -193 2295 2284 -37 -2123 -2401 -397
1339 -397 2194 2407 -24 -1991 -2314 -297 2099 2430 122 -2207 -2508 -246 2202 2209 149 -2017 -2272
1356 -2272 -389 1923 2341 429 -1831 -2304 -237 1605 2245 704 -1718 -2371 -518 1728 2241 832
1372 832 -1905 -2176 -838 1295 2161 634 -1640 -2468 -604 1870 2248 529 -1521 -2329 -695 1408
1388 1408 2280 626 -1561 -2103 -387 1412 1978 595 -1359 -2399 -970 1129 2124 835 -1491 -2083
1404 -2083 -712 1405 1739 1097 -1487 -1893 -703 1548 2233 841 -1309 -1994 -833 1254 2019 932
1420 932 -1303 -2293 -790 1172 2002 898 -1044 -1953 -860 1209 2002 858 -899 -2045 -839 978
1436 978 2155 992 -1069 -1933 -1042 926 2131 1108 -1150 -2096 -675 976 1784 674 -934 -1889
1452 -1889 -992 873 1679 831 -1013 -1605 -940 786 1409 1148 -615 -1749 -1260 767 1725 1193 -461
1469 -461 -1713 -975 672 1515 1205 -526 -1720 -1207 526 1828 952 -471 -1732 -1124 339 1654 974
1486 974 -611 -1488 -954 698 1604 975 -190 -1461 -1166 506 1925 1204 -299 -1428 -1034 812 1596
1503 1596 1102 -299 -1323 -1070 -1 1772 1029 -275 -1564 -1083 356 1390 1354 -199 -1509 -1111 417
1520 417 1241 1110 -555 -1533 -909 402 1279 1267 -364 -1526 -1367 279 1436 946 -221 -1177 -1382 153
1538 153 1226 1131 133 -1266 -1200 90 1417 818 -310 -1291 -1432 -37 1198 1135 112 -1191 -1317 159
1556 159 1098 1134 -27 -868 -1437 198 1362 1323 -103 -891 -892 -55 1305 1305 -52 -884 -1093 -222 1137 1057
1576 1057 -44 -1247 -1124 -39 799 1298 223 -705 -1190 -388 1062 916 -51 -1061 -995 -69 845 1179
1594 1179 316 -932 -1030 -112 898 927 -96 -734 -926 -264 663 962 273 -1099 -1246 -70 908 937 84
1613 84 -748 -1283 -698 961 1341 22 -962 -1338 -186 607 1008 299 -633 -906 -421 990 1315 423 -657
1632 -657 -881 -192 665 896 229 -649 -1169 -356 750 1077 399 -1038 -901 -590 820 1083 474 -594 -832
1651 -832 -269 697 945 373 -580 -887 -245 342 1085 496 -573 -892 -64 620 1001 292 -499 -862 -441 400
1671 400 906 494 -471 -983 -526 568 1079 140 -325 -999 -437 326 767 676 -527 -1126 -371 427 759 596
1691 596 -374 -840 -632 548 693 254 -473 -885 -529 411 1139 643 -338 -803 -582 341 987 263 -448 -604
1711 -604 -388 -46 928 474 -314 -701 -728 316 756 279 -137 -559 -676 133 1053 800 -76 -764 -282 328
1731 328 602 587 -401 -799 -355 157 969 466 -392 -631 -386 321 523 424 -202 -791 -442 -159 976 540
1751 540 -318 -609 -390 -8 461 684 -126 -950 -400 157 930 406 -203 -587 -380 -12 707 628 155 -729
1771 -729 -448 -24 752 238 -111 -582 -674 -192 810 822 165 -559 -645 -102 571 643 239 -456 -764 -58 829
1792 829 853 -155 -312 -523 -212 663 439 39 -651 -484 12 637 465 -125 -354 -405 44 259 564 -75
1812 -75 -438 -482 105 447 286 -103 -495 -346 -160 381 713 -68 -411 -393 -395 573 593 -27 -718 -643 10 341
1834 341 327 -4 -474 -675 -80 434 445 444 -292 -394 -325 385 500 265 -369 -209 77 519 265 -205 -331 -613
1856 -613 98 225 686 -113 -268 -399 -208 457 414 154 -409 -394 -151 175 529 62 -329 -237 -188 57 259
1877 259 89 -379 -261 -48 379 601 -133 -104 -352 -150 598 338 55 -171 -503 -206 388 766 -55 -276
1897 -276 -441 -460 550 205 101 -308 -290 -215 112 347 238 -174 -395 -30 42 599 66 -413 -43 -276 37
1918 37 493 356 -328 -697 -360 435 441 251 -265 -383 -156 157 92 262 -309 -207 -392 108 237 134 -53
1939 -53 -451 -167 27 531 497 -15 -373 -322 266 232 422 -194 -13 -206 -180 373 235 -78 -344 -210 -2 284
1961 284 290 -357 -290 -495 120 473 231 10 -169 -97 -195 253 225 -15 -125 -123 378 506 68 -204 -196 -212 -236 97
1985 97 146 -83 -379 -55 241 773 373 -92 -245 -216 223 156 106 98 -314 -431 224 498 270 -206 -298 -164 -1
2008 -1 115 474 158 -272 -20 146 365 277 -85 -230 -13 18 395 180 -60 -7 -220 -100 68 101 99 232 -183
2031 -183 130 215 0 -186 -228 -273 -169 407 216 -451 -192 -2 92 119 125 -244 -34 -95 43 -122 260 -217 87
2054 87 -146 -197 170 272 264 -154 23 -202 148 146 -97 92 -100 78 334 164 186 -166 -46 100 56 11 -357
2077 -357 -76 154 -115 -52 350 115 -180 -234 35 554 305 -3 -196 -452 -163 126 206 -128 156 32 -93
2098 -93 122 -10 127 204 -147 -76 80 318 122 -442 146 -51 27 36 -5 -205 114 123 110 139 -63 -291 -225 104
2122 104 161 290 -18 -66 -131 -171 149 145 229 94 -264 -161 153 -8 -118 80 -504 97 -157 200 226 -44 131
2145 131 -126 165 42 101 -308 -290 280 6 128 166 -382 -214 62 -121 19 173 -3 -45 -49 251 -63 -188
2167 -188 -205 57 -100 -144 -336 -73 -82 -114 91 100 -26 216 -93 -100 -168 -8 -84 0 -204 -31 -219 87 99 -283
2191 -283 399 -85 -6 -232 354 -193 -12 99 27 116 -39 -118 -337 134 -204 212 188 175 268 -36 41 -174 192
2214 192 -166 60 17 -233 63 12 -19 263 -241 -119 255 -11 165 -53 107 35 226 264 -192 -131 -59 63
2236 63 65 92 -24 -108 -181 -200 88 46 186 -138 109 -192 234 -87 98 54 -325 -213 -188 174 264 -160 2 71
2260 71 -191 23 -50 91 -9 61 5 83 -151 -223 10 177 98 -266 -19 -215 -34 249 72 127 -62 -145 -201
2283 -201 -118 -150 273 -270 -123 -178 -135 -3 -299 67 -57 -244 -5 66 15 -15 -249 68 -101 97 -28 77
2305 77 -205 112 282 202 105 29 -29 94 96 -113 -224 -177 29 -27 90 112 -35 -54 23 -92 -111 143 243 -26
2329 -26 -192 -63 274 13 101 30 -179 -121 -155 12 45 -88 163 -58 133 -97 -41 -108 -77 -230 94 -65 3
2352 3 -486 -48 21 4 157 141 -123 106 -124 -46 127 65 -12 -345 -232 -101 -75 -134 -102 -146 -13 22 -48 209 -151
2377 -151 -77 126 221 306 -296 -263 -49 -59 460 125 109 -93 58 167 -300 280 71 91 -68 115 -192 173
2399 173 -102 84 -66 -28 142 -57 -88 -57 -26 -14 215 -83 336 -199 179 -141 136 118 183 21 -239 -211 60
2422 60 66 127 -127 -98 34 -154 -138 -26 124 -135 -215 11 10 -28 28 -153 -147 224 96 -92 -323 67 -142 34
2446 34 133 -100 90 6 -227 146 342 66 3 79 -174 255 -77 -201 191 -148 157 2 48 -101 50 220
2468 220 -166 -180 141 -107 121 -37 -18 338 14 106 78 183 -341 -58 -43 181 -139 -46 -128 -180 352 144 -114
2491 -114 -120 157 -53 257 -12 -94 -234 -51 206 -233 -149 -212 -100 -112 52 -100 379 -172 -338 -105 -261 334
2513 334 -61 -329 -77 169 245 232 169 252 -222 75 331 -6 -77 -390 -50 -400 -58 166 116 -148 -63 -174
2535 -174 -16 363 -2 -38 -5 87 242 -41 40 219 -186 -264 -97 219 -18 -117 -199 1 -285 -151 -163 -33 -232
2558 -232 86 82 -107 87 -284 -5 178 25 -2 -7 110 -31 -95 56 -23 -2 359 86 134 -46 53 -141 -37
2581 -37 -420 100 99 9 31 102 -162 139 25 35 184 174 -73 60 -374 -91 7 48 -115 -151 -67 116 90 -248
2605 -248 172 -82 39 330 32 -144 -256 91 151 -65 88 208 84 -223 -27 -7 95 -76 31 -6 0 3
2627 3 -89 60 171 -129 49 -121 151 55 -163 -309 169 330 72 -58 -170 -36 -211 -79 166 -21 -203
2648 -203 -7 -85 -66 112 141 -91 44 -153 8 56 -153 -3 205 -52 -230 460 -141 123 -248 -59 -22 81
2670 81 -135 -251 19 180 -320 253 -298 -187 -132 178 412 397 5 -54 -320 -144 49 -12 73 69 115 -158 23
2693 23 -78 27 -312 51 -193 169 34 160 -191 -360 84 -99 226 44 -31 -79 28 343 -15 50 -76
2714 -76 -162 -145 -18 73 -41 -171 -83 -33 -99 84 212 14 -143 -15 136 44 80 -420 72 74 137 57 60 -69 0
2739 0 -85 298 -180 -191 8 172 208 327 122 212 -69 -267 63 -241 -194 172 -303 -290 -295 195 324 129 -40
2762 -40 -32 -62 -107 71 111 -153 100 -27 317 -216 -86 289 -5 -313 -32 147 96 95 10 -228 -284 -21 227 -104
2786 -104 -260 -58 -50 445 191 -102 187 93 254 182 64 -233 -107 -54 184 47 133 -22 14 -122 -156 88 -127
2809 -127 -118 -92 36 50 112 24 90 -10 -373 -157 147 447 -159 -403 -328 48 131 214 48 -301 -56 -79 170 -70
2833 -70 19 -159 -219 -80 183 55 331 199 -80 244 -92 96 116 -214 -207 80 245 -123 -107 -101 -214 126 -24
2856 -24 -22 -51 -105 -3 -75 222 205 184 -119 45 -26 132 298 -31 73 -120 76 -201 -55 -64 -113 -72 228 68
2880 68 27 8 181 -176 -38 24 35 46 67 -170 241 -92 407 34 -58 -218 26 115 9 -130 -354 206 -97
2903 -97 213 126 207 -36 -197 -61 46 245 -119 -242 -445 -184 421 129 160 -56 -62 57 -19 28 -20 -220 -81
2926 -81 109 -24 270 -306 -43 -114 -270 308 182 -180 -54 5 89 137 236 58 -128 -155 30 -64 163 -205 114
2949 114 -269 41 51 -53 11 7 -314 48 226 138 17 -24 -1 -158 293 47 3 261 44 -432 -32 -161 -87
2972 -87 210 -411 -40 139 -39 -108 -133 -191 -35 182 196 239 -142 199 82 -2 5 -302 105 -309 151 136 161 -147
2996 -147 102 -20 64 -267 48 -386 44 14 -159 180 -91 138 -14 -33 -38 -9 -182 -151 52 79 55 74 201
3019 201 335 56 -36 -73 166 392 264 87 -281 -272 -12 -140 276 118 -245 -124 -18 355 19 143 45 110
3041 110 -43 310 52 -117 -219 -323 -129 -66 28 -259 18 -46 87 64 -45 -258 -76 -306 -51 95 -136
3062 -136 -190 -114 -41 -19 -204 101 150 -329 73 -39 175 387 165 -31 -53 -120 -95 119 -103 18 -229 62 114
3085 114 -295 -142 -120 -153 76 -179 -96 -91 -360 34 300 165 241 373 -206 -377 50 308 89 -29 126 -163
3107 -163 -98 -230 165 -67 158 142 -176 327 142 -12 -311 -98 -11 221 -150 -212 -71 -158 -58 230 202 -58
3129 -58 -350 -77 -121 242 -166 -77 -187 62 -171 51 247 -40 -150 -200 153 -215 80 -200 -211 -206 12 47 8
3152 8 327 85 -19 -7 26 -208 93 -34 -183 -207 94 89 42 -202 64 146 203 -162 -78 -232 -75 -5 16 95 94
3177 94 -33 116 13 -112 -148 179 -150 103 90 36 242 126 107 -39 36 -132 29 -181 68 -146 158 -325
3199 -325 -26 -219 -96 -184 -39 -9 214 -87 -324 -329 -50 75 -264 -58 -129 -31 260 -2 -187 129 18 134
3221 134 -241 1 67 -45 -130 66 -262 173 76 78 151 -266 -29 44 98 124 -89 -72 105 225 -115 245 165 -145
3245 -145 -320 193 -43 -215 -111 -195 -56 31 65 66 238 97 -147 249 271 -121 -99 -108 81 53 131 102 97 36 120
3270 120 427 -98 396 -283 31 -49 289 -32 187 -172 39 -60 59 134 -86 -33 -115 129 67 114 162 -13 -179
3293 -179 197 -139 135 104 -98 -36 -19 -2 352 -44 -187 269 -51 -29 288 24 108 -198 -196 181 -15 -1 -284
3316 -284 325 -109 -84 162 100 -74 -229 -97 47 73 128 20 -222 -80 -65 131 -136 -36 -329 61 591 167
3338 167 159 50 133 123 408 166 164 43 -167 -195 -213 -92 143 -83 -62 180 -11 -50 19 -151 -100 -85 -64 108 -67
3363 -67 -248 0 53 -179 -83 255 -163 226 -118 -122 -103 545 45 -71 -223 -106 158 261 97 -56 80 -95
3385 -95 -3 152 24 -59 50 -259 194 -45 -223 -154 -266 -176 -188 73 -70 160 9 -53 -31 33 90 154 -108 61
3409 61 31 -195 63 168 -233 -145 300 146 -92 -173 178 130 65 -81 83 96 -48 -193 57 185 -82 -142 291
3432 291 52 253 -99 -122 -124 -104 -208 43 -93 -350 -132 64 132 -70 -121 -41 169 -187 -14 168 117 136 11
3455 11 -65 90 -215 72 134 -202 -410 307 -54 3 -23 110 -44 -138 -127 -82 176 17 -31 -177 156 75 109 52
3479 52 101 -70 227 -66 -144 -262 -112 -45 280 5 -112 160 -116 -209 -66 16 -16 -25 -148 -141 85 -3 -101 -81 -260
3504 -260 -52 -154 132 74 22 -139 -147 127 -96 100 -19 -225 88 228 -79 239 -26 -41 326 56 248 8
3526 8 -126 97 -155 359 242 108 -59 26 122 68 140 24 42 -178 225 -129 -41 -75 -47 -57 -6 54 92 -59 30
3551 30 -181 -163 -137 -14 54 53 122 -18 70 59 122 280 -196 -116 -81 -192 1 -2 -117 93 29 -129 -218 -146 -27 219
3577 219 308 -130 -229 -395 -29 122 239 62 -150 -166 13 -125 65 -379 89 -128 -227 -228 180 74 -19 108
3599 108 52 31 90 72 -14 -162 33 -203 -204 140 -19 -66 -31 -225 -191 -69 -54 -62 -226 2 5 -288 162 75 23 -33
3625 -33 -17 350 -121 43 -352 98 21 183 476 -85 135 -22 42 -85 -123 -133 -98 -150 210 148 19 188 34
3648 34 -271 -252 61 -91 228 -180 -107 72 -41 89 334 37 46 -156 6 -72 134 -215 172 54 152 -101
3670 -101 -24 -91 121 -229 129 203 12 20 266 -151 -207 85 34 -166 95 -53 5 -27 -89 -108 60 26 -205 81
3694 81 -71 -139 223 37 -105 156 10 -186 -53 17 -220 115 215 4 -43 196 182 -71 38 67 -210 71
3716 71 62 271 222 -354 88 31 -69 235 38 -169 32 -138 23 85 -333 -198 159 133 -29 166 -84 -95 -96
3739 -96 174 286 -64 -89 -371 17 -200 222 -241 140 93 133 233 -47 70 221 -299 39 -78 35 -105
3760 -105 85 53 -283 -121 188 148 137 -110 47 -5 215 85 -160 -75 -245 245 224 185 -28 107 -223 -82
3782 -82 12 23 -193 -104 12 30 -94 63 338 45 -74 117 138 -58 -73 -89 -1 -158 3 -124 -57 -241 -154 46
3806 46 65 -100 -109 -8 43 -58 310 -169 -170 -158 -38 -250 -138 -74 13 -157 -72 23 -55 157 214 188 195 -113 63 42
3832 42 -91 272 -107 -52 -146 161 -102 -39 188 28 78 79 -296 105 -324 -71 53 -81 -77 118 -189 -32 -184
3855 -184 -48 151 -64 69 82 -41 251 -284 -77 -133 -32 -53 -28 163 -181 91 -27 -55 -156 -192 -107 198
3877 198 105 -62 -44 -9 -41 140 -14 123 -216 102 -169 93 -32 232 54 -89 92 -313 25 21 10 139
3899 139 159 -71 93 -120 -45 -53 193 2 -164 93 334 89 -133 -68 83 -154 133 -2 -139 31 75 -54
3921 -54 -216 -112 -196 -176 -234 -79 45 -60 95 -40 10 -4 32 -317 -102 5 -173 -154 -9 73 -26 -12 -253 96
3945 96 145 34 -72 -63 -151 -190 88 39 63 -133 -309 193 -125 -72 90 286 -80 -268 5 280 -95 -137 -37
3968 -37 -56 309 -202 -73 106 1 -100 -217 21 0 252 -66 -28 99 105 52 55 9 32 -101 -302 91 75 -103
3992 -103 -217 -73 144 -102 -115 -196 -106 -104 -41 181 -120 117 -277 1 266 -1 8 2 221 46 -42 187 -89 83
4016 83 168 65 70 29 -266 -116 132 117 -156 -227 241 122 -322 65 -406 -150 156 40 -186 -187 115 20 -82
4039 -82 247 288 -361 -41 320 96 -223 -284 -221 5 201 207 3 81 -121 124 -116 -86 -105 -195 -19 -263 1
4062 1 309 -254 289 -362 -8 69 -80 -191 -236 -176 43 -163 -135 69 -164 239 46 87 -9 -40 -157 1 4 -96
4086 -96 -75 -176 61 -295 -116 -29 -64 181 -190 -99 30 -74 192 187 28 253 -48 -22 69 -17 -126 -100 -10 -239
4110 -239 114 -151 -38 41 216 80 -42 -76 166 -20 -81 173 235 155 -160 96 52 -197 10 -46 252 -87
4132 -87 124 -100 -70 -18 31 304 6 17 -163 189 138 192 -240 58 -179 40 -81 66 122 147 56 -25 -51 121
4156 121 -98 29 -88 -107 -159 -99 28 -310 378 157 -57 -325 45 -178 -67 18 335 154 -67 443 -249
4177 -249 121 -213 15 -45 185 -91 -238 -111 10 -13 12 155 -175 137 -94 -316 -29 -50 -66 -97 -208 553
4199 553 -237 -118 173 -336 160 -31 -75 -28 32 126 149 116 174 -169 -102 -203 34 71 105 84 70 18 159 -89
4223 -89 45 32 270 170 -425 -219 260 63 113 -42 72 78 157 286 -327 -356 144 -8 -89 -117 91 175 -44
4246 -44 400 -248 104 -91 -114 -102 129 49 216 -30 -160 -154 203 175 -36 300 -42 -173 202 104 -126 84 164
4269 164 63 -77 288 -12 -85 307 122 -85 -11 -260 379 -165 136 6 79 167 -16 154 80 171 251 50
4291 50 383 -82 131 22 123 129 -53 -50 103 167 -66 266 322 -6 -286 -361 106 46 -454 -48 -59 75 92 100
4315 100 -60 -118 207 -140 -7 144 14 178 -61 10 -70 20 -103 -229 -214 -15 -166 -195 24 133 -40 -88
4337 -88 -88 202 122 163 -191 2 -16 -297 25 -163 149 40 -228 -36 77 -228 -129 33 147 33 70 -64 237
4360 237 62 115 -158 -187 34 149 241 4 227 -130 -196 -9 52 -30 67 48 95 354 56 -313 -59 -146 -28
4383 -28 -53 180 -97 -228 -138 116 84 110 63 -5 401 178 -306 146 -276 18 141 62 -35 95 52 183 41
4406 41 92 132 294 114 52 300 -140 -1 398 -196 96 -23 -43 148 54 262 275 -184 -220 313 132 93 243
4429 243 -239 -48 -132 122 160 -21 -118 220 -5 -11 -15 284 87 302 -164 35 253 277 230 -144 48 255 15
4452 15 -240 -106 273 150 -121 104 -104 23 -153 -80 233 -36 -41 -10 -228 91 270 -89 -49 -121 59 75 -28
4475 -28 -98 -81 -201 -240 46 -136 -6 121 -308 224 -177 -151 352 -32 8 -8 -32 90 14 -52 -127 -125 117 -288
4499 -288 136 213 -123 33 -188 -35 164 -30 85 -23 -155 -67 50 198 197 3 -111 -108 10 90 86 -162 253
4522 253 -72 46 26 21 -43 -115 -40 296 239 214 -192 -14 -276 77 -64 -231 110 92 81 104 -101 78 -287 168
4546 168 -52 -56 90 128 107 -133 358 -46 -47 273 -10 -220 -96 -130 298 218 278 -146 -126 -151 -210 -86 -126 70
4570 70 45 -190 50 79 -46 137 -109 57 -28 15 -33 -59 97 -25 156 -4 -123 -69 69 -56 78 124 -180
4593 -180 -93 -155 -212 -72 -193 -17 245 -114 164 75 -178 -390 -13 -133 -91 -46 185 52 208 19 164 157 27
4616 27 -271 -2 -301 -290 -95 45 240 0 71 -14 151 80 351 251 253 -153 111 -44 -104 -144 86 -34 275
4639 275 22 -136 -41 196 -162 32 54 -14 169 -111 93 254 53 16 -48 16 -42 47 -225 42 12 -179 232
4662 232 192 333 168 82 63 -23 -18 -1 4 160 97 -112 -213 -243 -128 -14 -99 -37 -220 31 -16 215 235 195 53
4687 53 17 13 113 -134 -287 -212 34 138 -107 -216 35 319 -59 -82 14 -169 31 186 56 -200 97 -122
4709 -122 -1 27 -1 -131 7 2 -432 30 -21 -172 -32 48 20 105 76 92 -149 -42 -9 365 32 -141 23 -10
4733 -10 -7 236 -98 -412 -185 -92 118 -40 63 2 -259 -113 206 -253 -34 84 86 81 -186 24 83 182 46 -77
4757 -77 -154 -23 65 125 71 -139 -290 -407 -205 46 120 57 175 118 -27 -85 -117 -151 -125 315 43 29 -121 -46 4
4782 4 258 -27 -102 131 -39 -70 38 -182 -318 53 127 -98 -184 18 -227 -34 -278 -103 -86 -24 -142 77 165
4805 165 31 297 -87 92 147 -235 -10 176 -152 165 128 -36 77 -61 116 111 -118 24 50 -3 187 255
4827 255 -36 -3 -132 111 -260 66 -132 108 -127 -2 122 -112 145 206 55 -284 12 -219 -80 91 43
4848 43 -42 -11 -7 -19 78 -46 311 -142 -67 -72 75 -85 189 -163 29 126 -36 -300 133 -8 -336 -283 -27 -82
4872 -82 -39 -196 174 -110 -49 39 -48 -124 -96 -30 -269 -101 104 128 104 92 3 -96 -56 78 136 212 -59 -12 -90 -208
4898 -208 -206 -150 -98 27 -152 -418 -194 159 142 -60 227 -4 -91 -11 20 129 37 -103 -178 31 -246 237 -34
4921 -34 -120 -65 -14 -208 -233 101 -162 169 38 87 62 13 151 11 -194 136 -45 23 -7 313 57 318 -205
4944 -205 -152 -148 16 -52 -20 32 182 175 287 -52 -81 211 -322 75 437 -2 59 101 -143 31 -66 53 -43 104
4968 104 -189 -3 33 151 130 192 138 79 253 -244 -192 48 129 187 -12 34 -81 143 -122 68 37 -90 -6 289
4992 289 50 -258 61 206 41 173 23 59 36 137 -11 292 -14 -174 -75 118 188 177 -177 64 141 -174
5014 -174 245 3 -146 132 70 -165 28 -122 278 -172 -104 201 20 -61 -135 -164 -258 18 -177 164 129 -76
5036 -76 -8 328 15 -158 -165 -215 -54 72 -47 111 126 -16 -40 -220 207 113 -15 9 -208 -361 -49 208 -189
5059 -189 82 -26 129 108 117 -56 -159 217 391 241 178 -125 -284 -199 -21 421 318 -201 -162 9 -72 -191
5081 -191 27 162 34 -106 23 -87 194 -104 -52 102 125 -116 -179 64 -56 66 48 205 35 41 -142 29
5103 29 70 7 -275 28 -188 113 238 223 242 -423 110 90 -119 276 -141 342 -30 -148 235 -148 10 104
5125 104 -120 4 166 163 -196 -284 178 54 -306 -132 -53 18 76 91 -49 -246 78 -159 119 15 -113 225
5147 225 4 -135 -135 -236 147 -26 260 133 -18 355 -94 -24 -104 47 224 -37 32 15 341 72 100 125 44
5170 44 13 -228 30 206 39 -262 160 67 34 212 -216 133 98 -17 -113 -52 -49 -46 94 -180 291 -206 277 -189
5194 -189 57 -191 -198 207 -213 58 79 -94 -214 -105 6 253 72 60 146 -58 147 -121 7 191 93 36
5216 36 -9 -240 -315 -16 -80 52 67 -203 -9 -7 -3 337 -103 -287 57 -313 11 47 94 -198 47 -47 -145 -196 -182
5241 -182 120 55 241 31 236 -386 -10 92 -8 -376 34 -88 -110 -315 -199 -148 108 -63 -31 119 198 217
5263 217 93 114 -137 261 137 44 -205 200 -13 -12 -20 -140 -93 -120 202 52 204 126 -94 361 111 185 126 -110
5287 -110 -258 -80 81 -234 63 -47 -38 -28 107 157 161 -107 -67 4 12 -88 110 -78 135 125 -200 131 -231 129
5311 129 0 -74 137 -59 24 200 -126 78 240 96 -141 -179 -84 -152 60 -80 -184 -7 -128 71 -68 168
5333 168 -223 194 -72 -18 -55 -68 39 -149 60 303 177 -165 -213 181 150 -88 114 -187 -111 -218 -72 -52
5355 -52 -78 -52 -18 -126 -86 -88 -54 309 -7 -20 172 -259 -185 29 -135 163 173 203 137 234 -380 -35 -139 23 224
5380 224 33 25 57 -3 -213 46 91 -148 -223 166 -259 108 -15 35 -246 101 -51 36 -197 155 -110 -53 25
5403 25 121 0 -116 7 218 166 -50 61 31 -153 -210 340 46 5 -78 4 -61 59 -19 -192 -61 -295 -135
5426 -135 -142 -89 -116 -103 44 43 -183 141 254 -54 -93 -41 -160 -101 -173 -90 62 164 141 35 -56 128 -115 86 137
5451 137 -58 56 -68 -340 247 -56 128 -64 34 102 51 344 21 -341 -48 245 188 -99 66 35 -167 141
5473 141 215 176 75 4 -129 81 -26 114 23 -259 132 59 -118 -39 73 -68 -345 -32 8 -70 -103 -205 28
5496 28 -141 46 -248 177 134 93 123 -222 289 142 -83 -159 -220 7 -209 279 173 77 -126 -165 -147 186 154
5519 154 476 77 111 168 -122 -152 262 261 175 112 -90 38 -124 225 -181 112 -159 283 -25 189 122 -66 -25
5542 -25 -472 388 24 -12 197 224 -233 61 62 43 79 192 156 77 -186 185 150 71 116 42 44 -113 -60 -188 -92 -120
5568 -120 -222 106 -250 -89 -19 124 -76 145 -40 28 -13 -91 -47 -113 127 -155 -222 181 -248 -144 80 -60
5590 -60 -211 -224 -272 -103 19 -170 130 168 -6 255 -103 -117 79 41 58 -50 388 -128 130 -178 -7 77 176
5613 176 297 11 -87 319 -42 48 27 -377 -75 -353 -123 -15 -281 84 -1 230 -60 -143 75 -31 -203 -19
5635 -19 62 91 -116 -99 -145 90 -60 -84 116 206 -43 -96 -342 127 129 245 114 236 179 -305 -122 -197 -92 245
5659 245 44 0 23 213 -197 -185 -66 129 236 16 112 -198 -46 -30 135 -73 141 -32 11 -118 183 67
5681 67 -59 -10 -94 159 -35 19 -114 -115 60 168 -7 36 -74 20 11 56 -162 -168 185 39 159 -150 298 -263
5705 -263 193 162 285 -71 26 82 -30 -196 -35 170 98 2 69 -25 17 -5 -106 87 -18 163 95 -66 28 -7
5729 -7 -26 -26 7 -61 199 -121 59 12 -117 -337 -85 -154 -152 153 206 4 -102 -56 -19 -6 57 221 -326 65 -139
5754 -139 -50 -157 325 29 103 113 -137 69 25 -75 -163 87 134 56 169 -152 -162 232 141 -294 2 6 38 -7
5778 -7 -176 169 86 259 39 -12 74 -53 5 114 -105 -56 -67 119 209 -68 -114 -97 305 53 -36 -93 54 -51
5802 -51 -26 9 -6 -153 203 0 -46 -29 -249 -144 149 196 339 -41 -190 -256 -20 137 15 -380 364 -145 180
5825 180 -116 218 54 115 -131 214 58 -26 199 112 -19 -62 270 -204 86 260 -27 350 115 -100 144
5846 144 24 256 40 46 -198 97 125 280 42 147 31 47 -95 61 0 -4 225 -128 186 -17 224 -131
5868 -131 67 -187 269 108 16 186 -248 -36 -76 79 -170 121 138 93 106 95 101 -356 18 -85 -96 188 -91
5891 -91 -152 56 -329 128 -152 -78 105 -174 36 -289 116 51 -38 -72 245 -192 -177 -53 50 -133 -159 -119 -265
5914 -265 33 72 -118 -113 81 -400 40 -42 25 -140 33 -48 86 68 85 -148 -62 -229 136 154 10 -263 24
5937 24 -10 -8 -66 203 304 17 252 -207 -28 -127 -9 355 -111 92 -115 -291 103 79 -85 292 42 -84
5959 -84 -148 94 64 -199 190 -142 -62 -33 -87 216 -93 199 -11 -169 -78 -59 56 242 -44 -37 1 16 -48 -86 34
5984 34 120 209 228 -65 -136 13 -24 114 -88 171 355 -133 -94 106 27 -174 -151 -212 33 211 122 179 41 -167
6008 -167 -16 43 -70 -30 88 -122 -86 90 -178 -163 -212 229 -33 -3 53 -100 -88 77 -127 -174 -137 -299 166
6031 166 87 15 -110 234 24 -256 40 -50 58 -129 -48 157 252 257 -28 -56 221 -223 13 -31 -10 144 -18
6054 -18 -148 51 -203 48 53 15 -83 -86 -64 273 40 -152 -64 -230 -36 -27 -129 54 -281 36 -95 132 -16 -152
6078 -152 -227 -78 76 75 7 240 140 -95 -6 -327 -229 -269 173 118 -80 155 -291 86 75 101 115 -154 -90 -24
6102 -24 175 -152 279 260 210 50 -154 -43 -10 -214 -182 35 132 223 70 41 -11 -5 -139 223 109 47 -196 -172
6126 -172 232 51 -171 -119 44 -11 42 307 107 0 79 172 -58 128 -45 258 17 -83 -50 110 32 -178
6148 -178 257 -1 -119 -82 -78 -28 120 114 -94 58 95 -234 -140 163 159 323 -13 -98 57 -105 38 -114 -41 135
6172 135 23 197 -190 -148 90 157 -115 265 -94 89 -244 37 15 -1 94 128 -226 63 -211 -239 -109 12
6194 12 -27 161 -215 135 -125 -134 -62 24 -261 85 302 63 143 -233 109 228 163 213 -190 -134 -59 -58 38 -66 70
6219 70 -50 218 -71 162 77 -7 179 62 -92 34 -17 -80 77 -38 -110 -91 -122 -58 46 525 -20 -96 61
6242 61 -63 53 -8 -252 -6 178 33 -147 -203 -123 257 178 -1 181 -38 -6 118 92 -101 -80 428 88 88
6265 88 -44 234 143 -15 -50 -27 14 121 61 -154 258 355 54 69 -384 91 -97 -88 -7 31 -17 -40 251 5 -394
6290 -394 175 183 -47 -188 -13 -46 -18 -43 -106 85 -122 182 1 -154 -206 -46 -27 42 -241 -10 278 209 276 -9
6314 -9 109 27 39 220 -115 -34 135 82 197 -43 -16 54 -328 -93 157 130 -4 139 -89 117 -149 -118 125
6337 125 -105 70 -13 37 -28 -84 -154 203 294 -127 1 -205 188 134 104 -192 -306 140 161 82 -196 70 -347
6360 -347 102 3 8 264 156 84 101 -188 32 -71 77 213 111 284 -93 36 40 -31 158 24 47 -261 119
6383 119 42 104 -113 -118 10 -54 75 14 159 107 -195 239 -246 7 7 165 -263 -212 204 -35 -179 -148 163 -58
6407 -58 -255 317 -103 -29 226 193 289 -259 17 155 60 77 78 0 222 114 -10 142 17 -54 -112 367 232 -14
6431 -14 14 -143 109 92 116 172 28 -31 49 -166 -120 53 -254 46 109 -4 67 26 218 43 232 -14 401 -115
6455 -115 -45 -9 -86 -13 -116 -70 -122 -16 -28 -287 24 -178 78 148 10 111 48 41 335 -142 172 -174 -57 2
6479 2 37 -12 -68 -29 -75 80 -28 -204 -206 149 -229 -8 -84 0 35 181 121 110 -63 39 248 -3 402 19 -72
6504 -72 -11 -95 -171 -72 33 61 68 -203 245 -3 -92 82 -2 72 -179 168 -254 -126 173 167 46 -88 -174 -173 -226 -117
6530 -117 67 -197 -25 -104 -36 110 103 -207 -81 46 45 -12 128 -249 60 -10 -66 172 -308 -55 -34 94 202
6553 202 -16 16 20 -102 -149 -245 49 -94 131 94 -150 -13 -125 -73 167 4 -184 -116 -195 265 6 -16 -47 63
6577 63 275 100 1 -154 -101 152 223 67 -23 83 -169 -328 146 -35 -217 170 -82 -285 283 135 75 -22
6599 -22 -28 92 -209 -196 65 -254 -112 -78 103 61 -125 -81 -141 -136 23 6 -88 329 73 -6 -61 -108 -167 19 110 -163
6625 -163 18 289 199 14 232 -248 -129 -105 -155 -31 -40 -148 -40 336 170 -59 34 -220 31 -61 279 -26
6647 -26 105 -237 55 130 1 -25 159 -211 105 68 -302 -123 59 -48 -3 42 -326 89 -48 -7 -22 -65 125
6670 125 153 -268 -50 -43 -161 93 -176 103 24 -233 -189 -38 14 105 207 -96 169 314 -12 -74 110 194 244
6693 244 165 -357 115 22 -76 -104 -178 -22 -406 -216 41 84 319 -61 -94 17 4 -200 71 -99 -118 103 -233
6716 -233 105 -77 -218 -5 -212 -108 40 -187 -196 -12 60 59 -62 101 -169 -196 -48 230 -83 44 197 145
6738 145 -39 -77 -59 76 -120 -51 -67 124 24 42 5 -33 31 76 115 9 -268 -45 326 -346 18 75 -233 -183
6762 -183 95 171 234 -71 103 -130 -68 -224 31 -53 -133 -106 -355 -16 21 135 79 -72 122 54 -154 195 -199
6785 -199 -76 -111 136 327 -246 -21 -1 -72 -34 63 104 327 -205 187 -150 217 -22 -172 48 195 233 13
6807 13 202 49 114 -261 -50 332 45 104 57 -143 49 39 7 175 129 122 52 -137 -9 -33 -124 51 -278 12
6831 12 228 -204 34 -6 54 0 -182 -151 -22 -149 -109 -36 -198 -14 -144 -192 -79 -140 36 -109 -128 90 -142
6854 -142 1 -261 -92 203 186 107 -223 19 201 -138 -62 67 146 -50 100 -69 -4 -159 -62 -119 87 187
6876 187 45 3 -230 -186 -68 -38 -94 -85 -479 -43 -83 -181 -47 -129 88 -5 166 170 -41 -275 -174 122 -162 -43
6900 -43 -302 -130 197 -391 -212 -85 24 -95 -96 51 86 -76 -128 90 -124 -216 115 15 -69 -10 -274 18 43
6923 43 225 -34 43 -122 -310 -146 -67 -176 -140 -6 116 -237 124 154 -5 -111 98 169 201 200 -162 -62 -73
6946 -73 -41 -2 -58 22 -120 47 6 -19 209 -47 -33 116 56 77 30 119 -12 93 205 32 347 129 12 81
6970 81 51 -67 15 95 31 -86 37 236 -140 22 -73 -27 109 26 -251 111 244 -75 158 -26 -2 164 -222
6993 -222 63 121 -25 261 -13 -140 -140 -39 300 56 -101 -153 -149 -122 250 -4 71 151 -410 -263 -99 -186 24
7016 24 -137 82 212 129 65 183 -67 -106 -108 -147 224 188 -88 271 -39 56 194 -127 39 -42 133 -50 41 -39
7040 -39 229 -36 1 -36 108 282 185 -254 -255 -106 -96 -17 -128 -256 -81 114 68 149 -8 -206 -32 0 65 134
7064 134 -139 216 108 -49 -65 29 -27 48 92 -39 387 -210 67 98 -82 -27 -182 -2 29 -164 85 -3 -139
7087 -139 -194 -128 119 79 132 28 -77 -117 -15 51 -52 -3 37 78 366 -130 -138 -39 -75 3 -103 92 -24 27 97
7112 97 134 111 -92 -60 -6 111 41 -214 -243 -51 145 56 19 -96 -26 -284 -79 160 -123 10 20 -146 11 10
7136 10 -136 -277 204 -136 -323 285 -289 -69 5 -184 85 160 171 -282 30 -22 -55 -30 -168 -134 85 -251 43
7159 43 -171 -344 -196 -43 63 -165 13 7 267 -276 14 -36 -3 63 -50 -302 -467 -183 226 280 237 16 21
7182 21 188 -21 -77 -166 -205 -221 -57 86 -41 -158 89 -28 -150 114 79 6 25 50 6 -78 -116 90 -15 -35
7206 -35 103 12 35 -181 -245 -121 -109 226 115 -129 139 -267 82 -28 180 -16 -114 -20 -27 262 -89 -132 11
7229 11 299 -75 213 179 -65 -81 -103 58 102 91 42 -61 -53 -120 165 12 -33 -130 14 -56 -8 -199 100 131 -177
7254 -177 45 -110 -287 109 305 -138 46 69 187 135 150 74 167 -111 165 -89 -76 -190 150 182 30 -119
7276 -119 -23 15 -34 -18 -157 390 37 -4 210 59 63 -62 331 -303 267 -30 168 98 -26 42 -184 172 -59
7299 -59 19 130 -66 83 -141 -197 -60 -14 75 389 244 -60 90 -101 -56 6 -239 129 -38 -135 -53 161 -12
7322 -12 38 21 -70 -40 -235 46 -196 156 -190 -81 209 -13 -221 -65 -229 158 149 1 143 -235 -169 141 212
7345 212 -55 -99 28 125 -54 -122 62 44 -132 -176 100 -61 -102 274 -82 -174 99 71 -139 -71 -112 59 83 -56
7369 -56 251 5 210 84 22 70 26 68 -59 40 -233 57 -269 -132 375 202 -187 14 -94 142 -43 30
7391 30 -228 -119 241 24 37 162 149 299 72 121 39 -199 192 -291 -28 -107 16 -212 305 37 43 45 -278
7414 -278 -18 -65 -159 -127 24 -44 -65 135 -19 -313 -38 2 -91 83 -182 -165 11 29 -22 101 -173 73 64 113
7438 113 -88 30 -52 68 226 -11 22 46 -126 3 -42 -117 -43 41 191 124 59 315 -79 183 -7 -142 -93
7461 -93 -30 53 -98 -169 12 367 -28 15 -166 -138 -363 145 180 -127 -97 -79 -57 223 -189 -20 25 -117 145 -161
7485 -161 104 -170 3 -139 2 64 230 -323 50 58 -48 218 -114 -143 44 109 20 62 -234 -160 -101 -112 -122 261
7509 261 -64 -69 -29 -33 104 19 122 -100 101 18 88 106 -35 -124 128 98 215 -104 139 -119 -221 187 -46 122
7533 122 -129 185 -139 -157 -46 73 39 17 89 -163 49 -3 79 114 -68 -129 -70 34 232 -196 75 -63 -299
7556 -299 -72 -150 211 204 37 -41 135 -55 283 426 177 129 -109 -45 72 -209 137 188 -259 -295 119 -109 -74
7579 -74 -74 126 -60 -137 -233 -180 102 -84 128 -5 -124 -16 -86 2 84 -224 135 1 -18 208 -44 53 -147 -51
7603 -51 -22 207 -141 1 -306 -164 317 -34 -85 1 -62 -102 -129 96 235 248 46 -151 6 -77 -199 163 -332
7626 -332 -250 105 -320 -32 182 -259 269 21 208 208 -85 -126 -21 244 -200 61 257 17 -15 148 72 195
7648 195 -119 -163 -77 153 -129 44 107 133 8 -58 -17 -157 -13 -7 -205 302 195 -281 -89 282 88 130 8
7671 8 -63 -225 -43 94 201 211 51 165 -168 41 192 31 -56 532 234 146 -447 155 -2 -110 57 132
7693 132 175 89 269 -188 -80 -472 174 209 -58 169 14 -12 -25 -236 186 56 -41 -106 -4 -40 -48 -14 51 -1
7717 -1 -179 -55 -59 -20 145 91 28 -288 -112 -220 71 200 127 -41 -12 -40 -19 60 199 25 -134 15 -177 7
7741 7 92 72 -8 19 -244 262 190 99 -40 -285 -83 110 44 -195 43 109 47 -67 123 -30 -16 145 -249 -171
7765 -171 67 -15 98 64 -70 182 -185 -36 24 273 95 236 28 -227 23 -124 -329 -4 167 -184 -211
7786 -211 -33 -51 -38 16 292 -122 116 59 -42 -34 124 161 101 -155 29 -212 143 15 -49 32 -156 33 -119
7809 -119 53 -236 223 237 -198 -121 341 129 -228 -165 270 161 -201 153 117 -242 -2 119 -178 -5 120
7830 120 -9 -122 162 203 124 -29 42 123 -20 -96 45 -44 196 -88 106 138 -179 -65 -1 20 -96 194 238
7853 238 -196 148 -231 225 -40 -65 -174 -124 33 179 136 160 99 -116 -137 80 94 183 -65 -108 -51 -234 78
7876 78 151 -30 46 -61 -147 -154 125 155 -192 179 -148 241 -114 -180 203 -228 268 8 -31 -174 189 25 -90
7899 -90 -52 52 142 -27 -40 61 206 -5 76 -27 -8 -276 101 21 92 82 -323 -237 7 -68 128 -53 -127 36
7923 36 -96 -31 -111 33 -21 -95 -82 255 58 -53 -143 41 1 141 -76 -234 -25 76 174 -21 0 37 134 100
7947 100 37 175 20 248 104 -9 -8 -72 -35 -208 -13 -95 23 -6 -100 -298 168 -40 -203 -223 -166 -49 -153
7970 -153 -15 26 -3 28 99 -34 -104 -76 -165 -95 -39 206 -111 13 137 58 321 -77 60 89 130 148 -71 285
7994 285 -128 204 104 381 141 287 -56 -128 128 106 149 120 -2 -138 -196 -160 7 109 2 -80 -177 -110 124
8017 124 9 68 68 307 -187 169 38 107 14 -17 295 -2 174 -173 216 253 -177 15 -359 -123 98 151 115
8040 115 -125 -71 161 85 20 224 119 -78 -176 -139 -73 -304 50 -126 -34 288 -89 58 -116 -46 -73 -26 86
8063 86 147 -36 20 -33 181 46 -36 60 55 -205 148 -59 86 -103 -194 -77 -188 5 -274 -65 130 166 -119
8086 -119 -48 65 42 101 73 -231 135 9 -52 -410 120 -1 -130 187 -129 -5 -26 -87 290 4 -108 128
8108 128 94 41 305 259 -104 -1 -120 122 5 -39 29 143 142 -24 169 -102 97 176 -250 -133 -168 159 84
8131 84 112 286 195 -104 86 -124 33 332 5 -132 -101 13 -189 -159 92 -82 13 185 -195 -336 -65 -208
8153 -208 268 -22 -145 40 28 -188 68 -214 -213 -162 -137 -10 21 26 179 -141 154 -23 -47 -112 167 76 -84 69
8177 69 -77 -89 -15 -150 4 -52 14 277 1 -146 -225 -311 66 -99
8191i9
$$ Imaginary data points
##PAGE= N=2
##DATA TABLE= (X++(I..I)), XYDATA
0 0 0 0 0 0 0 0 0 -8 8 -8 8 -11 16 -17 24 -31 32 -40 48 -56 64 -77 89 -103 119 -137 153 -176 197 -222 252
31 252 -283 316 -354 394 -438 489 -543 600 -668 739 -817 905 -1003 1110 -1233 1372 -1526
48 -1526 1708 -1918 2164 -2464 2832 -3296 3909 -4750 5990 -8011 11864 -21897 104407 213332
62 213332 -22637 -162984 -121957 61548 148167 97263 -34997 -109223 -94037 2021 83272
73 83272 85516 -7538 -99928 -108454 -17109 78446 95572 18104 -72068 -95746 -25941 76424
85 76424 123841 60061 -64159 -127738 -48047 100319 153515 39233 -119144 -148706 -23005
96 -23005 113316 118251 -3777 -122641 -122681 -8798 103029 101438 -3524 -96955 -86087 6745
108 6745 85617 87078 22857 -52557 -79668 -29783 62323 107102 45923 -69718 -119463 -45813
120 -45813 73263 108848 23159 -89878 -114634 -31518 70861 97398 29326 -66055 -99883
131 -99883 -34024 75067 118344 43230 -73238 -103099 -15820 86736 95360 14712 -66679 -81349
143 -81349 -29355 43660 77358 35895 -53845 -103817 -52686 53803 102636 39994 -65184 -99600
155 -99600 -28881 71475 99340 33346 -54524 -80058 -25046 56128 86475 37014 -48827 -89033
167 -89033 -41964 45619 82292 31143 -53432 -87754 -42732 37641 79625 43943 -38593 -86668
179 -86668 -46041 47063 94673 48328 -40836 -82027 -36980 45613 85936 44703 -40034 -86216
191 -86216 -45854 38837 80528 35652 -47970 -84142 -40759 36013 71069 34539 -33683 -68078
203 -68078 -37351 28797 71120 50692 -16531 -68559 -48971 27540 82374 52979 -30337 -79036
215 -79036 -45821 28304 67843 39405 -27988 -72202 -52114 17360 69810 49631 -24399 -73868
227 -73868 -46446 28815 74679 47927 -20829 -62876 -39908 24396 66565 46422 -17058 -63825
239 -63825 -48541 13823 61543 45307 -20398 -68546 -49810 14909 59305 42922 -14754 -56709
251 -56709 -44954 11303 60194 53505 -5576 -57553 -47523 13385 61632 49889 -9116 -57464
263 -57464 -50398 4508 54138 48510 -9713 -62050 -53985 5992 56820 47363 -10433 -56643 -45322
276 -45322 10742 55770 46854 -4241 -46920 -41092 5612 49206 47916 403 -48145 -49629 -1055
289 -1055 47118 45948 -3067 -50017 -50005 -4138 43578 48396 3358 -47446 -51526 -1582 51635
302 51635 52941 2159 -46358 -44855 2624 47581 47171 2137 -43174 -45207 -4188 39581 43165
315 43165 3296 -41656 -48447 -9203 37814 45728 6595 -39328 -45777 -6899 38973 48267 11967
328 11967 -34850 -46225 -8910 40578 50254 9430 -39699 -46827 -7678 36205 42051 5855 -36040
341 -36040 -45433 -12341 31590 43093 10706 -33010 -43646 -11359 32462 45471 14944 -29220
353 -29220 -42863 -12576 32034 46184 15109 -30098 -45232 -15267 29801 43845 12301 -32693
365 -32693 -45883 -14220 28596 40904 11526 -27909 -40045 -13956 26017 41938 17277 -23710
377 -23710 -39445 -14972 25818 42361 17672 -23032 -40999 -18350 22621 40763 17235 -25273
389 -25273 -43483 -19592 22580 40369 16504 -24297 -41020 -16574 24090 40378 17319 -20408
401 -20408 -35967 -15386 20487 38028 19466 -17611 -37408 -19929 17097 36744 19155 -18572
413 -18572 -39031 -22169 15399 36654 20708 -17352 -38550 -21229 17784 38946 21383 -16369
425 -16369 -35767 -18239 17953 36779 19961 -14825 -34422 -19564 13737 32879 19603 -13883
437 -13883 -34590 -22854 10700 32790 21338 -11878 -33437 -22454 11370 34076 23925 -10268
449 -10268 -32996 -21715 12486 35188 22590 -10959 -33116 -21601 10950 31328 19802 -11082
461 -11082 -31913 -22104 8015 29312 21109 -8274 -30047 -22085 7503 29856 23499 -6060 -28677
474 -28677 -22568 7622 30836 23953 -5905 -29623 -23286 6445 29244 22200 -7497 -29915 -22950
487 -22950 5500 27063 20940 -5860 -26907 -21615 4368 26312 22692 -2081 -24257 -22213 2818
500 2818 26163 24167 -1884 -25725 -24049 1523 25329 23507 -2625 -27364 -25119 1801 25718
513 25718 22935 -3485 -25983 -22294 3307 24918 21809 -1572 -22411 -20510 1772 22744 21812
526 21812 242 -21113 -21706 -1088 20327 22218 1345 -21360 -23832 -3081 20400 23521 2342
539 2342 -21671 -24484 -2416 22290 24845 2237 -22018 -22666 -165 22548 22533 1098 -20588 -21092
553 -21092 -1145 19581 20402 1386 -19257 -21062 -3010 17057 20055 3386 -17032 -21235 -4456
566 -4456 16901 22078 5224 -16429 -21417 -4465 17217 22590 5882 -16696 -22549 -5725 17198
579 17198 22310 4758 -17820 -22354 -5363 16355 21282 4351 -16601 -21607 -4147 16040 20407
592 20407 4943 -14581 -19354 -5048 14129 20468 6502 -13480 -19982 -6365 13582 19841 6393
605 6393 -13480 -20028 -7379 11972 19398 7330 -12715 -19729 -7994 12015 20322 8665 -11411
618 -11411 -20609 -8477 13110 21726 8208 -12608 -20114 -7061 12027 18928 7160 -11365 -19102
631 -19102 -8058 10621 18146 7621 -10760 -18615 -8078 10020 18177 8674 -9269 -17833 -8136
644 -8136 9521 17898 9101 -7845 -16728 -9671 7828 17849 10152 -7994 -18999 -10598 8261
657 8261 18324 9254 -8800 -18289 -9530 8125 17926 9534 -8081 -16675 -8833 7937 16643 9608
671 9608 -6250 -16396 -10524 6326 17238 10047 -7472 -17194 -9858 6876 15908 9323 -6144
684 -6144 -15772 -9983 5973 15803 10444 -5141 -15082 -10175 5026 16138 11622 -4598 -16263 -10699
698 -10699 5671 15523 9883 -5257 -14634 -10551 3246 13828 11330 -3413 -15289 -11808 3572
711 3572 15789 11683 -3707 -15099 -10855 4325 15445 11045 -4282 -14612 -9705 4153 13156
724 13156 9478 -3032 -13013 -10722 1866 12702 10901 -2774 -13455 -10649 2592 12560 11040
737 11040 -1447 -11994 -11270 1064 12653 11745 -700 -12674 -12036 484 12517 12376 -748 -13836
751 -13836 -12726 1499 13742 11300 -3120 -13159 -9901 2186 11573 9960 -929 -10736 -9720
764 -9720 903 10716 10425 454 -10006 -10873 -772 10418 11411 743 -10970 -11460 -634 10109
778 10109 10750 1277 -9654 -11634 -2241 10722 12726 1656 -11202 -11937 -422 11316 11784 304
792 304 -10355 -10878 -584 10297 10632 94 -9700 -10135 -1246 8416 9836 2096 -8633 -10914 -2195
807 -2195 8780 10554 2180 -8200 -10344 -2704 7948 11081 3520 -7928 -11455 -2908 8474 11185
821 11185 2862 -7968 -11188 -3191 7752 11526 2948 -8616 -11324 -1898 8421 9982 2152 -7089
835 -7089 -9693 -2829 6891 10100 3271 -6704 -9997 -3010 6423 9644 3924 -6016 -10392 -4180 6242
850 6242 10176 3566 -6560 -9870 -3682 5680 9582 4665 -5546 -10475 -4757 6173 10999 4096
864 4096 -6342 -9989 -3731 5833 9465 4144 -5627 -9868 -4129 5285 9224 3838 -4739 -9055 -4779
879 -4779 4475 9784 5121 -4613 -9173 -4707 4630 9021 4743 -3640 -9014 -5190 3675 9198 5521
894 5521 -4244 -9290 -5088 4168 8637 5148 -3872 -9039 -5525 3719 9342 5062 -4007 -8671 -4788
909 -4788 3465 8313 5206 -2879 -8588 -5680 2847 8628 5641 -3095 -8325 -5573 2531 7915 6130
924 6130 -2470 -8603 -6195 2570 8354 5267 -2429 -7591 -5259 1800 8111 6147 -2052 -7773 -5939
939 -5939 2546 7803 5349 -1936 -7500 -5696 1465 7567 5772 -1511 -7249 -5746 1715 7066 5756
954 5756 -937 -6915 -5967 951 7233 6404 -1592 -7019 -5863 1254 7140 5710 -658 -7154 -6426 689
970 689 7249 5942 -894 -6792 -5573 669 6323 5911 -93 -6445 -6022 419 6407 6032 -329 -6133
986 -6133 -5888 173 5862 6319 264 -6024 -6131 -8 6078 5990 500 -5710 -5984 -277 5840 5990 233
1003 233 -5742 -5972 29 5400 5772 885 -4881 -5867 -553 5492 6233 721 -5294 -5749 -371 4997
1019 4997 5618 724 -4665 -6057 -1340 5106 6147 899 -4833 -5619 -968 4666 5938 1367 -4543
1034 -4543 -6096 -1180 5043 5678 1503 -4178 -5561 -1508 4240 5780 1679 -4237 -6055 -1474 4351
1049 4351 5884 1318 -3742 -5655 -2092 3829 5886 2001 -4005 -5642 -1665 4063 5676 1972 -3540
1064 -3540 -5551 -2051 3481 5485 2010 -3465 -5194 -2150 3259 5304 2136 -3289 -5633 -2244 3325
1079 3325 5443 2235 -3217 -5270 -1879 2720 5326 2408 -2882 -5432 -2596 2950 5245 2190 -2650
1094 -2650 -5003 -2470 2504 4925 2642 -2622 -5062 -2280 2848 5190 2524 -2494 -4773 -2810 2254
1109 2254 5132 2838 -2493 -5066 -2584 2341 4942 2874 -2146 -4647 -2744 1804 4790 2504 -2139
1124 -2139 -4912 -2739 2094 4318 2944 -1705 -4437 -3115 1382 4723 2877 -1638 -4440 -2952 1376
1139 1376 4423 2815 -1027 -4495 -2781 1223 4485 2954 -1363 -4258 -3089 1002 4432 3137 -994
1154 -994 -4214 -3263 997 4107 3043 -1256 -4289 -3264 724 4024 3157 -898 -4099 -3129 867 3819
1170 3819 3191 -815 -3768 -3291 930 3896 3503 -470 -3672 -3308 775 3757 3223 -493 -3504 -3197
1186 -3197 214 3841 3296 -687 -3886 -3160 266 3474 3280 -138 -3438 -3088 -41 3607 3189 -186
1202 -186 -3660 -3244 41 3268 3257 234 -3313 -3206 197 3069 3231 24 -3078 -3427 -210 3127 3165
1219 3165 425 -3047 -3297 -364 2823 3310 298 -2725 -3436 -666 2967 3381 488 -3322 -3046 -627
1235 -627 3015 3079 297 -2818 -3271 -738 2535 3184 403 -2735 -3059 -419 2492 2976 490 -1936 -3051
1252 -3051 -831 2576 3117 761 -2292 -3332 -1028 2433 2999 859 -2362 -2902 -862 2549 3327 910
1268 910 -2240 -3269 -1188 1982 2846 957 -2218 -3317 -1207 2342 3269 1222 -1852 -3148 -1082 1883
1284 1883 2568 825 -1978 -2939 -811 1709 2991 1400 -1735 -3113 -1186 1772 3271 1324 -1694
1299 -1694 -3242 -1363 1725 2969 1141 -1540 -2757 -1239 1448 3200 1471 -1553 -2909 -1197 1514
1314 1514 2425 1205 -1662 -2685 -1226 1765 2868 1293 -1537 -2458 -1519 1248 2377 1451 -1192 -2500
1330 -2500 -1212 1055 2629 1501 -1054 -2730 -1544 1038 2500 1691 -1091 -2581 -1523 843 2790
1345 2790 1820 -985 -2685 -1414 1382 2793 1544 -1242 -2417 -1416 957 2701 1468 -1080 -2287
1360 -2287 -1648 919 2261 1361 -742 -2321 -1660 652 2122 1797 -730 -2131 -1374 854 2376 1604
1376 1604 -680 -2559 -1768 659 2171 1755 -643 -2519 -1552 284 2423 1688 -605 -2145 -1760 861
1392 861 2239 1694 -331 -2153 -1783 242 1857 1594 -268 -2112 -1749 245 1898 1763 -5 -2228
1408 -2228 -1476 300 2132 1967 -271 -1873 -1813 39 1750 1637 34 -1957 -1917 -78 2139 1847 -180
1425 -180 -1657 -1866 182 1782 1729 90 -1547 -1611 57 2057 1823 -70 -1867 -1673 73 1724 1795
1442 1795 -176 -1970 -1752 -48 1571 1611 23 -1680 -1725 -251 1376 2080 185 -1846 -1619 -116 1837
1459 1837 1660 204 -1416 -1725 -155 1738 1816 185 -1503 -1585 -585 1411 1521 84 -1352 -2071 -365
1476 -365 1583 1852 439 -1433 -1563 -180 1404 1559 232 -1398 -1662 -220 1633 1680 381 -1301 -1507
1493 -1507 -332 923 1614 563 -1174 -1641 -404 935 1315 360 -1192 -1672 -535 877 1772 382
1509 382 -999 -1398 -472 929 1522 317 -1033 -1655 -450 1112 1374 224 -1025 -1431 -349 965 1419
1526 1419 751 -935 -1257 -440 922 1796 615 -864 -1436 -382 988 1363 709 -463 -1608 -680 1195
1543 1195 1615 843 -1087 -1377 -585 259 1506 650 -839 -1468 -580 775 1372 790 -707 -1270 -893 495
1561 495 1164 697 -595 -1407 -890 725 1345 858 -657 -1527 -945 364 1161 595 -692 -1546 -666 428
1579 428 1268 681 -515 -977 -559 514 1252 698 -656 -1076 -734 480 1332 690 -576 -1239 -743 342
1597 342 1340 882 -540 -1099 -770 384 1101 681 -210 -1306 -728 543 987 741 -447 -1131 -868 169
1615 169 1433 796 -224 -1391 -777 351 1477 908 -375 -1040 -650 347 1106 1077 -349 -1203 -577 199
1633 199 964 651 77 -848 -697 -9 923 1005 -301 -1012 -586 215 794 795 26 -923 -957 184 1171 1090 -375
1654 -375 -916 -699 392 751 868 77 -949 -749 226 872 874 60 -683 -694 271 733 683 182 -982 -851
1674 -851 -12 617 734 29 -972 -751 -13 974 752 -76 -926 -733 100 407 406 43 -931 -647 -165 1122
1694 1122 862 -119 -677 -820 91 503 907 122 -859 -943 -418 810 677 251 -748 -918 -345 630 782 321
1714 321 -381 -1116 44 902 920 -127 -542 -636 -152 586 814 -60 -473 -724 -189 547 787 168 -511 -564
1734 -564 -443 348 764 474 -710 -520 170 698 767 223 -298 -751 -489 452 773 125 -350 -785 -185 636
1754 636 494 142 -285 -708 -176 678 851 21 -526 -810 -212 325 356 -19 -284 -650 -275 557 686 -36
1774 -36 -336 -627 -138 227 799 532 -358 -259 -221 94 687 221 -290 -556 -443 223 602 381 -277 -988 -160
1795 -160 456 622 29 -380 -317 -286 320 614 201 -335 -589 -366 494 733 565 -31 -760 -516 259 684 307
1816 307 -192 -242 -578 230 647 352 -1 -648 -278 389 763 326 -349 -226 -169 75 406 396 -399 -672 -508
1837 -508 89 197 227 15 -546 -382 329 406 98 -354 -409 -287 302 698 230 -315 -564 -393 -101 545 318
1858 318 142 -382 -302 -123 261 -276 -143 -552 -508 284 560 98 63 -403 -522 -158 323 307 -191 -110 -316 55
1880 55 408 389 17 -336 -541 26 396 160 11 -596 -599 68 438 -106 11 -172 -398 -16 465 484 28 -804
1902 -804 -433 69 424 474 63 -453 -321 -14 492 320 25 -225 -453 243 205 90 -3 -441 -523 4 419
1923 419 307 60 -452 -556 221 229 474 -74 -341 -399 222 285 377 144 -353 -274 -288 -85 118 -52 -334 7
1945 7 262 324 221 -195 -511 -293 -107 211 61 11 -55 -391 110 245 184 -11 -252 -52 -165 -31 124 143
1967 143 -400 -174 38 -3 396 -230 -315 -232 -24 134 226 -105 -116 -153 169 475 329 25 -348 -345 -114 512 192
1990 192 -115 -411 -458 37 -91 227 208 -572 -272 89 117 -43 302 -275 -111 -161 92 221 23 -134 -275
2011 -275 107 92 321 65 -73 -344 -107 352 391 -128 -422 -200 -6 525 369 63 -26 -309 -24 -13 175
2032 175 39 -91 -76 -194 109 269 -58 -13 -441 -196 164 312 209 -30 -77 -333 27 205 -38 -75 -84 125
2054 125 80 218 156 22 -173 9 -15 90 209 0 -373 47 333 219 266 -335 -128 131 68 189 124 42
2076 42 -71 -431 95 260 136 -250 -15 215 310 126 53 -14 -257 -292 9 -76 56 -337 -261 -3 -100 -121 -23
2099 -23 139 -205 208 112 141 -88 -4 -112 -277 -98 -58 -42 60 -275 109 107 261 103 -107 -187 162 -86 411
2122 411 7 52 31 97 481 -80 184 40 -62 -254 135 -102 244 -118 0 261 181 -83 99 -264 -289 -53
2144 -53 -181 374 92 -228 140 -176 -118 372 344 184 206 62 -103 218 22 149 -234 209 202 60 167 -2
2166 -2 318 74 -5 325 235 91 -70 24 51 301 393 -232 -203 52 -20 -67 -17 -68 14 -8 -59 338 13 -192 -39
2191 -39 -256 175 124 -211 48 119 285 -21 85 -31 -289 -86 -90 -154 5 92 140 -132 -70 71 250 -109 11
2214 11 21 158 -59 -23 -48 -143 267 -653 142 68 -3 94 -125 -2 212 -96 -219 216 55 3 -255 -144 -286
2237 -286 -5 -188 -128 3 132 211 -50 78 -222 140 93 58 -207 -56 123 207 -39 3 -85 28 4 121 -128
2260 -128 240 -33 60 225 180 350 118 49 83 39 28 150 241 -41 33 -96 -30 367 15 -106 -254 -127 266
2283 266 349 102 19 -46 -22 70 161 64 127 118 -69 -259 -37 54 178 75 141 253 -25 -156 -101 -241 76 77 23
2308 23 -53 66 -86 37 -330 83 205 33 150 -13 208 -261 -114 159 -179 -37 42 -235 -306 -137 -48 -129
2330 -129 123 -256 10 144 -136 60 -37 190 -4 -202 -7 278 -181 439 193 231 -224 14 110 208 235 -154
2352 -154 -24 174 34 -192 198 -507 -251 148 8 218 -81 -19 -115 272 32 -209 -224 -158 -129 142 342 -26
2374 -26 73 -108 188 6 -229 164 -24 116 46 140 -138 62 -92 -166 -37 17 101 196 90 97 114 99 10 83 -140
2399 -140 73 -147 74 121 -188 201 -97 -76 67 161 24 -72 -295 -25 -38 75 -89 -129 -7 -187 78 388
2421 388 45 0 -37 -264 44 -16 219 -1 -39 -412 -84 -68 29 60 23 -100 -14 66 246 252 -172 112 -1 145
2445 145 -167 -315 -177 -253 -52 85 276 -57 -121 -162 -35 10 -13 -215 0 -74 -208 133 105 -14 -117 -84 14
2468 14 -10 -133 -81 -233 -60 -294 -207 204 198 -226 -61 293 -67 93 -29 -106 -313 -64 179 -86 -133 65 188
2491 188 -137 -264 -214 96 -45 -118 75 102 -29 -252 -92 -349 252 260 96 14 -88 -50 193 192 218 150 -120 -402
2515 -402 -188 -88 287 40 -271 -190 -153 140 4 65 -156 -133 -73 76 -10 147 -229 30 175 139 -97 -39 -67
2538 -67 -350 -95 18 25 -96 6 25 128 81 -215 99 -262 -379 -239 127 213 186 -72 -85 3 -49 106 -169
2561 -169 -86 54 -144 -6 323 -143 63 -154 -489 100 -4 -348 -64 73 123 71 -17 162 -31 -161 -77 150
2583 150 232 155 -252 -60 284 107 205 -101 -77 -241 24 -193 60 -11 117 82 -35 -29 266 198 -31 -53 250
2606 250 -241 36 22 -42 25 -156 40 207 294 -127 -130 59 -92 47 166 -67 141 -98 0 132 -178 200
2628 200 -25 137 53 91 23 -119 47 -305 213 159 205 44 -150 68 136 23 39 -276 -171 68 294 -157
2650 -157 -321 20 -159 49 169 -30 -254 25 -271 84 277 125 258 141 -113 -406 -105 392 154 144
2670 144 -279 74 50 432 52 -122 188 -89 83 8 47 -137 -89 -88 -48 -217 -76 29 -122 -343 -3 419
2692 419 -19 209 52 -161 160 200 83 50 125 -184 67 206 -13 -103 75 -123 -228 -11 87 281 -47 -256
2714 -256 -59 64 -49 81 63 -138 -22 2 123 -156 189 17 -166 132 304 -150 19 -166 -19 160 18
2735 18 -50 -594 213 -87 107 -24 -48 115 -238 88 -124 -47 -6 98 -53 219 -56 99 141 72 -341 -100
2757 -100 44 203 2 75 -137 143 177 187 -197 -323 -154 -51 299 67 -195 -193 -329 80 62 80 -135 -85 -313
2780 -313 212 171 19 34 -112 -33 -166 371 -37 -154 -360 -73 150 3 117 -112 -132 -55 161 140 38 112
2802 112 -59 -211 -98 3 -159 58 91 -24 -67 -184 1 -41 -265 134 -169 -74 245 -47 -42 -180 -50 118
2824 118 166 165 -5 -98 -154 9 48 -355 -20 -66 -212 125 172 9 -49 -169 72 -15 128 183 -111 7 -271 -23
2848 -23 -6 38 -131 -351 234 276 313 -4 -160 -144 183 93 304 78 -152 -2 -38 18 105 53 -187 -19 -60 -278
2872 -278 203 -250 -128 -71 -93 41 -82 295 -101 -33 101 263 97 -51 -117 -26 228 198 281 111 -142 -450
2894 -450 284 362 102 -154 108 -6 -25 2 -72 345 -95 63 -85 21 237 201 -99 -103 117 -127 -61 250 77
2917 77 -166 -139 -64 95 209 191 75 79 284 112 285 -151 -48 157 132 204 335 -181 79 -243 -110 -106 242
2940 242 107 -126 147 -49 299 32 215 -251 44 -13 -96 16 135 1 215 6 -29 50 382 -220 -110
2961 -110 -67 266 112 -152 -169 -469 -238 -8 40 -435 -256 -220 10 218 145 -273 -63 -125 -78 339 -94 -361
2983 -361 -41 84 -88 -183 -161 32 -76 -100 210 -68 119 -76 -204 -135 -143 216 13 52 2 -9 -166 408 152
3006 152 88 15 222 65 -74 -129 -375 32 91 -26 226 179 31 -273 -140 -145 55 88 41 -135 -224 -327 333
3029 333 76 68 -107 0 183 -143 168 70 -211 -136 39 -39 232 -59 -124 50 -58 275 -65 -157 -210 -230 -306
3052 -306 -7 258 -142 -4 -220 -334 216 -137 -409 93 74 18 124 161 -97 27 -65 212 222 215 -40 -92 10
3075 10 -90 60 -24 -88 -384 -22 -19 333 246 -96 -255 -154 134 303 271 149 -215 -258 239 130 -8 244 -106
3098 -106 -129 -97 -183 145 24 57 -275 22 -22 147 77 -239 -376 -211 139 262 -437 -241 160 249 149 211 193
3121 193 -214 215 197 264 -29 104 -95 217 10 -1 -144 -254 174 -223 196 10 -7 24 -244 -52 -264 144
3143 144 -136 196 -5 -22 79 117 -93 219 -168 -56 -11 -67 120 91 229 -80 84 -202 -28 22 -105 -24
3165 -24 -187 -69 99 -73 34 89 101 112 54 262 19 -18 -149 -19 109 -193 -115 208 -27 -53 107 63 16
3188 16 -2 -12 -199 60 24 -10 -145 169 -247 -80 94 -159 -21 -243 -63 -194 51 87 35 -222 -103 5
3210 5 -55 208 13 99 -105 -58 123 -102 -257 -97 -6 102 130 109 -8 70 -353 111 100 -155 -40 197 81
3233 81 30 223 76 -71 -307 198 22 39 -207 -5 53 -7 68 57 -61 -30 136 17 103 208 -215 -75 -145
3256 -145 -299 -14 48 -81 -247 9 -106 147 -96 -116 188 -36 -70 -160 -73 116 -3 -178 53 -150 -246 -36
3278 -36 397 32 -17 80 167 131 84 -291 -88 -115 -8 2 205 -45 47 237 145 19 -84 -109 -296 1 -236 36
3302 36 -252 -29 -66 185 31 68 69 -90 126 169 -51 160 -81 -177 -222 -122 109 -207 69 -38 -131 -64 23 231
3326 231 -405 -110 -53 8 -28 -193 -24 67 195 324 230 10 86 -24 251 -184 28 62 230 90 203 61
3348 61 30 -129 -18 -84 27 259 -280 124 105 -89 44 146 -117 -14 -2 -56 -303 -82 150 -289 18 -41
3370 -41 -108 159 237 11 -154 98 -281 -10 -80 64 -116 -288 52 -68 -26 24 351 8 12 119 26 121 -47
3393 -47 19 -163 32 28 -281 -214 -130 241 -42 50 112 -131 269 12 138 295 -132 35 -19 30 142 151 -153 -131
3417 -131 -225 -1 89 162 -243 -247 -304 -7 -357 216 88 -244 -37 -134 98 172 -37 -38 -86 -23 -118 60 -58 -164
3441 -164 -43 -182 54 161 208 119 -90 73 55 205 291 -50 -65 -97 126 143 -169 180 39 164 158 92 -311
3464 -311 143 145 -169 -129 346 412 -37 -32 22 -53 -8 149 -101 -206 -99 -154 -157 165 -29 -183 229 100 -20 -207
3488 -207 195 10 152 -120 73 -110 -15 -166 -146 146 294 30 196 -214 369 256 8 193 -39 -130 -43
3509 -43 -317 -68 336 122 -106 -27 -336 391 169 -108 36 31 -53 12 298 -89 6 32 -55 -112 -241 -110 -206 -74
3533 -74 23 344 -184 -71 19 -211 -17 -369 -64 159 -205 -56 102 -18 -141 -41 -224 22 -261 130 144
3554 144 -57 -158 29 250 91 -58 -40 15 212 272 236 -128 230 -294 -154 -144 -44 -159 -76 -211 -189 -91 336
3577 336 -109 94 187 153 258 -76 121 199 333 -9 87 5 204 -130 -285 42 181 27 175 -91 48 -120
3599 -120 -50 186 197 -99 -155 -138 31 71 214 185 -184 -89 45 -2 -62 -70 -11 -29 77 -19 13 106 -85 -136 -94 64
3625 64 41 267 -7 32 -8 55 243 -8 -26 -121 199 -102 548 87 103 -218 72 231 -116 139 -20 -125 283
3648 283 34 -89 -132 19 55 -84 273 -10 252 -239 -242 -200 63 56 80 304 -120 38 286 259 89 77 -168
3671 -168 -5 304 -45 -36 -233 -68 123 80 -36 -303 -105 4 227 -76 10 417 47 113 -82 -67 -158 259
3693 259 164 -330 77 -19 -85 -130 144 -171 256 60 133 34 -38 46 -44 -150 -5 255 -109 162 208 -86 110
3716 110 134 -87 153 56 92 177 -5 -147 -253 -112 -224 187 -125 167 23 26 165 -193 93 180 30 -146
3738 -146 51 -259 -201 30 -190 -341 192 -131 152 -82 -5 -257 104 -147 -62 296 -166 41 20 -21 -12 -229
3760 -229 296 -148 -188 55 36 227 -3 17 -257 -19 27 -87 -136 256 -303 95 -240 138 57 103 -48 183
3782 183 277 -285 10 77 -14 51 -63 -172 -334 -148 181 -26 97 -168 -191 199 67 -6 -270 49 -134 -372
3804 -372 127 -160 -121 -26 204 -133 162 11 67 86 -237 52 287 201 45 -54 26 14 97 -4 -217 -50 -141
3827 -141 41 -68 -116 24 -28 -149 -216 18 62 -40 237 -49 -318 -273 20 -50 -229 -66 329 -188 287 -246
3849 -246 -5 23 315 -69 88 105 91 11 64 143 45 122 23 -293 68 10 101 -27 -18 -16 53 201 -238 148 -138
3874 -138 164 -139 -65 7 126 -63 -158 97 -158 93 231 72 -38 -54 -4 20 -103 -254 -295 87 226 -71
3896 -71 -207 140 -12 -73 22 -67 154 -228 -172 96 365 29 -52 -11 -156 -145 -196 -197 46 102 -3 61 -214 129
3920 129 315 61 168 -233 11 109 55 -195 268 106 64 -198 99 62 28 186 62 74 -44 14 101 -59 -59
3943 -59 -61 5 119 -138 48 -44 -23 236 -25 -27 -69 -108 9 -103 -119 -124 134 -174 -148 65 28 19 -86 -119 121 211
3969 211 24 -63 -250 101 -124 -101 46 -77 -258 -18 126 -222 -6 35 10 80 -158 -40 -50 100 238 -97
3991 -97 99 42 -96 112 51 -84 53 254 3 -18 186 225 -17 -115 -81 -124 -3 109 -49 -76 -199 -78 -191
4014 -191 -242 278 114 -80 -296 -32 -17 127 236 -317 100 63 -208 -279 -108 -10 148 182 -274 286 123 40
4036 40 85 -208 83 -142 -75 -157 145 74 -34 -66 77 -16 73 35 37 75 -45 -104 -50 -113 -104 2 8 108 -190 56
4062 56 84 93 -70 42 224 -251 -64 -125 250 58 93 -60 -84 69 117 100 -62 -8 45 -160 64 211 -30 54
4086 54 54 153 125 -88 127 177 -78 -164 -211 72 196 0 -106 -146 235 -106 151 -71 -115 88 145 -232 107 -16
4110 -16 -40 -42 71 -34 -67 -151 104 -122 -134 -145 46 214 -198 177 301 12 -83 -143 -214 258 -120 -186 -333 111
4134 111 365 -177 -141 84 126 -27 182 -262 -49 -84 -140 -157 -32 44 6 83 101 -13 223 280 -128 48 -105
4157 -105 148 103 121 -33 -179 -289 -108 -511 14 -76 -141 -215 40 -162 -99 344 14 -233 -64 -103 12 320
4179 320 140 -209 196 225 -192 -65 -149 167 108 228 -55 -33 263 -35 96 -311 -145 -112 -241 86 -186 -293
4201 -293 -274 12 -5 -198 -124 14 102 -81 65 -111 38 -16 217 -101 -71 91 278 -199 121 -12 249 -167
4223 -167 -327 205 -164 -58 244 131 234 54 -26 -50 100 16 369 208 52 -109 -16 117 -98 -175 -16 175
4245 175 -86 51 -68 -173 -26 276 93 9 -15 -234 -195 -15 67 -146 -39 -162 16 55 57 128 144 -185 -76
4268 -76 -155 -46 8 -23 -113 146 164 -18 69 122 -7 -55 64 -151 133 -7 50 -230 -83 31 43 31 145 149 -70
4293 -70 -133 3 402 -55 109 -94 -111 57 -188 134 -35 -72 -184 181 37 -53 -285 79 -105 -94 289 88
4315 88 -69 -87 258 23 -208 104 52 -219 80 218 11 44 -172 -55 240 -231 70 -19 -140 -151 135 -63
4337 -63 -387 -74 -193 -240 17 -319 -96 -15 -20 -99 -251 -151 -63 137 -184 -43 -41 173 -79 -81 -48 200 12 61
4361 61 -327 -66 207 9 9 -236 125 -244 -137 -108 -117 -57 -18 -276 -154 123 161 -29 127 -39 -76 150 130 20
4385 20 -128 17 108 -122 -316 -66 -118 -89 -133 437 193 -279 -92 270 -22 -25 13 181 4 268 30 -157 278
4408 278 -72 43 -54 -14 -208 -74 10 -20 68 37 78 -48 -85 31 41 -371 -81 217 -49 108 -388 310 98
4431 98 150 122 -270 -303 163 132 -163 195 44 -74 -130 -229 -17 -176 32 142 42 194 -211 -124 -21 -289 -73
4454 -73 -99 -151 -69 -5 106 -32 45 42 -27 -168 11 148 128 204 269 131 -14 80 -107 -80 131 167 46 209 -115
4479 -115 123 105 -91 -52 -28 -40 -4 106 89 80 91 -298 -144 -14 -160 -6 49 -127 182 299 -244 -190 51 60
4503 60 -50 -222 53 64 -267 213 -132 40 -139 23 79 54 -114 -93 -60 13 -290 -225 130 49 -41 -184 184
4526 184 45 133 76 -5 -147 -14 148 157 -42 -131 -224 -60 208 30 -80 42 32 -220 -87 -109 99 -59 -201
4549 -201 8 284 -21 96 -228 -214 182 -68 -73 146 31 63 176 -332 30 -174 -63 -140 345 -1 -89 76
4571 76 187 199 229 -45 -188 -86 -58 -46 133 -37 47 313 -75 -8 -126 137 -20 -15 188 10 -181 -100 -41 7
4595 7 271 81 -75 -39 -124 242 115 132 -148 22 17 73 17 -14 40 2 272 -59 36 -137 69 12 -3 -154 -102
4620 -102 111 -425 52 -171 -264 13 -18 312 -110 -93 -49 -68 -129 25 211 29 -290 29 90 -206 -36 -122 -150
4643 -150 -87 102 -44 47 194 124 92 -245 15 63 -62 -59 -35 295 56 -210 -42 -28 10 211 109 -13 194
4666 194 -56 45 -26 -254 -297 189 -75 141 34 -209 92 -88 -25 -71 -17 -103 -210 -120 126 -3 -82 201 116
4689 116 45 258 -58 -376 48 -298 98 -432 62 53 -219 -74 28 -119 456 354 -26 -72 3 -108 193 34
4711 34 39 -119 -297 200 -38 -25 38 -41 164 -8 137 177 148 -90 -50 -199 95 350 33 -46 53 91 66 79 -105
4736 -105 -76 -116 110 126 -23 234 -124 -277 37 188 208 242 -5 10 263 46 42 -132 2 74 29 34 -22 51 230
4761 230 -162 -142 -334 -184 -199 68 26 120 90 -106 -44 -183 -6 81 -125 136 57 -80 -48 227 45 -16 -152
4784 -152 45 338 47 253 16 -293 -170 -89 174 82 -150 25 -165 -72 -128 39 -10 46 -1 305 -199 247
4806 247 22 143 -226 38 53 -204 -23 -209 -38 78 156 36 -18 53 -97 -19 112 96 21 253 -143 -7
4828 -7 119 178 -28 -201 -15 -216 -102 -165 -20 42 49 -166 99 -105 -61 239 2 137 456 19 147 -77 13
4851 13 -29 51 72 -139 133 11 52 252 98 226 142 194 -84 -139 -7 50 89 -19 -14 -95 57 24 310 -39 57
4876 57 32 -239 161 -33 -202 -205 -25 108 168 -42 -291 -28 24 -15 -29 31 -214 138 -292 -46 -103 -155 -68 305
4900 305 80 -42 302 -218 152 28 -208 -121 7 -335 -174 -227 47 33 -256 -3 -91 -94 -159 -109 98 167 86
4923 86 -38 206 179 129 -161 162 91 -93 -28 -116 152 -1 33 66 81 134 183 -380 -66 -32 -25 -20 300 52 34 256
4949 256 176 50 119 180 -299 -37 32 105 42 31 62 64 -4 -399 186 218 -81 5 79 187 -142 -11 82 50 200
4974 200 62 90 100 79 -211 71 -90 -60 -46 -79 120 341 12 297 111 175 46 55 176 -145 106 -33 141
4997 141 -22 127 -198 11 235 -112 -185 -169 117 303 115 13 -68 -56 65 -44 -311 -2 -16 -13 -10 71 -33
5020 -33 148 187 65 -336 -7 115 -173 337 -131 -60 -11 238 43 198 40 77 -37 -62 -56 107 -111 -218 125
5043 125 137 -87 -2 268 162 -12 147 -41 166 -101 8 74 -83 91 -273 -196 -49 -177 14 136 124 62
5065 62 107 -107 -167 80 -167 120 -137 -38 -74 94 60 25 107 121 -202 23 -16 -216 179 -88 -164 -88 126 222
5089 222 -107 70 -11 25 -147 -100 -114 65 -106 41 -19 -26 174 89 245 70 -113 21 -115 -133 -181 -201 -45 -253
5113 -253 175 6 101 107 103 -207 -23 11 363 216 -109 65 -95 -24 74 -17 63 295 68 89 -44 191 36 44
5137 44 210 88 60 -68 -87 -101 -160 180 -40 -64 -149 -144 126 -172 46 -242 208 48 -113 297 243 -1 -74 442
5161 442 35 81 112 -359 20 285 118 301 184 160 7 -86 130 191 -31 250 -31 247 110 -87 -266 -39
5183 -39 142 133 -133 23 19 -23 -176 22 -46 16 -50 -93 26 105 131 74 13 -243 200 57 87 -150 -97 -137 82 26
5209 26 -181 -160 31 -91 -331 9 -205 -62 24 -16 -351 -237 99 98 5 -57 -24 -12 -159 96 69 187 -244 26
5233 26 -69 106 -6 173 -104 107 -69 -35 -51 40 96 -286 184 -207 -190 -199 -146 309 -220 -216 73 222 -306 -384
5257 -384 -87 -407 -284 79 128 -216 -97 -247 -70 22 -121 -40 263 -170 137 217 94 -182 108 125 112 -46
5279 -46 198 1 47 -84 -280 30 51 -152 166 154 92 -24 -349 -39 223 -181 55 78 -282 -116 90 -198
5301 -198 -115 70 54 -87 73 -25 -101 -220 -49 83 -215 -128 18 -77 -154 -3 -53 -15 -65 17 82 -117 -74 191
5325 191 45 -207 135 249 -340 131 -110 27 -45 28 154 97 -41 -115 159 -177 -24 -215 97 -72 68
5346 68 229 109 -46 116 66 -91 -218 -343 91 86 -103 154 -153 -399 120 18 60 -7 -96 -133 63 -66 -83
5369 -83 2 232 57 271 -103 202 -90 14 60 -310 -208 21 61 153 -145 17 -70 6 -2 -33 127 -197 -31
5392 -31 31 -191 168 107 129 133 -61 175 -180 45 -168 71 -21 102 -15 -2 -174 -59 -212 511 -60 -164 -278
5415 -278 -112 -12 -3 -208 -188 22 -43 -197 -206 -149 42 191 117 254 -3 -161 -183 196 -20 77 9 -22 -37 92
5439 92 -51 45 213 -31 -233 -152 213 -248 111 91 65 101 20 154 -211 -31 103 -173 -20 5 134 -223 225
5462 225 55 62 -78 322 -133 92 -91 -56 151 -203 -88 240 -325 86 85 -46 64 -202 -72 186 -25 -43
5484 -43 265 337 -133 27 -163 5 258 31 60 -190 -224 129 324 -328 135 -120 -261 -264 -178 -208 204 335 -50
5507 -50 -6 -98 -90 -19 46 -175 -104 -301 -148 40 -127 33 -31 -5 -479 50 -200 113 -142 -54 -170 -264 138 -86
5531 -86 -121 -48 64 138 34 46 93 -202 -46 54 100 85 -153 60 -60 262 -287 -208 -290 13 11 -30 40 -41 70
5556 70 -202 -166 115 155 -33 -186 -96 113 41 -180 45 116 -47 39 -110 122 51 111 71 -24 162 53 -68 -119
5580 -119 -201 28 130 87 -88 -75 211 391 69 -71 -28 111 -68 -71 -169 -57 -245 205 23 -62 227 -8 7
5603 7 54 -226 -133 119 212 86 -179 -82 -43 -180 -41 -14 30 262 -41 166 -193 365 145 116 166 -149 41 106
5627 106 -59 53 57 -89 61 87 31 -76 2 -14 269 57 2 88 -38 -185 -96 68 9 232 59 -221 83
5650 83 -73 163 -17 9 171 130 11 -31 224 230 154 144 97 126 105 -81 -151 158 -162 140 92 139 161 74 26 -48
5676 -48 25 -78 504 -10 -39 -23 385 -25 194 -194 -100 -244 0 -7 -33 142 -324 123 -223 -316 85 191 -109
5699 -109 52 77 31 271 89 85 -86 -124 -24 -36 -150 -289 202 -121 -78 179 -90 475 -225 99 20 -122 -238
5722 -238 117 176 -127 -1 7 -128 -206 100 -82 58 -9 146 -261 318 -63 -235 -123 -97 89 246 -189 79
5744 79 -87 -144 -197 -43 120 138 -40 110 -92 -63 -63 69 95 -102 10 92 -17 -475 81 135 88 -13 -47 27
5768 27 277 33 91 -30 67 11 275 -36 -58 -219 -98 126 -133 65 -304 -64 -26 -33 152 183 -168 -26 -116
5791 -116 28 49 -85 45 -18 -107 -245 -136 149 479 224 -258 136 -102 -62 164 -13 -123 19 -5 45 -343
5813 -343 -160 -140 38 120 -155 -187 -68 -468 -307 70 79 100 -16 -19 -160 -7 88 -17 15 -194 -45 -244 121
5836 121 -128 203 -46 -141 61 84 -124 300 -49 138 44 115 155 230 9 -8 138 228 196 113 -110 22 -73 -133
5860 -133 75 -90 -10 -4 221 -22 204 -113 -123 52 -241 -229 100 -68 -428 33 -32 -13 -129 123 -101 -166 79
5883 79 182 -74 -85 -81 30 84 80 -163 -59 -28 118 -199 -108 -180 51 -42 192 116 -325 48 103 12 -17 175 192
5908 192 -98 115 -311 -25 -48 184 120 -5 303 -170 189 35 -105 66 229 -41 -322 -56 84 -155 -116
5929 -116 25 136 62 -35 -9 124 -213 265 215 333 -59 -158 -201 146 73 201 -14 -148 -81 -61 263 -23 -77
5952 -77 -188 163 -176 12 -100 -22 -76 183 -122 -26 212 -279 -253 -68 -41 -37 206 217 -159 102 -26 -46 383
5975 383 169 -210 187 -87 51 9 156 -5 -121 25 -148 62 -54 161 -97 -211 91 -34 54 -165 -6
5996 -6 177 -127 57 -195 64 -91 -227 40 51 57 -71 -148 323 -148 -79 -43 33 -162 -80 105 -12 -132 193
6019 193 -149 55 180 110 59 -202 52 84 131 -29 146 -150 -1 371 -115 -19 -128 -13 260 68 269 136
6041 136 -102 -26 45 193 207 -71 -47 -142 -110 -44 -139 -191 -41 -126 -185 153 19 -153 -76 -213 79 -52 68 -42
6065 -42 -42 48 11 -62 -8 -222 -139 -57 -25 179 -23 66 -29 -30 264 239 123 -228 -71 -10 21 20 245 32 93 -207 -66
6092 -66 176 -267 -242 -124 14 55 182 232 10 179 284 -2 -3 40 -34 -161 -291 20 -230 -163 40 -26 -341
6115 -341 -144 -179 32 -5 39 37 -150 56 -134 -219 53 130 373 172 5 -182 27 124 -70 -149 -130 240 -167
6138 -167 2 94 -61 78 -82 187 14 11 240 -230 237 -106 -112 333 -22 88 147 103 139 -73 32 8 -118
6161 -118 106 104 31 -161 29 175 134 95 -70 178 93 0 435 340 -132 134 85 -273 70 -241 29 47 320
6184 320 60 124 175 -257 29 231 99 30 122 20 112 -91 -252 129 6 240 316 27 282 29 -35 165
6206 165 -491 -49 124 91 -79 191 165 324 -63 69 235 21 1 89 -86 -26 -45 172 43 -73 -143 -54 -264
6229 -264 112 -37 -20 161 -120 -78 293 160 -18 60 202 -125 -37 -187 167 -270 -48 104 81 447 -149 133
6251 133 -51 1 77 55 12 -147 -152 184 -70 250 78 -34 213 -127 -150 -5 187 332 -83 66 63 56 -169 106
6275 106 -86 168 44 -383 109 105 -21 4 -179 -69 -79 70 -76 -78 -23 -194 216 -14 57 76 -46 -73 -66 19
6299 19 57 -307 131 111 106 -55 15 -258 -126 -79 -64 113 109 24 161 -131 109 -51 -204 -171 -336 198 -2 -383
6323 -383 -48 59 -55 -65 -89 11 -42 127 29 75 79 91 -133 50 300 43 -131 -41 -4 225 -13 241 -7
6346 -7 -142 79 2 -258 -154 -265 -65 -93 -139 8 -300 -35 176 -216 -222 -38 4 -61 -38 -154 -133 -30 195 197
6370 197 206 -85 129 445 200 115 -51 -64 -111 -274 -169 -142 286 78 153 -309 65 86 -126 -294 -47 162 153
6393 153 44 -183 -194 29 247 -124 -11 107 14 44 110 1 -395 13 165 -134 -32 81 19 -22 94 -56
6415 -56 -22 39 -2 -327 -75 -6 -265 6 -237 14 143 -467 -130 -168 -224 43 242 113 -234 -393 -71 -47 -24
6438 -24 -8 232 125 -142 2 124 -136 -19 88 -298 100 33 154 10 217 -57 319 26 54 -460 92
6459 92 -97 161 65 121 124 138 -123 -258 -193 22 36 156 159 -129 10 -26 185 98 -108 -157 86 -176 -321 8
6483 8 -138 130 -6 -7 -95 -163 -241 -225 120 -206 72 80 -319 -55 169 13 -272 -24 209 139 61 -86 17 164
6507 164 -119 39 123 106 -50 -239 -14 -388 297 66 81 210 -182 -82 249 75 -33 17 213 178 -160 -157
6529 -157 -11 -62 100 -173 -149 176 53 20 -132 422 147 115 28 56 -35 -297 -324 -7 -222 193 -176 -210 143
6552 143 -315 -100 -152 -115 -69 -18 -27 -60 21 284 34 -37 -223 -156 129 109 66 92 148 194 -71 215 126 29 -164 -248
6578 -248 -78 -152 -82 -14 -160 -198 102 25 -310 -66 -181 -50 281 -90 -121 5 -204 109 74 -65 126 -118
6600 -118 160 35 50 9 -230 -1 -105 66 -27 -156 -22 183 63 -87 -94 59 218 -63 337 221 78 87
6622 87 141 35 3 -17 -272 46 63 -96 46 -148 84 -452 -164 -58 248 292 67 61 8 -210 -65 -29 -291
6645 -291 -80 118 -59 53 -79 -94 50 -61 -17 117 -103 39 224 -121 -263 305 61 -120 271 -107 -162
6666 -162 -91 -8 73 224 127 -110 146 102 -56 -7 121 -63 85 -103 -175 26 233 259 -325 -21 26 38 99 -22
6690 -22 -39 8 -194 -236 -106 126 -98 116 -278 -120 -15 8 -48 -315 13 215 12 -114 -49 95 71 -121 38
6713 38 230 84 84 -25 166 -167 116 91 -23 -248 13 -47 332 157 -238 15 339 -284 -43 21 -49 -41 -38 -145
6737 -145 16 -51 218 -23 -46 -65 177 -200 -253 1 -33 153 -80 448 93 204 -73 -36 -253 -35 13 -67 10
6760 10 97 55 141 34 -1 13 -125 -126 437 -76 -328 120 154 303 -13 -280 29 -21 -39 -43 -27 -36 -111 281 55 -47
6786 -47 25 -58 155 12 -16 260 108 -167 53 59 152 -128 -104 82 -277 211 44 81 -170 -212 25 192 66
6809 66 -168 43 -89 -169 -212 40 -46 -106 -105 -381 111 -129 -122 -10 12 -109 184 -102 -156 33 83 159 -195 232
6833 232 -119 88 70 -8 -169 82 -367 -267 208 294 -245 -46 -85 -274 -20 198 -89 -73 -34 10 32 -200 -139
6856 -139 6 -75 -232 53 94 40 134 127 137 69 -266 70 253 196 270 11 -35 14 -11 -299 118 13 -244 -156 -174
6881 -174 42 50 -69 -187 13 -177 -156 -351 -131 -161 191 216 -143 -26 307 161 -5 -52 -92 -161 -118 -96 97
6904 97 44 -41 -63 -191 -21 -139 -34 206 313 -122 -65 22 234 113 103 10 1 121 192 -186 -174 264 -108 92
6928 92 162 80 296 -18 -167 96 -161 328 -56 40 -204 -196 179 189 25 -213 73 -373 74 -93 -116 -45 203
6951 203 114 5 335 -128 41 7 40 115 36 -87 -145 22 191 231 -54 141 209 -161 -121 4 275 -164 -18
6974 -18 -279 -96 81 216 -168 110 14 211 69 -77 -350 -192 24 -166 173 -120 79 -13 132 -160 162
6995 162 245 -11 -197 -116 100 217 -63 -312 220 75 35 -222 -283 132 -132 208 108 185 42 -178 231 -43
7017 -43 38 18 -108 -194 -152 141 131 114 -27 -138 182 253 -231 38 -2 -202 -2 -129 239 125 106 62 -182 -37
7041 -37 -272 238 -106 154 201 24 161 -55 -13 -143 168 -189 -135 163 -1 -46 -40 51 96 -28 -2 -493 -211
7064 -211 41 101 -299 86 261 -213 44 -17 156 52 -67 50 39 89 130 56 -210 20 -88 -90 27 67 -102
7087 -102 -344 -7 13 91 -244 27 -233 -44 211 7 -52 -31 -86 -5 -95 -168 215 53 54 137 -243 103 44 -371
7111 -371 -57 -88 46 351 -71 -344 132 56 -11 -69 -229 164 34 -95 -43 146 -47 22 189 132 -45 -258
7133 -258 -91 -84 62 -115 -122 -13 29 -65 -310 153 -72 -8 -38 -66 -4 -288 23 -103 240 -79 112 -125 81
7156 81 -22 -13 243 -63 -27 89 -41 157 36 -152 27 -78 303 -33 12 -137 59 72 106 315 -14 63 299
7179 299 -190 -257 231 160 97 130 17 -36 95 79 -7 150 -6 -32 -2 26 -138 1 -364 80 -37 -141 2
7202 2 213 -137 27 163 30 176 161 63 53 -49 -378 -60 10 34 111 64 175 238 -47 -217 209 93 35 91
7226 91 -17 144 229 47 -5 -78 28 -14 -176 118 -63 169 -10 -215 246 4 82 215 -187 71 73 75 -127
7249 -127 -188 218 112 41 69 -92 -160 -376 202 50 -179 158 -16 -310 -20 174 -152 -39 -102 -82 50 -13
7271 -13 -118 6 162 -32 51 132 305 28 -95 22 -27 34 115 -44 147 255 -152 3 81 -26 4 -54 136
7294 136 116 -109 -19 122 88 88 -1 76 -69 2 77 -98 306 281 -48 -174 -372 168 90 -219 164 69 -269 -111
7318 -111 165 330 46 134 -206 55 -222 141 -87 220 -42 -69 1 -137 27 -110 -125 106 -95 94 233
7339 233 12 75 -189 -21 -220 178 320 141 295 -109 19 57 204 125 16 324 -273 57 -184 224 116
7360 116 66 -243 18 65 234 -8 -3 99 51 -36 118 -120 12 130 -203 -14 -310 25 91 10 -33 -271 -199
7383 -199 57 -180 -19 -51 -253 26 297 -73 30 -171 87 -196 275 175 -11 -246 -148 -85 19 77 127 51
7405 51 -235 181 55 -67 160 121 -188 305 5 -41 -106 141 126 -86 50 -240 -31 -127 -166 30 -258 -267 -82
7428 -82 59 -75 -8 -233 -190 107 -186 -39 11 202 -124 -95 -209 -94 193 -101 -214 -186 -12 128 155 103 52
7451 52 -63 -50 -199 436 186 -125 -88 84 131 -16 -12 57 146 122 258 -105 -304 23 -178 134 234 27 -89
7474 -89 -210 268 -128 -84 -10 -123 81 -35 73 82 -63 414 -70 -122 -227 17 -73 -328 -22 108 53 -26 -65
7497 -65 34 204 -71 -399 66 -11 281 62 94 36 4 -180 72 93 -27 144 102 -16 -63 3 61 2 -140 37
7521 37 52 -33 -15 -2 25 108 155 107 -99 223 -184 78 44 -12 -145 -370 -176 -29 10 -150 -68 135 -68 -43 155
7546 155 -66 386 61 -217 -67 98 -186 -201 -17 -28 89 40 -195 90 -99 -152 -131 -101 -168 -148 127 173 317
7569 317 -285 299 217 190 35 -79 -163 38 -23 -53 -82 73 -47 93 32 -156 61 162 -95 41 42 96 42 118
7593 118 60 10 -28 -132 -342 167 -37 -92 181 36 -40 -87 116 49 -205 -299 -345 -304 82 -151 -96 4 138 66
7617 66 -353 -24 5 -56 -153 73 103 128 94 -131 -39 -64 76 242 99 80 -167 -36 -80 40 8 -295 -332 -77
7641 -77 122 132 266 45 163 -166 -59 6 326 341 174 187 2 177 70 59 117 -259 102 76 -83 258 81
7664 81 161 37 -182 101 135 90 224 -66 167 -168 103 168 -139 276 -190 12 -319 232 -225 -268 -140 -135 387
7687 387 -249 11 92 86 -176 36 195 -61 -95 190 109 -203 46 266 -359 90 -187 110 -159 -206 185 106
7709 106 144 -144 255 -239 116 -17 208 73 -213 -139 -48 -86 -86 119 -240 -123 253 219 -88 -31 123 173 62
7732 62 133 -20 31 9 -185 306 179 -66 -89 -37 -214 44 -133 71 -295 -173 22 -339 162 -191 -138 20
7754 20 -22 324 32 -21 182 64 60 -101 -265 71 -93 -35 -41 426 -134 143 169 -133 34 192 192 44 102 -86
7778 -86 125 15 -306 34 79 -300 76 -222 42 -87 -9 -89 276 71 -77 -16 -184 75 2 -242 330 -228
7800 -228 -21 27 -147 166 29 -178 159 -54 229 11 34 -59 150 118 -97 -53 195 -189 -80 -58 46 13
7822 13 386 -11 33 -72 -159 164 26 -142 -355 -290 79 297 27 -123 -120 107 -175 -146 -158 17 115 297 -138
7845 -138 38 -120 -196 -170 108 191 -269 -51 -129 -345 111 98 -161 143 -18 32 63 -28 345 -23 -180 109 -131
7868 -131 -317 195 -157 -27 -228 -26 201 12 -131 -56 14 -2 -86 176 -26 -35 -29 36 68 107 21 -182 87 -352
7892 -352 -164 8 101 -38 290 -219 -123 190 -117 -65 -50 -88 55 262 156 -52 13 216 -325 80 -269 -56
7914 -56 4 -84 -83 -12 164 41 70 92 -23 -62 -182 93 -177 -39 127 -94 188 -118 -137 -101 142 19 25 -102
7938 -102 -168 -147 46 -49 -93 141 -50 110 -118 191 -202 -15 -290 -160 192 -43 -48 97 102 -75 -10 123 -142
7961 -142 90 63 -21 -211 -23 -93 -10 32 -186 -83 -40 119 267 2 297 3 -128 204 -2 80 146 26 75
7984 75 4 -90 88 -34 -134 194 123 22 25 -98 104 -99 108 -55 116 -156 176 -133 51 67 -16 -246 57
8007 57 211 144 43 207 151 -106 226 -54 138 141 191 22 428 120 376 34 48 124 176 -99 69 123 92 80
8031 80 224 189 -120 -102 -164 -173 -52 79 -58 7 246 208 -178 8 -227 189 130 -31 -135 -22 -258 124 135
8054 135 51 -11 3 57 -349 36 190 177 -175 102 -293 -85 -209 26 174 105 29 160 -167 191 -50 -80 -17
8077 -17 -105 95 96 -294 2 71 -23 259 22 29 -34 -11 78 20 -32 140 91 80 52 86 -45 67 95 236 -143 -179
8103 -179 -15 -37 -140 -68 14 131 -175 421 -275 -171 -73 52 323 -73 -160 150 -2 74 -119 90 -215 126
8125 126 -87 -20 37 -45 -201 4 27 244 -341 129 155 0 101 33 -205 155 169 -58 -103 250 -139 -56 276
8148 276 -140 62 -51 79 211 -269 118 120 114 -49 45 130 90 68 -156 -256 -10 -56 -143 32 96 80 -167 182
8172 182 -88 82 34 -99 -125 -110 151 86 121 45 38 -124 -37 -125 -69 66 -192 -6 -296
8191b96
##END NTUPLES=NMR FID
##END=
