##TITLE=1H_Pr dep3
 CDCl3, 8 sc, 
 2.08.2021
##JCAMPDX= 6.0         $$ Bruker NMR JCAMP-DX V2.0
##DATA TYPE= NMR FID
##DATA CLASS= NTUPLES
##ORIGIN= UXNMR, Bruker Analytische Messtechnik GmbH
##OWNER= root
$$ XWIN-NMR		Version 3.5
$$ Mon Aug  2 12:44:01 2021 Russian Standard Time (UT+4h)  she@DPX200
##.OBSERVE FREQUENCY= 200.131506
##.OBSERVE NUCLEUS= ^1H
##.DELAY= (6, 6)
##.ACQUISITION MODE= SIMULTANEOUS
##.ACQUISITION SCHEME= undefined
##.AVERAGES= 8
##.DIGITISER RES= 18
##SPECTROMETER/DATA SYSTEM= spect
##.PULSE SEQUENCE= zg30
##.SOLVENT NAME= CDCl3
##.SHIFT REFERENCE= (INTERNAL, CDCl3, 0, 15.7039)
##AUDIT TRAIL= $$ (NUMBER, WHEN, WHO, WHERE, WHAT)
$$ ##TITLE= Audit trail, XWIN-NMR		Version 3.5
$$ ##JCAMPDX= 5.01
$$ ##ORIGIN= Bruker BioSpin GmbH
$$ ##OWNER= she
$$ F:/spectra/data/she/nmr/H-F/1/audita.txt
$$ ##AUDIT TRAIL=  $$ (NUMBER, WHEN, WHO, WHERE, WHAT)
(   1,<2021-08-02 12:42:40.43 +0400>,<she>,<DPX200>,
      <created by zg, POWCHK disabled, PULCHK disabled
       configuration hash MD5:
       00 E9 B6 7A A2 85 ED C7 34 08 36 98 17 FE 4E 26
       data hash MD5: 16K
       CE 3E BB 09 7D 6D 7F E3 39 AC 98 AD 7B E3 A0 94>)
$$ ##END=
$$ 
$$ hash MD5
$$ 3D 18 6C 8A C1 0E AA 97 A8 D4 1D F3 FB 90 FB 8D
##$RELAX= 
##$RELAX= 
##$RELAX= 
##$RELAX= 
##$RELAX= 
##$RELAX= 
$$ Bruker specific parameters
$$ --------------------------
##$DU= <F:/spectra>
##$EXPNO= 1
##$NAME= <H-F>
##$PROCNO= 1
##$TYPE= <nmr>
##$USER= <she>
##$AMP= (0..31)
100 100 100 100 100 100 100 100 100 100 100 100 100 100 100 100 100 100 
100 100 100 100 100 100 100 100 100 100 100 100 100 100 
##$AQSEQ= 0
##$AQ_mod= 1
##$AUNM= <au_zg>
##$AUTOPOS= <>
##$BF1= 200.13
##$BF2= 200.13
##$BF3= 200.13
##$BF4= 200.13
##$BF5= 200.13
##$BF6= 200.13
##$BF7= 200.13
##$BF8= 200.13
##$BYTORDA= 1
##$CFDGTYP= 0
##$CFRGTYP= 5
##$CHEMSTR= <none>
##$CNST= (0..31)
1 1 145 1 1 1 1 1 1 1 1 1 1 1 1 1 1 1 1 1 1 1 1 1 1 1 1 1 1 1 1 1 
##$CPDPRG= <>
##$CPDPRG1= <>
##$CPDPRG2= <>
##$CPDPRG3= <>
##$CPDPRG4= <mlev>
##$CPDPRG5= <mlev>
##$CPDPRG6= <mlev>
##$CPDPRG7= <mlev>
##$CPDPRG8= <mlev>
##$CPDPRGB= <>
##$CPDPRGT= <>
##$D= (0..31)
0 1.2 0 0 0 0 0 0 0 0.06 0 0.03 0 0 0 0 0.0002 0 0 0 0 0 0 0 0 0 0 0 0 
0 0 0 
##$DATE= 1627893759
##$DBL= (0..7)
120 120 120 120 120 120 120 120 
##$DBP= (0..7)
150 150 150 150 150 150 150 150 
##$DBP07= 0
##$DBPNAM0= <>
##$DBPNAM1= <>
##$DBPNAM2= <>
##$DBPNAM3= <>
##$DBPNAM4= <>
##$DBPNAM5= <>
##$DBPNAM6= <>
##$DBPNAM7= <>
##$DBPOAL= (0..7)
0.5 0.5 0.5 0.5 0.5 0.5 0.5 0.5 
##$DBPOFFS= (0..7)
0 0 0 0 0 0 0 0 
##$DE= 6
##$DECBNUC= <off>
##$DECIM= 32
##$DECNUC= <off>
##$DECSTAT= 4
##$DIGMOD= 1
##$DIGTYP= 9
##$DL= (0..7)
0 120 120 120 120 120 120 120 
##$DP= (0..7)
150 150 150 150 150 150 150 150 
##$DP07= 0
##$DPNAME0= <>
##$DPNAME1= <>
##$DPNAME2= <>
##$DPNAME3= <>
##$DPNAME4= <>
##$DPNAME5= <>
##$DPNAME6= <>
##$DPNAME7= <>
##$DPOAL= (0..7)
0.5 0.5 0.5 0.5 0.5 0.5 0.5 0.5 
##$DPOFFS= (0..7)
0 0 0 0 0 0 0 0 
##$DQDMODE= 0
##$DR= 18
##$DS= 0
##$DSLIST= <SSSSSSSSSSSSSSS>
$$ [...]
##$SUBNAM2= <"">
##$SUBNAM3= <"">
##$SUBNAM4= <"">
##$SUBNAM5= <"">
##$SUBNAM6= <"">
##$SUBNAM7= <"">
##$SUBNAM8= <"">
##$SUBNAM9= <"">
##$SW= 20.0188882624521
##$SWIBOX= (0..15)
0 0 2 0 0 0 0 0 0 0 0 0 0 0 0 0 
##$SW_h= 4006.41025641026
##$TD= 16384
##$TD0= 1
##$TE= 0
##$TE2= 300
##$TE3= 300
##$TEG= 300
##$TL= (0..7)
0 120 120 120 120 120 120 120 
##$TP= (0..7)
150 150 150 150 150 150 150 150 
##$TP07= 0
##$TPNAME0= <>
##$TPNAME1= <>
##$TPNAME2= <>
##$TPNAME3= <>
##$TPNAME4= <>
##$TPNAME5= <>
##$TPNAME6= <>
##$TPNAME7= <>
##$TPOAL= (0..7)
0.5 0.5 0.5 0.5 0.5 0.5 0.5 0.5 
##$TPOFFS= (0..7)
0 0 0 0 0 0 0 0 
##$TUNHIN= 0
##$TUNHOUT= 0
##$TUNXOUT= 0
##$USERA1= <user>
##$USERA2= <user>
##$USERA3= <user>
##$USERA4= <user>
##$USERA5= <user>
##$V9= 5
##$VALIST= <valist>
##$VCLIST= <CCCCCCCCCCCCCCC>
##$VD= 0
##$VDLIST= <DDDDDDDDDDDDDDD>
##$VPLIST= <PPPPPPPPPPPPPPP>
##$VTLIST= <TTTTTTTTTTTTTTT>
##$WBST= 1024
##$WBSW= 4
##$XGAIN= (0..3)
0 0 0 0 
##$XL= 0
##$YL= 0
##$YMAX_a= 116471
##$YMIN_a= -248175
##$ZGOPTNS= <>
##$ZL1= 120
##$ZL2= 120
##$ZL3= 120
##$ZL4= 120
##$ABSF1= 10
##$ABSF2= 0
##$ABSG= 5
##$ABSL= 3
##$ALPHA= 0
##$AQORDER= 0
##$ASSFAC= 0
##$ASSFACI= 0
##$ASSFACX= 0
##$ASSWID= 0
##$AUNMP= <proc_1d>
##$AZFE= 0.1
##$AZFW= 0.1
##$BCFW= 1
##$BC_mod= 2
##$BYTORDP= 1
##$COROFFS= 0
##$CY= 11.3945322036743
##$DATMOD= 1
##$DC= 2
##$DFILT= <>
##$DTYPP= 0
##$F1P= 2.36226072786647
##$F2P= -0.459571619588291
##$FCOR= 0.5
##$FTSIZE= 0
##$FT_mod= 4
##$GAMMA= 1
##$GB= 0.15
##$INTBC= 1
##$INTSCL= 1
##$ISEN= 128
##$LB= 0.24
##$LEV0= 0
##$LPBIN= 0
##$MAXI= 10000
##$MC2= 0
##$MEAN= 0
##$ME_mod= 0
##$MI= 1.114404
##$NCOEF= 0
##$NC_proc= 0
##$NLEV= 6
##$NOISF1= 3.799351
##$NOISF2= 2.8
##$NSP= 1
##$NTH_PI= 0
##$NZP= 0
##$OFFSET= 15.70392
##$PC= 1
##$PHC0= -13354.8
##$PHC1= 8.80099
##$PH_mod= 1
##$PKNL= yes
##$PPARMOD= 0
##$PSCAL= 0
##$PSIGN= 0
##$REVERSE= no
##$SF= 200.130013532006
##$SI= 16384
##$SIGF1= 3
##$SIGF2= 2
##$SINO= 400
##$SIOLD= 16384
##$SREGLST= <1H.CDCl3>
##$SSB= 0
##$STSI= 0
##$STSR= 0
##$SW_p= 3612.71676300578
##$SYMM= 0
##$S_DEV= 0
##$TDeff= 0
##$TDoff= 0
##$TI= <>
##$TILT= no
##$TM1= 0
##$TM2= 0
##$TOPLEV= 0
##$USERP1= <user>
##$USERP2= <user>
##$USERP3= <user>
##$USERP4= <user>
##$USERP5= <user>
##$WDW= 1
##$XDIM= 8192
##$YMAX_p= 0
##$YMIN_p= 0
$$ End of Bruker specific parameters
$$ ---------------------------------
##NTUPLES= NMR FID
##VAR_NAME=  TIME,          FID/REAL,        FID/IMAG
##SYMBOL=    X,             R,               I
##VAR_TYPE=  INDEPENDENT,   DEPENDENT,       DEPENDENT
##VAR_FORM=  AFFN,          ASDF,            ASDF
##VAR_DIM=   8192,          8192,            8192
##UNITS=     SECONDS,       ARBITRARY UNITS, ARBITRARY UNITS
##FACTOR=    0.0002496,     1,               1
##FIRST=     0,             0,               0
##LAST=      2.0444736,     0,               0
##MIN=       0,             -248175,         0
##MAX=       2.0444736,     116471,          0
$$ Real data points
##PAGE= N=1
##DATA TABLE= (X++(R..R)), XYDATA
$$ [...]
$$ plain form
1854 668 -810 -160 1100 88 -139 565 -87 -172 921 516 -480 327 408 -102 616 641 -421 105 1141
1873 1141 209 -220 616 -373 -442 919 303 -704 -89 338 -380 232 346 -684 -180 385 -216 -436 243
1892 243 -353 -209 332 166 -767 75 57 -363 154 60 -632 -469 265 -409 -187 -12 -748 -405 385 -210 -927
1913 -927 21 188 -438 39 -115 -630 -230 392 -224 -358 218 -627 -137 672 1 -604 269 171 -252 274
1933 274 198 -277 -67 306 113 185 261 0 73 346 -5 50 53 270 -95 331 149 -77 -27 569 -53 -45 408
1956 408 -33 186 523 283 -26 412 172 117 -48 100 -41 316 363 -216 173 327 12 -178 235 -70 -68
1977 -68 222 -74 38 181 82 -263 90 -5 -262 -22 114 -322 -27 -15 -6 -177 -415 -16 -75 -139 -213 -122 107
2000 107 -229 -400 93 -111 -273 29 -260 -291 57 149 -206 86 -79 -132 -105 -77 36 268 -38 299 -79 46
$$ packed form
1854F68j478O50J260j012k27P04o52q5J093m05r96Q07Q1n10P18K5j062N26J036
1873A141r32m29Q36r89o9J361o16j007O15M27p18O12J14j030N04N65o01k20O79
1892B43n96J44N41j66r33Q42j8m20N17r4o92J63P34o74K22J75p36L43P90n95p17
1913i27R48J67o26M77j54n15M00O22o16j34N76q45M90Q09o71o05Q73r8m23N26
1933B74p6m75K10L73j93P2P6k61P3K73l51N5LK17l65M26j82k26N0N96o22QM53
1956D08m41K19L37k40l09M38k40n5j65J48j41L57M7n79L89J54l15j90M13l05K
1977f8K90k96J12J43r9l45L53r5k57K40J36m36K95J2Rj71k38L99n9o4p4R1K29
2000A07l36j71M93k04j62L02k89l1L48R2l55K92j65n3K7K8J13K32l06L37l78J25
$$ plain form
2022 46 44 -88 134 113 -70 61 10 -17 -55 29 269 162 198 167 -62 74 210 445 295 144 360 153 302
2045 302 123 35 276 137 234 387 200 96 247 309 -248 187 -25 5 185 -7 208 -87 -59 59 -139 -253
2067 -253 -8 31 -136 -207 -148 -243 20 -64 -150 -33 -194 -438 -126 -22 -288 -44 -86 -137 220 135 -166 -209 -169 -107
2091 -107 -314 79 -84 -175 -302 -80 -374 -132 63 -178 62 12 13 13 -206 50 11 159 -174 -229 -106 170 94
2114 94 82 -58 -10 -123 225 124 498 98 133 103 131 57 217 180 530 291 342 491 -141 136 193 172 -103 203
2138 203 309 109 328 366 -251 243 197 -5 392 163 -102 127 233 5 110 156 -301 -234 164 53 8 -254
2160 -254 82 -369 -13 106 93 -138 -92 -21 13 17 -289 -167 -106 -170 -514 -70 128 -365 -436 32 -443 -73 -82 -249
2184 -249 36 3 -291 -362 1 208 -411 70 4 -16 287 196 -232 -82 507 -175 64 209 -204 -141 306 150
$$ packed form
2022D6kj32K22k1j83J31n1k7l8Q4K40j07L6l1k29J36J36K35j50j51K16k07J49
2045C02j79q8K41j39R7J53j87j04J51O2n57M35k12L0J80j92K15k95K8J18j98j14
2067b53K45L9j67p1N9r5K63q4q6J17j61k44L12J04k66K44m2n1L57q5l01m3M0O2
2091a07k07L93j63r1j27K22k94K42J95k41K40n0J%k19K56l9J48l33n5J23K76p6
2114I4j2j40M8j13L48j01L74m00L5l0K8p4J60l7L50k39N1J49o32K77N7k1k75L06
2138B03J06k00K19L8o17M94m6k02L97k29k65K29J06k28J05M6m57O7L98j11m5k62
2160b54L36m51L56J19j3k31M6P1L4Ml06J22O1o4l44M44J98m93p1M68m75L70rj67
2184b49K85l3k94p1L63K07o19M81o6k0L03r1m28J50N89o82K39J45m13O3M47j56
$$ plain form
2206 150 -205 160 253 -23 336 531 -401 -153 432 -78 -24 284 -45 -299 375 309 70 370 395 -204 -84
2227 -84 40 -137 49 514 78 -130 331 82 116 585 42 -474 260 338 -392 215 -34 -510 123 518 -279
2248 -279 -507 -159 -126 -229 518 -115 -778 -224 36 -223 77 -100 -807 -53 394 -199 -592 262 -535 -350
2268 -350 383 -303 -713 -235 254 -379 -67 -138 -698 -43 263 -512 -184 325 -271 -150 296 -259 -589 206
2288 206 340 -222 266 67 -607 396 594 -431 -421 163 -57 240 665 -443 -558 336 669 -70 251
2307 251 268 -565 676 961 -19 -136 79 -428 204 584 -159 -531 384 300 -67 39 -67 -473 147 575
2327 575 -287 -4 198 -173 -81 575 -425 -587 558 384 -691 -89 -202 -806 442 591 -426 -582 284
2346 284 -38 40 427 -406 -729 607 221 -293 83 -304 -688 351 204 -651 -581 125 -252 27 192 -257
$$ packed form
2206A50l55L65R3k76L59J95r32K48N85n10N4L08l29k54O74o6k39L00K5n99J20
2227h4J24j77J86M65m36k08M61k49L4M69n43n16P34P8p30O07k49m76O33L95p97
2248b79k28L48L3j03P47o33o63N54K60k59L00j77p07P54M47n93l93Q54p97J85
2268c50P33o86m10M78M89o33L12p1n60O55L06p75L28N09n96J21M46n55l30P95
2288B06J34n62M88j99o74J003J98j025J0N84k20K97M25j108j15Q94L33p39L21
2307B51J7q33J241K85r80j17K15n07O32L80p43l72R15q4l67J06j06m06O20M28
2327E75q62K83K02l71R2O56j000j62J145j74j075O02j13o04J248J49j017j56Q66
2346B84l22P8L87q33l23J336l86n14L76l87l84J039j47q55P0P06l77K79J65m49
$$ plain form
2366 -257 -621 474 372 -312 -89 -46 -391 334 250 -470 -359 365 -139 -105 404 -283 -354 399 384 -367 71
2387 71 122 -385 321 340 -190 -104 409 181 -21 540 -34 -185 502 448 -502 110 430 -369 451 559 -248 50
2409 50 471 118 319 364 -227 -297 456 651 -377 -75 47 -337 146 589 -424 -342 590 -7 -211 160 -153
2430 -153 -165 375 362 -571 30 -150 -399 150 248 -527 -253 187 63 -61 36 -343 -329 206 -88 -277 75 14
2452 14 -173 283 -69 -359 -97 292 -217 -254 45 -253 -113 124 -3 -104 283 198 -307 269 151 -286 -172
2473 -172 355 8 -81 215 -42 35 366 78 11 397 97 136 506 187 -442 225 324 294 12 156 2 146
2495 146 547 109 -105 225 299 -278 404 37 -181 26 361 239 279 -23 44 -69 -87 17 -55 98 26 -63
2517 -63 21 -54 -278 55 -124 -220 24 153 -129 -33 29 -87 56 -26 -76 9 123 -26 -386 29 -103 -39 -104 -258
$$ packed form
2366b57l64J095j02o84K23M3l45P25q4p20J11P24n04L4N09o87p1P53j5p51M38
2387G1N1n07P06J9n30Q6N13k28k02N61n74j51O87n4r50O12L20p99Q20J08q07K98
2409E0M21l53K01M5n91p0P53J95j028L02J22l84M83M43j013Q2R32n97k04L71l13
2430a53j2N40j3r33O01j80k49N49R8p75K74M40j24j24R7l79J4N35k94j89L52o1
2452A4j87M56l52k90K62L89n09l7K99k98J40K37j27j01L87q5n05N76j18m37J14
2473a72N27l47q9K96k57P7L31k88o7L86l00L9L70l19o29O67R9l0k82J44j54J44
2495A46M01m38k14L30P4n77O82l67k18K07L35j22M0l02O7j13j8J04p2J53p2q9
2517f3Q4p5k24L33j79r6K44J29k82R6O2j16J43q2n0Q5J14j49l60M15j32O4o5j54
$$ plain form
2541 -258 -337 32 251 -141 -192 -173 -168 -270 -248 106 -4 -182 5 2 31 111 74 -73 181 -254 -190 84 46 -65
2565 -65 68 -126 -84 247 34 -295 156 172 72 184 -140 253 165 -81 -15 -36 248 -36 10 130 320 168
2587 168 -181 111 -128 205 302 -56 67 198 81 -191 -54 -38 141 118 90 -68 -48 207 60 137 -128 -32
2609 -32 -75 -33 -14 -173 -143 -25 -129 158 -179 -85 -273 -390 -170 -158 -331 -267 -138 -186 -333 -132 -357 -119 -315
2632 -315 -125 -60 7 111 -60 -78 136 96 -130 2 -98 152 -153 185 76 -55 -107 74 -159 22 283 -225
2654 -225 -113 -158 45 105 127 149 58 -100 -116 146 -116 57 167 12 48 257 270 -27 -20 93 213 26 95 -57
2678 -57 117 24 263 31 187 95 -44 111 -74 -96 -238 -38 171 99 -120 231 -357 -84 -176 201 -151 -36
2700 -36 253 -272 -81 -148 -214 75 25 164 91 -206 -239 -352 -164 80 -236 173 109 -189 -8 10 -99 122 0
$$ packed form
2541b58p9L69K19l92n1J9Nj02K2L54j10j78J87lK9Q0l7j47K54m35O4K74l8j11
2565f5J33j94M2L31k13l29M51J6j00J12l24L93q8k46O6k1K84k84M6J20J90j52
2587A68l49K92k39L33R7l58J23J31j17k72J37J6J79k3k8j58K0K55j47P7k65R6
2609c2m3M2J9j59L0J18j04K87l37R4j88j17K20J2j73O4J29m8j47K01k25K38j96
2632c15J90O5O7J04j71j8K14m0k26J32j00K50l05L38j09j31n2J81k33J81K61n08
2654b25J12m5K03O0K2K2r1j58j6K62k62J73J10j55L6K09J3k97PJ13J20j87O9j52
2678e7J74r3K39k32J56r2j39J55j85k2j42K00K09p2k19L51n88K73r2L77l52J15
2700c6K89n25J91o7o6K89n0J39p3k97l3j13J88K44l16M09o4k98J81J8j09K21j22
$$ plain form
2723 0 -70 -100 79 -193 45 251 62 14 47 -22 7 143 19 -22 -54 44 -66 358 -227 213 73 -102 244 -145
2747 -145 87 219 19 -48 -8 4 -21 135 -92 116 138 179 -135 -59 165 9 176 164 -89 190 82 -218 5
2770 5 148 -89 -67 622 171 -97 134 190 -100 241 334 -88 -60 -24 -140 -237 224 -60 98 16 196 -463 206
2793 206 -123 -413 -37 41 -379 -55 184 -229 -368 153 -199 -267 296 -163 -560 210 -88 -246 257 127 -427
2814 -427 -74 262 -141 -60 65 -235 -433 227 -15 -228 196 -281 -93 329 231 -337 29 260 -125 -283 432
2835 432 -17 73 405 106 -440 159 64 -127 189 175 -269 215 483 120 -67 -138 29 -4 264 117 -157 101
2857 101 433 -185 113 265 -628 131 312 187 -456 -71 -199 -95 233 -39 -274 134 211 23 76 38 -329
2878 -329 -165 82 98 -48 117 95 -285 459 80 -548 127 176 -301 -46 -102 -142 70 260 -148 -410 29 -249
$$ packed form
2723@p0l0J79k72K38K06j89m8L3o9K9J36j24m1l2R8j10M24n85M40j40j75L46l89
2747a45K32J32k00o7M0J2k5J56k27K08K2M1l14P6K24j56J67j2k53K79j08l00K23
2770EJ43k37K2O89m51k68K31N6k90L41R3m22K8L6j16r7M61k84J58q2J80o59O69
2793B06l29k90L76P8m20L24K39m13j39N21l52o8N63m59l97P70k98j58N03j30n54
2814d27L53L36m03Q1J25l00j98O60k42k13M24m77J88M22r8n68L66K31l85j58P15
2835D32m49R0L32k99n46N99r5j91L16j4m44M84K68l63j87p1J67l3K68j47k74K58
2857A01L32o18K98J52q93P59J81j25o43L85j28J04L28k72k35M08P7j88N3l8l67
2878c29J64K47J6j46J65k2l80P44l79o28O75M9m77K55n6m0K12J90m08k62M39k78
$$ plain form
2900 -249 -260 139 -195 -539 70 -138 -389 -78 2 -206 119 174 -66 -161 -7 -19 125 177 -14 -399 2 179
2922 179 -25 24 1 -283 140 274 -63 -10 118 28 140 260 91 -362 381 148 78 80 270 -257 486 531 -62
2945 -62 11 116 208 268 122 -18 -93 166 418 93 119 -196 -74 133 -42 -220 -114 347 -357 6 380 -5
2967 -5 -86 -4 101 -331 266 -7 -388 389 67 -373 -327 119 -110 -107 105 -144 -322 68 48 -59 168 -56 -321
2990 -321 184 115 -476 -95 -224 -230 27 46 -217 -404 186 26 145 -110 -143 -101 143 538 -179 -36 77 27
3012 27 -72 272 11 -345 451 272 -256 304 -91 -128 240 273 -149 -34 177 35 -67 116 -203 -92 271
3033 271 191 -385 368 0 -117 74 131 -85 -164 200 150 -195 -162 -68 -266 123 77 -142 274 -124 -136 198 93
3056 93 1 87 413 88 -15 -54 -254 -81 80 -17 31 -145 -122 -152 -93 22 17 -37 0 -316 20 150 -290 -151
$$ packed form
2900b49j1L99l34l44O09k08k51L11Q0k08L25N5k40r5J54j2J44N2j91l85M01J77
2922A79k04M9k3k84M23J34l37N3J28r0J12J20j69m53P43k33p0KJ90n27P43M5n93
2945f2P3J05R2O0j46j40p5K59K52l25K6l15J22K07j75j78J06M61p04L63L74l85
2967eq1Q2J05m32N97k73l81P77l22m40M6M46k29LK12k49j78L90k0j07K27k24k65
2990c21N05o9n91L81j29oK57J9k63j87N90j60J19k55l3M2K44L95p17J43J13n0
3012B7r9L44k61l56P96j79n28N60l95l7L68L3m22J15K11j42j02J83l19J11L63
3033B71q0n76P53l68j17J91N7k16p9L64n0l45L3R4j98L89m6k19M16l98j2L34j05
3056I3r2Q6L26l25j03l9k00J73J61r7M8j76K3l0N9J15nn4L7l16L36J30m40J39
$$ plain form
3080 -151 164 -65 -325 -63 18 -39 -53 -226 -113 10 109 168 122 95 10 133 114 -64 -347 -126 -51 -254 514
3103 514 -20 -109 -86 144 56 76 115 84 132 229 161 20 -151 -293 174 132 316 73 -77 79 -53 -33 342 -120
3127 -120 197 49 -120 -206 93 129 -90 179 7 -72 -198 285 179 147 -129 -127 -172 -41 -13 -70 -141 -102 58 77
3151 77 -161 16 -159 111 212 -7 187 19 -188 23 -142 -180 -217 218 100 -9 -143 -174 -11 112 -246
3172 -246 -68 -46 132 -9 69 276 -15 283 -194 -95 -240 23 -105 93 -146 -30 -178 147 -206 303 -212
3193 -212 -30 -5 94 167 -179 -57 -183 132 -224 66 131 46 -100 359 260 138 363 108 46 239 40 -79
3215 -79 -23 63 95 40 5 -111 272 54 -216 -106 43 261 -68 -59 78 -97 -52 21 340 -108 70 -129 -124 -7
3239 -7 22 -48 -88 -280 2 89 -70 87 158 71 -36 -272 -16 -261 6 220 9 -310 -68 -21 -293 12 -172
$$ packed form
3080a51L15k29k60K62Q1n7j4j73J13J23R9N9m6k7q5J23j9j78k83K21P5k03P68
3103E14n34q9K3K30q8K0L9l1M8R7o8j41j71j42M67m2J84k43j50J56j32K0L75m62
3127a20L17j48j69q6K99L6k19K69j72p9j26M83j06l2k76Km5J31K8n7p1L9J60J9
3151G7k38J77j75K70J01k19J94j68k07K11j65l8l7M35j18j09j34l1J63J23l58
3172b46J78K2J78j41P8K07k91K98m77R9j45K63j28J98k39J16j48L25l53N09n15
3193b12J82K5R9P3l46J22j26L15l56K90O5q5j46M59r9j22K25k55o2J93j99j19
3215g9N6Q6L2n5l5j16L83k18k70J10J49K18l29RJ37j75M5P3L19m48J78j99NJ17
3239gK9p0m0j92K82Q7j59J57P1q7j07k36K56k45K67K14k11l19K42M7k72L05j84
$$ plain form
3262 -172 -86 -81 136 -42 -119 67 -55 -18 79 5 21 2 -242 26 23 -74 90 -84 -51 21 -38 34 -59 -45 48 -35 -211
3289 -211 -104 -50 365 307 -228 19 55 -249 -9 -118 79 277 -41 186 -3 199 229 218 47 148 -43 43
3311 43 29 -156 276 55 -156 -46 -98 63 -198 -67 -214 97 -61 -81 168 141 -24 315 17 -145 -7 -60
3333 -60 102 154 -23 84 -15 133 -482 -112 -306 -248 32 38 31 -20 -22 -24 112 -45 76 -121 -64 59 173 -48 145
3358 145 -86 279 -108 -11 13 227 280 36 -146 109 94 -25 110 30 -340 -342 3 51 23 156 63 45 253 -39
3382 -39 -65 -100 170 -26 97 26 60 142 -29 34 -144 65 -265 33 465 -61 195 120 253 6 284 131 -382
3405 -382 -162 -159 243 181 -103 -44 -197 -88 77 -111 223 103 155 24 -45 -287 28 245 28 -142 247 18
3427 18 -141 198 -20 -290 78 3 -334 51 -301 -341 70 61 -107 -157 57 -232 106 181 -16 -255 116 253
$$ packed form
3262a72Q6NK17j78p7J86j22L7R7p4J6j9k44K68lr7J64j74L3P2n9P2r3J4R3q3j76
3289b11J07N4M15n8n35K47L6l04K40j09J97J98l18K27j89K02L0j1j71J01j91Q6
3311D3j4j85M32k21k11J10n2J61k61J31j47L11j58k0K49k7j65L39k98j62J38n3
3333f0J62N2j77J07r9J48o15L70j94N8K80Opn1kkJ36j57J21j97N7J23J14k21J93
3358A45k31L65l87R7K4K14N3k44j82K55j5j19J35q0l70kL45M8k8J33r3j8K08k92
3382c9k6l5K70j96J23p1L4Q2j71O3j78K09l30K98M32n26K56p5J33k47K78j53n13
3405c82K20LM02o2k84N9j53J09J65j88L34j20N2j31o9k42L15K17k17j70L89k29
3427A8j59L39k18k70L68p5l37L85l52m0M11rj68n0K14k89L38P5j97k39L71J37
$$ plain form
3449 253 -257 -308 -180 -205 -140 363 149 -163 47 -131 -192 20 -35 -9 53 244 -21 201 -44 -134 -142 -131 -98 -202
3473 -202 301 -47 -124 216 81 31 -104 457 87 -33 197 137 -5 634 -149 -297 86 72 -14 -237 259 -214
3495 -214 -65 324 -16 -257 102 -430 110 478 294 -339 42 159 28 334 156 -296 -63 96 -106 -293
3515 -293 -159 25 -240 127 167 -109 102 184 -14 -127 84 -225 6 257 -332 -140 -158 -149 -144 141 -2 -179
3537 -179 43 154 -83 -28 -84 -349 56 50 -233 -85 -122 10 45 15 -124 -167 -160 141 123 90 -7 -56 -27 287 -49
3562 -49 -79 176 -260 -65 103 4 12 -24 37 -160 -81 -58 -45 -150 281 -211 -170 124 -38 -111 89 125 -116 -279
3586 -279 13 33 22 81 -36 31 223 -7 -157 18 -2 137 86 -75 -20 81 -106 131 -103 -133 205 200 -119
3609 -119 -291 130 345 10 -37 28 -30 -74 124 132 1 54 -18 39 -165 -211 -167 44 179 -329 -31 23 -132 -128 -111
$$ packed form
3449B53n10n1J28k5O5N03k14l12K10j78o1K12n5K6O2J91k65K22k45r0qJ1L3j04
3473b02N03l48p7L40j35n0j35N61l70j20K30o0j42O39p83j48L83j4q6k23M96m73
3495b14J49L89l40k41L59n32N40L68j84o33L81J17j31L06j78m52K33J59k02j87
3515b93J34J84k65L67M0k76K11Q2j98j13K11l09K31K51n89J92j8RNK85j43j77
3537a79K22J11k37N5n6k65M05ok83J48l7J32L5l0j39m3PL01j8l3r7m9K9L14l36
3562d9l0K55m36J95J68r9Ql6O1j97P9K3J3j05M31m92M1K94j62p3K00L6k41j63
3586b79K92K0j1N9j17O7J92k30j50J75k0J39n1j61N5J01j87K37k34l0L38nl19
3609a19j72M21K15l35m7O5n8m4J98Qj31N3p2N7k04m6M4K11J35n08K98N4j55MJ7
$$ plain form
3634 -111 -118 102 -237 -209 127 -107 -152 -170 -248 65 19 -64 67 8 106 244 75 116 -75 57 95 125 66 -227 320
3659 320 -129 200 289 214 -270 18 11 325 51 150 -134 226 -8 203 -85 -149 -140 -47 86 92 242 259 -23 17
3683 17 129 253 -19 -185 -9 95 -194 -186 -113 -80 89 51 323 -27 -111 80 -272 21 122 89 58 117 -221
3706 -221 13 -71 -180 72 -253 -121 103 83 -140 178 -178 -172 75 240 -92 -31 -20 -214 -145 -19 -145 9
3728 9 -169 78 -169 -104 -29 281 -215 -264 86 49 11 -110 -29 -38 6 194 54 -44 84 -39 44 402 308 -55 135
3753 135 -20 53 -294 48 125 209 36 -428 -118 140 -199 -19 -2 207 45 299 -63 -89 -17 -125 -27 -54 81
3776 81 17 -99 -226 -106 -346 -368 -62 74 102 157 -284 -134 85 -116 -222 -28 182 30 122 191 143 37 -163
3799 -163 -167 -143 -107 85 -51 6 134 -151 -130 -20 -28 -210 296 -130 93 -213 -88 -8 53 -87 -41 -85 -56 12 106
$$ packed form
3634a11pK20l39K8L36k34m5j8p8L13m6q3J31n9R8J38j69M1j91J32L8L0n9k93N47
3659C20m49L29Q9p5m84K88pL14k74R9k84L60k34K11k88o4RR3J33OJ50J7k82M0
3683A7J12J24k72j66J76J04k89QP3L3J69l8K72l50q4J91l52K93J01l3l1N9l38
3706b21K34q4j09K52l25J32K24k0k23L18l56OK47J65l32O1J1j94O9J26j26J54
3728Ij78K47k47O5P5L10m96m9L50l7l8j21Q1rM4J88j40r8J28j23Q3L58r4l63J90
3753A35j55P3l47L42P7Q4j73m64L10K58l39J80J7K09j62K54l62k6P2j08R8k7J35
3776H1o4j16j27J20k40k2L06J36K8N5m41J50K19k01j06J94K10j52R2O9m8j06k00
3799a63mK4L6J92j36N7J28k85K1J10qj82N06m26K23l06J25Q0O1j40M6m4K9O8R4
$$ plain form
3824 106 201 -87 -141 -96 127 -116 -207 -326 104 16 -124 272 -20 -53 -115 96 -38 185 130 -68 -27 91 280
3847 280 -38 -44 -38 37 -172 -87 -59 147 102 123 -47 40 50 240 -74 47 160 109 123 30 123 41 -91 57 88 4
3873 4 282 94 -132 101 -73 -85 63 14 -205 -265 42 32 137 -19 -98 -164 -10 -29 -174 -3 -292 -73 60
3896 60 -79 -61 -25 -181 94 -75 -98 -85 134 146 144 59 -20 -270 -121 102 -184 -29 205 -292 122 73 -18 -56
3920 -56 168 82 -98 49 57 220 288 -163 -12 120 46 88 -159 35 -66 -191 54 180 311 -38 -60 -81 -46
3943 -46 32 131 -202 -131 114 103 26 30 80 15 -56 255 211 -128 126 -163 -82 219 -58 24 297 182 35 91 81
3968 81 -166 89 99 -242 -54 -178 -124 45 15 -166 -14 -102 -417 44 -10 -21 -59 -363 70 308 195 71 -171
3991 -171 70 99 256 37 -139 53 -227 26 -146 -282 39 -7 158 -135 -111 -104 62 287 -339 -145 23 127
$$ packed form
3824A06R5k88n4M5K23k43r1j19M30q8j40L96k92l3o2K11j34K23n5j98M1J18J89
3847B80l18oOP5k09Q5K8K06m5K1j70Q7J0J90l14J21J13n1J4r3R3q2j32J48L1q4
3873DK78j88k26K33j74j2J48m9k19o0L07j0J05j56p9o6J54j9j45J71k89K19J33
3896F0j39J8L6j56K75j69k3J3K19J2kq5p9k50J49K23k86J55K34m97M14m9r1l8
3920e6K24q6j80J47QJ63O8m51J51J32p4M2k47J94j01j25K45J26J31l49k2k1L5
3943d6P8R9l33P1K45j1p7MN0o5p1L11m4l39K54k89Q1L01k77Q2K73j15j47N6j0
3968H1k47K55J0l41J88j24N4J69l0j81J52q8l15M61n4j1l8l04M33K38j13j24k42
3991a71K41K9J57k19j76J92k80K53j72j36L21m6J65k93K4PJ66K25o26J94J68J04
$$ plain form
4013 127 -40 109 55 -199 -90 30 209 139 57 43 61 72 -62 179 -72 70 -118 65 -151 -38 -3 -77 -235
4036 -235 -86 49 27 222 314 -41 -229 -89 7 146 64 -30 34 -175 193 -153 -108 21 141 312 -177 -186 89
4059 89 -24 66 -24 136 72 -48 197 -234 -328 63 -43 53 160 -32 -158 -241 -33 -87 86 -116 43 -17 -2
4082 -2 95 21 -130 -41 89 165 -105 -191 89 98 109 -26 5 175 125 385 -79 -74 3 -197 54 134 -48 -44 103 -200
4108 -200 66 64 215 -45 113 -198 34 -60 28 19 -23 100 120 -75 298 79 -108 -165 -53 -47 119 251 -154 -97
4132 -97 339 -88 394 68 34 -45 -58 102 -28 128 85 7 -194 -193 -277 22 122 -86 -490 -26 11 -156 85
4155 85 -107 -117 -7 69 -68 0 -10 18 83 -89 131 -225 -6 -39 -34 -17 373 38 -120 68 62 21 56 -75 -87
4180 -87 -243 -339 125 128 56 -61 311 139 -97 -103 -48 -142 176 -80 150 -32 170 84 -108 41 -178 173 -40
$$ packed form
4013A27j67J49n4k54J09J20J79p0q2j4J8J1j34K41k51J42j88J83k16J13L5p4j58
4036b35J49J35k2J95R2l55j88J40R6J39q2r4O4k09L68l46M5J29J20J71m89rK75
4059H9j13R0r0J60o4j20K45m31r4L91j06R6J07j92j26q3K08n4J73k02J59o0J5
4082bR7p4j51Q9J30P6k70q6K80RJ1j35L1J70n0K60m64NP7k00K51Q0j82MJ47l03
4108b00K66kJ51k60J58l11K32r4Q8rm2J23K0j95L73k19j87n7J12OJ66J32m05N7
4132i7M36m27M82l26l4p9j3J60j30J56m3p8k01Jq4K99J00k08m04M64L7j67K41
4155H5j92j0J10P6j37O8j0K8O5j72K20l56K19l3NJ7L90l35j58J88om1L5j31j2
4180h7j56r6M64Lp2j17L72j72k36oN5r4L18k56K30j82K02q6j92J49k19L51k13
$$ plain form
4203 -40 -277 297 -103 108 105 -115 -32 52 -45 15 -210 103 228 105 -123 -81 -29 -335 -133 10 20 -126 -122 -101
4227 -101 -44 -149 -119 284 9 -112 138 43 -78 139 -102 4 37 -130 -179 -46 -46 -62 -177 -138 44 41 163 53
4251 53 141 -15 -202 -138 143 -186 -76 166 54 -9 -24 135 15 121 -158 -358 20 -180 -39 221 38 -131
4273 -131 144 -85 -346 28 -82 -183 -361 -96 58 -13 -14 -141 117 -31 -97 74 338 98 281 83 140 118
4295 118 322 165 150 -107 354 50 79 -2 -153 215 222 -246 -168 -91 -69 -231 231 -299 -201 -135 188 75 118 -26
4319 -26 -74 -26 50 -74 161 157 -242 78 -69 -7 -80 112 34 134 50 65 8 211 -80 -142 66 136 251 -9 -21
4344 -21 -13 -156 70 -22 -19 -58 -216 -139 -54 184 -66 -216 -124 -23 -90 56 -51 -62 133 268 87 225 205 -146
4368 -146 -64 -50 164 -72 295 -177 -50 159 124 30 19 -42 147 264 -161 -20 65 -239 -105 -22 16 -203 26
$$ packed form
4203d0k37N74m00K11lk20Q3Q4r7O0k25L13J25j23k28M2N2l06K02J43J0j46MK1
4227a01N7j05L0M03k75j21K50r5j21K17k41J06L3j67m9J33%j6j15L9J82lJ22j10
4251E3Q8j56j87O4K81l29J10K42j12o3j5J59j20J06k79k00L78k00J41K60j83j69
4273a31K75k29k61L74j10j01j78K65J54p1jj27K58j48o6J71K64k40J83j98N7k2
4295A18K04j57j5k57M61l04K9q1j51L68Pm68P8P7K2j62M62n30R8O6L23j13M3j44
4319b6m8M8P6j24K35ml99L20j47O2p3J92p8J00q4J5n7K03k91o2K08P0J15k60j2
4344b1Qj43K26r2Ll9j58P7Q5K38k50j50R2J01o7J46j07j1J95J35j81J38k0l51
4368a46Q2J4K14k36L67m72J27K09l5r4j1o1J89J17m25J41Q5l04J34Q3L8k19K29
$$ plain form
4391 26 43 -100 -50 -45 -34 78 -132 -150 181 129 48 7 150 -63 61 127 2 -26 185 -128 193 -120 141 -40
4415 -40 159 115 68 92 -92 -203 -15 -283 100 136 -277 -122 25 -234 -91 -96 -235 130 -169 120 64 291 7
4438 7 -44 26 -232 -88 -144 -20 -113 393 -6 186 308 -190 -243 -296 -346 -18 -130 39 40 244 126 74 229 108
4462 108 184 134 -76 185 162 52 104 -410 233 -123 66 282 42 -191 -164 165 173 16 -15 -106 138 -150 -95
4485 -95 63 29 -54 350 47 -135 -84 -174 42 89 -162 70 -181 276 85 -37 -193 -142 181 -13 243 -71
4507 -71 -144 -168 -63 111 -36 -187 27 -127 196 27 40 -49 1 258 -217 -117 8 152 -66 -111 67 0 265
4530 265 27 19 113 -249 235 -52 -32 -222 -169 116 -85 121 41 96 224 -300 -250 265 155 -175 223 227 216 145
4554 145 181 116 8 39 -71 -6 -186 23 153 -166 -227 18 30 110 174 -75 244 31 -166 -114 -316 44 -36
$$ packed form
4391B6J7j43N0NJ1J12k10j8L31n2q1m1J43k13J24O6j25k8K11l13L21l13K61j81
4415d0J99m4m7K4j84j11J88k68L83L6m13J55J47k59J43nj39L65k99K89n6K27k84
4438Gn1P0k58J44n6J24r3N06l99J92J22m98n3n3n0L28j12J69JK04j18n2J55j21
4462A08P6n0k10K61k3j10N2n14O43l56J89K16k40k33K7L29Qj57l1r1K44k88N5
4485i5J58l4q3M04l03j82N1r0K16M7k51K32k51M57j91j22j56N1L23j94K56l14
4507g1p3k4J05J74j47j51K14j54L23j69J3q9N0K57m75J00J25J44k18m5J78o7K65
4530B65k38qR4l62M84k87K0j90N3K85k01K06q0N5J28n24N0N15j10l30L98Mj1p1
4554A45L6o5j08L1j10O5j80K09J30l19o1K45J2Q0O4k49L19k13j97N2k02L60q0
$$ plain form
4577 -36 287 -36 190 -1 -59 -6 -39 -165 -173 327 209 135 48 108 397 14 -96 -101 -19 -55 -148 4 -207 44 37
4602 37 168 16 3 21 90 -156 -61 65 99 9 82 -75 -18 228 158 76 -41 -282 -157 -60 74 -42 120 198
4626 198 -149 -302 -78 -144 99 294 68 23 -7 -102 50 18 118 -30 -187 -180 148 -89 78 170 180 52 -83
4649 -83 -71 133 -71 1 143 -293 -15 9 -180 -68 54 -114 172 76 137 67 -156 -30 -178 60 -128 -8
4671 -8 130 -63 275 15 63 -71 -111 -144 93 -45 116 223 34 -13 14 104 129 84 90 -242 -174 -19 -96 -194 4
4696 4 -13 37 436 -162 276 64 200 -173 -57 68 -237 190 166 -284 178 369 -354 183 152 -30 -64 267
4718 267 -128 -51 -55 -213 -192 120 -100 -207 -41 85 -200 281 283 -25 -140 -151 -230 20 87 -39 -122 73 20 -10
4742 -10 158 33 -53 -99 60 14 -196 -61 139 150 226 31 -52 300 2 -139 -203 68 -42 174 62 170 -149
$$ packed form
4577c6L23l23K26j91n8N3l3j26qN00j18p4q7O0K89l83j10nQ2l6r3J52k11K51p
4602C7J31j52j3J8O9k46R5J26L4r0P3j57N7K46p0q2j17k41J25R7J34j16J62P8
4626A98l47j53K24o6K43J95k26m5l0r5J52l2J00j48j57PL28k37J67R2J0j28j35
4649h3J2K04k04P2J42m36K78K4j89J12J22j68K86r6O1p0k23J26j48K38j88J20
4671hJ38j93L38k60M8j34m0l3K37j38J61J07j89m7K7R0K5m5Ol32O8J55p7r8J98
4696Dj7N0L99n98M38k12J36l73J16J25l05M27k4m50M62J91p23N37l1j82l4L31
4718B67l95P7mj58K1L12k20j07J66J26k85M81Kl08j15j1p9K50O7j26q3J95n3l0
4742a0J68j25q6m6J59m6k10J35K00J1P6j95q3L52k98j41o4K71j10K16j12J08l19
$$ plain form
4765 -149 -60 -161 -68 1 58 -304 188 -40 -79 -30 161 50 110 130 13 355 282 -106 43 -253 -122 9 40
4788 40 207 165 -103 176 227 -334 8 -149 52 -16 64 216 -131 -6 81 62 68 -121 -186 184 -161 -158 28 -88
4812 -88 156 30 9 -112 -134 -69 -31 19 -279 -109 146 -155 -53 51 -319 -40 -98 75 40 39 -2 116 125 -108
4836 -108 99 52 127 -82 -5 -60 199 68 -174 145 177 -171 -97 -13 -71 -21 -99 -41 -189 107 -74 252 -30 -129
4860 -129 -157 143 -121 -94 319 84 145 170 -54 -452 100 90 -76 -109 -41 3 -143 -118 44 -180 268 -26 205
4883 205 317 -84 -313 -8 -176 -124 156 201 -99 -35 68 271 -20 138 169 -149 -143 -74 -195 -49 99 -111
4905 -111 -56 -34 35 406 317 148 69 106 69 -260 -20 -227 -140 159 -61 -110 -69 103 28 -11 -7 -131 440 -47 15
4930 15 -123 -106 267 -79 -15 68 -8 -96 -75 80 77 115 51 0 139 56 128 -26 -36 -82 -57 -156 -22 -20 -78 24 -79
$$ packed form
4765a49Q9j01R3O9N7l62M92k28l9M9J91j11O0K0j17L42p3l88J49k96J31J31L1
4788D0J67m2k68K79N1n61L42j57K01o8Q0J52l47J25Q7j9Oj89o5L70l45LJ86j16
4812h8K44j26k1j21k2O5L8N0k98J70K55l01J02J04l70K79n8J73l5jm1J18Rk33
4836a08K07m7P5k09P7n5K59j31k42L19L2l48P4Q4n8N0p8N8j48K96j81L26k82r9
4860a29k8L00k64K7M13k35O1K5k24l98N52j0j66l3O8M4j46K5J62k24M48k94K31
4883B05J12m01k29L05j68N2K80M5l00O4J03K03k91J58L1l18OO9j21J46J48k10
4905a11N5K2O9L71q9j69p9L7l7l29K40k07Q7K99k20m9M1J72p5l9Mj24N71m87O2
4930A5j38J7L73l46O4Q3p6q8K1J55lL8o4n1J39q3P2j54j0m6K5r9J34Kn8J02j03
$$ plain form
4957 -79 -176 -19 -6 -128 -42 -130 254 -16 63 -81 64 -172 -144 45 214 60 201 108 -43 -194 -108 61 -57
4980 -57 23 110 69 116 -172 58 -141 210 -100 21 -90 118 -91 -169 -286 -18 99 -212 -40 -156 -88 -192
5002 -192 -92 94 113 -88 158 31 -196 164 -61 162 -58 -92 175 139 42 101 -210 202 -126 -193 -178 6
5024 6 66 57 26 -95 -9 -19 290 39 102 -214 -183 -154 -20 -84 -20 81 -52 42 -245 -152 54 -123 -97 -110 -315 -6
5050 -6 25 -231 -49 261 -43 -96 -4 314 100 76 -142 113 15 -174 92 -83 93 170 -184 374 -35 142 73
5073 73 -41 29 59 -122 0 111 -51 -25 -161 16 171 128 -75 -57 -118 180 161 -38 -30 -139 -70 -153 16 -234
5097 -234 14 7 162 166 102 161 -50 69 56 -50 22 -98 58 -259 209 281 -21 174 -48 -7 136 25 38 -188
5121 -188 69 17 -83 342 -129 519 -9 82 111 38 133 294 -90 -140 -79 72 120 107 161 -15 20 -128 160 168
$$ packed form
4957g9r7J57J3j22Q6q8L84k70P9j44J45k36K8J89J69j54J41r3j51j51Q6J69j18
4980e7Q0Q7m1M7k88K30j99L51l10J21j11K08k09p8j17K68J17l11J72j16O8j04
5002a92J00J86J9k01K46j27k27L60k25K23k20l4K67l6r7N9l11M12l28o7J5J84
5024FO0rl1j21Q6j0L09k51O3l16L1K9J34o4O4J01j33R4k87R3K06j77K6j3k05L09
5050fL1k56J82L10l04n3R2L18k14k4k18K55r8j89K66j75J76P7l54N58m09J77o9
5073G3j14P0L0j81J22J11j62K6j36J77J55m3k03J8o1K98j9j99Qj09O9q3J69k50
5097b34K48pJ55Mo4N9k11J19j3j06P2j20J56l17M68P2l02J95k22M1J43j11J3k26
5121a88K57n2j00M25m71O48n28R1K9p3R5J61l84n0O1J51M8j3N4j76L5j48K88Q
$$ plain form
5145 168 -44 167 12 -174 -98 -172 -281 -46 102 2 -105 -62 25 60 -36 -88 -20 251 198 154 179 -255 -44 64
5169 64 8 179 279 -77 128 -26 -206 -68 -23 -127 2 -275 153 -159 60 51 3 -166 -327 -68 -136 -25
5191 -25 122 163 198 -56 -103 -26 -173 -56 -168 -105 195 8 30 -21 -135 -134 72 233 182 223 128 -167 19 235
5215 235 -126 -167 65 -111 190 -192 11 244 16 164 -187 -132 -26 -142 35 182 -194 -20 77 108 -558
5236 -558 -231 -224 140 -38 147 78 198 98 -151 -74 59 -112 26 -73 -213 156 335 80 6 26 142 -180
5258 -180 54 10 -205 -70 -126 39 244 -16 9 22 -127 16 -51 -25 -111 445 45 -142 237 158 -47 36 75
5281 75 9 -138 -44 136 -54 7 173 -66 -79 7 154 -174 -208 116 142 138 -30 23 223 102 -345 -13 65 -53
5305 -53 -223 -177 156 -174 230 87 252 118 -151 16 -56 134 315 66 -175 166 49 247 -16 -293 72
$$ packed form
5145A68k12K11j55j86P6p4j09K35J48j00j07M3Q7L5r6n2O8K71n3m4K5m34K11J08
5169F4n6J71J00l56K05j54j80J38M5j04J29k77M28l12K19rm8j69j61K59o8J11
5191b5J47M1L5k54m7P7j47J17j12O3L00j87K2n1j14JK06J61n1M1r5k95J86K16
5215B35l61m1K32j76L01l82K03K33k28J48l51N5J06j16J77J47l76J74R7L1o66
5236e58L27PL64j78J85o9J20j00k49P7J33j71J38r9j40L69J79k55p4K0J16l22
5258a80K34m4k15J35n6J65K05k60K5J3j49J43o7K6q6N56m00j87L79p9k05Q3L9
5281G5o6j47R4J80j90O1J66k39j3Q6J47l28l4L24K6mj68N3K00j21m47L32P8j18
5305e3j70M6L33l30M04j43J65j34k69J67p2J90J81k49k41L41j17J98k63k77L65
$$ plain form
5326 72 266 -204 63 -394 -241 376 198 95 -134 48 -57 -59 -160 121 -238 -128 138 -40 96 -206 -40
5347 -40 89 243 17 -237 -196 -164 109 -176 -98 156 -152 26 268 2 38 -110 89 121 -85 -79 -10 -110 56
5370 56 132 -116 -49 -187 -7 -239 -64 247 16 -145 -117 130 -193 187 108 -43 -114 -141 -148 -301 100 288 171
5393 171 -16 224 277 -40 36 -68 -27 62 -149 125 -46 -30 7 -35 -148 36 -85 -23 -56 110 0 57 -48
5416 -48 111 -7 -217 -106 -57 56 2 92 372 -1 -241 -100 -1 125 -236 -225 90 15 205 -92 -107 93 -28
5439 -28 -118 -50 -53 238 -93 101 32 345 -90 -44 -112 -78 -213 -51 -97 -209 98 163 200 -45 -202 18 -209 138
5463 138 -111 -141 -182 130 -26 31 79 -137 148 23 67 -177 -107 -100 54 -76 208 86 147 26 21 -181 84 -167
5487 -167 248 168 -95 203 -89 177 -232 440 130 171 -125 38 -237 98 97 -13 -3 103 108 -40 143 102 -84
$$ packed form
5326G2J94m70K67m57J53O17j78j03k29J82j05kj01K81l59J10K66j78J36l02J66
5347d0J29J54k26k54M1L2K73k85P8K54l08J78K42k66L6j48J99L2k06OO9j00J66
5370E6P6k48O7j38J80k32J75L11k31j61K8K47l23L80p9j51p1k7pj53M01J88j17
5393A71j87K40N3l17P6j04M1Q9k11K74j71J6L7m2j13J84j21O2l3J66j10N7j05
5416d8J59j18k10J11M9J13n4R0K80l73k40J41R9J26l61J1L15p5J90k97j5K00j21
5439b8r0O8lK91l31J94o9L13m35M6o8L4j35J62m6j12L07O5L7k45j57K20k27L47
5463A38k49l0m1L12j56N7M8k16K85j25M4k44P0PJ54j30K84j22O1j21nk02K65k51
5487a67M15q0k63K98k92K66m09O72l10M1k96J63k75L35jj10J0J06Nj48J83m1j86
$$ plain form
5510 -84 -112 27 -3 -68 53 -188 -17 -146 -286 -19 238 253 -30 -42 213 -8 -132 -6 -204 -89 -70 89
5532 89 -56 -236 66 156 -213 118 -29 125 39 122 -142 98 -74 -162 170 123 -90 3 68 122 -16 -81 225
5555 225 42 -60 -60 -151 -229 -1 -229 125 -241 98 -31 230 81 -86 147 -58 37 -380 -222 132 40 22
5577 22 82 -131 -135 198 -63 401 101 41 148 -13 -162 157 103 35 210 -163 -171 -75 217 -36 175 77 -159 72
5601 72 -65 -25 115 -279 -30 -147 8 59 31 122 158 -135 -278 -39 276 293 -170 107 -169 -299 -63 -239
5623 -239 -98 -205 -93 155 -73 19 114 226 26 82 -108 -238 -8 -80 -89 21 -60 67 310 27 -7 -6 -154
5646 -154 37 -86 101 -143 119 129 -117 30 -258 -48 -58 -83 84 89 -98 341 -71 225 42 -103 -237 -112
5668 -112 40 -37 71 -128 -167 -104 103 -122 240 29 -7 -273 -166 47 332 -76 75 -133 143 54 -154 29
$$ packed form
5510h4k8J39l0o5J21k41J71j29j40K67K57J5k83j2K55k21j24J26j98J15J9J59
5532H9j45j80L02R0l69L31j47J54q6Q3k64K40j72q8L32m7k13R3O5N4j38o5L06
5555B25j83j02%r1p8K28k28L54l66L39j29K61j49j67K33k05R5m17J58L54r2j8
5577B2O0k13mL33k61M64l00o0J07j61j49L19n4o8J75l73qR6K92k53K11r8k36K31
5601G2j37M0J40l94K49j17J55N1k8R1L6k93j43K39L15J7m63K77k76j30K36j76
5623b39J41j07J12K48k28R2R5J12k00N6j90j30K30p2rJ10q1J27K43k83l4Jj48
5646a54J91j23J87k44K62J0k46J47k88K10j0k5J67Nj87M39m12K96j83j45j34J25
5668a12J52p7J08j99l9O3K07k25L62k11l6k66J07K13K85m08J51k08K76q9k08J83
$$ plain form
5690 29 -25 -38 -95 -169 -5 -58 143 -13 -58 -30 87 91 -183 -318 75 -20 -192 -12 46 -66 143 -79 39 -48
5714 -48 -6 81 125 -243 -143 -331 42 -201 57 -284 -119 84 -369 184 107 186 -117 159 29 -122 1 143
5736 143 -151 -248 -115 183 -227 108 -190 245 -132 250 -99 220 226 -80 -55 4 184 -74 -3 45 63 -6 -33
5759 -33 3 -274 49 -46 -19 -55 -103 -60 91 13 11 68 -184 174 71 124 -26 -90 -35 54 193 -206 277 -104 91
5784 91 -147 -210 -83 14 -92 170 117 -384 -66 -170 101 -217 90 21 -49 164 -148 -109 -101 1 -64 -127 51 169
5808 169 -33 -51 -33 50 283 101 -68 -31 -63 -28 -53 95 3 381 54 116 31 -65 -153 37 255 209 -239 24
5832 24 23 -193 -12 0 -101 135 -14 85 -54 266 111 -85 -80 133 -291 175 152 377 188 131 -31 35 6 0
5856 0 313 48 4 -111 -40 29 193 48 161 46 168 -87 80 -115 -35 -107 100 -102 -154 -98 57 84 175 236
$$ packed form
5690B9n4j3n7p4J64n3K01j56m5K8J17Mk74j35L93r5j72J80N8j12K09k22J18q7
5714d8M2Q7M4l68J00j88L73k43K58l41J65K03m53N53p7P9l03K76j30j51J23J42
5736A43k94r7J33K98m10L35k98M35l77L82l49L19Ol06K5N9J80k58P1M8J8o9k7
5759c3L6k77L23r5K7l6m8M3J51p8kN7k52L58j03N3j50o4N5Q9J39l99M83l81J95
5784I1k38o3J27R7j06K62n3n01L18j04K71l18L07o9p0K13l12L9QJ02o5o3J78J18
5808A69k02j8J8Q3K33j82j69L7l2L5k5J48r2L78l27O2q5r6q8J90K18m6m48K63
5832B4jk16J81J2j01K36j49R9j39L20j55j96NK13m24M66k3K25j89n7j62O6k9o
5856@L13k65m4j15P1O9J64j45J13j15J22k55J67j95Q0p2K07k02n2N6J55K7R1O1
$$ plain form
5880 236 216 118 19 138 -225 133 -62 -43 -230 164 -407 201 180 178 173 -126 -91 21 -60 -81 -326 -182 -48 86
5904 86 3 -98 314 64 -9 109 83 -121 -101 -44 70 397 31 -70 -178 286 -41 -45 47 156 46 -15 -227
5927 -227 24 -13 -309 -213 39 104 256 22 194 171 -163 -120 127 37 120 167 85 269 100 279 -238 123 217
5950 217 53 217 -77 -257 85 10 -71 43 131 -48 -36 123 59 173 112 124 -45 -101 -397 136 112 24 -123
5973 -123 -191 -47 -193 -29 260 -230 -47 -52 163 0 -42 65 52 -150 -97 3 -32 -240 -29 241 255 318 -66
5996 -66 79 113 62 -211 -136 -33 -26 62 -99 62 -127 -49 -77 -228 84 180 213 351 -132 -39 -56 276 63 218
6020 218 -40 -145 8 -229 -217 -178 201 62 43 -216 18 -10 -143 -72 -29 -20 -244 7 4 36 169 -114 14 -99
6044 -99 184 -63 63 -106 192 18 -194 -191 60 -60 182 -98 -61 88 -159 10 -71 153 -184 -91 94 -10
$$ packed form
5880B36k0r8r9J19l63L58j95J9j87L94n71O08k1knk99L5J12q1k1k45J44J34J34
5904H6q3j01M12k50p3J18k6k04K0N7J14L27l66j01j08M64l27mR2J09j10o1k12
5927b27K51l7k96R6K52O5J52k34J72k3l34M3K47r0Q3M7q2J84j69J79n17L61R4
5950B17j64J64k94j80L42p5q1J14Q8j79J2J59o4J14o1J2j69n6k96N33k4q8j47
5973a23o8J44j46J64K89m90J83nK15j63m2J07j3k02N3J00l5k08K11K70J4O3l84
5996f6J45L4n1k73P5J03PQ8j61J61j89P8k8j51L12R6L3J38m83R3j7L32k13J55
6020B18k58j05J53k37J2L9L79j39j9k59K34k8j33P1M3Rk24K51lL2J33k83J28j13
6044i9K83k47J26j69K98j74k12LK51j20K42k80L7J49k47J69q1K24l37R3J85j04
$$ plain form
6066 -10 -171 -126 -28 -9 255 27 20 -44 -234 -249 42 178 -211 -166 -105 -41 -1 100 178 153 87 207 252 -68 188
6091 188 12 -81 -87 -140 -19 -158 65 -157 -69 -431 -145 -26 -245 2 -22 -69 160 -105 137 -106 -58 128 35
6114 35 -104 -26 193 -67 -60 200 162 -171 73 281 -262 35 -14 -189 13 -223 160 -153 254 43 -34 2 110
6137 110 35 -188 57 128 -4 74 27 61 -62 347 -120 -162 -75 -156 -260 -62 -4 -123 -91 33 -274 63 -249
6160 -249 -217 -109 -255 -222 -100 62 -257 196 32 216 181 -94 -157 0 -6 -332 64 -89 2 117 -155 279
6182 279 87 36 -8 69 -184 -44 137 14 -100 199 74 -276 145 40 -57 -44 -94 -26 -14 -222 -74 -206 -93
6205 -93 148 222 77 36 18 129 18 138 -104 40 35 142 226 -129 -51 -140 -199 -47 93 -167 -28 61 13 52
6229 52 378 69 162 -90 56 116 119 191 -71 -112 -65 -126 275 82 -192 105 46 -141 -179 145 -122 79 6 139
$$ packed form
6066a0j61M5R8J9K64k28po4j90j5K91J36l89M5O1O4M0J01P8k5o6J20M5l20K56
6091A88j76r3on3J21j39K23k22Q8l62K86J19k19K47k4m7K29k65K42k43M8J86r3
6114C5j39P8K19k60PK60l8l33K44K08n43K97m9j75K02k36L83l13M07k11p7L6J08
6137A10p5k23K45P1j32P8m7L4j23M09m67m2Q7q1j04J98N8j19L2J24l07L37l12
6160b49L2J08j46L3J22J62l19M53j64J84l5k75o3J57ol26L96j53R1J15k72M34
6182B79j92n1m4P7k53J40J81j23j14K99j25l50M21j05r7J3n0O8J2k08J48j32J13
6205i3K41P4j45m1j8J11j11J20k42J44nJ07Q4l55P8q9n9J52J40k60J39Q9m8L9
6229E2L26l09R3k52J46O0LP2k62m1M7o1M01j93k74K97n9j87l8L24k67K01p3J33
$$ plain form
6253 139 258 -258 -23 -317 49 -66 86 79 61 132 41 74 -77 -94 -8 239 127 35 242 -77 -52 -307 -105
6276 -105 -91 172 121 -92 -147 57 7 -230 -149 -186 -168 106 -133 -460 -23 -180 311 -145 7 -210 48 33 -126
6299 -126 139 311 86 136 -139 60 179 192 -38 33 53 -22 241 -178 185 -246 -338 -21 110 44 -293 211
6321 211 15 -89 -84 -378 68 -82 -51 22 261 -137 86 116 -10 32 -174 -113 190 86 214 -103 20 -55 -23
6344 -23 230 -131 17 69 88 -107 -571 155 20 -77 -107 -246 31 258 51 -73 -159 -47 41 -61 89 -136
6366 -136 25 262 -134 -103 -151 113 -38 -113 -303 -50 -23 256 -89 15 324 -336 -58 85 170 -365 36 -114
6388 -114 -255 -27 -24 45 -133 267 -74 167 58 -202 117 286 -120 131 9 -8 -59 156 45 -44 79 10
6410 10 10 47 -140 96 35 52 177 165 -9 65 33 152 151 -8 112 -23 -105 -194 52 91 97 -125 32 124 -262 9
$$ packed form
6253A39J19n16K35k94L66j15J52pj8P1r1L3j51j7Q6K47j12r2K07l19K5k55K02
6276a05J4K63n1k13n5K04n0k37Q1l7J8K74k39l27M37j57M91m56J52k17K58j5j59
6299a26K65J72k25N0k75J99J19J3k30P1K0p5K63m19L63m31r2L17J31o6l37N04
6321B11j96j04Nk94M46j50L1P3K39l98K23L0j26M2k06O1L03j04J28l17J23p5L2
6344b3K53l61J48N2J9j95m64P26j35r7l0j39K77K27k07j24q6J12Q8j02J50k25
6366a36J61K37l96L1m8K64j51p5j90K53K7K79l45J04L09o60K78J43Q5n35M01j50
6388a14j41K28LO9j78M00l41K41j09k60L19J69m06K51j22j7n1K15j11q9J23o9
6410A0%L7j87K36o1J7J25j2j74P4l2J19jj59J20j35q2q9K46L9Ok22J57R2l86K71
$$ plain form
6436 9 -246 -360 183 -6 -47 23 -107 -10 189 255 -227 61 -29 200 -79 -48 183 79 48 136 -69 42 -30 40
6460 40 149 52 -174 94 -52 -26 -56 -123 125 -284 116 7 -94 -136 -31 -17 139 150 -24 323 387 -67 -52
6483 -52 131 -104 -204 -113 214 -136 84 -206 197 114 -211 307 11 -120 30 38 97 -151 49 53 -187 17 77
6506 77 -19 -196 -260 -136 -53 -206 106 189 -108 -111 -196 -95 -181 -6 44 59 121 -233 -80 58 -37 35 -350 47 188
6531 188 -74 66 27 232 198 224 62 -116 212 176 -116 -151 25 283 -159 92 56 174 -105 28 35 151 102
6554 102 -140 164 108 96 126 -240 12 230 259 76 -173 168 306 -42 -26 -187 -229 35 -144 -50 -60 86 38
6577 38 -92 133 42 -243 -104 -278 28 -142 201 -140 0 100 37 112 -131 60 207 83 -91 100 57 186
6599 186 -433 -20 42 -17 -67 82 112 50 -241 181 99 120 -39 -23 -17 -43 36 11 33 1 112 -4 -144 -120 63
$$ packed form
6436Ik55j14N43j89m1P0j30R7J99O6m82K88r0K29k79L1K31j04l1Q8k05J11p2P0
6460D0J09r7k26K68j46K6l0o7K48m09M00j09j01m2J05J4J56J1j74L47O4m54J5
6483e2J83k35j00R1L27l50K20k90M03q3l25N18k96j31J50QN9k48K00Mk40K04O0
6506G7r6j77o4J24Q3j53L12Q3k97lq5J01q6J75N0J5O2l54J53J38r5P2l85L97J41
6531A88k62J40l9K05l4K6j62j78L28l6k92l5J76K58m42K51l6J18k79J33PJ16m9
6554A02k42L04n6j2L0l66K52K18K9j83k49L41J38l48J6j61m2K64j79R4j0J46m8
6577C8j30K25r1k85J39j74L06j70L43l41J40J00o3P5k43J91J47j24j74J91m3J29
6599A86o19M13O2n9n0J49L0o2k91M22q2K1j59J6Ok6P9k5K2l2J11j16j40K4J83
$$ plain form
6624 63 95 55 155 242 48 104 329 -283 -171 -2 -201 227 -46 87 -36 179 220 -395 -125 133 -242 281
6646 281 70 10 -14 81 -113 -209 -37 88 -115 140 65 100 -25 45 7 19 21 -35 -58 0 55 48 -60 -242 38 -238
6672 -238 156 91 -136 183 202 82 -209 14 338 -52 175 -182 106 146 37 14 125 56 153 -244 -116 210
6694 210 167 154 -247 217 71 192 401 28 135 -217 -195 -35 -95 -20 -211 -7 -260 -42 -37 41 -32 86 198
6717 198 -96 112 -161 65 -116 -1 42 48 81 242 -259 -14 -32 66 -149 -45 260 56 -110 -303 58 10
6739 10 -110 -110 101 135 109 -36 38 26 87 -234 -273 111 -216 -178 99 129 47 -33 -33 -101 -151 -73 -1 -287 17 158
6765 158 -22 -72 -107 65 90 79 131 -77 180 -231 -177 131 -56 -104 54 -11 -108 -101 -82 -204 75 142 -19 -11 -40
6790 -40 174 51 143 79 210 -295 -50 -79 47 -85 -139 -18 89 -30 -123 236 96 -115 -173 23 -196 137
$$ packed form
6624F3L2m0J00Q7j94N6K25o12J12J69j99M28k73J33j23K15M1o15K70K58l75N23
6646B81k11o0k4R5j94r6J72J25k03K55p5L5j25P0l8J2Kn6k3N8N5pj08j82K80k76
6672b38L94o5k27L19J9j20k91K23L24l90K27l57K88M0j09k3J11o9R7l97J28L26
6694B10m3j3m01M64j46J21K09l73J07l52K2J60o0P5j91K04k53K18NP8p3J18J12
6717A98k94K08k73K26j81J15M3OL3J61n01K45j8R8k15J04L05k04j66j93L61m8
6739A0j20%K11L4k6j45P4j2O1l21l9L84l27L8K77L0q2q0%o8n0P8P2k86L04J41
6765A58j80n0l5J72K5j1N2k08K57m11N4L08j87m8J58o5r7PJ9j22K79O7j61Qk9
6790d0K14j23R2o4J31n05K45k9J26j32n4J21J07j19r3L59j40k11n8J96k19L33
$$ plain form
6812 137 172 31 210 -71 -95 13 182 -118 43 -211 38 61 95 125 -200 -83 187 -74 112 -139 69 130
6834 130 -60 -36 -49 655 -41 -44 -94 -283 -138 35 -30 -312 23 -46 -115 -29 -149 215 -18 -127 -31 -136 64
6857 64 -38 158 70 -14 -127 67 61 -119 35 26 249 141 227 217 116 61 85 -143 -87 -245 9 -195 57 -215
6881 -215 -165 108 36 -207 122 -165 31 -100 188 -69 16 2 82 -180 115 132 124 167 -162 -106 132 172 81 41
6905 41 -138 66 -12 198 -159 -177 -179 35 -238 -50 -29 63 164 -90 -23 43 52 100 -160 -52 -151 157 168 -71 94
6930 94 69 154 40 -97 -84 174 -73 49 163 -109 -87 -41 -258 187 55 -276 179 -58 -7 164 72 172 60
6953 60 143 -198 -75 39 -105 -131 -244 34 -238 218 -119 46 -170 182 -181 82 -262 -45 -86 -26 -34 -8 93
6976 93 121 -2 122 -18 -233 -96 -94 -43 -57 -123 -73 3 180 -223 -200 -83 47 155 -115 125 116 -96 -54 -65 -109
$$ packed form
6812A37L5j41J79k81k4J08J69l00J61k54K49K3L4L0l25J17K70k61J86k51K08O1
6834A30j90K4j3P04o96ln0j89J45J73o5k82L35o9o9Q6j20L64k33j09R6j05K00
6857F4j02J96q8q4j13J94oj80J54rK23j08Q6j0j01n5K4k28N6j58K54k04K52k72
6881b15N0K73p2k43L29k87J96j31K88k57Q5j4Q0k62K95J7qM3l29N6K38M0r1m0
6905D1j79K04p8K10l57j8kK14k73J88K1R2J01k54O7O6RM8k60J08r9L08J1k39J65
6930I4k5Q5j14j37J3K58k47J22J14k72K2M6k17M45j32l31M55k37N1J71r2J00j12
6953F0Q3l41J23J14j44k6j13K78k72M56l37J65k16L52l63K63l44K17m1O0qK6J01
6976I3K8j23J24j40k15J37KN1j4o6N0P6J77m03K3J17J30J08k70K40rk12M2j1m4
$$ plain form
7001 -109 207 135 155 5 -95 15 -1 -83 330 246 352 -77 -17 62 327 -19 70 106 218 -59 -120 -224 74
7024 74 -114 29 199 -24 -63 188 -182 -16 31 -119 93 146 206 82 -107 -43 -208 -69 272 -21 111 -71
7046 -71 -107 160 159 44 150 164 -58 26 -35 205 9 59 121 -43 62 -38 12 -62 -244 112 -63 -32 49 -20 -261
7071 -261 15 -24 -25 119 -95 -89 -157 86 30 65 127 6 66 158 -185 157 -83 112 -13 97 -41 131 -60 -15
7095 -15 -14 68 52 -7 93 -83 -30 -33 219 40 193 -162 48 117 -229 118 -66 -81 -43 -16 -87 -31 249 -206 -39
7120 -39 -32 14 -35 -273 0 -9 51 -204 -60 -119 117 74 37 239 217 27 -32 253 28 44 180 128 130 199 -8 90
7146 90 -60 208 170 -82 -19 71 -15 -46 -35 -81 221 8 -39 -104 -119 164 -85 -51 70 -1 234 -189 -41 -181
7170 -181 64 -122 -31 175 -41 -21 -197 26 -46 -21 59 34 134 -199 -268 -72 -142 -204 -37 74 -250 72 -217
$$ packed form
7001a09L16p2K0j50j00J10j6q2M13q4J06m29O0P9K65l46Q9L6J12k77o1j04K98
7024G4j88J43J70k23l9K51l70J66M7j50K12N3O0j24j89O4j65J39L41k93J32j82
7046g1l6K67jj15J06J4k22Q4o1K40j96N0O2j64J05j00N0p4j82L56j75L1Q1o9k41
7071b61K76l9jJ44k14Oo8K43n6L5O2j21O0R2l43L42k40J95j25J10j38J72j91M5
7095a5JQ2j6n9J00j76N3lK52j79J53l55K10O9l46L47j84j5L8K7p1N6K80m55J67
7120c9PM6m9k38K73rO0k55J44n9K36m3l7K02k2j90n9K85k25J6J36n2KO9k07R8
7146I0j50K68l8k52O3R0q6l1J1m6L02k13m7o5j5K83k49L4J21p1K35m23J48j40
7170a81K45j86R1K06k16K0j76K23p2K5Q0k5J00l33o9J96p0o2J67J11l24L22k89
$$ plain form
7193 -217 38 74 0 396 -77 252 2 99 47 -31 46 -124 -60 56 -177 82 48 4 -111 -42 -316 -57 2 -175
7217 -175 -64 -242 -31 199 250 113 -207 69 21 -1 -47 152 371 -118 56 -54 -137 -30 -108 68 64 46 -319
7240 -319 -16 41 -341 60 42 -121 40 199 114 123 -101 -66 -37 -52 102 -43 46 -264 -186 35 -212 167 62
7263 62 -88 -268 -101 -1 -3 -118 -141 9 -74 -121 -108 155 385 -27 -192 101 211 -182 -146 189 3 -69 208
7286 208 192 26 87 65 -97 148 4 -102 -74 12 -75 254 -30 184 4 -235 241 67 182 -122 -41 -213
7308 -213 -34 56 4 -315 26 -140 -169 21 74 136 47 12 236 54 -93 201 50 98 -51 119 -122 -65 72
7331 72 -19 97 -243 24 33 127 39 -13 18 180 -126 28 -92 -151 41 -107 -38 -55 137 -195 -117 -173 -67 -80 -35
7356 -35 63 -75 222 10 -250 -248 -162 165 97 19 -3 40 -275 158 -31 127 153 23 252 -30 -143 17 1 35
$$ packed form
7193b17K55L6p4L96m73L29k50R7n2p8P7j70O4J16k33K59l4m4j15O9k74K59N9j77
7217a75J11j78K11K30N1j37l20K76m8k2m6J99K19m89J74j10q3J07p8J76mj8l65
7240c19L03N7l82M01j8j63J61J59q5Rk24L5K9j5J54j45Q9l10P8K21k47L79j05
7263F2j50j80J67J00kj15k3J50q3m7J3K63K30m12j65K93J10l93L6L35j86p2K77
7286B08j6j66O1k2j62K45j44j06K8Q6q7L29k84K14j80k39M76j74J15l04Q1j72
7308b13J79R0n2l19L41j66k9J90N3O2q9l5K24j82j47K94j51M8j49J70k41N7J37
7331G2r1J16l40K67RR4q8n2L1J62l06J54j20n9J92j48O9j7J92l32P8n6J06j3M5
7356c5R8j38K97k12k60KQ6L27o8p8k2M3l15M33j89J58K6j30K29k82j13J60j6L4
$$ plain form
7380 35 173 -125 -77 20 -8 -71 1 -53 -4 -96 -28 22 60 -46 -223 194 -63 53 -149 123 9 -14 -18 155 46
7405 46 186 -519 -72 202 -70 -11 132 288 105 131 -130 97 -246 -65 308 189 -302 -244 39 79 163 -156
7427 -156 -79 192 -189 -460 185 16 -22 -149 -43 95 135 -243 95 85 126 142 -38 -161 12 -17 393 51
7449 51 -135 -25 19 -6 89 19 79 175 -100 -89 135 -140 6 151 -38 325 -49 112 -217 -192 119 -255 13
7472 13 94 199 -100 -28 121 233 -244 312 72 91 2 195 -97 -156 13 116 -295 223 -207 2 87 52 -70
7495 -70 93 113 -198 -122 -152 -66 115 -144 -191 -312 -239 166 -123 -44 -25 -177 102 -23 -28 325 168 92 86 -164 41
7520 41 -83 -166 -68 -84 107 116 -132 167 5 -189 26 -68 -5 154 -25 -38 109 54 9 13 -231 218 -108 -273
7544 -273 66 149 8 -33 67 105 109 15 -47 103 204 -54 30 82 -69 58 13 34 -161 -160 -39 131 -114 -5
$$ packed form
7380C5J38k98M8R7k8o3P2n4M9r2O8N0L8j06j77M17k57J16k02K72j14k3mJ73j09
7405D6J40p05M47K74k72N9J43J56j83K6k61K27l43J81L73j19m91N8K83M0Q4l19
7427a56P7K71l81k71O45j69l8j27J06J38M0l78L38j0M1J6j80j23J73k9M10l42
7449E1j86J10M4k5R5p0O0R6k75J1K24k75J46J45j89L63l74J61l29K5L11l74K68
7472A3Q1J05k99P2J49J12m77N56k40J9q9J93k92n9J69J03m11N18m30K09Q5l5j22
7495g0J63K0l11P6l0Q6J81k59m7j21P3M05k89P9J9j52K79j25nL53j57p6ok50K05
7520D1j24q3R8j6J91Rk48K99j62j94K15r4O3J59j79j3J47n5m5Mk44M49l26j65
7544b73L39Q3j41m1J00L8Mr4o2J50J01k58Q4N2j51J27m5K1j95JJ21J70k45J09
$$ plain form
7568 -5 -249 221 -20 86 -161 -82 -157 250 -100 195 130 124 -141 -161 49 82 -14 196 117 -312 -17 -136 -201 -166
7592 -166 354 -27 347 -33 -62 237 -117 2 165 15 33 -307 -234 -260 -20 -24 -214 173 13 -71 56 156
7614 156 -83 -19 82 155 39 50 -176 -127 34 -75 19 -381 -49 -34 8 228 -90 127 68 -56 0 39 -181
7637 -181 -227 38 80 -10 247 12 55 332 -185 125 -80 -63 101 23 282 -51 -41 145 1 -288 -101 -159 -175
7660 -175 56 2 82 -338 -8 -11 1 1 -25 154 39 -98 -164 -95 21 20 184 -105 94 128 106 -53 99 -56 -99
7685 -99 94 -179 -330 58 -67 -26 124 40 14 32 141 -140 -13 64 -23 173 97 44 48 0 116 -90 170 3
7709 3 -122 -161 50 -25 110 68 39 14 194 50 -61 0 -70 79 -74 -45 -40 -24 193 42 -86 34 105 -273 -26
7734 -26 75 -176 154 15 2 39 -185 -147 102 -39 -33 -95 -122 -204 110 56 -125 -51 -7 -35 -11 153 -62 -115 -92
$$ packed form
7568ek44M70k41J06k47P9p5M07l50K95o5ok65k0K10L3r6K10p9m29K95j19o5L5
7592a66N20l81L74l80k9K99l54J19J63j50J8l40P3k6K40mj90L87j60q4J27J00
7614A56k39O4J01P3j16J1k26M9J61j09R4m00L32J5M2K20l18K17n9j24N6L9k20
7637a81m6K65M2r0K57k35M3K77n17L10k05J7J64p8K59l33J0J86j44k89J87n8j6
7660a75K31n4Q0m20L30lJ2%k6J79j15j37o6O9J16jJ64k89J99L4k2j59J52j55m3
7685i9J93k73j51L88j25M1J50q4k6J8J09k81J27P7q7J96p6n3Mm8J16k06K60j67
7709Cj25l9K11p5J35m2k9k5J80j44j11O1p0J49j53K9NJ6K17j51j28J20P1l78K47
7734b6J01k51L30j39j3L7k24L8K49j41Oo2k7q2L14n4j81P4M4k8K4J64k15n3K3
$$ plain form
7759 -92 -37 38 -371 -205 -7 -20 380 -39 -130 -123 -227 -34 -31 104 -22 -58 -71 -114 160 -71 183 27 -16 296
7783 296 79 93 -221 -162 47 225 11 76 -126 -36 210 122 94 -353 15 28 61 2 72 248 267 18 218 -114
7807 -114 -65 15 0 19 -107 17 47 285 22 -170 -300 29 -55 123 -33 133 145 -180 -176 150 -20 50 -294
7830 -294 -26 190 -221 -34 47 -29 149 -53 -198 -93 -69 -33 115 163 97 317 -5 -133 -30 -92 -82 135 -80
7853 -80 -143 -36 145 -20 -35 -211 -148 -8 5 58 88 -5 -297 75 -226 73 -277 61 272 -169 59 -399 334
7876 334 65 137 28 -235 144 -86 -119 -86 265 -51 -159 59 115 149 -53 -28 186 -67 -57 111 -49 110
7898 110 -128 -194 -93 7 -33 -43 -79 -286 76 17 -199 266 -19 118 82 -42 31 80 153 -95 -135 -46 95 -187
7922 -187 198 -89 95 -40 48 201 -101 -86 228 62 -112 -227 -201 -70 -59 -297 -106 -94 -63 -2 -109 -4
$$ packed form
7759i2N5P5m09J66J98j3M00m19r1Pj04J93LJ35j26l6j3m3K74k31K54j56m3L12
7783B96k17J4l14N9K09J78k14O5k02R0K46q8k8m47L68J3L3n9P0J76J9k49K00l32
7807a14M9Q0j5J9j26J24L0K38k63j92j30L29q4J78j56J66J2l25ML26j70P0l44
7830b94K68K16m11J87Q1p6J78k02j45J05K4L6J48M8o6K20l22j28J03o2J0K17k15
7853h0o3J07J81j65j5j76O3J40J3N3L0r3k92L72l01K99l50L38K11m41K28m58P33
7876C34k69P2j09k63L79k30l3L3L51l16j08K18N6L4k02K5K14k53J0J68j60J59
7898A10k38o6J01J00m0j0l6k07L62n9k16M65k85J37l6j24P3M9P3k48m0Q9J41k82
7922a87L85k87J84j35Q8J53l02J5L14j66j74j15K6J31J1k38J91J2L1O1j07J05
$$ plain form
7944 -4 -331 -57 74 51 291 -55 -14 252 -85 83 -36 -4 78 -192 -236 63 267 -179 -170 -86 188 2 24 142
7968 142 -91 155 -12 136 -8 -75 -64 -27 -267 49 198 124 61 -21 38 -24 169 -92 120 41 -78 -2 184
7991 184 -151 270 -122 -48 252 -93 16 147 25 -130 166 198 -123 -120 -52 -277 329 138 -97 -190 -94 -352
8013 -352 63 389 70 139 -152 57 -141 413 137 -60 29 -117 330 -56 -97 -140 -119 -29 -117 126 -124 -25 22
8036 22 106 -62 69 -126 222 85 -14 -134 -278 179 -327 36 -12 -76 64 -74 102 96 -101 -84 -16 78 -115
8059 -115 31 208 -306 -53 -31 -116 -106 227 73 60 -225 241 66 13 -185 -229 83 -3 44 91 110 -178 -74
8082 -74 65 -197 70 162 -118 -110 14 -60 -90 259 26 262 -13 97 -210 409 -69 -33 -59 -192 39 10 131
8105 131 190 -109 38 -115 -78 59 -146 114 -85 -179 -66 368 -86 130 -17 62 66 -158 216 212 72 26 7
$$ packed form
7944dl27K74J31k3K40l46M1K66l37J68j19L2Q2k70m4K99K04m46RQ4K74j86K2J18
7968A42k33K46j67J48j44o7J1L7k40L16J49p4o3q2N9o2J93k61K12p9j19P6J86
7991A84l35M21l92P4L00l45J09J31j22j55K96L2l21LO8k25O06j91k35r3R6k58
8013c52M15L26l19O9k91K09j98N54k76j97Q9j46M47l86m1m3K1R0q8K43k50R9M7
8036B2Q4j68J31j95L48j37r9j20j44M57n06L63m8o4J40j38J76oj97J7O8R4j93
8059a15J46J77n14K53K2q5J0L33j54j3k85M66j75n3j98m4L12q6M7M7J9k88J04
8082g4J39k62K67R2k80QJ24p4l0L49k33K36k75J10l07O19m78L6k6j33K31k9J21
8105A31N9k99J47j53L7J37k05K60j99r4J13M34m54K16j47P9Mk24L74mj40m6j9
$$ plain form
8128 7 85 50 -115 389 -69 -35 168 237 19 83 -13 32 127 -21 -95 -49 -72 -81 179 127 -28 145 78 -38 -72 -14
8154 -14 -92 -56 -5 -8 -211 -25 100 -156 -209 -234 115 -182 -83 134 126 214 375 77 157 -246 190 114 3 -94 -220
8179 -220 282 35 17 -155 -75 -161 -23 -119 155 -225 -42 51
$$ packed form
8128GP8l5j65N04m58L4K03O9k18O4r6M5R5j48p4M6k3rK60n2j55J73o7j16l4N8
8154a4p8L6N1lk03J86J25k56n3k5L49k97R9K17qQ8J61k98Q0m03M36p6j11r7j26
8179b20N02k47j8j72Q0q6J38r6K74l80J83R3
8191E1
$$ Imaginary data points
##PAGE= N=2
##DATA TABLE= (X++(I..I)), XYDATA
$$ plain form
0 0 0 0 0 0 0 0 0 0 0 0 0 0 0 -5 8 -8 8 -8 10 -16 16 -21 24 -26 32 -40 43 -50 56 -66 77 -88 98 -111 125 -141
36 -141 157 -175 197 -219 243 -271 296 -328 365 -402 444 -489 537 -591 654 -720 793 -877 969
55 969 -1077 1197 -1336 1501 -1696 1935 -2231 2611 -3119 3832 -4906 6698 -10230 19740 -98169
70 -98169 -248175 58662 113363 -74575 -73419 50556 18063 -16973 3070 -13464 -22978 17858
82 17858 -7777 -42602 605 32946 232 -27921 -33842 4084 44109 718 -50913 -556
94 -556 29319 -10029 -4612 5423 -25804 15994 39462 -50780 -35356 74975 13075 -70943 16226
107 16226 39184 -41107 2168 50911 -30417 -38709 36368 11127 -19600 22876 2710 -40724
119 -40724 8535 46945 7 -33557 -2253 26893 7402 -16980 8820 30937 -13980 -36698
$$ packed form
0@%%%%%%%%%%%%%nJ3j6J6j6J8k6L2l7M5n0N8p2Q3r3J06j22J43j65J86k09K36k66
36a41K98l32L72m16M62n14N67o24O93p67Q46r33J026j128J245j374J513j670J846
55I69k046K274k533K837l197L631m166M842n730O951q738J1604j6928K9970j17909
70i8169j50006L06837N4701j87938J156J23975l2493l5036K0043j6534r514M0836
82A7858k5635l4825M3207L2341l2714k8153n921L7926M0025m3391n1631N0357
94e56K9875l9348N417J0035l1227M1798K3468r0242J5424J10331o1900q4018Q7169
107A6226K2958q0291M3275M8743q1328q292P5077k5241l0727M2476k0166m3434
119d0724M9259L8410m6938l3564L1304K9146j9491k4382K5800K2117m4917k2718
$$ plain form
131 -36698 28116 49901 -21576 -34594 23984 22098 -11772 5861 13276 -15430 -3983 25145
143 25145 1756 -15962 9376 5539 -11645 9512 8214 -18576 398 21051 -8401 -21089
155 -21089 6537 13026 -4287 -8604 -4520 -445 2607 -1371 -39 -1306 -12404 -75 13446 -9214
169 -9214 -13865 13228 2111 -23182 -735 20373 -2548 -18087 -8076 -731 10706 10925 -19411
182 -19411 -26396 11873 26186 -10760 -32386 1282 26675 -5362 -29182 2737 21953 -7249
194 -7249 -20027 3601 11168 -2232 -4195 -1881 -3584 5327 9076 -5735 -8444 7994 11603 -3186
208 -3186 -7132 3867 9171 6345 10 -7202 2065 17042 5226 -11783 -1006 14404 6495 -6140
222 -6140 -545 9973 3943 -6796 188 13788 2826 -11538 2039 11190 -2906 -1701 5793
$$ packed form
131c6698O4814K1785p1477j3018N8578j886l3870J7633P415k8706J1447K9128
143B5145k3389j7718K5338l837j7184K1157j298k6790J8974K0653k9452j2688
155b1089K7626O489j7313m317M084M075L052l978J332j267j1098J2329J3521k2660
169i214m651K7093j1117k5293K2447K1108k2921j5539J0011P345J1437K19l0336
182a9411o985L8269J4313l6946k1626L3668K5393l2037k3820L1919J9216k9202
194g249j2778K3628P567j3400j963K314j703Q911L749j4811k709J6438L609j4789
208c186l946J0999N304k826o335p212R267J4977j1816j7009J0777J5410p909j2635
222f140N595J0518o030j0739O984J3600j0962j4364J3577R151j4096J205P494
$$ plain form
235 5793 -4934 -2888 10539 -178 -10033 5035 6742 -8549 -1789 9263 -2752 -7459 3144
248 3144 2652 -2603 -1387 -1206 -1196 -346 -1053 -1174 -1973 -3327 -994 1386 -2975 -6105 148 1610 -4540
265 -4540 -3778 -1094 -3437 -1065 999 -6238 -6048 4125 1305 -10032 -3033 7522 -3712 -9349 3163
280 3163 3354 -5479 -1753 2501 -1165 -1808 1735 270 -1508 499 1393 1674 602 -1997 1303 5189
296 5189 3 -1562 2203 2744 2373 896 -1174 2640 6306 90 -3716 4906 7252 -3068 -2287 7379
312 7379 3578 -2910 1027 4660 865 -556 3004 2401 -861 1798 3553 -34 -361 2261 2027 213
328 213 -458 1237 1616 528 -707 -131 803 1083 -1013 -925 -226 687 -334 -3412 -1154 2011 -2011 -3836
346 -3836 -79 -105 -3332 -2315 -191 -3004 -3218 -111 -1498 -4617 -1488 172 -2730 -3691 -1507 116
$$ packed form
235E793j0727K046J3427j0717r855J5068J707j5291O760J1052j2015m707J0603
248C144m92n255J216J81J0Q50p07j21p99j354K333K380m361l130O253J462o150
265d540P62K684k343K372K064p237J90J0173k820j1337O999J0555j1234n637J2512
280C163J91q833L726M254l666o43L543j465j778K007Q94K81j072k599L300L886
296E189n186j565L765N41l71j477k070L814L666o216l806Q622K346j0320P81R666
312G379l801o488L937L633l795j421L560o03l262K659J755l587l27K622k34j814
328B13o71J695L79j088j235N76R34K80k096Q8O99R13j021l078K258L165m022j825
346c836L757k6l227J017K124k813k14L107j387l119L129J660k902r61K184J623
$$ plain form
362 116 -2360 -3603 -439 224 -1994 -1972 -43 -145 -1678 -1211 516 -733 -799 913 -68 -376 654 505
380 505 225 262 644 455 680 1210 -294 -256 3041 1583 -1662 1213 3706 904 -1160 1460 3672 870
398 870 -834 1920 3156 1331 -51 1842 3049 584 722 3042 1223 497 2718 2254 434 891
414 891 1840 2094 978 117 221 2041 1571 -1422 -764 1490 -184 -1150 -208 -251 -731 -1096 -1478 -445 -945
433 -945 -2238 -1053 -199 -2157 -3036 658 28 -4656 -2045 1457 -2183 -3862 -460 -883 -1662 -624 -2384
450 -2384 -2479 736 291 -3099 -1564 490 -1644 359 937 -3857 -1810 3453 -263 -3195 593 181
466 181 -2339 1444 1688 -2439 98 1398 -2723 1133 4076 -3162 -1982 4814 0 -2325 4510 1875
482 1875 -4336 2102 6045 -472 -240 2723 -963 3048 6480 -2828 -1987 7361 2733 -3227 3225 2954
$$ packed form
362A16k476j243L164O63k218K2J929j02j533M67J727j249o6J712r81l08J030j49
380E05k80L7L82j89K25N30j504L8L297j458l245K875K493k802k064K620K212k802
398H70j704K754J236j825j382J893J207k465J38K320j819p26K221m64j820M57
414H91R49K54j116q61J04J820m70k993O58K254j674r66R42m3m80l65l82J033n00
433i45j293J185Q54j958q79L694o30m684K611L502l640j679L402m23p79J038j760
450b384r5L215m45l390J535K054k134K003N78m794K047N263l716k932L788m12
466A81k520L783K44m127K537J300m121L856K943p238J180O796m814k325O835k635
482A875o211O438L943o517K32K963l686M011L432r308Q41R348m628n960O452k71
$$ plain form
498 2954 -2068 4520 4023 -5821 506 8206 -1154 -3384 3693 -408 -1600 4846 -648 -3678 4408
513 4408 301 -7661 3685 7891 -6988 -6688 4933 75 -1660 3608 -4528 -6982 5123 3980
527 3980 -5525 -1403 -400 -5443 2704 4725 -8117 -4756 5835 -3175 -5735 5047 -928 -7968
541 -7968 1885 2220 -5712 -360 2441 -5330 -1519 3532 -4208 -3062 4814 -3212 -4370 5498 -1349
556 -1349 -7292 5221 6618 -6304 -4013 4035 488 2430 4113 -6433 -4090 9068 4763 -3279
570 -3279 795 -603 -1567 7004 5073 -5271 -743 4209 -1492 1586 7730 -1459 -6061 3499 4773
585 4773 1057 2361 -1805 -3776 3920 5124 -1671 -1151 1304 -1527 1416 4779 -1933 -3157 4186
600 4186 2171 -2250 163 77 -638 2756 1559 -3983 -2202 2818 1990 -253 -2081 -4373 -423 4833
$$ packed form
498B954n022O588m97r844O327P700r360k230P077m101j192O446n494l030Q086
513D408m107p962J1346M206j4879L00J1621m858j735N268q136k454J2105j143
527C980r505M122J003n043Q147K021j2842L361J0591r010k560J0782n975p040
541g968R853L35p932N352K801p771L811N051p740J146P876q026j158R868o847
556a349n943J2513J397j2922K291Q048l547J942J683j0546K343J3158m305q042
570c279M074j398r64Q571j931j0344M528M952n701L078O144r189m602R560J274
585D773l716J304m166j971P696J204o795N20K455k831K943L363o712j224P343
600D186k015m421K413q6p15L394j197n542J781N020q28k243j828k292L950N256
$$ plain form
616 4833 227 -4038 -2466 -1484 -316 1826 233 -3165 -3499 -3078 120 4056 69 -7838 -5360 2169
632 2169 3396 188 -4396 -6319 412 4845 -696 -3580 -1912 -1345 140 2860 -580 -3498 711
647 711 1464 -1880 579 1696 -1733 530 2085 -1284 247 1842 -1775 860 4809 -1376 -4347 4255
663 4255 4594 -2181 305 1241 -2648 3138 6967 -1497 -3864 1191 1993 3365 5440 -2825 -5429 4776
679 4776 5818 -1327 1066 916 -4300 2525 7010 -1386 -3020 2176 -489 -321 5286 -224 -5649 1570
695 1570 2555 -2595 1996 1314 -6376 91 6142 -3413 -4790 2926 -570 -3679 2197 -269 -5267 858
711 858 2868 -4444 -2157 899 -3395 69 3785 -4336 -5031 3141 699 -2690 1831 -1399 -5963 2310
727 2310 4686 -4048 -2672 1279 -2611 -244 4115 -2269 -3959 2148 360 -2034 3865 945 -6211
$$ packed form
616D833m606m265J572R82J168K142j593l398l34M21L198L936l987p907K478P529
632B169J227l208m584j923O731M433n541k884J668N67J485K720l440k918M209
647G11P53l344K459J117l429K263J555l369J531J595l617K635L949o185k971Q602
663D255L39o775K486R36l889N786L829q464k367N055Q02J372K075q265k604J0205
679D776J042p145K393j50n216O825M485q396j634N196k665J68N607n510n425P219
695A570R85n150M591o82p690O467O051r555j377P716l496l109N876k466m998O125
711H58K010p312K287L056m294L464L716q121o95Q172k442l389M521l230m564Q273
727B310K376q734J376L951l890K367M359o384j690O107j788k394N899k920p156
$$ plain form
742 -6211 803 5811 -1450 -2157 1890 -609 -224 3672 -372 -2389 2434 1644 -1035 1809 1406 -2027
758 -2027 2344 3671 -1678 -124 3775 40 -837 3428 781 -1985 1904 1990 -337 1394 694 -2101
774 -2101 2038 4001 -1867 -1877 2346 716 -490 1506 -23 -2305 636 1663 -915 -775 -47 -1590
790 -1590 -77 786 -1531 -1278 138 -1259 -1071 1002 -1005 -2525 -406 575 -1042 -1119 -651 -1354 -463
807 -463 492 -1659 -1382 90 -982 -703 -85 -1151 -1503 -61 97 -1000 -840 115 -618 -598 209 -119 -324
826 -324 -814 -146 906 147 -856 20 1222 140 -44 451 704 -202 571 1231 264 101 947 523 762
845 762 899 766 1041 739 455 836 1286 686 385 804 1642 619 -297 1032 1128 1014 133 208 1025 638
865 638 -465 390 818 -106 -337 521 799 -608 -215 936 -390 -656 106 250 -138 -1100 -164 17 -557
$$ packed form
742f211P014N008p261p07M047k499L85L896m044k017M823p90k679K844m03l433
758b027M371J327n349J554L899l735q77M265k647k766L889Q6k327J731p00k795
774b101M139J963n868j0M223j630j206J996j529k282K941J027k578J40P28j543
790a590J513Q63k317K53J416j397J88K073k007j520K119R81j617p7M68p03Q91
807d63R55k151K77J472j072K79O18j066l52J442J58j097J60R55p33K0Q07l28k05
826c24m90O68J052p59j003Q76J202j082j84M95K53r06P73O60r67j63Q46m24K39
845G62J37j33K75l02k84L81M50o00l01M19Q38j023r16J329R6j14q81P5Q17l87
865F38j103Q55M28r24k31Q58K78j407L93J151j326k66P62J44l88r62R36J81n74
$$ plain form
884 -557 -814 -335 -159 -650 -1021 -610 -157 -639 -1003 -815 -320 -761 -1045 -588 -525 -753 -933 -476 -679 -927 -896
905 -896 -407 -511 -884 -462 285 -504 -865 -171 351 -145 -824 110 366 -536 -403 8 463 174 163 728 409
926 409 213 409 511 668 536 351 593 902 290 809 832 737 561 853 867 648 190 951 849 591 454
947 454 782 1197 51 107 1100 323 -40 384 171 692 297 163 483 166 38 409 410 -25 -307 197 38
968 38 -420 -139 424 -634 -633 -307 -441 -483 -751 -960 -966 -106 -740 -1311 -428 -409 -1230 -837 -141 -931 -1136 -318
990 -318 -548 -1002 -602 -551 -398 -666 -661 -744 -180 -14 -1183 -127 652 -555 -670 391 23 -616 -75 178
1010 178 53 330 220 -325 158 955 280 386 569 -419 246 1789 259 -617 498 955 503 538 683
1029 683 35 99 1317 845 842 536 -170 433 1447 555 126 567 308 -215 1008 1037 -155 -93 502 314
$$ packed form
884e57k57M79J76m91l71M11M53m82l64J88M95m41k84M57O3k28j80M57k03k48L1
905h96M89j04l73M22P47p89l61O94N22m96o79R34K56r02J33M11M55k89j1N65l19
926D09j96J96J02J57j32j85K42L09o12N19K3r5j76K92J4k19m58P61j02k58j37
947D54L28M15j146N6R93p77l63M24k13N21l95j34L20l17j28L71Jm35k82N04j59
968C8m58K81N63j058JL26j34m2k68k09oQ60o34n71Q83J9q21L93O96p90k05Q18
990c18k30m54M00N1J53k68Nq3N64J66j169J056P79j207j15J061l68o39N41K53
1010A78j25K77j10n45M83P97o75J06J83r88O65J543j530q76J115M57m52L5J45
1029F83o48O4J218m72ll06p06O03J014q92m29M41k59n23J223K9j192O2N95j88
$$ plain form
1049 314 422 193 -299 220 551 -411 -329 71 1 23 -253 -598 -881 255 322 -535 -820 -555 -459 513 -159
1070 -159 -1476 -1019 -458 -734 145 83 -1528 -1961 -63 122 -264 -160 -1909 -1864 865 467 -575 -704 -1385
1089 -1385 -1316 1131 1147 -1332 -1273 304 -206 310 1088 -535 -1395 812 642 -550 978 378 -734 1093
1107 1093 1035 -855 315 2120 6 -724 1487 311 -322 2334 1014 -1696 50 1574 149 1909
1123 1909 1162 -2147 -332 3239 1252 -805 992 -920 -1275 3636 2419 -2362 -734 488 -476 1516
1139 1516 1908 -2444 -1792 2071 584 -577 1768 -1350 -3082 1977 1983 -2249 -555 842 -2292 -94
1155 -94 2021 -1706 -1730 1820 -841 -2084 881 -490 -2455 1434 431 -3649 -232 1970 -1595 -915
1171 -915 917 -2571 -1784 3092 489 -3120 -517 -363 -1007 2357 1308 -4008 -1201 1889 -394 432
$$ packed form
1049C14J08k29m92N19L31r62Q2M00p0K2k76l45k83J136O7q57k85K65R6R72o72
1070a59j317M57N61k76Q79o2j611m33J898J85l86J04j749M5K729l98j042j29o81
1089a385O9K447J6k479N9J577n10N16P78j623q60K207j70j192J528o00j112J827
1107A093n8j890J170J805k114p30K211j176o33K656j320k710J746J524j425J760
1123A909p47l309J815L571j987k057J797j912l55M911j217m781J628J222r64J992
1139A516L92m352O52L863j487j161K345l118j732N059Om232J694J397l134K198
1155i4K115l727k4L550k661j243K965j371j965L889j003m080L417K202l565O80
1171i15J832l488P87M876k603l609K603J54o44L364j049n316K807L090k283Q26
$$ plain form
1187 432 1634 -2597 -2717 3365 2094 -1745 209 -203 -1748 2537 2927 -2384 -906 1950 -244 791
1203 791 2468 -1251 -1869 2764 1462 -1506 1192 1079 -1240 1324 1983 -1633 -49 2161 -135 -242
1219 -242 983 -715 -511 2904 690 -2310 478 1312 -422 1699 1184 -2529 -563 2358 757 -572
1235 -572 118 -1755 -582 2782 941 -2174 -500 27 -788 1612 788 -2697 -1581 1314 37 -395
1251 -395 -408 -1810 -1392 1108 72 -1244 -448 -562 -1236 655 143 -2284 -595 935 -500 -503 207 -885
1269 -885 -603 1035 -250 -1286 -40 191 -99 1021 -170 -1792 482 1384 -271 43 80 -693 343
1286 343 2038 -16 -1109 580 500 613 1948 -65 -1852 898 1734 -74 748 527 -1000 545 1935
1303 1935 395 -765 757 299 173 1560 24 -1018 1019 826 -240 568 399 -955 457 1791
$$ packed form
1187D32J202m231j20O082j271l839J954m12j545M285L90n311J478K856k194J035
1203G91J677l719o18M633j302k968K698j13k319K564O59l616J584K210k296j07
1219b42J225j698K04L415k214l000K788Q34j734K121n15l713J966K921j601j329
1235e72O90j873J173L364j841l115J674N27q15K400q24l485J116K895j277m32
1251c95j3j402M18K500j036j316P96j14o74J891n12k427J689J530j435lP10j092
1269h85K82J638j285j036J246K31k90J120j191j622K274R02j655L14L7p73J036
1286C43J695k054j093J689q0J13J335k013j787K750Q36j808Q22k21j527J545J390
1303A935j540j160J522m58j26J387j536j042K037j93j066Q08j69j354J412J334
$$ plain form
1319 1791 -399 -875 622 158 -271 1082 -397 -1398 776 841 -720 47 -364 -1225 332 1014 -916
1336 -916 -1328 431 -303 -857 331 -784 -1704 382 336 -979 -124 -398 -1628 -290 526 -933 -975 669
1354 669 -466 -872 502 -654 -1275 335 281 -990 -115 -50 -346 130 804 -914 -657 745 -80 -336
1372 -336 957 1 -883 744 825 -405 151 801 11 681 1050 104 -55 828 365 184 995 523 -232
1391 -232 993 910 -267 2 652 26 74 671 45 -204 614 556 -241 384 104 -252 674 282 -267 293
1411 293 395 -204 -244 142 275 -430 247 -91 -177 47 -667 -91 -16 -270 -428 -296 -221 -490 -216 130 -497
1432 -497 -630 -420 -51 -539 -190 37 -306 -215 -159 -223 -251 -286 -304 -482 -159 -121 -373 -87 -40 -262 -21 94 -326
1455 -326 -145 124 340 177 -131 -58 177 -234 -5 239 196 253 153 138 438 172 355 298 545 304 115 375
$$ packed form
1319A791k190m76J497m64m29J353j479j001K174O5j561P67m11q61J557O82j930
1336i16m12J759p34n54J188j115r20K086m6j315Q55k74j230J338Q16j459m2J644
1354F69j135m06J374j156o21J610n4j271Q75O5k96M76O74j718K57J402q25k56
1372c36J293r56q84J627Q1j230N56O50p90O70L69r46j59Q83m63j81Q11m72p55
1391b32J225q3j177K69O50o26M8N97o26k49Q18n8p97O25k80l56R26l92n49N60
1411B93J02n99m0L86J33p05O77l38q6K24p14N76P5k54j58J32P5k69K74L46o27
1432d97j33K10L69m88L49K27l43R1N6o4k8l5j8j78L23L8k52K86M7k22K41J15m20
1455c26J81K69K16j63l08P3K35m11K29K44m3N7j00j5L00k66J83n7K47k41j89K60
$$ plain form
1477 375 433 173 403 348 573 364 269 410 17 101 506 351 343 463 152 669 426 -11 238 386 70 -120
1499 -120 -15 281 173 -215 252 51 -223 -55 -78 -40 -145 -192 -370 -77 -312 -278 -535 -377 -727 -393 -413 -299
1521 -299 -484 -167 -256 -235 -356 -401 -141 -307 -465 -546 -233 -574 -512 -395 -215 -315 -354 100 -338 -305 -103 -95 -200
1544 -200 -379 -83 -178 263 -137 121 329 288 -151 -386 283 154 -268 283 353 -164 364 621 109 335 443
1565 443 283 -28 500 442 98 692 378 168 255 288 -10 299 501 -41 -16 749 266 -116 375 406 -38 196
1587 196 103 -267 150 279 -180 138 122 -306 -118 326 -37 -717 44 -171 -399 233 -61 -584 -254 -161 -97
1608 -97 -200 333 -702 -515 103 -817 -756 -52 45 -1117 -83 -146 -872 -192 384 -631 -601 -13 -482 -152
1628 -152 819 -611 -1106 487 163 -373 395 149 -875 88 792 -219 79 238 -350 192 1254 48
$$ packed form
1477C75N8k60K30n5K25k09r5J41l93Q4M05j55qJ20l11N17k43m37K49J48l16j90
1499a20J05K96j08l88M67k01k74J68k3L8j05m7j78K93k35L4k57J58l50L34k0J14
1521b99j85L17q9K1j21m5K60j66j58q1L13l41O2J17J80j00l9M54m38L3K02Qj05
1544b00j79K96r5M41m00K58K08m1m39k35O69j29m22N51P0n17N28K57n12K26J08
1565D43j60l11N28n8l44N94l14k10Q7L3k98L09K02n42K5P65m83l82M91L1m44K34
1587A96r3l70M17J29m59L18j6m28J88M44l63o80P61k15k28O32k94n23L30R3O4
1608i7j03N33j035J87O18r20O1P04R7j162J034o3p26O80N76j015L0N88m69L30
1628a52R71j430m95J593l24n36P68k46j024R63P04j011K98J59n88N42J062j206
$$ plain form
1646 48 -539 371 351 -20 933 452 -602 541 1244 -199 -67 749 -481 -68 1146 218 -541 933 671
1665 671 -463 516 412 -399 643 901 35 -70 745 268 118 900 -176 -678 720 599 -314 21 -337
1684 -337 -741 649 975 -401 -492 4 -579 -63 1039 -558 -1524 209 562 -127 403 -476 -1476 -85
1702 -85 722 -535 -555 -177 -703 -308 591 -423 -1007 211 -26 -625 48 117 -839 207 435 -802 -339
1721 -339 381 -495 -27 564 -1183 -801 1101 501 -747 250 -97 -902 949 1064 -820 -667 317 -113
1739 -113 639 1099 -1175 -861 1257 709 231 723 -206 -621 1247 1400 -564 -80 306 -431 839 1058
1757 1058 -540 -664 854 384 -130 898 -197 -912 859 954 -827 -70 735 -556 330 599 -1056
1774 -1056 -491 928 218 -831 433 -310 -944 1083 352 -1288 -320 477 -285 394 408 -1408 -1191 1435
$$ packed form
1646D8n87R10k0l71R53m81j054J143P03j443J32Q16j230M13J214r28p59J474k62
1665F71j134R79j04q11J042K58q66j05Q15m77j50P82j076n02J398j21r13L35l58
1684c37m04J390L26j376r1M96n83N16J102j597r66J733L53o89N30q79j000J391
1702h5Q07j257k0L78n26L95Q99j014n84J218k37n99O73O9r56J046K28j237M63
1721c39P20q76M68N91j747L82J902o00j248R97l47q05J851J15j884J53R84m30
1739a13P52M60k274L14K118n48m78M92r29m15J868J53j964M84L86p37J270K19
1757A058j598j24J518m70n14J028j095p15J771R5j781P57Q05j291Q86K69j655
1774a056N65J419p10j049J264p43o34K027p31j640R68P97p62O79J4j816K17K626
$$ plain form
1792 1435 226 -814 267 -921 -1163 947 470 -1450 -657 207 -663 12 290 -1292 -1165 971 275
1809 275 -582 327 -371 -796 850 494 -1085 78 448 -716 141 951 -774 -408 1502 244 -685 580
1827 580 46 -393 1131 433 -1043 193 945 1 110 1011 -755 -219 1463 393 -523 485 -291 -596
1845 -596 1122 668 -949 37 753 173 365 593 -740 -274 862 154 -603 330 -84 -350 758 477
1863 477 -580 -220 770 -222 -63 380 -820 -375 804 -325 -1000 320 -237 -609 386 -187 -1059 -277
1881 -277 235 -377 -289 -64 -783 -212 736 -221 -835 3 -245 -587 466 -193 -868 -387 185 -560 -586 71
1901 71 -728 -633 410 -200 -471 264 -72 1 606 140 -240 390 648 -120 105 379 -88 -70 727 -70 -42
1922 -42 193 -16 -122 452 252 -455 382 622 -48 183 480 -131 -276 533 233 -408 381 -20 -14 323 282
$$ packed form
1792A435j209j040J081j188k42K110m77j920P93Q64q70O75K78j582J27K136o96
1809B75q57R09o98m25J646l56j579J163L70j164Q57Q10j725L66J910j258r29J265
1827E80n34m39J524o98j476J236P52r44J09R01j766N36J682j070r16J008p76l05
1845e96J718m54j617R86P16n80J92K28j333M66J136p08p57R33m14k66J108k81
1863D77j057L60R90r92J59M43j200M45J179j129o75J320n57l72R95n73q72P82
1881b77N12o12Q8K25p19N71R48r57o14Q38k48l42J053o59o75M81N72p45k6O57
1901G1p99R5J043o10k71P35l36P3O05m66l80O30K58p68K25K74m67J8P97p97K8
1922d2K35k09j06N74k00p07Q37K40o70K31K97o11j45Q09l00o41P89m01OL37m1
$$ plain form
1943 282 -135 118 218 145 105 452 -146 128 270 -51 -38 268 203 -183 -13 -14 -424 111 -39 -127 177 -232
1965 -232 -290 63 219 -490 -430 -171 -246 -113 -43 -165 -360 -207 -31 -320 -92 -144 -287 -347 -36 -244 -200 -61
1987 -61 -218 -527 -100 -176 -361 -215 172 307 -214 -70 -74 34 145 -50 213 -157 181 37 344 154 -126
2008 -126 258 151 -137 98 392 341 168 26 352 136 -18 167 -9 408 116 -13 202 117 159 98 317
2029 317 148 -8 222 25 18 200 195 10 54 87 -113 44 -143 128 -177 246 -154 -266 251 -4 343 103
2051 103 13 -387 -279 -54 26 -133 -142 -63 24 97 -103 -287 24 -256 -24 -333 -171 -75 17 -153 -117 -204 -271 -25
2075 -25 58 -66 -54 -138 281 -20 -202 20 35 275 -65 -344 -47 29 289 50 -104 140 86 41 370 227 -11
2098 -11 -97 190 -137 280 305 154 190 245 206 155 233 399 108 248 -21 360 201 128 145 185 -29 79 350 83
$$ packed form
1943B82m17K53J00p3m0L47n98K74J42l21J3L06o5l86J70jm10N35j50q8L04m09
1965b32n8L53J56p09O0K59p5J33P0j22j95J53J76k89K28n2j43o0L11k08M4J39
1987f1j57l09M27p6j85J46L87J35n21J44mJ08J11j95K63l70L38j44L07j90k80
2008a26L84j07k88K35K94n1j73j42L26k16j54J85j76M17k92j29K15q5M2o1K19
2029C17j69j56K30j97pJ82nj85M4L3k00J57j87K71l05M23m00j12N17k55L47k40
2051A03r0m00J08K25Q0j59rP9Q7P3k00j84L11k80K32l09J62R6R2j70L6q7o7K46
2075b5Q3j24J2q4M19l01j82K22J5K40l40k79K97P6K60k39j54K44n4m5L29j43k38
2098a1q6K87l27M17K5j51L6N5l9n1P8J66k91J40k69L81j59p3J7M0k14J08K71k67
$$ plain form
2122 83 141 200 272 243 197 380 271 8 84 61 -264 214 -1 -152 -52 -101 -13 46 172 -386 -563 49 132 -196
2146 -196 -66 -206 -338 -106 90 -541 -123 -396 -204 126 4 -202 -119 -24 -417 -368 172 -245 -160 -320 -43
2167 -43 -168 -287 -179 151 -59 -63 -257 -106 37 -170 -121 33 36 -23 411 109 -28 20 139 161 363 262 -365
2190 -365 40 389 402 11 363 -32 63 610 21 116 375 177 -92 513 501 -193 163 472 124 190 577 53
2212 53 -48 536 54 280 196 26 55 128 50 -216 153 211 -365 -91 117 -440 52 140 -399 18 -5 -202 -181
2235 -181 336 -318 -567 192 334 -442 -341 -11 -569 -118 415 -253 -600 -173 -25 45 83 -277 -859 -42 221
2256 221 -230 -88 -49 -465 90 402 -307 -572 209 -246 -203 350 110 -392 166 399 -365 -242 99 -155 -175
2277 -175 271 -54 -297 494 100 -151 267 40 -227 299 496 -126 189 364 -414 235 635 -383 -274 413
$$ packed form
2122H3N8N9P2k9m6J83j09k63P6k3l25M78k15j51J00m9Q8N9J26n58j77O12Q3l28
2146a96J30j40j32K32J96o31M18k73J92L30j22k06Q3R5l93M9N40m17Q5j60K77
2167d3j25j19J08L30k10mj94J51J43k07M9J54Ln9M34l02j37M8J19K2K02j01o27
2190c65M05L49J3l91L52l95R5N47n89R5K59j98k69O05j2o94L56L09l48O6L87n24
2212E3j01N84m82K26q4j70K9P3p8k66L69N8n76K74K08n57M92Q8n39M17k3j97K1
2235a81N17o54k49P59J42p76J01L30n58M51N33o68l47M27J48P0L8l60n82Q17K63
2256B21m51J42L9m16N55L12p09k65P81m55M3N53k40n02N58K33p64J23L41k54k0
2277a75M46l25k43P91l94k51M18k27k67N26J97o22L15J75p78O49M00j018J09O87
$$ plain form
2297 413 261 72 212 -381 -464 412 738 -134 4 152 -349 41 647 -158 -688 -69 -72 -149 317 -113 -769
2318 -769 241 311 -600 -266 156 -408 89 667 -444 -671 389 151 -301 309 -586 -703 270 217 -294 -126
2338 -126 -218 -532 47 570 -642 -641 481 -205 -252 431 -336 -554 643 538 -610 -177 88 -205 -48 570
2358 570 -378 -610 549 52 -292 525 67 -564 385 446 -272 25 337 -305 309 708 -510 -413 626 100
2378 100 120 677 -210 -593 514 716 -529 74 426 -52 178 445 -403 -112 535 263 -191 201 148 -318
2398 -318 372 520 -531 -4 385 -149 46 254 -588 -289 144 -200 -452 9 -470 -431 244 -67 -527 -106
2418 -106 161 -223 -109 378 -568 -516 308 68 -282 -70 -324 -181 301 258 -673 -161 41 -227 0 186 -549
2439 -549 -301 211 20 -127 5 -124 -225 480 294 -536 -100 103 119 -22 111 -53 7 151 256 -143 273
$$ packed form
2297D13j52j89J40n93q3Q76L26q72J38J48n01L90O06q05n30O19lp7M66m30o56
2318g69J010P0r11L34M22n64M97N78j111k27J060k38m52O10q95j17R73n3n11J68
2338a26r2l14N79N23j212JJ122o86m7O83p67k18J197j05j148M33K65k93J57O18
2358E70r48k32J159m97l44Q17m58o31R49O1p18K97L12o42O14L99j218R7J039n26
2378A00K0N57q87l83J107K02j245O03L52m78K30K67q48K91O47k72m54L92n3m66
2398c18O90J48j051N27L89n34J95K08q42K99M33l44k52M61m79L9O75l11m60M21
2418a06K67l84J14M87r46N2Q24k40l50K12k54J43M82m3r31N12K02k68K27J86p35
2439e49K48N12j91j47J32j29j01P05j86q30M36K03J6j41J33j64O0J44J05l99M16
$$ plain form
2460 273 -109 130 388 96 -191 69 241 67 36 122 107 116 524 -163 -145 329 284 91 63 400 -484 89 281
2483 281 101 200 21 -104 152 346 117 -207 16 -199 -211 174 415 -434 -246 92 -120 -55 145 -313 47
2504 47 215 -167 -145 -99 -150 -87 -160 -84 -476 -150 76 -41 53 129 -469 55 5 48 -237 -178 117 75 47 -138 -581
2529 -581 147 118 -285 58 158 173 132 51 -133 -13 102 -88 86 56 151 -137 -63 294 232 119 -55 -115 -59
2552 -59 133 -61 137 506 -3 -178 100 116 -177 171 459 37 11 221 -14 283 285 -179 -185 374 233 224 87
2575 87 -14 -121 160 41 -270 279 -17 -414 -176 93 -283 -49 -305 -80 -150 -126 161 21 -106 -44 -93 -214
2597 -214 -108 -40 -234 -10 -58 -95 -179 -95 29 -94 -329 -382 34 -142 -132 -150 -112 -410 -295 61 -45 76 125
2620 125 138 138 -207 245 -5 -121 149 106 -37 29 73 -131 86 184 0 13 170 124 -34 54 -65 3 302 -1
$$ packed form
2460B73l82K39K58k92k87K60J72j74l1Q6j5RM08o87J8M74m5j93k8L37q84N73J92
2483B81j80R9j79j25K56J94k29l24K23k15j2L85K41q49J88L38k12O5K00m58L60
2504D7J68l82K2M6n1O3p3P6l92L26K26j17R4P6n98N24n0M3k85N9K95m2k8j85m43
2529e81P28k9m03L43J00J5m1q1j84J20J15j90J74l0R5k88P4L57o2j13j74o0N6
2552e9J92j94J98L69n09j75K78J6k93L48K88m22k6K10k35K97Km64oN59j41rj37
2575H7j01j07K81j19l11N49k96l97K38K69l76K34k56K25p0K4K87j40j27O2m9j21
2597b14J06O8j94K24m8l7q4Q4J24j23k35n3M16j76J0j8L8k98J15L56j06J21M9
2620A25J3%l45M52k50j16K70m3j43O6M4k04K17R8j84J3J57m6j58Q8j19O8K99l03
$$ plain form
2644 -1 212 -60 72 70 214 -49 291 144 53 -47 109 142 314 354 -83 -195 26 14 -66 -62 260 194 38 82
2668 82 -106 -238 -100 55 -41 215 -9 -108 -39 90 91 -5 159 -316 -95 -208 -61 204 -208 -125 -131 -405 -91
2691 -91 -298 -119 -170 -9 -203 20 -154 -298 82 -134 -92 -347 -292 -51 -51 63 107 -6 -243 -359 -47 -214
2713 -214 189 116 25 81 -89 -144 55 -293 249 -19 -103 96 -95 306 9 7 -91 -44 281 255 101 157 37 -8
2737 -8 -68 99 -34 334 168 -48 328 23 58 -98 184 26 -68 168 -32 -374 154 -139 41 102 229 -82
2759 -82 120 140 7 -86 58 -150 -121 32 -168 -49 -70 -43 -431 195 67 -369 -22 172 -68 125 156 -239
2781 -239 -59 327 -62 -299 -43 -160 -142 247 -150 -345 -156 18 -62 165 212 -160 16 184 -82 -189 112
2802 112 82 -150 313 -106 -388 116 291 -119 273 308 -194 -123 264 -133 -90 89 -101 -73 258 205 -198 -40
$$ packed form
2644aK13k72J32kJ44k63L40j47r1j00J56L3J72M0m37j12K21j2q0ML22o6j56M4
2668H2j88j32J38J55r6K56k24r9O9J29Jr6J64m75K21j13J47K65m12Q3ok74L14
2691i1k07J79n1J61j94K23j74j44L80k16M2k55N5K41%J14M4j13k37j16L12j67
2713b14M03p3r1N6j70n5J99l48N42k68q4J99j91M01k97kr8M7L25k6j54N6j20m5
2737ho0J67j33L68j66k16L76l05L5j56K82j58r4K36k00l42N28k93J80O1J27l11
2759h2K02K0j33r3J44k08K9J53k00J19k1K7l88O26j28m36L47J94k40J93L1l95
2781b39J80L86l89k37K56j17J8L89l97j95J89J74q0K27M7l72J76J68k66j07L01
2802A12l0k32M63m19k82N04J75m10L92L5n02P1L87l97M3J79j90K8L31n3m03J58
$$ plain form
2824 -40 190 -32 229 261 31 -276 366 3 -248 331 -4 281 130 278 -297 -40 439 -15 10 20 -199
2845 -199 -155 227 -125 -388 50 -143 -106 284 36 -458 -99 514 13 -136 181 -408 -134 552 -67 -46 60
2866 60 -62 -191 234 -53 -607 -129 105 -299 -67 46 -94 -205 221 160 -325 83 -177 9 59 240 -309
2887 -309 -6 284 8 -41 124 -230 -94 121 -172 -275 -16 -93 22 117 95 -253 57 337 -51 -9 77 -75
2909 -75 212 656 82 -328 289 155 -122 207 -113 -238 95 631 -134 89 -4 -154 -133 372 13 -30 117
2930 117 128 84 270 329 -346 221 487 -236 -16 -67 -268 -156 211 59 -245 2 -47 88 -223 -210 -526 -80
2952 -80 170 166 -228 172 -195 37 -70 -94 -232 -120 -178 -85 139 -308 -346 -11 -180 -195 3 49 -351 159 -11
2975 -11 -339 -230 -59 -298 -47 -157 -236 -270 31 84 -275 152 283 -77 16 330 -400 -208 335 -58 -230 79
$$ packed form
2824d0K30k22K61L2k30l07O42l63k51N79l35K85j51J48n75K57M79m54K5J0k19
2845a99M4L82l52k63M38j93L7L90k48m94L59O13n01j49L17n89K74O86o19K1J06
2866F0j22j29M25k87n54M78K34m04K32J13j40j11M26o1m85M08k60J86N0J81n49
2887c09L03K90k76m9J65l54J36K15k93j03K59p7J15R5k2l48L10K80l88M2Q6j52
2909g5K87M44n74m10O17j34k77L29l20j25L33N36p65K23r3j50K1N05l59m3J47
2930A17J1m4J86N9o75N67K66p23K20n1k01J12L67j52l04K47m9J35l11J3l16M46
2952h0K50ml94M00l67K32j07k4j38J12n8R3K24m47l8L35j69j5J98M6m00N10j70
2975a1l28J09J71k39K51j10p9l4L01N3l59M27J31l60R3L14p30J92N43l93j72L09
$$ plain form
2997 79 -381 -585 481 105 -55 45 -43 -72 -27 118 -244 -274 448 123 114 154 -204 -246 409 -33 -372 70 110
3020 110 97 -38 43 -223 -110 381 96 -117 22 54 -133 191 -53 -272 54 -56 -119 -158 100 -281 16 102
3042 102 -192 -146 219 -19 -389 -16 8 -313 -95 -198 -173 -285 42 -341 -130 -20 244 -2 67 186 -389
3063 -389 -53 -321 -203 10 319 -151 -86 -54 263 -131 -46 332 128 -149 -141 -205 62 46 -206 -119 -138 -149 158
3086 158 134 -2 30 138 132 69 -86 -42 -163 112 -161 -65 306 20 58 142 103 -89 101 148 83 120 382 153
3110 153 -49 107 220 -7 291 -202 -16 183 -175 281 -50 -4 -39 -86 103 -5 120 -53 36 -128 -297
3131 -297 -43 174 65 -83 -174 105 -152 -114 -75 20 -158 -100 -159 -353 -206 155 -7 -102 -11 76 -23 -417 -321 36
3155 36 -66 -134 -87 -83 -84 -28 -15 -211 47 88 -30 73 44 65 32 280 -125 86 -122 -227 16 31 92 204 -25
$$ packed form
2997G9m60k04J066l76j60J00q8k9M5J45l62l0P22l25rM0l58m2O55m42l39M42M0
3020A10j3j35Q1k66J13M91k85k13J39L2j87L24k44k19L26j10o3l9K58l81K97Q6
3042A02k94M6L65k38l70L73K4l21K18j03K5j12L27l83K11J10K64k46O9J19n75
3063c89L36k68J18K13L09m70O5L2L17l94Q5L78k04k77Qo4K67j6k52Q7j9j1L07
3086A58k4j36L2J08oo3j55M4j21K75k73R6L71k86L8Q4l9j92J90M7o5L7K62k29
3110A53k02J56J13k27K98m93J86J99l58M56l31M6l5m7J89j08J25j73Q9j64j69
3131b97K54K17j09j48r1K79k57L8L9R5j78N8n9j94J47L61j62r5R1Q7r9l94R6L57
3155C6j02o8M7MjN6J3j96K58M1j18J03k9K1l3K48m05K11k08j05K43J5O1J12k29
$$ plain form
3180 -25 272 10 92 -40 -83 -205 247 -119 349 185 -53 -4 39 -79 9 134 94 49 25 107 7 65 370 -172
3204 -172 189 -65 19 89 -44 -34 -59 23 -14 -244 82 -131 -61 39 -58 -170 -142 80 -90 -141 55 -215 -136 -336
3228 -336 181 -183 -92 -211 132 -146 61 -112 -301 73 -98 64 -252 -65 -104 2 -127 -104 56 2 -131
3249 -131 -7 112 203 41 24 34 68 184 195 -159 112 -121 -55 90 68 48 -106 30 26 340 276 192 -15 140
3273 140 -41 40 -8 -156 -104 206 -192 -102 228 -114 -229 -27 84 -139 43 67 -138 370 163 -78 165 -48
3295 -48 -94 128 -124 273 -302 16 109 -161 134 -247 -37 200 10 -169 -32 63 124 -66 74 -43 -442 -1
3317 -1 140 -233 56 -58 -231 -187 -131 -222 96 25 -75 -143 -232 121 17 -13 100 128 -238 156 160 143 217 -122 110
3342 110 -88 -191 -202 -185 -36 13 -12 188 -125 -224 96 -162 128 -21 146 91 114 -13 -100 156 62 -5 106
$$ packed form
3180b5K97k62Q2j32m3j22M52l66M68j64k38M9M3j18Q8J25m0m5k4Q2j00N8L05n42
3204a72L61k54Q4P0j33J0k5Q2l7k30L26k13P0J00r7j12K8K22j70n1J96k70P9k00
3228c36N17l64R1j19L43k78K07j73j89L74j71J62l16J87l9J06j29K3J60n4j33
3249a31J24J19R1j62j7J0L4J16J1l54K71k33O6J45k2k0j54J36mL14o4q4k07J55
3273A40j81Q1m8j48N2L10l98R0L30l42j15K02J11k23J82K4k05N08k07k41K43k13
3295d8m6K22k52L97n75L18R3k70K95l81K10K37j90j79J37R5O1j90J40j17l99M41
3317aJ41l73K89j14j73M4N6r1L18p1j00o8q9L53j04l0J13K8l66L94Mj7P4l39K32
3342A10j98j03j1J7J49M9k5K00l13r9L20k58K90j49J67n5K3j27q7K56r4o7J11
$$ plain form
3365 106 -75 -78 -238 189 198 66 23 -45 278 -200 -76 182 212 80 -65 78 84 -10 119 -46 -64 -211 -5 -150
3389 -150 -48 10 98 -272 -179 46 10 -90 -330 -143 246 63 90 -58 -124 -130 339 159 -72 -204 215 -175 -225
3412 -225 -33 -337 68 114 69 -27 -186 70 201 50 -346 -171 -94 83 -372 -146 -10 -331 89 275 -59
3433 -59 -174 299 -379 -116 179 37 -266 239 50 -145 50 243 55 215 -31 253 -121 -149 2 37 276
3454 276 -235 -235 -43 304 -93 223 212 -98 -217 295 -331 18 30 -264 -85 116 45 -111 -28 168 -36 166
3476 166 149 88 -88 332 220 -242 384 -82 -60 188 187 -521 -69 391 -139 99 -24 10 -75 172 -8 -30 -59
3499 -59 -29 25 10 -101 -70 -32 228 -263 -8 -91 -226 -4 46 -154 -504 37 30 -226 133 118 -304 -260 81 18
3523 18 -29 -81 -258 -228 184 170 -96 -126 -44 147 -125 145 -268 -163 354 -113 -84 292 -99 38 349 13 -175
$$ packed form
3365A06j81lj60M27Rj32m3o8L23m78J24K58L0j32j45J43Or4J29j65j8j47K06j45
3389a50J02N8Q8l70R3K25l6j00k40J87L89j83K7j48o6oM69j80k31j32M19l90n0
3412b25J92l04M05M6m5r6j59K56J31j51l96J75P7J77m55K26J36l21M20J86l34
3433e9j15M73o78K63K95j42l03N05j89j95J95J93j88J60k46K84l74k8J51L5K39
3454B76n11%J92L47l97L16j1l10j19N12o26L49J2k94J79K01p1j56Q3J96k04K02
3476A66j7o1j76M20j12m62O26m66K2K48jp08M52M60n30K38j23L4q5K47j80k2k9
3499e9L0N4j5j11L1L8K60m91K55q3j35K22N0k00l50N41pk56L59j5m22M4L41o3
3523A8m7n2j77L0M12j4k66l0Q2J91k72K70m13J05N17m67K9L76l91J37L11l36j88
$$ plain form
3546 -175 293 132 294 59 -8 -324 65 193 40 142 58 -174 135 153 23 39 -24 28 -174 214 -148 -61
3568 -61 106 41 -19 -190 86 -120 -224 3 42 -248 127 -68 -188 167 -303 -9 -197 -27 -185 207 100
3589 100 -170 -177 5 187 120 279 -174 115 143 -73 -239 -7 -59 -61 85 -23 32 -10 -104 67 -118 74 -114
3612 -114 -95 56 -151 -76 203 211 -77 248 316 194 112 -88 141 -22 -342 -63 -152 -53 -133 -34 89 175 -138 224
3636 224 50 -137 -32 89 5 -190 167 -149 140 131 77 -59 57 -294 -120 -45 -39 -53 -39 32 -66 -107 -4 0 -224
3661 -224 41 -145 209 -10 -178 177 70 -90 -76 -86 -244 -163 -192 78 -242 78 148 -90 -46 98 12 -35 -134
3684 -134 -33 -148 -119 152 -277 -10 125 -41 -278 -207 57 134 -46 50 42 185 202 343 -35 -110 -305 203 82
3707 82 36 149 -122 21 -60 1 71 -156 -155 132 226 31 71 101 87 -54 34 148 124 143 64 -3 158 -186 265
$$ packed form
3546a75M68j61J62k35o7l16L89J28j53J02q4k32L09J8j30J6o3N2k02L88l62Q7
3568f1J67o5o0j71K76k06j04K27L9k90L75j95j20L55m70K94j88J70j58L92j07
3589A00k70pJ82J82o7J59m53K89K8k16j66K32n2kJ46j08N5m2r4J71j85J92j88
3612a14J9J51k07P5K79Qk88L25O8j22q2k00K29j63l20K79q9R9q0R9J23Q6l13L62
3636B24j74j87J05J21q4j95L57l16K89rn4j36J16l51J74P5Oj4J4P1r8m1J03Mk24
3661b24K65j86L54k19j68L55j07j60J4j0j58Q1k9K70l20L20P0k38M4J44q6m7r9
3684a34J01j15K9K71m29K67J35j66k37P1K64P7j80R6qJ43J7J41l78p5j95N08j21
3707H2m6J13k71J43q1O1P0k27JK87R4j95M0L0j4j41Q8J14k4J9p9o7J61l44M51
$$ plain form
3732 265 -65 -53 78 6 224 -14 238 114 -92 -121 249 79 -127 184 73 145 -207 -89 62 -61 115
3753 115 -35 -209 333 -54 -20 61 -143 -85 -153 199 -59 204 -88 -369 -120 115 21 40 28 -74 6 120 -53
3776 -53 -80 -134 167 -54 -75 168 -129 13 28 125 -36 -108 -171 -73 81 159 -66 -170 -3 198 28 166 46
3799 46 97 -1 -124 -6 -23 139 12 200 -116 123 -105 6 -233 -139 2 -37 156 45 81 256 46 -101
3821 -101 -216 162 246 185 253 -173 93 83 75 -17 -99 -6 241 95 -219 39 -32 -86 47 94 -235 174 75 -73
3845 -73 10 123 -59 -317 9 93 -195 73 -154 -179 46 62 294 -158 -144 195 158 71 -4 229 -32 309 -109
3868 -109 -61 121 -101 -17 -31 158 158 34 22 -134 7 233 -87 210 -68 13 132 -16 -118 -132 225 145 -33
3891 -33 200 92 242 -76 -156 -40 -135 -17 176 -115 -138 -330 -145 -147 -63 -157 115 -15 -63 -105 -8 242 -14 172
$$ packed form
3732B65l30J2J31p2K18k38K52j24k06k9L70j70k06L11j11P2l52J18J51j23J76
3753A15j50j74N42l87L4Q1k04N8o8L52k58K63k92k81K49K35r4J9j2j02Q0J14j73
3776e3k7n4L01k21k1K43k97J42J5R7j61p2o3R8J54P8k25j04J67K01j70J38j20
3799D6N1r8j23J18j7J62j27J88l16K39k28J11k39R4J41l9J93j11L6J75k10j47
3821a01j15L78Q4o1O8m26K66j0qr2q2R3K47j46l14K58p1n4J33M7l29M09r9j48
3845g3Q3J13j82k58L26Q4k88K68k27k5K25J6K32m52J4L39l7q7p5K33k61L41m18
3868a09M8J82k22Q4j4J89%j24j2j56J41K26l20K97k78Q1J19j48j02j4L57q0j78
3891c3K33j08J50l18q0J16r5J18J93k91k3j92J85kQ4r4K72j30m8m2R7K50k56J86
$$ plain form
3915 172 -67 69 243 -17 -150 287 -81 217 -43 -53 38 -91 117 -1 296 -124 232 -206 82 -174 -97
3936 -97 65 -10 -300 97 107 28 36 342 -34 -13 90 -151 -84 -264 -135 24 405 49 -147 -4 -130 -63 -7
3959 -7 -154 -301 115 210 43 84 -27 -73 -50 -108 -45 -2 -67 143 -164 -52 51 -272 -167 -156 100 90 131 -33
3983 -33 -112 -36 127 21 -182 -78 27 257 214 -220 40 173 152 228 89 -149 7 -6 278 -142 181 135 337
4006 337 89 134 5 -167 -205 64 -128 258 -408 -138 312 56 25 93 160 73 -1 -29 21 64 160 -47 83 -91
4030 -91 -39 153 -34 -154 -34 22 167 60 55 -219 -146 112 -58 -18 20 -29 38 -35 124 -12 76 -158 -20 19
4054 19 -350 -12 155 -18 92 88 112 136 -121 -85 96 -36 -77 -4 -100 -90 140 -59 -163 -66 231 -73 143 -102
4078 -102 134 35 243 -123 -313 271 187 159 216 79 -50 -20 50 -158 -22 -130 71 -194 -17 57 -168 -229 11
$$ packed form
3915A72k39J36J74k60j33M37l68K98k60j0R1j29K08j18K97m20L56m38K88k56P7
3936i7J62p5k90L97J0p9QL06l76K1J03k41O7j80J29J59L81l56j96J43j26O7N6
3959gj47j47M16R5j67M1j11m6K3n8O3M3o5K10l07J12J03l23J05J1K56j0M1j64
3983c3p9P6J63j06k03J04J05K30m3m34K60J33k1P6j39k38J56j3K84m20L23m6K02
4006C37k48M5j29j72l8K69j92L86o66K70M50k56l1O8O7q7p4k8N0M3R6k07J30j74
4030i1N2J92j87j20J20N6J45j07nk74P3K58j70M0L8m9O7p3J59j36Q8k34J38L9
4054A9l69L38J67j73J10mK4K4k57L6J81j32m1P3r6J0K30j99j04R7K97l04K16k45
4078a02K36r9K08l66j90N84q4k8N7j37j29L0P0k08J36j08K01k65J77P4k25o1K40
$$ plain form
4101 11 -13 89 -33 -119 -1 163 125 210 44 40 -115 180 12 -1 148 -86 67 -5 -30 -358 64 -18 108 -133
4125 -133 3 -104 373 91 -141 -71 35 -468 -67 24 6 -25 19 66 -71 -112 -40 67 238 106 59 -57 -154
4148 -154 -19 21 -142 -86 21 93 124 354 -9 -34 -209 -149 57 -67 108 -211 -189 170 37 80 -76 -73 156
4171 156 -61 88 2 89 27 4 -21 126 33 185 -17 160 -110 43 38 172 41 -41 32 88 233 -274 39 105
4195 105 53 -213 34 286 -107 128 216 -30 -148 -164 105 0 -147 15 -270 -196 73 -275 -80 29 -18 -381
4217 -381 -172 345 -145 -74 -156 133 212 19 133 -218 -5 -129 57 -39 -110 309 52 247 -185 -132 -97 -107 -144
4240 -144 70 -192 -25 -108 187 53 -37 -64 209 112 85 -214 190 -171 -148 219 40 -174 140 -73 -21 33 -229
4263 -229 -100 -182 143 74 -85 -109 99 -106 -223 241 -142 -51 292 -27 123 210 4 -12 -153 -227 -21 96
$$ packed form
4101A1k4J02j22q6J18J64l8Q5j66mj55K95j68j3J49k34J53p2k5l28M22q2J26k41
4125a33J36j07M77k82k32P0J06n03M01R1j8l1M4M7j37m1P2J07J71j32m7j16r7
4148a54J35M0j63N6J07P2L1K30l63k5j75O0K06j24J75l19K2L59j33M3j56LK29
4171A56k17J49q6Q7o2k3k5J47r3J52k02J77k70J53nJ34j31q2P3N6J45n07L13O6
4195A05n2k66K47K52l93K35Q8k46j18j6K69j05j47J62k85P4K69l48J95J09m7l63
4217c81K09N17m90P1q2K89P9j93J14l51K13j24J86r6p1M19k57J95m32N3L5j0l7
4240a44K14k62J67q3K95j34r0k7K73r7k7k99M04l61K3L67j79k14L14k13N2N4k62
4263b29J29q2L25o9j59k4K08k05j17M64l83R1L43l19J50Q7k06j6j41p4K06J17
$$ plain form
4285 96 -145 -239 -49 -157 19 -207 259 -126 113 21 -81 -51 -127 169 -130 -103 -2 198 -31 -135 48 136
4307 136 25 164 4 -223 241 80 -98 -109 95 263 130 128 -71 -182 244 203 75 -118 -68 109 -119 206
4329 206 -186 143 7 122 124 1 32 -258 160 111 -17 -92 220 118 117 -97 -140 107 -94 -103 49 54 -88 245
4353 245 -13 -25 -3 389 -90 67 133 15 99 -10 -73 -122 159 224 75 47 -89 -159 317 201 98 219 178
4376 178 198 -102 -84 -41 165 224 -186 -115 -112 -75 147 -132 64 -200 -40 125 -164 -189 -64 105 31 -214 118
4399 118 121 -159 -316 146 -15 -251 -92 -126 -209 -87 83 56 23 -41 -243 -13 -6 -41 -21 -295 -62 -262 154 241
4423 241 22 -102 181 -211 -16 124 -39 44 -349 186 -119 -44 50 32 -231 -20 31 -237 114 106 44 -353 -55
4446 -55 -80 173 -55 30 -213 26 6 30 130 -32 128 225 -104 -10 -213 -207 133 205 95 -133 -235 -26 -52 105
$$ packed form
4285I6k41r4J90j08J76k26M66l85K39r2j02L0p6K96k99K7J01K00k29j04J83Q8
4307A36j11J39j60k27M64j61j78j1K04J68j33kj99j11M26m1j28j93N0J77k28L25
4329B06l92L29j36J15Kj23L1k90M18m9j28p5L12j02jk14m3K47k01rJ52Nj42L33
4353B45k58j2K2L92m79J57O6j18Q4j09o3m9K81O5j49k8j36p0M76j16j03J21m1
4376A78K0l00J8M3K06N9m10P1LL7K22k79J96k64J60J65k89k5J25J69p4k45L32
4399A18Lk80j57M62j61k36J59l4q3J22J70k7l3o4k02K30Pl5K0k74K33k00M16Q7
4423B41k19j24K83l92J95J40j63Q3l93N35l05P5R4j8k63K11N1k68L51qo2l97K98
4446e5k5K53k28Q5k43K39k0K4J00j62J60R7l29R4k03OL40P2j10k28j02K09k6J57
$$ plain form
4470 105 222 91 43 178 84 119 281 225 250 -3 -281 245 92 82 -75 79 -46 -107 47 -158 -27 90
4492 90 -405 -60 45 68 -230 144 9 78 -84 127 54 -133 184 -58 52 -192 68 -177 -102 265 -120 27
4514 27 312 3 14 9 119 69 -35 -78 -147 241 -297 -25 -2 90 -64 -86 83 -141 286 -75 127 -56 -103 75
4538 75 -134 131 13 161 27 -193 -21 -80 -96 -258 -111 285 -198 -96 151 60 -194 218 -196 -309 -141
4559 -141 -10 -6 91 91 -72 -63 -130 188 -73 22 -89 -42 45 25 32 -84 -200 -78 -317 -215 -75 -229 7 122 -3
4584 -3 -141 125 -14 -30 160 2 -33 155 155 64 123 -107 -188 -30 128 -365 -181 113 106 -344 14 -196 -92 -37
4608 -37 14 -129 -66 37 -88 -25 59 223 37 219 26 191 -156 -14 -61 -95 -61 16 40 14 -89 20 85 -13
4632 -13 80 54 178 167 -222 41 -238 1 -77 -115 163 -75 -86 3 214 -200 -22 -114 -229 -22 -180 274 -285
$$ packed form
4470A05J17j31m8J35r4L5J62n6K5k53k78N26j53j0j57J54j25o1J54k05J31J17
4492I0m95L45J05K3k98L74j35O9j62K11p3j87L17k42J10k44K60k45P5L67l85J47
4514B7K85l09J1nJ10n0j04m3o9L88n38K72K3R2j54k2J69k24M27l61K02j83m7J78
4538G5k09K65j18J48j34k20J72n9j6j62J47L96m83J02K47r1k54M12m14j13J68
4559a41J31MR7%j63Ro7L18k61R5j11M7Q7k0Pj16j16J22k39J02J40j54K36J15j25
4584cj38K66j39j6J90j58l5J88%r1N9k30q1J58J58m93J84K94pm50L58k10J04N5
4608c7N1j43O3J03j25O3Q4J64j86J82j93J65l47J42m7l4L4P7K4k6j03J09O5r8
4632a3R3k6J24j1l89K63k79K39p8l8K78k38j1Q9K11m14J78r2j15K07j58M54n59
$$ plain form
4655 -285 -248 153 -34 -146 50 72 -30 -67 -71 -109 190 157 81 -88 -12 20 -184 42 137 138 85 -193 140 6 43
4680 43 -24 -81 -44 -197 142 -81 -31 -16 -17 -30 72 50 92 42 131 34 -177 103 57 344 -82 51 284 -149 143
4705 143 -13 -195 91 -69 -66 -222 77 85 240 -259 52 -145 -11 -116 37 89 86 286 -357 -107 168 -247
4727 -247 -244 -224 -318 -69 -53 93 -34 120 -21 -174 -49 10 6 117 76 54 187 61 -294 -86 -249 -132 42
4750 42 84 -59 -283 171 -35 152 -43 -40 140 -42 -90 -94 -189 -20 211 93 -239 -75 -146 -218 160 -47 -148
4773 -148 78 58 8 -88 -96 50 66 -61 -68 -20 -356 81 3 -95 -217 -180 -65 -1 -16 -119 -186 -426 -74 33 270
4798 270 90 -170 54 27 -176 -142 -36 137 -316 -176 -109 -66 -82 -123 60 -39 -45 208 165 -67 49 -92 341
4821 341 350 -71 -113 -77 -57 364 145 -209 -266 21 -101 2 151 -36 253 -194 44 231 -81 -123 142 149 127
$$ packed form
4655b85L7M01j87j12J96K2j02l7ml8K99l3p6j69P6L2k04K26R5Jn3k78L33j34L7
4680D3o7n7L7j53L39k23N0J5jj3J02k2M2n0Q9r7k11K80m6K87m26J33K33m33K92
4705A43j56j82K86j60Lj56K99QJ55m99L11j97J34j05J53N2lK00o43K50K75m15
4727b47LK0r4K49J6J46j27J54j41j53J25N9mJ11m1k2J33j26l55K08j63J17J74
4750D2M2j43k24M54k06J87j95LJ80j82m8mr5J69K31j18l32J64p1p2L78k07j01
4773a48K26k0n0r6qJ46J6j27pM8l36M37p8r8j22L7J15O4j5j03o7k40L52J07K37
4798B70j80k60K24k7k03L4J06J73m53J40O7M3j6m1J83r9oK53m3k32J16j41M33
4821C41Rm21m2L6K0M21k19l54n7K87j22J03J49j87K89m47K38J87l12m2K65Pk2
$$ plain form
4844 127 99 -28 93 43 -214 -79 6 -10 357 -17 -124 183 7 2 -226 -430 156 123 -162 -132 10 40 106
4867 106 78 225 -333 120 -235 -65 -272 112 -207 -36 229 -139 -12 28 -221 -5 -173 45 33 120 -9
4888 -9 -55 195 89 -125 210 2 40 -10 -129 61 64 24 -93 -158 -81 47 81 -313 185 50 -276 -6 -44 -279
4912 -279 -241 312 137 91 212 -33 102 146 182 -247 -86 64 -28 25 -98 44 -54 -45 105 -178 169 72 154 37
4936 37 8 -118 13 184 -16 35 139 -139 37 -43 -84 -117 -35 89 -267 -154 176 -100 209 -132 136 187 -173
4959 -173 24 -37 265 -72 292 -61 -17 -116 -138 63 10 58 -76 74 48 -250 52 37 32 164 44 -234 203
4982 203 -141 129 -91 21 111 141 -203 -16 -259 -261 -50 -12 -51 10 45 38 -244 -233 -35 -113 -240 182 255 173 -48
5007 -48 -52 28 -51 -2 -28 -39 245 -77 130 -51 25 -51 -67 -35 20 -18 -254 23 111 10 -159 61 42 20 196 -86
$$ packed form
4844A27k8j27J21n0k57J35Q5j6L67l74j07L07j76nk28k04N86l3k85L0J42L0O6
4867A06k8J47n58M53l55J70k07L84l19J71K65l68J27M0k49K16j68K18j2Q7j29
4888im6K50j06k14L35k08L8n0j19J90Lm0j17o5P7J28L4l94M98j35l26K70l8k35
4912b79L8N53j75m6J21k45J35M4L6m29J61J50r2N3j23J42r8RJ50k83L47r7Q2j17
4936C7k9j26J31J71k00N1J04k78J76q0m1l3Q2J24l56J13L30k76L09l41K68N1l60
4959a73J97o1L02l37L64l53M4r9k2K01n3M8j34J50k6k98L02j5nJ32j20k78M37
4982B03l44K70k20J12R0L0l44J87k43kK11L8l9O1L5pk82J1J98p8j27M22P3q2k21
5007d8mQ0p9M9k6j1K84l22K07j81P6p6j6L2N5l8k36K77Q8j01j69K20j9k2J76k82
$$ plain form
5033 -86 -19 32 -29 -97 22 64 118 -209 150 64 -111 -8 -16 -140 -171 -103 -181 262 149 53 147 342 -161 93 189
5058 189 -139 -46 -18 258 -54 -25 180 -183 174 -59 -95 -262 56 -29 -170 186 -87 5 -258 165 126 6
5080 6 118 55 214 78 -235 -467 209 -36 1 -53 -173 119 77 43 -212 5 -276 -1 11 47 110 -185 87
5103 87 -84 -210 136 -176 160 -88 -21 205 -183 55 -240 52 102 -215 -152 -228 74 153 -215 132 159 -68
5125 -68 -36 13 87 105 58 33 -57 39 -51 147 89 111 23 -182 108 45 145 -102 117 -16 -288 -65 121 132 35
5150 35 -143 -63 -274 123 -144 -142 -255 55 -70 -30 -41 -96 92 -59 -85 -91 -202 -32 -163 -38 -149 49 242
5173 242 170 10 -264 -12 63 -91 -106 -265 107 -85 -136 159 -87 355 -72 75 219 77 -121 69 113 237
5195 237 -1 -68 88 -31 4 -3 -156 -108 214 124 -134 -176 83 95 -110 58 -217 83 125 -254 106 -147 -67
$$ packed form
5033h6O7N1o1o8J19M2N4l27L59q6j75J03qj24l1O8p8M43j13r6R4J95n03K54R6
5058A89l28R3K8K76l12K9K05l63L57k33l6j67L18q5j41L56k73R2k63M23l9j20
5080FJ12o3J59j36l13k32O76k45L7n4j20K92m2l4k55K17k81K75J2L6O3k95K72
5103H7j71j26L46l12L36k48O7K26l88K38k95K92N0l17O3p6L02P9l68L47K7k27
5125f8L2M9P4J8m7k5r0R6r0J98n8K2q8k05K90o3J00k47K19j33k72K23J86J1r7
5150C5j78Q0k11L97k67Kj13L10j25M0j1n5J88j51k6oj11J70j31J25j11J98J93
5173B42p2j60k74K52P5j54j5j59L72j92n1K95k46M42m27J47J44j42j98J90M4J24
5195B37k38o7J56j19L5pj53M8L22r0k58m2K59J2k05J68k75L00M2l79L60k53Q0
$$ plain form
5218 -67 -104 25 107 210 89 -183 3 -213 138 353 143 124 -229 136 -269 52 -81 79 152 -279 -46 61
5240 61 128 -133 -68 -171 238 -156 38 46 -78 -288 295 186 -49 -92 -62 -183 -88 74 -189 -143 8 124 -232
5263 -232 -166 59 79 101 176 -285 58 166 -285 -256 -293 75 -145 -69 -120 -62 -113 45 -26 4 -8 92 -10 65 23
5288 23 -85 5 71 -387 -227 -138 -347 -86 203 127 313 -99 -20 136 44 10 -27 20 40 218 137 -56 -154 161
5312 161 22 -132 3 -194 -126 -15 122 37 140 -42 -202 11 16 23 115 23 215 -221 59 -45 -126 -61 -146 67
5336 67 -176 -5 -158 -94 -35 -106 78 56 -2 -87 170 80 -362 -165 44 155 88 258 129 77 -225 -366 74
5359 74 172 -142 -17 186 -100 261 -188 -113 -12 -286 -65 22 51 224 152 41 -16 313 -10 44 -71 -38 46
5382 46 -129 263 -34 -52 289 -79 -115 -88 190 -70 -9 263 54 146 31 -107 386 -120 -145 374 59 209
$$ packed form
5218f7l7J29Q2J03j21k72J86k16L51K15k10j9l53L65m05L21j33J60P3m31K33J07
5240F1O7k61O5j03M09l94J94Qj24k10N83j09k35m3L0j21R5J62k63M6J51J16l56
5263b32O6K25K0K2P5m61L43J08m51K9l7L68k20P6n1N8n1J58p1L0j2J00j02P5m2
5288B3j08R0O6m58J60Q9k09K61K89p6J86m12P9J56r2l4l7M7K0J78q1j93r8L15
5312A61j39j54J35j97O8J11J37q5J03j82j60K13NPR2r2J92m36K80j04q1O5q5K13
5336F7k43J71j53O4N9p1J84k2n8q5K57r0m42J97K09J11o7J70j29n2l02j41M40
5359G4R8l14J25K03k86L61m49P5J01k74K21Q7K9J73p2j11n7L29l23N4j15L3Q4
5382D6j75L92k97j8L41l68l6K7K78k60O1K72k09R2j15j38M93n06k5N19l15J50
$$ plain form
5404 209 3 93 50 11 61 -197 50 73 109 -220 95 -167 -191 -21 138 32 -213 -111 -128 -163 52 -80 -127
5427 -127 -17 124 3 10 81 -151 108 177 160 -80 -25 165 71 -80 -188 -185 -245 -39 -317 81 65 -133 69 -214
5451 -214 64 -295 129 -37 -58 -116 76 70 10 6 -16 -272 13 -51 115 1 -18 -68 16 -9 -127 -127 -28 -187 102
5476 102 -414 190 -134 -54 -90 126 144 177 -51 105 76 -21 91 -77 -46 -118 -471 -65 -27 14 53 -111 -80 2
5500 2 -5 -5 113 70 -48 101 120 -35 -104 -93 -24 100 48 44 290 13 358 147 59 -175 297 -169 66 -289 -54
5525 -54 162 79 290 -94 5 -20 149 101 -21 42 -104 -119 -33 -197 -55 -281 190 232 96 -156 -154 75 127 -128
5549 -128 71 -89 51 -11 113 65 133 61 -177 399 -143 118 -127 -96 -47 -200 -142 -15 -226 -82 -44 -16 1
5572 1 -140 -194 -65 -154 -233 126 75 300 83 152 -22 -373 -7 -124 -136 -16 -163 203 223 198 -207 55 -136
$$ packed form
5404B09k06R0m3l9N0k58K47K3L6l29L15k62k4J70J59j06k45J02j7l5K15j32m7
5427a27J10J41j21PP1k32K59O9j7k40N5J90r4j51j08Lo0K06k78L98j6j98K02k83
5451b14K78l59M24j66k1n8J92oo0mk2k56K85o4J66j14j9n0Q4k5j18%R9j59K89
5476A02n16O04l24Q0l6K16J8L3k28J56k9r7J12j68L1p2l53M06L8M1L9j64L1Q2
5500Bp%J18m3j18J49J9j55o9J1O9J24n2mK46k77L45k11q8k34M72m66K35l55K35
5525e4K16q3K11l84R9k5J69m8j22O3j46j5Q6j64J42k26M71M2j36k52KK29N2k55
5549a28J99j60J40o2J24m8O8p2k38N76n42K61k45L1M9j53N8J27k11J44L8K8J7
5572Aj41n4J29q9p9L59n1K25k17O9j74l51L66j17j2J20j47L66K0k5m05K62j91
$$ plain form
5595 -136 376 -75 -43 -201 -65 25 102 88 -115 83 -405 -15 -66 73 341 28 -96 97 -162 -110 86 -132
5617 -132 -122 -39 -142 -29 63 23 -56 59 44 254 -5 164 -7 -4 134 -17 6 -48 118 -72 -106 -283 98 151
5641 151 46 67 112 -214 -4 -256 -136 -216 85 44 27 -93 -33 56 -134 62 -143 -108 -169 -245 170 -117 -14
5664 -14 138 152 -117 -330 -338 -135 187 110 -92 -51 9 191 203 -17 18 63 -144 0 178 -161 -242 -27 1 -190
5688 -190 100 205 -148 23 95 -49 -67 -79 41 4 -40 -364 -54 40 122 82 62 -51 -73 -153 154 -305 33 -221
5712 -221 71 111 -67 139 -17 -66 -88 -85 -182 23 -113 -248 227 159 35 -112 -101 53 58 114 15 -230 77 -81
5736 -81 0 162 -65 88 -9 9 30 122 -44 1 -62 -7 99 56 -223 -108 98 -246 -344 -287 12 -124 121 196
5760 196 -236 129 -137 -6 -115 -145 32 -21 -159 -229 172 9 -26 64 -71 38 142 -15 187 -107 186 20
$$ packed form
5595a36N12m51L2j58J36R0P7j4k03J98m88L90n1J39K68l13j24J93k59N2J96k18
5617a32J0Q3j03J13R2m0p9J15j5K10k59J69j71LJ38j51K3n4J66j90l4j77L81N3
5641A51j05K1M5l26K10k52J20q0L01m1j7j20O0Q9j90J96k05L5o1p6M15k87J03
5664a4J52J4k69k13qK03L22p7k02M1O0J82J2k20L5M5k07J44J78l39q1K15K8j91
5688a90K90J05l53J71P2j44j8j2J20l7m4l24L10R4Q2m0k0j13k2q0L07m59L38k54
5712b21K92M0j78K06j56m9k2Lr7K05j36j35M75o8j24j47J1J54NN6r9k45L07j58
5736h1Q1J62k27J53r7J8K1R2j66M5o3N5J06m3k79J15K06l44r8N7K99j36K45P5
5760A96m32L65k66J31j09l0J77n3j38p0M01j63l5R0j35J09J04j57K02k94K93j66
$$ plain form
5782 20 -30 -65 325 -4 -327 61 -41 83 -197 -58 287 11 -43 42 -202 -147 165 228 248 156 -213 -83 84
5805 84 22 -84 233 9 -88 115 3 -3 -45 -9 6 63 -154 117 127 57 132 279 -40 -120 -221 -255 0 -125 30
5830 30 282 15 -284 55 -150 -92 82 -133 -154 279 -143 -15 -95 66 9 -169 35 74 132 -52 -123 -25 111
5853 111 -329 137 392 30 97 62 -60 39 -44 -63 121 86 -166 -278 22 88 -152 232 101 26 -68 16 46 -47
5877 -47 204 154 49 -82 211 -165 -24 215 34 -2 -130 146 -20 -131 -15 -100 -114 129 -10 201 111 -239
5899 -239 75 -51 -91 -40 93 316 175 52 -9 -204 61 185 -21 133 96 -55 -157 -196 141 -108 -42 25
5921 25 -140 111 -164 -119 -51 -114 320 66 19 255 -113 -19 -16 60 188 -140 143 -148 242 -167 6 219 34
$$ packed form
5782B0n0l5L90l29l23L88j02J24k80J39L45k76n4Q5k44N5L12O3K0r2l69J30J67
5805H4o2j06L17k24r7K03j12om2L6J5N7k17K71J0p0P5J47l19q0j01l4K55j25J55
5830C0K52k67k99L39k05N8J74k15k1M33m22J28q0J61n7j78K04L9N8j84p1R8J36
5853A11m40M66K55l62O7l5j22R9q3j9J84l5k52j12L00O6k40L84j31p5r4Q4L0r3
5877d7K51n0j05j31K93l76J41K39j81l6j28K76j66j11J16q5j4K43j39K11r0l50
5899b39L14j26m0N1J33K23j41j23o1j95K65J24k06J54l7j51j02l9L37k49O6O7
5921B5j65K51k75M5O8o3M34k54m7K36l68R4LP6J28l28K83k91L90m09J73K13j85
$$ [...]
8191a08
##END NTUPLES=NMR FID
##END=
