##TITLE=1H_Pr dep07
 CDCl3
 8 sc, 
 7.07.2022
##JCAMPDX= 6.0         $$ Bruker NMR JCAMP-DX V2.0
##DATA TYPE= NMR FID
##DATA CLASS= NTUPLES
##ORIGIN= UXNMR, Bruker Analytische Messtechnik GmbH
##OWNER= root
$$ XWIN-NMR		Version 3.5
$$ Thu Jul  7 14:14:47 2022 Russian Standard Time (UT+4h)  she@DPX200
##.OBSERVE FREQUENCY= 200.1313499994
##.OBSERVE NUCLEUS= ^1H
##.DELAY= (6, 6)
##.ACQUISITION MODE= SIMULTANEOUS
##.ACQUISITION SCHEME= undefined
##.AVERAGES= 8
##.DIGITISER RES= 18
##SPECTROMETER/DATA SYSTEM= spect
##.PULSE SEQUENCE= zg30
##.SOLVENT NAME= CDCl3
##.SHIFT REFERENCE= (INTERNAL, CDCl3, 0, 15.7039)
##AUDIT TRAIL= $$ (NUMBER, WHEN, WHO, WHERE, WHAT)
$$ ##TITLE= Audit trail, XWIN-NMR		Version 3.5
$$ ##JCAMPDX= 5.01
$$ ##ORIGIN= Bruker BioSpin GmbH
$$ ##OWNER= she
$$ F:/spectra/data/she/nmr/H-F/1/audita.txt
$$ ##AUDIT TRAIL=  $$ (NUMBER, WHEN, WHO, WHERE, WHAT)
(   1,<2022-07-07 14:13:23.54 +0400>,<she>,<DPX200>,
      <created by zg, POWCHK disabled, PULCHK disabled
       configuration hash MD5:
       00 E9 B6 7A A2 85 ED C7 34 08 36 98 17 FE 4E 26
       data hash MD5: 16K
       56 73 70 37 B2 8B 85 3A 97 D3 5C A2 04 34 9A 95>)
$$ ##END=
$$ 
$$ hash MD5
$$ 73 4D A0 9C 9A F7 45 E2 0D F3 7F 01 FD 51 B5 F7
##$RELAX= 
##$RELAX= 
##$RELAX= 
##$RELAX= 
##$RELAX= 
##$RELAX= 
$$ Bruker specific parameters
$$ --------------------------
##$DU= <F:/spectra>
##$EXPNO= 1
##$NAME= <H-F>
##$PROCNO= 1
##$TYPE= <nmr>
##$USER= <she>
##$AMP= (0..31)
100 100 100 100 100 100 100 100 100 100 100 100 100 100 100 100 100 100 
100 100 100 100 100 100 100 100 100 100 100 100 100 100 
##$AQSEQ= 0
##$AQ_mod= 1
##$AUNM= <au_zg>
##$AUTOPOS= <>
##$BF1= 200.13
##$BF2= 200.13
##$BF3= 200.13
##$BF4= 200.13
##$BF5= 200.13
##$BF6= 200.13
##$BF7= 200.13
##$BF8= 200.13
##$BYTORDA= 1
##$CFDGTYP= 0
##$CFRGTYP= 5
##$CHEMSTR= <none>
##$CNST= (0..31)
1 1 145 1 1 1 1 1 1 1 1 1 1 1 1 1 1 1 1 1 1 1 1 1 1 1 1 1 1 1 1 1 
##$CPDPRG= <>
##$CPDPRG1= <>
##$CPDPRG2= <>
##$CPDPRG3= <>
##$CPDPRG4= <mlev>
##$CPDPRG5= <mlev>
##$CPDPRG6= <mlev>
##$CPDPRG7= <mlev>
##$CPDPRG8= <mlev>
##$CPDPRGB= <>
##$CPDPRGT= <>
##$D= (0..31)
0 1.2 0 0 0 0 0 0 0 0.06 0 0.03 0 0 0 0 0.0002 0 0 0 0 0 0 0 0 0 0 0 0 
0 0 0 
##$DATE= 1657188803
##$DBL= (0..7)
120 120 120 120 120 120 120 120 
##$DBP= (0..7)
150 150 150 150 150 150 150 150 
##$DBP07= 0
##$DBPNAM0= <>
##$DBPNAM1= <>
##$DBPNAM2= <>
##$DBPNAM3= <>
##$DBPNAM4= <>
##$DBPNAM5= <>
##$DBPNAM6= <>
##$DBPNAM7= <>
##$DBPOAL= (0..7)
0.5 0.5 0.5 0.5 0.5 0.5 0.5 0.5 
##$DBPOFFS= (0..7)
0 0 0 0 0 0 0 0 
##$DE= 6
##$DECBNUC= <off>
##$DECIM= 32
##$DECNUC= <off>
##$DECSTAT= 4
##$DIGMOD= 1
##$DIGTYP= 9
##$DL= (0..7)
0 120 120 120 120 120 120 120 
##$DP= (0..7)
150 150 150 150 150 150 150 150 
##$DP07= 0
##$DPNAME0= <>
##$DPNAME1= <>
##$DPNAME2= <>
##$DPNAME3= <>
##$DPNAME4= <>
##$DPNAME5= <>
##$DPNAME6= <>
##$DPNAME7= <>
##$DPOAL= (0..7)
0.5 0.5 0.5 0.5 0.5 0.5 0.5 0.5 
##$DPOFFS= (0..7)
0 0 0 0 0 0 0 0 
##$DQDMODE= 0
##$DR= 18
##$DS= 0
##$DSLIST= <SSSSSSSSSSSSSSS>
$$ [...]
##$SUBNAM2= <"">
##$SUBNAM3= <"">
##$SUBNAM4= <"">
##$SUBNAM5= <"">
##$SUBNAM6= <"">
##$SUBNAM7= <"">
##$SUBNAM8= <"">
##$SUBNAM9= <"">
##$SW= 18.0517283424941
##$SWIBOX= (0..15)
0 0 2 0 0 0 0 0 0 0 0 0 0 0 0 0 
##$SW_h= 3612.71676300578
##$TD= 16384
##$TD0= 1
##$TE= 0
##$TE2= 300
##$TE3= 300
##$TEG= 300
##$TL= (0..7)
0 120 120 120 120 120 120 120 
##$TP= (0..7)
150 150 150 150 150 150 150 150 
##$TP07= 0
##$TPNAME0= <>
##$TPNAME1= <>
##$TPNAME2= <>
##$TPNAME3= <>
##$TPNAME4= <>
##$TPNAME5= <>
##$TPNAME6= <>
##$TPNAME7= <>
##$TPOAL= (0..7)
0.5 0.5 0.5 0.5 0.5 0.5 0.5 0.5 
##$TPOFFS= (0..7)
0 0 0 0 0 0 0 0 
##$TUNHIN= 0
##$TUNHOUT= 0
##$TUNXOUT= 0
##$USERA1= <user>
##$USERA2= <user>
##$USERA3= <user>
##$USERA4= <user>
##$USERA5= <user>
##$V9= 5
##$VALIST= <valist>
##$VCLIST= <CCCCCCCCCCCCCCC>
##$VD= 0
##$VDLIST= <DDDDDDDDDDDDDDD>
##$VPLIST= <PPPPPPPPPPPPPPP>
##$VTLIST= <TTTTTTTTTTTTTTT>
##$WBST= 1024
##$WBSW= 4
##$XGAIN= (0..3)
0 0 0 0 
##$XL= 0
##$YL= 0
##$YMAX_a= 94740
##$YMIN_a= -128715
##$ZGOPTNS= <>
##$ZL1= 120
##$ZL2= 120
##$ZL3= 120
##$ZL4= 120
##$ABSF1= 10
##$ABSF2= 0
##$ABSG= 5
##$ABSL= 3
##$ALPHA= 0
##$AQORDER= 0
##$ASSFAC= 0
##$ASSFACI= 0
##$ASSFACX= 0
##$ASSWID= 0
##$AUNMP= <proc_1d>
##$AZFE= 0.1
##$AZFW= 0.1
##$BCFW= 1
##$BC_mod= 2
##$BYTORDP= 1
##$COROFFS= 0
##$CY= 11.3945322036743
##$DATMOD= 1
##$DC= 2
##$DFILT= <>
##$DTYPP= 0
##$F1P= 2.36226072786647
##$F2P= -0.459571619588291
##$FCOR= 0.5
##$FTSIZE= 0
##$FT_mod= 4
##$GAMMA= 1
##$GB= 0.15
##$INTBC= 1
##$INTSCL= 1
##$ISEN= 128
##$LB= 0.24
##$LEV0= 0
##$LPBIN= 0
##$MAXI= 10000
##$MC2= 0
##$MEAN= 0
##$ME_mod= 0
##$MI= 1.114404
##$NCOEF= 0
##$NC_proc= 0
##$NLEV= 6
##$NOISF1= 3.799351
##$NOISF2= 2.8
##$NSP= 1
##$NTH_PI= 0
##$NZP= 0
##$OFFSET= 15.70392
##$PC= 1
##$PHC0= -18061.67
##$PHC1= 13.00068
##$PH_mod= 1
##$PKNL= yes
##$PPARMOD= 0
##$PSCAL= 0
##$PSIGN= 0
##$REVERSE= no
##$SF= 200.130013532006
##$SI= 16384
##$SIGF1= 3
##$SIGF2= 2
##$SINO= 400
##$SIOLD= 16384
##$SREGLST= <1H.CDCl3>
##$SSB= 0
##$STSI= 0
##$STSR= 0
##$SW_p= 3612.71676300578
##$SYMM= 0
##$S_DEV= 0
##$TDeff= 0
##$TDoff= 0
##$TI= <>
##$TILT= no
##$TM1= 0
##$TM2= 0
##$TOPLEV= 0
##$USERP1= <user>
##$USERP2= <user>
##$USERP3= <user>
##$USERP4= <user>
##$USERP5= <user>
##$WDW= 1
##$XDIM= 8192
##$YMAX_p= 0
##$YMIN_p= 0
$$ End of Bruker specific parameters
$$ ---------------------------------
##NTUPLES= NMR FID
##VAR_NAME=  TIME,          FID/REAL,        FID/IMAG
##SYMBOL=    X,             R,               I
##VAR_TYPE=  INDEPENDENT,   DEPENDENT,       DEPENDENT
##VAR_FORM=  AFFN,          ASDF,            ASDF
##VAR_DIM=   8192,          8192,            8192
##UNITS=     SECONDS,       ARBITRARY UNITS, ARBITRARY UNITS
##FACTOR=    0.0002768,     1,               1
##FIRST=     0,             0,               0
##LAST=      2.2672688,     0,               0
##MIN=       0,             -128715,         0
##MAX=       2.2672688,     94740,           0
$$ Real data points
##PAGE= N=1
##DATA TABLE= (X++(R..R)), XYDATA
0 0 0 0 0 0 0 0 0 0 0 0 0 0 0 0 0 8 -8 8 -8 8 -8 16 -16 16 -24 24 -32 34 -40 48 -56 63 -72 80 -89 101 -114
37 -114 128 -142 159 -178 195 -219 243 -268 297 -326 361 -396 438 -483 532 -585 646 -712 788
56 788 -875 972 -1085 1218 -1379 1570 -1807 2115 -2525 3107 -3990 5512 -8851 33798 -81512
71 -81512 -116713 70171 84839 -38317 -55951 45358 40421 -29057 -26145 18584 6767 2502
83 2502 21375 -6383 -58325 -14289 64064 31619 -56737 -38817 31399 19424 -31439 -11961
95 -11961 26032 8534 -18873 -8972 -1569 322 21470 23939 -18014 -34768 9145 38253 9189
108 9189 -17238 -4772 9095 3352 -4314 -4267 4639 15288 4057 -25585 -23750 19619 30786 -15255
122 -15255 -33093 7407 17933 -21447 -17113 32015 18202 -40982 -23141 38349 18817 -33972
134 -33972 -4881 41156 2918 -41877 -364 43367 9808 -24518 -3517 11411 -4397 -379
146 -379 16459 -1700 -20400 3337 16253 -15897 -21062 22106 23663 -29704 -33753 21391 26976
159 26976 -20417 -18625 19425 7412 -24482 -3152 27308 4621 -19112 2494 15457 -6487
171 -6487 -8352 17255 14494 -13380 -11449 11312 8340 -7140 -166 8057 -5158 -12722 1672 7674
185 7674 -3246 -4401 1652 -6683 -11151 5639 10960 -7864 -11672 7836 8152 -12180 -6573 17068
199 17068 12714 -11528 -13041 7984 15609 2893 -7019 -2931 6190 7238 -3597 -9120 3697 14150
213 14150 -1052 -19878 -7441 16071 8193 -15464 -10795 7850 2488 -10143 -1233 7891 -2895
226 -2895 -7128 4537 2898 -8395 1887 16089 1296 -16064 -667 17880 4623 -10370 1002
239 1002 10055 -1978 -6686 5563 6107 -5899 -3134 6637 -3837 -13558 3877 15213 -6765 -20691
253 -20691 2059 16249 -5320 -15613 5237 12634 -7251 -11958 6765 10811 -3205 -4628 5622
266 5622 3181 -4026 1887 9260 1894 -6256 140 6717 135 -4390 1813 3949 -3334 -5305 -59
281 -59 1603 -1357 -1853 -1540 -3912 -2588 1737 1502 -2372 -2701 495 1466 -251 -826 1843 4525 2164
298 2164 -3675 -2028 6943 6647 -2553 -4042 4021 5526 -2964 -4404 4559 4884 -5145 -6508 2427
313 2427 3306 -4933 -4314 2762 -966 -7865 -616 6277 -1711 -7132 1763 5990 -3403 -4738 6174
328 6174 6530 -3803 -3850 5739 5144 -2589 -396 6100 1538 -5307 723 6590 -566 -6413 1056 4706
344 4706 -4614 -6964 3599 4203 -6123 -6960 2709 2942 -5412 -3417 4180 2044 -5069 -1870 4599
359 4599 3039 -2415 -455 4363 1641 -2045 1827 5096 564 -2904 1715 3894 -1237 -2810 2329
374 2329 2388 -3066 -4342 334 1901 -2113 -4398 -1056 689 -2176 -2508 300 738 -2415 -936 2752
390 2752 297 -2922 1954 6400 129 -5238 1419 8327 2044 -5295 -367 6736 2687 -4494 -2143
405 -2143 3939 2116 -3799 -2658 447 -822 -1508 594 -1331 -5195 -1448 4217 -126 -6367 -1893
420 -1893 5580 1920 -5244 -1809 5510 4195 -2489 -1851 3444 3278 -292 760 2562 -180 -1110 2478
436 2478 2725 -2455 -3096 2269 2518 -3598 -4323 749 1852 -2221 -3741 -1083 226 -1066 -801 369
452 369 -1305 -2200 1068 3956 205 -3761 1075 6199 2319 -3749 -1215 5301 5111 -1616 -4319 477
468 477 5262 2923 -3957 -5122 996 4279 -519 -6306 -4279 2863 4093 -3588 -7869 -956 6188
483 6188 2229 -5873 -4502 3535 5693 508 -4084 -1525 4675 5552 -899 -4484 680 6706 3707
498 3707 -3980 -4206 3199 5953 -857 -6240 -1458 4261 841 -4395 -3173 189 336 -1011 -1470 -2521
514 -2521 -1664 1840 1857 -2645 -3125 2399 4697 -617 -2962 2520 4615 -453 -1957 3539 4053 -2686
530 -2686 -2398 5268 3834 -5822 -4002 6189 4177 -6866 -6477 4091 4831 -4610 -6633 676 3250
545 3250 -1294 -3456 -948 248 299 1864 519 -3511 -925 6352 4926 -4818 -5172 6295 8919 -2720
561 -2720 -7620 2260 8950 1142 -7309 -2004 5523 2616 -4174 -3694 474 823 -851 -554 -2384 -3837
577 -3837 458 4127 -1434 -7139 -247 7871 1650 -7858 -1771 8540 4476 -6319 -3106 7646
591 7646 4887 -4751 -2025 5968 2286 -4615 -187 5261 -653 -5793 529 4578 -2314 -5820 401
606 401 3235 -2230 -4574 122 1496 -2447 -1318 2052 -152 -3263 808 5138 -542 -4975 1472
621 1472 7258 975 -5306 230 6830 2419 -4102 -1511 3321 2471 -1334 -2069 -484 174 268 -242 -2092
638 -2092 -3404 57 2546 -772 -5268 -2323 4271 2780 -4541 -4062 3544 5250 -1334 -4472 1586
653 1586 5741 1675 -2873 -471 3868 2415 -902 -464 405 609 1063 564 -2111 -2075 1428 1424 -2764 -3622
671 -3622 819 1839 -2481 -3217 568 1313 -1369 -1843 1133 1078 -1006 425 2605 538 -1407 1528
687 1528 3459 156 -2039 1722 3238 -586 -1946 1117 2132 -1131 -1863 430 217 -1805 -1592 5
703 5 -603 -1966 -1077 81 -735 -1771 -150 943 -584 -931 750 1394 -100 -64 1643 1293 363 495
721 495 1662 942 -260 617 1319 335 -1021 -79 941 -158 -1905 -924 803 -384 -2699 -1153 860
738 860 -475 -2427 -1461 1332 213 -1318 -498 1394 1207 -591 172 1466 1428 311 1029 1498 535 243
756 243 1324 995 -899 -172 1322 84 -2000 -676 456 -634 -1900 -801 285 -979 -2144 -286
772 -286 348 -1025 -1407 420 1097 -1127 -876 1781 2037 -525 -453 1968 1847 -487 6 1895 1016 -743
790 -743 156 1096 -113 -1010 66 567 -723 -2022 -395 406 -1381 -2071 -382 380 -1232 -1416 2
807 2 843 -595 -641 677 601 40 641 1199 272 303 1151 1303 393 0 996 1290 -3 -1122 92 1114
827 1114 -569 -1911 -547 930 -728 -2016 -728 412 -519 -1542 -686 481 -38 -778 -152 665 238
844 238 200 1089 1105 -14 442 2146 1037 -789 346 1930 746 -1182 18 1417 -16 -1142 -498
861 -498 511 -620 -1262 -350 -316 -1377 -1415 286 -78 -1886 -721 1454 526 -1502 178 1890 566
878 566 -433 976 1682 222 -235 1375 1141 -251 156 1318 689 -1091 -801 1022 548 -1835 -1584 146
896 146 -59 -1347 -1166 -453 -476 -525 -388 -647 -818 39 752 224 -574 190 1154 1336 79 -267 929 1900
916 1900 844 -916 -290 1681 933 -1079 -790 801 245 -1186 -964 181 -683 -1460 -241 -102 -1536
933 -1536 -1920 539 1025 -1463 -1778 1481 1511 -1225 -834 1917 1213 -584 594 2202 197 -863 1531
950 1531 2095 -643 -1719 1275 2369 -1235 -2403 574 1858 -994 -2338 -367 535 -714 -998 -500
966 -500 -1202 -556 729 332 -1431 -803 1952 1716 -621 -867 1124 1924 788 -339 -321 1389 2058 476
984 476 -1689 -337 2121 974 -2009 -1603 1121 1083 -1707 -1820 -32 -202 -1192 -242 -105 -1168 -645 1311
1002 1311 656 -2021 -420 2613 1134 -1938 -57 2631 1328 -1289 282 2171 548 -815 906
1017 906 1456 -877 -1086 953 712 -1587 -1217 451 145 -1427 -935 -206 -482 -491 -56 -684 -954 603 961
1036 961 -643 -739 1145 1322 175 103 844 592 543 1098 618 -945 263 2279 264 -2374 -868 2788
1054 2788 700 -3579 -1607 2180 287 -2824 -1304 1199 -452 -1943 238 472 -1591 -595 2432
1069 2432 591 -2094 186 3143 593 -2363 478 3645 250 -1707 394 2151 151 -1362 507
1084 507 732 -819 -749 176 -209 -1461 -269 510 -797 -1209 -161 309 -739 -732 126 -25 -253 545 90
1103 90 -78 510 1210 157 -95 1071 1050 -455 -84 1732 373 -1475 -244 1807 35 -2183 -138
1120 -138 1452 -981 -2560 83 1148 -1587 -1916 747 533 -1677 -669 1785 -10 -1945 642 2310
1136 2310 -469 -1599 1497 2537 -743 -1117 1856 1771 -1219 -878 1561 480 -1355 -225 1181 -635
1152 -635 -1755 299 766 -1246 -1323 516 370 -1762 -803 956 -66 -1133 -209 1023 -51 -258 887
1169 887 840 153 582 1334 476 -56 833 956 -234 -288 1010 561 -876 -25 552 -356 -1214 -307 111 -1108
1189 -1108 -1036 362 -264 -1550 -118 784 -263 -1111 661 1148 -597 -665 1705 1150 -785 122 1695
1206 1695 701 -872 617 1487 -315 -1199 623 1277 -1177 -1301 883 606 -1799 -1005 862 -366 -1566
1223 -1566 -253 695 -741 -1254 511 1023 -762 -605 1233 892 -859 137 1677 638 -792 991
1239 991 1633 -123 -586 789 811 -850 -591 782 16 -1272 -484 394 -460 -1381 -194 124 -1176 -710
1257 -710 35 -248 -599 3 327 -282 -243 550 751 -146 16 987 682 65 663 941 191 -330 525 620 -531
1278 -531 -463 531 -180 -1120 -408 404 -649 -1182 -126 -38 -1030 -699 335 -35 -808 47 886 -131 -794
1297 -794 593 1138 11 -419 1179 999 -197 48 1172 550 -585 -184 1169 -204 -1001 133 457
1314 457 -971 -996 -45 -70 -1063 -849 288 -132 -1033 -44 574 -1 -715 215 548 -96 -209 742 966 143
1334 143 283 918 849 -60 457 703 12 -368 237 356 -477 -488 5 -419 -684 -236 -313 -689 -505 -300 -581
1355 -581 -675 -199 296 -65 -466 361 569 106 79 717 695 194 458 710 396 -152 165 387 17 -386 47
1376 47 283 -434 -541 -238 -210 -678 -278 -229 -511 -652 -151 -152 -429 -244 266 330 -2 243 657 346 126 254
1398 254 671 189 -16 596 244 -141 -32 553 191 -502 -149 153 -288 -598 -479 -108 -495 -667 87 -160
1418 -160 -836 -261 87 16 -353 -460 507 652 104 231 816 510 2 123 929 252 -33 353 418 254 -389
1439 -389 184 305 -148 -654 -354 225 -344 -1057 -429 213 -433 -911 -325 503 -120 -300 84 459 236 -273
1459 -273 302 726 134 364 646 647 50 11 705 516 -238 -188 483 371 -417 -669 192 279 -546 -616 -155 -233
1481 -233 -479 -745 -150 -67 -486 -325 114 169 -194 303 902 384 -318 194 856 436 -360 135 804 324 -543
1502 -543 -95 473 -79 -666 -118 -80 -611 -773 -278 88 -708 -931 -118 18 -505 -545 294 24 -351 -17 168
1523 168 302 -97 118 796 438 13 441 676 297 -111 166 469 150 -296 -215 62 -45 -424 -349 -251 -338
1544 -338 -608 -419 -96 -84 -444 -270 27 141 -222 41 325 167 48 214 807 480 -61 536 522 596 -40
1565 -40 471 496 -23 -190 -41 -44 -217 -536 -246 22 -608 -423 -377 -179 -722 -289 73 -58 -287 -14 77 57
1587 57 34 318 413 196 58 344 526 368 142 236 335 395 161 120 14 -59 -199 -200 -351 -238 -493 -507 -326 -129
1611 -129 -98 -539 -148 139 -53 -76 190 253 119 -76 393 403 219 93 565 302 30 47 584 70 -169 366
1633 366 257 17 -502 -80 115 -296 -657 173 -18 -384 -571 -1 -94 -451 -312 8 -87 -113 300 257 401
1654 401 55 308 511 376 194 491 258 208 302 210 71 124 -208 -24 -257 -193 -265 -236 -239 -26 -250 -402 -90
1677 -90 -133 -301 -353 223 121 -107 138 561 261 -49 211 573 386 58 316 473 74 -207 19 660 -75
1698 -75 -438 76 133 -549 -534 -47 -103 -350 -406 52 -412 -602 -215 85 39 -109 101 556 -83 -53 511 353
1720 353 326 228 433 361 144 3 651 13 -133 104 187 -137 -63 -74 -255 -386 -457 -106 -116 -416 -173 -170 -289
1743 -289 -235 31 17 -36 -70 84 77 -195 339 324 98 265 407 247 216 90 424 158 63 247 17 -191 -323
1766 -323 -173 -143 -266 -360 -307 -219 -404 -196 -298 -241 -342 75 -63 225 108 152 255 0 403 407 360 217 362
1789 362 76 281 173 312 28 -86 -144 -140 -29 -146 -6 -154 -364 -354 -99 -210 -331 -352 -55 -111 -308 -143
1811 -143 180 87 -160 0 550 125 53 257 581 28 6 321 493 185 -44 343 137 -233 -457 -225 -123
1832 -123 -182 -338 -249 -156 -460 -314 186 11 -253 -121 23 139 -217 131 218 288 62 171 237 384 171 141
1854 141 396 409 -31 -40 140 12 -141 -175 -50 64 -354 -224 -145 -239 -285 -245 -11 -38 -298 -33 238 142 -458
1877 -458 219 159 8 -87 279 627 300 229 329 533 172 50 66 72 -176 -67 19 -78 8 -378 -482 -186 -237
1900 -237 -161 -207 -335 -478 -187 -326 -158 78 -229 273 179 161 413 305 276 361 105 6 248 100 -41 108
1922 108 1 129 -48 314 -91 -144 -350 -344 -141 -348 -415 -244 68 -135 -262 -66 388 -164 -83 92 209 -70
1944 -70 18 322 446 244 103 426 383 52 6 262 177 -66 -33 247 -158 -657 -250 -175 104 -589 -457 -238
1966 -238 -241 -201 -106 55 -242 -8 -17 270 133 213 151 580 -3 300 96 332 215 -134 234 324 -94 -238 -14
1989 -14 35 -142 -480 -117 -129 -325 -409 -418 -124 -267 -520 -100 68 -89 -15 28 244 -34 89 350 255 150 182
2012 182 469 377 190 -34 271 300 -98 -104 249 142 -218 22 -33 -109 -358 -153 60 -200 -314 -253 59 -289
2034 -289 -179 78 64 -35 -82 192 102 228 7 289 367 208 15 252 227 123 52 190 138 -98 -141 -124 -84 -248
2058 -248 -302 -224 -25 -315 -132 -416 36 -93 -53 59 36 -61 -177 277 290 178 102 237 265 138 8 361 324
2081 324 13 202 185 118 -269 -143 130 -277 -408 -193 -150 -503 -266 156 9 -263 -246 132 -28 -198 28
2102 28 82 -141 145 137 241 78 314 479 96 157 171 285 64 55 207 130 -324 -401 133 -223 -291 -374 -53 -349
2126 -349 -367 167 -198 -355 -138 397 145 -369 -111 155 29 -19 169 514 160 126 609 263 -150 73 230
2147 230 141 -94 48 254 -58 -274 101 -85 -316 -318 5 -178 -131 -264 -47 -270 -240 110 155 67 117 160 253
2170 253 98 141 350 115 92 272 196 117 236 235 271 -166 -98 141 -89 -546 84 -75 -309 -183 32 -120 -370
2193 -370 -130 208 -212 -361 -20 -35 -21 177 220 163 36 145 272 155 201 280 378 184 34 239 360 -22
2215 -22 -288 40 83 -239 -187 -47 -276 -378 -87 -17 -194 -287 -2 -326 -44 -89 232 -221 -18 393 375 -91
2237 -91 5 226 338 38 -46 134 16 -156 32 257 -224 -46 193 -61 -200 -329 52 -223 -551 -184 202
2258 202 -153 -448 133 173 -68 35 328 238 -189 -3 426 269 -169 201 320 4 139 354 76 -92 17
2279 17 98 -6 -370 3 8 31 -351 -1 -66 -368 -154 3 -109 -354 -192 86 -164 -224 53 182 -70 47
2301 47 463 122 -66 111 340 229 -267 243 389 92 -41 133 78 -334 -181 162 -187 -384 58 -36 -470
2322 -470 -350 -171 36 126 26 -61 230 -143 -61 50 37 110 476 101 -138 253 58 40 75 180 217 131 -326
2345 -326 121 80 -228 -247 -215 -194 -102 41 -95 -264 -318 110 71 6 134 31 73 -118 -166 414 304 -107 109
2368 109 335 326 -124 -29 516 88 -109 220 76 -34 91 -78 3 -139 -316 -101 -267 -303 -75 63 -90 -210
2390 -210 165 -96 -96 8 35 0 -2 332 338 -39 62 330 62 -55 190 148 -102 100 -70 -84 -184 -183 30 -105
2414 -105 -236 46 158 -227 -309 -12 -67 -425 -217 212 -187 -104 177 212 183 -107 176 180 18 188 314 122
2436 122 55 -260 -68 -48 -249 -113 -180 44 -440 -40 56 -174 -226 -119 -139 -192 76 -53 -133 -282 7 -8 -282
2459 -282 352 327 84 7 152 222 -163 254 53 158 260 42 119 178 -175 85 81 -28 -84 -221 37 -382 -399
2482 -399 -141 -10 -378 -353 -70 25 -67 -17 105 114 -22 181 259 277 151 337 439 125 189 -38 235 8 -8
2505 -8 -129 -168 -73 -5 -272 39 -53 -268 -325 -99 -128 -321 -78 -295 7 -233 -54 -51 -150 -90 -85 147 -62 200 36
2530 36 202 316 200 243 -40 -47 149 25 114 -7 88 -14 -76 -225 -294 -74 -95 -222 -26 -234 -404 2 -343
2553 -343 50 -53 195 197 -44 -191 279 96 73 373 317 146 101 52 -42 134 -31 45 29 -207 -137 -32 -22 -155
2577 -155 -180 -56 -13 20 -199 -248 77 75 134 -87 -78 68 217 275 273 102 -60 38 292 332 370 146 198 250 -39 -21
2603 -21 -57 -30 -11 -25 -319 -141 -109 135 -60 -237 -281 -175 -34 -62 -81 14 -64 -78 64 99 -30 -4 173 300 15
2628 15 148 -22 168 93 -51 98 100 -160 -330 -251 -157 -167 -70 -27 -139 -117 -66 -79 -60 -171 -13 -41 63 229 0
2653 0 262 244 178 163 -29 -4 171 -205 38 8 141 -123 152 81 -131 -96 -59 99 -169 36 45 -125 -505 -83
2677 -83 32 -335 -355 -45 30 98 -160 248 195 -104 111 336 222 191 138 177 204 -81 150 130 162 -36 124 -113
2701 -113 -126 -157 34 27 72 61 -103 -38 -140 -72 136 -315 69 212 123 -145 251 29 187 90 61 -8 7 72 78
2726 78 -13 -43 146 43 -164 -211 265 42 -299 -1 -191 -387 -106 138 -160 32 -307 85 102 -175 -127 -110
2748 -110 -21 129 -1 248 30 68 14 73 22 142 331 400 103 110 -22 57 39 -110 -125 -5 113 -274 -45 -81
2772 -81 -69 -46 -214 -28 170 -208 17 93 -107 32 -25 -172 101 234 70 -68 142 188 -9 138 363 -23
2794 -23 -80 -67 158 -223 111 -22 130 -226 -144 74 230 -168 -253 58 -99 -245 -20 -46 212 -4 38 205
2816 205 -24 222 249 192 83 81 231 251 -24 77 -49 -123 -124 -53 -171 219 -196 6 -95 -207 -161 -209 -89 0
2840 0 10 -352 -85 -3 -32 -25 -175 131 50 -71 349 278 140 146 281 390 -5 147 243 184 2 121 -22 89
2864 89 -140 -371 -145 -67 -316 -165 -47 -19 -208 208 -26 -257 0 129 -12 -171 74 -9 96 -266 -42
2885 -42 500 81 -99 1 34 -246 85 -39 95 219 -86 -46 56 29 -153 -249 94 73 -30 -75 31 81 -347
2908 -347 -85 71 28 67 -158 8 -2 122 76 202 342 85 59 50 35 109 -44 39 11 -99 -130 16 -330 -212
2932 -212 -161 23 -208 -325 161 -34 55 -260 -159 194 -98 90 249 314 -21 -36 388 29 -200 108 295
2953 295 233 -230 -79 95 -65 79 -87 -46 40 -118 121 -301 97 -231 -259 37 -144 59 -92 -97 -145 202
2975 202 -20 -67 158 264 156 -27 30 85 208 40 184 94 184 377 -46 -137 113 135 -40 -270 42 87 -119
2998 -119 -110 -285 -45 -78 -88 74 3 70 196 79 59 -121 69 72 257 227 7 46 192 53 -13 -75 -80 -165 84
3023 84 -3 0 -117 -85 -60 -115 -237 25 75 -76 -182 5 -220 111 -184 6 76 -61 -38 29 227 31 -62 63
3047 63 109 157 9 36 226 21 224 85 -61 220 -32 -45 -142 -80 -209 22 -64 -253 -156 53 -296 -108 117
3070 117 -65 -40 176 76 44 -23 -13 218 90 99 -75 169 109 256 -83 -9 36 83 61 249 -37 -460 -153 -29
3094 -29 -165 -79 -96 -201 -27 -119 -160 62 -46 -295 17 60 34 -74 -163 247 -31 -10 17 -31 244 133 161 -73
3118 -73 -384 3 -58 -9 -247 -249 -250 211 -259 -184 -45 -374 -62 -135 106 29 -280 21 -5 -3 -39 -122 276 -63 -175
3143 -175 197 74 93 166 12 18 42 -81 -42 -37 104 129 147 42 52 69 94 66 -155 -225 178 -154 36 -22 29 -139
3169 -139 184 -56 109 -43 -162 62 -145 203 -230 332 23 8 -96 13 15 76 -66 -88 -73 -118 -28 34 -71
3192 -71 -245 45 -253 -196 62 48 -27 -64 50 -7 -86 -250 -30 205 -87 46 320 178 18 200 63 98 -90
3215 -90 25 -141 60 144 -64 99 -180 -201 90 -3 -100 76 57 -187 18 38 31 -166 -72 80 216 39 141
3238 141 123 197 -21 204 269 49 -28 372 -5 -35 -151 -18 107 -76 -10 28 126 -196 -205 -9 -63 17 -133 -251
3262 -251 -20 -109 -37 262 49 -71 225 111 -61 311 27 313 -156 284 272 143 156 83 112 -351 -60 -88
3284 -88 53 -92 -50 -54 -117 32 94 -18 -184 -7 151 -73 -171 -95 -32 -68 178 125 144 -76 228 169 129 -95 366
3309 366 40 -24 -250 -162 -38 -7 62 48 -93 -230 -110 -205 189 -111 -77 -23 1 -207 195 -51 -126 112 -41
3332 -41 -117 -36 166 -118 -21 147 76 -15 266 74 -59 126 101 -170 88 -173 -11 -71 -11 -150 32 -61 104
3355 104 -90 -22 122 -30 25 125 -39 -84 56 137 -107 84 66 194 -22 -121 -58 105 164 103 296 81 110
3378 110 17 47 -98 -141 -52 241 -2 -150 -70 42 -220 52 -185 256 136 -226 24 -19 52 -66 0 198 30
3401 30 23 77 -144 20 -91 138 -105 -85 90 -140 223 192 110 -74 -46 133 -114 143 159 -35 -98 -169 32 -110
3425 -110 -174 110 45 37 -324 -12 219 -26 -34 219 -29 -12 299 195 18 111 76 189 -101 -197 -28 -71 37 -195
3449 -195 84 -47 -114 -142 -11 56 -286 47 158 -103 -31 54 -105 -2 -173 66 -21 40 -76 -18 -56 154 -6
3472 -6 181 74 87 207 -51 72 73 245 -42 8 58 -101 154 -20 -372 14 -16 76 7 -122 48 32 148 88
3496 88 159 163 -64 -89 75 46 23 -101 122 13 140 -5 131 -33 -68 55 -21 63 83 58 105 -230 -114 -224
3520 -224 -120 185 -96 62 46 64 -114 -9 40 61 123 116 -143 101 354 -123 199 29 -231 151 -79 -25 -115
3543 -115 32 66 -247 -89 65 29 -4 -13 -6 104 -212 55 -135 89 257 253 182 -100 -21 -76 196 -92 153 151 163
3568 163 127 187 85 59 -122 -67 -114 -120 128 96 -154 -56 -54 141 -27 -300 -153 -40 -24 -178 -26 -287 -80 -114
3592 -114 88 -242 9 151 -55 29 29 6 59 212 191 126 74 77 -131 -85 42 -64 -74 66 -36 99 -113 -177
3616 -177 -164 -230 -2 137 -153 -159 57 233 5 50 26 232 182 76 70 201 151 -158 191 -28 13 194 -185 196
3640 196 -79 -134 -132 -154 208 120 -108 -129 -37 54 -16 -18 30 93 -74 -81 -91 -158 46 83 -12 60 -221 -20 -89 125 80
3667 80 -179 145 -216 -120 40 165 1 0 294 29 -95 -141 -33 -73 9 -273 -95 -207 -3 71 12 20 140 -6
3691 -6 -256 135 -118 -101 -35 89 -147 -50 96 109 -143 139 62 -123 -49 196 22 26 56 -174 -98 -139 -152 -268 -166
3716 -166 -281 -120 -29 -165 68 164 4 -107 25 37 146 252 -49 -101 -221 -171 -96 139 230 136 120 -37 147
3739 147 -74 -17 -18 -122 -119 23 -32 31 37 5 -6 -291 18 -97 -125 -73 -5 -113 90 188 -96 16 71 56 145 129
3765 129 -102 81 -53 -137 63 273 -55 -166 -201 35 -191 -268 217 -125 133 -56 44 30 -287 -10 119
3786 119 -17 255 -89 -137 -163 64 119 141 93 14 71 145 -79 44 -9 18 -8 -129 14 -50 -11 91 181 67 349
3811 349 -189 -44 42 -148 -53 -107 -11 135 95 -19 131 -57 118 -29 43 -121 34 -150 -51 -97 -46 124 -117
3834 -117 -67 -43 75 -91 -159 -184 92 12 -122 -167 93 140 -228 84 55 -55 -64 140 -139 146 -3 -90 289 18
3858 18 23 -66 -46 -250 38 10 237 -246 181 -52 -205 13 -168 130 -91 -132 53 -51 108 -74 -69 164 -162
3881 -162 -41 183 -104 -131 -136 148 -54 190 -6 349 -82 218 -37 -185 66 -106 11 105 -49 -19 14 -119
3903 -119 159 -135 -255 -75 -23 -156 0 -15 58 -116 256 -138 -52 -10 2 116 -56 169 75 146 -151 96 9
3926 9 -7 -203 -103 233 173 -142 -37 60 58 39 21 -59 -208 68 88 -25 -163 -168 118 35 -138 -62 68 304 -4
3951 -4 -95 -54 99 -32 119 91 316 258 -70 108 90 42 -82 211 153 -1 -32 68 -167 -48 -362 32 108 -3
3975 -3 -160 -275 -17 -94 -68 49 130 -52 168 230 116 -51 70 80 -76 -58 -17 -163 -48 -49 71 -12 -308 -45
3999 -45 23 121 -294 37 -80 -80 -37 -65 24 -29 -108 -166 119 106 -120 -68 -152 132 -94 11 134 9 -125 21 -134
4024 -134 -15 252 -173 -138 209 -63 26 -97 -181 -20 -39 -55 155 87 -248 -128 -21 -123 -198 17 25 206 69
4047 69 -6 35 163 22 64 97 171 152 34 150 81 133 -43 79 -89 -117 191 -49 163 12 -10 -64 199 16
4071 16 -51 151 -46 -46 7 -33 166 29 49 -81 92 -18 230 123 -115 -40 -18 214 18 183 -248 108 38
4094 38 -137 -27 -170 -86 93 -264 -53 121 22 -110 -113 -93 -105 15 2 32 140 -122 -19 -162 188 13 -63
4117 -63 40 300 -67 101 104 -31 -87 7 106 116 -14 -51 241 73 17 -155 -102 -110 -21 115 27 -17 78 16 140 -311
4143 -311 -39 28 14 -148 189 76 -126 -120 -46 176 -55 76 -50 318 -35 19 -23 107 62 83 -101 -169 95
4166 95 -178 371 -94 -91 1 86 63 -150 -218 -54 -92 185 -90 60 114 65 55 76 166 -18 49 122 42 94 74 -11
4192 -11 -66 -107 -111 126 11 2 -133 -85 -85 -242 310 -244 -271 -134 -73 -119 -156 -6 -193 105 184 -53 95 -127 -47
4217 -47 306 81 -82 -110 63 105 -281 -87 -65 183 -59 -140 -78 137 34 89 -11 -56 32 -118 -220 150 51
4240 51 71 103 90 -61 -111 -16 10 20 -87 156 44 -124 26 109 -160 -7 -124 -72 155 -14 -149 42 0 -92
4264 -92 -169 -56 -80 -35 -122 -71 172 -57 -42 185 -110 -88 71 278 55 213 5 -161 -3 211 -87 -7 -94
4287 -94 68 284 66 142 127 21 -51 160 19 51 101 -106 -166 130 -120 14 -16 -11 100 211 -80 207 -198
4310 -198 -87 -16 88 169 -173 -134 -190 -57 -150 204 -74 27 10 -79 40 -13 157 76 -307 104 24 162 131 -10
4334 -10 90 -175 156 128 19 -62 -283 -48 16 9 112 -91 3 109 267 -180 -58 122 100 -108 -113 -56 68 147
4358 147 -72 -107 -159 35 -42 312 -20 -237 -149 49 75 -41 130 145 -113 115 50 -30 -122 89 90 102 0 160
4382 160 -17 -207 16 90 -17 -337 -47 55 -163 -113 140 13 -251 55 103 -57 -107 -104 -28 -30 114 62 -53
4405 -53 -91 107 -41 166 135 17 66 17 27 161 -110 40 167 -43 222 -61 58 -3 -88 -244 67 -9 -45
4428 -45 -79 -65 -274 112 -140 37 -98 60 240 -59 72 -117 44 30 110 61 -170 56 73 80 -77 4 -61 1
4452 1 -198 39 -34 -70 -138 175 127 136 3 -147 -240 62 -38 19 -41 137 7 93 85 130 178 -214 -111 -7 70 -245
4478 -245 8 33 9 104 96 -56 128 96 97 -71 137 39 194 -156 92 -21 167 -169 137 25 32 -128 -13 143
4502 143 85 99 77 5 -17 233 -1 -26 63 -3 -29 -199 -126 201 8 -122 -89 63 -46 -130 126 22 16 -34 107
4527 107 145 -163 99 37 -104 52 73 201 32 320 19 -166 -32 53 14 46 -69 77 73 -10 77 27 -181 -24
4551 -24 -17 158 -70 -98 -162 -63 53 159 220 -31 -287 -44 2 -140 2 19 73 15 166 -18 -132 -37 84 -59
4575 -59 53 -151 -97 127 136 2 -150 30 0 -361 263 -12 2 -65 -69 55 -26 25 -93 -74 62 18 6 -153 72
4600 72 42 11 236 158 98 64 -56 -145 79 -58 0 -98 -110 76 128 -1 72 169 -190 156 -8 -37 -125 -35 37 -198
4626 -198 39 -89 -186 -15 36 75 38 98 -19 -172 89 -88 -74 -258 8 154 -14 -33 73 65 91 -90 -295
4649 -295 1 -98 24 -2 -13 -35 -178 165 17 -68 -167 98 34 -9 -61 -16 92 98 67 147 -64 35 -50 141 -135
4674 -135 -93 111 -144 0 -241 165 -70 -107 116 83 -130 119 191 67 -16 54 -79 132 -143 -58 88 -20
4696 -20 149 -23 22 -95 -39 136 151 -55 90 163 -61 16 -121 -72 -132 -203 -190 252 -41 104 -331 -210 3
4719 3 69 200 -154 -104 -135 -23 -234 -77 -102 20 40 4 16 23 -132 88 10 43 -34 61 29 17 66 103 197 -75 126
4746 126 -245 71 48 1 122 -92 118 10 -6 -153 -82 78 119 107 143 125 -143 153 -235 -67 96 25 230
4769 230 101 -129 167 -34 -59 65 -90 29 2 -11 57 104 -143 -104 -5 98 61 -99 51 -14 44 -41 196 21
4793 21 214 59 51 61 33 99 2 24 354 23 97 -168 216 39 -30 -126 -53 -57 -36 -185 -67 -153 161 -73 12 33
4819 33 172 25 -92 100 50 109 -51 144 -124 157 -46 217 202 44 -79 -15 -11 -15 -150 222 -11 34 -200
4842 -200 12 100 -141 137 -44 129 201 82 52 31 -163 -95 79 -23 112 -52 -142 125 47 108 -109 -150 -44
4865 -44 -43 275 -18 -31 -209 11 132 -79 -86 -12 81 -40 -26 79 33 -97 -168 66 -30 108 -139 263 25 -197
4889 -197 23 31 57 32 -123 -183 -75 5 -65 -152 95 46 53 -144 323 -242 34 -145 222 109 -80 73 -56 -138
4913 -138 99 97 207 109 11 108 151 -104 96 -19 132 95 350 354 209 -68 4 -52 -5 177 134 59 -203 -134 141
4938 141 214 10 -123 -203 221 -178 -29 90 74 145 -141 -121 -40 104 154 -110 213 87 46 17 53 -42 258 -65
4962 -65 -85 19 55 45 -261 98 -8 -109 -222 -81 9 69 -73 -195 -144 61 69 -139 18 86 -81 99 30 170
4986 170 259 -72 -283 246 -98 -54 23 59 15 133 -244 134 -48 -272 110 -77 115 159 330 110 170 -114
5008 -114 -48 -192 -111 77 61 60 231 250 155 -158 -112 97 101 -77 -39 -175 25 60 -161 176 -141 -25 52 61 -135
5033 -135 -105 -107 -201 -257 -182 33 121 -189 -139 -34 115 -95 -76 32 -10 -183 49 77 -48 -127 -11 -106 -64 25 -125
5058 -125 118 190 -46 134 27 52 -44 48 5 -276 -106 -98 -106 -168 147 120 -31 -72 -1 23 -35 43 106 -40 140 107
5084 107 76 137 -86 -108 204 49 93 31 4 -145 -299 -79 11 -51 -3 -1 260 -3 -169 -315 -221 -86 -229 -83
5108 -83 52 -6 -251 25 132 5 73 105 -152 -45 -259 -44 -67 57 -57 40 -83 5 -12 -184 -49 79 44
5131 44 77 177 -10 108 48 34 -30 -226 -144 14 202 -106 -291 105 139 187 242 -73 -58 178 -31 100 -95
5154 -95 34 -127 -96 3 -192 -89 -110 -50 55 150 111 -130 -76 -146 8 146 114 -18 65 -39 -235 74 52 133
5178 133 143 93 -80 2 189 1 57 -107 -95 94 -81 -138 114 21 54 10 -81 8 -170 -15 -216 -38 131 -162
5202 -162 -50 67 -47 -29 -46 48 105 34 0 136 260 -64 -54 137 -40 68 85 77 9 -53 -82 -63 44 -233 -39
5227 -39 -56 -6 -55 36 -103 -208 -143 78 -200 -13 62 45 -160 -6 32 -94 78 139 84 268 38 120 49 -22 127
5252 127 50 56 185 133 10 -114 127 -87 -34 -14 45 -127 102 -91 -21 179 5 -19 -7 50 42 -20 -110 -4 -16
5277 -16 85 64 43 -97 46 -351 235 95 -75 73 175 4 47 26 84 76 -74 -60 97 146 -81 53 199
5300 199 -95 -193 67 -158 44 60 24 -93 116 -65 -56 -103 73 -73 118 23 139 57 27 -136 -266 118 -94
5323 -94 51 -96 160 -86 113 12 -13 -66 -159 -420 -9 -6 248 316 -206 114 -112 -146 -2 -91 39 40 139 17
5347 17 130 106 14 156 48 -185 103 63 87 -87 -28 -211 24 174 53 84 69 17 134 155 106 -165 15 -139
5371 -139 26 146 20 51 -80 50 -165 -127 -58 145 -85 -132 14 130 -105 66 -49 -38 -38 -70 19 154 -359
5394 -359 71 -248 39 -28 -58 -54 -70 195 203 75 -135 133 66 -43 -117 19 119 -50 -94 -19 89 45 22 3 -122
5419 -122 -86 -175 -47 48 -290 -100 -57 -134 94 -220 65 -78 10 180 -49 -88 28 23 0 -35 -57 201 -81 89
5443 89 -178 -50 23 -199 206 -119 11 15 -73 135 10 194 -223 -40 -131 8 105 248 -193 -42 -133 -105 73
5466 73 -198 -33 -161 162 76 -52 43 181 82 68 117 16 71 -21 47 268 35 -35 -22 92 96 -61 -147 -73 125
5491 125 -5 -147 -12 38 -89 -159 -124 49 25 106 82 -87 58 -39 -95 -7 27 13 -177 108 55 -179 -52 -34
5515 -34 94 -74 -82 -245 -80 4 -92 62 -110 171 -205 -107 281 -23 50 33 -52 -36 -61 10 -119 26 -200 146
5539 146 107 -203 -377 -197 -151 -66 83 208 56 -97 84 16 -148 116 -56 -25 10 186 67 -57 156 306
5561 306 120 204 170 17 -181 -77 14 68 56 -101 187 27 -35 197 -41 37 -68 16 -80 153 -160 -138 23
5584 23 77 297 -13 -50 9 -23 -100 -2 28 -89 123 -148 32 116 -108 -39 -12 -170 -80 -60 -200 2 -187 178
5608 178 -94 -41 -130 -192 -98 21 77 50 -167 41 -117 -196 -49 -32 -59 376 -6 126 317 -104 196 138 50 12
5632 12 41 278 133 -84 106 17 45 213 8 -1 66 -197 -307 -53 -19 -21 15 -101 0 90 -119 -37 1 172 -1
5657 -1 10 6 -153 275 -45 -212 142 95 1 57 -91 267 11 -49 -115 101 -116 43 155 25 -157 10 287
5680 287 -39 -33 -125 -40 72 4 110 26 -27 -73 51 29 192 -70 -63 26 -10 81 -145 -96 174 162 -136 -133 -45 -50 81
5707 81 78 8 124 -204 -196 159 -190 -133 177 91 -78 156 -51 148 268 75 -21 -19 87 85 70 -115 198 79 19
5732 19 -38 -55 282 59 -214 -35 122 -133 41 -155 -229 -45 102 -75 -75 -53 -20 -59 -107 -80 27 54 -117 86
5756 86 35 174 0 -71 117 48 49 -56 84 48 18 196 90 -70 143 -35 -20 151 110 -118 -72 65 -55 -85
5780 -85 -214 -110 -39 -50 -5 -7 -109 -70 1 -13 201 -185 -135 -23 63 357 -107 94 -87 194 -77 11 2 -115 81
5805 81 -91 -23 49 -96 20 -70 27 45 -216 53 -35 -79 114 -59 50 103 -70 -231 79 117 83 84 36 102 55
5830 55 -153 21 124 -62 240 143 -22 -72 -114 -29 237 116 -181 54 86 -377 0 147 87 21 75 -74 -25
5853 -25 27 13 28 -103 213 158 55 89 68 -38 -92 -142 -93 -19 41 67 -60 -65 -132 -88 -16 83 118 134 82 121 57 -207
5881 -207 -97 -283 105 -68 3 27 -12 39 119 124 192 -145 32 55 -18 262 37 18 24 74 230 73 184 36 -89
5906 -89 202 61 67 19 -18 54 113 -187 -1 -63 -116 -79 -36 90 193 76 85 58 -176 -209 150 -10 -29 94 55 62
5932 62 159 5 3 11 -150 -145 -80 -368 65 34 -187 154 -223 -106 -75 116 -91 -142 -94 -10 86 111 -32 -197 50
5957 50 417 -43 -105 100 62 25 93 47 -72 -152 -149 41 -139 201 16 -5 -44 -18 88 156 -178 -135 160 246 56
5982 56 49 -96 -223 -92 139 -145 23 -47 16 -200 90 -79 -224 -19 -187 203 7 54 -80 196 -144 -171
6004 -171 65 -67 -2 -71 -25 -35 39 -29 179 82 18 160 34 219 -56 127 -35 37 -29 56 185 -102 169 -51
6028 -51 130 93 -116 82 46 94 21 191 -42 157 71 -29 4 91 98 156 -172 -13 -138 -145 -39 5 6 71 -100 302
6054 302 -47 95 80 -63 108 44 -26 -126 91 70 236 85 -95 -230 -130 134 -51 34 -97 -27 -95 236
6076 236 -63 65 -73 108 -47 112 95 -38 48 75 -333 33 166 -74 59 275 70 -20 91 78 -75 24
6098 24 256 46 -82 -7 -95 46 -197 -5 -146 -45 100 -16 85 -55 -51 102 -186 28 -97 -142 54 -14
6120 -14 -87 119 -103 40 142 222 17 -140 48 59 144 106 144 -93 -54 -22 52 115 156 -75 305 -53 -26 -2 -75
6145 -75 177 177 267 47 -8 16 -94 70 -229 -49 -209 151 17 60 -140 -17 -159 38 -35 13 23 -9 -119 -102
6169 -102 187 -10 27 -110 225 -137 43 -64 -48 41 84 -116 -12 -128 36 -47 -46 -199 154 -80 -98 31 -44
6192 -44 5 168 -182 -59 140 35 12 263 -4 33 -89 14 -64 13 -105 -146 117 -185 109 14 -90 51 -107
6215 -107 82 121 285 -213 -5 115 41 -127 106 3 29 267 -186 6 -34 -41 -72 -126 96 160 -232 -66 1
6238 1 -16 271 -39 -119 230 -345 115 70 32 51 242 7 72 -31 131 -164 140 -67 2 -38 170 -7 22 82
6262 82 -49 80 112 -73 -65 -229 -170 -17 9 -7 -118 -122 -133 17 -267 29 6 -244 -23 -34 8 -19 79 -105 191
6287 191 282 -67 -36 -135 -67 163 -13 -105 223 23 -225 143 61 -147 29 36 -207 -137 70 -33 -77 -30 77 117
6311 117 113 -105 126 -37 35 31 -16 127 104 105 119 -44 182 35 27 86 -41 315 49 8 -40 -78 192 -56 171
6336 171 221 24 115 -33 24 190 232 -63 -104 29 -21 -18 12 48 -121 -138 -135 105 59 -75 -142 -11 29 -5 -30 -45
6362 -45 -17 129 166 -8 -24 77 -216 56 242 64 130 -42 -36 -85 18 -15 37 115 -118 101 61 33 -186 146
6386 146 -205 -165 251 -65 -85 2 155 199 -109 125 -77 111 -52 16 110 -178 137 -66 -37 -7 39 75 -13 137
6410 137 -6 59 189 -138 -3 118 98 167 -13 -68 -6 53 143 170 161 -119 -17 -29 -64 42 -107 -36 -92 -17 30
6435 30 91 -193 239 -112 7 15 103 -57 67 223 -83 -168 232 -115 53 67 -109 124 -123 108 -18 220
6457 220 -142 -213 -166 -256 -330 -245 -123 128 58 161 108 -114 103 60 173 7 -32 -117 84 18 29 100 16 -33 77
6482 77 -10 48 -170 88 -59 -1 115 148 -21 10 -3 109 159 15 -91 -79 -23 -18 99 164 15 200 212 -51 -298
6507 -298 -87 71 -198 46 109 118 -65 -183 -176 -231 -13 232 -102 -3 -75 -223 166 -54 89 -34 40 -33 -52 78
6531 78 111 -183 -67 4 -22 56 -14 -183 -184 86 37 -289 162 -48 174 214 98 -284 -73 30 -29 -22 -35 59 81
6556 81 21 -18 113 -156 -96 85 86 117 -92 -61 145 -173 -80 -151 -4 -253 -240 -140 -248 -230 105 -143 95 130
6580 130 104 22 118 -112 -38 18 39 -144 -99 113 36 -141 -95 6 102 104 60 179 -58 -94 -106 154 49 -53 -81
6605 -81 217 19 -14 189 -37 -190 -121 80 -164 133 14 89 6 -47 -83 -164 103 -64 -10 14 211 -302 -71
6628 -71 -127 302 -192 -105 46 -33 134 -139 -83 112 49 159 113 -80 50 -107 24 102 92 44 -266 46 -44 153
6652 153 102 18 -212 125 -37 -17 6 -27 78 -299 -10 114 -40 94 46 56 141 228 126 119 -145 -168 -85 38
6676 38 16 23 63 119 47 -59 -55 105 193 43 -71 -72 -121 -220 -114 160 12 206 -119 -101 16 65 218 10 15 93
6702 93 -40 -40 -31 -349 95 13 -40 26 24 -33 16 -38 -28 -41 162 -38 -66 23 -76 -22 -122 -12 -233 -125 -323 -135
6728 -135 -28 -164 -89 -88 -106 90 -145 -52 88 -137 42 9 119 -62 -42 -217 -40 -40 14 179 -95 6 -9 165
6752 165 5 125 -96 -200 150 237 -183 197 130 -38 141 13 127 199 -153 198 160 73 178 -161 25 126
6774 126 109 116 23 60 -141 2 188 189 -336 24 19 -153 103 141 118 -47 -98 211 -137 -11 -34 -65 -35 213 142
6799 142 -72 19 -162 81 -157 -67 24 -15 50 60 -194 -54 -90 62 -221 -85 -23 -11 94 65 90 -31 157 -102
6823 -102 185 -105 6 -8 -152 -65 -13 122 -186 -58 37 -9 178 -66 120 108 19 -112 -66 88 -91 -121 -84
6846 -84 -140 -81 -125 69 145 71 -180 225 -61 238 -224 39 -3 130 126 283 64 237 -42 229 -16 -130 -85
6869 -85 7 85 232 36 -347 42 32 60 183 -117 -75 66 -52 298 -68 181 87 -44 148 -37 -110 29 -97
6892 -97 18 -16 90 -29 54 -198 13 14 35 -155 149 -97 -170 55 73 -121 -144 -99 -118 -166 -101 112 -2 36 -114
6917 -114 165 64 -32 -200 -58 -68 365 108 -7 27 -30 150 67 131 14 -126 247 -67 52 21 69 235 86
6940 86 -38 181 84 75 84 -17 19 61 -197 142 -165 38 11 142 93 61 66 205 65 -100 77 -107 59 46 -3
6965 -3 -36 -92 -369 81 -97 95 135 6 7 -103 -262 70 98 -62 -32 147 -130 -129 17 -95 -32 68 -116 39
6989 39 31 -57 92 75 -181 -49 -195 49 163 213 193 18 189 34 -20 -13 133 185 45 167 44 -119 68 -28
7013 -28 106 28 4 38 125 -86 -79 -7 -38 -187 -60 179 182 -26 -112 54 -88 -19 -113 1 -53 312 -110 -210 1
7038 1 -8 122 122 117 -57 24 15 -6 -137 141 -164 -5 300 49 138 -17 254 -84 167 101 21 254 -65 87 -53
7063 -53 130 -56 -160 -74 188 168 113 11 99 -72 2 264 70 -195 29 34 -54 -35 -197 27 -55 16 207 98
7087 98 104 -67 -15 226 -216 -12 -132 -192 33 -135 -72 84 48 113 96 69 73 -36 116 193 -134 172 -31 250
7111 250 87 -247 27 45 -129 0 9 -55 126 -84 265 31 -20 133 -8 78 -12 36 47 151 -158 9 199
7134 199 -7 62 -41 -286 -58 32 -63 104 -102 -63 -240 -48 2 -18 132 46 -43 -132 -34 114 127 -2 2 -136
7158 -136 19 -187 -63 -193 117 50 -240 -10 129 -189 14 69 37 44 41 -235 156 60 0 -140 232 58 -179
7181 -179 -227 -66 -15 -196 -75 -16 -99 -49 -27 8 50 -87 -167 -51 -277 -264 84 -228 38 -119 -28 51 -22 -96 88
7206 88 80 36 183 7 55 -63 144 22 0 -77 231 69 209 36 173 101 -2 -18 -155 138 23 61 -174
7229 -174 83 142 9 -65 -25 -203 -21 -52 -5 -65 -15 -35 74 -38 -153 -7 -136 190 -104 -18 -51 50 -63
7252 -63 8 47 87 78 82 -119 -129 143 -37 259 -156 -369 -47 72 23 43 164 -48 -4 146 82 32 166 171 -99
7277 -99 -181 7 125 -2 38 -235 -206 -7 162 167 -29 136 -144 -79 154 9 -61 47 135 151 51 -90 -40 -101
7301 -101 106 -169 17 112 147 -76 112 -15 -174 -300 219 -99 -35 83 -173 -4 -81 15 175 -133 12 42
7323 42 71 53 94 38 39 20 -225 -58 -122 -17 169 -42 131 17 -54 162 -68 8 152 -149 -117 -115 -180 -1 81
7348 81 -184 -45 146 101 38 -34 29 -20 -42 -109 -161 -41 -67 -116 -56 86 -66 81 -86 111 -61 10 14 -125 24
7373 24 41 50 -56 50 -189 146 -11 -202 110 177 -58 205 -56 -51 -74 105 -92 35 -179 -135 206 -10 -54
7396 -54 39 7 -139 -33 -142 -42 275 -128 -51 -171 -13 -135 -124 -53 -22 54 23 -77 174 -5 103 28 90 -12
7420 -12 -172 141 -119 189 -14 -41 -148 -60 -163 59 156 17 -121 65 84 117 157 -16 -198 -36 -7 83 -66
7443 -66 45 177 -178 -20 5 -88 95 -81 -147 -94 -189 96 77 164 70 91 -207 101 -184 -212 -117 92 -183 44
7467 44 104 59 24 93 83 1 -39 137 91 93 -198 65 1 -34 146 -55 133 37 139 -144 -35 -157 -71 154 -178
7492 -178 -204 23 56 81 152 262 91 119 165 66 -82 138 100 205 1 48 -113 -224 -106 -81 128 37 -18 75
7516 75 34 162 118 6 5 215 -28 12 -100 203 -267 -335 -45 -30 -34 -256 135 67 -37 118 185 -13 65 52 -121
7541 -121 -7 56 102 57 -71 24 109 -42 -126 210 -111 -169 49 -21 70 -136 80 -145 48 -157 62 8 20 -54
7565 -54 38 -17 -31 -154 -82 91 -27 191 151 -33 78 -29 112 123 136 -1 -82 110 73 -176 -306 -33 58 -173
7589 -173 -81 114 82 28 -91 174 -149 -187 -1 10 -70 40 -129 -86 104 144 -7 -87 -123 97 235 -240 75
7612 75 139 -56 141 42 -47 218 -317 -137 -169 -12 186 53 73 -26 217 -211 -126 -57 -141 106 306 -131 9
7635 9 8 -168 -178 -46 -70 105 45 -115 -101 28 21 62 76 -17 -300 119 35 86 168 -152 -88 -26 -128 -312 -3 248
7661 248 29 -237 -105 -105 -6 85 62 -127 -4 -10 -24 -169 -15 -81 -198 181 -57 -111 24 212 82 -200 -126 -91
7685 -91 112 6 -16 -80 -110 39 54 41 -178 103 128 25 -33 154 -111 75 13 84 40 -26 166 60 49 71 103
7710 103 -159 120 1 -194 -60 -52 -26 2 -16 35 -133 49 98 -115 -221 -67 -127 -6 -199 -51 116 56 -40
7733 -40 -128 -163 -22 56 -91 -167 57 57 81 135 149 -26 -94 -184 84 98 -126 -17 -118 24 17 216 -316 162 6
7758 6 78 193 -149 82 45 -73 59 73 291 -10 -26 -21 219 58 -62 72 9 38 48 -38 -124 228 85 244
7782 244 102 251 -33 -57 95 13 -198 205 112 166 -162 -89 -50 -50 119 78 2 65 68 104 24 -119 90 -52 48
7807 48 -48 231 41 -25 -168 200 58 -51 -20 -286 -120 309 -177 -153 86 -184 -70 281 -47 106 99 -118
7829 -118 53 23 -169 -122 -52 0 8 -13 -146 201 -126 223 220 103 132 -7 157 -28 -39 -90 -71 36 189 100 -35
7854 -35 77 -231 29 213 50 212 93 -160 76 -93 -224 67 -10 -15 87 -13 -42 47 106 -63 128 125 -155
7877 -155 119 125 -19 -66 11 61 200 -62 -173 98 -66 -208 -278 220 -81 138 167 -25 -71 44 9 -8 297
7900 297 18 -56 -110 84 -14 -79 -23 71 32 -73 -17 29 42 -47 34 -19 151 -1 -78 6 -202 54 73 23 39 175
7926 175 65 -108 127 22 161 -132 -143 266 -16 -2 -50 -3 169 169 89 -40 -105 59 -55 -63 -58 -28 165 28
7950 28 22 -52 116 169 120 227 -29 52 -39 -84 22 -59 123 187 120 -62 -27 -183 56 -66 23 -7 -95 42 -52 181
7976 181 157 -34 70 94 -119 56 175 190 -68 186 145 -68 41 284 41 -197 -67 51 115 -12 72 -158
7998 -158 -26 -20 -127 -11 -50 14 198 46 82 61 33 190 -17 32 131 26 -172 77 -51 -154 -145 -30 26 -39
8022 -39 -95 187 -11 152 117 24 60 -32 -37 2 -23 -64 26 215 -24 -41 228 131 -18 60 -16 -57 55 1 53 166
8048 166 116 -24 -93 -22 -149 82 -175 -203 -133 54 0 -171 -15 12 360 58 -86 160 71 62 -211 -63 -107 -60
8072 -60 -11 257 25 -30 -50 -94 8 116 48 98 14 64 94 -211 -16 36 93 9 0 -124 212 92 133 131 64 -54
8098 -54 -93 22 -227 -17 -54 101 175 66 89 109 -53 101 116 -59 295 48 -204 -93 -3 181 -115 -11 14
8121 14 -280 42 -159 -101 -40 4 145 60 56 110 -31 -55 122 -36 -111 -147 33 -14 -22 -234 50 -111 50 82 -2
8146 -2 13 137 33 -102 -201 -30 -85 46 -132 -65 -203 -1 -102 23 18 -121 -46 -180 47 107 145 -3 16 36
8170 36 -40 54 -51 46 106 -152 -54 -86 -78 48 -17 -154 122 -42 122 18 12 -79 -61 42 -152
8191a52
$$ Imaginary data points
##PAGE= N=2
##DATA TABLE= (X++(I..I)), XYDATA
0 0 0 0 0 0 0 0 0 0 0 0 0 0 0 0 8 -8 8 -8 8 -16 16 -16 24 -24 32 -32 40 -47 52 -59 68 -79 88 -99 112 -127
36 -127 141 -159 178 -196 220 -244 271 -299 332 -365 404 -445 490 -539 595 -655 722 -797 880
55 880 -977 1083 -1211 1356 -1528 1739 -1996 2324 -2759 3360 -4249 5706 -8494 15753 -78145
70 -78145 -128715 83768 94740 -47193 -72304 45741 46154 -33642 -32410 29729 19992 -2317
82 -2317 8923 -2718 -38804 1778 66748 26927 -61950 -36906 42263 29249 -31837 -16171
94 -16171 25995 6489 -28061 -12631 5760 2713 9390 8887 -24761 -32792 13261 38385 1217
107 1217 -27793 -7141 14200 6158 -2947 650 8423 12255 1773 -18994 -11181 26370 30685 -16282
121 -16282 -32962 9908 25150 -14146 -18161 24829 14454 -40715 -24437 37570 19043 -38276
133 -38276 -14798 34614 1173 -43311 -1553 44008 6124 -33781 -6231 19390 2665 -2128
145 -2128 13942 1787 -16638 4449 20942 -7066 -16211 20501 22558 -26976 -30066 25481 30333
158 30333 -22083 -25275 16751 9865 -24637 -7101 24548 1611 -25941 -3079 15756 -4945
170 -4945 -10891 12641 11972 -14848 -12229 14575 13144 -6102 -1556 9559 -929 -8459 5679 12396
184 12396 -1150 -5794 1943 -1916 -7151 5586 9971 -8866 -13872 5134 7451 -12277 -9219 12980
198 12980 7846 -16741 -14470 9465 14553 -2003 -10700 -2429 7837 6711 -2527 -5569 6353 14007
212 14007 -620 -15477 -1563 20193 9759 -15092 -9695 11004 6281 -9503 -3043 7509 -2604
225 -2604 -10086 1287 2923 -8238 -2111 10341 -1993 -17685 -1573 17226 3135 -13689 -1390
238 -1390 11078 -125 -6336 6050 8903 -3514 -2837 8211 1289 -8425 5529 15212 -5260 -18336
252 -18336 4076 17833 -4638 -17590 3646 12138 -8648 -14305 4879 9693 -6672 -9601 2785
265 2785 3063 -4879 -298 7152 303 -6841 261 8159 2015 -3439 2993 5672 -882 -3078 3239
280 3239 5094 334 -991 -119 -1663 -1093 2279 739 -3650 -3694 -567 -95 -2159 -2720 -661 1098 -1163
297 -1163 -5206 -2760 5281 4516 -4169 -4549 4318 6166 -1780 -3064 5746 6487 -3103 -4178 5291 6416
313 6416 -2388 -3299 3861 1382 -6008 -692 5885 -1931 -8287 -331 4821 -4346 -6802 3307 4317
328 4317 -6341 -5985 4281 4458 -3859 -2598 5348 1850 -4483 1171 7658 1235 -4710 2168 7087
343 7087 -1491 -4730 4965 6215 -4451 -5652 4139 4297 -4821 -4564 3081 919 -6416 -3411 3179
358 3179 1209 -4668 -2928 2239 264 -3462 169 3793 -248 -3056 1961 4636 303 -1835 3415
373 3415 4244 -1071 -2337 2903 4458 -598 -3003 542 2205 -1045 -2318 32 288 -2898 -2683 782
389 782 -957 -4597 -364 3233 -2001 -6561 177 6803 475 -6663 -676 7063 2855 -4314 -850
404 -850 5889 3656 -2262 -595 3213 2153 -111 1209 302 -3026 -345 4150 -23 -6718 -2537 4553
420 4553 342 -6964 -3489 4114 1670 -5190 -3716 2250 2755 -1422 -1141 1971 452 -984 2770 3491
436 3491 -942 -1468 3993 4409 -1836 -2176 3260 3710 -1382 -2842 320 1486 -697 -1549 -655 -1817 -2905
453 -2905 -169 1822 -1897 -5142 -515 4311 186 -5628 -1675 5120 3871 -2794 -3849 2453 6520
468 6520 2687 -3166 -2626 4001 6068 179 -4695 -1400 5020 4409 -3565 -6416 514 5947 437 -7428
484 -7428 -4933 3303 3869 -3043 -6287 -2309 3775 3015 -3285 -5117 1067 6266 2161 -4753 -2872 5394
500 5394 6423 -599 -4881 879 6467 2235 -3114 -1221 2824 1870 -913 -1464 -1475 -859 1403 425 -3673
517 -3673 -4096 1244 2597 -2947 -4861 722 3171 -1990 -3602 2187 3631 -2421 -2449 4930 4405 -4155
533 -4155 -2529 7278 5197 -5308 -4214 6502 6485 -4022 -5566 2621 4841 -1376 -4247 -1056 677
548 677 -399 -612 -1092 -4182 -1808 3654 2015 -6416 -5629 5619 7264 -4151 -7821 3202 9279
563 9279 438 -7001 -243 7720 3701 -3738 -2315 3293 2909 -299 -620 -583 -1921 1129 3333 -2128
579 -2128 -6754 -724 6195 -304 -9252 -3085 7312 1991 -8112 -4488 6658 3865 -5803 -3013
593 -3013 5977 3040 -4165 -241 6312 1174 -4581 1824 6427 -449 -4470 2162 4818 -1217 -3736
608 -3736 1016 2508 -2248 -2444 868 -639 -3935 -726 3124 -1444 -6146 179 5613 -820 -6507
623 -6507 -188 6476 1669 -4486 -963 4465 3310 -1168 -1133 1352 2352 1383 634 -791 -1382 1165
639 1165 2982 -602 -4314 -1370 3948 1803 -5623 -4388 2993 3449 -3503 -5868 589 4573 -287
654 -287 -4751 -1137 3566 1806 -1631 -507 1877 1619 1481 1057 -620 -313 2828 2692 -1663 -2070 2173
671 2173 2696 -1947 -3125 930 1716 -1691 -2521 123 146 -2190 -1519 810 -823 -2674 154 2229 -553
688 -553 -2529 1222 3239 -343 -1820 2030 3037 -112 -733 1896 1981 -350 -352 1285 670 -1132 -703
705 -703 687 -284 -1671 -603 471 -1097 -2002 -514 175 -1347 -1436 177 126 -980 -409 928 465 -486
723 -486 458 1590 836 -245 887 2093 768 -455 433 2212 635 -1559 -91 1723 70 -2051
739 -2051 -1072 1188 -309 -2121 -1324 382 -99 -1628 -1194 174 -73 -1049 -275 612 -155 -212 1144 1067
757 1067 -287 314 2229 1372 -724 355 2090 645 -839 156 1448 -129 -1452 128 603 -1293
773 -1293 -1604 -120 314 -1801 -2115 276 781 -2020 -1735 730 904 -1159 -809 1758 1044 -638 260
790 260 1544 1001 -118 933 1847 496 -432 919 1542 -142 -1044 169 995 -744 -1684 -49 108
807 108 -1104 -1377 -351 -423 -766 -583 -166 -523 -722 207 584 -284 -259 808 1442 489 -443 1286 2039 423
827 423 -600 959 1979 354 -1240 162 1220 -130 -1506 -644 368 -691 -1371 -848 -242 -800 -933
844 -933 -261 -298 -1107 -525 930 348 -1167 248 1882 588 -873 441 2230 823 -481 739 1532
861 1532 333 -297 422 657 -762 -608 738 -203 -1911 -962 578 -117 -2246 -1175 636 -307 -2013
878 -2013 -417 787 -554 -537 764 622 -583 71 1622 1031 -491 266 2085 1659 -558 -511 1297
895 1297 1076 -385 -491 242 199 -310 -589 -716 -989 -359 6 -992 -1424 -730 367 108 -1036 -1014 177
914 177 1491 218 -1218 178 1833 1382 -494 -6 1711 1279 -2 116 1381 300 -728 458
930 458 769 -846 -1503 708 992 -1787 -2205 590 854 -2261 -1889 731 510 -1977 -741 1145 -309
947 -309 -1457 1028 1902 -397 -1338 1772 2870 -528 -1634 1467 2718 -236 -1340 593 1501 -38
963 -38 -752 -267 -614 -446 221 -115 -1852 -1383 858 544 -1906 -1809 402 1204 -277 -1334 -489 1260 1761
982 1761 -3 -1168 481 2576 1456 -1219 -658 2283 1785 -982 -956 1147 830 -837 -130 202 -848
999 -848 -861 843 -178 -2531 -1270 1624 135 -2789 -935 1793 612 -2161 -428 1921 397 -945
1015 -945 749 1537 -148 -110 1585 1580 -749 -475 1360 1012 -820 -526 470 38 -565 -486 -537 -1101 -142 349
1035 349 -1323 -1566 24 355 -1136 -1052 217 103 -260 484 212 -534 542 2247 687 -1623 256
1052 256 3339 1244 -2357 -661 3106 1065 -2302 -812 2006 2 -2203 67 674 -1589 -1210 835
1068 835 -350 -2710 -618 2080 -274 -3056 -153 2746 339 -2203 181 2583 602 -1165 980
1083 980 1792 116 -156 1274 774 -653 139 1262 -13 -1094 271 470 -727 -932 -364 -467 -981
1100 -981 -404 -443 -844 -366 78 -704 -897 567 308 -619 -193 1365 767 -954 472 2273 675 -1343
1118 -1343 544 2507 269 -1721 583 1935 -901 -1852 816 769 -1832 -1432 1100 -500 -2522 -92
1134 -92 1295 -1083 -2526 618 1607 -1086 -1827 1645 1734 -960 -739 1921 1511 -894 263 1839 593
1151 593 -1010 705 1620 -904 -960 1374 778 -1404 -852 1024 -267 -1742 -544 360 -658 -1069 -224
1168 -224 -101 -756 -561 514 -132 -603 692 997 -192 45 1086 1101 -422 -20 1449 563 -428 428
1186 428 924 -273 -699 311 209 -1359 -235 651 -624 -1729 17 635 -1346 -1488 517 456 -1244
1203 -1244 -658 1029 413 -1055 188 1463 181 -787 1048 1824 -680 -659 1592 1454 -990 -283 1488
1220 1488 611 -1333 -24 1039 -544 -1616 44 303 -1367 -1454 708 235 -1609 -721 1013 -287
1236 -287 -1154 -72 1157 -115 -501 1002 1102 -292 -37 1372 753 -621 365 1407 -17 -661 303
1253 303 627 -594 -529 156 -130 -817 -490 51 -463 -1006 -126 -10 -796 -550 212 -17 -533 62 750 39
1273 39 -117 784 1115 -170 -30 1254 747 -413 -20 1018 -26 -820 398 586 -553 -780 370 -85
1291 -85 -1254 -368 346 -525 -1209 -126 604 -510 -1094 420 916 -720 -552 1065 925 -400 144 1623
1309 1623 417 -424 592 1372 -159 -373 739 876 -516 -576 916 191 -870 -588 605 -520 -1144
1326 -1144 -287 78 -768 -935 32 147 -569 -282 554 316 -312 252 760 94 51 755 675 214 162 437 600
1347 600 49 323 39 -66 -63 268 -234 -542 -445 -94 -283 -930 -390 -153 -604 -675 27 -16 -250 -64 453 246
1369 246 -122 299 963 651 28 532 606 128 -18 566 319 41 -63 43 -305 -584 1 52 -561 -665 -106
1390 -106 -62 -725 -427 -210 -12 -709 68 121 -249 -76 511 331 -34 184 732 975 -373 277 1011 553
1410 553 -68 202 561 279 -192 115 -44 -257 -316 89 -246 -652 -679 27 -76 -885 -697 157 44 -548 -317
1431 -317 363 363 -138 246 623 303 259 683 896 387 54 411 754 151 -280 -2 561 -16 -682 -188 215
1452 215 -483 -830 -237 -84 -608 -741 -80 -31 -420 -288 13 316 -167 -221 568 359 65 -170 808 911 -8
1473 -8 19 670 552 -250 -238 392 347 -410 -352 276 -55 -903 -523 36 -205 -712 -316 135 -73 -715 -144 528
1495 528 -29 -664 -78 671 212 -175 525 792 367 -61 591 607 245 -349 299 603 -117 -432 -16 116
1515 116 -482 -734 -235 -293 -629 -796 -121 -221 -296 -244 205 -3 -405 -8 303 244 -97 117 591 353 -31
1536 -31 298 725 153 209 313 411 189 51 81 118 109 -317 -349 -383 -370 -234 -446 -102 -544 -673 -369 167 -144
1559 -144 -369 20 208 116 -350 331 608 507 21 461 794 260 -12 527 301 86 -93 100 94 -345 -197
1580 -197 -95 -125 -570 -422 -302 -316 -667 -360 -252 -204 -356 -157 -80 31 223 234 427 265 136 569 266 308
1602 308 348 408 134 306 103 -6 81 314 -166 -342 -71 -166 -152 -534 -331 -1 -557 -425 41 33 -414 -6
1624 -6 378 121 -209 25 532 289 -251 396 670 391 -259 295 601 -58 -347 119 76 -315 -185 284 -61
1645 -61 -760 -622 -138 -220 -415 -367 -251 -411 -177 -452 37 -324 -59 111 198 359 -61 421 453 337 393 320
1667 320 77 329 381 100 31 219 16 -264 -196 52 -106 -566 -249 -137 -453 -288 -194 -202 -564 -404 268 179
1689 179 -211 125 152 -120 -231 230 602 325 175 484 564 74 119 431 173 -73 -154 397 47 -375 -222
1710 -222 65 -195 -585 -236 -19 -290 -585 -332 -315 -408 -459 -10 161 108 124 174 198 8 286 468 334 237 355
1733 355 367 -36 75 248 -103 -52 -379 -119 -214 -163 -195 -304 -408 -424 -298 -389 -149 -105 32 -165 -31 138 288
1756 288 65 213 129 170 179 313 699 215 136 130 273 353 259 368 -88 -44 -148 -192 -275 -305 -189 -381 -234 -364
1780 -364 32 -319 -172 -221 -148 150 -116 156 108 58 39 346 418 317 362 255 83 39 184 163 -55 23 76 41
1804 41 70 -116 -203 -257 -388 -442 -83 -105 -417 -188 132 -189 -409 -120 153 -124 -124 89 400 204 62 481 304
1827 304 326 19 377 382 -33 -239 203 -45 -291 -188 -129 -121 -189 -193 -19 -204 -612 -288 -100 -196 -371 -233 -55
1850 -55 -119 7 -42 319 243 241 11 210 414 159 294 281 426 192 41 354 182 -240 -180 -107 -177 -265 -450 -120
1874 -120 -424 -364 -326 -212 -167 -367 -111 130 13 56 179 252 68 -81 169 496 154 -24 103 437 218 228
1896 228 44 312 -23 -198 143 -117 -162 -344 -60 -66 -271 -322 -306 -218 -281 -229 -280 -271 134 -225 14 136 312 152
1920 152 68 447 209 39 347 482 453 49 103 227 129 38 94 159 -13 -283 -140 -210 -182 -554 -119 -178 -433
1943 -433 -437 41 -20 -209 -206 44 272 -147 91 202 241 49 197 296 287 70 191 288 261 -192 -11 130 -147 -120
1967 -120 -31 -50 -163 -506 -247 -107 -155 -409 -88 2 -170 -300 -207 401 76 130 47 350 165 -65 326 282 167
1990 167 -5 152 372 15 -19 5 285 -198 -112 -273 28 -287 -524 -77 -14 -362 -657 -62 6 -486 -318 292
2012 292 81 -43 -406 335 294 -369 176 325 278 80 -73 290 133 -49 -7 196 -59 -269 -111 -77 -136 -287
2034 -287 -166 81 -407 -385 103 -149 -83 -117 -118 31 -138 9 10 201 196 398 238 300 243 211 332 292 179 91 549
2059 549 165 102 -63 113 -136 -36 -265 -369 93 -257 -758 -141 -122 -237 -379 46 13 4 -160 239 252 -39
2081 -39 82 241 263 -56 286 393 36 135 420 150 -59 91 13 -243 -119 -371 -41 -165 -204 -155 49 -83
2103 -83 -437 -158 11 -362 -228 171 135 -32 153 267 -130 185 413 378 -5 142 423 297 34 96 62 -76
2125 -76 -93 52 -46 -351 -180 -51 -73 -469 -226 40 -190 -263 24 224 -303 -261 154 -1 -269 20 434 212
2147 212 -98 140 304 242 -54 143 118 19 -219 123 106 107 -83 93 -80 -242 -14 -222 -300 -21 81 -93
2169 -93 -355 -164 -28 -41 -282 328 59 -336 -59 334 77 89 561 375 17 -62 412 292 -5 -29 99 -14
2191 -14 -250 28 184 -129 -331 -175 132 -459 -527 -71 -67 -444 -471 -10 239 -256 -85 234 -49 106 243 514
2213 514 244 -46 431 263 91 80 191 142 -66 -38 329 -207 -251 83 -242 -243 -242 -73 -159 -75 177 138 -202 -275
2237 -275 46 53 -194 -168 341 121 -191 82 406 300 116 156 321 -182 127 92 156 -230 72 150 61 -117 -317
2260 -317 -127 -251 -325 88 -72 -375 -210 6 26 -412 127 195 -101 -13 141 130 -17 138 92 327 -12 173
2282 173 422 93 26 96 68 -96 -75 147 68 -294 -210 -64 -269 -261 124 175 -232 -154 -49 66 -350 -45 150
2305 150 38 -76 106 354 -97 -134 386 146 -32 143 165 141 -89 283 291 -92 -206 -130 -28 -189 -282 45
2327 45 -27 -315 -177 -63 -164 -210 16 202 -122 -102 141 165 -273 -37 313 91 -75 423 261 109 89 94 111
2350 111 -82 48 137 -115 -307 -151 125 -313 -250 -217 23 -357 -235 -28 -151 -152 -130 260 32 -242 -8 197
2372 197 35 215 350 139 -235 25 371 318 6 101 238 16 -281 -157 6 -80 -247 160 -138 -157 -437
2393 -437 -194 -36 -226 -145 -161 132 227 -82 14 -30 154 -125 258 41 300 206 -109 -219 305 98 -13 -49
2415 -49 100 -59 -158 119 223 -198 -359 -63 -173 -355 -280 -87 -87 -402 -106 -140 -139 -256 73 47 -85 161 474
2438 474 107 -35 87 308 11 313 190 75 -11 15 -52 -161 49 -95 -7 10 -144 -305 -229 -129 -187 -214 -165
2461 -165 -17 -22 -257 -25 116 54 14 92 94 287 168 -43 282 147 131 296 40 -110 48 -78 122 -21 -180
2484 -180 -75 -77 24 -25 -262 -5 -208 -223 -82 126 83 -229 96 -44 91 -63 349 236 189 -196 -84 211
2506 211 151 33 123 177 -53 238 -6 -24 -76 -194 -44 -259 -328 -167 -289 -41 -127 -90 -228 -7 0 -116 -79 64
2530 64 113 -51 73 90 141 53 -4 229 120 193 194 215 -49 171 32 -4 -101 -154 -57 -78 1 -44 -65 -212 59 -24
2556 -24 80 116 -134 -72 -134 92 -52 -41 158 278 115 186 203 208 157 184 134 160 -4 1 94 224 152 249 252 -50 -21
2583 -21 -116 -276 -380 -106 76 -216 -134 -157 97 59 -344 -187 -59 -119 27 533 -36 -29 200 238 118 117 230 250
2607 250 -171 17 106 -143 -226 -284 -4 -157 -40 -231 -130 -279 -257 -143 -64 -299 -181 -136 25 156 79 -55
2629 -55 183 -47 38 147 70 113 183 202 38 56 165 105 148 -214 70 -67 19 -56 -188 -274 -106 -176 -66 -26 -148
2654 -148 -99 -172 -177 109 -89 -107 115 123 -63 -2 158 93 -47 -44 275 111 -1 -282 258 135 58 -65 182 -153
2678 -153 -244 -47 -225 115 -326 -100 -192 -127 -112 -99 -12 -319 -120 37 35 -27 210 233 177 38 254 241 -163 57
2702 57 97 299 145 -163 345 132 13 -32 -82 -18 -153 -33 -289 -313 -130 -141 -43 -251 -250 -37 -254 160 52
2725 52 -123 -197 76 225 70 -86 69 284 -137 -146 343 -182 -94 150 35 143 -83 66 147 -119 -350 -352 -19
2748 -19 -273 -386 8 -175 -223 -121 370 117 -121 -6 278 4 150 153 485 142 -200 35 117 13 27 -118
2770 -118 123 -56 -62 -30 3 50 55 -49 -179 -120 -86 -82 26 114 -73 -194 -71 49 61 -22 -3 167 -151 59 95
2795 95 -47 20 30 298 141 -1 180 197 12 -21 -89 95 -55 -32 24 -222 -403 -242 116 -57 -141 -156 -200 -35
2819 -35 -141 -128 -119 -196 -24 -51 90 152 145 340 83 210 116 67 336 148 107 -45 76 110 -48 149 32 85 -76
2844 -76 -179 -151 -129 -27 -118 -194 117 68 102 -251 -102 -2 80 307 105 94 -1 131 182 -42 -121 -2 -149 -235
2868 -235 -91 118 295 -84 -180 -111 -220 -94 -130 -16 -198 -236 -275 -2 -30 -26 150 178 -168 -8 71 186 141 -13
2892 -13 394 88 -9 64 116 -20 -60 144 127 -66 56 -211 54 -13 5 -220 -185 -84 -189 -29 -35 11 -199 9
2916 9 -41 130 -10 -67 113 144 205 101 287 275 242 66 306 182 1 312 182 -174 46 85 104 -277 -152
2939 -152 57 51 42 -81 -28 -96 -106 -335 35 186 -129 -58 62 243 -76 8 123 157 92 255 277 148 19 -88
2963 -88 -57 -11 -53 43 146 -50 -71 173 -92 -139 -13 -19 2 112 -63 11 -185 129 -97 134 198 124 -18 66 164
2988 164 -119 15 343 39 -84 -21 -89 273 -250 83 61 143 29 -180 -164 -4 -154 -164 97 -114 -163 -35
3010 -35 -125 -92 23 -26 4 -135 -26 -189 180 303 125 89 164 -58 28 236 214 -61 37 -2 318 104 50 -239
3034 -239 -12 -68 -34 -31 8 42 -140 -32 174 -8 133 77 29 -22 -68 106 5 26 168 182 214 132 266 201 -74
3059 -74 98 120 -42 132 -124 4 -146 -168 -40 -180 -188 -204 11 118 -201 -129 -26 -5 72 -102 -1 8 186 120
3083 120 84 221 61 71 -259 -40 86 -8 -97 344 11 -18 166 79 -162 90 -115 -278 -236 -116 -36 -115 -51
3106 -51 -211 89 2 -14 3 -22 253 -62 -120 71 194 -180 81 122 -74 -76 -2 122 -33 -274 -73 -55 -429 -80
3130 -80 -34 86 -174 -169 -9 -280 87 -122 20 6 5 -112 -2 163 -2 -14 159 93 -13 77 28 112 116 34 44
3155 44 346 46 161 -87 -80 -73 -39 -193 95 -145 -332 47 47 -184 -46 -11 32 -116 -69 -95 190 -26 41 -56 132
3180 132 90 119 128 48 -167 219 228 -83 121 -45 4 14 -230 132 -12 -2 210 -341 -93 87 -179 55 -345
3203 -345 -187 9 -158 126 -133 -232 -61 -15 -89 255 -100 -54 93 130 -68 140 -122 -75 100 -48 81 -166
3225 -166 14 -58 -269 33 95 118 -120 -37 -173 -113 -65 -193 168 -284 176 58 77 236 -91 70 34 57 -136
3248 -136 32 27 -78 10 189 50 -40 74 -92 126 -79 51 254 263 7 -38 37 -367 -80 -19 -265 -106 71
3271 71 57 122 61 -31 172 -105 201 -73 24 -165 311 160 -2 8 -4 8 65 9 -131 -112 -45 -21 53 -378 -58
3296 -58 157 -43 -367 -106 193 55 -155 -68 103 -159 193 21 -16 -361 -9 -68 234 -75 141 46 248 -87
3318 -87 -60 132 -52 190 -20 8 -72 -95 -145 -48 -35 -51 -101 -30 -106 -68 -63 -49 -5 56 -132 27 -29 -114 30 12 -24
3345 -24 94 230 72 98 15 -57 -97 18 134 178 -103 17 77 -31 -69 -211 -236 91 25 -98 -138 -54 226 143
3369 143 -403 -38 -88 297 -309 58 252 174 34 176 106 -6 76 -27 -141 -104 -45 27 79 -24 -14 -54 -107 -18
3393 -18 -131 -130 -44 122 -13 62 -167 60 3 78 -68 46 79 192 132 77 103 156 268 200 -205 166 190 -135 264
3418 264 88 -168 28 10 -5 6 -238 -120 -76 -153 -297 17 -52 42 -146 153 156 -102 -166 -145 99 -328 -70 111
3442 111 -124 23 -47 211 210 -21 235 -25 9 -124 -71 -178 -177 16 -72 -280 -31 -14 -7 45 77 14 254 128 -320
3467 -320 -113 -17 190 -183 77 35 58 110 -104 -83 231 149 5 34 97 31 -97 -238 44 -164 -116 172 67
3490 67 45 -41 -110 -20 -30 -77 175 56 -20 86 28 -26 -49 118 44 -7 6 92 -39 -72 93 14 74 61 93 40 35 25
3518 25 73 131 3 -19 -251 -71 179 -26 -134 -211 -156 -135 -201 23 -25 159 -93 -176 -58 95 262 -32 92
3541 92 13 -90 -76 157 -41 125 93 -38 -17 185 -36 -28 -52 88 -87 -138 -65 -167 -55 -184 -85 -156 -122 -75 77
3566 77 -166 134 -110 34 -13 105 -60 62 22 -120 -15 -49 229 82 -116 37 -65 -272 -46 -377 161
3587 161 -156 -76 -56 -52 -105 -77 -5 78 22 -222 -84 157 -192 -24 111 -37 216 1 -308 255 49 88 89 78
3611 78 85 -122 -160 -90 54 12 49 -77 96 -107 -43 -177 -86 -203 -67 317 -110 -22 71 5 93 126 -62 237 -102
3636 -102 56 81 142 159 137 77 -78 14 -172 -67 67 25 41 -34 -36 -69 -69 -144 -134 -99 -54 183 22 59 -19 201 -51
3663 -51 57 55 7 -61 40 -139 109 30 56 298 118 177 -106 16 -247 209 -73 -188 97 76 81 132 66 -57
3687 -57 42 -77 -18 81 78 -58 -87 24 -59 -71 101 -147 -93 -169 -5 33 114 215 84 103 201 322 -110 -5 -58
3712 -58 -166 -212 26 -153 66 -142 -233 139 -44 39 55 40 74 -57 39 -3 -48 52 -1 87 -92 0 40 -100 49
3737 49 -45 131 31 206 -1 18 29 -103 -322 -25 34 48 -51 -8 -70 -168 -122 -97 3 -203 175 -39 3 168
3761 168 -139 10 32 206 -31 206 236 177 -3 204 -64 25 203 -174 -58 -23 122 -116 94 185 -23 -121
3783 -121 330 -16 -81 -194 91 108 -52 5 83 -12 -46 61 29 33 -50 76 -7 109 134 -20 127 153 -80 109
3807 109 -66 46 -204 41 23 27 48 12 27 1 -40 29 -219 -39 77 -91 7 139 -123 177 -147 104 24 -162
3831 -162 219 84 -112 -61 69 -5 -13 -48 -66 120 19 -224 134 -82 -82 -4 -218 196 90 38 96 -103 47 38
3855 38 121 -172 -201 -172 55 28 34 -10 78 132 49 -15 12 34 81 0 72 -64 -88 -51 -171 46 -40 60 -127 -105 -12
3882 -12 20 -200 -110 55 -119 109 -126 -42 -183 148 116 134 -64 5 22 239 -130 -19 -56 122 44 125 -38 75
3906 75 -31 -27 60 38 88 -154 25 140 -212 -110 64 -64 -98 -189 39 -45 228 -4 82 -25 -253 102 54 -45
3930 -45 -350 3 -72 -2 -47 358 101 15 223 190 17 -38 -25 61 -179 -222 -117 -22 -138 11 75 -56 -49 -99 -18
3955 -18 212 107 46 99 -76 -265 -27 -157 75 249 -7 150 337 43 -60 -266 -3 84 28 -136 89 21
3977 21 50 -114 52 140 9 -122 3 178 42 -29 81 -81 48 235 103 -199 -30 42 -96 46 173 -124
3999 -124 141 150 -35 134 -162 -76 -56 35 -52 -35 -132 101 -129 -86 -77 161 -27 206 91 77 207 218 -77 103
4023 103 -115 158 -174 -170 154 127 -17 234 11 34 -130 257 -76 26 80 158 -13 -57 80 -87 48 -131
4045 -131 -15 63 -92 -83 216 219 39 132 63 247 -95 -230 147 -116 210 -135 -58 215 -28 179 195 -10 -271
4068 -271 52 58 -16 70 19 -107 272 5 174 -20 -106 -8 -145 -167 123 130 -278 270 -211 -112 68 -58 -5 130
4092 130 -237 81 -56 206 138 28 58 23 -55 -160 89 -50 -239 -156 -57 8 134 58 -32 103 -69 -106 -113 50
4116 50 -47 -269 43 -44 171 197 -165 -303 23 -135 8 85 101 196 32 -58 67 -12 38 116 -98 -136 213 -25
4140 -25 -93 7 183 -71 -43 26 -87 -108 -369 -44 -172 -13 42 -33 155 267 91 -39 -123 3 248 167 77
4163 77 53 -86 -194 -99 -138 -51 -11 -13 -12 128 -126 -159 -90 -30 -96 -46 17 -37 32 -153 -183 40 -34 62 -6 36 140 84
4191 84 193 -16 -133 138 -78 113 17 12 93 -83 29 -152 -252 -7 27 29 129 -56 -66 10 133 50 23 214
4215 214 -123 -152 106 -115 -100 45 52 171 37 -202 195 224 -30 -46 148 -6 -133 121 -85 -156 -25 -225
4237 -225 161 -115 -219 20 47 -42 96 242 -161 170 -26 90 295 139 -110 -9 43 -21 56 -169 1 -92
4259 -92 85 -276 -92 -19 132 -71 -16 15 92 -128 -207 -96 26 231 4 -2 -60 -179 210 -180 5 9 -13 52
4283 52 42 152 42 47 -89 130 -44 90 -135 173 0 84 83 133 23 -264 -78 -98 -23 -5 10 67 101 147 -19
4308 -19 366 53 59 -75 -85 17 59 281 13 -36 69 79 214 -131 351 -59 161 -207 10 21 58 55 -152 64
4332 64 34 -3 -216 138 -37 1 57 106 83 -109 -2 -35 155 2 106 -6 10 9 33 434 -31 106 -118 -22
4356 -22 21 -36 -28 -12 -23 268 -48 -162 71 177 -212 -155 19 138 26 -49 114 -31 31 -118 -44 76 34 240
4380 240 245 -72 -27 50 63 187 -122 68 -114 42 -136 63 -123 -74 -31 105 -219 -94 160 100 -146 134 174
4403 174 53 -194 -36 -103 -22 222 137 -51 46 58 -62 8 -116 -85 79 30 -98 100 -188 -42 -53 231 -4
4426 -4 -30 26 98 4 -115 -160 -70 -86 -96 43 -16 -27 77 -232 220 -9 -89 128 90 77 8 106 110 79 33 89 85 -17
4454 -17 -132 43 -62 48 -145 -163 -84 24 -65 62 139 240 -161 -122 43 -133 132 111 105 140 42 -33 -38 -79 99
4479 99 33 1 -88 -64 -123 1 -4 53 -39 164 -22 85 -47 -121 -311 -4 159 -24 70 -5 -31 -76 -11 -244 57
4504 57 -17 -102 -190 60 67 123 3 12 57 96 -10 196 58 -102 88 -96 18 124 -212 -28 -27 66 -110 -126 -1
4529 -1 62 149 30 -22 -47 -309 7 22 41 48 -64 6 157 -65 54 59 0 -136 67 45 87 203 76 -8 137 56
4555 56 16 -54 -85 -55 67 14 15 86 -147 91 220 -95 31 -203 -189 38 42 100 -51 104 -80 75 -18 41 123
4580 123 36 16 53 166 60 -1 -161 50 -22 -16 -46 84 57 21 2 37 -31 -4 67 -82 165 80 167 27 102 -119
4606 -119 124 -39 38 -14 55 244 111 -258 102 -55 2 -135 -56 -38 50 146 1 93 -58 -66 -13 -51 -66 45 42
4631 42 156 -192 58 60 259 74 56 -102 16 -55 15 -14 87 124 180 102 -78 -37 89 14 -239 -162 -10 22 -137
4656 -137 155 -243 -56 -104 75 -73 -200 -200 -96 70 58 2 146 -137 -48 -164 -100 66 -16 130 96 -162 -66
4679 -66 -11 166 -144 -66 -69 -76 -107 104 18 108 -137 -97 -21 -113 -84 -75 -41 30 10 -71 -24 -60 203 230 42 -118 -62 73
4707 73 -183 -175 -34 55 99 88 2 121 -177 97 279 31 43 -51 222 144 -114 7 8 -124 89 47 33 23 71
4732 71 -19 -27 -77 -39 46 -284 298 -8 115 153 -146 124 -43 -147 -1 -43 -159 12 -298 -64 -291 -66 12
4755 12 85 169 156 263 -93 133 23 169 -13 140 -88 -46 -102 95 299 26 -184 45 95 -106 7 100 -198
4778 -198 -42 -6 20 -104 -169 164 -140 31 -103 -90 -63 -138 61 110 52 46 64 42 -67 94 154 -63 233 126
4802 126 3 -89 91 15 32 -112 113 -18 26 142 -52 55 76 161 94 29 147 -151 -209 -180 -51 8 192 103
4826 103 100 218 3 175 -185 -139 20 106 36 80 -135 -35 -29 146 -137 -49 57 214 -194 145 -228 236 380
4849 380 -142 143 -182 267 40 -28 98 -156 76 -99 -28 60 180 -73 -4 -64 10 -104 -96 121 -14 37 143
4872 143 -100 -78 -78 -57 77 -204 -159 -110 47 115 72 -164 5 69 -77 -43 -31 -21 -102 -129 -47 -103 33 -155 -204 -12
4898 -12 125 104 32 -40 5 100 98 -41 19 -91 45 -113 -23 145 -88 30 -151 -118 -39 34 -34 -70 -14 188 -64
4923 -64 67 84 187 8 -22 19 -139 -36 38 165 54 -97 33 74 -68 -119 48 54 -11 -96 -38 7 -9 -71 -116
4948 -116 147 134 -14 88 107 62 -193 130 128 -6 51 118 -220 -132 -1 -4 82 54 74 -119 15 56 88 63 -22 59
4974 59 -31 -88 103 2 104 12 122 23 28 -115 -124 -153 108 98 71 -24 155 -130 -162 252 187 59 125 247 -31
4999 -31 124 36 122 -114 -50 -53 -50 114 11 -101 -178 113 -8 -111 91 -79 71 99 180 -51 50 96 -109 24
5023 24 -95 88 145 -142 83 -10 48 161 -17 236 133 35 86 -222 222 55 118 -12 -211 -40 -22 -25 123
5046 123 -62 -128 -37 -7 34 107 -69 116 204 98 -27 1 22 -199 -40 254 103 247 -29 -87 70 -148 43
5069 43 12 43 208 -28 148 19 212 79 58 75 85 -93 -120 -23 -280 -82 68 -19 -116 179 168 25 28 62 149
5094 149 35 -90 -259 97 -218 62 -52 -120 124 -56 -65 155 -16 -136 153 116 -77 -41 -112 101 122 105 -97
5117 -97 -147 85 23 -52 135 -70 -67 231 175 44 117 326 -212 146 263 -13 -8 32 94 -244 -284 106 -204 -62
5141 -62 -2 -73 21 -112 205 4 95 -149 -214 -87 -207 66 85 27 295 3 57 56 -107 36 -161 61 63 105 -83
5166 -83 -33 183 -42 -9 -88 -142 319 19 244 47 -234 203 8 -123 235 63 22 54 57 82 90 50 -123 -2
5190 -2 -14 176 -137 66 -39 -63 56 137 -145 -93 40 -34 -92 139 -96 -90 -60 -31 -111 73 -82 73 83 -129 159
5215 159 -100 -201 -110 -109 4 108 51 23 -32 -48 -88 -90 130 40 -14 -267 -51 -43 34 96 -100 -64 55 -69 108 239
5241 239 203 3 -82 83 68 181 165 178 24 370 165 102 -42 -78 -233 153 35 -119 171 -45 135 -77
5263 -77 19 -22 -172 -116 -46 7 -145 202 -106 30 79 181 -34 -70 22 -181 -167 -315 101 8 138 231 -65 44
5287 44 7 -62 78 -184 -4 -2 120 -65 -136 78 -17 222 -92 -78 41 244 -141 -23 5 163 -51 -105 -131 108
5311 108 155 -149 -110 -62 210 -25 80 -196 -120 86 179 176 -238 123 -96 135 189 -17 -172 -31 114 77 -126
5334 -126 96 -198 -12 83 -197 -280 -103 -313 -203 81 196 180 152 -11 -24 -36 -192 221 248 126 -250 -259 196
5357 196 69 32 7 -155 -261 251 56 20 152 86 -231 -18 -73 -6 -128 -66 88 30 -20 -81 256 -34 -37 -208
5381 -208 -37 -51 59 -34 73 -47 -11 158 -80 169 -51 57 -111 48 57 -16 68 92 -118 -40 -63 226 -42
5404 -42 99 151 -37 -11 34 -50 55 267 -42 164 86 188 -193 122 86 203 -32 -104 -90 -3 29 42 -112 -88
5428 -88 -161 -285 -10 -242 81 40 -16 -227 59 177 -39 116 57 103 118 118 83 25 90 101 -108 60 70 204 40
5453 40 75 -250 78 -185 39 27 249 115 60 -44 -155 88 128 154 -82 150 -5 -10 -23 10 143 57 -247 -126
5477 -126 97 -21 189 212 34 -43 204 -163 12 79 46 174 -8 2 75 49 -251 84 -171 107 -77 -147 -58
5500 -58 117 76 -18 96 65 12 190 10 306 -2 -119 87 115 -50 9 77 -27 -197 18 27 241 43 -2 -168
5524 -168 -37 -388 -38 164 23 84 -120 32 148 11 -9 180 -113 161 79 -13 -76 234 236 157 73 -96 154
5547 154 -6 203 68 -22 -13 -110 207 -17 -26 51 51 -268 -38 -52 -32 -12 -73 124 9 129 -268 -89 103 226
5571 226 105 101 -183 -83 17 -35 -82 -68 -64 237 88 -87 -35 -108 10 38 -132 177 -61 326 78 -165 86
5594 86 -229 28 36 135 49 -239 40 -50 -29 9 -85 -101 66 128 53 -7 -72 -212 -127 -20 45 66 164 199 246 -151 -222
5621 -222 61 -192 0 -105 -69 24 -30 -56 -128 56 184 149 -25 -32 159 -58 55 -51 -226 141 -120 85 146
5644 146 -79 45 -6 -187 -80 -124 -62 -28 -169 -36 -230 -182 200 -214 158 -184 -12 -13 -155 -208 34 -173 179
5667 179 156 -83 -233 66 -85 -83 172 58 137 -23 259 112 210 120 244 57 -385 -97 -2 -74 69 69 -81
5690 -81 -89 59 -17 202 -141 -175 -218 -178 -189 96 -41 92 112 -55 55 49 15 81 -137 242 -166 -130 54 -92 -65
5715 -65 -78 -29 91 -51 -216 164 35 173 -6 -137 49 2 16 -12 -30 122 -141 177 -109 1 -216 28
5737 28 103 -64 100 24 -255 276 208 137 -44 -214 99 -43 -105 -84 -21 -100 -129 -162 -8 25 30 -126 103 -68 74
5762 74 -137 -152 123 2 -110 -102 -100 16 32 175 151 250 -11 39 11 52 114 14 53 -78 -24 -198 9 36 -66
5787 -66 220 -102 90 -85 126 113 26 169 82 -95 -17 -8 92 18 219 -49 -43 4 -162 24 -220 194 197 -26
5811 -26 -128 -126 -17 -27 -22 -132 -128 -27 30 71 33 -118 -27 -115 133 183 14 -36 -193 107 -119 52 102 79 -205 -203
5837 -203 91 -140 -130 65 115 211 -42 -49 -50 57 -44 113 -37 26 -7 66 -94 184 27 102 -97 -79 117 67
5861 67 118 122 40 79 133 -109 21 -136 -144 60 -52 -93 -41 -180 235 -67 24 131 17 44 -66 42 -75 -61 78
5886 78 -48 -140 -63 57 171 -7 96 -54 -83 126 56 125 95 -34 0 51 -133 -203 67 16 201 -130 11 -35
5910 -35 147 28 0 -129 -27 47 68 79 26 106 -124 -223 -78 67 -120 276 -65 3 -124 -77 41 25 12 146
5934 146 45 -20 51 90 104 106 -148 -49 39 -193 -28 9 138 -34 67 -143 18 -73 -52 -3 -13 47 -103 -89 294
5959 294 -229 -336 100 -172 -183 -34 -38 -163 93 95 -22 -222 269 -57 132 -158 -68 -6 1 73 -106 -3 -28 -49
5983 -49 25 79 136 -52 21 6 5 -12 -173 -67 2 47 -165 27 -78 -92 -36 34 -113 -10 -40 -24 146 -7 -96 87
6009 87 196 -161 120 127 28 33 39 -22 -64 15 -94 193 -110 157 -114 49 -86 -90 305 -122 135 -122 12 -235
6033 -235 80 -71 -243 -125 181 68 172 -144 -61 -110 -74 -31 -85 129 -36 37 10 -48 -78 312 280 -59 37 200
6057 200 -43 -21 -29 180 -58 -31 -160 -150 40 -80 -245 -102 -50 -156 10 227 163 12 146 10 168 -47
6079 -47 -159 -336 2 -105 -122 -75 -60 1 105 -60 70 242 157 -67 -31 36 14 16 10 -27 37 -68 39 -79 33
6104 33 195 -320 -113 -78 -80 -115 161 -172 340 9 -63 -25 0 232 -80 -50 48 -26 -258 -2 146 166 -20 -70
6128 -70 -127 -310 -6 50 28 -120 -111 -6 -42 151 131 72 -232 -21 -68 116 -131 117 108 -209 -122 278 121 38 56
6153 56 -55 -9 37 189 36 41 -144 238 52 62 -192 153 173 -5 -135 289 -21 10 -5 -15 -140 -106 42 254
6177 254 -87 -51 140 -178 7 191 289 -48 -52 178 5 -193 128 110 32 128 85 48 -109 12 41 59 -44 -280
6201 -280 -158 106 34 -2 59 -148 -329 -14 -37 133 135 33 -72 -23 29 -171 10 -86 -58 -122 -37 17 230 -257
6225 -257 -167 -58 -98 27 30 36 188 -54 -56 -53 31 -170 -155 202 53 -1 209 -126 15 -59 16 175 12 69 -162
6250 -162 189 18 55 57 -161 52 95 55 84 196 -188 249 -67 -70 23 163 -33 -185 20 -301 138 -1 -123
6273 -123 -98 -116 -32 110 -158 115 42 -128 29 -17 40 43 -34 298 271 -41 59 -6 98 57 -99 22 5 59 -267
6298 -267 41 -46 50 -238 114 -125 -83 -181 31 128 123 88 -40 123 -201 -37 164 96 -152 -159 -353 -91 -36 33
6322 33 -13 -34 25 -95 -174 81 -89 -221 47 -52 -330 -184 375 139 37 -43 -108 84 119 -231 13 59 5 179
6346 179 245 112 3 56 -70 -126 131 241 -38 58 125 52 84 18 -10 40 65 85 199 -171 80 -260 18 153
6370 153 -38 -80 29 59 -165 15 29 -7 -86 -103 -158 -55 93 4 27 -65 167 8 -74 80 186 -79 202 -22
6394 -22 71 29 -256 -138 -51 -63 193 160 62 166 -110 6 147 3 42 -72 19 -133 126 20 328 137 81
6417 81 -109 231 61 -176 -213 27 -49 51 64 73 163 -89 -13 -63 -12 -271 9 183 18 -129 -92 -111 27 -27
6441 -27 65 -95 18 118 -37 -61 128 -7 -21 138 167 80 93 84 -190 79 131 -149 299 -195 -73 -1 376 -160
6465 -160 4 110 89 -127 35 12 46 -114 39 -34 214 103 119 -81 108 -130 -150 172 25 59 -120 111
6487 111 -197 53 -246 -71 50 99 -10 -9 -109 108 184 -276 -81 111 90 -161 282 66 -15 -11 -58 -187 58
6510 58 140 -49 -88 185 -90 -20 63 -82 -84 -86 -12 -126 -26 71 175 -103 89 10 26 -138 -218 -30 10 156 35
6535 35 265 76 157 291 33 -40 80 57 -122 175 10 20 124 -45 -93 -71 -115 -83 -6 -37 76 80 187 27
6559 27 -45 26 120 24 51 30 -38 -100 132 133 125 81 -204 -246 -48 70 46 -257 25 151 227 -71 -125 1 -113 -101
6585 -101 8 57 -74 129 177 25 -22 -8 21 -257 132 12 95 -154 -69 -70 -110 98 -11 152 -157 24 -133
6608 -133 205 -58 -60 84 -170 -115 -156 -109 -251 -165 208 36 19 -41 -49 136 78 41 172 120 -66 -219 -275 7 141
6633 141 53 -74 -47 -21 207 -22 90 -31 -54 193 78 -61 -106 -204 -96 -186 13 -67 -70 62 132 94 -113 99
6657 99 138 -187 -111 0 -59 -29 121 -70 3 -52 51 76 69 -135 175 -21 241 109 6 127 -131 -151 -55 -79
6681 -79 -134 59 -22 -72 -23 9 -249 216 17 190 103 -28 83 47 364 -161 -82 -132 -74 -134 -283 -161 -50 -14
6705 -14 201 -111 59 -147 -150 254 220 137 166 119 52 -59 33 31 -211 -91 27 101 -60 16 30 -78 23 191 10
6730 10 -54 -123 -159 79 -13 -284 176 -76 62 -24 52 4 10 42 -101 -107 110 -112 -65 49 -203 -26 52 48 -23 -222
6756 -222 35 -87 80 86 -27 -97 -116 76 210 19 -83 26 192 26 -12 -56 71 -73 -39 -144 108 75 -12
6779 -12 42 26 106 128 82 -115 37 -75 -64 -90 73 10 41 -105 113 -74 -159 33 -90 116 -125 161 -12 12
6803 12 -81 -3 -17 13 154 -21 5 -68 -71 -98 -30 40 104 -121 98 23 -49 -78 45 35 65 255 -133 250 -53 -285
6829 -285 -29 -122 131 235 37 59 -102 -147 -103 -212 45 166 98 138 -103 -24 31 -107 63 20 -24 80 51 195
6853 195 67 -221 -101 98 123 -127 8 -101 -100 80 -161 -9 -113 146 -192 106 104 298 24 50 184 -25
6875 -25 20 42 4 -293 -96 -12 -230 -72 -71 -209 74 -14 -28 5 106 41 51 31 28 166 164 -114 -62 -20 143 29
6901 29 183 168 54 40 77 71 280 155 -69 -144 -33 -79 -149 -42 131 109 68 77 -155 -68 -36 -260 149 -90 -236
6926 -236 148 -276 65 -28 -40 -133 66 207 35 -44 -9 60 -53 17 -33 68 241 -109 84 33 -305 110 -46
6949 -46 -63 87 -155 -37 -28 22 -17 -81 7 -79 26 -72 68 63 -37 22 240 -79 -5 -169 91 185 -94 -85 -32 -43
6975 -43 -46 54 -330 -221 -333 245 -79 4 -6 14 227 55 -234 -32 4 -71 -95 -151 117 -129 113 -121 -135 83
6999 83 114 59 -160 -30 55 135 208 -51 91 -344 -165 -19 81 86 88 25 -107 85 -138 149 43 107 84 -38
7023 -38 -20 -177 45 65 -22 45 118 12 19 -40 151 -10 -315 89 122 107 -229 -106 149 145 -95 52 -23 -56 33
7048 33 -14 -55 -52 -123 -29 -312 94 -137 209 174 -107 -78 2 -209 -97 -34 -138 39 15 -51 251 208 48 -26 60
7073 60 -78 109 189 43 -180 -155 132 167 108 268 -99 -90 -1 -126 151 -127 -214 -200 344 123 210 -33 148 -130
7097 -130 76 57 75 -97 -158 -95 -71 -58 -31 184 95 -7 79 -26 -21 -45 -162 170 -82 -112 127 81 -160 45 268
7122 268 89 104 13 69 134 -53 111 -46 214 85 9 -87 -8 -77 -113 -106 143 76 -84 -93 -60 283 -254 -164 102
7147 102 -35 -310 -214 -47 218 74 -241 -117 -79 -42 -1 -79 100 -13 45 -16 89 73 -211 -32 151 -153 -60
7170 -60 54 -132 -38 113 12 51 116 -174 55 1 -34 -172 -79 -228 195 98 6 54 -20 86 70 -37 119 -187
7194 -187 -42 25 38 -118 71 -81 -28 126 -183 -59 285 -128 2 -78 2 44 142 -229 186 222 100 -180 83
7217 83 245 -341 -52 183 173 -125 135 -96 123 -26 81 -78 20 -91 29 -71 -220 -24 -34 -199 -92
7238 -92 83 -255 19 192 -109 67 -201 50 -107 91 -89 -213 13 260 23 -29 5 -188 -239 -35 -193
7259 -193 -29 0 -28 -77 -132 70 -97 206 6 -33 157 26 98 80 60 -9 -237 -71 -53 142 -207 -28 6 281
7283 281 -123 17 -89 -73 64 -95 -34 -30 -5 25 123 -10 -178 -128 -81 -123 216 167 -40 -17 -119 -21 -20 177 -90
7308 -90 -114 -173 -113 -44 -157 -7 11 51 11 27 11 -3 -199 -29 185 -1 178 -53 -202 -24 -42 91 -191 102
7332 102 118 44 -14 8 143 -19 241 -175 98 -181 -80 -128 -27 -187 96 174 -15 43 -247 -42 -103 -212 85
7355 85 -107 50 -25 118 31 74 95 87 57 -9 22 -62 145 243 -154 -240 -33 120 209 -59 63 187 -99 39 -196
7380 -196 22 -235 58 180 -53 -4 -130 112 -58 -43 -75 4 -130 135 -242 -223 -155 81 -160 74 215 -210
7402 -210 -69 -339 -105 151 -61 -223 110 80 186 19 -6 -56 2 51 -58 44 71 -240 310 -54 -2 167
7424 167 151 60 71 74 54 -142 -51 302 60 -70 39 294 -121 -178 -59 100 -44 -206 103 109 64 67 22 8 227
7449 227 35 -223 -67 68 52 117 109 33 -64 52 82 76 -60 17 -52 -57 91 -135 -106 165 -1 -71 16 -229 52
7474 52 8 -146 60 -45 -112 -33 -62 -124 -106 -258 -98 -75 -16 -123 19 -109 62 157 -201 -69 -148 -162 123 -52
7498 -52 -25 206 -20 174 212 -96 53 -55 -106 -173 -40 42 164 -110 106 352 17 154 19 165 -92 -53
7520 -53 -119 175 -46 108 91 -93 35 -52 -4 92 0 -52 -117 -147 -115 -104 222 -15 173 104 -123 -31 -3 -66 70
7545 70 -29 -14 116 -44 -231 -78 103 37 -83 109 33 -86 -68 -4 27 3 -147 -123 104 113 42 -27 91 -62 251
7570 251 21 17 141 -20 28 64 183 49 0 -22 -14 83 77 87 -25 95 104 27 -176 231 -145 74 -7 98 91 -6
7596 -6 -71 -32 -152 -222 145 115 41 268 -22 -133 -25 42 -53 69 64 -36 25 -108 58 111 37 -104 -252 69 -125
7621 -125 -26 -2 -176 -49 18 -57 104 60 102 65 -106 35 -191 -66 89 175 113 112 58 -171 -13 -117 51 -75
7645 -75 -30 156 -226 -9 -132 -44 82 91 -152 -86 -52 -171 -18 109 25 -71 78 125 -37 -68 73 -376 -72 -167
7669 -167 87 141 -21 -119 -63 194 25 66 -200 110 57 70 -216 -126 -85 91 109 -22 142 -54 -134 91 -212
7692 -212 -31 -180 105 -89 156 31 90 -77 -8 -2 58 -4 110 149 258 156 4 -60 41 -232 -26 -98 39
7715 39 18 -31 -26 -3 118 -163 -127 -168 -78 -196 -61 65 -153 165 75 255 84 74 27 176 -41 -26 -90 100 -160
7740 -160 111 -89 -268 -7 -13 -102 146 -254 45 90 -60 -116 -38 -22 11 17 70 -4 -141 208 -88 -114 -89 -124 83
7765 83 68 73 67 74 51 -19 123 -38 -43 -32 -95 33 -23 144 -114 75 -91 107 -129 10 -1 -67 -91 -23 -59 -52 77
7792 77 41 -31 0 -25 -96 -4 -132 12 -271 161 45 -28 25 9 187 -44 -85 118 30 13 23 -88 -240 112 -52
7817 -52 66 -19 202 195 24 153 43 -40 -7 -24 84 174 -103 -107 -79 6 63 56 69 -24 -111 -132 -87 154 158 -129 -18
7844 -18 -24 174 96 -70 -17 81 -105 14 153 -9 -26 5 170 15 267 -74 -100 -155 -70 -28 160 232 90 54 -76
7869 -76 -162 180 -10 28 -37 113 167 133 -92 130 61 -111 165 216 148 46 -203 -47 41 6 93 -65 2 59 -87
7894 -87 16 111 7 149 101 -48 22 92 132 -37 -236 -42 45 -85 43 -55 -31 -38 -64 -233 -33 -156 27 -86
7918 -86 -135 -217 31 146 274 -102 -237 -3 -71 128 195 -130 -32 -174 56 196 -30 -74 -144 -4 -56 -25 -271
7941 -271 70 -93 -72 -158 127 271 9 35 -3 -1 166 -87 2 -108 177 12 47 135 -77 -51 -104 -12 -57 117
7965 117 -91 115 89 -8 -102 -239 116 172 -13 -97 -10 -144 34 -103 -35 -197 -9 42 70 37 36 -127 186 -67
7989 -67 -151 10 27 -72 108 132 171 -47 167 189 -98 120 140 -64 -39 166 177 -51 21 -156 -105 101 29 116 38
8014 38 68 88 10 230 -124 -115 -77 -31 -25 -62 -54 102 6 19 -58 147 195 -57 82 84 -16 66 -68 -68 -75 -163 116 -119
8042 -119 -102 -109 -277 -31 105 194 -79 94 88 -10 -134 -266 17 7 -286 28 8 27 -198 -156 -219 6 -55 13 -5
8067 -5 -68 -17 -5 194 -68 -25 -95 -132 -27 183 -288 154 159 79 73 25 -292 -87 29 31 84 69 -205 -118 -81 -186 82
8094 82 -146 -165 148 -39 -83 -124 150 -108 -91 -151 -222 18 -52 194 153 52 -54 12 -130 -63 51 -75 121 44
8118 44 -213 -20 100 -41 88 -40 102 58 -4 -97 230 -305 118 257 117 -13 -39 230 -217 -82 32 -6
8140 -6 -58 -133 48 -81 71 140 7 -148 -212 -105 143 -53 -270 -8 205 -124 97 -284 105 -25 94 -377
8162 -377 -68 109 5 -35 47 121 -224 64 -180 -86 -53 6 3 89 11 177 -6 -62 -88 159 89 -9 51 -92 -38
8187 -38 31 22 -4 17
8191A7
##END NTUPLES=NMR FID
##END=
