##TITLE=1H_Pr dep
 CD3OD
 8 sc, 
 23.3.2023
##JCAMPDX= 6.0         $$ Bruker NMR JCAMP-DX V2.0
##DATA TYPE= NMR FID
##DATA CLASS= NTUPLES
##ORIGIN= UXNMR, Bruker Analytische Messtechnik GmbH
##OWNER= root
$$ XWIN-NMR		Version 3.5
$$ Thu Mar 23 14:50:21 2023 Russian Standard Time (UT+4h)  she@DPX200
##.OBSERVE FREQUENCY= 200.13135
##.OBSERVE NUCLEUS= ^1H
##.DELAY= (6, 6)
##.ACQUISITION MODE= SIMULTANEOUS
##.ACQUISITION SCHEME= undefined
##.AVERAGES= 8
##.DIGITISER RES= 18
##SPECTROMETER/DATA SYSTEM= spect
##.PULSE SEQUENCE= zg30
##.SOLVENT NAME= MeOD
##.SHIFT REFERENCE= (INTERNAL, MeOD, 0, 15.7039)
##AUDIT TRAIL= $$ (NUMBER, WHEN, WHO, WHERE, WHAT)
$$ ##TITLE= Audit trail, XWIN-NMR		Version 3.5
$$ ##JCAMPDX= 5.01
$$ ##ORIGIN= Bruker BioSpin GmbH
$$ ##OWNER= she
$$ F:/spectra/data/she/nmr/H-F/1/audita.txt
$$ ##AUDIT TRAIL=  $$ (NUMBER, WHEN, WHO, WHERE, WHAT)
(   1,<2023-03-23 14:49:26.42 +0400>,<she>,<DPX200>,
      <created by zg, POWCHK disabled, PULCHK disabled
       configuration hash MD5:
       00 E9 B6 7A A2 85 ED C7 34 08 36 98 17 FE 4E 26
       data hash MD5: 16K
       C8 57 0B AB EE D2 CA 3D 14 06 C0 F8 52 89 2F 32>)
$$ ##END=
$$ 
$$ hash MD5
$$ 69 84 60 D7 A5 AF 98 A9 F7 7C 26 2E CA 76 D3 87
##$RELAX= 
##$RELAX= 
##$RELAX= 
##$RELAX= 
##$RELAX= 
##$RELAX= 
$$ Bruker specific parameters
$$ --------------------------
##$DU= <F:/spectra>
##$EXPNO= 1
##$NAME= <H-F>
##$PROCNO= 1
##$TYPE= <nmr>
##$USER= <she>
##$AMP= (0..31)
100 100 100 100 100 100 100 100 100 100 100 100 100 100 100 100 100 100 
100 100 100 100 100 100 100 100 100 100 100 100 100 100 
##$AQSEQ= 0
##$AQ_mod= 1
##$AUNM= <au_zg>
##$AUTOPOS= <>
##$BF1= 200.13
##$BF2= 200.13
##$BF3= 200.13
##$BF4= 200.13
##$BF5= 200.13
##$BF6= 200.13
##$BF7= 200.13
##$BF8= 200.13
##$BYTORDA= 1
##$CFDGTYP= 0
##$CFRGTYP= 5
##$CHEMSTR= <none>
##$CNST= (0..31)
1 1 145 1 1 1 1 1 1 1 1 1 1 1 1 1 1 1 1 1 1 1 1 1 1 1 1 1 1 1 1 1 
##$CPDPRG= <>
##$CPDPRG1= <>
##$CPDPRG2= <>
##$CPDPRG3= <>
##$CPDPRG4= <mlev>
##$CPDPRG5= <mlev>
##$CPDPRG6= <mlev>
##$CPDPRG7= <mlev>
##$CPDPRG8= <mlev>
##$CPDPRGB= <>
##$CPDPRGT= <>
##$D= (0..31)
0 1.2 0 0 0 0 0 0 0 0.06 0 0.03 0 0 0 0 0.0002 0 0 0 0 0 0 0 0 0 0 0 0 
0 0 0 
##$DATE= 1679568565
##$DBL= (0..7)
120 120 120 120 120 120 120 120 
##$DBP= (0..7)
150 150 150 150 150 150 150 150 
##$DBP07= 0
##$DBPNAM0= <>
##$DBPNAM1= <>
##$DBPNAM2= <>
##$DBPNAM3= <>
##$DBPNAM4= <>
##$DBPNAM5= <>
##$DBPNAM6= <>
##$DBPNAM7= <>
##$DBPOAL= (0..7)
0.5 0.5 0.5 0.5 0.5 0.5 0.5 0.5 
##$DBPOFFS= (0..7)
0 0 0 0 0 0 0 0 
##$DE= 6
##$DECBNUC= <off>
##$DECIM= 32
##$DECNUC= <off>
##$DECSTAT= 4
##$DIGMOD= 1
##$DIGTYP= 9
##$DL= (0..7)
0 120 120 120 120 120 120 120 
##$DP= (0..7)
150 150 150 150 150 150 150 150 
##$DP07= 0
##$DPNAME0= <>
##$DPNAME1= <>
##$DPNAME2= <>
##$DPNAME3= <>
##$DPNAME4= <>
##$DPNAME5= <>
##$DPNAME6= <>
##$DPNAME7= <>
##$DPOAL= (0..7)
0.5 0.5 0.5 0.5 0.5 0.5 0.5 0.5 
##$DPOFFS= (0..7)
0 0 0 0 0 0 0 0 
##$DQDMODE= 0
##$DR= 18
##$DS= 0
##$DSLIST= <SSSSSSSSSSSSSSS>
$$ [...]
##$SUBNAM2= <"">
##$SUBNAM3= <"">
##$SUBNAM4= <"">
##$SUBNAM5= <"">
##$SUBNAM6= <"">
##$SUBNAM7= <"">
##$SUBNAM8= <"">
##$SUBNAM9= <"">
##$SW= 18.05172834244
##$SWIBOX= (0..15)
0 0 2 0 0 0 0 0 0 0 0 0 0 0 0 0 
##$SW_h= 3612.71676300578
##$TD= 16384
##$TD0= 1
##$TE= 0
##$TE2= 300
##$TE3= 300
##$TEG= 300
##$TL= (0..7)
0 120 120 120 120 120 120 120 
##$TP= (0..7)
150 150 150 150 150 150 150 150 
##$TP07= 0
##$TPNAME0= <>
##$TPNAME1= <>
##$TPNAME2= <>
##$TPNAME3= <>
##$TPNAME4= <>
##$TPNAME5= <>
##$TPNAME6= <>
##$TPNAME7= <>
##$TPOAL= (0..7)
0.5 0.5 0.5 0.5 0.5 0.5 0.5 0.5 
##$TPOFFS= (0..7)
0 0 0 0 0 0 0 0 
##$TUNHIN= 0
##$TUNHOUT= 0
##$TUNXOUT= 0
##$USERA1= <user>
##$USERA2= <user>
##$USERA3= <user>
##$USERA4= <user>
##$USERA5= <user>
##$V9= 5
##$VALIST= <valist>
##$VCLIST= <CCCCCCCCCCCCCCC>
##$VD= 0
##$VDLIST= <DDDDDDDDDDDDDDD>
##$VPLIST= <PPPPPPPPPPPPPPP>
##$VTLIST= <TTTTTTTTTTTTTTT>
##$WBST= 1024
##$WBSW= 4
##$XGAIN= (0..3)
0 0 0 0 
##$XL= 0
##$YL= 0
##$YMAX_a= 41861
##$YMIN_a= -33288
##$ZGOPTNS= <>
##$ZL1= 120
##$ZL2= 120
##$ZL3= 120
##$ZL4= 120
##$ABSF1= 10
##$ABSF2= 0
##$ABSG= 5
##$ABSL= 3
##$ALPHA= 0
##$AQORDER= 0
##$ASSFAC= 0
##$ASSFACI= 0
##$ASSFACX= 0
##$ASSWID= 0
##$AUNMP= <proc_1d>
##$AZFE= 0.1
##$AZFW= 0.1
##$BCFW= 1
##$BC_mod= 2
##$BYTORDP= 1
##$COROFFS= 0
##$CY= 11.3945322036743
##$DATMOD= 1
##$DC= 2
##$DFILT= <>
##$DTYPP= 0
##$F1P= 2.36226072786647
##$F2P= -0.459571619588291
##$FCOR= 0.5
##$FTSIZE= 0
##$FT_mod= 4
##$GAMMA= 1
##$GB= 0.15
##$INTBC= 1
##$INTSCL= 1
##$ISEN= 128
##$LB= 0.24
##$LEV0= 0
##$LPBIN= 0
##$MAXI= 10000
##$MC2= 0
##$MEAN= 0
##$ME_mod= 0
##$MI= 1.114404
##$NCOEF= 0
##$NC_proc= 0
##$NLEV= 6
##$NOISF1= 3.799351
##$NOISF2= 2.8
##$NSP= 1
##$NTH_PI= 0
##$NZP= 0
##$OFFSET= 15.70392
##$PC= 1
##$PHC0= -19266.6
##$PHC1= 12.20075
##$PH_mod= 1
##$PKNL= yes
##$PPARMOD= 0
##$PSCAL= 0
##$PSIGN= 0
##$REVERSE= no
##$SF= 200.130013532006
##$SI= 16384
##$SIGF1= 3
##$SIGF2= 2
##$SINO= 400
##$SIOLD= 16384
##$SREGLST= <1H.CDCl3>
##$SSB= 0
##$STSI= 0
##$STSR= 0
##$SW_p= 3612.71676300578
##$SYMM= 0
##$S_DEV= 0
##$TDeff= 0
##$TDoff= 0
##$TI= <>
##$TILT= no
##$TM1= 0
##$TM2= 0
##$TOPLEV= 0
##$USERP1= <user>
##$USERP2= <user>
##$USERP3= <user>
##$USERP4= <user>
##$USERP5= <user>
##$WDW= 1
##$XDIM= 8192
##$YMAX_p= 0
##$YMIN_p= 0
$$ End of Bruker specific parameters
$$ ---------------------------------
##NTUPLES= NMR FID
##VAR_NAME=  TIME,          FID/REAL,        FID/IMAG
##SYMBOL=    X,             R,               I
##VAR_TYPE=  INDEPENDENT,   DEPENDENT,       DEPENDENT
##VAR_FORM=  AFFN,          ASDF,            ASDF
##VAR_DIM=   8192,          8192,            8192
##UNITS=     SECONDS,       ARBITRARY UNITS, ARBITRARY UNITS
##FACTOR=    0.0002768,     1,               1
##FIRST=     0,             0,               0
##LAST=      2.2672688,     0,               0
##MIN=       0,             -33288,          0
##MAX=       2.2672688,     41861,           0
$$ Real data points
##PAGE= N=1
##DATA TABLE= (X++(R..R)), XYDATA
0 0 0 0 0 0 0 0 0 0 0 0 0 0 0 0 0 0 0 0 8 -8 8 -8 8 -8 10 -16 16 -16 24 -24 27 -32 36 -40 48 -52 58 -65 73 -81
40 -81 90 -101 113 -124 138 -152 168 -185 204 -223 247 -272 300 -331 367 -406 451 -501 563 -632
60 -632 717 -823 954 -1125 1364 -1711 2265 -3304 5930 -27607 -33288 23077 13902 -3090 7230
75 7230 31408 18097 -7431 -21270 -19531 -16957 -5574 5836 10691 10769 17742 17016 286 -16735
89 -16735 -15510 -11623 -11959 -5074 11203 18160 14300 11077 6127 -9971 -20411 -13122 -6273 -9016 1094
104 1094 23223 24317 2416 -6707 -509 -6173 -19557 -15628 -174 7868 10724 15071 11772 -1085
118 -1085 -6913 -3869 -8916 -17770 -8657 10647 13043 4473 9010 14977 -663 -19409 -14275 -670
132 -670 -3243 -8420 4734 20801 16221 945 -6535 -8108 -8925 -7358 -5339 -3749 4174 15734 14894
147 14894 1308 -6161 -3894 -4994 -10131 -8204 3 4749 7336 11982 9539 -2353 -8360 -4124
161 -4124 -4653 -11663 -7226 8837 14070 5056 1615 6018 1444 -11560 -14254 -4245 2405 2297 4807
176 4807 8483 6662 2757 -850 -7165 -11541 -6358 1975 2494 993 6528 10416 4070 -4108 -5599
191 -5599 -5188 -7265 -5457 2274 6722 5600 5243 5309 610 -6010 -7660 -5298 -3989 -1133 5312 8668
207 8668 5110 1257 868 -1311 -6780 -7804 -3362 103 2725 6704 6823 1792 -944 23 -2712 -8657
223 -8657 -7265 1119 5157 3477 3528 5490 3111 -3222 -6079 -4588 -3531 -2498 1144 5153 6040 4156
239 4156 1499 -1913 -4775 -4488 -2662 -2622 -1051 4348 7471 3996 -298 -707 -1706 -5179 -5342 -1402 1206
256 1206 1949 4185 5685 2974 -1779 -3475 -3450 -3836 -2919 241 2925 3576 3800 3546 688 -3621 -4846
273 -4846 -3171 -1795 -763 1569 3779 3723 2691 1717 -1623 -5428 -4596 -781 535 -67 1961 4920
289 4920 3919 167 -1965 -2878 -3628 -3058 -697 1786 2543 2832 3092 1671 -1039 -2771 -3394 -3269 -1624
306 -1624 1485 3264 2412 1628 2174 700 -2688 -4133 -2785 -962 293 2120 3385 2416 797 265
322 265 -956 -3088 -3762 -1743 929 1936 2349 2631 1672 -114 -1342 -2061 -2640 -2514 -320 2062 2675
339 2675 2250 1698 271 -1423 -2056 -1953 -2074 -1443 1100 3211 2732 1091 48 -565 -1552 -2438 -2153 -850
357 -850 631 2085 2734 1901 422 -814 -1460 -2049 -2187 -923 673 1370 2061 2325 1148 -845 -1974
374 -1974 -1796 -1464 -1074 133 1278 1767 1885 1431 28 -1674 -2325 -1458 -500 10 547 1338 2096 1793 297
393 297 -1378 -2283 -1923 -662 230 521 1081 1830 1867 521 -1197 -2046 -1841 -830 453 676 671 1201 1782
412 1782 979 -1029 -1927 -1223 -669 -550 -16 1026 1716 1294 506 -193 -976 -1560 -1602 -974 356 1491 1711
431 1711 1253 311 -335 -593 -1242 -1736 -1083 530 1662 1408 603 268 9 -421 -1084 -1206 -794 -202 534
450 534 1253 1494 705 -412 -760 -254 -552 -1706 -1350 754 2358 1746 106 -403 -344 -625 -1052 -1039 -581
469 -581 354 1401 1959 981 -1150 -1425 101 651 -1066 -2034 16 2376 1653 -406 -728 424 565 -876
487 -876 -1901 -1030 550 1200 941 476 579 230 -555 -1209 -1457 -730 829 1474 409 -141 803 1147 -775
506 -775 -2357 -1038 1106 1130 -595 -802 1172 1915 118 -1460 -830 33 -393 -668 225 679 364 847
524 847 1134 -120 -1766 -1559 49 632 113 -27 786 1260 346 -886 -878 -489 -646 -109 911 831 -283
543 -283 -236 974 910 -711 -1598 -686 680 641 -380 -258 958 1370 245 -993 -1086 -770 -200 736 609
562 609 -287 260 1461 744 -1467 -1980 116 1343 -51 -1273 107 2052 1078 -1547 -1484 827 990
579 990 -1014 -1502 342 1537 749 -248 -278 87 36 -271 -716 -635 -96 876 1334 396 -757 -632 366 307
599 307 -1019 -1185 474 1506 648 -546 -497 311 321 -433 -791 -432 397 580 356 191 59 46 99 -369
619 -369 -743 -470 205 506 192 356 675 155 -705 -609 38 23 -347 -44 851 754 -83 -474 -173 165 -272
640 -272 -703 -189 590 535 8 81 393 11 -454 -416 -180 -56 155 279 338 265 7 -92 -95 -295 -562 -258 420
663 420 508 -116 -126 595 429 -403 -922 -239 408 229 -108 14 485 580 -176 -683 -229 140 -103 -149 147 310
685 310 381 224 -138 -323 -126 -14 -281 -141 256 196 109 179 227 -158 -344 -207 -142 -131 23 205 364 386 -62
708 -62 -298 -157 -104 -304 -280 293 523 117 -43 57 64 -120 -329 -315 48 361 144 -182 61 413 112 -444
730 -444 -315 -51 -46 -72 -73 143 393 182 -157 -291 -98 -190 -222 -31 247 230 196 146 -80 -230 -240 -144 -57 58 151
755 151 8 19 170 39 -190 -173 1 -64 -171 -51 169 307 199 83 -51 -141 -144 -233 -99 102 254 227 111
778 111 -1 -109 -215 -153 -181 53 155 96 30 47 35 -40 -99 -22 -17 -138 -39 139 108 130 188 29 -96 -143 -107 -87
804 -87 -63 98 241 184 76 -62 -168 -30 -132 -128 -1 134 149 35 -42 58 -38 -115 -109 -91 35 15 -17 51 26 159
830 159 13 -173 -164 -68 -14 5 70 88 179 2 -36 -205 -128 -11 -28 -24 128 26 72 67 10 -162 -176 15 30 -52 -45 69
858 69 120 131 24 -140 -53 -59 -38 -11 -44 93 171 68 -59 -163 -42 7 -72 7 119 64 20 64 36 -32 -145 17
884 17 35 -70 -33 58 179 90 7 -23 3 -98 -12 -25 -32 80 188 89 -181 -82 59 80 -122 -56 -11 102 102 6 -120
911 -120 -75 105 111 -132 -309 -67 295 238 -101 -272 181 226 -175 -251 -77 149 170 81 32 -127 -69 94 13 -121
935 -121 0 25 52 61 16 -7 33 96 62 -81 -118 -17 -12 9 65 78 12 -108 -37 -2 -81 -140 36 220 157 -153 -133 176
963 176 -45 -266 -8 245 9 -164 25 143 -131 -137 166 70 -195 -59 137 84 -172 -88 194 352 -81 -353
985 -353 -123 247 211 -170 -199 83 408 41 -360 -276 39 329 26 -321 -108 217 56 3 -10 -160 -86 215
1007 215 173 -339 -317 335 359 -192 -293 159 191 -117 -216 152 175 20 -94 125 59 -198 -181 157 114 -123 -51
1030 -51 204 3 -155 -12 247 -13 -229 -8 78 -19 -5 -26 -5 135 68 -124 -171 99 95 -141 -53 238 34 -158
1054 -158 -92 182 156 -142 -132 136 163 19 -151 -30 48 -77 -77 126 -149 -166 152 286 -94 -360 84 372 -68
1077 -68 -342 -18 115 113 -15 27 -29 -29 138 9 -165 -27 116 94 -14 -46 106 57 -61 -47 2 23 -23 39 38 39
1103 39 10 125 27 -203 -40 230 52 -284 -26 257 -11 -315 63 162 -107 -150 91 62 -136 -70 170 34
1125 34 -163 -41 48 -25 -102 -14 94 73 -109 41 20 -118 -196 51 78 -50 -32 85 23 -112 64 120 -71 -141
1149 -141 162 142 -102 -43 147 -27 -48 67 45 -145 -71 91 57 -66 3 120 -2 -123 -102 88 -21 -108 -28
1172 -28 164 12 -236 -77 162 -1 -127 56 80 -114 -51 108 -95 -133 132 136 -86 -111 114 34 -164 19 149
1195 149 78 -79 -62 49 5 -87 38 41 44 -72 30 38 -107 -100 134 50 -191 -68 115 2 -138 38 120 -70 -135
1220 -135 175 122 -226 -90 184 95 -75 -12 78 -15 -69 47 38 -28 8 10 -27 -95 -37 67 72 -71 3 13 -61 -101 37
1247 37 137 -25 -188 142 106 -68 -134 51 138 -98 -58 52 -40 -49 72 82 43 -43 80 19 -51 -24 37 -50 -76 28
1273 28 89 -28 -79 24 33 -26 -41 53 43 -58 -67 56 42 -80 -20 106 -35 -73 -12 143 -55 -40 58 82 -92 -10
1299 -10 98 -9 -22 -27 129 -10 -11 43 4 -42 7 51 0 25 -42 43 39 -87 67 95 27 -30 17 40 -32 -34 39 8 -64
1328 -64 -69 109 20 -35 26 32 -50 -57 68 44 16 -80 -17 4 -10 -95 54 25 -33 27 18 77 -67 -25 57 -34 26 49 12 -75
1358 -75 -11 -24 -46 3 8 96 -14 9 43 47 -46 18 65 57 -49 -40 84 -42 4 -11 4 9 -7 -36 7 -54 -12 63 28 -31 -60
1389 -60 34 57 -22 27 74 6 0 -32 12 -9 -13 -11 14 -57 -10 -23 42 49 52 -2 39 25 -12 -85 -54 16 10 15 -1 -35 51 -21 -66 33
1423 33 66 21 -41 -58 -1 -25 -34 2 73 32 -18 -25 -58 7 -1 42 27 -49 7 13 -16 41 -1 -4 24 50 -2 31 -6 -24 41 98 -14
1456 -14 -23 26 -4 -3 -47 -54 21 117 44 10 -23 30 1 -25 1 -47 -45 -75 -19 -2 -17 -1 14 32 39 -29 -40 55 167 -3 -48 21
1488 21 93 9 -39 -19 67 38 7 -18 0 14 -23 -48 8 3 -13 39 -23 -35 -23 18 22 -8 -47 21 -34 -27 4 18 53 74 58 -55
1520 -55 15 -16 -42 -61 1 34 -42 17 19 -28 -45 -14 12 54 -1 -31 22 16 72 -24 73 125 -1 -21 7 18 35 -19 20 33 -28
1551 -28 -31 -11 -50 -20 23 -12 12 35 -35 40 -21 49 -3 2 -26 6 52 16 2 28 1 5 13 15 17 -2 44 18 -28 -73 35 51 5
1584 5 40 26 41 -61 2 9 65 -3 10 58 -16 -13 31 26 -24 24 8 13 18 32 -17 41 29 -1 14 22 -31 7 17 -10 -37 -44 31 -41
1618 -41 -30 82 -35 -7 44 24 2 -52 16 17 -89 11 92 3 5 -19 -4 5 -31 -50 -15 18 6 -9 10 -33 -51 -18 13 -16
1648 -16 -33 21 4 -31 -15 42 33 -51 -12 -3 -66 27 26 39 27 -31 39 14 33 79 10 10 19 -31 1 -4 -35 20 1 14 3 11 34 -4
1682 -4 -12 68 2 -84 -23 46 -21 -61 -36 1 32 -39 37 -11 10 7 55 -47 4 -3 -1 55 18 3 -19 56 60 -13 18 -12 -85 8 -28
1715 -28 -19 -25 -10 43 -29 66 3 -68 -25 34 3 -42 31 26 -24 -22 9 -16 -64 -17 48 13 -44 -24 0 11 -4 -1 -36 8 -10 -24 44
1748 44 -26 -41 13 -6 -18 -10 0 -22 -1 -22 20 -12 -56 11 70 8 8 8 3 -41 -22 -12 -30 -42 0 16 -14 -25 -60 -21 40 -31
1780 -31 -10 -14 43 41 -30 36 -47 -49 37 75 41 38 5 -16 61 44 -30 -49 37 -8 -37 -57 7 53 -5 13 -40 -29 -8 -14 3 -45 -32
1813 -32 -60 -11 66 22 -13 -5 12 -13 -22 20 -7 46 -6 39 9 -24 12 37 7 -1 11 -49 3 11 29 4 -10 35 40 29 59 -84
1845 -84 -41 54 53 -2 -19 19 53 84 -27 -71 -8 3 -32 -7 -9 35 8 -10 25 21 -58 -33 55 22 0 1 -61 -5 102 18 -22
1876 -22 -39 -2 35 32 -22 8 -6 37 -40 25 -60 -40 33 1 -5 37 -53 19 24 3 -8 4 -9 -6 24 -34 -12 8 57 41 -17 27
1908 27 -1 3 -5 45 37 -20 -49 -2 -7 59 4 -31 38 54 51 -33 -68 22 78 75 -13 8 -2 -56 25 -25 -26 -35 -23 72 38 -49 -41 7 52
1943 52 -7 45 -76 -44 32 37 30 -11 -65 -13 36 6 -5 -17 -7 38 -21 -4 -7 -41 43 32 -7 7 -7 48 116 -24 -39 -84 11
1974 11 13 56 1 -39 -23 -17 -9 -8 -13 31 6 52 57 -47 -67 -76 37 -18 -85 -93 -13 9 39 37 -4 -35 45 38 43 -38 -36 -9 14 37 -6
2009 -6 -90 15 42 56 23 -19 -18 14 43 6 -38 -61 26 37 2 -17 -26 -31 34 21 -36 -53 -27 15 36 -2 -64 -28 34 41 -10 -10 16
2042 16 34 9 20 -19 -90 -17 17 59 -61 -34 9 24 29 28 65 0 2 25 68 -39 -29 -2 31 34 -31 -83 49 27 44 -20 -41
2073 -41 -8 13 18 1 -16 -43 -1 -5 31 -19 -83 -24 45 67 14 -21 -94 -11 77 26 -22 -33 5 -7 54 -46 -30 -20 51 -34 -64
2104 -64 -33 -37 -7 47 2 36 -49 31 70 45 -75 7 -3 36 38 27 -9 -79 60 69 -7 0 -73 9 98 1 31 -88 -26 53 92
2135 92 -27 4 -30 55 96 6 -57 -91 24 41 20 -9 -51 -32 83 32 9 -45 -7 -42 -17 11 -22 -82 6 23 -5 -9 -31
2164 -31 -41 50 114 -5 -83 9 15 43 -6 5 -71 65 40 -22 -42 -25 -26 32 -16 -19 -64 -65 21 48 13 -106 -32 26 84 70 -27
2195 -27 -81 -16 40 30 -49 -27 -13 47 31 4 -54 -52 4 63 40 5 -96 -59 99 45 11 -42 -4 70 18 8 -49 0 -1 9
2225 9 32 -56 -74 85 21 57 24 -59 -28 6 78 -5 -68 -22 66 42 14 -17 -84 26 -3 13 -39 -37 -36 59 17 35 -20 -41 22
2256 22 51 7 -25 -24 -38 79 45 -41 -102 18 41 -3 29 -14 -34 8 24 1 -26 -30 61 20 33 -5 -61 26 -2 13 47 -66
2286 -66 -51 49 63 -18 -68 -54 42 12 5 -28 -73 -8 -8 39 -4 -77 28 97 31 11 -59 -88 20 45 -39 -12 -32 -17 -7 28
2316 28 30 -66 -8 -30 75 20 -62 -57 35 74 -15 -81 -96 27 52 10 -60 -24 -40 49 41 -13 -39 14 37 53 -15 16 2 -4 4 37
2348 37 -64 -49 -19 71 56 35 -28 25 68 21 -32 -23 -51 -30 63 3 -5 -40 20 20 -31 -48 54 -16 29 14 27 14 -19 -15 34
2379 34 6 -38 -62 -38 96 51 4 -1 53 67 51 -5 -58 -69 4 67 18 -41 -30 39 47 25 2 -42 15 28 13 31 -37 22 31
2410 31 20 28 -40 -44 7 63 14 -37 -16 22 23 -7 -40 10 -70 39 44 -8 -53 -29 32 15 40 -31 11 -1 -5 48 -50 -3 -53 -16
2442 -16 25 15 -12 -7 -20 5 18 7 6 17 -21 21 11 -26 -45 -1 81 15 -29 -12 50 6 61 6 -19 11 23 60 19 -57 49
2473 49 19 71 -20 -15 -34 53 53 46 -4 -31 63 81 36 3 -54 -12 4 33 44 -34 -19 17 18 -10 -49 1 4 2 55 -7 -89 -33 -5
2506 -5 15 -71 -47 34 -43 23 30 -34 -27 33 35 -13 -58 5 -39 25 51 -13 -35 45 -20 47 -1 14 9 15 41 35 -8 -37 -50 25 38 -18
2540 -18 18 -80 29 27 -9 -32 -4 -22 19 7 -33 -55 68 9 75 5 32 -18 -13 34 12 49 -36 38 29 20 -23 -44 13 5 23 -33
2572 -33 -29 58 19 50 1 -46 -8 3 1 27 -17 -23 -63 -50 16 -61 -31 -33 44 47 -33 -32 22 -29 34 0 -114 2 12 3 31 8 -31
2605 -31 -15 59 4 -19 -9 -17 12 -3 28 -2 -7 -12 62 -7 28 -7 -11 40 33 2 -7 13 -30 4 -68 -61 -19 -2 13 20 -17 32 -24 -33 60
2640 60 -25 -10 -46 20 21 -20 41 41 -6 62 -7 -17 -26 -4 -8 17 -4 40 11 -5 4 0 -17 26 2 -8 -9 -33 3 -51 -60 -2 -15 -7 -12
2675 -12 24 10 53 -27 7 10 -24 30 -29 -15 -3 11 2 -25 2 8 23 57 13 3 -40 -15 29 19 -71 -5 59 1 -3 -30 -4 38
2707 38 3 -26 -34 30 7 -9 -9 -11 -48 -48 20 -1 -35 -20 -50 -8 1 -9 -64 -14 32 -41 5 -12 6 -28 1 -6 24 -30 12 50 -5
2740 -5 -49 39 2 -42 -31 -11 -31 -36 -10 -22 -18 -13 -12 32 24 33 -51 -63 -3 -5 -9 -57 16 3 -54 54 39 -17 -15 24 25 14 22 76 7 41
2776 41 24 -34 38 41 20 41 -9 14 54 55 49 22 -8 -29 -26 10 41 -14 1 -6 33 30 -17 50 44 10 21 50 -13 25 -29 -8 -56 25
2810 25 18 22 -21 -26 39 -8 31 45 65 -29 15 -15 10 -26 -31 19 -33 -16 -34 3 16 -4 -6 -20 -4 8 16 -34 -25 -68 29 -39 -58 -36
2844 -36 9 14 -28 -56 -20 -58 -12 -5 8 -50 7 54 -2 29 -34 9 38 -35 15 2 25 19 -9 5 2 -2 63 -17 1 -6 16 -7 9
2877 9 -8 -24 -26 14 -7 4 -29 -4 -38 -14 -4 25 -7 14 44 3 43 -5 40 7 -32 -12 -24 2 23 -12 74 37 2 -11 -9 7
2909 7 19 -2 36 2 28 13 -49 8 38 48 1 33 -18 18 -4 -31 38 33 -45 -23 -17 -47 -3 21 -12 2 23 48 69 -12 38 -39
2941 -39 -10 12 -17 34 -38 19 20 73 59 40 0 6 -50 -67 14 -6 -2 -28 20 -29 -36 -39 66 14 -10 0 19 -1 22 11 -13 66
2973 66 -22 -23 -8 -29 -26 -22 17 0 -1 34 12 7 3 63 -9 -26 -33 -30 -14 -46 47 -9 -19 -95 5 41 -34 -13 -46 16 18 23 -16 17 -6
3008 -6 -27 -27 -40 -13 39 7 -10 -14 -19 21 4 -17 -58 -61 39 -10 30 -17 12 -11 -8 35 22 52 2 -50 1 -30 -6 3 2 -21 -26 -19 -21
3043 -21 -22 -22 -78 -32 -9 -23 -21 42 -42 -36 64 -7 -37 -46 -12 6 44 -33 -8 4 -39 42 -11 33 11 30 52 1 33 -34 29 -19
3075 -19 15 -24 -28 -15 49 -8 34 11 25 -35 27 -40 -20 2 69 43 -22 -10 21 8 -31 8 -30 -59 -16 0 30 55 17 -21 -26
3106 -26 -10 -16 30 25 76 29 57 0 -12 -20 -6 34 -6 39 2 -8 16 12 -11 36 -30 -26 -9 -15 42 12 -37 -1 0 18 -17 -32 4 16
3140 16 38 -60 -21 -23 37 22 -40 1 -25 -14 -24 0 -30 13 -3 -13 4 29 -34 65 54 -5 -7 1 -15 0 27 5 -17 -33 12 -18
3172 -18 -12 17 -35 -39 -36 -6 15 -1 -5 -44 -64 -30 52 12 32 9 -2 -14 -17 17 -62 -54 -67 9 4 6 48 29 -10 21 23 71 38 12 59
3207 59 8 -33 3 7 -2 22 1 6 -13 72 -16 34 3 -40 1 12 11 -29 41 29 16 18 -6 -28 -45 65 -26 63 -7 -15 34 3 -12
3240 -12 24 8 46 14 8 -6 -6 -23 57 17 -39 -6 1 29 30 -33 4 -50 -25 -9 8 -6 -39 -29 -30 -47 8 35 -15 -18 5 64 4
3273 4 0 -3 -34 -9 4 -8 -3 44 -4 -42 12 0 -11 -22 48 20 4 14 79 63 5 2 -73 20 -5 10 -6 -25 42 48 27 -24 -12
3306 -12 -46 -47 -5 -17 -67 13 17 26 -8 59 -21 -9 19 25 13 -30 25 59 34 -8 15 8 19 28 34 -15 -50 -8 -24 20 -23 -33 29 -15
3340 -15 26 18 56 -45 47 -60 -3 -2 14 -11 -37 -14 22 -6 11 21 -44 -14 -10 45 -51 -3 37 -28 -9 -19 14 -40 -7 30 -62
3371 -62 27 7 -33 0 -2 38 3 -10 -30 -21 -15 19 -16 28 -12 -1 7 6 9 3 8 56 -64 46 -19 -8 -35 -42 1 69 -21 -16 -43 -2
3405 -2 -24 0 -51 29 20 -34 -1 -27 -52 -32 -17 26 15 63 31 27 -15 -30 30 -7 -15 -3 -7 20 6 10 26 11 1 17 16 -26 18 24
3439 24 27 5 -4 13 -12 -36 -73 -34 -4 -36 25 17 43 -2 28 26 6 -16 18 -3 12 -6 -14 12 38 54 -13 -32 -18 28 11 -37 -13
3472 -13 -8 -3 -3 -4 -45 -10 34 -18 -1 -47 -17 -2 12 7 -9 13 -4 -64 6 -26 -11 5 15 -2 -30 7 56 17 53 -9 -8 13 -4
3505 -4 -44 19 14 7 73 9 -20 56 6 16 -13 -33 18 27 12 -39 -31 -3 -6 32 -19 14 -9 -9 -3 -36 2 54 36 -47 -15 -10 -5 15 17 -47
3541 -47 28 -12 27 -6 56 -16 16 -73 21 -30 16 39 -7 6 16 3 -19 33 -27 3 19 -3 37 -28 50 49 52 28 30 -24 -19 34
3573 34 -7 -7 -37 -70 -17 -9 2 -40 13 19 6 42 5 29 18 2 -1 37 0 46 7 -29 -8 -40 -46 1 -42 17 -70 2 12 -31 -4
3606 -4 8 -40 5 0 29 -21 -5 1 32 53 -33 -16 -36 -16 0 19 6 4 11 40 7 24 34 -9 -7 -17 12 23 73 24 -7 -35 -29 -27
3640 -27 18 46 -15 27 -34 19 -24 -22 -5 -49 -31 -38 -4 20 7 -48 33 -74 15 -17 -4 13 13 37 2 94 -47 -24 2 15 -4
3671 -4 28 23 -33 6 -9 5 27 -3 30 20 -3 12 -14 25 -10 5 3 -9 47 -27 -2 24 -16 35 -23 -39 1 -16 3 -34 -6 37
3703 37 -84 72 -1 -28 8 29 -20 67 18 8 -7 1 17 2 -6 -28 -18 -11 -40 76 -42 13 7 -34 -21 -11 12 22 -17 1
3733 1 -46 33 -49 -11 34 -1 13 -39 -6 -74 33 -29 -30 -21 -8 -13 1 -38 -23 -17 32 37 9 19 36 4 -30 -21 69 17 -31 15 -27
3766 -27 24 7 1 -18 -13 -10 22 65 -34 -68 -48 57 -20 -45 5 -60 30 -6 19 46 -20 21 7 -11 41 -24 29 -79 -55 -25 -21
3797 -21 -3 53 -16 -20 -13 9 23 3 15 1 -2 -9 24 -52 8 -25 4 7 12 -10 18 29 12 10 12 -36 -10 12 7 55 29 53 -9 -8 29
3832 29 20 32 -15 10 35 11 8 1 -19 12 36 59 -30 2 -7 31 2 -41 -4 -55 -4 56 -3 36 -30 -5 -9 47 -4 -35 30 -3 42
3865 42 -8 -13 -59 -20 -6 -12 -22 -80 1 28 -43 14 2 7 21 -17 47 -11 41 8 28 5 49 53 -9 3 14 60 25 6 -16 -24 -53
3898 -53 -33 37 2 -6 -46 -49 6 -9 -76 -30 -7 9 13 -42 -4 -27 -2 -83 -42 -4 28 -6 36 30 3 27 -7 49 -5 1 22 6 -29
3931 -29 33 34 -7 -7 -32 53 -8 35 14 -26 18 30 5 15 3 58 2 -73 2 -20 0 6 29 -20 -9 -30 19 -15 -19 62 11 4 -10
3964 -10 -13 21 -26 -20 -11 -2 -41 -14 -5 -17 29 91 20 34 -18 26 1 7 -32 25 20 -4 -12 62 14 40 -21 -54 40 3 -5 51 23 -33 0
3999 0 -1 -10 -24 20 -13 -2 -7 -32 17 41 10 38 42 -16 35 19 -23 -10 4 3 49 39 -11 -13 7 19 -4 58 58 -34 -23 5 -18 7
4033 7 15 38 -61 15 -31 -76 -5 22 -25 20 32 -11 54 9 41 -6 5 42 6 -3 50 41 38 13 21 -31 40 -7 -28 41 0 48 -2
4066 -2 -63 1 0 4 2 -40 18 13 -3 25 21 -55 64 14 1 33 6 -30 12 30 -54 -29 12 58 1 -12 56 -25 14 -19 -7 29 -6
4099 -6 -15 -14 -20 32 -14 -30 52 7 51 26 60 -29 -26 -4 46 9 -33 76 54 51 -11 -21 25 -12 -12 39 -36 22 36 -7 -7 40 13 -44
4133 -44 -5 54 -12 -5 -2 33 38 2 41 9 87 -11 12 -18 -15 38 -4 42 5 -19 20 5 6 45 2 -14 5 -34 38 -38 -8 -9 -66
4166 -66 -57 29 50 0 -20 -41 20 -22 8 41 26 -54 -12 15 -18 6 40 5 13 23 29 -34 -8 -14 19 9 -2 30 8 41 36 13 -14
4199 -14 -17 18 -20 9 60 18 16 -11 -22 -34 -29 11 29 2 6 -30 -42 -24 10 -8 -20 -5 45 19 -30 -12 19 18 24 -4 0 5 1 24 11
4234 11 8 17 61 3 41 24 -12 -51 -60 36 70 7 -46 12 -46 -15 -11 -14 23 -12 2 -13 1 -7 56 -7 3 -3 -21 -62 14 10 -21 22
4268 22 -4 3 40 6 9 17 47 22 2 38 -9 -1 -18 9 66 -40 -21 13 15 21 -29 6 -32 3 -4 -15 31 -17 62 -52 -36 36 44
4301 44 -10 -74 -26 39 -33 19 27 -23 -2 3 39 38 51 18 4 6 16 15 3 -11 -58 -15 30 6 -20 48 -8 27 17 -23 -27 3 7 -38
4335 -38 -4 -33 0 7 -42 -54 -9 28 -23 -18 -16 25 -24 19 0 -26 28 45 20 13 36 2 38 40 46 2 22 19 -25 43 44 -15 -38 -5
4369 -5 16 28 -17 -35 -4 -19 19 -3 -28 -43 -23 -24 -22 -17 6 34 19 -31 7 6 26 -37 19 21 40 19 -7 25 12 82 -63 15 -14
4402 -14 51 20 -9 35 -30 22 -8 28 -42 45 -8 -18 -9 46 4 -9 23 4 -25 -4 24 -46 -6 -12 9 -8 18 -38 58 -13 -22 -12
4434 -12 -47 -3 31 -34 -20 6 9 -16 -28 -7 8 -21 72 26 -22 9 29 1 5 23 -33 -15 15 0 -48 6 -17 -10 20 -84 -7
4465 -7 0 28 28 8 4 -20 33 18 44 -21 25 -25 -14 33 0 -4 12 38 3 -32 47 -26 -9 -9 -7 -14 -17 82 3 -18 -8 30 5 -17 -20
4500 -20 -25 31 -8 -5 -1 -8 -18 5 -24 43 34 -17 48 -22 57 28 -8 -1 -10 6 58 -18 10 47 23 40 3 40 -11 -1 4 17 30 62
4534 62 -13 -36 -9 37 -5 -43 -12 -16 -26 -38 -35 -10 8 -18 -1 -78 10 19 55 -32 -29 -43 -15 58 -43 10 23 -24 17 7 -21 20
4566 20 -2 -70 -1 13 -15 16 16 19 34 -30 17 -30 -21 7 -18 -15 15 -11 -24 8 8 -4 -14 27 -60 -19 7 -45 -32 6 13 -60 22
4599 22 -14 55 13 40 -14 -25 19 -48 17 38 -6 8 13 -1 9 -13 67 -30 42 19 -19 0 -8 -10 41 -29 -46 -35 -16 66 40 22
4631 22 17 -33 -38 -24 9 2 -8 -17 -30 -43 27 63 -25 -41 47 -3 1 -67 -1 18 38 -10 -20 32 -39 4 -61 25 -23 18 -28 -11 -12
4664 -12 -22 46 -4 12 -4 27 -3 -12 13 15 -28 1 -25 53 -27 -21 -36 -2 0 9 44 12 39 30 30 -41 4 -3 -8 12 72 70 -17 21 3
4699 3 55 60 60 32 -24 78 -57 29 27 5 40 11 31 -48 8 7 -19 47 -18 -4 2 28 36 -6 -33 -24 4 59 3 2 -6 -3 -19 -5 -39
4734 -39 37 -24 -36 28 12 30 -46 -13 28 -8 52 72 5 -5 17 -63 8 -15 52 72 30 -15 23 -30 -34 -9 -3 -28 -5 -71 47
4765 47 12 26 -28 -14 -15 -5 52 -19 35 20 7 -15 -4 81 41 1 21 38 -2 -52 41 -23 -18 -10 -33 -13 4 -22 -10 58 28 15
4797 15 -29 7 42 18 58 47 10 -4 -21 -45 -39 -1 -10 -27 -15 1 11 -6 79 -15 38 -12 -6 -22 33 -25 67 37 -19 -26 6 28
4829 28 -8 -12 -10 -21 -32 -42 37 -2 48 -44 -25 -19 30 7 -9 -22 -10 17 7 21 16 45 -28 -2 39 -51 11 -25 29 42 -27 29
4861 29 28 -21 -18 4 -38 6 -1 -9 -10 -19 23 20 27 -46 -8 51 -8 -30 23 48 44 19 -16 28 21 56 -6 -34 -8 -22 61 -18 -7 -10 45 -40
4897 -40 44 10 -42 27 -21 18 -4 20 -2 -8 20 55 -26 80 -46 16 17 42 28 -32 13 41 -5 17 8 -53 -25 23 -6 -3 7
4928 7 43 5 18 9 -26 68 -10 15 51 22 -7 12 -28 -61 27 29 18 17 21 31 45 -15 -5 -39 -60 16 49 3 -7 15 22 49 8
4961 8 23 32 11 -32 -24 -32 1 39 12 10 -1 -17 -25 -44 -2 -59 -32 0 12 -21 -46 7 -71 1 -33 -72 10 38 15 20 -4 15 -3 2
4995 2 24 -37 -33 22 2 -25 -10 40 -17 -15 25 -4 -14 -4 -23 21 -20 22 15 -2 12 -2 -23 11 -8 14 -76 -10 -57 -39 19 19 -12
5028 -12 -24 18 33 8 9 -56 4 11 -31 21 -3 5 22 13 8 16 14 23 27 -7 10 6 -66 23 -2 30 -4 20 18 18 16 2 41 -4 -27 33 12
5065 12 -17 -34 -17 -12 20 13 1 -23 -1 30 5 4 30 -15 27 1 -6 3 -20 -6 38 55 16 -3 -39 18 38 29 -15 31 30 -59 -7 -16
5099 -16 -8 -3 -31 -49 -17 10 -16 9 -2 14 -6 -69 3 -50 1 19 -62 27 29 -10 60 6 11 -33 8 4 44 32 -17 -13 21 5 22
5132 22 -30 -24 -14 -18 -12 -59 26 13 61 -31 8 -25 -23 -60 -64 26 20 37 29 -17 22 -12 -32 2 17 -7 28 -12 -25 -8 -19 43 -19 6
5166 6 -7 -30 35 -20 4 28 -60 15 -11 1 7 -21 2 -1 14 -26 20 -68 76 25 -31 -20 26 -72 7 -4 -44 25 -2 -12 -20 -28
5198 -28 0 18 52 -45 20 -12 -37 34 -42 19 6 -5 11 -18 -3 -28 -38 50 -19 37 13 17 -1 6 36 16 -25 -25 30 22 -28 -47
5230 -47 26 -22 19 1 40 38 -49 50 29 -13 -11 -26 -31 23 -20 40 -32 -5 24 3 -4 -14 -2 -5 28 18 29 16 -26 39 -6 3 -28
5263 -28 37 -5 -2 12 27 -22 -24 9 -6 24 32 -6 3 20 8 21 -32 15 -49 -30 20 0 -2 65 8 8 -3 8 -22 -7 6 24 -34
5296 -34 8 -21 27 5 25 19 1 -3 -40 46 10 25 -3 4 -11 -49 -42 -89 3 22 -55 -11 -46 -1 -26 13 -25 -31 33 40 12 6 15 -4
5330 -4 -30 -22 29 -47 9 -38 10 28 22 38 25 48 -25 29 -12 44 -19 -11 43 -22 -54 15 34 -9 60 68 26 -9 -9 -16 -18 14 0 7 -34
5365 -34 25 43 4 0 31 12 -4 -29 40 -11 -49 -2 11 27 -12 38 36 16 -29 -6 50 5 -14 15 15 45 -15 -20 -44 -32 -1 11
5397 11 -11 7 8 -19 -17 21 -9 -53 24 37 23 11 16 32 22 79 30 17 34 -12 -4 -4 -12 -41 -23 30 27 31 -25 37 -5 -31 30 25 24
5432 24 19 51 -4 63 19 18 13 24 -2 -48 4 -26 4 35 -16 30 17 27 30 38 12 -14 -14 15 91 -35 -18 20 30 -12 -11 -20 -8 -8
5466 -8 17 -11 24 36 4 28 -27 19 12 22 56 -17 29 31 33 -6 -28 57 17 -26 0 12 -22 -5 17 -37 26 -18 -2 -42 4 18
5498 18 -72 21 -2 31 43 34 47 14 16 38 12 -18 33 14 29 15 34 5 -34 32 -2 -11 -15 -21 -11 22 25 -18 13 23 6 16 10 -24
5532 -24 -13 39 -69 7 11 42 24 -5 -4 15 0 -56 5 11 -17 -41 -31 49 -20 -7 5 -14 82 -1 -2 19 39 -18 -17 64 50 -18
5564 -18 24 -20 -4 -50 3 -19 25 -9 -49 -14 21 8 21 -19 -9 28 1 -38 -8 24 -5 8 -33 50 -26 18 21 -26 15 13 -8
5595 -8 53 20 15 35 18 -19 22 31 0 13 -4 -7 -18 -18 -3 16 25 19 59 -6 -21 -26 8 -23 -35 -2 -23 -56 -62 -3 13 -40 -2 16 0
5630 0 54 -9 -2 69 34 41 1 24 -29 40 10 9 66 20 27 67 58 28 -3 -2 13 -5 21 30 -6 -32 -8 33 12 20 16 -33 11 -3 26
5665 26 17 68 -57 -4 7 8 19 -19 46 33 39 31 2 15 -37 36 9 -16 -26 34 0 38 28 37 8 -10 -25 -2 -5 1 42 14 27
5698 27 25 55 27 4 -13 2 -12 -49 -8 -40 -29 -20 17 -4 -28 12 -2 -37 -45 -48 42 -11 0 -16 31 48 -26 -25 14 -3 56 32 47
5731 47 -24 23 10 17 35 -10 34 50 37 -14 4 -26 22 -55 -11 -27 14 -9 -54 1 35 5 -49 -13 -10 -11 -8 24 -3 -15 -21 20 39
5764 39 37 -20 -48 -20 -23 18 29 -25 -30 23 49 28 3 -14 -2 -75 -57 36 -6 -37 -19 -43 34 20 -35 46 7 39 12 -21 16 -12
5796 -12 32 -21 20 40 2 -2 -40 -18 6 -19 59 45 39 21 -12 21 60 10 20 -34 45 -17 24 4 25 39 -15 -24 -19 10 72 -22
5828 -22 -2 21 -17 18 5 0 9 -14 -11 -12 10 5 -46 3 8 13 22 -15 22 15 14 24 20 5 29 -8 -19 18 60 -50 -3 -10 5 17 7 19
5864 19 127 -22 -22 -1 -21 20 32 21 -39 43 13 31 -36 -4 -28 -19 22 -15 26 33 -29 -68 1 31 46 41 -1 -6 -25 -1 56 2
5896 2 16 57 -3 -67 39 -5 25 -10 -7 3 46 -39 26 -11 -22 16 -27 4 5 47 -46 38 -18 16 -4 -16 -17 19 -57 -38 4 -7
5928 -7 -2 28 -1 26 23 11 13 -3 57 -61 36 10 -1 4 -14 30 -22 48 52 10 10 -20 39 17 -5 -25 12 -38 -23 19 -10 31 -34
5961 -34 -39 -20 -26 -29 -7 7 -9 -4 5 -40 19 19 -1 42 43 -39 -13 -36 -10 7 -36 4 -1 51 6 24 -8 -16 -18 38 9 12 41 26 -25 40
5997 40 -48 9 0 3 23 -33 8 -48 20 -40 23 8 -14 53 -33 2 15 -48 -11 16 -5 -23 6 -34 -29 7 16 -18 -23 -45 31 -15 -43
6030 -43 61 -27 -18 2 -11 8 -53 7 -8 -27 -28 7 -10 -9 -8 0 -47 -35 68 -51 41 -13 -1 -22 -32 -39 -4 -28 -1 -37 40 -14
6062 -14 32 35 31 -2 -26 34 2 38 -30 -28 26 37 30 -23 39 40 -30 20 -26 8 -5 7 12 -34 5 -4 5 5 3 22 -4 -38 -35 -30 -5 -9 46
6099 46 1 65 23 -57 18 -10 34 26 38 23 -38 51 22 0 21 -13 -13 -16 2 -26 59 -21 26 -22 -1 4 -8 -25 -32 -40 14 -34 17
6132 17 39 -6 22 -7 69 40 -72 6 47 9 -3 4 -18 18 8 -70 43 32 1 -21 40 -1 91 -3 26 -5 17 -25 -30 -38 24
6163 24 46 -16 -22 -75 -31 5 10 40 -29 -8 -2 44 38 12 -15 -47 -57 -7 14 85 0 13 -9 -5 26 21 9 -19 23 63 -31 47 28
6196 28 16 -25 2 -12 63 26 13 50 16 61 -9 -8 -6 -32 -15 47 -40 56 0 0 -20 4 19 -73 -32 -12 -40 29 -51 33 -27 52
6228 52 -52 2 6 3 19 21 -22 -29 14 -9 18 -11 15 35 -26 -23 -18 11 -56 12 14 -32 -21 26 4 -12 10 -11 -26 -8 21 8 -30
6261 -30 -31 25 14 15 9 -5 49 -5 -25 -23 -22 26 -3 42 3 -31 35 -39 -5 42 -45 51 -48 -74 45 52 33 22 27 -18 -21 5 -33 -45
6295 -45 23 -2 -62 31 -25 -7 -1 -57 7 7 22 -29 2 56 0 -2 17 34 71 -20 6 8 -56 -1 50 40 4 31 42 -65 59
6326 59 -16 -21 -32 -24 41 6 -1 98 -44 0 8 21 -15 11 46 -8 -26 6 7 -21 49 31 -49 -40 -22 -64 -12 -13 -4 1 -20 33 25 22 -16
6361 -16 13 36 -30 27 41 38 32 -9 -46 60 -35 -9 45 18 -38 -33 -15 20 18 24 -8 -12 -4 42 -18 -24 33 -49 -53 -12 26 12 64 -11
6395 -11 70 -20 -3 16 15 -36 2 3 6 -1 -10 49 -7 11 -10 3 -11 -8 46 17 8 26 13 11 -8 -28 -23 43 7 10 26 28 -34 26 -49 -8
6431 -8 -38 20 18 -13 -41 2 -1 -4 41 7 -56 2 -29 -24 -22 24 22 12 13 -11 -31 28 50 42 36 45 -17 28 47 33 -15 25 -11 6 42 -4
6467 -4 -48 2 11 25 19 -18 0 34 35 21 41 -34 51 -24 -22 48 10 -50 3 -19 -4 2 19 -7 1 26 -7 4 56 11 -9 -19 10 -82
6501 -82 12 20 10 23 -9 -39 19 -3 -7 -15 79 5 -2 4 34 -53 -19 -19 -25 51 -38 33 -5 4 -15 26 47 64 -52 -3 -31 31 7 60
6535 60 -11 -45 47 72 4 42 -43 -26 6 -1 -38 11 -5 14 39 -21 -7 -7 3 7 65 18 -70 -4 -48 -23 11 6 -24 -3 36 -10
6567 -10 23 -22 -1 2 9 -17 9 40 32 -8 -21 20 -7 -28 1 9 -1 11 -1 32 11 5 -46 -6 4 65 -9 16 22 26 21 3 -82 15
6601 15 21 4 36 15 8 5 -8 1 37 -23 -22 27 34 1 -4 17 -10 -1 10 9 -34 -8 -1 46 46 -5 79 22 21 31 10 -7 11 36 3 -50
6637 -50 9 -74 -11 -20 7 -30 -19 -22 -3 -42 -26 -61 -14 -39 -4 -28 -15 -19 -1 49 12 -16 -26 -29 -51 6 -21 20 4 -3 47 -50 -17
6670 -17 -7 -3 7 14 -60 45 -18 38 -6 1 42 3 1 -41 -29 -26 21 7 -14 -9 -12 -17 -21 -37 29 44 8 -43 -24 75 -22 -13 47 50 -18
6705 -18 -71 38 27 -4 -23 24 -48 -17 54 5 -11 49 2 25 -3 45 6 20 23 19 56 1 -53 2 35 21 4 -14 39 -59 0
6736 0 13 -2 -26 1 -13 29 -17 -38 31 47 60 -2 19 -5 -15 18 37 11 63 -18 48 30 15 -14 10 3 -9 22 18 -18 -29 32
6768 32 -16 0 -41 -2 29 -13 -1 -81 3 -9 36 -17 -31 36 2 27 -8 -36 15 -20 23 -6 20 8 17 -22 37 -8 -25 16 22
6799 22 9 -19 0 2 -14 -25 44 16 -19 -35 -38 -28 24 6 -66 -26 12 42 6 -37 -5 -2 8 -65 41 25 6 -24 1 25 -35
6830 -35 48 44 28 29 49 96 47 -45 -12 21 1 21 -10 13 -40 15 26 45 18 58 34 -20 -26 -37 16 8 -67 -29 9 -7 18 -25
6862 -25 -34 -97 10 -16 -13 -13 9 37 2 -53 31 37 47 49 -46 -3 39 12 -52 11 -79 12 -13 4 20 -20 -18 6 -23 26 61 -43
6894 -43 7 -26 -8 -42 4 14 -39 59 3 -24 -40 -8 -82 -3 -71 -21 -21 -44 -10 -38 -38 32 48 -1 22 -14 -64 -14 61 -10 -35
6925 -35 -18 -14 53 53 5 -11 22 18 32 -10 25 13 -18 -7 30 26 -17 -4 23 -78 -36 15 14 -42 -8 4 30 30 51 7 -26 31 -11
6958 -11 -15 -8 1 30 55 67 14 -70 23 5 24 24 8 38 -20 -27 -25 16 -16 -10 13 -25 -20 2 -6 -20 16 -29 19 -47 -32 -8 30 28 22 -62
6994 -62 13 25 6 -6 -33 -23 4 -12 -33 -11 -7 1 -10 -5 1 6 -18 3 -23 -25 -27 24 58 55 1 28 -14 4 -54 -5 24 -8 -25 -32 23
7029 23 -18 -37 24 2 -21 -20 18 -11 25 -14 61 13 -17 9 17 29 24 -6 38 9 0 41 22 39 48 -17 14 7 30 50 57 17 -9 17
7063 17 23 11 26 -41 24 0 -50 -24 59 -35 -14 -26 -31 40 1 27 10 -13 -28 11 64 -50 -6 -31 -15 -23 -36 17 41 36 20 37
7095 37 68 20 58 40 2 24 41 -27 -60 -1 -3 -3 -31 -18 32 -59 19 -44 -10 -11 -20 -40 16 -45 -15 -19 2 -38 -40 1 10 -15 -3 6
7129 6 -10 -11 -12 2 -29 77 -70 -7 -5 28 -13 -18 -34 21 -4 5 24 16 48 23 7 -7 59 11 26 23 -45 -26 -9 17 -23 -1 -28
7162 -28 18 -3 -24 11 -5 21 25 -23 -23 18 45 -35 1 -6 8 11 -19 21 6 -9 28 19 22 -10 -38 -21 -27 40 26 -4 4 14 -8 7
7196 7 54 10 60 -22 29 -4 2 4 -40 -10 -41 -6 -5 -19 3 12 -1 44 -40 -21 -35 -11 42 1 16 -20 26 25 -6 12 -20 46 -11
7229 -11 -60 24 -24 27 -3 3 -13 28 -30 -36 55 -52 -20 -46 -17 -22 21 -17 -21 19 4 55 -17 7 11 9 16 -14 -31 -4 -5 20 -14 24
7263 24 -10 -18 8 19 -21 -6 28 28 30 42 12 8 32 53 22 -19 7 -49 -5 22 -49 16 -47 -18 21 -31 22 -29 -2 15 26 16
7295 16 12 -36 -28 41 -9 25 7 -49 17 -50 4 -10 15 -31 -43 -66 -28 -6 10 28 -41 -25 34 15 32 24 52 31 8 58 -11 -5
7327 -5 -4 -17 -47 -10 -5 -1 -2 73 -36 -41 6 -52 32 11 20 1 -37 36 -8 25 -4 -38 -28 -4 29 13 -1 16 -32 28 7 -41 -5
7360 -5 -40 -6 -12 14 -16 -10 10 -11 7 -18 -4 0 -14 -21 -10 -5 -19 7 -32 -9 50 -3 -27 -27 -20 3 17 17 -12 28 32 0 31 31 21 62
7396 62 55 40 -9 11 -13 21 5 37 7 -6 -7 42 -79 5 -26 32 -56 18 3 -28 -6 11 -5 53 -10 -33 -60 28 9 51 2
7427 2 -30 67 55 43 -47 20 -9 -18 42 -4 -1 11 -10 70 5 -9 -1 54 32 -16 -19 37 5 26 33 -63 -43 -3 49 -2 -45 -14 -1
7460 -1 23 15 56 -19 -7 -35 12 40 45 28 -4 58 29 -14 42 -27 47 43 45 -18 -55 4 31 -10 30 10 43 -5 -21 88 4 52
7492 52 13 -32 -24 7 9 23 -32 2 -41 28 -44 -51 26 -1 32 -14 12 5 -13 102 16 -27 41 25 15 38 31 42 -9 -34 -7 -4 40
7525 40 36 -21 17 2 -6 -22 70 -17 37 -19 -18 31 9 50 21 -1 31 -12 28 74 -17 29 13 27 12 6 -4 -19 37 -7 -4 26 33
7558 33 13 82 -41 -25 65 78 4 -3 -10 -12 63 23 -1 -5 -10 20 16 7 1 26 60 27 35 22 -1 13 35 -59 17 -25 -64 7 -11 38
7592 38 41 16 -5 11 -18 -13 -89 39 50 -11 -27 28 -13 4 21 -72 7 18 35 13 32 -47 1 28 28 40 32 36 18 -3 22 -2
7624 -2 -35 -83 -6 -57 -7 40 -53 46 5 3 2 14 -38 8 -20 -5 -13 15 24 4 22 22 -7 -13 82 12 34 21 16 10 -13 20 71 -49
7658 -49 4 16 -18 9 14 26 27 41 9 4 -42 -19 49 -24 -18 18 3 5 15 -25 0 15 -49 33 32 8 -9 9 -6 -12 -37 43 -2 22
7692 22 43 26 -10 33 17 40 9 -23 71 -44 63 19 4 45 20 -2 -20 -11 21 1 -18 -23 54 -14 -50 -16 6 -34 22 -18
7722 -18 -57 16 -27 16 14 -20 -24 -5 0 29 48 -41 8 -35 4 -29 20 36 59 0 5 -12 14 20 -85 51 -18 8 29 -12 32 -2
7754 -2 -30 -57 4 -6 -41 -36 6 32 -24 -33 -17 27 -27 16 -50 55 -27 17 45 -6 57 19 42 11 15 -24 -1 13 0 32 33 -2
7786 -2 -22 15 -35 1 25 18 -22 -67 -42 -5 -7 -20 -6 -33 -8 -3 -46 1 -12 16 58 1 4 -18 16 6 -6 -5 3 -51 -4 32 -14 -20
7820 -20 30 7 -21 32 -12 7 -35 -39 -12 21 19 36 12 6 10 -16 31 -4 -7 3 -17 -14 11 39 -51 -12 -13 -82 -17 -42 28 -10 57 50
7854 50 28 10 23 73 -12 -46 13 0 23 68 -34 -52 27 80 -11 -52 2 8 59 16 -3 -3 17 14 15 -15 21 58 1 21 26 29 -3
7887 -3 -32 -16 36 -26 -15 -37 -21 -13 15 -59 -10 15 2 25 -18 23 47 16 28 0 -6 13 22 6 -1 -6 -18 6 17 -24 -3 44 -19
7920 -19 5 33 -24 -28 33 -12 -15 -25 -10 2 -41 -35 -51 -45 -56 24 18 35 23 -19 -20 36 10 78 69 6 4 -23 -30 9 -12 37 45 6 5 10
7956 10 9 16 38 12 -50 34 12 -10 5 -25 -18 4 54 -16 -2 7 -53 5 1 -15 -48 3 -25 42 20 -62 32 -7 -20 21 24 -19 65
7989 65 26 5 -12 -51 42 -19 -34 16 -4 -2 14 9 29 21 -8 32 5 2 -39 -62 24 -7 52 -11 -14 -27 32 -47 -18 5 58 3 -1
8022 -1 -20 50 46 -33 -65 -25 3 1 11 27 37 67 6 -23 17 53 -2 45 -7 6 50 -36 37 -1 46 6 5 6 61 32 20 -22 19
8055 19 -35 41 -36 -42 -14 -3 -6 -15 -28 51 -28 35 70 16 14 18 -11 8 -29 -1 9 -40 -22 -18 -49 -6 -16 -13 -9 31 0 24 12 -24
8089 -24 -66 6 -13 -18 7 46 7 -45 41 -9 28 -10 5 -4 -57 -9 43 10 -17 12 -15 -20 1 7 -21 -48 22 19 11 30 28 -51 -4 2
8123 2 -10 -16 -34 17 -23 4 20 -32 -3 -43 -18 -15 -7 1 -26 22 -47 -21 -18 14 10 -30 -7 8 17 10 -19 24 2 -24 -8 -37 22 -46 -45
8158 -45 36 -61 36 -54 16 47 -15 -32 36 -13 10 13 13 45 -21 18 -3 3 -7 23 34 27 -23 -39 -11 19 22 -13 12 -40 -17 -51 -36
8191c6
$$ Imaginary data points
##PAGE= N=2
##DATA TABLE= (X++(I..I)), XYDATA
0 0 0 0 0 0 0 0 0 0 0 0 0 0 0 0 0 0 0 0 0 0 0 0 0 0 0 0 0 0 0 0 0 0 0 -1 2 -3 5 -6 7 -8 8 -8 9 -10 11 -13 14 -15 17 -18 20
51 20 -22 24 -26 30 -34 35 -38 42 -47 50 -56 62 -66 70 -71 55 9 -319 2921 41861 31152 -4184
73 -4184 2138 18249 1364 -27241 -28705 -12758 414 10567 18453 15717 8065 5274 625 -14798
87 -14798 -24511 -14137 74 3882 9089 19030 18085 4790 -4731 -9207 -17456 -19391 -4573 8389
101 8389 7196 10755 22506 14799 -11658 -20427 -7776 -5411 -12686 -4190 13614 17674 11008 6557
115 6557 -141 -11951 -14843 -6701 -4317 -7303 2925 19216 16274 589 -1427 2693 -9760 -22494
129 -22494 -10395 8738 7895 750 9364 18764 6860 -12153 -15942 -9536 -4550 -443 3733 5814
143 5814 9388 13409 6679 -8957 -14457 -6996 -2799 -4446 -596 7998 10674 7257 5207 251 -10207
158 -10207 -13143 -4556 -10 -3256 1442 14238 14429 62 -6591 -2071 -3872 -12389 -9786 4082
172 4082 10978 6899 4490 5045 776 -4921 -7032 -8277 -7351 323 8710 7386 2568 4070 5080 -2693
188 -2693 -10167 -8068 -2838 -1473 1210 7507 9193 3939 -73 -1338 -4917 -8634 -6477 -464 2972
203 2972 4646 7629 7183 640 -4674 -4285 -3993 -5979 -4281 2439 6061 5603 5549 3061 -3024 -5731 -3334
220 -3334 -3107 -5546 -1973 6625 8754 3441 433 843 -1757 -6644 -6794 -1996 1400 2510 4558 5996
236 5996 3779 -474 -3670 -5105 -5251 -2678 988 2054 2735 5567 5673 18 -4985 -4257 -2732 -3665
252 -3665 -2160 2816 4941 3653 3051 2344 -1415 -5386 -5054 -2318 -651 1010 3606 4737 3233 1098
268 1098 -562 -2922 -5390 -4334 -346 2039 2569 3376 3721 1807 -858 -2290 -3936 -5102 -2242 2660
284 2660 3620 1894 2206 3299 832 -3450 -4451 -2991 -1681 -18 2464 3808 3016 1368 358 -1375
300 -1375 -3382 -3602 -2092 -346 1631 3689 3854 1437 -695 -715 -1645 -3773 -3431 -290 2242 2810 2912
317 2912 2474 392 -1863 -2157 -2170 -2669 -1792 1069 3305 3082 1612 702 -708 -2343 -2598 -1967 -1171 13
335 13 2093 3504 2507 607 -725 -1881 -2574 -2086 -781 85 992 2710 3329 1342 -1188 -1992 -1836 -1718
353 -1718 -1497 -356 1393 2341 2381 1686 -88 -1687 -2260 -1830 -1227 -421 1033 2301 2067 1333 619 -918
371 -918 -2395 -2436 -1095 159 789 1505 1950 1408 541 -434 -1646 -2318 -1793 -140 1209 1367 1267 1388 1102
390 1102 30 -1478 -2388 -1979 -600 1002 1676 1337 1098 990 271 -1177 -2313 -1950 -670 798 1761
407 1761 1407 663 578 541 -496 -2095 -2114 -523 669 663 930 1430 1236 222 -880 -1405 -1341 -1179 -467 601
427 601 1602 1859 1070 -48 -1011 -1304 -1046 -913 -671 387 1654 1987 862 -503 -823 -732 -877 -914 -489
446 -489 225 912 1130 1201 603 -406 -1343 -1228 -370 -161 -757 -110 1799 2410 776 -1233 -1465 -707 -566
465 -566 -605 -142 578 1267 1431 1106 -319 -1933 -1597 307 845 -550 -1156 941 2587 1105 -1388 -1392 44
484 44 262 -829 -1364 133 1611 1627 518 -250 -331 -525 -983 -1009 -593 399 1620 1422 78 -713 -39 371
504 371 -1234 -2043 -124 1940 1392 -576 -769 1003 1329 -739 -1994 -749 648 315 -186 606 968
521 968 315 164 214 -835 -1785 -943 966 1405 463 -9 472 608 -417 -1417 -900 68 193 399 1101
540 1101 717 -580 -555 532 420 -1186 -1499 -26 1258 914 -253 -289 763 786 -539 -1435 -929 -22
558 -22 637 996 682 -265 -77 858 -21 -1795 -1573 818 1861 118 -1091 235 1720 423 -1958 -1491
576 -1491 1037 1155 -920 -1123 912 1756 351 -902 -667 -87 37 -279 -459 -52 541 1043 884 -280
594 -280 -1210 -801 377 403 -673 -662 990 1630 223 -1115 -743 296 255 -498 -627 106 753 700 38 -134
614 -134 -208 -179 -184 -332 -462 -39 575 669 150 -38 160 -258 -866 -543 274 386 -25 124 754 404 -515 -736
636 -736 -160 147 -109 -394 137 855 482 -249 -282 54 -171 -538 -322 124 235 354 318 207 -75 -177 -300
657 -300 -237 -186 -159 136 581 537 -281 -338 314 173 -621 -814 97 712 377 -115 -18 377 256 -473 -782 -123
679 -123 485 150 -31 189 308 142 -112 -338 -396 -71 137 -25 64 400 234 -73 -20 -8 -239 -400 -85 181
701 181 143 211 290 181 69 -327 -398 -125 -9 -96 21 432 501 -71 -352 -102 -59 -183 -177 -112 226 413 150 -249
725 -249 1 285 23 -470 -271 155 220 50 22 202 275 25 -321 -398 -126 111 27 156 332 219 34 -126
747 -126 -203 -205 -156 42 122 146 172 -10 -59 25 -5 -274 -94 54 28 -39 27 258 192 25 -120 -237 -148 -11 -62 94
773 94 220 211 70 -94 -136 -187 -155 -66 65 161 183 103 -47 -42 -45 -121 -79 -3 26 -10 99 167 64 34 102 -103 -249 -177
801 -177 8 48 54 159 141 51 -88 -204 -166 -10 -51 11 119 152 119 -80 -125 44 10 -143 -63 8 86 128 17 7
827 7 90 45 -123 -203 -92 61 53 58 105 123 83 -72 -178 -130 -65 62 53 103 153 58 -56 37 -93 -173 -44 21 136 -23
855 -23 9 99 62 55 -66 -138 -100 59 19 48 -2 39 103 -53 -94 -167 0 65 -28 60 108 11 33 2 2 -119 -170 36 75
884 75 32 11 99 66 -34 -130 -107 -53 57 29 27 -4 90 182 9 -161 -162 38 64 -95 -80 66 154 61 -30 -95 -68 156
912 156 128 -95 -280 57 378 163 -234 -270 98 192 -192 -271 48 202 138 68 -37 -89 -100 50 8 -122 -57 94
936 94 106 1 -22 -51 -32 39 60 -112 -80 22 124 37 72 17 28 -124 -89 20 -64 -93 111 167 31 -212 -123 158
962 158 17 -215 -19 218 46 -221 4 147 -104 -112 119 82 -134 -111 191 164 -191 -118 217 195 -179 -342 -92
985 -92 347 182 -156 -201 150 292 -36 -390 -236 198 343 -2 -314 -81 268 82 -100 -74 -85 30 200 156
1007 156 -274 -238 333 297 -290 -366 175 208 -186 -237 199 239 13 -113 -6 20 -140 -131 138 124 -47 -36 168 61
1031 61 -257 -31 174 38 -186 42 145 -30 -56 -5 -44 54 28 -103 -169 77 166 -136 -88 186 82 -202 -186
1054 -186 153 160 -185 -92 77 193 -88 -191 -23 139 -31 -33 154 -33 -185 124 301 -180 -347 162 365 -116
1076 -116 -290 72 238 93 -61 -36 4 23 64 -18 -148 -6 133 69 -103 -92 65 76 -26 -81 -4 25 43 -9
1100 -9 14 -62 -38 59 7 -201 -32 251 49 -228 -18 258 -36 -258 55 198 -67 -166 104 71 -117 15 133
1123 133 65 -193 -19 78 12 -69 27 113 -5 -98 -51 100 -62 -122 60 169 -37 -76 73 -14 -117 25 155 -34
1147 -34 -154 108 69 -145 -83 129 41 -112 120 91 -106 -91 159 106 -33 -41 98 2 -127 -63 5 59 -67 -2 118
1172 118 18 -195 -84 107 85 -107 -1 80 -44 -74 95 -38 -96 108 135 -89 -120 59 87 -133 -23 110
1194 110 64 -161 -49 53 -3 -64 7 74 -1 -49 -12 8 -26 -7 91 91 -159 -30 123 -40 -81 0 137 -30 -113 74
1220 74 56 -179 -73 189 84 -140 -136 57 24 -123 -22 68 26 -46 6 -48 -111 -17 83 18 -29 -26 51 -9 -181 14
1246 14 147 11 -180 71 83 -21 -147 62 150 -80 -69 74 -50 -98 -9 82 8 -44 -5 -28 -34 -1 62 28 -48 58
1272 58 31 -34 -150 -40 121 11 -74 29 -7 -25 -22 20 44 -70 -50 110 36 -118 20 133 10 -39 10 40 -71
1297 -71 22 88 -37 -93 5 111 -55 6 46 54 -24 -54 48 -15 -32 -27 -4 45 -58 -49 10 50 -83 -9 69 -31 -119 37
1325 37 124 -98 -83 59 25 -61 15 82 -56 -108 106 37 -36 -16 9 65 12 -66 51 40 -19 33 42 -74 -47 -77 37
1352 37 -9 -49 41 45 -22 -19 51 18 12 13 87 -43 -21 55 -3 -60 8 60 32 -84 1 65 86 -33 4 36 0 -32 -76 7 21
1383 21 68 -17 2 -6 -32 -16 78 -32 36 12 32 -38 -13 -51 -18 -42 -24 24 -84 -9 -10 -56 46 -84 -14 -1 19 15 -16 -23
1413 -23 29 65 12 -4 -23 -4 -13 -47 10 109 -4 -39 -34 -26 22 -41 -74 111 24 -2 -84 -11 64 -35 -13 20 -7 -8 -72 21 16 35
1445 35 17 -5 -30 -12 -65 7 -23 52 47 4 -25 8 16 -15 -12 -22 21 88 4 -25 -34 25 83 -7 -34 -4 -57 -58 14 19 43 -8 -73
1478 -73 16 50 -65 -93 32 49 -6 -79 13 75 -36 -69 -39 67 48 -27 -8 -6 1 -17 39 55 59 1 -20 -42 -36 -7 37 61
1508 61 4 1 32 -1 -24 31 50 46 59 3 -1 -15 -4 -63 7 47 -74 -15 -73 -4 24 -14 50 -5 -19 27 22 10 46 52 -22 51
1540 51 49 -3 -62 55 41 17 -48 45 82 -26 -55 4 3 27 31 -38 72 38 -1 -28 -10 22 -18 29 -35 -1 7 35 -10 -32 -1
1571 -1 20 55 -2 -57 16 -44 -36 -39 -36 1 39 -4 17 12 35 3 24 22 15 -37 19 12 44 54 11 18 -23 -16 30 -4 1 7 -31 20 7 -63
1607 -63 6 44 -36 29 37 30 2 37 -37 3 1 18 -60 -74 3 64 -41 -83 30 -19 -42 -16 32 -52 9 23 -17 6 -33 -50 33
1638 33 57 -41 -45 45 56 -38 -72 92 35 -46 -16 1 26 16 7 49 -100 -50 25 -32 -24 53 -6 57 22 45 -9 4 3 -18 -32
1669 -32 10 -67 -13 32 -28 23 26 -42 -31 0 48 -42 5 71 32 -126 -37 39 -54 35 -39 33 14 -72 -32 -35 0 88 6 -30 -30
1700 -30 17 -3 14 24 -3 -15 6 18 22 23 71 60 -20 7 22 -17 82 -23 -57 21 20 -34 -9 53 37 -37 17 74 -2 -44 9
1731 9 30 -69 -32 -9 43 -43 3 -7 -1 19 -8 -1 58 14 -31 -13 5 -65 1 50 32 -33 49 8 31 7 -7 3 -11 14 59 80
1763 80 -32 1 -12 -18 -33 14 -16 -16 25 20 -25 -67 -19 58 -23 1 1 7 15 10 15 10 -19 34 30 1 -11 -25 28 -11 41 33 -59 -39 -16
1798 -16 27 -42 11 24 47 5 13 51 -63 -24 69 87 -13 40 57 -16 40 27 -25 14 33 24 -53 -131 -38 -11 0 54 -56 -47
1828 -47 40 -5 25 -15 -16 -33 -29 37 24 -78 -20 -18 8 73 27 -1 -59 22 12 -62 -67 -26 67 51 -69 -43 48 40 62 -3 40 -12
1860 -12 -56 -1 66 32 -57 -44 -1 31 -18 -25 -30 -1 73 32 -55 -1 26 -7 -11 30 -61 6 62 -8 -29 -51 1 40 80 42 -32 -32
1892 -32 -4 29 45 -37 11 -11 30 3 45 -2 27 49 11 -68 -61 -36 -5 48 39 -34 -70 -25 -36 47 -32 -36 -53 73 7 -16 -54
1923 -54 12 21 35 40 45 -2 19 9 75 9 11 29 14 52 77 -65 -45 47 78 50 -57 -81 -79 -15 39 -49 -27 -45 1 42 -22 -48
1955 -48 -12 20 45 28 13 -40 -12 -29 -20 -50 -29 -19 84 6 -16 -45 3 24 37 9 -32 -37 -7 24 -2 -18 -32 -23 28 23 46 -8
1987 -8 -22 28 58 52 -54 -27 19 34 23 -39 -80 0 3 -31 -78 39 3 61 -19 -9 -40 -21 -12 77 66 4 -71 -21 30 38 -33 -61
2019 -61 -41 46 64 -9 -81 19 -2 63 52 -40 -4 -32 17 26 -18 -45 -61 -5 42 12 -40 -20 65 50 23 -60 -15 8 49 -21
2049 -21 16 -81 -26 23 75 85 -40 -24 51 39 -6 -3 -31 36 70 10 -42 23 52 12 2 -25 -48 -17 19 38 -4 24 -19 -27 -13
2080 -13 19 -37 -92 -16 42 39 -51 -64 -70 19 89 42 -19 -36 -37 57 33 -11 -43 27 35 72 -39 -28 0 33 0 13 -9 -82 38
2111 38 9 38 -68 -26 43 17 35 -42 -22 -17 -12 27 -18 3 -3 -14 49 -24 -5 -42 -14 60 31 -34 -61 -4 37 37 -64 -51 -42 65
2143 65 27 -18 -5 -34 -39 66 33 -84 -78 17 11 11 -12 -34 -3 0 96 38 -4 -29 -1 34 45 -30 -40 -9 27 47 -14 -67 -7 10
2175 10 16 17 -88 -66 -22 76 -1 5 8 -3 21 73 25 -44 -42 69 53 -50 0 -27 -36 27 -1 -15 -55 30 26 0 -62 -40 -13 6
2207 6 48 -27 -40 -30 -19 90 43 -81 6 49 32 23 -5 -61 -45 40 22 0 -46 -90 86 63 46 0 -21 22 43 61 -32 -70
2237 -70 2 63 121 41 -54 -88 12 28 20 -11 -54 22 38 16 11 -24 0 14 31 7 -1 -56 -21 4 31 -37 -6 31 55 -12 32
2268 32 3 -18 34 69 -13 -70 12 47 69 28 -27 -11 80 72 -40 -9 -3 37 11 50 -18 -61 -37 35 12 -7 -45 -62 20 47 54
2299 54 30 -89 -5 51 16 38 -11 46 57 61 91 -40 -9 12 61 8 5 -54 -10 57 6 9 -35 -26 -11 56 -11 -63 1 75 68 10
2331 10 11 2 -35 60 11 -59 -43 -22 36 52 -42 -33 -45 25 56 -33 50 -52 -33 2 63 -35 -65 -1 29 69 6 -55 -57 68 66 9
2363 9 -27 42 76 66 7 -42 26 29 48 63 -16 -26 -54 69 15 25 -102 -59 21 41 -51 23 -29 -13 52 -42 -29 -30 -13 51 57
2394 57 29 15 -54 8 -2 -17 2 -62 19 60 24 44 -8 15 38 24 -39 -76 2 27 43 44 -40 12 4 32 -13 -1 -40 -9 -13 71
2426 71 -73 -11 -3 49 45 36 -3 -10 38 49 -39 -24 -24 -13 30 35 -13 -17 -4 -8 28 3 -29 -23 3 51 6 4 -38 -52 43 87 40 -47 -14
2461 -14 14 5 -42 -58 -19 -24 35 10 0 6 24 42 8 46 -1 -32 59 23 -16 -38 -17 -31 35 9 -67 -39 -14 41 32 -10 -9 -11 27
2494 27 -18 13 7 -45 -31 15 23 41 -37 -4 -3 25 14 37 -37 18 36 -4 -78 -12 25 46 -21 -33 -20 3 43 -9 -57 -31 -5 40
2526 40 -18 -46 -78 -44 -28 36 21 -28 -58 1 30 92 13 -47 -7 61 21 12 -46 -23 33 -4 41 1 -57 -27 67 -8 -17 -6 2 11
2558 11 43 -32 18 -30 -28 3 39 -58 71 18 75 7 -15 -58 34 43 18 -27 -15 -14 45 -21 -4 8 9 21 -22 19 -21 -57 24 25
2590 25 -2 -23 -37 -19 25 8 -10 -11 -34 11 53 0 -31 51 -33 -4 54 18 -51 0 -2 42 14 -31 7 16 10 -43 -41 -46 0 -17 3
2623 3 -45 -5 -36 -14 -48 37 -28 53 54 -22 11 -6 -2 0 -52 9 25 -74 -18 42 -24 -10 -4 -50 -12 31 44 10 3 5 10 -14 -8 -54 -34
2658 -34 49 -3 -5 28 -22 6 4 -10 -43 15 12 1 31 -19 -7 17 -11 8 -2 -41 -2 32 -10 -43 -57 -41 9 44 12 17 -61 28
2690 28 30 14 18 -3 62 29 1 -8 -5 37 62 -35 -29 52 -56 83 0 14 10 4 21 -33 -6 -28 20 -13 3 7 -18 27 -17 36 24
2723 24 -23 -8 -21 3 30 -43 -6 -74 4 15 -6 41 3 -13 36 6 5 29 -2 29 14 -27 29 -11 -34 -39 37 -6 -46 22 23 45
2755 45 -15 37 29 19 -42 22 3 20 3 -16 15 -6 -27 -9 -6 -41 -18 -6 20 -68 -37 -23 9 -33 18 52 27 6 -33 14 -24
2786 -24 45 27 -66 37 -42 26 43 15 33 14 7 25 46 -40 -22 -9 20 7 -9 33 -45 -33 11 -23 -34 -15 3 -43 24 13
2816 13 -5 29 11 44 32 44 13 32 52 72 -2 -23 27 8 -34 9 -15 22 -62 -43 -31 2 6 45 -11 -48 1 7 42 -15 22
2847 22 -41 -54 10 -53 -9 -15 0 -7 16 -32 -19 -30 -10 -4 12 -14 -31 -35 23 12 15 -16 17 -9 -34 -4 12 13 -4 -33 -14 14 32
2880 32 67 56 60 -12 39 -46 52 28 5 8 -17 -12 -21 -46 -18 -21 5 -20 -40 47 -50 14 0 -5 -19 14 -7 13 47 -14 -16 -41 16 -1
2914 -1 14 27 -14 3 15 34 4 22 -9 26 32 18 1 -2 26 -24 -33 -29 40 -16 -3 33 -4 -37 -13 18 -20 0 8 3 28 -16 31 -2
2948 -2 -1 -29 31 -11 10 -16 39 -24 60 7 -13 31 -24 -26 17 53 -5 -9 -38 42 -23 34 -8 -10 -19 17 45 72 -8 43 -46 -11 25
2981 25 -16 52 -59 -32 0 55 -33 -21 42 23 14 -17 -47 20 49 56 -14 6 17 85 20 0 4 -14 -3 26 9 38 -15 -27 20
3012 20 -15 55 -67 41 18 -60 -11 13 29 1 16 -21 -12 -21 -9 -18 27 -38 37 -58 29 9 27 33 0 35 31 28 55 33 7 18
3044 18 -25 11 -16 6 -16 34 37 10 24 -36 -40 59 -63 -1 50 28 37 0 13 -61 -43 -13 1 17 -2 12 -23 -27 -1 -26 -13 54
3076 54 15 -10 30 44 53 -35 -18 18 0 57 2 -40 26 18 22 3 43 -6 -12 40 10 -6 14 -9 28 -19 38 13 27 -33 53 55 -25
3109 -25 -21 -4 -25 -16 -9 64 -25 7 4 41 -20 -42 -26 9 -36 -19 21 50 -38 -35 13 38 13 -18 31 -14 9 15 -9 -20 -22 3 -34 37
3143 37 4 -10 12 -16 -5 16 -15 -24 1 -18 -5 -19 10 -17 -6 19 7 -33 25 19 17 21 -2 4 -14 21 -26 -23 31 30 3 13 -7 71
3177 71 0 -34 13 -37 2 -48 -34 15 -18 35 52 21 -6 42 -3 -19 -3 -12 -3 -38 -9 6 -57 29 17 19 28 2 4 -42 16 -28 50
3210 50 -1 58 15 17 -15 15 15 -22 9 24 -38 28 -51 10 70 -20 16 25 -20 -7 2 52 19 -34 77 56 13 34 10 -1 23 -22
3242 -22 8 -34 28 2 14 -15 -20 17 -5 -2 8 48 9 39 1 3 15 -33 28 26 1 -16 28 -61 20 -1 -73 3 -24 35 -15 -28
3274 -28 13 -11 24 36 -66 -23 25 -52 12 -33 -30 28 59 0 47 8 -13 34 54 0 -5 25 47 -16 12 -38 -24 63 51 13 23
3305 23 16 -36 2 -6 53 33 4 9 -5 83 25 7 18 -39 29 -27 25 -43 -44 -10 8 -35 -25 67 64 -43 31 -3 1 -18 54 -22 -74
3338 -74 -35 25 66 37 9 3 -15 -30 18 55 -5 46 31 25 -18 -29 -24 31 -52 -85 -21 -20 -17 -64 0 3 9 -32 -11 0 44 -10 -17 -12 -10
3373 -10 44 -23 -13 -64 -7 -12 -9 -20 48 69 34 23 3 34 2 17 -43 -17 -1 27 12 43 25 31 -20 15 3 -52 30 -39 -27 -15
3405 -15 -10 -15 32 24 -9 -19 26 21 13 17 -16 -12 16 27 45 28 8 -25 49 20 20 -57 -32 0 5 33 35 28 57 46 41 12 5 27 21 23 -7 21
3443 21 28 44 13 33 13 17 -42 -10 -28 -45 -20 6 -6 33 11 13 16 16 69 22 29 -7 1 11 40 7 -15 54 3 11 33 -20 28 -5
3477 -5 23 -9 -40 8 -5 30 5 86 26 1 1 -27 76 36 -18 27 -6 -50 -12 -26 -10 21 34 6 -24 6 8 45 -5 37 -46
3508 -46 0 -38 -39 -13 -20 23 27 36 53 8 1 13 58 2 14 30 -52 37 16 14 40 18 -23 -29 34 -26 26 33 27 -12 -29 -41 -36 -16 20
3543 20 27 11 13 4 41 21 15 -30 45 13 -29 12 -27 35 46 -12 40 20 -1 1 -11 -29 -24 -48 -52 -19 26 -7 5 -4 5 46 -2 76 16
3578 16 16 40 -16 31 8 -11 54 -63 20 45 -6 -14 -12 8 -29 42 -25 3 21 -1 19 9 -44 -14 26 25 49 19 -23 -30 43 31
3610 31 -26 22 32 -17 -11 -37 -16 51 -10 50 -1 20 -23 36 68 5 -12 -39 -15 2 -16 -17 -45 -18 4 8 -13 55 76 27 -28 -7
3642 -7 21 -17 22 -18 52 -12 10 38 17 -15 -2 8 19 -4 22 -14 -10 9 21 -3 -18 -9 -76 35 -38 -54 6 30 29 12 8 -27
3674 -27 28 12 16 0 6 -17 -5 22 8 -48 59 -22 25 -25 -52 7 -52 -20 -10 36 49 -11 -22 -4 25 -3 -6 13 26 17 11 3 85
3707 85 -9 -38 -5 10 33 77 -12 -11 -29 11 11 74 23 13 -1 19 42 45 -20 -9 28 -30 51 13 2 29 -10 41 8 10 4 -47 32
3740 32 -13 -18 -2 66 39 -21 6 -1 3 -21 -1 -7 -10 -41 -8 -1 -17 6 17 -12 82 18 6 6 -13 -4 9 -4 -29 23 30 -46 -16 -34 -20
3775 -20 -23 -23 3 7 6 -21 -8 34 10 -1 55 3 -6 6 -48 76 -10 -7 7 -75 -30 26 -13 27 10 58 5 10 7 -19 15 -32 23 21
3809 21 40 24 -38 -8 7 -24 -41 -15 20 11 39 -16 76 -9 19 39 -54 42 27 -32 -16 28 11 -23 -14 10 -92 32 31 -32 29
3840 29 22 -8 -16 -7 -15 25 44 -28 31 16 20 32 -55 23 -5 14 67 -23 -41 -47 -24 22 7 35 -5 5 14 -10 47 31 -52 -28 -9 7
3874 7 21 -15 43 -65 -21 -4 3 14 8 -6 -3 24 1 -10 5 -21 -18 0 -3 27 16 -23 11 62 7 -9 12 -30 1 78 -35 31
3906 31 20 41 -13 6 -8 -17 34 39 -16 -4 11 12 -23 20 -33 14 -30 -33 20 -31 21 -46 13 7 43 -8 0 -9 7 45 4 -41 -15 15
3940 15 60 -56 -12 28 11 50 18 24 36 12 13 -20 3 76 -20 -20 42 30 0 -49 -9 -1 10 -57 19 13 -83 -88 43 41 56 20 -32
3973 -32 23 -38 27 -15 -7 -5 64 17 -4 -10 37 -39 10 -16 -6 18 -30 21 63 48 -14 -33 25 10 -47 19 47 -28 -47 -48 -41 7 -19
4006 -19 -14 30 -23 59 7 -6 -18 -18 -35 -34 7 5 36 -16 -33 0 23 26 8 14 14 -21 -15 18 28 40 -16 9 20 -20 82 -8 16 11
4040 11 -9 -5 1 3 -4 4 38 17 -19 16 -18 18 -49 -31 48 20 54 -15 19 -26 9 38 26 -10 4 22 -14 22 33 -20 -20 45 -9
4073 -9 18 -8 -63 -21 -40 -19 6 14 24 -56 79 -37 1 -26 -26 -13 -16 -7 -62 10 -7 -41 -6 -63 -64 -8 25 3 -13 -2 -11 22 44
4106 44 20 23 24 -18 29 26 9 73 -23 -29 6 -5 15 8 -12 -14 -19 -13 42 -6 55 -50 -41 20 13 38 -5 33 -37 -14 5 3 1 4 2 5 -7
4143 -7 10 -33 16 -58 -10 39 21 -8 35 -43 16 17 5 -8 38 4 32 57 -14 -19 2 -27 -37 -3 30 -19 31 -21 19 28 -25 -12
4175 -12 -20 -86 -2 -6 1 16 -12 15 50 -32 -4 1 -26 -12 -7 43 46 -15 -56 33 -3 -11 -29 73 -18 8 24 -13 -12 28 37 -12 -43 28
4209 28 -15 68 16 22 -29 -41 -28 -44 0 -15 -57 -16 -26 -12 -17 -31 17 -20 6 -28 17 51 40 9 9 3 24 33 55 -4 19 36 -18
4242 -18 1 53 23 2 27 29 10 28 -15 -24 57 12 24 6 -44 27 59 -9 -5 6 -23 5 -4 3 -24 28 12 -14 -5 18 12 1 10 -19
4276 -19 -24 24 -18 1 -8 -4 -21 35 59 11 27 12 -48 3 3 -19 0 -31 -53 5 2 -19 12 -9 46 -16 32 17 23 -16 -31 2 -26
4309 -26 -38 -19 -41 8 53 -42 -34 6 -44 -18 -9 -2 -18 -28 5 59 20 26 -19 -7 -28 -25 17 41 -24 18 -19 17 5 -10 31 -32 -12
4342 -12 -11 42 4 85 -77 -27 -21 -1 16 -1 -23 21 -3 0 -46 -27 27 45 14 37 -17 34 -18 -12 -31 -5 -21 45 63 45 6 -16
4374 -16 29 -26 -48 1 11 21 42 -25 28 48 -31 -12 1 18 39 -57 -25 -8 -41 -7 -53 -58 -79 -1 -4 1 -44 10 -29 -47 2 0
4406 0 43 31 30 -8 39 26 -26 -1 -24 -11 -49 -27 -33 -49 19 7 -30 49 12 -3 37 -14 49 46 -16 -26 -12 -49 21 -31 -71 -13
4438 -13 -46 13 10 20 14 57 -37 -28 -21 16 43 -14 1 27 -3 -3 -13 58 1 31 -42 -23 16 23 54 21 -23 -34 -50 -3 -7 23 -70 13
4472 13 5 -12 -15 -12 1 -50 45 21 2 2 15 14 42 -5 4 -22 -35 -37 23 9 -22 17 3 -4 -22 -60 1 25 -1 -59 48 8 -10 -18
4506 -18 19 -24 -36 15 -13 -33 -4 20 2 17 4 35 30 -56 26 27 -53 -46 28 -2 -19 -19 -36 -9 -2 1 2 -32 12 1 14 -7 -38 -6
4540 -6 0 17 -22 -2 -17 7 18 10 -13 21 12 48 23 -51 -43 12 -48 13 -13 -9 -39 -13 31 -65 -10 -6 1 -5 33 41 -8 -24 -21 16 14 -4
4576 -4 -6 -33 -22 -11 -8 -16 -32 17 24 -45 -17 -28 83 -16 -29 9 16 49 -5 -17 13 23 19 -6 11 -10 -33 -25 -25 -8 -18 23 -18 -12 -13
4611 -13 -1 24 -33 35 15 34 -26 -29 28 -10 25 30 50 29 -47 -5 -31 -17 -29 12 15 8 -44 23 29 -29 -36 55 -8 15 11 -34 -6 17
4645 17 -12 -13 47 10 23 10 47 21 27 35 27 -51 12 -8 1 -21 -23 -25 -22 0 -27 -37 -4 -24 0 -17 28 -35 -14 46 3 -27 46 12
4679 12 42 -47 -63 28 41 29 -48 16 -35 -17 -11 3 -44 26 19 -4 -23 -5 15 47 -24 4 1 -22 4 66 24 18 -31 -26 -14 -24 27
4712 27 29 -31 5 37 -11 42 -42 27 -28 15 7 -35 -8 -49 9 -32 -4 15 11 43 -37 -12 -8 -26 5 29 -7 24 16 5 13 -33 -45
4745 -45 37 37 24 31 -14 33 8 3 48 33 7 -17 24 3 -10 37 41 10 -68 -40 -9 10 9 -7 -40 -53 40 -46 -39 -23 22 16 -13 -10
4779 -10 -15 -44 -17 -7 -29 32 20 49 6 8 -26 -20 18 -19 15 58 4 37 -57 -58 -16 -10 34 -29 -26 -22 26 -2 10 33 -14 30 -16 -59
4813 -59 68 -16 -4 -61 -10 -3 73 20 14 52 -9 -37 -22 15 -12 -24 6 24 26 -31 -28 -29 -42 16 -9 -3 -56 28 -1 4 17 2 3 13
4847 13 -18 -5 18 27 26 14 56 7 27 4 9 -49 0 -5 -11 -41 -23 59 -6 -3 11 -7 -64 -17 22 -42 -11 66 -23 4 -7 24 -4
4880 -4 23 -7 9 17 -32 4 -13 -23 -22 -22 39 78 46 31 -30 -25 -14 -41 -13 10 2 31 -51 18 -30 -16 -27 45 15 -4 -33 63 -4
4913 -4 5 -13 26 3 26 41 -17 19 31 -13 19 -17 -7 -7 -6 -18 -42 52 24 31 -8 -35 -11 29 27 -1 32 34 36 2 20 -3 -19 5
4947 5 8 -19 -39 -12 8 -46 20 8 -30 45 73 -26 0 -18 49 26 27 15 -22 34 -46 11 19 -19 5 58 -26 10 -15 44 -10 -29
4979 -29 25 -26 -16 -22 -7 44 5 -86 -17 7 -22 21 -51 -45 -23 -17 31 -13 -57 -1 -17 -27 -7 12 -2 -7 24 -4 21 4 41 -16
5011 -16 -21 -4 -7 13 9 -1 -33 -10 -24 -21 -24 -22 -42 33 -15 60 -23 19 -7 -4 -15 -29 -41 -43 40 0 -70 -11 18 51 -8 37 42 -23 -1
5046 -1 10 -11 33 -6 53 -25 9 -22 7 50 -8 -38 -14 -27 16 3 -8 4 -9 -21 13 36 -11 -16 18 3 35 -20 -8 21 9
5077 9 -43 -8 -23 25 21 10 25 28 12 -1 52 24 37 39 -2 -40 -4 34 -37 45 6 2 4 -13 -7 -16 24 -8 -5 -13 -31 -60 36 -20 -28 23
5113 23 -48 -5 29 -8 -19 -41 34 -5 -15 -15 -1 2 11 10 -88 -17 66 21 44 -31 -7 2 32 -18 -2 -27 -26 -6 -37 51 16 45 31
5146 31 38 11 22 -9 24 -4 -22 15 -56 -6 -37 -2 57 12 16 33 16 -62 -20 -21 -28 -49 30 41 28 31 -3 22 26 46 13 -22 4
5179 4 56 -26 2 10 -51 13 -37 -6 8 -10 -13 27 -46 -18 -3 4 -24 -6 -20 1 23 -15 -11 -44 -20 -23 -48 38 -45 -9 -32 -97 24
5212 24 -2 21 -19 9 -71 -10 -26 -19 37 -19 -25 5 -22 -4 -16 29 22 29 35 -20 29 29 15 59 -2 18 -17 -66 -24 10 11 16 32 32 9
5247 9 -41 -29 -20 -6 47 43 56 -17 2 11 -21 -19 24 25 12 39 -16 42 -35 25 8 0 17 13 14 10 20 -10 3 19 19 -15 14 0 5 3 -11
5284 -11 12 -41 -9 -13 -11 -18 9 -9 1 -48 -15 -64 16 21 9 -40 -18 15 -24 -1 35 -10 -15 -47 -14 -15 -11 19 1 25 -15 36 -14 -27
5318 -27 -44 -40 -11 4 -5 45 4 -12 -8 5 -31 -20 -9 -7 -27 5 -2 -52 31 12 -50 -10 24 39 26 -30 -21 -43 -7 -9 -30 -16 12 25
5352 25 22 -23 0 -2 45 -43 5 -41 -15 -36 -16 -19 11 64 -20 -1 -26 38 -13 13 -40 27 62 -18 -28 11 4 -2 -48 57 -54 -52
5384 -52 53 22 -6 46 13 18 20 1 -3 -23 8 -6 12 -4 38 4 -11 4 15 36 59 30 12 -4 -38 -9 -20 49 15 12 10 11 -11
5417 -11 -10 -5 -32 -1 19 -1 60 90 3 -14 58 9 -33 -11 -36 -33 14 -12 -3 45 13 14 -17 17 5 -3 2 6 37 -6 -7 15 -7 3 33
5452 33 58 54 -11 12 26 -4 -19 -3 -7 6 10 -20 37 -15 14 -37 8 -23 50 0 8 22 39 33 27 18 22 -41 4 12 1 38 -2 -24 12
5487 12 16 -43 -11 18 0 6 58 15 -39 26 -16 37 -71 -7 3 5 -22 39 -30 -26 -6 -58 -13 11 12 -43 0 61 53 52 -28 -48 -39 -6
5521 -6 27 40 -46 -5 16 -50 -13 33 -14 -15 33 2 -6 9 -20 -73 8 -35 33 -9 -1 1 6 -14 -17 20 -37 -27 31 -19 -55 -29 8 -18
5555 -18 8 24 -10 -8 33 38 -34 -3 -32 9 26 8 -22 16 -46 -33 18 24 34 -44 -65 -17 16 -13 27 -18 -29 -88 -26 21 -37 -10
5587 -10 15 30 -18 11 2 -25 38 39 -27 -56 38 10 38 20 10 -20 -16 -11 6 8 55 22 1 -3 38 49 34 -21 -26 -32 -6 38 -8 5
5621 5 -19 33 28 -6 -8 -3 -4 34 12 -33 12 25 -34 -22 18 6 -9 0 14 -7 -5 -10 29 -21 46 13 8 12 32 11 5 -11 34 -12 13 39
5657 39 79 -10 -44 -27 39 -35 -56 -24 16 -21 19 -38 -7 5 39 -41 27 -65 -20 -20 21 36 22 18 16 -3 -26 37 47 -12 -5 38
5689 38 -32 40 16 9 35 21 24 -36 15 20 -42 35 18 6 7 -14 -34 15 -17 1 8 -4 38 -2 -5 7 21 -28 -13 8 -15 2 17
5722 17 26 -21 14 3 45 46 -23 39 9 26 -15 -5 44 2 54 -14 57 15 37 -20 34 13 -8 31 25 21 11 56 -23 -17 -54 28 -4
5755 -4 0 10 -16 -2 24 -5 13 -45 -15 22 -23 -15 47 33 -3 -66 53 9 36 11 78 39 6 32 23 31 52 14 -11 -26 21 45
5787 45 37 0 -18 -57 -4 -5 3 -44 -23 6 -24 31 20 -4 -6 -10 -4 25 -12 25 15 26 -10 -14 0 1 43 8 22 17 16 56 27 26 7 -2
5823 -2 -24 13 -42 20 -4 -55 37 -16 -27 -8 20 -29 16 -54 32 1 33 -37 21 -53 -37 -26 -27 16 -6 7 -14 -37 -9 27 38
5854 38 -5 -10 -51 -11 11 -60 -23 10 -45 -1 43 -20 41 33 -13 41 27 -31 26 -7 -2 -18 -14 -17 -28 52 16 -43 5 4 -5 16 0 -68
5888 -68 -39 -14 15 7 14 2 42 -57 -24 -4 11 14 -13 -21 -8 2 20 39 11 -6 17 -4 -31 32 -6 -7 -24 10 -8 -14 31 5 14 -24
5922 -24 24 -7 -67 -8 -28 -35 38 -18 -4 -6 -20 49 -26 17 97 -33 -8 -24 -19 -3 30 -31 23 1 -45 6 27 -46 47 -47 55
5953 55 -18 -34 58 5 22 -22 -5 0 -48 -29 24 -13 -14 -24 -31 -16 -36 15 13 -1 -35 5 -4 -50 30 27 60 6 -38 1 7 2 -15 2
5987 2 -29 5 -15 55 20 -39 -18 25 -6 -25 38 51 16 -10 -14 28 -6 18 0 36 -27 35 20 -17 22 -6 -7 -8 4 -7 22 -16
6019 -16 2 -30 16 60 -45 40 -18 29 -10 -37 26 32 18 17 -33 -33 3 51 -4 -19 65 33 66 -14 19 -24 -18 39 15 -9 31 -41
6051 -41 -10 -7 26 -28 9 -32 -54 28 -32 -17 -42 -14 -1 -50 -49 -1 8 88 16 2 6 57 -19 17 -4 2 33 -4 -42 57 -3 -9 6
6084 6 -6 19 -19 -5 -38 15 26 -4 -10 -33 -43 12 -9 6 53 -13 4 0 0 26 -37 16 16 -11 -15 -2 4 -28 -45 16 43 3 21 -9
6118 -9 0 1 35 0 52 24 -53 -28 6 14 43 -52 25 6 -9 5 -13 -57 -29 -3 -36 -5 5 8 -17 23 -28 3 31 -38 -9 37 29
6151 29 -20 -6 -15 -24 -13 -23 30 69 63 55 13 -38 -30 -51 7 -30 -6 66 -33 70 28 -16 66 14 -17 -26 30 12 8 -9 14 26 -33
6184 -33 -33 10 6 -67 -33 8 -58 -55 27 11 21 -26 16 47 -12 27 27 51 22 15 8 -34 -43 21 31 38 -44 20 11 32 1 3 -19 -4 -10 -42
6220 -42 39 -10 -5 38 19 -20 -5 -26 -33 -45 22 -30 30 -1 -66 -18 13 -18 -38 -46 -28 -14 27 -11 94 -6 20 -17 -27 -31 -20
6251 -20 -25 10 5 -18 45 -17 14 -40 -36 -13 42 16 -16 -57 12 40 -19 11 -1 -39 45 -4 21 11 -46 2 -26 -37 29 -24 -32 57
6283 57 -36 7 40 -12 -5 10 27 -43 -7 7 54 19 36 31 16 -2 41 -14 25 22 -10 -12 -7 54 3 -53 8 19 24 -36 -52 19 8
6316 8 -8 13 -83 6 18 3 13 -4 0 19 9 -34 -38 -45 13 -85 -4 -25 47 32 19 3 8 -4 15 -16 -40 -71 35 -12 52 -44
6348 -44 9 -19 -17 -10 -32 46 24 -45 30 -4 32 15 -20 11 5 41 14 15 18 -9 -16 20 43 2 -42 -30 -39 -2 -8 37 -32 -9 10 81
6382 81 -39 -16 -26 -17 48 -11 47 -19 26 -20 -19 10 -19 -50 -12 -23 40 14 41 -14 11 -13 2 -16 -29 25 11 -20 -27 -3 16
6413 16 -16 -32 -6 17 12 2 -11 -4 -3 -34 -12 -9 41 20 4 22 6 3 -3 62 -2 -32 27 -17 -5 -47 5 61 19 2 -3 -10 -17 -26 6
6448 6 14 -55 34 -32 -18 11 21 1 5 -15 -16 22 -6 -9 0 4 32 2 -50 -14 -60 -16 12 -5 -12 -37 -21 28 -41 -27 9 -2 -15 0
6482 0 17 -39 -16 -9 31 -35 -18 -30 44 2 39 -11 14 32 -40 -16 27 -9 19 28 -21 -28 -2 19 7 3 -7 19 24 12 -44 -6 18
6515 18 17 -11 -33 30 12 -26 18 -29 9 -18 7 27 -35 -32 33 -19 -5 3 -46 -11 -29 -38 -5 0 -3 -13 -4 -40 7 15 -2 -11 1 33 -28
6550 -28 38 -7 -19 34 23 -64 48 57 2 -10 -74 28 43 -49 -35 3 -33 -20 16 -41 1 -18 -16 25 -17 -25 -39 -7 20 -25 19
6581 19 -13 4 -24 45 19 -48 24 -33 10 -25 -32 11 48 -23 -14 -7 -11 4 -27 -16 4 -5 4 18 -22 49 -58 27 22 24 -12 -2 38 27
6615 27 -27 -77 -6 -18 32 -14 0 24 20 -4 -13 27 -57 -13 -66 27 2 10 28 55 -6 25 74 -15 12 -7 13 -25 38 13 3 9
6647 9 -11 -21 -10 -13 -69 -41 -17 56 18 -31 -21 28 5 -12 -4 14 27 -16 -9 -35 20 41 -33 29 -28 -4 -30 16 -24 13 -6 -43
6679 -43 42 31 -10 -46 -39 51 -10 13 65 -31 -2 -7 -9 12 8 13 -12 15 6 -4 -58 31 40 33 -27 -29 -55 8 31 38 -4 1 3 -3 24 -12 58
6716 58 57 31 15 4 -2 -26 12 -37 13 26 -1 12 39 -21 -13 -84 52 0 31 -13 -13 -5 5 24 31 -20 10 26 -43 -27 8 48 4
6749 4 -6 -23 23 30 -29 8 33 -6 47 -35 -11 21 -12 24 91 -36 -37 32 -20 47 -14 42 68 -29 -5 -27 -9 11 -40 -6 3 2
6781 2 7 -14 7 -36 -21 11 -50 7 -10 16 8 4 -13 -23 19 17 9 -28 -24 11 73 5 -1 40 -41 21 29 16 13 -20 25 -13 -43 -14 53
6816 53 -4 -40 -16 32 0 6 -9 -16 15 -6 -35 -21 -14 6 -46 -1 -3 11 62 9 43 -35 -13 -25 7 42 26 10 -32 -7 15 16 -3
6849 -3 0 0 44 19 21 0 11 51 55 -17 24 8 -23 20 24 0 -53 7 -51 -51 23 36 48 11 -26 -25 11 37 -41 -17 -20 -18 -44 -29 7
6884 7 22 -30 5 5 39 13 -13 -54 -7 -4 17 18 -119 27 23 -8 -9 -18 15 22 -23 15 -49 19 27 -55 -37 -6 18 -28 -3 -18 -3 12
6918 12 5 48 27 -26 76 23 2 1 9 37 12 -22 55 -36 104 -14 13 16 17 37 -26 42 -3 -21 -27 -7 -28 18 23 53 -11 -18 20
6951 20 -11 47 -28 -32 -20 -13 -7 -17 28 -16 -1 -7 -41 3 -6 57 0 -11 8 -31 33 14 71 80 35 19 -4 35 32 -55 33 -29 5 36
6985 36 46 5 -13 -8 24 26 -12 4 79 30 19 -9 14 -64 -13 21 6 23 -13 10 21 17 -6 20 -17 29 21 12 -49 -40 -5 31 51
7018 51 -11 2 24 43 -40 3 3 1 8 8 18 -22 -3 -9 -2 -2 35 26 -48 -34 -28 -7 -34 -37 -27 0 27 9 -41 30 -1 33 44 44 22 -27
7054 -27 24 35 67 49 19 2 4 -20 7 -4 3 -14 35 -3 -44 24 -22 -4 -1 -28 -36 -39 32 19 3 -1 -3 -8 -20 26 27 -4 17 61 -50
7089 -50 7 -24 -53 -44 1 4 -14 -29 47 26 -50 38 38 23 0 30 61 11 8 42 -2 -8 21 36 -10 54 31 7 -4 43 6 -14 4
7122 4 -36 17 24 40 -9 24 6 2 3 -7 23 13 -4 -40 4 7 -21 -16 -12 4 -3 43 34 -12 46 25 31 39 10 34 25 28 -44 -6 -18 35 -42
7159 -42 51 -33 0 17 21 59 4 -9 6 -34 -4 -15 13 3 -24 -36 -18 -15 -13 -24 -29 -22 -18 -39 10 67 5 -57 29 69 -10 41 -34
7192 -34 34 10 35 31 -3 3 3 -1 32 -10 21 -34 0 40 37 -57 -26 12 -14 -4 6 -21 -13 -8 -77 -8 -25 -3 2 21 6 -4 -7 -4 7
7227 7 14 9 46 14 7 -17 -40 -7 6 -19 -59 10 69 -11 7 21 10 25 -53 14 -12 50 5 -47 34 -1 13 -8 -57 -42 -45 5 -13
7260 -13 24 8 -32 13 13 2 15 -23 15 17 -40 23 37 49 26 9 -12 -6 23 40 8 30 -11 18 -16 20 59 -2 3 2 19 -15 8
7293 8 -17 -14 -10 -58 11 -7 -5 -20 -1 12 -20 0 -25 -3 -18 -14 17 -1 -37 29 15 38 -21 -1 -30 -2 9 -57 45 11 -9 -9 42
7326 42 -21 -53 -8 -65 -1 -25 25 -3 4 20 6 4 27 -3 -47 -28 35 -32 8 60 -35 14 -19 -40 -2 -14 -60 -52 -7 -28 -3 -23
7358 -23 21 2 -27 -32 -18 37 -5 29 49 -34 25 27 -6 1 30 0 24 6 -23 33 -20 -6 -4 -3 -9 26 16 -13 -35 -9 -11 18 4 -16
7392 -16 3 5 -1 21 20 44 16 0 -52 -19 -40 -6 44 -14 51 -6 -30 51 37 5 35 -33 -30 8 -5 2 6 -8 11 -6 -20 7 10 6
7426 6 28 47 29 -17 8 -4 44 3 25 56 -53 79 -13 9 33 31 17 -67 10 -8 5 38 -23 15 -12 33 21 -3 15 -27
7456 -27 26 -1 -13 -3 -22 20 -2 -63 -3 -30 52 6 13 -43 -11 28 -18 -34 18 -56 15 -1 23 -2 -4 -11 13 15 21 13 -12 -2 44
7489 44 53 41 -39 3 -16 -38 -5 26 50 -22 -21 -19 52 -16 21 -74 1 -65 -59 43 11 -12 21 38 5 -9 -26 -42 -25 -62 -70 16
7521 16 43 -21 21 33 -7 28 17 32 46 -2 36 34 8 -2 32 12 -26 33 -9 60 -11 45 62 10 11 25 7 3 -4 -5 -33 -14 50
7554 50 27 -21 14 -5 -69 8 1 -25 17 25 22 9 -14 53 -26 23 74 21 -24 33 40 52 -9 -40 30 12 14 -32 -1 -2 -5 28 58 2
7588 2 53 -46 -25 0 -16 -28 9 -2 -26 -39 2 12 -3 -34 -11 37 19 -40 -13 45 38 39 25 7 -1 29 -17 15 4 -25 -54 -6
7620 -6 6 18 28 12 27 11 15 16 -3 -21 0 -75 9 -12 -13 -44 -32 48 -8 -15 -1 -4 -33 -2 -15 21 16 -26 -3 23 -56 -19 21 -28
7654 -28 -4 16 23 -8 10 44 11 -18 12 10 16 -37 27 -14 12 12 41 13 -12 12 41 6 -35 22 -8 -43 0 -21 32 6 -5 15
7686 15 19 3 32 23 -9 -28 -16 -8 23 -26 31 43 57 15 -13 -20 28 -20 6 15 30 4 -45 16 -50 -49 20 -29 51 -4 -4 -26 4 70
7720 70 -17 -17 -49 3 -16 4 -54 -8 12 25 67 -25 9 -24 9 -17 51 60 -43 -19 11 26 0 -13 13 2 3 42 10 -24 51
7751 51 -4 -42 -23 30 2 -18 -2 -37 -19 0 -11 -24 22 26 -17 12 22 6 18 -5 8 -21 14 -6 -37 -3 39 27 5 33 -21
7782 -21 6 39 -30 -4 39 17 3 -20 46 8 32 7 29 38 7 -19 -1 -29 12 -77 -10 -13 18 26 -29 -43 -53 1 -24 0 -19 -53
7814 -53 22 -56 -7 66 -1 -15 -1 -38 -19 -15 26 7 -36 11 -73 26 6 31 15 -58 49 -4 -39 1 22 27 -45 -22 13 37 -11
7845 -11 -18 -20 -39 -4 40 -9 -86 18 -18 -35 -41 2 -38 -9 -17 40 19 -17 -55 -8 -1 -21 -14 2 52 29 38 26 52 -53 -9 -11 32
7878 32 -26 -13 -2 -93 -26 -60 10 -30 -16 -34 54 -16 -63 6 -35 -65 33 42 5 -6 -43 -3 -7 31 19 9 -3 49 -5 8 40
7909 40 6 12 15 -10 34 -47 -4 -17 36 67 3 33 -11 -33 7 42 -29 19 -24 35 34 -48 -45 58 35 14 -10 -17 16 1 -3 -18 -11
7942 -11 19 -18 -11 0 30 5 24 -4 -56 -32 7 -24 -28 -21 14 9 -34 32 -39 -4 24 -16 -20 -7 -18 17 -24 24 -6 56 40 -24 46
7975 46 -30 -20 -55 -45 4 16 -43 -5 11 20 31 40 10 38 -98 52 35 1 14 -33 13 43 18 15 -4 24 31 15 -45 19 -8
8006 -8 17 -36 15 -24 -16 19 -26 58 16 6 -8 -18 -70 -25 24 -7 -55 -66 -24 -30 1 -22 10 13 16 30 33 27 -21 33 -62 40 -16
8039 -16 14 -8 -33 28 38 21 -5 35 -15 7 21 25 6 -7 23 -26 31 25 -30 17 -2 -43 -29 -13 -10 -15 57 53 -34 -8 -56 -26 -68
8072 -68 20 -28 -30 -8 31 -31 -24 42 -44 0 -33 -22 -1 91 64 27 -4 -19 26 30 -37 48 25 -23 23 12 -7 -15 2 9 -1 -10 4
8105 4 -1 10 -42 -14 -10 -17 3 39 37 17 1 2 -22 -53 -23 -11 33 57 80 -4 -24 -3 15 21 22 -9 -3 12 19 -9 -62 83 23 16 65
8140 65 22 -19 46 6 21 -46 12 -9 35 23 -34 -25 0 -99 16 -48 -56 8 -21 -38 4 30 -54 -42 12 6 -2 -61 -18 29 -82
8171 -82 -51 8 -14 21 -16 31 6 22 -41 7 18 -4 12 32 -31 -1 -26 22 14 -18
8191a8
##END NTUPLES=NMR FID
##END=
