##TITLE=1H_Pr dep-Eth
 CDCl3
 8 sc, 
 13.05.2022
##JCAMPDX= 6.0         $$ Bruker NMR JCAMP-DX V2.0
##DATA TYPE= NMR FID
##DATA CLASS= NTUPLES
##ORIGIN= UXNMR, Bruker Analytische Messtechnik GmbH
##OWNER= root
$$ XWIN-NMR		Version 3.5
$$ Fri May 13 11:32:59 2022 Russian Standard Time (UT+4h)  she@DPX200
##.OBSERVE FREQUENCY= 200.1313499996
##.OBSERVE NUCLEUS= ^1H
##.DELAY= (6, 6)
##.ACQUISITION MODE= SIMULTANEOUS
##.ACQUISITION SCHEME= undefined
##.AVERAGES= 8
##.DIGITISER RES= 18
##SPECTROMETER/DATA SYSTEM= spect
##.PULSE SEQUENCE= zg30
##.SOLVENT NAME= CDCl3
##.SHIFT REFERENCE= (INTERNAL, CDCl3, 0, 15.7039)
##AUDIT TRAIL= $$ (NUMBER, WHEN, WHO, WHERE, WHAT)
$$ ##TITLE= Audit trail, XWIN-NMR		Version 3.5
$$ ##JCAMPDX= 5.01
$$ ##ORIGIN= Bruker BioSpin GmbH
$$ ##OWNER= she
$$ F:/spectra/data/she/nmr/H-F/1/audita.txt
$$ ##AUDIT TRAIL=  $$ (NUMBER, WHEN, WHO, WHERE, WHAT)
(   1,<2022-05-13 11:31:39.89 +0400>,<she>,<DPX200>,
      <created by zg, POWCHK disabled, PULCHK disabled
       configuration hash MD5:
       00 E9 B6 7A A2 85 ED C7 34 08 36 98 17 FE 4E 26
       data hash MD5: 16K
       80 F3 13 2C 7C 44 51 7C B2 1F E8 AB 09 BD 70 6D>)
$$ ##END=
$$ 
$$ hash MD5
$$ FC 5D AA 08 6B 17 2F DE F9 6F DC 1D 64 C9 06 8C
##$RELAX= 
##$RELAX= 
##$RELAX= 
##$RELAX= 
##$RELAX= 
##$RELAX= 
$$ Bruker specific parameters
$$ --------------------------
##$DU= <F:/spectra>
##$EXPNO= 1
##$NAME= <H-F>
##$PROCNO= 1
##$TYPE= <nmr>
##$USER= <she>
##$AMP= (0..31)
100 100 100 100 100 100 100 100 100 100 100 100 100 100 100 100 100 100 
100 100 100 100 100 100 100 100 100 100 100 100 100 100 
##$AQSEQ= 0
##$AQ_mod= 1
##$AUNM= <au_zg>
##$AUTOPOS= <>
##$BF1= 200.13
##$BF2= 200.13
##$BF3= 200.13
##$BF4= 200.13
##$BF5= 200.13
##$BF6= 200.13
##$BF7= 200.13
##$BF8= 200.13
##$BYTORDA= 1
##$CFDGTYP= 0
##$CFRGTYP= 5
##$CHEMSTR= <none>
##$CNST= (0..31)
1 1 145 1 1 1 1 1 1 1 1 1 1 1 1 1 1 1 1 1 1 1 1 1 1 1 1 1 1 1 1 1 
##$CPDPRG= <>
##$CPDPRG1= <>
##$CPDPRG2= <>
##$CPDPRG3= <>
##$CPDPRG4= <mlev>
##$CPDPRG5= <mlev>
##$CPDPRG6= <mlev>
##$CPDPRG7= <mlev>
##$CPDPRG8= <mlev>
##$CPDPRGB= <>
##$CPDPRGT= <>
##$D= (0..31)
0 1.2 0 0 0 0 0 0 0 0.06 0 0.03 0 0 0 0 0.0002 0 0 0 0 0 0 0 0 0 0 0 0 
0 0 0 
##$DATE= 1652427099
##$DBL= (0..7)
120 120 120 120 120 120 120 120 
##$DBP= (0..7)
150 150 150 150 150 150 150 150 
##$DBP07= 0
##$DBPNAM0= <>
##$DBPNAM1= <>
##$DBPNAM2= <>
##$DBPNAM3= <>
##$DBPNAM4= <>
##$DBPNAM5= <>
##$DBPNAM6= <>
##$DBPNAM7= <>
##$DBPOAL= (0..7)
0.5 0.5 0.5 0.5 0.5 0.5 0.5 0.5 
##$DBPOFFS= (0..7)
0 0 0 0 0 0 0 0 
##$DE= 6
##$DECBNUC= <off>
##$DECIM= 32
##$DECNUC= <off>
##$DECSTAT= 4
##$DIGMOD= 1
##$DIGTYP= 9
##$DL= (0..7)
0 120 120 120 120 120 120 120 
##$DP= (0..7)
150 150 150 150 150 150 150 150 
##$DP07= 0
##$DPNAME0= <>
##$DPNAME1= <>
##$DPNAME2= <>
##$DPNAME3= <>
##$DPNAME4= <>
##$DPNAME5= <>
##$DPNAME6= <>
##$DPNAME7= <>
##$DPOAL= (0..7)
0.5 0.5 0.5 0.5 0.5 0.5 0.5 0.5 
##$DPOFFS= (0..7)
0 0 0 0 0 0 0 0 
##$DQDMODE= 0
##$DR= 18
##$DS= 0
##$DSLIST= <SSSSSSSSSSSSSSS>
$$ [...]
##$SUBNAM2= <"">
##$SUBNAM3= <"">
##$SUBNAM4= <"">
##$SUBNAM5= <"">
##$SUBNAM6= <"">
##$SUBNAM7= <"">
##$SUBNAM8= <"">
##$SUBNAM9= <"">
##$SW= 18.0517283424761
##$SWIBOX= (0..15)
0 0 2 0 0 0 0 0 0 0 0 0 0 0 0 0 
##$SW_h= 3612.71676300578
##$TD= 16384
##$TD0= 1
##$TE= 0
##$TE2= 300
##$TE3= 300
##$TEG= 300
##$TL= (0..7)
0 120 120 120 120 120 120 120 
##$TP= (0..7)
150 150 150 150 150 150 150 150 
##$TP07= 0
##$TPNAME0= <>
##$TPNAME1= <>
##$TPNAME2= <>
##$TPNAME3= <>
##$TPNAME4= <>
##$TPNAME5= <>
##$TPNAME6= <>
##$TPNAME7= <>
##$TPOAL= (0..7)
0.5 0.5 0.5 0.5 0.5 0.5 0.5 0.5 
##$TPOFFS= (0..7)
0 0 0 0 0 0 0 0 
##$TUNHIN= 0
##$TUNHOUT= 0
##$TUNXOUT= 0
##$USERA1= <user>
##$USERA2= <user>
##$USERA3= <user>
##$USERA4= <user>
##$USERA5= <user>
##$V9= 5
##$VALIST= <valist>
##$VCLIST= <CCCCCCCCCCCCCCC>
##$VD= 0
##$VDLIST= <DDDDDDDDDDDDDDD>
##$VPLIST= <PPPPPPPPPPPPPPP>
##$VTLIST= <TTTTTTTTTTTTTTT>
##$WBST= 1024
##$WBSW= 4
##$XGAIN= (0..3)
0 0 0 0 
##$XL= 0
##$YL= 0
##$YMAX_a= 64397
##$YMIN_a= -88817
##$ZGOPTNS= <>
##$ZL1= 120
##$ZL2= 120
##$ZL3= 120
##$ZL4= 120
##$ABSF1= 10
##$ABSF2= 0
##$ABSG= 5
##$ABSL= 3
##$ALPHA= 0
##$AQORDER= 0
##$ASSFAC= 0
##$ASSFACI= 0
##$ASSFACX= 0
##$ASSWID= 0
##$AUNMP= <proc_1d>
##$AZFE= 0.1
##$AZFW= 0.1
##$BCFW= 1
##$BC_mod= 2
##$BYTORDP= 1
##$COROFFS= 0
##$CY= 11.3945322036743
##$DATMOD= 1
##$DC= 2
##$DFILT= <>
##$DTYPP= 0
##$F1P= 2.36226072786647
##$F2P= -0.459571619588291
##$FCOR= 0.5
##$FTSIZE= 0
##$FT_mod= 4
##$GAMMA= 1
##$GB= 0.15
##$INTBC= 1
##$INTSCL= 1
##$ISEN= 128
##$LB= 0.24
##$LEV0= 0
##$LPBIN= 0
##$MAXI= 10000
##$MC2= 0
##$MEAN= 0
##$ME_mod= 0
##$MI= 1.114404
##$NCOEF= 0
##$NC_proc= 0
##$NLEV= 6
##$NOISF1= 3.799351
##$NOISF2= 2.8
##$NSP= 1
##$NTH_PI= 0
##$NZP= 0
##$OFFSET= 15.70392
##$PC= 1
##$PHC0= -18047.02
##$PHC1= 27.20074
##$PH_mod= 1
##$PKNL= yes
##$PPARMOD= 0
##$PSCAL= 0
##$PSIGN= 0
##$REVERSE= no
##$SF= 200.130013532006
##$SI= 16384
##$SIGF1= 3
##$SIGF2= 2
##$SINO= 400
##$SIOLD= 16384
##$SREGLST= <1H.CDCl3>
##$SSB= 0
##$STSI= 0
##$STSR= 0
##$SW_p= 3612.71676300578
##$SYMM= 0
##$S_DEV= 0
##$TDeff= 0
##$TDoff= 0
##$TI= <>
##$TILT= no
##$TM1= 0
##$TM2= 0
##$TOPLEV= 0
##$USERP1= <user>
##$USERP2= <user>
##$USERP3= <user>
##$USERP4= <user>
##$USERP5= <user>
##$WDW= 1
##$XDIM= 8192
##$YMAX_p= 0
##$YMIN_p= 0
$$ End of Bruker specific parameters
$$ ---------------------------------
##NTUPLES= NMR FID
##VAR_NAME=  TIME,          FID/REAL,        FID/IMAG
##SYMBOL=    X,             R,               I
##VAR_TYPE=  INDEPENDENT,   DEPENDENT,       DEPENDENT
##VAR_FORM=  AFFN,          ASDF,            ASDF
##VAR_DIM=   8192,          8192,            8192
##UNITS=     SECONDS,       ARBITRARY UNITS, ARBITRARY UNITS
##FACTOR=    0.0002768,     1,               1
##FIRST=     0,             0,               0
##LAST=      2.2672688,     0,               0
##MIN=       0,             -88817,          0
##MAX=       2.2672688,     64397,           0
$$ Real data points
##PAGE= N=1
##DATA TABLE= (X++(R..R)), XYDATA
0@%%%%%%%%%%%%%%qJ6j6J6j6K4l2L3m1M9n7P2q2R1j06J22j43J66j87K12k42K74
36A45l06L40l81M27m77N32n88O52p24Q00q82R72j074J184j305J436j582J748j927
55a010K128k359K621k925L279l698M206m831N630o692Q178j0425J4263k2647P8679
70F4397m1603m9437P8788l3249p492k4459J7043o183m4082M6323K5885n7595L1600
83f4L640j4826J0091k1581K4093O882m4303M3083O113k6341K2201n866J2870j109
97A4883m1171L8137J218k9537L0454j3421n608J9867j9718J7876r570k0786L7012
110A9636k2377j7226K5635j4952J8344j987k9204L2177j1146j4232K8141j9991
122g182J483L797j4419L3804j2382j6174K7997k5704N874K2560k6232J0977m920
$$ y = [0, 0, 0, 0, 0, 0, 0, 0, 0, 0, 0, 0, 0, 0, 0, -8, 8, -8, 8, -8, 16, -16, 17, -24, 25, -32, 40, -42, 49, -57, 65, -78, 88, -99, 113, -129, 145, -161, 179, -202, 225, -252, 280, -308, 344, -380, 420, -462, 510, -564, 620, -685, 751, -831, 917, -1010, 1118, -1241, 1380, -1545, 1734, -1964, 2242, -2589, 3041, -3651, 4527, -5898, 8365, -14282, 64397, 22794, -26643, 52145, 18896, 11404, -13055, 3988, -2195, -46277, 46, 25931, -31664, -64, 3576, -11250, -1159, -22740, 1353, 8235, -36068, 7015, 13128, -13213, 8988, 3122, 15992, 14883, -26288, 11849, 13067, -16470, 13984, 563, -5045, 14822, -4896, 12980, 3410, -17376, 19636, -2741, -19967, 5668, -9284, 9060, 7073, -22131, 10046, -1100, -15332, 12809, -7182, -5699, -1902, -16321, 17483, 5101, -11073, 16924, -8780, -2906, 19654, -6578, 4399, -521]
135e21q343K6566k4453N51K0552k5195J3994l53j6595K5404j6353k093K0967k4953
149a0825J3258Q154j9914J7921j2218m211J7956k5987J3445J1715k4748J9810
161D356k244q057J8457k1117Q270J3493k2210J6183m020r982K3279j9054P81J4326
175A2461k2736J6375M00j7986J8582j3773j098J4859k0241J4342K703j8381K2734
188H241q967o406J7058j9442R883O923j8092J9032p011q198J9727j7347O341R118
202A0860j8638J7670n436j3131K0301j3824n8R487j8116J4793k970j3266J8776
215F448j3373j867J4662j7414J2525K813j4594J8326q451k233J4222j8297R249
228B016N647j5491J6636p896n790J6616j6004N981P589j7243J4150m360q969J5143
$$ y = [-521, -8864, 17702, -6751, -6200, 14352, -10843, 3151, 2798, -13797, 11607, -4746, -6839, 14128, -10825, 2433, 10587, -9327, 8594, -3624, -7835, 10121, -15866, -2421, 9294, -15454, 4356, 2112, -5945, 12512, -8605, -335, 13158, -9052, 7131, 3111, -6871, 16408, -2646, -1865, 12461, -10275, 6100, 6500, -11486, 7096, -6677, -7775, 7084, -13157, 1185, 3888, -14493, 8241, -726, -7132, 9926, -9516, 367, 7290, -10802, 8230, 1219, -6979, 12748, -4599, 1742, 10860, -7778, 9892, 4456, -8675, 11626, -2198, -2256, 7231, -10885, 3908, 938, -12328, 6448, -6925, -8792, 5870, -11544, 981, 3794, -10800, 7526, -925, -3158, 11064, -7233, 2016, 7663, -7828, 8808, 912, -4878, 11738, -4266, 1715, 9304, -7939, 6211, 1851, -7118, 8025]
242H025j4911L447J0100j7505J3585j308j1244J6146j1851R09J1754j6945J1795
255A997J942j2337J6213r656j725J3987j6610Q257M469j3119J5351q044n414J4703
269A0014j4456N523N750j5006J3472n163p709J5040j3338K584Q067j4104J2673
282C347l013q952J5321j1316J225J0294j4736J0649P25j0600J4864r201j157J1432
296H882j3750Q866J891j2522J4362p223n011J2370j3673O381M328j3412J3276
309D765n462o202J3034j2813M715O418j3992J2474j793q056J3417j0394K433Q713
323G257j3765J0407k46r627J3893r374j27J0226j3828Q684J859j1288J2213p661
337a377k813J0592j3109O434L823j1654J2003n186n153J2408j1959L991N746j1112
$$ y = [8025, -6886, -3439, 6661, -10844, 2741, 1433, -9811, 6335, -5516, -4607, 7147, -9798, 1997, 3939, -8398, 7815, -1841, -3566, 10421, -6189, 2068, 6537, -6582, 8769, 725, -4689, 10014, -4442, 1081, 6831, -8175, 5297, 134, -7575, 7465, -5873, -3289, 4778, -9326, 3347, 334, -8618, 6703, -4613, -3388, 6906, -7830, 2819, 3544, -7056, 7808, -1393, -2550, 8882, -4868, 3998, 5889, -6633, 7729, 506, -4505, 7865, -5808, 573, 4901, -8511, 4765, -697, -6899, 6135, -6678, -1963, 4455, -9537, 2937, 1144, -6912, 6505, -3889, -1456, 7257, -6508, 3899, 3653, -5974, 7919, -1455, -1582, 8644, -5184, 3500, 5359, -5929, 6284, -1377, -4190, 6402, -6707, -273, 3550, -8104, 3899, -1287, -6440, 5968, -5991, -2000, 3746, -7366]
351g366J1158l407n755J3023j0436J931P993j2211R402j300q040J2710q923k90
365a511Q632j2038Q133L85r461J1438p795k511R809j1986N980L260j0136J1361
379C560n456l253J0668j0627M467M937j0955J1012l043n876J1208q954K159N998
393E845j0788R302j602p034J0973q500N42P347j1398P323R36q840J0023o253j285
408c409Q049j0971O175K375r689J0548m662l240R776r788M725M519r508R476l110
423A266m047R832r437L130N296j0684Q673j782o286R834q213Q20O334j0151P070
438A655p58o800J0615p663p52Q217j0463N734K036p360R183n088j839Q569q557
453c271M830K713q744R780m158m084R376q488K139M572q701P689k599m942Q546
$$ y = [-7366, 3792, 385, -5370, 7653, -2783, -852, 7141, -5070, 4332, 3032, -5008, 7702, -1221, -1511, 7121, -4917, 3216, 3601, -5860, 5578, -2217, -4728, 5081, -6905, -925, 2335, -7801, 3560, -1896, -5149, 5519, -5108, -641, 4296, -6659, 4353, 1310, -4566, 6642, -2312, -153, 5845, -4943, 4359, 2757, -4277, 6696, -1804, -1262, 6085, -5313, 2010, 2946, -5894, 4129, -2124, -3409, 4640, -6331, -156, 2219, -7470, 3078, -1584, -4824, 4952, -4836, -111, 4408, -5100, 4376, 1266, -2781, 7051, -2386, 744, 6040, -4644, 4029, 2247, -4039, 5795, -2418, -1598, 4736, -5415, 1655, 897, -5903, 4712, -2951, -3703, 4514, -5949, -215, 1821, -5539, 3644, -1444, -3283, 5286, -3271, 1559, 4272, -4472, 5308, 1150, -2934, 6442, -2046, 93, 4665, -4036, 3653, 1054, -3888, 4658]
468D658p873J646M964r551P073m73o967R958n776p84O687q128N996P48o760R282
484D700m995j304P822q834M821K444q615Q083l345l878P211p726L558L403q675
499e330Q435k618m835R198p743J352N361r047O309m94n349P510o096P09O144q275
515d769O637M02o464Q985m240j686O576p713L888J807o451P361n022k419Q005
530D897q572L080L520p699O649j999l691P435o484J283M176o915O179k281m251
545d673Q491o653O46O221p558N226Q91n237P312n209j98N349p407N147Q83p154
561c923P899l687k639O488o919K203K038o060O753l135l200O995o625L113L523
576B824p672O789j582m238P445m993R24L926o139O028m93m986P122n791m47N763
$$ y = [4658, -3215, -1569, 3395, -6156, 917, 444, -6523, 3435, -2341, -3125, 3562, -4566, 1430, 2178, -4582, 4700, -295, -1599, 6223, -2611, 2210, 4654, -3961, 4122, 777, -3101, 4110, -3616, -58, 3345, -5330, 3105, 487, -4348, 4850, -2893, -1541, 3820, -5227, 1082, 588, -4761, 2749, -3347, -2638, 3506, -4769, 1868, 2270, -4194, 4791, 551, -1135, 5441, -2272, 1616, 3423, -3028, 4333, -689, -3108, 4897, -3675, -595, 2925, -4774, 1875, -124, -3815, 3620, -2864, -1581, 2595, -4320, 1859, -422, -4673, 3818, -2835, -2189, 4032, -3526, 1700, 2591, -2646, 4666, -543, -741, 4608, -2799, 2348, 3231, -3923, 3976, 289, -2350, 4138, -2781, -578, 1460, -4600, 2153, -982, -4182, 2813, -3812, -699, 2824, -4848, 1941, 359, -3879, 3566, -1427, -503, 3423, -2716, 3312, 2819, -2167, 4955, -836, -1283, 4480]
592D480p426L790Q63n585O676l071j857N241o736L786J569o093O755l994k159
607c761P548o073J595L498o370N521j410k376O123o428K227M036o671N733r17
622B275n081O729m898j79M679p038L756L59m115O454m571r24N446o901M299J386
638A676n928O429k709k062N988n209K324J349m977O502k492l260O453n576J438
653e4L799o058M613r94l665N934m597J41L336o802N034k14m046N952m177r36N201
670B467n572L547Q92n142N884k789o95N207n910L248J751n471N684k173k799N472
686C601n136J754L020n922M829j495l227N794n323N58L792n935M126j38l862N585
702B021l757K0M410n635L722M46m383N942l313p47M865n594K643J896m499M920
$$ y = [4480, -2946, 844, 1707, -3878, 2798, -273, -2130, 3111, -3625, 161, 1730, -4363, 2392, -1602, -3761, 3787, -2286, -691, 2807, -3563, 1958, 548, -1828, 4295, -2133, 94, 4130, -2541, 3192, 2275, -2806, 3923, -975, -1154, 3525, -3513, 243, 602, -3513, 2941, -1630, -2554, 2892, -4009, 290, 1676, -4252, 2177, -532, -2594, 3394, -1815, 509, 1858, -3119, 3383, 891, -2369, 4084, -1492, -54, 3745, -2313, 2300, 1306, -2359, 3575, -1022, -881, 2455, -4347, 687, 473, -3573, 2379, -1798, -2734, 2467, -3105, 442, 1334, -3808, 2076, -713, -1408, 3799, -2111, 1137, 2888, -2583, 3101, 928, -1871, 3601, -1535, 219, 3239, -2683, 2146, 651, -2576, 3218, -2105, -1547, 2245, -3690, 436, 298, -3564, 2021, -1736, -1716, 2694, -2941, 781, 1227, -3156, 2786, -527, -1274, 3591, -2003, 640, 2536, -1963, 2957]
718B957k515j959M926n093J992J927n265M716j575k851N432m735O18L241n292
733c476M555j014l143N516m144J48M135n245L665M23m002N426k812j150M372n185
749a931L092J303m793N067k836j436M795n485K485J671n142M859j885k392M746
764B118m433J324K516m602M093o09l026M826l768M80L686m947L421M78l663N064
780B958l298q8L540n281L202Q15m259M619k438j366M394n017J875J729m377M215
796A223j960j555M489m411J662K558m557M198j298k393M827m035Q29L133m903
811b193L610k42k573M658l582l20L497m760K791K70l785M512k964q23M169m572
827b307K400Q14l931M393k181j567M365m155J599K479m652M738j441j879M037
$$ y = [2957, 442, -1517, 3409, -1684, 308, 2235, -3030, 1686, 111, -2740, 2692, -2043, -1425, 1816, -3476, 1079, 65, -3078, 2438, -1706, -1558, 2577, -2668, 997, 1420, -2582, 2844, 32, -1118, 3254, -1931, 1161, 2464, -2329, 2738, -98, -1534, 3261, -2224, 261, 1932, -3210, 1649, -236, -2628, 2118, -2315, -991, 1525, -3077, 1016, 407, -2619, 2207, -1561, -1081, 2605, -2342, 1079, 1557, -2106, 2958, -340, -428, 3112, -2169, 1033, 1848, -2411, 2208, -230, -1596, 2798, -2219, -344, 1385, -2992, 1223, -737, -2292, 2197, -2214, -552, 2006, -2551, 1647, 349, -2044, 2783, -1252, -423, 2710, -2193, 1417, 1175, -1398, 3260, -322, -642, 2855, -1905, 886, 1156, -2629, 1883, -1081, -1904, 2265, -2307, 93, 907, -3024, 1369, -812, -2379, 1986, -2169, -570, 1909, -2743, 1995, 554, -1325, 2712]
842B712l766J247K179m420L793m60k793M258l494L46K723m673L114j97l360M377
858A586k774l95L594m471K530Q84l915M582k206j320L819m057K189J744l920M040
874A910j362j857L962l716J051K087m118L486p88k223M107l587N46K513m235K468
890B44J77k846L723k513l29L255l745K403N64l398L992k042q98L640l815K014
906D26J669l808L554j518j377L754l516R48J800l780L219j112k158M223l300J79
922g97K315l756K561k61k658L845k579k89L226l477K423M53k896L884k428l65
938g99K908l445K201O69k967L217j561j241L395l839J553J505l619L196q99j878
954a604L571l343O25K053l531L057r34j954L443k484K37K476l685K753N36k568
$$ y = [2712, -1054, 193, 2372, -2048, 1745, 1285, -1508, 2750, -744, -398, 2325, -2348, 766, 569, -2791, 1586, -1188, -1583, 2011, -2460, 70, 954, -2961, 1621, -585, -1905, 1914, -2143, 46, 1790, -2130, 1910, 548, -1309, 2653, -1063, -12, 2075, -2043, 1443, 655, -1568, 2539, -1048, -502, 2011, -2224, 244, 421, -2425, 1298, -1215, -1544, 1711, -2034, 369, 933, -2465, 1527, -515, -1413, 2227, -1588, 426, 2095, -1713, 1841, 323, -1054, 2700, -816, 132, 1932, -1848, 1371, 259, -1899, 2324, -976, -797, 1518, -2238, 323, 62, -2596, 1249, -1330, -1619, 1607, -1870, 553, 1006, -1890, 1994, -434, -799, 2109, -1336, 865, 1534, -1433, 1784, 223, -1018, 2377, -1462, 91, 1596, -2023, 1173, 274, -1604, 1967, -1376, -751, 1302, -2229, 828, -106, -2060, 1383, -1101, -864, 1612, -2073, 680, 1216, -1352]
970a352L277j972l41K447l355K339K75l055L753j971j147L310l617J505Q08l055
986b151L101j461j144L137l301J601J697l811L120q39j795L537k566K72K248l052
1002a407K654j76k169L374k846J35K720l660K036M09k675L308j993o51K642l321
1018a620J528P78k739L135j433j344L305l167J076J524k960K873q65j272K632
1033A451k222P41J562l121L169l35k617L247k168m3K041l140K042J14k322L151
1049A550k175k44K464l404J711J025k739K689j401p68K429k571J581P46k551L040
1065A382j186j039K875k837R41J782l034K008j57j539K513k254J71J640k871K143
1081E38j69k020K879k105l31K456k617J180Q09k615L131j511m75K532k949J629
$$ y = [-1352, 1925, -47, -388, 2059, -1296, 1043, 1318, -1737, 2016, 45, -1102, 2208, -1409, 96, 904, -2151, 950, -511, -1655, 1482, -1819, -218, 1479, -2332, 788, -51, -1846, 1691, -875, -603, 1645, -1407, 1247, 1071, -1098, 2276, -570, -435, 2285, -1375, 661, 1070, -1605, 1703, -290, -941, 1701, -1620, -92, 686, -2053, 1082, -351, -1695, 1610, -1557, -481, 1043, -1917, 956, 91, -1181, 1451, -771, -30, 1532, -1589, 1580, 1245, -1372, 1875, -293, -336, 1705, -1435, 607, 721, -1601, 1550, -625, -869, 1595, -1809, -98, 927, -1812, 877, -524, -1292, 1137, -1434, 147, 893, -1658, 1382, 196, -843, 2032, -805, 136, 1918, -1116, 892, 735, -804, 1709, -545, -374, 1266, -1605, 538, 369, -1651, 1228, -877, -1208, 1248, -1369, -189, 620, -1995, 1136, -375, -850, 1682, -1267, 362]
1097C62Q85k581K552q97j363K714k384J095J059k850K737r80j369K949k852L50
1113e73J691k789K209l48j979K742j962J53J801k746K484k25j918K730j758n01
1129i89K490k872J949N34k246K376j172o30K427k806J152P78k278K473q23j614
1145a251K489k050N41J303k442J586k01j432K553k168K06J790k906K417J37j792
1161a220K549j654k42K092k359J552L25j986K519j497p61K340k592J328M46k207
1177a367K348j201r21K000j775P35J030k439K075l84j530K490j847J52J666k329
1193a297J805J48j716K661j791R9J759k600J469K75j918K214j337k08J928k304
1209h13Q91M87k010K216j459m48K281k138O48P19j910K005l85j227K249k075R29
$$ y = [362, 1247, -1334, 1218, 321, -1042, 1672, -712, 383, 1442, -1408, 1329, 349, -1020, 1929, -923, -573, 1118, -1671, 538, 190, -1789, 953, -1009, -856, 945, -1801, 683, 458, -1460, 1270, -488, -989, 1501, -1371, 578, 1112, -1134, 1242, 70, -560, 1867, -939, 213, 991, -1287, 1186, 363, -1251, 1238, -812, -271, 1032, -1410, 176, -25, -1457, 1096, -1072, -866, 924, -1982, 435, 572, -1220, 1329, -325, -567, 1525, -834, 718, 1043, -943, 1576, 79, -682, 1658, -934, 394, 840, -1367, 981, -220, -1141, 859, -916, -181, 849, -1590, 485, 101, -1429, 1061, -786, -634, 1032, -1297, 508, 656, -1060, 1601, -190, -91, 1668, -932, 537, 812, -1106, 1108, -229, -437, 1491, -813, 78, 565, -1445, 771, -688, -1136, 1145, -993, -345, 374, -1536, 469, 84, -1143, 1106, -969, -40]
1226d0R91k190K035j63j500K311j740K46J328k264J580j55j259J935j547k18J788
1243A138k238J240N99k222K085p88q49K036k269J181P62j751J762o67q17J885
1259A087k062P99J328k127J731l08r90J723j537K84J230k057J581j08j577K250
1275A247j766l4J457k055J303M53j915K203j152n12J518j893J210M60j743J899
1291F80p60m76K020j833N08R31j743J790p78q35J779j873L32J162j953J441n07
1308a15p02J749j312LJ237j983J088J01j297K132j498J66J527k030J209M92j711
1325i44J933j108j76J418j740P82Q48j977J876n96q49J650j718N61Q17j768J504
1342E13m32r05J647j480j04J651k112J730j28j535K125j487J57J384j853J168
$$ y = [-40, 951, -1239, 796, 633, -867, 1444, -296, -50, 1278, -986, 594, 439, -820, 1115, -432, -650, 1138, -1100, 140, 739, -1483, 602, -186, -1035, 1001, -1268, -87, 675, -1076, 686, 19, -798, 1087, -975, -176, 1152, -975, 756, 448, -542, 1181, -356, -72, 1158, -899, 682, 574, -1003, 1247, -519, -553, 904, -1151, 152, 605, -1310, 893, -259, -771, 747, -1146, 64, 524, -1219, 680, -80, -556, 1464, -369, 139, 1070, -673, 1117, 339, -496, 1283, -590, -258, 904, -1049, 392, -115, -817, 932, -380, -377, 860, -1123, -35, 66, -1231, 901, -597, -431, 1096, -934, 275, 767, -944, 989, -119, -295, 1123, -617, 165, 1013, -964, 912, 316, -533, 1117, -601, -40, 777, -991, 513, 81, -824, 823, -657, -761, 890, -1222, 508, 380, -1155, 970, -517, -360, 1024, -829, 339]
1358C39J36j238J680r34j84J305j778R35L07j462J763n64r95J611j503L32O97
1375D47j681J903p82q13J695j669M69R82j537J327kj269J805j428L25J046j490
1392f72J429l25j238J746q49l40J143j511J123j23j011J307q29k93J255j457N38
1409a07N33j649J933o43r80J572j564O93Q87j910J630O7j336J849j363L2J305
1426I49j183R87m67r71J301p61J6R43j578Q90K13r75J278p89m93J473j459L29
1444b97O61j513J796r87k36J386j498Q32O73j567J519n52o90J453j299L95Q06
1461H82j391R66k18q66J492j438L70Q30j067P39q8r27J333j095L6R92j206M02
1479b54K89p98J070l43n31J477j676P88O68j332J150l39o71J204q97J70O64j209
$$ y = [339, 475, -763, 917, -17, -201, 1104, -674, 261, 568, -894, 869, 305, -690, 921, -582, -250, 447, -1234, 669, -113, -926, 769, -900, -431, 551, -986, 341, 339, -930, 875, -553, -228, 818, -672, 757, 432, -806, 940, 91, -249, 894, -617, 506, 383, -628, 679, -150, -443, 812, -645, -107, 426, -1223, 710, 67, -913, 659, -905, -212, 675, -1235, 395, 462, -874, 975, -388, -356, 949, -234, 753, 286, -685, 616, -145, -129, 814, -764, 126, 339, -636, 642, -147, -640, 833, -626, -297, 364, -1149, 647, -340, -576, 810, -688, 144, 817, -750, 769, 217, -473, 980, -319, 76, 882, -509, 457, 239, -627, 865, -573, -203, 627, -440, 299, 211, -716, 617, -478, -442, 550, -656, -254, 35, -763, 307, -36, -567, 910, -766, 22, 690, -642, 508, 169, -502, 702, -195, -25, 639, -570]
1497e70J116j45j093J414j164J35P56j359R71qq44J328q63j75J094j175P63L33
1515E14j285J273n65k44J252j353N93K53j119J253o12k81J194j231M99O32j486
1532g13Q89j11n08J201j385M52N65j106P93j31n68J385r77j46J033j489J045K25
1550D54j086J250p17l69J186j020N93K37j075J216o13n61J194j292N26O85j262
1567f54J031l23q64J322r80Q2Q72j368J087l8r40J177o86K8P55r22R72l15p12
1586d76J162o92l2Q33r64M20L30j143J107n91l13J038j092M84J32j068J352n15
1604b8m36J238j288M74M85j038Q18j87n01J138j035L69N27j132P44J52o80J288
1622I08r03j78P73q65O32n7n80O39n68L1R39j353O28J00r68J203l56n83P39q63
$$ y = [-570, 546, 401, -692, 722, -442, -307, 449, -910, 61, 53, -791, 537, -326, -501, 593, -582, 181, 514, -771, 502, -63, -307, 945, -408, 185, 438, -681, 572, -40, -321, 873, -358, 141, 773, -713, 176, 65, -443, 758, -627, -175, 390, -716, 77, -54, -622, 763, -214, -360, 673, -816, 229, 454, -632, 618, -99, -468, 718, -302, 291, 528, -547, 669, 56, -505, 689, -603, -77, 608, -654, 377, 54, -810, 512, -468, -386, 486, -882, 205, 167, -773, 404, -282, -254, 501, -421, 551, 236, -476, 686, -6, -38, 795, -169, 251, 581, -562, 545, -46, -359, 679, -413, 71, 203, -865, 487, -28, -464, 774, -514, -40, 445, -593, 225, 38, -463, 675, -360, 9, 536, -596, 148, 300, -380, 908, 5, -173, 600, -265, 367, 310, -270, 369, -199, -168, 771, -582, 46, 146, -822, 381, 25, -558, 181, -682]
1642f82M77M72p96Q10j81n33J041q84M73L04j160J016R5r91J176q20J56O07j033
1661d53J000j92j186J495r20oQ19j120M11J08p18J102n56k42Q49j029N39O35j145
1680f09R08l12l37Q91p75J01P34p18L78j55n09R16n09j02P81j130P25k80p08J201
1700D91m70k44O56j183O32M16o44P53o67J7J025j020L07L64q05Q41m69j99O73
1719D74q74M91M64j073Q85j72l38O65p10R0L27q00Q02j42o92R12q44K04P94j131
1739f68J013m9q18Q58l56MN29q98M67K44p82J118o84l38J127r57K38L44q65J170
1759F97n33p35J174j143L48M33q01Q39k84o27J036q90L87O54j003O85l3q12J035
1778D27m33q9P57j054O03O3o39O68l37k61J046q69L46L3n98M33l20k37J018r80
$$ y = [-682, -205, 267, -529, 281, 100, -433, 608, -276, 197, 501, -659, 357, 452, -539, 637, -183, -27, 580, -453, 547, 355, -831, 664, -256, -262, 557, -563, -152, -44, -762, 340, -216, -458, 391, -638, -99, 536, -609, 299, -13, -350, 541, -234, -133, 601, -117, 261, 106, -403, 513, 4, -98, 683, -447, 278, -2, -710, 491, 21, -223, 433, -750, -118, 298, -346, 407, -260, -243, 782, -238, 69, 433, -372, 469, 0, -199, 474, -400, 91, 555, -518, 367, 195, -143, 522, -188, -98, 229, -571, 231, 89, -603, 309, -535, -331, 463, -668, 345, 296, -522, 336, -20, -16, 513, -385, 82, 326, -456, 662, -22, -360, 767, -190, 48, 392, -473, 697, 164, -571, 603, -540, -192, 241, -560, 279, -5, -632, 404, -486, -99, 555, -448, 237, 204, -608, 427, -6, -95, 662, -392, 211, 274, -365, 303, -34, -295, 751, -118, 228, 261, -337, 96, -224, -461, 557, -423]
1798d23%L10l28P69k71m08Q75r41M10M92j033R74j75l9K09n80n1P52p72L90J1
1819A71o94Q62o09J7P37r30L80L34n92O27n58j42P59j031O01O5o88J014k28m97
1839d02J004p69j7N10q04Q10k49l87P57m97n7O25q62M99p2n01P70m68k32P73p82
1860c51K63J77o43P81n54O9P40j114M97M35r35P27j83k64R03r57M54J20n04Q00
1880D61m36j11N24o32J08N18r12R02j13n85M11r7q9M38r52N50j59k55P77l17k76
1901b45N77o99J89K93n52P24k29l01P74p88L15K69o56P38m59k90P17o19P6O25
1921D59q36N23l1m42P87o39j11O20r03O63N2p56Q70o15r6R50r66L86M37p90R55
1942E17o72m1N60m38J17K72p12O49j72m82O41n27K18K51m55N31j88n44Q75q20
$$ y = [-423, -423, -113, -441, 328, 57, -351, 524, -417, -7, 485, -548, 426, 251, 212, 421, -159, -210, 542, -230, 160, 171, -523, 339, -270, -253, 484, -446, -66, 268, -324, 303, -255, -397, 362, -669, -68, -3, -691, 323, 95, -402, 602, -167, -184, 326, -478, 332, 83, -304, 453, -44, -101, 524, -338, 161, 89, -412, 358, -110, -342, 431, -351, -88, 89, -554, 227, -327, -258, 482, -632, -135, 300, -635, 92, -91, -355, 548, -409, 45, 165, -339, 461, 25, -86, 438, -194, -86, 432, -480, 422, 309, -276, 135, 38, -51, 387, -565, -15, -174, -429, 348, 31, -245, 332, -367, -178, 115, -437, 287, 58, -243, 531, -257, 58, 327, -329, 409, -50, -340, 377, -242, -166, 459, -377, 146, 115, -327, 460, -179, -290, 330, -573, 90, 142, -614, 256, -359, -455, 495, -471, -85, 352, -438, 517, -155, -196, 364, -74, 43, 315, -397, 252, 80, -402, 239, -288, -70, 181, -274, 257, 69, -475, 400, -420]
1962d20J15M93n28M80k60k16O67k59j99P53j046M98P0m70O69m21L0M92o28L06
1982A26P4m27M86l22k98R13r51L60K37n94M31j2l87O84n58J70O51q92K31R4l95
2003c79Q28l66k71P22n90K20J51l89L79k89k43M74m40M08O9o66O25o95J23Q22
2023D93q28M11L45r30N30l34j18Q27p11K20K67n50O51k48k96Q16n93k8N11r88
2043e53O05K11l69L75m41JN84q10N54J03n25K74j71j96O76n83J96L23q82J069
2063D41l63l01O95q43K74M87p23N17k4m59R76p77J61J78m55M63j5n33Q48p05K24
2084F6O99j002M38lp02P18m77m9N90o25L78J99o04N18k3j50L41p76N15L40q37
2105d46R77l56l02M93o11K72K53m24N03l19k96K61l12M2M49n48M90p5m46O28n01
$$ y = [-420, -305, 188, -340, 140, -120, -336, 331, 72, -127, 626, -420, 78, 148, -322, 347, -74, -44, 448, -180, 126, 200, -227, 259, -63, -361, 552, -399, -39, 198, -396, 35, 23, -364, 320, -238, -68, 583, -309, -78, 16, -379, 449, 83, -188, 534, -56, 164, 315, -74, 305, 16, -227, 247, -193, 215, 284, -382, 243, -452, -329, 493, -335, 76, 421, -509, 21, -313, -431, 396, -315, -95, 172, -378, 273, 25, -271, 545, -48, -76, 435, -553, 52, 263, -106, 269, -172, -171, 413, -397, 157, 260, -265, 9, -162, -358, 318, -265, -69, 254, -628, 441, 78, -223, 472, -371, -97, 390, -333, 184, 160, -299, 677, -100, 61, 239, -216, 247, 232, -301, 547, -158, 66, 765, -237, 201, 198, -504, 214, -263, -312, 278, -347, 31, 230, -374, 144, 121, -29, 312, -464, 51, 391, -446, 531, 175, -127, 366, -245, 27, 280, -144, 359, 40, -256, 5, -307, -265, 184, -364, 126, 51, -395, 233, -268]
2126b68l20R60n38P8K63m25P51m75q8M50p58M96K04n24N94k96l88O80p18M10M8
2147A36n63O54l68k97Q96m67R0K18n05K17j64k11O94m79J7L47l40J32J77m33O70
2168D21n15LM84q48N43J92n85N94k13j77N07n65J19K87o35O31k08m51L75k48K12
2189g7K85m74L23K22n02O81o06N8L70o10O22j13l91M75k50j82N06m24L93K8o14
2210b80N34n75J18O05o31J35L52o02N32j55m22M71m28M09L47o47O00l5m60L33
2230B01m33j08N86n77N79j27m07L83j51k22N28n83M81j61l20M28Q6m31L06j63
2250a05kK45o01O44pk31K39n28J92M51l59K48k85J18J35k54RM68m93K54Q5n83
2272c60P84l52l48O75n69K85K49n01L71j01l75O45q43O49n3m62N63k78j29N51
$$ y = [-268, -588, 372, -166, -88, 175, -250, 501, 26, -62, 388, -370, 126, 330, -194, 400, 104, -284, 396, -322, 88, 136, -427, 227, -141, -438, 458, -9, 81, 299, -206, 11, -153, -364, 330, -149, -132, 215, -125, 7, 184, -249, 421, -94, -91, 393, -455, 88, 280, -305, 289, 76, -101, 406, -159, -40, 247, -388, 243, 35, -416, -41, -289, -77, 208, -266, 57, 279, -223, 458, -148, -90, 280, -330, 292, 179, -212, 263, 13, -169, 337, -87, 306, 334, -280, 254, -321, -203, 402, -229, -94, 258, -344, 188, 33, -389, 82, -346, 63, 410, -237, 363, 328, -132, 201, -232, -340, 246, -331, 248, 121, -286, 97, -54, -276, 252, -331, 150, -11, -331, 97, 183, -248, 58, -105, -107, 138, -463, 181, 174, -57, 182, -346, -154, 297, -62, 186, -99, 19, 154, -100, -91, 377, -116, 138, 223, -360, 424, 72, -276, 399, -170, 115, 364, -137, 234, 133, -242, 403, -440, 209, 156, -306, 257, -21, -150, 401]
2292D01n58L92l6p03P19k73J13K69l43J51J35m04J00J45l11L98j22l8J77m50J83
2313e5N2m81N89l64o4O17l72j57O15q27P81l87k87M73j63M5L0o8K62n8k86M81
2335C76m88j9L75m86K05J53l92O00m70J13K17n89L99J6j03L40n9l85J27j08K94
2356A16k3k53L14n3k10K72k51M87o2m29M07J3o17P17m67j47L77p49O58j59qJ33
2378F6k60K17J5m92N96O0m60N51n16R1K29l87K44J65l31K85K3j38K95n41N42j88
2400F6j86L98k46k99M96l79J9L41n24M58j43j76J82j36O0K38m39L37R0k40K98
2421B15k99k51O65m69K96P2j93M1l5J38m4j75Q4J80n99M67j40q8N11p11K26L11
2443B02m07P0K24k13L48j43k69K85j55J52O4l46P58m90l13P63n41j8K2k09M07
$$ y = [401, -157, 235, 199, -504, 215, -58, 55, 324, -19, 132, 267, -137, -37, 108, -203, 195, 73, 35, 212, -238, -55, -3, -484, 105, -259, -323, 294, -78, -235, 380, -447, 334, -53, -340, 133, -30, 15, 45, -23, 239, 181, -105, 376, -112, -131, 244, -242, -37, 116, -276, 324, -146, -33, 184, -405, -6, 10, -93, 247, 188, -197, -70, -178, 116, 93, -160, 154, 101, -109, 163, -88, 399, 337, -92, 315, 328, -289, 428, -39, -186, 191, -558, 100, -59, -67, 66, -194, 23, 38, -454, 142, 202, -258, 293, -223, -132, 97, -290, -46, 119, -212, 73, 96, -42, 253, -288, 254, 66, -120, 278, 32, -267, 229, -150, -131, 210, -314, 144, 1, -175, 7, -129, -69, 169, -270, 67, 157, -83, 215, -84, -335, 330, -139, 157, 229, 36, 77, 42, 180, 136, -39, 45, 225, -374, 93, -47, -135, 376, -335, -109, 202, -205, -135, 89, -124, 224, 81, -188, 97, -58, 94, 158, -188, 570, 80, -233, 530, -11, -29, -7, -216, 191]
2464A91N0l50L36m07K65O5l80M67m48J44L9k5M28l31j23L71m21n8L55m20K49J2
2486Ij05P9N9j71J09J9LM3k01O0K19n65N71j79o4J82l11J99o1q4L08j03j68J52
2510@j78J69K42m07L60k63K2M13m89n3O5R4O7j21r0L56l99mM59l83J70J14q1M9
2534A12k42j41N51m62L86j35j3j59R0NR8k91K16J23k12K61p2p1kj08l19O37k46
2557Fk92L51l10L21k47K30J7n19Q90j27n55K71k28R9M03l99j1m7j2RK26j48J7
2580e5j03K24O8l61L06j81j29M52n2j18J65k71J09M7O1o1l06K92J37n24L22J83
2602B05m15M78n21K55K66m45L56l43J26K89l42J53r1j23K59j04l24M98k31j89
2622b43L27q9MJ61j61J72k47J12O7k70j6L76k27k1J05k63L30p0j67J05k31K46
$$ y = [191, 241, -109, 227, -180, 85, 150, -230, 237, -211, -67, -28, -53, 375, 44, -79, 292, -129, -187, 168, -252, -3, 9, -96, -17, 42, -129, -20, -1, 2, 45, -156, -96, 123, -442, 129, -50, -114, 68, -243, -44, -105, -189, 119, 16, -152, 0, -178, -9, 233, -174, 186, -77, -55, 358, -131, -184, -119, -25, 42, -79, -169, 187, -212, -216, 243, -140, 30, 144, 63, 112, -130, -271, 280, -182, 204, 69, 56, -103, -13, -8, 90, -201, 15, 138, -74, 187, 115, 44, 42, -66, -385, 252, 6, -286, 65, -245, 76, -171, 59, 76, -443, 447, 320, -235, 36, -192, -93, 310, -89, -100, -147, -159, -150, 76, -72, -55, -158, 66, 134, -227, 79, -102, -231, 221, 169, 51, 216, -55, 54, 101, 162, 101, -205, 87, 224, -300, 22, 205, -210, 268, -253, 2, 268, -177, 179, -164, -38, 251, -91, 62, -29, -152, 107, 3, -321, 177, -54, -243, 84, -5, -1, 160, -1, 171, -76, 36, 103, -167, -183, 193, -34, -55, 50, -213, 117, 47, -120, -15, -246, 0]
2644@o3kJ42j22Q6J18k47J91O5m39O25m33Q9J44j54k7M6o4K07k71J63l1p5n2L61
2669B57m08J05K76k05J87j63J4%j05J48k08q1K34k0J07j61j79J30K27m62M81k63
2691h9J77K64m07K11r5l19K62m7Q3q9k66M26l73J53K72l15K24L55n28j35L28j02
2713a0L9J12k31L81k13j12L88m19K75K37n84L55r2m4M2l36K66Q5l32K85j4l4K64
2736C08l81K09O8l80O15l24m56L04j73J32L22m41M46k30m87O26j89L6L48n70M8
2757a69K37j73K21m92M03n2m9K64m01K7L99l09J49N0l96K62J14l55M40j84J15
2778A01L2j79K30j3l88N37l22J97qj56m7J03j20K01r4J52k75J74J5j90M9J79j03
2801G5k55M07J52m40p1Q2J00l8l32L87j33J98p0j58l9J26j97K32k28J81K24j55
$$ y = [0, -63, -65, 77, -45, 41, 159, -88, 103, 168, -271, 354, -79, 10, 154, 0, -27, 19, -45, 162, -109, 54, 23, -52, -104, 257, -151, -46, 230, 25, 212, 49, 63, 63, -42, 106, -102, -183, 51, 31, 138, -23, -202, -72, 155, -307, 174, -89, 88, 352, -55, 156, 61, -258, 4, -43, 40, -49, -315, 111, -262, -109, 163, -152, 72, 427, -101, -236, 92, -10, 29, 141, -90, 291, 78, -34, 354, -65, 210, 447, -137, 218, 126, 82, 124, -212, 54, 139, -193, 92, 78, 44, 308, -73, 136, 204, -176, 439, 115, -341, -37, -210, -78, 244, -197, 249, 19, -468, 158, -31, 5, 353, -217, -169, 68, -105, 116, -376, 27, -25, -74, 190, -211, -184, 215, -94, 55, 105, -291, -29, 85, -270, 170, -14, 101, 133, -46, 184, 171, -217, 320, -2, 195, 187, 31, -16, 87, -33, 168, 74, 226, -49, 125, 140, -50, -1, 178, 75, -180, 227, 379, -61, -132, -50, 50, 12, -320, 67, -66, 132, 62, -96, -135, -9, -206, 26, -202, -21, 203, 48]
2823D8l29L09l00K14N5n3J77l5j62K0Q8O7J44l40L84k35m5J62j21k50J81k6J24
2846G7j37J65P9j18P1J7j97j44R2J90J54k33j08J02j13K62l3k20J42R7k26R0k57
2869b48J57L29l61J73J20l0K0m32L82j77P4J05j96l38N39l3j21J21l91N09l65
2890a63p1Q6K10K12m03n1K11Q4j59K16l56K37j22p6J83n7Mn3q9J89J31l37J26
2913d8j39j41M87q7r9K10j70L7j4k77L25K8k21R3r9j9P3q9M03m06J3L31k78J10
2937B3K26l09J75M6m00L21k11M2M9n4K96j68j31L01o6KJ59j28k80J05j57J44J95
2960A80k36Q7j77J70K68l22K50o02K75K75k16m9Q6m3K74j02l34K42j30k6O3J8
2982d9Q7l4P0j54R9P6J50k91j38K47j77K00m2N2L7J14k6K4n30K77R6k3m4P2k06
$$ y = [48, -281, 28, -272, -58, -3, -56, 121, 86, -76, -56, 32, 99, 243, -97, 287, 52, 7, 169, 48, -202, -21, -47, 77, -60, 105, 184, 66, 137, 154, -43, -187, -95, 95, 249, 16, -92, 10, -103, 159, 126, -94, 48, 145, -81, 9, -248, -91, 238, -123, 50, 170, 140, 160, -272, 110, -67, 7, 112, -84, -422, 117, 84, -37, 84, -307, 202, -163, -234, -148, 62, 274, -129, -180, 31, 115, -44, 172, -184, 53, -69, -145, 38, -19, -15, -68, -157, 32, 163, -174, -48, -187, -328, 159, 72, -27, 183, 13, 50, 36, -241, 84, 112, -109, -16, -115, -134, -61, -150, 253, -153, -140, 191, -87, 23, 249, -60, 115, 161, -239, 82, -129, -87, -38, -92, 204, 36, -95, 206, 140, 142, 301, 173, -107, -2, -159, -15, 180, -56, 31, -146, 24, 292, -30, 220, -382, -107, 168, -48, -97, -11, -54, 220, 118, -216, 26, -104, -130, -67, -49, 38, 4, 74, -80, 19, 95, 245, -46, -184, 63, -114, 86, 44, 96, 133, 247, 221, 245, -285, -8, 88, 65, 21, 93, -113]
3007a13M93p15M85k45q6K7O4J87K4j46l3O5j8J10l74J33K06k4k34K92k12K75k98
3030a37R0J32k17K57q0k88L38j43o1K62k91j14M03k30K37p3j02K32k92J63r4P9
3052G1R3nk04M6j29J89J06l81L81m0k40L00l35O6J36j49J47m8K7ol30K14L00l13
3076a04q4K53j58K14k33P4L2j10l21M99k20K29P6m24M02o0k7R7j45K67k25k72
3098b40L95o2k33J63m5K76l99k77M08J34l54M41k49j19K80o6LJ17k08J95q9k35
3120a64J96j67J59J81n46K86J38k32M35n02L10k63J62J69k97m1J13j03L62k03
3140gk15L16j43J81j08q0N1J49m06J92N6%J9j85L0K27k56J39j13k3L14m24N6J54
3164g6J01J03M2j68P0J72r0j30m7J46j20q3K66j76j31J81L8J58q9k83J60j49O2
$$ y = [-113, 380, -335, 150, -95, -181, -154, -90, 97, 121, -25, -58, 7, -11, 99, -275, -142, 64, 40, -194, 98, -114, 161, -137, -47, 85, -132, 125, 45, -243, 95, -48, -109, 153, -138, -252, 151, -79, 158, 85, -17, 215, -77, 86, -8, 71, 164, 159, -45, 1, -128, 61, 167, -214, 167, 127, -113, 187, -148, -82, 54, -95, 52, 4, 31, 25, -305, -91, 209, -104, -188, 65, -93, 121, -112, -38, -6, -116, -437, 62, -158, 71, 147, -277, 125, 65, 38, 135, -10, 257, 32, -240, 155, 93, -140, 23, -22, 254, -145, -422, -14, 120, -234, 207, -42, -161, 119, 53, 56, 173, -35, 160, 71, -164, 32, -135, 24, 205, -341, -55, 83, -149, 286, -216, 94, -169, -7, 162, -135, -176, -63, -166, 196, -7, -222, 94, -49, 132, 24, -56, -5, 144, -262, -70, -14, -14, 5, -180, -150, 77, -179, -40, -153, -176, 138, -286, -230, -76, 25, 128, 170, 2, 72, 244, 154, 24, -23, 123, 3, -80, 186, 10, -121, 60, 98, 256, 167, -116, 44, -105, -43]
3187d3J13r9j78M14l97R9K2o5J07J8J49J23j12j30k87K01M42l13q6O4k24L4K97
3210A49l06J88J22p0R5k34M6N4l10M64l93J2J38j01J33lL4q8K71q8j77P6K22j92
3234D2K4K29k39r1P4j80L9M72l59K00L5l44K45L1j61K07l06J10k61J25K98j12
3256G8j63J61Q7l9J22j56k46J20J52o5j89j73L93j05L5j9j44K02j06J29N7n20
3278c89K35J60R6m9j52J83R7m55K49j85K21o3P4j06K63K8k33Q9r2J5Rr8R6JP5
3303F9r5k4J53k97L27K07m90J03R2r5J37Q2j77j21J7K69R3n51J02K67K7j27J91
3326A59k86K37k97P1K60r5N7k4k64L26l13K58j18R6j22L4J65J49k68p0M7N7P7
3349A36j73j26J90K0j38K17n06O58l13p1K77k05qK68k64l6J60j58N60m03l29N99
$$ y = [-43, 70, -29, -207, 207, -190, -91, -69, -134, -27, -9, 140, 263, 151, 21, -266, -65, 377, 64, -22, 42, -182, -148, 149, -157, 31, 153, 83, 178, -56, -10, 44, -266, 198, -195, -183, -45, -146, -13, -16, 18, -70, 201, 113, -64, 12, 234, 42, 66, 295, 56, -35, 39, -141, -102, 370, 11, 211, 246, -98, 147, 178, 17, 224, -82, 28, -233, -108, 190, 78, -85, 76, 163, 124, 246, 90, -156, -36, 116, 51, -138, -311, 82, -23, 12, -7, -151, 51, -55, 74, 131, -389, -154, 6, 102, 53, -99, 84, 181, -274, -25, -210, 11, -52, 22, -84, 179, 207, -26, 63, -29, -14, -5, -103, -7, -6, 69, -26, -50, 103, -194, 133, 340, -150, -47, 45, -50, 87, 169, -8, -129, -112, 157, 250, -301, -199, 68, 95, -32, 159, -127, 110, -187, -116, 144, 49, 106, 82, -182, 144, -169, 89, -29, 67, -55, -21, 144, 293, 25, -45, 2, 59, 136, -37, -163, 27, 47, -91, 126, -380, 278, -35, -106, 171, -34, -42, 226, -38, -74, 86, -72, 488, 85, -244, 355]
3371C55o17J44J86j0o8K1K83k36l23K38M9j27O3m7k1L1J68j63K80l29J72k84J92
3394d3J41o9k98M47j46Q5J50n35N25k08l62M70j73j4O5k55K11R1L2J01o60L06
3416a39O67o47J29J83k19K04l4k12Q5k44R4n2m3L64q5r7k9M9L9J55m28L76k2l72
3440b78O93m21q1J66r0P2K9j71L20j93J31l38J69Q1o9r8j15J67r6l7K39j12J44
3463A12o8n9k5K04o4J6M0j9k29L7j68rK73l51K87j23P0J07q4J8l3j30J9J63k80
3488b96L88r0j2J32l4j67M1K0R9J78l22J11o0k36L49m8k17p1M6L28l87J52K73
3511A77j63N6j06LM82m94o0J76l84L11J08k44J53q6J57P8k20P8J24j02O8k78J59
3534gJ17k68oo0L19k8N6k84J58M4J4J35j06j93q0K05m0J52j29p4K62Mk01Q8m23
$$ y = [355, -262, -118, 68, 58, -10, 11, 294, 58, -265, -27, 22, -105, -42, -89, -110, -79, 89, -74, 206, -123, 49, -235, -43, 98, 29, -269, 178, 32, 117, 267, -268, 257, 49, -313, 157, -16, -30, 35, -220, -9, 82, 114, 215, -445, -139, 528, -119, 10, 193, -26, 178, 144, -68, 17, -227, -133, -185, -228, 136, 51, -46, -75, -26, 13, 168, -260, 116, 94, -278, 415, -6, -87, 79, -11, 61, 90, -81, 239, 46, 177, -161, 8, 89, 20, -78, -193, -26, -122, -159, 80, -32, 112, 44, -15, -40, 164, 100, 116, 156, 137, -92, -55, -223, -232, 41, -310, -23, -146, -76, 31, -53, -35, -68, -198, -179, -16, -296, 92, 2, -10, 122, 88, -79, -38, -18, 81, 259, -63, 48, -12, -248, 101, 53, -164, -235, -189, 139, -248, -96, 177, 14, 70, -36, -33, 449, -45, -105, 71, -313, -2, 106, -138, 15, -71, 86, 164, -56, 22, 146, 44, 112, -166, -7, 110, -158, -164, -224, 95, 67, 123, -161, -3, 41, 55, 190, 84, -109, -189, 16, -24, 128, -1, -75, 187, 191, -10, 78, -345]
3559c45N06k99M3Q2k50M85m17J32J89l50L58k64l7L65k06j15K94l19K57l4m45
3580c70P29l32RO4j66J3KM1m4k02K55L01j82J19j66r8J04k39R2NN6j43m6R6K27
3605A25l1j18J79k58K94L3l72L30k61N3J03O0k00P5p1K02Q2j64j37k79L75J2N2
3628H4J7k4k01K7q6L94j76k64J76J8j86N0J34L52k36o1j04K48k61J52k15L65j22
3651H1K7K07p6m57L32j59j28j9J16J79j95o6J19J10l18K85j90kK45k95L48r9j54
3674a09m0K3R3j72J85P7m7k33L42k9k97K75k58L05j36Q4pj90J49j04L5L19k22
3697D3l4ll5Q2Nk44J40L59m89K67p2r6K96k24J59N9k90q4R3j34J21N5K7k83L23
3722D1J35l4k33J48j31L4J31r7k71K70nN6j9j13l3JK31J97l64q6K56l03J69n0
$$ y = [-345, 161, -138, -95, -13, -263, 222, -195, -63, 126, -224, 134, -130, -167, 198, -8, -123, 171, -148, 109, 75, -370, 359, 27, 36, 100, -66, -53, -51, -10, -54, -256, -1, 300, 118, 237, 71, -27, 77, -162, -70, -65, -9, -152, -198, -102, 125, 94, -24, 155, -103, 191, 224, -148, 182, -79, -26, 77, 137, -63, 12, -59, 143, 225, 61, -76, -355, 20, 32, 84, 101, 77, -124, -97, -183, 211, 35, -229, -53, -35, -221, -171, -37, 315, 79, 18, -86, 162, -99, 53, -162, 203, 81, 108, 315, 239, -218, 114, -45, -173, -192, -76, 103, -92, -158, -39, 71, -247, 38, -152, -154, 91, -204, 144, 45, -109, -149, -126, -33, -205, -20, 57, 10, -223, 119, 90, -207, 68, -190, 115, -21, 63, 56, -134, 15, -89, -54, 265, 43, 9, 6, -29, 53, 58, -186, -46, 313, -176, 91, 19, -77, 219, -5, 154, 213, -77, -161, -68, -202, -81, -26, 1, -282, 41, 176, 142, -91, 57, -74, -40, 91, -6, -277, -7, -12, 44, 25, -88, -121, -120, 111, 308, -56, -142, 114, -189, -20, -70]
3746g0J66K60n63K54J04l14J85J30k52J50j06J6j66K84p2J51j02K08o14M48J82
3767B79o36M17N3j45j46J87L4k1Q6n3j05P8K40l66J61j3k33L71j29O3Nj15J0j7
3791Ej19R6L48m06L4K14j32q3P5q2k50K72J59k09m4L92m69q6M72l52J56K87m51
3814a73L64O5o6j63prj29r9J71K0M9J54k38M02l66q5j5k16L70k7l4m4R4j64J53
3839Gk57K65K73m57L66M3k73p1Om3J60l3j18K02m52L07J16K9l6p8P6n0jM6K68
3864B95n24L00J84k50k44Q1J58K65k47m9q2K10k3k51K42j67K25j30L5L3J12l09
3886a36J64q1j2JQ3K8P6K1j28l6k51L91j37L1j61L0J72j47m6J65j28k7K25j18
3910b1r3J82j34j9J45l7K01l65J74J69k17l61M67j35nJ82j05j07j18K55o9j15
$$ y = [-70, 96, 356, -207, 47, 151, -163, 22, 152, -100, 50, -56, -40, -206, 78, 6, 157, 55, 263, -351, 97, 279, -357, 60, 113, -32, -178, 9, 43, 22, 108, 55, -50, 28, 268, -98, 63, 50, -183, 188, 59, 122, 127, 12, 22, 5, -114, -18, 330, -76, -42, 172, 40, -43, 32, -50, -300, -28, 131, -78, -122, 270, -199, -285, 187, -165, -9, 278, -173, 191, 256, 190, 27, 20, 11, -118, -217, -46, -26, 23, 177, -61, 341, -25, -110, -125, -341, 29, 2, -32, -76, 18, -146, 7, -250, 15, 288, -169, 197, 240, -33, -104, -98, -141, 19, -14, -132, 70, -382, -75, 41, 70, 34, -44, 32, -18, -19, 27, 295, -229, 71, 255, 5, -239, -158, 0, 265, 18, -31, -113, 97, 74, -177, 65, -102, 123, -7, 28, 61, 173, -136, 28, -53, -65, -64, 19, 47, 123, 144, 16, -20, -271, 120, -17, 14, -147, -117, 55, -92, -138, 27, -101, -128, 97, -21, -114, 68, -66, -85, 60, 23, 224, -141, 33, 202, -15, -376, 91, -44, -49, 133, 28, -79, -197, 58, -11, -126]
3932a26n7j79M27nn5o2K28k4K65m50j02J02J54j0M4m7Nj62r1J52j28L69j74m0
3956C4j20L41m05J51j52P6J38k3k6K7j7ML5o6l4M0J72k7l87J67J86l06J18K97
3980B23k10n2J32j01J25L3J7k72o8M71l74j08M19l26J75j16k26L66k27r8k3J87
4002e3j8M2k6L1J57j00j09M8K33r5n5j14J84r9p9j11J96K0l53M27j41J4J08l29
4026b22J24R6k3j97K85j73Mj21J39J74q2pm9J1J41K4n74M03M2J05k99j28L71j36
4050i2J08R5m33L23K16n18O27k92k19K61k22j01R2J79K1R5r9J7j1j72J07n1M7
4073b2J16K9r0j63J69O6m03J51J11j18L4j7J63M17m95m9Q0RK48k54n8J74j72n4
4097a28J3K15J3k38QJ01j91L23j15R2q4k57J61L21j32j6O9k78%K62j94K46k57
$$ y = [-126, -183, -362, 65, 60, 5, -57, 171, 147, 412, -38, -140, -38, 116, 106, 150, 103, 108, -54, -145, 7, -121, 248, 74, 34, -86, 255, -150, 1, -151, -75, 63, 40, 14, 41, 24, 28, 63, -3, -37, 3, 175, 148, -239, -72, 114, -192, -74, 223, 13, -39, 93, -8, 117, 150, 167, -105, -173, 298, -76, -184, 235, -91, 84, -32, -258, 108, -119, -217, -240, -53, -71, -29, -55, -24, 133, 33, -76, -28, 205, 110, 55, -59, 125, 26, -53, -164, 32, 52, -301, 126, -15, -1, 107, -222, -98, -2, -25, -222, 63, -110, -106, -227, -88, 86, 4, -3, -52, -41, 100, 124, -450, -47, -5, 100, -199, -327, 44, -92, 16, 111, -322, 1, 217, -301, 326, 34, -185, 76, -146, -247, -155, 24, 45, 140, 41, 58, 47, -125, -18, -69, -22, 94, 123, 33, -130, 39, 105, -298, -147, -36, -154, -120, -137, 26, 443, -52, -101, -21, -12, 236, -18, -76, 98, -74, -128, -115, 100, 113, -125, -117, -16, -207, 116, 1, 93, 9, -248, -87, 234, 102, 86, 155, -123, -123, 139, -55, 191, -66]
4120f6K26j94N2p3jq9J39K6J8nk4n4N7J16j04j83Q0N11l90m5J25l19N1L07k14
4145e3J23p6q7J23k17r5K11R4o4j21k6K11J33j48J45l37J12lQ4M8j42J01m9Q9
4169E6o8L3m6R6n3q7P9k24J82R6j37J4J26k41L52k56MK00j66j78J87J83k48J65
4193F9k5J20j43jj9M4o6l2L35j41j85j4n3K4J14M4K2o4k3J14Q3k56j52N4J98j9
4219B8L6j1m5l4J26j1k13J90p5q1r4Q1j2J93j59P9j65Q2K26l55N6n9Q1K28l96
4244c04L93j28l71K74N8O5L7n5l64M10k30K72k07K55j15J32M6kj91J92k77qO4
4267e4j22M11q9l06J94j59p5K79q9k45M34l11J37n2J02J3N7r0N9J12l15O0J09
4290F0m2r4j22L90k58K49l7k71K65p5j01K50m05M2K08k29M5K45J04j85j09m5K70
$$ y = [-66, 160, -34, 18, -55, -56, -145, -6, 20, 38, 33, 9, -45, 12, 128, 24, -159, -79, 432, 42, -3, 122, -197, -146, 161, -53, 70, -6, -93, 30, -187, -282, -71, 23, -41, -162, -188, 23, 156, 8, 153, -184, -72, -75, 9, 57, -85, 16, -33, 56, -12, 21, -25, 71, 18, -69, 10, -214, -32, 64, -73, -59, 67, -174, 178, -78, -74, 126, -40, -218, -31, 152, -96, 69, 44, 164, 21, 20, 1, 45, -21, -53, 282, 141, -44, -58, -111, -87, 27, 71, 93, 29, 6, 120, 203, -53, -205, -151, 47, 28, 64, 53, 8, -26, 100, 89, -124, 66, -9, -90, -184, -103, -115, 78, -81, -2, -167, -85, 141, -214, -158, -217, -136, 92, -304, 89, -39, -410, -136, -78, -13, 24, -31, -395, 15, -215, 57, -150, 105, -10, 122, 168, 166, -25, 167, -110, -118, -54, -176, 235, 146, -160, 34, -125, -200, 79, -10, -255, 179, -132, 5, -47, 55, 68, 125, 35, 94, 206, -109, -49, 60, 18, -76, -198, 192, -66, 183, 146, -125, 140, 65, -36, 214, -191, -149, 59, -170, -125, 120, 224, 39, -70, -115, 155]
4313A55m75N73k69N2Ll06J86N6PK5l4mP6p8j35J60j95J04K93k75J84m6k99L5P5
4338a32K09K07k86j44J75jn5j82J96K80j53Q7j04j91J79N8l8J54p5k35j98K59
4360A0r7pM0K58k52J47J33j01k28L90m83L53o3j71K39l40K02J0j57jM48n93K60
4383cq6J72R6k13k27L46K7R4m08K46L2K91l70R4j57J98q7K2ql56L49k14P4J69
4407H1l0j21N7l32N61k25j6K02m05J32RNj1K39J85l61k0R2K3j35J40k28o4K26
4431DP3J64j33j94K13K7j28P1k3j57J92j31Q4m13P3J57J69k18J21l52L20J96j73
4454e8o8Qj32J48O8J1J75n8rk8j02N1j07J8N8J41L0K8k42J06j40k98N01m45L76
4479C2J7m7J1k48qN94j97j23K2j72J80O0r1p2J76r7M4k29P8K06o1k19m1J37K15
$$ y = [155, -320, 253, -16, 36, 39, -267, -81, -25, -18, 7, -27, -31, 45, -33, -168, -8, -203, -99, 194, -81, 103, 57, -242, -207, -132, 77, 284, -2, -146, 29, 28, -27, -209, -13, 267, 114, 201, 97, -94, 85, 143, 105, 259, 184, -51, -249, 10, -87, -94, -54, 204, -48, 99, 232, 131, -97, 293, -190, 163, 100, -71, 168, -172, 30, 40, -117, -118, 330, -263, -3, -89, 83, 179, -34, -261, 85, 112, 206, -202, 44, 76, 367, -3, 91, -66, 132, 45, 67, 59, -297, 52, -162, -88, 81, 51, -70, -13, -345, 216, -9, -25, 177, -228, -96, -87, -82, -93, 146, 331, -30, -50, 42, 65, -70, 70, -158, -222, 4, 77, 241, 108, -86, 127, 154, 26, 97, 74, -83, 109, -22, 62, -351, -278, -121, 48, -170, -49, -401, -81, 115, -58, -126, -118, -250, -102, -34, -23, 152, 94, 85, 57, -45, 6, -101, -83, -25, 116, 146, 174, -68, 38, -102, -400, 101, -344, 32, 49, 2, 13, -235, -243, 351, 154, 31, 53, -119, 61, 121, 30, -42, 134, 37, 81, -148, -70, 136, 75, -144, -185, -48, 167]
4504A67q1j10ln5l9J69j66M56m41P4M6P5n2J13j27R5j78q5L00k75L87l52l6J58
4528D0j47J5K89o6j27k35R6J35p3M0j12J09N6m0o5K42m99K50K75j78j37J86l11
4551b57L41q0N6R5k37L1L4k86M79q3j84K35m8m3J84k67j10J96q7P2j07J59q3J08
4575A18m2m2Kp1J52%j37j07J1L71l76K4kJ45M1l6NJ48j73J22k59J08M0N1n6J5
4601E2o7L58l34K42k98j3J18J71j98q5n5R6K46M5p5k91J81J6j28r7M08m45kJ92
4625C7l0k00J93p9O2j5L4j7n2o2J87J46j70k95J49Q2J24L3J30j20l3j46j35J66
4649a1j01J45J03k04k18J74o2J80j16K81l67K86k21K89q5O9J35l23j82J2K86j06
4671c6jm7M7N9J43l13K95j9m4J05k76j04L36n6rm0k00K18j74K50N9k75J16L7O7
$$ y = [167, 86, -24, -27, -82, -121, 48, -118, 338, -103, -29, 17, 92, 40, 153, 26, 121, -57, -142, 158, -117, 270, -82, -118, 40, -107, -92, 197, 131, 4, -231, -135, 0, -73, -33, -145, -36, 20, -20, -85, 157, -342, -92, 183, 5, -132, 54, -257, 84, 4, 60, 155, -82, -51, -17, -303, 176, 93, -91, 144, 96, 53, 237, -30, -140, 56, -31, 41, -66, 93, 10, 118, 76, 34, 36, -35, 117, 117, -20, -127, -116, 255, -121, -97, -99, 46, 87, 51, 56, 204, 31, 153, -106, 2, 42, 93, 37, 52, -15, 343, 9, 251, -47, -60, 58, 229, 31, -54, -109, -13, 233, 278, 203, -88, 93, 109, -19, -116, 292, -153, -155, 37, 7, -193, 0, -79, -17, -32, 2, -15, -67, -129, 58, 204, 34, -261, -112, -30, 94, 127, 257, 137, 104, -42, -177, -11, -112, 33, 136, -68, -286, -112, -174, 6, -110, 171, -196, 90, -131, 158, 73, 142, 277, -46, -228, -216, 70, -36, -37, -84, -37, 22, 165, -148, 147, 128, 84, 189, -87, -191, 145, 89, 80, 40, -160, 58, -116, 134, 193, -82, 34, 71, 138]
4696A38j43K31l49K23n0o8L5N8K38j84j0k6l20J70K00L3l8j9j74L12l40J93j15
4719eJ45k76K29j7Nj17R8J3m9M2J76j05k34Q0L3j2J40N7p3r1j52K05k00M7L22
4744B61n25M29N4j51k13K08j7ol2M4K9k2j12o8L74m03J64r5j28N7jj0J62J8j82
4769a65J69K4j94j12K07K16j78j67O1N0l0K79j55J54P9l58j06J12J95l9J9n3J83
4792A91k90j01K47Q1l7j04m2P8o6J58l03P5JJ4K3L2m0K18j0k07K8L1L05l05O1
4817C8O8J8k69J64K04j94j8n6K19m4p9K62j76j67l0K19J42j24l44P2J00M8Q9j92
4841e0J22j65j7n7K17M6rl3p2J28J9q8L8j64J13o4j44J44K18m39J12L24k18J56
4865A17l10L61k32oO8J10J39m30J63k72Q3J82K62p5j80J65j07R9Rj63j70p8K93
$$ y = [138, -5, 226, -123, 100, 50, -18, 17, 75, 313, 129, 119, 93, -227, -57, 143, 176, 138, 119, -55, 257, -83, 110, -5, 140, -136, 93, 76, 81, -36, 62, 75, 26, 68, 244, 139, -95, -15, 18, 6, 146, 203, 130, 39, -113, 92, -108, -61, 261, -264, 165, 219, 68, -145, 63, 46, 40, 8, 52, 81, 59, -53, -121, 253, -150, 14, -81, -209, -152, -153, -163, -1, 17, -165, 4, 28, -166, -278, -71, 145, -33, -200, -139, -89, -119, 160, 5, 159, 238, -120, -226, -114, 81, 42, 61, 8, 191, -99, -200, 47, 128, 91, -13, -55, 23, -43, 115, -188, -113, -112, -98, -75, -43, -83, 135, 125, -82, -54, -23, 282, -23, 38, 106, 124, -145, 19, 223, 29, 11, -45, 174, 130, 51, 313, 137, -30, -60, 159, 301, 177, -167, -95, 5, 53, 142, -50, 72, -93, -110, -167, 50, 96, 87, 54, -18, 110, 129, 41, 79, -85, 28, -36, -180, -36, 182, -257, -145, 179, -39, 117, -193, 168, -64, -70, -2, 108, 247, -183, -20, -292, -209, -27, 235, 160, -20, 145, 38, 137, 146, -17, -187, -265, 28]
4888B8r4k3RK17j02K6j14j61J83j38K65Nj07R4k04P8k09J43J25m4M6k6O9j09K22
4913A79l53M54k53j01Lp9K10l04J04L13k07j18J45J85r4m1n8l3n3J82p4j4j9K0
4937fk39L25J2l87K77J28L9j00M7j74R2Q7N2l20K24RJ4j0N0j08j03J97j83J1M4
4962b2o0J01k16K97j58j34Q2K04k70R7J22j23J75o1j78r3J01J21K60j08j09r0
4984f2N5o4J83k74J77j73R1K42j50o6R9Ok04MR6J26K05j56j85J06j39l2K68r0
5008F3k02K25M4l07Q1J08J13p8j50K11l09L92K27l88k4j85L81l31K25kk09J13
5030bN3j31J14Q3l43N7J30k6LL67l58P7k1j8k1qK28p3j84J34j54R6p4r9L3J3K54
5057A30j67j8Q5M0l26L47k37J36Q8K3j55K08J6q2r4j43M5J33N8M6k56J84J26J9
$$ y = [28, -66, -89, -80, 137, 35, 61, -53, -214, -31, -169, 96, 101, -6, 88, -116, -38, -247, -104, 21, -23, 23, -3, 66, -43, 179, -174, 280, 27, -74, -71, -150, 60, -244, -140, 173, -34, -152, -7, 178, 84, 43, -15, -48, -101, 81, 7, -7, -26, -6, -245, 80, 92, -295, -18, 110, 149, 49, 96, -78, 14, 101, 153, -167, 57, 66, 80, 70, 120, 12, -91, 106, -77, -66, -22, -82, 19, -197, 100, -58, -192, -110, 94, -176, -79, 43, -80, 95, 34, -144, -237, -136, -15, 245, 137, 28, -62, -7, -71, 112, -162, 15, -158, -67, 175, 25, -41, 58, 64, -140, -136, -40, 86, 291, 135, -50, 56, -83, -115, 153, 63, -139, 86, 130, -177, -96, 12, 125, 47, -103, 108, -201, 191, 418, 30, 6, -179, 202, -129, 96, 94, -115, -2, 51, -80, 34, 117, -226, -169, -39, -65, -62, 305, -53, 24, 3, -15, -36, -44, 184, 111, -73, 61, -93, 3, -71, -170, -137, -124, 130, -37, -55, 30, 70, -256, 91, -146, -10, 78, 101, -54, 154, 170, 88, -6, -149, -104, 29, 87, 133, -123, 61, 187, 206]
5081B06l29J17J85j71N4o8k85L8J29L15k15j48K77m83M53J00m4n1j27K08j34M0
5103F7K5l2M6j35k02K27O3j01J9L32m24j49K78n3O7p6lo6O2n6K17j68J23M6M0
5128A47m27K56R4r9M36l14K11k33o1J03O7k55M2J5J86m05L65l50L07o5j9q9P6
5151a2K20J97m32J95n5k7m8l85N84l00K96j73j73K71p5j34K77k12J19k50k47L29
5173c5J32q5Q5k97R1J76kk01J63j78J24K02k33R4k4k05O3l6q2L35k36J11j35N5
5197a18N3J39k4P9l01J75R8J86k10j11L04k70n5K6j32M4N0j17L01j02j73J58r8
5220i8J51l0l43J66K29p9j33J74l6K3j0m7J34l23J38J58K04k35o0j03n3Q5L35
5243B47m4l96N03o57K34P4J71J3l63J18K56l20J40J86j68O4J38k14q9K2M1L28
$$ y = [206, -123, -6, 179, 8, 62, -6, -291, -253, -124, 191, -24, -172, 105, -378, 75, 175, 131, 80, -47, 161, 27, 67, 92, 60, 106, -29, -231, -4, 59, -42, -23, 309, -115, -264, 14, -39, 28, -48, -51, -117, -55, -111, 106, -62, 61, 107, 147, -280, -24, 70, -29, 407, 93, 304, 71, 10, 113, 180, -75, -33, -18, 168, -237, 128, -222, 85, 20, 1, -88, -12, 208, 405, -27, 168, 113, 86, 38, -347, 237, -63, 233, 60, -113, 158, 83, -51, 226, 14, 133, -117, -364, -35, 97, 12, 97, -200, -109, 67, 65, -136, 27, -151, -27, 175, -58, 36, 12, -193, -130, -166, -248, 87, -149, -38, -173, -118, -65, 74, 50, 129, -172, 3, 101, 287, 77, -34, 270, 0, -55, -29, -161, -117, -67, -184, 117, 15, -158, 0, -98, 53, 23, -320, -154, 75, -4, -137, 37, 1, 24, 14, -33, 101, -222, -84, 74, 278, 43, -17, -120, -173, -88, 247, 203, -193, 310, -347, -113, -39, 132, 145, -218, -100, 156, -164, -24, 162, -6, 58, 196, -18, -107, -85, -44, 284]
5265B84l35R8J6j08r7P1J0M1J10k43J89j89J11J24ol6k39K36R1k11j62M28j07
5288G6J17l15K07k01O1J43j35M6j12J7J56j32k5o8J50p2M7O6k16L03q9j1j72K94
5312A35q9j8r8J36j96J67j68O1L05l44N5K75j87N5K52k21j55k0O7J43J0j96k13
5335b44J57o0P8J32j47j20P1L4P1J13j84K05j54J31j60M6k8J46p9K82k27r5l6
5358f8K07l6j67O9k09J05K76Oj39J34l61J69J6J36j02L9L4O2k64J76j95M54l34
5381Hr5J7K43q4pJ6o6N3j81J6J43j91M4K9o8R2q7J40j14K28J9q6j32J18l6K62
5407B81l07j18RJ26O7k07K21k77K55l32K32j91J12J61N1j62O4l3q3P9K45j5n33
5430c55L61K56k08j27J96m8o0k8K01k51j33m4P5J19M0j30K36j92j22J45J17o1
$$ y = [284, -51, 47, 63, -45, -142, -71, -61, -20, 90, -153, 36, -153, -42, 82, 76, 40, -199, 37, 128, -83, -245, 183, 76, 193, -122, 85, -116, -55, 88, -47, -1, -113, -96, 60, -72, -97, -165, -15, -87, -40, 26, -190, 113, 24, 13, -159, 135, 46, 28, -70, 66, -130, 37, -131, -70, 235, -109, -54, 221, 34, 89, 341, 120, -35, -55, 12, 155, 165, -31, -244, -87, -147, -69, 63, -84, -204, -133, -99, -28, 85, -99, 106, -48, 83, -77, -31, -59, 87, 8, 290, 63, -32, -68, 139, 103, -64, 5, -204, -99, 177, 183, 44, 178, -183, -14, 2, 138, 36, 75, 109, 171, -93, 83, -112, 342, 8, -87, -70, 173, 89, 82, 98, 32, 85, -96, -80, 63, -128, -84, -55, -123, -31, -118, 22, -92, 136, 155, 69, -63, 55, 19, 281, -26, -144, -135, -9, 58, -149, 72, -205, 50, -282, -50, -241, -129, 32, 83, -79, -15, -48, -131, -52, 193, 178, -355, 6, 262, 54, -73, 123, 75, 15, -13, 188, -63, -196, -240, -165, -46, -6, -136, 100, -92, -214, -69, 48, -13]
5452a3K1m9j88L36j25l6O3p5K31Pj49J29j8K5j82j42J82K2J31k40p1P7MP1O2j24
5478e1J01k60J00J22K6K23k98k50K85r0Q1j70R2P7L9L2J2l3k51M13j48j54K41
5501A39j69K6J17J80j87l67K52j96M14l06K68j87j81K06M8j03M2p5j33J27K97
5522B12l14p7L32m47M46l51L31k05lRl5J5N5j88M37J4n46M48k03k0N6r9M13l99
5546a19J48k9j89N3J66J71j59M9k06j30L31l1J64k97K72P3q9j33l9j16K16j93
5568h7J86K1k09K10k8j41M54l76J05k15J23K69k78j46L35j98J58k59K83m0k53
5589h6J00K54l26K01K66k65k04P2j61mK42K8j9j5J00m9j10r2K04m33M19j36J81
5612A67m08N3k1K76J75j60K3q6LK69k32j58j71J07P9J01r5k30Q2j03L18J29j68
$$ y = [-13, 8, -41, -229, 107, -18, -54, 9, -66, 165, 172, 23, 152, 134, 159, -23, -165, 17, 39, 170, -70, -141, -64, -60, 11, 73, -51, 50, -210, -110, 12, 38, 261, -37, -287, -2, -92, -11, -181, -89, -12, 27, 59, 71, 38, -213, 200, 52, -102, 139, -30, -4, 113, 293, 106, -261, -9, -205, 209, -97, 171, -16, -197, 9, 57, -46, -4, -79, -212, -85, 212, -102, -179, 153, -294, 152, -199, 132, -73, -76, -67, -102, -87, -32, -220, 217, 231, -315, 133, -70, -90, -34, -133, 280, -119, 29, 0, -189, -136, 30, 201, 42, 91, -115, -245, 86, 55, 219, -78, 194, 267, 178, 45, 6, -110, 106, -87, 99, 120, -89, 121, 93, -48, 406, 30, 135, -80, 43, 312, 34, -112, 223, 25, 183, -76, 207, 167, -86, 14, 268, -58, 143, 409, 144, -60, 12, -149, -153, 89, 117, 98, 83, 183, 134, 24, -68, 136, -297, 122, -14, 167, -241, -188, -209, 67, 242, 82, 105, 19, 22, 291, 59, -99, -270, -163, -84, 17, -78, -308, -226, -329, -11, 118, -50]
5635e0J17J01J30l63J5K8M7j17J17q9L47j63J76k66r8Q1k94K38N6j01L14m56L12
5658H2Jl85K63R6j55k3PJ9O9L4j14j7M89m61J80l35K57o9r7J35j6K53k70j64M16
5683A95j13k2R6o8Qk30L06j53O6Pk03K92j02J14l47n5K82J41m22K17%L9pj53r
5708a21J63P1k3p8o1l6n2K73p0K2j20K36j65j5k5j21%N5K3J50J09m72K59R9l2
5733F9j29lR2pl6K01k68j09J3M6K60j77J17Q9l3k8m0O7q7o6J26j42RP4Ok1j98
5760a75Q4lo1M39j95j6q3J46j1k57K09j87K83k49j12J44J12j28m4j3l0K49q7k82
5784b67L83j68r9j09K10M1L7j96K11q3N0R8L4m4N6J35q9l47l6J96O7p0M1p3J44
5809A22n4q0k81K77L22j78J8j98p1J15j8N9K94k75j15J32j87MJ55j71L36m49L39
$$ y = [-50, 67, 168, 298, -65, -50, -22, 25, -92, 25, -64, 283, 120, 296, 30, -68, 13, -281, -43, 13, -88, 226, -230, 82, 83, -302, -39, 57, -98, -121, -114, -95, -26, 8, -106, -123, 366, -95, 85, -250, 7, -62, -159, -24, -40, 213, -57, -221, 195, 82, 60, 156, 88, 96, -134, 172, 19, 85, 92, -111, 181, 79, 193, -154, -209, 73, 214, -208, 9, 9, 48, 41, -112, -121, 42, 113, 90, 12, -49, -85, -137, 136, 66, 88, -32, 204, 39, 24, -1, -122, -122, -67, -44, 106, 215, -257, 2, 101, 69, -60, -63, 29, 22, -14, 187, -81, -190, -177, -131, 129, -48, 69, 158, 125, 97, 57, 124, 37, -29, 97, -45, -36, 38, 44, 23, -175, -91, -94, -155, 284, 89, 73, -10, 136, 125, -132, 77, -110, 173, -76, -188, -44, 68, -60, -104, -117, -147, 102, 15, -267, 116, -52, -151, -260, -50, -9, 28, -168, 43, -40, 10, 108, 142, 98, 154, 289, 200, -147, -183, 13, 80, 10, 51, -22, 122, 68, -12, -293, -16, 306, 128, 146, -52, -123, -8, -26, 33, 327, 52, -63, 69, -118, -114, 41, -130, 206, -243, 96]
5832I6j00n0L5k06J98J78n29M66m4J4R9k54K38l4k17J49P5j35j04K52j5Q9J84
5855C85m11P0r8K84n5r2j80J86L2k58M06k46k9J04j1j05r0NL65k98J64j28k4J16
5879I2p9j75K43j50M6K97k73p8J30L4j15qr7p1K79J31k11R8k19N8r8L61l34l3
5903a72Q9K10o0J71l3m41L40k30O9L0J39j08j66j2Q3p9L17j05JL01l95L2J60k73
5927a32J00l14N23m70K64Q4j07o7K15j43P8J00k00J97k22j14M1J32n9K6N18j77
5949B73j72J67m55K34K0r7J5L6k11L58j88nJ27k69N9J86r4N5J1O3J0K9j6L3Rj45
5975C3p0k0KjK13k05R1J19k48P5n0K32l3O3l7j85pk25J14J71L0k94K06J27p9O
6001B8N3N1l28L48k65J02Q0k72J89J69j51k1j63K33K1k0q8M0l09M68l90K36J29
$$ y = [96, -4, -54, -19, -225, -27, 151, -378, 88, 44, 58, 157, -97, 141, 107, -110, 39, 114, -21, -125, 127, 112, 201, 385, -26, 44, -54, 230, 175, 83, -97, 89, 121, -137, 269, 23, -6, 98, 87, -18, -108, -103, 262, -36, 128, 0, -24, 92, 13, -162, 81, -69, -23, 274, 1, -77, 53, 87, -28, -36, -133, -204, 75, 206, -5, 93, -126, -68, -166, 195, -139, -172, -83, 127, 67, 238, 205, -236, 104, -126, -57, -27, 112, 4, -162, -174, -91, -170, 147, 42, 43, 344, -51, -19, 141, -132, -32, -346, 177, -293, -29, 55, -52, -119, 96, -47, 31, 131, -69, 128, -94, -208, -167, -35, -94, -68, 450, 273, 101, 268, -187, 47, 67, -30, -15, 21, -190, 168, -20, -25, 102, -167, -108, 78, -16, 39, 50, 113, 123, 152, 136, 169, 178, 33, -37, -57, -55, -56, 157, -48, 43, 162, -86, -11, -61, 171, 138, 201, 164, -21, -28, -253, -139, 32, 62, -232, -26, 101, 22, 28, 81, 132, -196, 152, -113, -11, 69, -203, -14, 155, 4, -17, -180, 53, 74, 54, -34, 6, -303, 165, -225, 11, 140]
6024A40k81J79L2%j77J78n6l3K87k58j65J34m9J89j50m8O8J02j14N2Q7K7r5k14
6048a65J99R3k14K3J46O2m4m5p1L16k44L4P2k18K0J42J9j22kj54j01N1P9K24N0
6073A50J60m43J40M5k52J20M7OJ11pMj46l8L43k14k4Rp6J86j30J57l95M16j95
6097b6N4j60J18K6q5K9M7J47l19J95k0j66L67l81K57K5j17m9J61l39M0L60o4j37
6121c7Q2J01k29J23j70K19j49m2q9N21o50L28j48o5M8K8K0K11o0o3k6K75k02o9
6145d3kL04l4j69j96M1J32j99K98j75J48j29J63k85j44L69k52L88k12K9K0m4m2
6168c4K5Q6j29m4L6p0K98j58n7O8J74j54l5j14L93l20K35j51qj54j27K37n8J02
6192D1p2J9L1k10K30l0R6j76qP4J2Q4M8r8j65O9M7J41k86L71j48Q5j06J73l64
$$ y = [140, -141, 38, 70, 70, -107, 71, 15, -18, 269, 11, -154, -20, -69, 120, -30, -78, -10, 92, -22, 30, 117, 144, 49, -165, 34, 127, -87, -64, 82, 144, 100, 55, -16, 300, 56, 90, 162, -56, -36, 106, 125, 3, 1, -153, -254, -203, -124, 100, 150, 310, -133, 7, 52, -200, -80, -33, -27, 84, 77, 81, -65, -103, 240, 26, 2, 11, -65, 121, -9, 148, -247, 169, -26, 28, -132, -14, 12, -73, -44, 3, 150, -169, 26, 6, -160, 207, -174, 83, 108, -9, -58, 103, -236, -196, 164, 100, -37, 45, 146, -83, 40, -130, 89, -60, -102, -191, 330, -320, 8, -140, -205, -157, -129, -109, 102, 42, -21, -47, 228, 26, -43, -45, 259, 225, 56, -140, -99, 33, -166, 132, -43, 105, -24, 139, -146, -290, 79, -173, 215, 3, 32, 52, 8, -34, -9, 77, -52, -96, -60, -130, 168, 10, -47, 21, 195, 41, 6, -108, 285, -35, 200, 49, 41, -113, -240, -3, -61, 41, -31, -12, 19, -191, 39, 9, 105, -71, -79, -5, 7, 91, 139, 41, -124, -55, -8, 133, -153, 218, 70, 155, 49, 222, -142]
6217a42K26k67L63k14j48J72j8o9M6J72k59K75k2Km92L42j14L56n05Q07m53k88
6239b30L30o4q2J16j54p2M03k54j15m6L24k71J25l06L03P4J9q4p3J84j42l8qJ97
6263A36k30k00L24q7K8k14M29k84N9K92k25N1m4R3l83N32o1l11K58k13J03K33
6285B86l33R2j90p8L8R9L6J1qJ32K4L9k45K73m8J6j63mj01J41j35M9L1r7K35m5
6311E5l98K70K72j37j85R2K85l08J27J88m51J55J24N2p7j45N2P8K59m35K7J31
6333C1j4J21j91j20J00j23J35J33q8Rk5N5q4q3K40J3K55m97K90k23K6R2j59K65
6357A58nj47M9o9P2o4k79M07j34K1R1k42L41J02k93J20k82J68n7K58j6k47r6L44
6381B00m15m2J03K79k82J61K73l84K34k87J48j22J30N5J11kj18Q5j72J32l6L7
$$ y = [-142, 84, -183, 180, -34, -182, -10, -28, -97, -51, 121, -138, 137, 115, 117, -375, -33, -147, 209, -296, 511, 58, -230, 100, 36, -46, 70, -84, -156, 247, -7, -122, -168, 156, -115, 10, -296, 7, 81, 100, 16, -57, 127, -15, -53, -61, 136, -94, -294, 30, -57, -29, -243, 186, -98, -39, 253, 28, 79, 35, 128, -255, 277, 216, -95, 163, -50, 53, 286, -47, 45, -145, -223, -185, -86, -50, -39, -47, 85, 109, 148, -97, 176, 128, 144, -19, -23, -124, 17, -118, -69, -38, -135, 100, 55, -343, -73, 199, 62, -123, -31, 254, -54, 73, 261, -190, -35, 89, 141, 64, -81, -29, 49, 308, -127, -100, 31, 17, 138, -53, -173, -73, -196, -61, 72, -16, -7, -32, 23, -61, -144, 96, 109, 364, -133, 157, -66, -40, 52, -107, 158, 153, 6, 55, -14, 58, -6, -285, 122, -12, 9, 100, -142, 199, 301, 8, 128, -154, 14, -43, 215, 199, -48, -144, 200, -215, -257, -154, 125, -157, 4, 277, -107, 127, -160, -12, -134, -4, 51, 162, 160, 42, 127, -45, 87, 51, 88]
6403H8q8j36J16Oj44K27K8j9J30m05L3K75J44k40n0J19r3k83N07k12M4q5J11j51
6427g8Q1l5J59p2k20J40L1l0j68K71J1lj09J01M4j9k66J8K06j19j01J39j48K01
6451C4p6M2j50J57j00J47J48l70K25k79L26K8j80M0J35k53J82J6MR3l81N5K50
6474I3j63J19K7j56L06l26r7K45j37J82o4J38j38mm6n9o4J07K23j23l1j22L3J07
6498E0R9Rk02L4K78j11k50m3K4K72o2J05p7l01J81l6J74k74J42K3r5l3L2K13k15
6523f3L3K01k88o9L68m6k16l7L07k33m1L00k29K42k38O4k50J42Nj82M6J11J21
6546D8k06K14J7P4r8r9J58n1j92J46m0J99j85m4j3K27q7K4p0j6q2P2j04J40PR4
6572A33K8j76p8jJ88k5L8j80K66j79j93O8J43n0J75n8k08L8J05o4N2O7q4j59J62
$$ y = [88, 0, -136, -20, -14, -158, 69, 97, 78, 208, -197, -164, 111, 255, 15, -35, 84, -9, -292, 215, 3, 47, -38, 73, -78, 3, -32, 127, 55, -165, -25, 6, -24, -192, 79, 90, 87, -22, 79, 123, 104, -162, -144, 62, -57, -158, -19, -167, 34, -42, 0, -150, 7, -93, 54, 202, -168, 57, -222, 104, 132, -48, -8, 127, -126, 56, 72, 76, 169, -212, -157, 93, -70, 49, 76, -80, 226, -100, -197, 48, -89, 93, 29, 167, 29, 25, -21, -80, -144, -37, 186, 63, 32, -90, -57, 50, 149, 158, -44, -10, 268, 157, -93, -136, -112, 160, 98, 203, 126, -175, 6, -30, 144, -130, 12, 35, -60, -93, -61, 152, -63, -30, 171, -117, -186, 182, 136, -80, -117, 190, -43, -84, 216, -13, 229, -9, 55, -195, -53, -48, -230, -184, -73, 48, -158, 56, 73, 147, 49, -50, 108, 57, -135, 11, -29, 170, -15, -59, -72, 155, 68, 92, 22, 6, -76, -4, -108, 32, 39, 133, 161, -15, -93, -94, 94, 69, 107, -73, 193, 14, -179, -111, 32, -18, 157, 99, -109, -71, 34, -30, 22, 89, 5, -154, 8]
6597HK49l11Q5l2J64j87K74k13j65J41k4J8K23j44k49R5o0M11l30K98L9l19p8
6620a07R8k6J28lo5k10J93j72J56P2k89P1N1L9J74k22N07m50J14J4k24J39pL57
6644C38l60j07M0M16m25P2p4K17Mk30j7J8QK53k45J12j85L10j35K28l27J5J97
6667A23l78J07J61J4k15K15l2j69J30L7k7L55j54k27K78l20J15l0J96k95jK05
6689H8k09J87j55J81p8o8r5j19K37K30K19l30j90j92J66J4L7J15Q6k48K86j12
6711E0j30L0P1J1lj61K17k46P1Q0k3Q2J27r6o7L7P3j79k05O7J35J5j49J39J07
6736E3l44K85L1J89k11Jm2j4M9J63J05j2m21R4R0m8K67j45k55J42J80j0l81K74
6760D0N4j86J93O2k8j29k95M43Q4j68j02K7O5j6J24k09K70j36l29J24J86J6j57
$$ y = [8, 257, -54, 31, -1, 163, -24, 250, 37, -128, 13, -11, 7, 230, 86, -163, -68, -128, 283, -47, 251, 290, -29, -107, -9, -35, 93, 90, 25, -185, 8, -164, -8, 64, -225, -154, -103, -64, 110, -112, 395, -55, 59, 73, -151, -12, -19, 338, -22, -129, -89, 327, -98, -26, -100, 117, 121, -109, -126, -108, -100, 153, -92, 20, -165, 145, 10, 238, -89, -74, 123, -255, -148, 13, 27, -188, 27, -5, -174, -44, -7, -34, 321, 167, -60, 218, -102, 13, -17, 179, -116, -117, 88, -121, 66, -89, 92, 14, -54, -149, -268, -31, 199, 418, 88, -102, -294, -128, -114, -77, 38, 124, -124, 162, 50, -80, -50, 21, 32, 29, -132, 85, -161, -90, -10, -33, 49, 176, 80, 13, 50, 123, -56, -261, -194, -59, -44, -193, -54, 53, -291, -6, 25, 214, 3, 4, -38, -52, -3, 160, 265, 253, -168, -74, 16, -32, 235, 90, -165, -23, 157, 147, -234, 40, 94, -92, 101, 163, 135, 6, -289, 154, 238, 70, -32, -5, 60, 44, 168, -41, 229, 93, -236, -112, 74, 90, -67]
6783f7Q7l8m3kJ38l46J75k1O9J99r0n7N8j39Q4k21M3L5M23k73j3j10n9Q1Q6j3
6809a4K2l48J40K84J0Mr5J03Q1j81N3q9K21mk50J59q5J38q7l6J31J35j57j33n6
6834e4J90k37J00R8j36J31j86j18O1J82k70K72J0J03ok97l1L05K7K6k71J41P4
6857A14l1Qk28J15j12j30M47%j09j13L3k17J17K67q1l23J91K4r3P3J48m7j76K9
6881i4R0J49n0j85R8r2j93J17J87j4k67K84q5K86l80M3K6P1j68J49n3M5p5K4L4
6906e3j7J55n7k22K08j38J03j84K27K43n36j4K18j75K80r8L2j6j92k6M27j70r4
6929i9m6J02qr9K78j28j47j36K02Q7L5k16J92k05J45R5l23K20m8J94p3j6j34K44
6953A16p5l06L24N3k20J79n7q1J03n3J2P9l14J74L02k49l9K4J57r6j63J05j74
$$ y = [-67, 20, -18, -61, -63, 75, -271, -96, -117, -48, 151, 61, 4, 62, -77, 7, -214, -171, -136, 287, 14, 1, -109, -168, -87, -1, -14, 8, -340, -200, 84, 94, 98, 3, 106, 187, 6, 59, -30, 191, 187, -63, 96, 11, 149, 62, 26, 157, 292, 135, 2, -54, 136, -101, -1, 97, -39, 92, -94, -212, -151, 31, -239, 33, 43, 146, 140, -157, -188, 117, 144, 170, -101, 40, 114, 83, 91, -137, -22, -134, -264, 183, 183, 74, -39, -6, -223, -106, 161, 80, -243, -52, -28, -121, -48, 100, 53, -123, -94, -4, 145, 95, -90, 8, -84, -277, -160, 27, 13, -254, 30, -55, 231, -149, -106, -80, -9, -177, -28, -81, -36, -111, -87, -53, -70, 85, 28, -194, 14, -124, -21, -205, 22, 265, -271, -285, -67, -242, 38, -60, -28, -44, -236, -262, 165, -5, -99, -145, -43, -51, -150, 128, 0, -147, -283, -81, 6, 41, -175, 17, -188, -43, 52, -271, -51, -99, 95, 22, 6, -128, 116, 41, -265, 59, 112, -108, 71, 14, -67, 36, -17, -5, 74, -240, -66, 236, -13, -52, -28, 129, 33, -130, -25, -199]
6976a99K36R0l43N47k86J9j87J02J07O9j97r0J09N3j5j11J16k03J44J28l22J39
6998i4L3K20j3k03N5q5j79L99Q7j11J11k43k14N08k28o2R1N6j06j69J82p1J78
7021A42l14K31k08r5K23J63p2o2l08K41j09P8j57L41j70K08r1l85K87j8J00o8
7043d3j57M34j22Mj75Q8J32k28m3J75o1J24Oj36K86l03J63j71K19p7k33O1J14
7066E7K8K7k06O5P7k3J64J66k46p6j89K82k6k62J13K66j21NqJ09j19J18k64K02
7090A39K9l8j15Q8k90L56O7j94m9j79O9J68K6L4j06oj45p2p9M97k15k6K48k96
7114h9R4r1P4N7O4j54K31m18K01K60m27J55k5l9j1j77K78O0J49l03J31J28j7N0
7138A81k36R2%j12K08l48J92l24L35J2R5Q0j92j68J76J3J85k35m1n5M00m65L14
$$ y = [-199, 37, 127, -216, 331, 45, 64, -123, -21, 86, 155, -42, -132, -23, 30, 15, -96, 20, -183, -39, 89, -233, -94, -61, 159, 146, -57, -2, -87, -266, 133, 220, 109, 220, -23, -237, 271, 43, -19, 72, 128, 22, -147, 35, -36, 142, -172, 59, -149, -244, -21, 142, 70, 8, -300, -59, -168, -90, -247, 94, -76, 132, 41, -344, -57, -75, 25, -43, -200, 234, 112, 116, -59, 29, 161, -67, -110, 65, 4, 128, 134, -2, 284, -19, 144, -27, 192, 115, -118, -57, 57, 85, 112, -94, -29, 48, 25, 189, 355, 109, 33, -156, 126, 100, -162, -49, 217, 96, 101, 93, 202, 83, 201, -63, 139, 168, 130, 15, 103, -187, 169, 236, 42, -7, -186, -117, 51, 77, 111, 5, -1, -146, -218, -297, 200, -15, -41, 207, -89, 5, -86, -12, 45, 109, -45, 186, -232, -31, 229, -198, -43, -68, -107, -118, -295, -17, 43, 192, -111, 20, 148, 131, 181, -55, 37, 37, -75, 133, -215, -23, -347, -12, 0, 95, 175, -17, -185, -9, 4, 189, -46, -87, -142, 258, -207, 107]
7161A07JJ02k76L4J56oL0j40K3Po1J3p5J88p1L9m2J1J65k01l9m3R9j38o4J71J2
7188Bp0L40l58j7q0L38k1j75j86J62K28k16N3m1k2Q3p0J05oM8j74L03j84%J35
7213A77m75L19k45K71Q7j48k20K95r2j5L7j18J41j16k9J62o7J1lM3m1J25Kk46
7237a45Q2k8j11J45k07J51M1q8K17k1p5j4Q2j89J57RJ09k39K41M0k57j32J37Q1
7261a4k5L49l70r4L18j66o6n7Q5J92j23K36l58J39j28J66p6P5k8M7q9j86J92J70
7285A89l00K02q5N3q8N6l1l0R8j83L01k21R3P5j77Q5j1j12j83L7N03k87l0J60
7309A14r4k6R8p8K8Q6j40J31m3O7j89M5n5J0L2l0K93o7k31k89M03N5r8k6N2k74
7335b26J76K57k10J54j13J37k45M8j67Q5j02L62k91K0J41O1l8o9J06j73J37k06
$$ y = [107, 108, 210, -66, -32, 124, 118, 148, 8, 31, 38, -23, -10, -85, 103, 32, 71, 29, 40, 205, 4, -35, -78, 21, -117, -181, -10, 2, -68, 272, -86, -103, -183, 155, 134, -41, -227, -65, 163, -53, 0, -41, -63, 20, -50, 55, 49, 97, -77, 226, 42, 42, 177, -298, 21, -224, 47, 134, -14, -234, 61, -31, -46, -9, -127, 14, -102, -131, 31, -36, -25, -28, 15, -26, 99, 101, -145, -63, -91, -202, -57, -264, -113, -72, -160, 57, 36, -39, -53, 29, -160, -3, 6, 115, -124, 117, 157, -100, -232, -95, -14, -39, 310, -60, -154, 164, -2, -68, -125, -40, 152, 29, 265, -93, 46, -82, 84, 8, 83, 55, 102, 13, -173, 19, 189, -111, 91, 6, 59, -29, 27, -4, -34, 64, -119, 182, -39, 54, 129, -48, 37, 26, -86, -269, -232, 271, -16, -46, 114, 20, -6, 92, 14, 42, 128, -12, 119, 76, 143, -46, -1, -56, -46, -14, -44, 249, 182, -49, -338, 65, 120, 22, -4, 48, -226, -50, 207, -3, 151, 38, 175, -70, -22, -189, -104, -206, 156, -135, -115, 26, 87, 49, -20, 86, -87, 50, -156]
7357a56K67k17Q1j73L03k71O8K16j11J5l6N4p5R1J7j02L30k16l7k72K62P0j37
7380b9K23k43L62m78L24k09K57j53l24K59J12k23k6JL3K28k11K64l19J35J77O8
7402B28k79j36L16l52L10J04o9K7k43j87N77k24j39J99j38l3r3P0R5r2Q8PJ1M1
7426H8l34J27K21j42K44k57J45l2q8n3m1J24M6j31K33k39K02m0l7K79m11K21j46
7449b1J48p3m8L47m59j4K75j44j82L58j54m8K15j44j47N4K40l60J25j88K04j75
7471a91j41J03K09j27K7J2QJ60r7J29j16J78J2k37K16j9j73o7J26k3m3O9J63l35
7495a57J00L56l19r3J53l04J62J39j63K45j01j78K02J16k45NK55k32j34P7R2M9
7517B5p7K56k85M8J08k96j9P1K6K66j4q7j7O5lr8RM19n54J65j18m5L5m0K43MJ88
$$ y = [-156, 111, -106, -25, -198, 105, -166, -98, 118, 7, 22, -14, 40, -35, 56, 73, -29, 301, 85, 48, -224, 38, 108, -29, 194, -49, 313, -165, 159, -50, 207, 54, -270, -11, 101, -122, -148, -147, -114, 114, -97, 167, -152, -17, 160, 228, -51, -187, 129, -223, 87, 191, 122, 149, -94, -281, 296, 72, -67, 132, -6, -39, -132, -62, 33, -59, 29, 36, 47, 88, -246, -119, 102, -40, 204, -53, 92, 60, -28, -81, -122, 2, 48, -83, 150, -89, 113, 73, 36, 315, -96, 125, -21, 127, 54, 6, 353, -106, -120, 155, 11, -171, 187, 33, -15, 200, 56, -91, -37, 203, -157, -32, -220, -16, -191, -332, -229, -20, -147, -120, -108, -100, 60, -37, 92, -24, 154, 166, -71, 145, 126, -47, -114, 12, -11, -54, 15, 178, -157, -57, 299, -20, -113, 40, -264, -102, 37, -126, 119, 18, -160, 42, 158, -87, -82, 173, -59, -193, -116, -24, 25, -52, 204, -81, -33, 75, -221, -240, -169, -143, 123, 109, 22, 5, 70, 67, -31, -22, 397, -157, 8, -110, -155, -120, -160, 83, 87, 275]
7544B75k79p0n4M6J27j65K12n5P0M6j28j9j75J46k38K24N3J00k74R3k0J84p9M6
7568F6j9m9j7L9Oq3j02K03M7J10k42j58K7k6K36K13p1j96J1p2P0k37l2K43Q7N4
7594A08k15J89n6l00L64j00J11r8k4k0K67k52r6K35o8J96k05q0M3O7k97K93J84
7617B46j98q4MJ78nk20J66j58J62j28nn3m4K13k46J92j70p5J99o4m6L01k36J4
7641e7J29j65J26l6l3m1j23M58m49K62J82j61o0J9j03J53m35L29k66L54n8L7J9
7664H1j3j44n5K54j13Q0q6N3q1K13LO5l88J77l4L1o4j36k7J50J9O7J16l16K20
7689G2No2J40k68L0O4p8M4P7j32K42k05J41Oj99j10K52j73J50j96K47l3Q7l6j83
7714a18o9R2K08j05J05j2l43P5L10k74JK47m9j44K29k27oJ27L7j72K23l27J95
$$ y = [275, -4, -74, -128, -82, 45, -120, 92, 37, 107, 153, 25, 6, -169, -23, -261, -37, 16, 116, -158, -65, -85, 99, 20, 66, 47, -2, -19, 20, 26, -57, -159, 44, 91, 201, -41, -199, -172, -198, 38, 251, 180, -16, -5, -77, -7, -244, -276, -33, 54, 108, -107, 82, 26, -274, 90, -10, 101, 3, -21, -41, 226, -26, -122, 113, 45, 241, 36, -44, -1, 66, -231, 62, 246, 48, -36, -32, 146, 141, -79, 87, -71, 91, -37, -42, -95, -139, 74, -172, 20, -150, -225, -26, -90, -136, 165, -71, -57, 72, -93, 33, -3, -36, -77, -200, 258, -191, 71, 253, 92, 32, 51, -52, 101, -334, -5, -271, 83, 25, 62, 81, 68, -76, -131, 123, 10, 90, 4, 57, -24, 189, 192, 257, -131, 46, 12, 43, -21, -157, -184, -34, -15, 52, 168, -148, 72, 77, 15, 155, -113, -83, -19, -97, -53, 24, -108, 134, -71, 70, 76, -123, -233, 19, -154, -4, -200, 47, 14, 101, 65, -118, -187, -95, 113, 8, 113, 101, -242, -167, 143, -131, -130, 117, 68, -76, 153, -74, -80, 47, 84, -88, 135, -192, 3]
7737CM3K48o6k10j22J39j4np1R0J23j6K47n36J85J30k57J78K1k13R4o9P9K79n28
7762b48J05j18L07j49j03M8L73r0j89L44j57k03j4J74n0K36l31K14j03J48k53
7783e9J29J93l03J40j07J5k00R0j35L53J9k13J19m4J18J27j24m1j29J71j83k1
7805h5J81K4j92J35r9j09J68J5K25k03R5j09nL4J75k82k16M76k17k08Q5J10l0
7828c2J98j80R8l67L57N7L2k27K99k6m16J63J43k76K39j16K76k30K4P3p4j16j62
7851b63M99j82j1j48J42k12L39j6j13J0J46j0l4k39q3N9J87R5j27Q4j57j86L04
7874H4n2J44j50l7lq2L62M2l30l9M59l59j6M9J11k10J30J12l49J82J46j46l03
7897b55J51K54k74k90N63l61J65j33J50M6r7J6J46l41L34o9o0R0M3l02P5L87j92
$$ y = [3, 46, 294, 228, 18, -104, 35, 21, 16, -55, 35, 158, 142, 389, -147, 38, 168, -89, 89, 110, -103, -9, -78, 1, 280, -248, -143, -261, 46, -103, -206, -158, 215, 125, -64, 280, 123, -80, -94, 80, 30, 266, -65, 149, 46, 194, -59, 70, 263, -40, 100, -7, 8, -192, -102, -237, 116, 135, -78, 41, -3, 115, 242, 118, 77, -52, 119, -64, -85, 96, 120, -72, 63, -36, -145, 23, 38, 263, 60, 155, 46, 41, 75, 250, -32, -248, 228, 11, -197, -112, -2, -32, 166, -14, 84, -283, 74, 131, 163, -64, 235, 209, -207, -44, 99, -177, 62, -54, 222, -8, 16, 89, 15, -101, -263, 236, 54, 43, -105, 37, -175, 164, 148, 35, 45, 191, 181, 147, -92, -175, -116, 71, 166, 39, 123, -34, -220, 84, 32, 176, 26, -11, -14, -96, 266, 308, -22, -61, 398, 39, 23, 72, 183, -27, 103, 215, -134, 48, 194, 48, -255, -104, 150, -124, -414, 149, -212, -47, -180, -30, 16, -81, -65, 81, -260, 74, 5, -55, 35, 78, -224, -149, 238, 46]
7920D6N0k36J56j6K8M2P8%l20K01lo1J41q0O2p2j98K18mm3q3K16l0l52J76L28
7946B44k57J56R9k04j11L09j92k8J5r4k2O3J70m27L59k82J37K44k05o8R1k0j31
7969a54oK90l13J94j56L49j67N4j62k1L38m31M2M3J3L1k47K21J01l84M05n7r5
7992a12K54q5k3k81K02j79M05k03O8J06o2k33p9J06L05j63k5J94j44q8n6m1L03
8015A69k40n8J30NR4j20K24m09L91n39L12l3J72l56K71l9K87k04O2k12K05j47
8037c5j4M5Q1j62r7J84j13O3O9N8M1ql14J77q2R4J3j17J62j14N8K7j03J05J9J19
8063A56k08K53l31K52j63n0KK7k4J60r6kk90L99r7K90k82j3K60j94j02j00L69
8086B16k15j74L9J69l9K18j04r2j34O3k74Q1J93k39K03M7p2J41k0P3n2J04j09
$$ y = [46, 96, -140, 16, 0, 28, 70, 148, 148, -172, 29, 26, -35, 106, 26, 88, 16, -182, 36, 32, -11, -94, 122, 92, -260, -84, 244, -13, 143, 242, 38, -73, 236, 44, 16, 31, -63, -85, -22, 148, -279, 80, -202, -65, 179, -26, -94, -3, -23, -154, -160, 130, -183, 11, -145, 204, 37, 91, -71, -92, 246, -185, -143, -100, -87, -56, -303, -82, 19, -365, 40, -17, -112, 142, 57, 34, -247, -45, -224, 181, -22, 46, 152, 90, -143, -222, -116, 189, 26, 1, 195, 51, -37, -93, -134, 169, -71, -129, 1, 6, 100, -20, 204, -205, 186, -353, -41, -74, 98, -258, 13, -26, 261, 57, 119, -93, 112, -35, -49, -4, 77, -85, -182, 2, -111, -48, 21, 79, 120, 112, -202, -25, -107, -13, 0, -117, 45, -69, -11, 16, -87, 18, 37, 156, -52, 201, -130, 122, -41, -91, -89, -62, -86, 74, -22, -24, -314, 85, -12, 278, -4, -17, 243, 49, -53, -153, 216, 1, -173, -134, 35, -4, 214, 110, 18, -116, -53, -327, -246, -53, -292, -89, -42, -114, 27, 7, 80, 28, 132, 23]
8109B3N3J4j20kj29J9K90k89K45j50O8op9J33k06Q8J28l24J92K55m36p4O43l2
8133C04k68Nq5L14k97nJ91k63O0R5r2j0j6J56j3n9R3Qj15j45J04n3p9L03j69P0
8159C4j52K02j00K17j74j32K91k7q0l53K11K05k95P1J39j31j63K15R3j20P8K6
8181E5m5J60j43R1J73l97M19j20m00J30
$$ y = [23, 76, 90, -30, -32, -161, -142, 148, -141, 104, -46, 22, 16, -63, 70, -136, -48, 80, -244, -52, 203, -233, -307, 336, 304, 36, 41, -44, 270, -27, -32, 159, -104, -44, 51, -41, -51, -67, 89, 76, 17, 110, 118, 3, -142, -38, -91, -170, 133, -36, 34, -118, 84, -16, 201, 27, -105, 186, 159, 79, -274, -63, 142, -153, -82, 57, -74, -237, -22, 71, -49, 29, 55, 10, 170, 27, 118, 291, -106, 313, 193, -207, -77]
8191g7
$$ Imaginary data points
##PAGE= N=2
##DATA TABLE= (X++(I..I)), XYDATA
0@%%%%%%%%%%%%%%%%Kj0J6j6J6j6J7k5L2l2M0m8N1n9O9p7Q8j02J13j26J42j59
38h4J78k01K23k46K74l02L34l70M07m48M94n45N98o58P28q02Q86r83J091j217
58f43J364j537J746k003K328k752L335m186N544q032J3989n3525m4445J27757
72C8940o18k1577K006M302O064m1479J6753L9787o4984R827L2217k8772J2279
85D745o612L38J9036m7824J8671K6853m2266J7423J1654n593J4880l2439K2543
98A409K4741m4414J9321N227k4685K6877j0241K793J3953k6134K8819j459l6021
111a9814L0307n619o568J3054l1304K2442J3018k9671K6726p690j8492J7570j6810
124a2851J6896M262l2099K8181n202j3294L3236k1542m802J4794j7547K2042q422
$$ y = [0, 0, 0, 0, 0, 0, 0, 0, 0, 0, 0, 0, 0, 0, 0, 0, 0, 2, -8, 8, -8, 8, -8, 9, -16, 16, -16, 24, -24, 27, -32, 37, -40, 48, -54, 59, -67, 75, -84, 94, -107, 116, -130, 144, -158, 176, -194, 213, -235, 259, -286, 312, -346, 382, -420, 466, -517, 574, -643, 721, -816, 930, -1073, 1255, -1497, 1838, -2348, 3196, -4836, 9153, -44372, -88817, 38940, 38322, 16745, 18751, 23053, 29117, -12362, 4391, 44178, -20806, -10979, 21238, -7534, 4745, -1867, -1529, 17507, -30317, -11646, 15207, -27059, -9636, 2018, -3575, 11305, -21134, 1409, 26150, -18264, 1057, 6284, -18401, 8476, -1765, 1028, 14981, -11153, 17666, 16207, -19814, 10493, 4874, -1694, 11360, -19944, 2498, 15516, -14155, 12571, 4881, -13611, 3959, -12851, 4045, 8307, -23792, 4389, -813, -14107, 19129, -2413, -7215, 7579, -9968, 12074, 3652]
137C652j7788K9861j8134l142J7516k2733J6708l84j9907K5466j5279m824K3112
150A4124k1326R431O123j6555K1056j4867o203K2875k6264N178J3910j9187J6035
163D330p648p800K3666k0021K495J2424j8788J9226m757j3854K3182j4977J832
176f90J6625k2781J2458K523j5182J8672j4709k138J5076k2870J3424O356j9181
189a2417J8902r277n419J8149j9679P916P190j8628J8506o200q639J9004j6270
202f862O705R755j9912J8590j192j2999J6959j3316L102J1167j9325J3667r68
215E371j4799J7972j2481j693J2494j9260J1040M265j3762J6637r852l480J6755
228I207j6934P411N609j5678J7000o434o662J6833j5464N811R464j6488J3889
$$ y = [3652, -14136, 15725, -2409, -5551, 11965, -10768, 5940, 5556, -14351, 11115, -4164, -8988, 14124, -7202, 2229, 8352, -8203, 12853, -2014, -8217, 14658, -11606, -6428, 7482, -11705, 4330, -3318, -11118, 12548, -7473, -4978, 7446, -11342, 7884, 3127, -10727, 12455, -2522, -690, 15935, -6846, 5612, 8135, -7047, 11625, -3084, -5222, 9854, -13016, 408, 6764, -12417, 6485, -2792, -8211, 9938, -9741, -1825, 5365, -13263, 5243, -957, -9596, 9408, -6862, -157, 9598, -10314, 8276, 7084, -5915, 11044, -2272, 830, 11997, -7328, 6339, 5371, -9428, 8544, -3937, -5630, 6864, -12396, -1356, 2909, -10853, 5784, -4068, -7548, 9207, -7727, -316, 5293, -10385, 6615, 181, -6481, 10352, -5112, 699, 10163, -6325, 7564]
241G564m718q752J6772j4865J999J1022j7273J2125j115j1255J6434j2767o93
254e522J2737j6884J0152J716j2204J6597r774l227J4531j5130Q129L713j3642
267h808J6121o378n766J4763j3820N712O687j4866J3096m340q420J4732j2844
280d131K770Q226j5589J2246j618j0135J4797j1224j24J0798j4979J0110J266
293B413j1426J4861q604j542J1737j4233R237L680j2896J3924o210m200J2454
306I195j3793O099N583j3797J2597m745o451J3294j3357L477P738j4345J0575
319B070k010p407J3118j0691J436R350j3595R661J06r548J4014q865r47J1257
333G949j2782P605K845j0690J2385o921l592J1299j2656N241M664j2070J1693
$$ y = [7564, 2846, -5906, 10866, -3999, -2000, 9022, -8251, 3874, 2759, -8496, 7938, -4829, -5522, 7215, -9669, 483, 2199, -10005, 6592, -3182, -6409, 8122, -7008, 1121, 4834, -8808, 7313, 935, -4831, 9932, -3888, 1824, 8511, -6355, 6741, 2401, -6019, 8713, -4131, -1361, 6865, -8724, 3522, 1904, -8231, 6566, -4658, -4782, 6016, -8963, 1147, 2413, -9013, 5848, -2756, -4298, 7439, -6794, 2443, 6123, -6773, 7151, 941, -3259, 9195, -4598, 1501, 7084, -6713, 5884, 1139, -5312, 7982, -5375, -1898, 5840, -8505, 2070, 60, -7347, 5771, -4920, -3484, 5866, -7729, 1932, 2038, -7510, 6504, -2361, -3308, 7949, -4833, 2772, 5617, -5073, 7312, 391, -3201, 8098, -4558, 683, 5347, -6723, 4970]
346D970m793n920J1465j0978L270N619j1959J0761k855p421J3659r810J511Q052
360E571j2131R742o89q368J2557q134n81R382j1730Q115J257r991J1981o634l301
375b954R707j1509N232L239j0774J0967n009m400J0447j0559L980N515j1656J0359
389B585k207o028J1105r108K461O634j1174Q931n09p326J1162p836J7Q196j1157
404d254O981J145q107J0034o779j576Q636j0968N481K666r911R941m807l832R546
419D196r692L974M118q991R553l341m288J0824r576K404O267j0164Q153j027o056
434c646J0189p534L06O431j0238P410l19p614J0223o575j943Q655j0327M825J756
449A599q122R302m770k420Q404q710M454L693r065R193k915m569R178p177K161
$$ y = [4970, 177, -5743, 5722, -5256, -1986, 3633, -8326, 2435, -420, -7841, 5818, -3992, -2481, 5571, -6560, 3182, 2493, -5875, 6682, -1452, -2033, 7349, -4381, 3734, 4991, -5000, 6981, 347, -2954, 6753, -4756, 476, 3715, -7059, 3908, -1101, -5501, 4946, -5613, -1633, 3882, -7774, 2585, 378, -5650, 5455, -3653, -1192, 5442, -5732, 3199, 2690, -4636, 6526, -1310, -1293, 6903, -4254, 2727, 3872, -4235, 5799, -980, -2556, 6080, -4888, 593, 3259, -6652, 3289, -1518, -5350, 4196, -5496, -1522, 2596, -6395, 3158, -183, -4471, 6353, -3223, -819, 5448, -4716, 3437, 2410, -3646, 6543, -991, -685, 5746, -4492, 2918, 2599, -5015, 5208, -1367, -3310, 5345, -4982, -157, 1599, -6523, 2779, -1991, -4411, 3993, -4717, -263, 3430, -5635, 3558, 643, -3926, 5252, -1925, 236]
464B36M532q366P893k030n040Q809p874J028N972r886O147O52p299Q349n383q75
480c135O546r003N545J224p007R036m717j719Q535q965M385L989q324P233l140
495D83k699P433q531L188M155q697Q056k143m961Q577o490P06N603q217N086r13
511F36n291Q180o674kO284r133O136J615o865Q226m205j124O496o838M220J328
527B989o372Q044m127l136P730p564K746L316p492P019k282m547P570n757J185
542f78L571p628P065j491n980Q389o158m07O013o956M592R02n029P250m511l71
558a427O121q241M768K334o970P384l302k316O516o572K967K366p465O297k512
573e2l098O839p188K180M179p345N827q84m850O470m871J374M361o951N650J10
$$ y = [236, 4768, -3598, 4295, 2265, -2775, 6034, -1840, -812, 5160, -4726, 1421, 2073, -5226, 3123, -2260, -3135, 3411, -5592, -47, 1177, -5830, 3206, -1511, -3230, 5305, -3660, 725, 4714, -3610, 3623, 483, -2216, 5217, -3314, -126, 4029, -4668, 3388, 1245, -3716, 4861, -1629, -923, 4680, -3537, 1549, 636, -4655, 3525, -3149, -3151, 3133, -6000, 136, 1751, -5114, 3112, -1093, -2217, 4279, -2559, 1661, 2989, -3383, 4661, 534, -2602, 5128, -2436, 310, 3626, -3866, 3153, 871, -3676, 3894, -1863, -678, 2893, -4735, 2330, 839, -5141, 3248, -2910, -3317, 2696, -4260, 332, 1234, -3795, 3455, -1056, -1427, 4694, -3547, 1221, 3555, -3415, 3969, 667, -1649, 4867, -1705, 1262, 3628, -3837, 2460, -52, -3150, 3689, -3499, -1319, 2860, -4485, 1342, 458, -4392, 2078, -2793, -1419, 2942, -4009, 1641, 1751]
589A751m568P472m853j182N621p033L885J618n625O530l849j323O042p193L429
604G22J312o579P474l025l726O625n719J497L503n658N109k214k981P381n891
619b170J322M349p228N641K40m168O565m931o36M783o082M378k89n386O822l867
635f57j216N628p062L395J565n466N969k551k749N352n056L182J995o471O066
650A924j857l345O813n060R43L271n333N353q30l595N485m640N22M342o655M195
666A533k69m804O432l396j211M213o104L472J329n114N752l569j132N697n831
681c002K923K365n766N565j455k533N688n132J258L023m991M884j466l704O284
696C941m721o6M207o081L763k81l771N611m009n74M340n441L428O66m439N404
$$ y = [1751, -2817, 4655, -198, -1380, 4241, -2792, 1093, 2711, -2914, 3616, -233, -1556, 4486, -2707, 722, 2034, -4545, 2929, -96, -3822, 2803, -2916, -1419, 2084, -3574, 1535, -679, -3660, 3721, -2170, -848, 3501, -3727, 1914, 2154, -2014, 4551, -380, -1016, 3767, -2315, 2063, 1774, -3612, 3210, -657, -1873, 3755, -3307, 88, 1653, -3813, 2156, -395, -3144, 2208, -2848, 334, 2329, -4142, 1924, 67, -3278, 3535, -1525, -582, 2689, -2644, 2709, 1879, -1716, 3769, -871, -349, 3993, -2662, 1533, 1264, -3540, 2892, -504, -1715, 2498, -3606, -134, 1195, -3919, 1833, -1736, -2868, 2829, -3002, -79, 2286, -3480, 2085, 630, -1903, 3785, -1347, -89, 2934, -2057, 2827, 1361, -2343, 3941, -780, -846, 3361, -2720, 1043, 762, -3009, 2602, -1407, -1981, 2359, -3082, 346, 1012, -3427, 1977]
712A977l211j432N279m750K376J486m707N399k263j648N197m858J552K766n476
727b313M961j291l692N423m336P00K756n385M190m10l617N323m012J80L915n902
743c510L823P43m295N309k718j071M417m708K873J120m533N664k711j447M619
758C575n056J946K185n024M399j743k412M675m347J098K930n040L667k72l337
773b756M752l948K81L865n104L195N54l337M931l165j84L965m953L012P96l931
789b027M854k655j467M450m722K039J484m482M363k069k253M915m638J499K368
804A659m479L818p48l067M996l898M41L176m425L504k4l158M999k973k51L706
820C276m654K535N49l751M536k446j115L965m363J877J477m617M175k010k048
$$ y = [1977, -1234, -2666, 2613, -2137, 239, 1725, -2982, 2417, 154, -1494, 3703, -1155, 397, 3163, -2313, 2648, 1357, -2335, 3088, -1248, -548, 2208, -3177, 1013, 603, -3014, 2309, -1703, -1523, 2392, -3510, 313, 1056, -3239, 2070, -648, -1719, 2698, -2010, 863, 1983, -2550, 3114, 403, -1044, 3575, -1481, 465, 2650, -2374, 2025, 282, -2130, 2545, -1802, -704, 2226, -2814, 853, 581, -2756, 1996, -1952, -1671, 2194, -2910, 285, 839, -2498, 2433, -732, -916, 3049, -1904, 1108, 1904, -2027, 2827, 172, -1295, 3155, -1567, 472, 1956, -2526, 1837, -232, -2485, 2430, -2208, -709, 1659, -2820, 998, 250, -2817, 2179, -1719, -1278, 1898, -2527, 977, 953, -2205, 2794, -179, -430, 3276, -1378, 1157, 1706, -2045, 2491, 45, -1070, 2895, -1468, 409, 1886, -2731, 1444, -566, -2614]
835b614M099l712J625J888m178M005p48k661M835l770O03K746m668L715P8k882
851a639M543k892j5L007m791K906K92l786M735k729p65L484m263K038J388m235
867b722M253k146j398L911m256J551K329m047M090j104k486M450l840R23K633
882B141m247L634n28k728M357k862N5K903m409K604J49l274L980k674m59L236
898A878m068K341N73l147L958k259j069L675l821J752J394l268L558j227k103
913a833M346l670J026J918l861L867j019k277L945k701R2K567m353L053n09k880
929b289L402k476jK700m007K968N78l311L960j954q39L071l545J879J466l565
945a963L691j440j130L415l620J163J837l547K993j009j763L608k953L68K503
$$ y = [-2614, 1485, -2227, -602, 1286, -2892, 1113, 365, -2296, 2539, -1231, -628, 2118, -2550, 1165, 1243, -1639, 2904, 12, -3, 3004, -1787, 1119, 1411, -2375, 2360, -369, -1134, 2350, -1913, 125, 1513, -2722, 1531, -615, -2013, 1898, -2358, -807, 1522, -2525, 1565, 461, -2025, 2425, -1415, -492, 2141, -2106, 1528, 1000, -1728, 2629, -233, -178, 2725, -1684, 920, 1069, -2205, 1775, -899, -1358, 1878, -2190, 151, 724, -2423, 1535, -724, -1793, 1882, -1939, -187, 1207, -2061, 1497, 270, -1833, 2513, -1157, -131, 1787, -2074, 1793, 774, -1503, 2442, -259, -167, 2400, -1953, 1100, 591, -2289, 1113, -1363, -1364, 1336, -2671, 297, 875, -2436, 1524, -430, -1269, 1802, -1743, 136, 1602, -1963, 1728, 288, -842, 2573, -1047, 116, 1953, -1594, 1399, 390, -1373, 2235, -718, -350, 2153]
960B153m093K902o31k391L754l279L96K472l599K645K22k443L454k159k80K740
976A863l467K330N89k869L880j727j436L070l048R57J357l176L332j867j105L401
992B084l504R21J913l509L082p31k459L173k373O41J707k982K908k89k322L704
1008A964k446j92K537l207K214L62k579K848j515n79K711l343J803Q11l365L381
1024A405j167j887L240l161J013J566k963K664r08j601L370k988R80K019l385
1039a803K633R9k326L316k287r0K286k742K034j71k143L036k128k66K577l236
1055a211J484Q25k672K417j265r43K711k908J392R93k977K966j040j463L386k919
1071a224Q61J688k847K726n67j612K800k303N22J806l178K324m27k134L182j726
$$ y = [2153, -1940, 962, 331, -2060, 1694, -1585, -1189, 1283, -2316, 329, 551, -1892, 1562, -597, -877, 1863, -1604, 726, 1315, -1554, 2326, 599, -837, 2233, -815, 142, 1499, -1677, 1655, -212, -1317, 2084, -1420, -499, 1414, -2095, 987, 256, -2203, 970, -1403, -762, 945, -2037, 871, 582, -1740, 1964, -482, -674, 1863, -1344, 870, 1232, -1347, 1501, -14, -593, 2118, -1225, 578, 1389, -1976, 1405, 238, -1649, 1591, -1570, -557, 1009, -1954, 710, -198, -1799, 1571, -1417, -437, 1582, -1803, 830, 929, -1397, 1919, -368, -458, 1828, -914, 1120, 949, -1194, 1842, -286, -552, 2025, -1211, 273, 1098, -1574, 843, -422, -1365, 1346, -1562, -170, 823, -2154, 812, -228, -1691, 1695, -1224, -363, 1325, -1522, 1204, 637, -975, 1825, -478, 44, 1850, -1328, 996, 569, -1565, 1617, -109]
1087a09n49K009k905J887J37k221K811j762n54L149l405J393J052k664K715r18
1103F6j220K526k476R82J564k919K759r35j406K726k070J96K023l250K030K95
1119H91k087K442j818j53J981k928K120j03k028K552j391n88K619k806J114R04
1135G21k189K582j187q04K534k559J047J405k763K315p41j194K600k249K04J445
1151A167k292K012n64j720K692j993J30J901k756J513K72k198K746j454m14J933
1167I75k238J449L38j847K594j257r06K658k462J006Q16k190K062n80j127K133
1183A424k287R10R14k361K150o17j505K414j902K81J637k596J775R1j653K252
1199I27j566j00J904k488J804N55k200K399r17p93K011k325R94O20j795K048r65
$$ y = [-109, -658, 1351, -1554, 333, 470, -1751, 1060, -702, -1256, 1893, -1512, -119, 933, -1731, 984, 66, -1154, 1372, -1104, -122, 1442, -1477, 1282, 347, -1059, 1667, -403, -207, 1816, -1434, 596, 891, -1196, 1246, -572, -725, 1256, -1672, 448, 345, -1683, 869, -522, -1110, 1509, -1297, -183, 721, -1468, 1114, -73, -877, 1657, -902, 145, 1550, -1213, 1102, 361, -833, 1767, -482, -278, 1167, -1125, 887, 323, -1397, 1295, -698, -568, 1333, -1423, 90, 362, -1836, 910, -544, -958, 975, -1263, 186, 524, -1323, 1271, 14, -892, 1766, -696, 310, 1126, -1064, 998, 418, -709, 1424, -863, 47, 961, -1400, 750, 133, -1372, 1042, -860, -579, 1058, -1538, 237, 328, -1325, 927, -639, -739, 1165, -1323, 481, 1036, -1164, 1235, 318, -475, 1536, -789, 205, 825, -970, 1078, 113]
1216A13j240K589k476P22J330k306J951q09r64K149k182N54J564k674K094k18
1232A97j245K425j732L4J303j968J293M46j709K074j603J07J852k596J298P67
1248I43k226K027o78j049K068j928P69N25j955K304j211r63K327j860O81J134
1264I08j826J595k47j411K175j539K93J329k220J715k76j335K023j578J21J292
1280A019j858J034K52j689K433j264p84J631j981J030O29j637J593o25p15J946
1296A014j772O50J003j761J826p17j069J978j485L54R85j798J208K25j521J900
1312A020j607M05J072j765J057O5j234J777j408k00J504j700J201J01j710J853
1328D31p80m62J808j682P86P52j619J803p48q66J814j493K02J203k040J546m86
$$ y = [113, -1127, 1462, -1014, -292, 1038, -1268, 683, -126, -1090, 1059, -1123, -569, 995, -1679, 415, 197, -1048, 1377, -355, -321, 982, -986, 307, 753, -956, 1118, -485, -378, 1474, -1122, 176, 943, -1283, 744, 66, -983, 1085, -843, -74, 451, -1504, 800, -411, -1374, 953, -907, -226, 908, -918, 677, 430, -981, 1194, -345, -52, 1277, -943, 772, 496, -839, 1184, -394, -273, 1019, -839, 195, 447, -1242, 1191, -73, -857, 774, -1207, -177, 452, -1185, 408, -217, -932, 1014, -758, -108, 895, -866, 960, 243, -826, 1152, -333, 21, 1006, -792, 416, 641, -880, 1020, -587, -182, 890, -875, 182, 247, -987, 790, -618, -818, 686, -1014, 187, 288, -1422, 431, -349, -811, 997, -685, 101, 853, -766, 1037, 289, -577, 1237, -256, -54, 1149, -891, 655, 169]
1345A69j212K141j703o5J167j321J299m39j188J856j460L04J426j752R56L08j585
1362a099K081j000o40J715j844J057M61j585J658o72o05J647j382K09P09j935
1378a225J884m57j079J830j607J71J244j950J519J25j449J605j089KJ236j899
1394a139J201O5r12J749j013n61J784j670P24M74j503J513n08n75J142j155M43
1411E9N66j653J614o89o39J494j456L23Q39j585J522k83j048J831j367K78J101
1428I07j671J151j13j270J955j014l6R97j360J001l84j126J636q30l22J133j049
1445c95L43M99j472J669o53q28J567j259J22P64j285J364m60p43J525j307M27
1462a22Q30j358J154L1j140J545j195Q1R75j243P81J10j300J513o85l80J126j652
$$ y = [169, -1043, 1098, -605, -670, 497, -824, 475, 36, -1152, 704, -756, -452, 974, -778, 178, 486, -1099, 982, -18, -658, 1057, -787, 270, 731, -854, 804, 132, -473, 1174, -208, 1, 710, -1225, 659, 202, -877, 953, -654, -483, 761, -1189, 330, 455, -994, 611, -478, -476, 760, -1139, 62, 127, -785, 964, -49, -610, 1174, -496, 228, 702, -801, 712, 204, -371, 771, -384, 59, 625, -1028, 586, -103, -742, 752, -704, -381, 458, -1127, 395, 112, -936, 895, -472, -194, 907, -764, 387, 274, -996, 959, -55, -91, 906, -454, 547, 163, -963, 673, -157, -479, 654, -395, -52, 447, -1025, 644, -9, -837, 730, -529, -407, 357, -928, 436, -24, -767, 758, -549, -122, 708, -650, 504, 535, -605, 940, -255, -174, 801, -442, 339, 449, -851, 662, -23, -403, 723, -929]
1480i29J030O7j102J508j059j85J534j696O40Q45j584J212j22p21J476j168O77
1497D23L24j297J069k78p88J408j026J88P90j485Q54N45j304R95r35J66J105j665
1515i11Q64J69r69J257q29n6R91j275P67N67j237J210m65n01J107r86M40N28j396
1534g25J122j74p35J230j127M46N34j093O67M5j089J568j210K84Q54j224O21K89
1552B83j023J263o22m65J134r72O64J61j112J311m13o68J206j207O35K93r36J018
1570E50k41q36J052r45L56P74j444J110l51r63J302p99J8R61j135Q53N9j165J477
1589F33q04j65J007j090M40N56j059J220l83l77R27j220l8P15j219J432p93m00
1607f18J588j434M27M35j024P07L5q33J050n86K23N52j226Q87r8q17J239q86L48
$$ y = [-929, 101, 168, -934, 574, -485, -670, 864, -832, -192, 653, -931, 281, 159, -562, 914, -254, 423, 747, -550, 519, 241, -547, 861, -165, 23, 813, -672, 182, 727, -577, 418, -517, -351, 754, -911, -47, 122, -847, 410, -419, -475, 516, -759, 8, 575, -662, 548, 83, -418, 689, -297, 143, 671, -725, 397, 223, -512, 718, -409, 37, 571, -522, 145, 190, -899, 669, -541, -257, 597, -627, -6, 283, -740, 523, -99, -564, 570, -402, 262, 423, -689, 622, 209, -459, 747, -460, 175, 468, -468, 550, 309, -527, 525, -420, -64, 710, -734, 376, 25, -938, 364, -435, -417, 544, -591, 262, 321, -844, 633, -171, -336, 671, -419, 21, 577, -482, 738, 355, -22, 905, -315, -353, 362, -857, 575, -218, -618, 970, -464, -37, 398, -626, 81, 116, -717, 333, -253, -30, 522, -704, 183, 85, -732, 507, -379, -31]
1626c1O67j058R00k55q62J248l56m88J133j136M61J82j019J115o38k61Q45j242
1644g95O74L11j017R95J9r32J148r72M32O30j154J016k88l97R26r85K49J061j219
1663b98O09J97j052J146o07k31O40j039O49J76q30J259n41m89O20r54N06O69j208
1682g78R90l36n48R15m27K57L67r98R33k68m11Q39q99L94O04j036P84j29n60P52
1702D45o07K07L47j104Q78o7p23R53p51J34O10q71M55L10r08J090m84k36J024
1721G02q62K32O52j055P19l40l69J035p31J9P27r64O06j75n89P56o48p1P33r96
1741f19N13K19p20J038o89P9K39k96L92p8q82J169k66k46P03q56M06K94m48M37
1761C89k48n38Q76o90K13K51p74Q10j84o09R99q77lQ17q72J04L92m04O25m19k03
$$ y = [-31, 636, -422, 478, 223, -639, 609, 253, -235, 898, -238, 223, 405, -614, 501, -137, -398, 447, -795, -121, 190, -827, 168, 187, -745, 403, -569, -137, 493, -661, 355, 67, -330, 596, -389, -140, 921, -298, 311, 508, -544, 602, -5, -236, 404, -635, 14, 190, -640, 619, 78, -411, 209, -745, -239, 430, -778, 212, -124, -672, 243, -184, 73, 440, -558, 375, 107, -304, 535, -364, 30, 634, -402, 382, 253, -307, 445, -162, 45, 392, -712, 166, 99, -624, 329, -422, -288, 322, -549, -94, 216, -692, 398, -86, -322, 702, -160, 72, 724, -331, 388, 48, -321, 714, -17, 2, 729, -235, 371, 196, -393, 363, -285, -356, 377, -619, -106, 113, -607, 431, -258, -179, 60, -236, 156, 78, -804, 365, 99, -147, 556, -300, 106, 400, -48, 389, 141, -397, 479, -211, 2, 253, -521, 289, 105, -504, 495, -382, -385, 432, -440, -336, 56, -348, 277, -142, -345]
1782c45P34q89N07K60m73N84m95l17P73n97M97K56m44M33o09K8N61q08L01K14
1802A71p12N95l48j60J006j076N70K28r29P82j31l96R88o30l62J003r57M43K26
1821C11n05P25m70M2M34p91N22r6n92Q41m82k93P57q28K97M68q57P63j95p39J103
1842D15n88j30O13n65M22J06o23Q35q06K15L27m57K93K53m67M46n80L65L67r56
1862e15P23q6n13N40p7k76O49j027O31J70r43J099k55l82N75p13M06M18q80O45
1882A89j19l72Q00o42P3K73n11N56j2n80Q87m86k11N88j009O98K60q46Q64n90
1902a90p6O36q17L15K28m29O41m85k76N67m05L12K93m77N37j88m84O70l94N2L93
1923D23q16O64Pp55Q87m65j52L45n37J92K45n66O53k11j3J73n82N51k68k05Q54
$$ y = [-345, 389, -500, 7, 267, -206, 378, -117, -434, 339, -258, 239, 495, 51, 484, -125, -97, 464, -344, -43, 171, -541, 54, -294, -454, 552, -524, 46, 274, -655, 127, -4, -400, 588, -42, -404, 599, -358, 85, 311, -194, 531, 61, 103, 537, -254, 268, 172, -420, 421, -61, -354, 403, -425, -128, 340, -517, 246, 51, -688, 415, -173, -303, 310, -255, 167, 273, -350, 485, -321, -106, 221, -236, 57, 310, -157, 289, -291, 74, 441, -515, 208, 122, -391, 149, 72, -204, 445, -582, 49, 219, -724, 375, 120, -262, 313, -400, 6, 424, -456, 189, 70, -302, 498, -144, -71, 202, -309, 247, 235, -345, 542, 56, -155, 433, -576, 122, 382, -464, 400, -190, -266, 370, -447, -132, 96, -333, 308, -177, -453, 114, -291, 21, 314, -163, 374, 186, -298, 372, -22, 30, 423, -393, 271, 278, -477, 410, -55, -207, 138, -399, -207, 38, -528, 125, -86, -99, 74, -508, 43, -225, -430, 424]
1944D24n82J51N22o25K28L27p30N26K84r18P34l34j00L04n58M22r2m77P43o10
1964c61K44N82j171P52q8l89R85p96k35N22n95Q34n3p71P21k16j42N83m34NP10
1985F87j088R78m65m43R72o88K22L25p82N89m12l37P98o83K24M03q68M81J09n39
2005e17Q26l43k04O21n10m1N34o14P09n30l24R37q81N91J55l95M14o17k98R76
2025D89o16P8N01p21N76m45k54O04n36N6L49o96P94N0l49N14l44j35K42n74N56
2046A39Q9p15R52n78j25P26j010M97N18r15L80j11q0O15n63J11K39o54J060p12
2066a37k18N30q38P27J70o56N92l06J4N06o36J25L89l98O29m81k68O99l59m37
2086c53N19l60J48J30n36N39k58j56P52p30M15O3n33N89l35j25L99l60l7P06r58
$$ y = [424, -158, -7, 515, -110, 118, 445, -285, 241, 525, -393, 341, 7, -93, 211, -347, 75, -17, -494, 249, -361, -117, 465, -706, 46, -42, -431, 554, -242, -477, 45, -550, 284, 231, -540, 181, -35, -177, 406, -28, -23, 687, -401, 577, 112, -331, 641, -47, 175, 500, -282, 307, -105, -442, 356, -327, -103, 300, -568, -87, 22, -517, 309, -34, -238, 383, -127, -168, 366, -248, 461, -69, -393, 544, -337, 254, 409, 14, 428, -189, -487, 489, -127, -49, 452, -269, 307, -138, -392, 212, -324, -268, 81, -615, 179, 229, -120, 394, 50, -85, 157, -417, 139, 228, -487, 465, -113, -238, 488, -522, -25, 493, -422, -42, -153, -233, 382, -181, -70, 169, -485, 575, -137, -355, 175, -663, 64, 234, -422, 170, -136, -122, 384, -252, -127, 262, -136, 493, 12, -256, 443, 84, -353, 166, -194, -46, 84, -452, 87, -171, -327, 425, -305, 110, 173, -360, 229, -106, -231, 168, -192, -229, 477, -481]
2107d81P17j01l22M30l43P4M20o13L80n2j79O46o02j69L82m33O48k98n66O31l53
2128a84k52Q58o09K7K83m43O34l70o54J146q38K84K49k30N26m36oL36o78L20M01
2149C64m25K29l6m06O06l63J7J26l35K49J85n07M12l23K06L05o18M14M9k44K08
2170A13N7l74O32l83l9K76n42N77k43k31L14k19R0L37p53M93j57l80P64o23J99
2191i2p6j13M40j73n80O28j68j89M98n40O15l4o18Q58m83J33J88l09K09L27n61
2212d0K65j39k32N24m27K64Q5p49N23k28k42M86m02L4N02m84N93l6n65N12k08
2233C6j0K76o58L56J58l02M61l00O0N13r58O83J63o30K92r7k70N24k41j28L23
2254B51m95N09j50l78L18m07R1O71o75K92m4k37N09l55J2M41q18O12j45j73O44
$$ y = [-481, 236, 135, -187, 243, -100, -26, 394, -219, 161, 109, -70, 576, -26, -195, 187, -246, 402, 104, -462, 169, -184, -436, 422, -187, -160, 123, -320, 314, -56, -710, 436, -402, -118, 131, -99, 427, -9, -15, 321, -357, -37, 364, -61, 168, 132, -274, 332, -31, -14, 112, -223, 26, 211, -296, 116, -207, -1, 304, -314, 100, 149, -95, 113, 170, -204, 428, 45, 6, 282, -260, 317, 74, -157, 157, -62, 28, 365, -388, 105, -52, -432, 332, -291, -92, -168, -281, 159, -14, -594, 34, -134, -323, 175, -365, 250, 216, -402, 456, -27, 106, 294, -15, 194, 521, -40, 225, 86, -146, 378, -49, 215, 300, -449, 74, -154, -396, 90, -312, -278, 224, -260, 333, 297, -268, 244, 36, 26, 302, -356, 0, 158, -144, 317, 17, 77, 590, -368, 315, 478, -152, 140, 43, -227, 297, 56, -72, 251, -244, 265, 115, -263, 55, -352, -261, 410, -265, 27, -17, -254, 255, -100, -88, 353, -465, 147, 2, -171, 473]
2275D73m52j82N02l07j02J79k54N19m39M3K67p81O37j01m19O11l32L3L04o44K96
2296a49L25m41N42j39n77O07l62q8O01n66L79q3j66L98k98j08O13p01K71p2j2
2317b6K26l48k38O19m48K87J11p18O38L1m45K10k29K04M21m67L31N9k15L23n66
2338b40L09J36m16L15L1l49N32m89J56K12m65L72J39l97L96l49m17O36l60J12
2358a36J53l44N94k83j91K96k77K52P9l85K78K50m39M77n55K68R0o9J20j77j01
2379a00M15m72J60M33n42J28K03m44L27o0k5J20m71K34K45m53L89j57k16N58k49
2400B3MK21m40K98Q8j92J4j28K53O4q30O12J02m59L27k29K4M41l44L05Qn19P06
2423C49n05n6J86l54N26K27o52L00j26k29L75kQ7J04k87K05j6l65O63m05N9j08
$$ y = [473, 21, -161, 341, 34, -68, 111, -143, 376, -63, -20, 247, -534, 103, 2, -417, 194, -138, -105, 199, -445, -149, 176, -265, 277, 138, -439, 168, -194, -282, 319, -247, 132, 49, -117, 281, -17, -125, 488, -213, 58, -14, -26, 200, -148, -386, 233, -215, 72, 183, -535, 103, 134, -311, -101, -330, -126, 295, -172, 159, 218, 3, 326, -240, 69, 205, -211, 104, 135, -214, 318, -171, -15, 197, -268, 104, 243, -154, 242, -107, -524, 112, -248, -136, 17, -327, 267, -16, -207, 89, -188, 64, 143, -242, 36, 286, -153, 324, -231, 37, 127, 58, 178, 1, -100, 315, -157, 3, 436, -106, 22, 225, -219, 108, 48, 23, 143, -328, -94, 151, -302, 87, -70, -286, 272, 23, 27, 248, -192, 106, 194, 2, 16, -112, 141, 205, -625, -13, 89, -370, -43, -272, -248, 193, -151, 154, 162, -357, 349, -156, -212, -26, -380, 146, 373, -279, 21, -105, -334, 41, 39, 126, 230, -57, 148, 132, -233, 430, 25, 84, -24]
2445b4l65P29j86k12O2l17J85J48l0lJ86m16M07l03L15j24k69L20J97m20L68j79
2467F9j72L08m83L74J67m70K80k00L6M08k25k55L49k99J97N0j13J68m25K99J72
2488B35q53N05l7k99P97l11O3R5n01M74j57J6Q8o8k05L67k40j73L12l56N08k01
2510E9o6J85j76j74J87P5l42N6l4M18l75J34J10m41N45o6j98L22j91q6K55j48
2532D9m7K03m01K03o4L1O3j38J04Qk12M38m96O3L06m14K41J82l42J32P2P5J16
2555A72m78K94m8m6K33j22n7J8j86K62N3o1l0K64l50L63n42L54L72o25K52r3j80
2578a81K65L9m86O15n15M41K26q91O01j71j69M45m9j21R3k43K40k29J77m9k21
2599a83L34j61o3J43p5N0K18l99J58K72m37J45K23l24K40j59j75J19k34L14J53
$$ y = [-24, -389, 340, 154, -58, 4, -313, -128, 20, -10, -13, 173, -243, 164, -139, 176, 52, -217, 103, 300, -120, 248, 69, -103, 205, -278, 96, 263, -207, 73, -127, -91, 317, 92, -163, 186, -113, 84, 134, 21, 189, -236, 63, 235, -618, -113, -150, -449, 348, 37, 100, 195, -306, 168, 11, 27, 115, 47, -158, 209, -31, -204, 108, -248, 260, 59, -7, 178, 2, -172, 15, 90, -252, -196, -230, 188, -187, -53, 57, -384, 161, 95, -103, 219, 28, -58, 197, 49, 2, 205, -196, 7, -57, -26, 37, -101, 3, 11, -201, 237, -259, -196, 110, -304, -63, 119, -223, -91, -19, 56, 172, -306, -12, -60, -106, 127, 5, -52, -34, -220, 42, 95, 34, 4, 268, -82, 281, -261, 93, 465, -160, 92, -1, -181, 84, 123, -363, 252, -263, 178, 404, -487, 114, -57, -226, 219, 170, 49, 142, -101, 139, -90, 87, 38, -183, 151, -10, -73, 70, -5, 45, 263, -136, 22, 294, -143, 2, 225, -99, 141, -18, -193, -74, -308, 6, 159]
2620A59m38K97r5n7K76j51J13J35k90L53j80j16J1j92J65K44j11J40k99J90k4
2641A30r8j18K93k71K65j85r8J04j90k38M18l55M04O0j05j41J81j36L00k75k48
2662c03L94k95K17J81L0j06m33J78K22k76M40m37J71R8j69k2L05l36O1K3l1K46
2684A58k87O3K74l42K18J24m57M36j88j81K75k70J64K71l06K9n3J40j01j48J13
2705f8k8j42L31j50p4K36j73J42R1n2j87K34l04M17l82Q2K6j99K77j24j95K24
2727a8N2j0P6j69oO3j85M09l47K46k11J40p4N9r1q1O5K5QK5j6n9l12L11J58j05
2753d7J98k79J30j04j26J17L93j67RN0o6J27k51K00k31j30K02k05J04m6k90J58
2775b54L04k51J67j54N1M58n68K98J39p48P69j86j27L50j72j60J08l20L25J62
$$ y = [159, -279, 18, -77, -134, 142, -9, 104, 239, -51, 302, 122, 6, 17, -175, -10, 234, 123, 263, -36, 154, 130, 32, -86, 207, -64, 201, 16, -82, 22, -168, -406, 12, -343, 61, 121, 16, -125, 56, -80, 220, -55, -303, 91, -204, 13, 194, 224, 118, -315, -137, 85, -191, 249, -188, -17, 81, -88, -110, 195, -141, -80, -57, -88, 158, -129, -66, 208, -134, 84, 208, -249, 187, -1, -182, 93, -177, -13, 258, -48, -19, -72, 68, -33, -181, -68, -96, -238, 93, -57, -131, 105, -68, 74, 165, 113, -74, 160, -144, 273, -109, -27, -1, -200, 77, -47, -242, -18, 34, 24, 100, -69, -75, -12, -197, 212, -135, 111, -100, 40, -34, 25, -66, -147, -82, -57, -49, -24, -40, -99, -411, -100, 58, -47, 151, -128, 2, -102, -228, -111, 282, 115, 124, 174, 108, 235, -16, 184, -47, -177, 25, -180, -76, -122, -412, -254, 50, -201, -34, -188, -137, 321, -247, 51, 190, -558, 211, 25, -102, 248, 76, -84, 24, -296, 29, 191]
2795A91k90L88o3k71L0j34J41P7k30K60p9J9K74k36Rj0q4J10m7r4K3j72J57J81
2819A50m26K50K89j65J81k59j75K68k2K0mr1m9j49J77K08k32p0k9j60J11q7j5
2842b79M90j41R3P6l57O10l91j13L4J90k46J4k87L70j89j82N70k33L3j18M1j3
2864b8nj14L58k98K1K53m49L30P3q7j70j52K19J12k21J44N14n28J47j51J76l13
2886a69K51j08P5k07J61J6l6nm0L5J20k36J38p9m2L13k8j22L2m16N34j67j43K75
2910A52j62l08L38P6l07L68m71M60j24k31L71k65J6J70j06NR9j82J98j01n1j15
2932a70L9oQ9J20j5k79J74R0k60J40J3RJ43N4l61M33k64M6L3j66J94N2k46L83
2956B45j42k88J10m7j0L12k42L25j53kj21K7J19N8k51K3Jj46L33j59J75k89m3
$$ y = [191, -99, 289, 226, -45, -15, -149, -8, 69, -161, 99, 20, 39, 313, 77, 86, 76, -8, 102, 55, -39, -16, -188, -31, 150, -276, -26, 263, 98, 279, 20, -155, 113, 91, 111, 107, 16, -33, -182, -5, 203, -29, -99, -128, -288, -177, -264, -279, 211, 70, 163, 239, -118, 492, 101, -12, 22, 212, -34, -20, -307, 63, -126, -308, 262, 29, 62, -56, -15, -28, -33, -147, 211, -87, -66, 187, -262, 68, 141, 54, -116, -268, -49, 63, -158, -14, 500, -28, 119, -32, 144, -169, 82, -26, 49, -158, 3, 19, -17, -22, -62, -27, 93, -143, -5, -84, -126, 187, 159, 37, 69, -347, 187, 20, -123, 152, -10, -318, 20, 96, -211, 157, -314, 146, 22, -209, 162, -103, -87, 83, -23, -18, 81, -101, 97, -4, -55, -170, -131, -137, -48, 72, 57, -222, -48, 42, -218, -78, -65, -56, 87, 141, -220, 213, -51, -5, 28, -138, 56, 108, -138, 245, 103, -185, -75, -122, -132, 180, -62, 263, 110, 108, -13, 14, 133, 191, -60, -37, -36, -182, 151, -8, 167, -122, -165]
2979a65M19n00K02L86m88K32O9k19J89Ok05K38m30L12r8J23K05l08KRq5J15J88
3002A97l85J56L00j96p4j79rL43l03L5N4P7K27l83O3OQ9J29j05m13M21k23K77
3025A04j48R5J1K8k15K89o3k08J7j2jL3j79M11J22l20L14m51QK26m09K19L43l91
3049a77K98N7k33R8p2K66k02j94K62l6p9K89k70L5j6m45M30j84M8L18k78k48P06
3072C73o73K63j05r3N18m28L12j32j52NR6j50M9P0j65L45k61L36l9l76L61j54
3094@k5J56l30L27j60j83K00j89o8M51l27J50J23n9Kj91k0K05n9n5M32m63k25
3117c08J62J55L29m52O5N16n83L5J74l48K32j2j94L65k08P8pn4J92j13j29K2j20
3140b03M15J08j52J24l4l46j22P0N8J12m43M03J44k08K42k75J48J88l42K62o5
$$ y = [-165, 254, -246, -44, 342, -146, 86, 155, -64, 125, 131, -74, 164, -266, 46, -52, 71, 276, -32, -30, -21, -106, 9, 197, -188, -32, 268, 72, -2, -181, -190, 153, -150, -115, -61, 16, 243, -140, -77, -71, 18, 147, 42, -371, 50, -173, 104, -44, 51, 62, 90, -125, 164, 101, -107, -90, -102, -103, -70, -249, 162, 284, -36, 278, -173, -165, 61, -348, -129, 214, -177, 121, 178, -55, 43, -29, 237, 35, -159, 103, 67, -12, 277, 7, 42, 26, -419, 11, -173, -125, 193, -85, -333, 373, -300, -37, -142, -235, 283, -145, 167, 35, -117, -112, -16, -166, -117, -47, -212, 133, -128, 208, 169, -207, 154, 0, -25, 131, -199, 128, -32, -215, -15, -204, -272, 179, -148, 2, 125, 66, 68, -123, -143, 62, 3, -52, 380, -83, -308, -146, 9, 338, -114, -49, 467, -116, -81, 93, -255, -23, -35, -229, 136, -72, 6, -1, -55, 137, 24, -105, -83, -203, 212, 320, 168, 292, 258, -88, -210, -140, -82, 30, -413, -10, 134, -74, 168, -107, 41, 229, -113, 149, 84]
3161H4m4J45k31J57j16j18J33rm08K96o2lL03j59L9J35j92L35l07l05K61l2n9
3184a57lj20M34J13m44L69j43j48L11l00J78j12p0J9mk82M68k71JO8k3J64j7k52
3208b21M94l68J22j07J21K3j90N2j26J84r1L22l45K16j81R0J05k15J73R5k99M61
3230C15j97k26K21P1j02M3k00l1n2r5L09%n9M6j20MK32l08K54j54k9K35l83j9
3254b45M94n23M93l6j20P2m2j78n2k3J42O7j73K54k60j30L09R3k07L21j25k05
3276g4k4k36L48J2J07mj51J52k58L3K21M9k08l5k08J93J48m12J90K35k44K17N2
3299A03k12J20j90L86l84Q4J43j57J64k08RN0j67K84J26k7K88l03l43L90k66J15
3321EM60n97J36J07j71L55m72K22R9j63O9M8k96L91l51J87J41ol03K88P8k72P1
$$ y = [84, 40, 185, -46, 111, -5, -123, 10, 1, -407, -111, -173, -176, 127, -32, 7, 142, -50, 285, -22, -327, -66, -98, -157, -160, -280, 154, 267, -177, 192, 49, -99, 212, -88, 90, -22, -92, -73, -77, -359, 109, -162, -161, -93, -116, 48, 31, -221, 273, -95, 27, -80, 41, 64, -126, -74, -200, -16, -107, 215, -130, 86, -95, -5, 100, -115, 58, 153, -146, 315, 118, -108, 113, 184, 82, 125, -75, -106, -158, -253, 56, 56, -3, 43, -77, -73, 159, -149, 105, -49, -78, 157, -226, -245, 249, -274, 219, 183, 63, 135, 93, -85, -137, -160, -18, 49, -124, 130, -130, -260, 49, 142, -65, 256, 131, -74, -98, -334, 14, 26, 133, 129, -22, 130, -128, -95, 126, 175, -33, -68, -276, -83, 65, -347, -157, 78, -166, 51, 103, -109, 11, -179, 207, -177, -93, 50, -107, 57, -151, -142, -92, -259, 25, 151, 124, 412, 109, -234, 156, -110, 5, 465, -132, 4, 111, -60, 295, -177, 45, 144, -19, 50, 98, -198, 193, -158, 29, 170, 164, -139, 149, 227, -45, 26]
3344B6o3j1k9Q0J12j43R4k47O3K53k75P7K54l91R8L62k63l8J41j43K20R0l59K13
3368A21k98M05k84Q5J57K5j78J88l68J56k2j38J93k33J02J72j36k39K24k6K00
3389A06j45K1J0j5J26N3l27L08mk01qj19M14%k61J6o3m2M60l38M4L6pJ05k67P5
$$ y = [26, -37, -48, -77, 3, 115, -28, 66, -181, -118, 135, -140, -63, 191, -200, -102, 260, -3, -41, 100, -43, 177, 267, -92, 121, -177, 228, -56, 29, 186, 211, 33, 221, -147, 9, -13, -151, 42, -191, -89, 83, -53, -292, -68, -94, 106, -39, -18, -8, -23, 103, 156, -171, 137, 133, -68, -76, -195, 219, 219, -42, -26, -89, -131, 329, -9, 35, 71, 64, 169, -98, -23]
$$ [...]
8191I8
##END NTUPLES=NMR FID
##END=
