##TITLE=1H_Pr dep-87A
 CDCl3, 8 sc, 
 27.04.2021
##JCAMPDX= 6.0         $$ Bruker NMR JCAMP-DX V2.0
##DATA TYPE= NMR FID
##DATA CLASS= NTUPLES
##ORIGIN= UXNMR, Bruker Analytische Messtechnik GmbH
##OWNER= root
$$ XWIN-NMR		Version 3.5
$$ Tue Apr 27 16:21:45 2021 Russian Standard Time (UT+4h)  she@DPX200
##.OBSERVE FREQUENCY= 200.131506
##.OBSERVE NUCLEUS= ^1H
##.DELAY= (6, 6)
##.ACQUISITION MODE= SIMULTANEOUS
##.ACQUISITION SCHEME= undefined
##.AVERAGES= 8
##.DIGITISER RES= 18
##SPECTROMETER/DATA SYSTEM= spect
##.PULSE SEQUENCE= zg30
##.SOLVENT NAME= CDCl3
##.SHIFT REFERENCE= (INTERNAL, CDCl3, 0, 15.7039)
##AUDIT TRAIL= $$ (NUMBER, WHEN, WHO, WHERE, WHAT)
$$ ##TITLE= Audit trail, XWIN-NMR		Version 3.5
$$ ##JCAMPDX= 5.01
$$ ##ORIGIN= Bruker BioSpin GmbH
$$ ##OWNER= she
$$ F:/spectra/data/she/nmr/H-F/1/audita.txt
$$ ##AUDIT TRAIL=  $$ (NUMBER, WHEN, WHO, WHERE, WHAT)
(   1,<2021-04-27 16:20:09.31 +0400>,<she>,<DPX200>,
      <created by zg, POWCHK disabled, PULCHK disabled
       configuration hash MD5:
       00 E9 B6 7A A2 85 ED C7 34 08 36 98 17 FE 4E 26
       data hash MD5: 16K
       B3 50 B9 20 F4 81 03 9E B8 55 64 EC 2B 7B 52 A3>)
$$ ##END=
$$ 
$$ hash MD5
$$ DB 1C 4F C9 B2 92 5D 29 2F 81 CA 53 1E 25 3C DC
##$RELAX= 
##$RELAX= 
##$RELAX= 
##$RELAX= 
##$RELAX= 
##$RELAX= 
$$ Bruker specific parameters
$$ --------------------------
##$DU= <F:/spectra>
##$EXPNO= 1
##$NAME= <H-F>
##$PROCNO= 1
##$TYPE= <nmr>
##$USER= <she>
##$AMP= (0..31)
100 100 100 100 100 100 100 100 100 100 100 100 100 100 100 100 100 100 
100 100 100 100 100 100 100 100 100 100 100 100 100 100 
##$AQSEQ= 0
##$AQ_mod= 1
##$AUNM= <au_zg>
##$AUTOPOS= <>
##$BF1= 200.13
##$BF2= 200.13
##$BF3= 200.13
##$BF4= 200.13
##$BF5= 200.13
##$BF6= 200.13
##$BF7= 200.13
##$BF8= 200.13
##$BYTORDA= 1
##$CFDGTYP= 0
##$CFRGTYP= 5
##$CHEMSTR= <none>
##$CNST= (0..31)
1 1 145 1 1 1 1 1 1 1 1 1 1 1 1 1 1 1 1 1 1 1 1 1 1 1 1 1 1 1 1 1 
##$CPDPRG= <>
##$CPDPRG1= <>
##$CPDPRG2= <>
##$CPDPRG3= <>
##$CPDPRG4= <mlev>
##$CPDPRG5= <mlev>
##$CPDPRG6= <mlev>
##$CPDPRG7= <mlev>
##$CPDPRG8= <mlev>
##$CPDPRGB= <>
##$CPDPRGT= <>
##$D= (0..31)
0 1.2 0 0 0 0 0 0 0 0.06 0 0.03 0 0 0 0 0.0002 0 0 0 0 0 0 0 0 0 0 0 0 
0 0 0 
##$DATE= 1619526008
##$DBL= (0..7)
120 120 120 120 120 120 120 120 
##$DBP= (0..7)
150 150 150 150 150 150 150 150 
##$DBP07= 0
##$DBPNAM0= <>
##$DBPNAM1= <>
##$DBPNAM2= <>
##$DBPNAM3= <>
##$DBPNAM4= <>
##$DBPNAM5= <>
##$DBPNAM6= <>
##$DBPNAM7= <>
##$DBPOAL= (0..7)
0.5 0.5 0.5 0.5 0.5 0.5 0.5 0.5 
##$DBPOFFS= (0..7)
0 0 0 0 0 0 0 0 
##$DE= 6
##$DECBNUC= <off>
##$DECIM= 32
##$DECNUC= <off>
##$DECSTAT= 4
##$DIGMOD= 1
##$DIGTYP= 9
##$DL= (0..7)
0 120 120 120 120 120 120 120 
##$DP= (0..7)
150 150 150 150 150 150 150 150 
##$DP07= 0
##$DPNAME0= <>
##$DPNAME1= <>
##$DPNAME2= <>
##$DPNAME3= <>
##$DPNAME4= <>
##$DPNAME5= <>
##$DPNAME6= <>
##$DPNAME7= <>
##$DPOAL= (0..7)
0.5 0.5 0.5 0.5 0.5 0.5 0.5 0.5 
##$DPOFFS= (0..7)
0 0 0 0 0 0 0 0 
##$DQDMODE= 0
##$DR= 18
##$DS= 0
##$DSLIST= <SSSSSSSSSSSSSSS>
$$ [...]
##$SUBNAM2= <"">
##$SUBNAM3= <"">
##$SUBNAM4= <"">
##$SUBNAM5= <"">
##$SUBNAM6= <"">
##$SUBNAM7= <"">
##$SUBNAM8= <"">
##$SUBNAM9= <"">
##$SW= 18.0517142713441
##$SWIBOX= (0..15)
0 0 2 0 0 0 0 0 0 0 0 0 0 0 0 0 
##$SW_h= 3612.71676300578
##$TD= 16384
##$TD0= 1
##$TE= 0
##$TE2= 300
##$TE3= 300
##$TEG= 300
##$TL= (0..7)
0 120 120 120 120 120 120 120 
##$TP= (0..7)
150 150 150 150 150 150 150 150 
##$TP07= 0
##$TPNAME0= <>
##$TPNAME1= <>
##$TPNAME2= <>
##$TPNAME3= <>
##$TPNAME4= <>
##$TPNAME5= <>
##$TPNAME6= <>
##$TPNAME7= <>
##$TPOAL= (0..7)
0.5 0.5 0.5 0.5 0.5 0.5 0.5 0.5 
##$TPOFFS= (0..7)
0 0 0 0 0 0 0 0 
##$TUNHIN= 0
##$TUNHOUT= 0
##$TUNXOUT= 0
##$USERA1= <user>
##$USERA2= <user>
##$USERA3= <user>
##$USERA4= <user>
##$USERA5= <user>
##$V9= 5
##$VALIST= <valist>
##$VCLIST= <CCCCCCCCCCCCCCC>
##$VD= 0
##$VDLIST= <DDDDDDDDDDDDDDD>
##$VPLIST= <PPPPPPPPPPPPPPP>
##$VTLIST= <TTTTTTTTTTTTTTT>
##$WBST= 1024
##$WBSW= 4
##$XGAIN= (0..3)
0 0 0 0 
##$XL= 0
##$YL= 0
##$YMAX_a= 378263
##$YMIN_a= -328763
##$ZGOPTNS= <>
##$ZL1= 120
##$ZL2= 120
##$ZL3= 120
##$ZL4= 120
##$ABSF1= 10
##$ABSF2= 0
##$ABSG= 5
##$ABSL= 3
##$ALPHA= 0
##$AQORDER= 0
##$ASSFAC= 0
##$ASSFACI= 0
##$ASSFACX= 0
##$ASSWID= 0
##$AUNMP= <proc_1d>
##$AZFE= 0.1
##$AZFW= 0.1
##$BCFW= 1
##$BC_mod= 2
##$BYTORDP= 1
##$COROFFS= 0
##$CY= 11.3945322036743
##$DATMOD= 1
##$DC= 2
##$DFILT= <>
##$DTYPP= 0
##$F1P= 15.9154993809931
##$F2P= -4.1035820241983
##$FCOR= 0.5
##$FTSIZE= 0
##$FT_mod= 4
##$GAMMA= 1
##$GB= 0.15
##$INTBC= 1
##$INTSCL= 1
##$ISEN= 128
##$LB= 0.24
##$LEV0= 0
##$LPBIN= 0
##$MAXI= 10000
##$MC2= 0
##$MEAN= 0
##$ME_mod= 0
##$MI= 1.114404
##$NCOEF= 0
##$NC_proc= 0
##$NLEV= 6
##$NOISF1= 3.799351
##$NOISF2= 2.8
##$NSP= 1
##$NTH_PI= 0
##$NZP= 0
##$OFFSET= 15.70392
##$PC= 1
##$PHC0= -11120.98
##$PHC1= 14.20102
##$PH_mod= 1
##$PKNL= yes
##$PPARMOD= 0
##$PSCAL= 0
##$PSIGN= 0
##$REVERSE= no
##$SF= 200.130013532006
##$SI= 16384
##$SIGF1= 3
##$SIGF2= 2
##$SINO= 400
##$SIOLD= 16384
##$SREGLST= <1H.CDCl3>
##$SSB= 0
##$STSI= 0
##$STSR= 0
##$SW_p= 3612.71676300578
##$SYMM= 0
##$S_DEV= 0
##$TDeff= 0
##$TDoff= 0
##$TI= <>
##$TILT= no
##$TM1= 0
##$TM2= 0
##$TOPLEV= 0
##$USERP1= <user>
##$USERP2= <user>
##$USERP3= <user>
##$USERP4= <user>
##$USERP5= <user>
##$WDW= 1
##$XDIM= 8192
##$YMAX_p= 0
##$YMIN_p= 0
$$ End of Bruker specific parameters
$$ ---------------------------------
##NTUPLES= NMR FID
##VAR_NAME=  TIME,          FID/REAL,        FID/IMAG
##SYMBOL=    X,             R,               I
##VAR_TYPE=  INDEPENDENT,   DEPENDENT,       DEPENDENT
##VAR_FORM=  AFFN,          ASDF,            ASDF
##VAR_DIM=   8192,          8192,            8192
##UNITS=     SECONDS,       ARBITRARY UNITS, ARBITRARY UNITS
##FACTOR=    0.0002768,     1,               1
##FIRST=     0,             0,               0
##LAST=      2.2672688,     0,               0
##MIN=       0,             -328763,         0
##MAX=       2.2672688,     378263,          0
$$ Real data points
##PAGE= N=1
##DATA TABLE= (X++(R..R)), XYDATA
$$ plain form
0 0 0 0 0 0 0 0 0 0 0 0 0 8 -8 8 -8 16 -16 24 -24 32 -40 48 -56 64 -77 88 -104 120 -136 157 -181 205 -233
33 -233 264 -301 339 -380 424 -476 531 -591 656 -728 807 -893 988 -1090 1202 -1324 1458
50 1458 -1609 1771 -1953 2154 -2383 2636 -2928 3261 -3649 4107 -4656 5332 -6189 7309 -8855
65 -8855 11131 -14833 21901 -40297 190009 378263 -140660 -241658 -5382 610 22736 149018
77 149018 71576 -49700 -119181 -129116 25244 303822 73483 -217362 -150030 82921 42800
88 42800 65952 114841 -49977 -138595 -89771 61019 134463 117091 -83641 -148325 -32011
99 -32011 18493 100534 148728 -31122 -230504 -50112 109523 73017 50957 32594 -143216
110 -143216 -135219 62362 108477 93005 7918 -153787 -178335 120293 172176 -30187 -38013
$$ packed form
0@%%%%%%%%%%%Qj6J6j6K4l2M0m8N6p2Q8j04J20j41J65j92K24k56K93l38L86m38
33b33M97n65O40p19Q04r00J007j122J247j384J535j700J881k078K292k526K782
50A458l067L380l724M107m537N019n564O189o910P756q763R988j1521J3498j6164
65h855J9986k5964L6734o2198K30306J88254n18923j00998K36276N992K2126J26282
77A49018p7442j21276o9481r935J54360K78578k30339k90845O7332K32951m0121
88D2800K3152M8889j64818q8618M8824J50790P3444j7372k00732o4684J16314
99c2011N0504Q2041M8194j79850j99382J80392J59635l6506k2060j8363j75810
110a43216P997J97581M6115j5472q5087j61705k4548K98628N1883k02363p826
$$ plain form
121 -38013 -11465 -118246 -70865 171446 116701 -65893 -104465 -73186 -8024 110510 90455
132 90455 -38436 -66518 -73393 -51395 84443 158633 -25504 -128130 -61681 10411 54428
143 54428 89056 41259 -84343 -97465 -50349 89195 160375 7554 -154422 -74805 60422
154 60422 35772 54249 68805 -54836 -129668 -19483 81721 104812 46080 -90956 -129337
165 -129337 25346 106930 22158 17498 2077 -84942 -77959 70086 109262 22969 -35563 -95605
177 -95605 -55866 67568 106522 12003 -49137 -57495 -56335 27078 99121 45490 -40733 -77801
189 -77801 -69026 27108 116197 57420 -77089 -86666 -26899 29119 77602 40981 -36651 -74785
201 -74785 -41637 1969 75661 82768 -45376 -105894 -32355 42129 47093 42905 -4695 -75313
$$ packed form
121c8013K6548j06781M7381K42311n4745j82594l8572L1279O5162J18534k0055
132I0455j28891k8082o875K1998J35838P4190j84137j02626O6449P2092M4017
143E4428L4628m7797j25602j3122M7116J39544P1180j52821j61976P9617J35227
154F0422k4650J8477J4556j23641p4832J10185J01204K3091n8732j37036l8381
165a29337J54683Q1584q4772m660j5421q7019O983J48045L9176q6293n8532o0042
177i5605L9739J23434L8954r4519o1140q358J160Q3413P2043n3631q6223l7068
189g7801Q775R6134Q9089n8777j34509r577N9767N6018M8483l6621p7632l8134
201g4785L3148M3606P3692P107j28144o0518P3539P4484M964m188m7600p0618
$$ plain form
213 -75313 -54489 14287 51925 63830 6814 -84052 -73364 26585 71373 38944 6733 -57092
225 -57092 -73885 3524 72624 60436 -3392 -52761 -72997 637 78532 56481 -5505 -50150
237 -50150 -56487 -9489 66813 65775 -6940 -46148 -48400 -15024 54662 67459 4951 -50655 -43576
250 -43576 -12347 33939 68211 17604 -41239 -53587 -20790 31505 66858 34688 -50824 -60912
262 -60912 -13164 28677 54166 34728 -29581 -70353 -28992 34263 58601 35263 -38176 -71641
274 -71641 -19711 36410 45935 20188 -16259 -59311 -39114 29245 51555 26905 -24850 -52848
286 -52848 -34685 21000 48134 19631 -8886 -41230 -44937 4653 51317 38395 -13605 -43130
298 -43130 -42139 -1353 51810 41970 -6016 -43828 -44017 -2511 46983 53353 -6050 -46729 -39972
$$ packed form
213g5313K0824O8776L7638J1905n7016r0866J0688R9949M4788l2429l2211o3825
225e7092j6793P7409O9100j2188o3828m9369k0236P3634P7895k2051o1986m4645
237e0150o337M6998P6302j038p2715l9208k252L3376O9686J2797o2508n5606P079
250d3576L1229M6286L4272n0607n8843j2348L2797N2295L5353l2170q5512j0088
262f0912M7748M1841K5489j9438o4309m0772M1361O3255K4338k3338p3439l3465
274g1641N1930N6121R525k5747l6447m3052K0197O8359K2310k4650n1755k7998
286e2848J8163N5685K7134k8503k8517l2344l707M9590M6664j2922n2000k9525
298d3130R91M0786N3163r840m7986l7812j89M1506M9494O370n9403m0679O757
$$ plain form
311 -39972 -2563 46455 48891 1910 -48395 -38529 4637 36646 45568 5485 -37799 -38236 -2688
324 -2688 34047 41160 15407 -33908 -42507 -2415 28054 39078 17636 -20855 -43713 -19121 28963
337 28963 42765 24455 -22988 -49458 -20124 26601 47044 20013 -19025 -47924 -30603 26257
349 26257 48988 23147 -24768 -47284 -25917 18972 47507 20780 -19997 -42430 -30626 15275
361 15275 41541 25339 -18964 -39401 -25558 4356 36951 28602 -7086 -38003 -34869 2692
373 2692 34387 36876 -4510 -39875 -34722 -2939 35699 38746 3896 -39508 -43278 -703 36990
386 36990 43549 4263 -40454 -41222 -3573 40674 41780 5989 -36856 -41720 240 34650 39172
399 39172 8146 -28240 -38054 -11441 32964 41720 13394 -26943 -40704 -8867 27220 38850
$$ packed form
311c9972L7409M9018K436m6981n0305R866M3166L2009Q922m0083m3284m37L5548
324b688L6735P113k5753m9315q599M0092L0469J1024k1442l8491k2858K4592M8084
337B8963J3802j8310m7443k6470K9334M6725K0443k7031l9038k8899J7321N6860
349B6257K2731k5841m7915k2516K1367M4889K8535k6727m0777k2433J1804M5901
361A5275K6266j6202m4303k0437J3843K9914L2595q349l5688l0917L134L7561
373B692L1695K489m1386l5365N153L1783L8638L047l4850m3404l770M2575L7693
386C6990O559l9286m4717p68L7649M4247J106l5791m2845m864M1960L4410M522
399C9172l1026l6386r814K6613M4405Q756k8326m0337j3761L1837L6087J1630
$$ plain form
411 38850 15286 -17280 -35343 -25563 20640 47403 26768 -22669 -48205 -20785 22934 47036
423 47036 22098 -20775 -41422 -27605 17679 45432 30554 -19607 -52308 -26788 20659 47256
435 47256 23427 -21389 -43383 -28346 15808 40383 27344 -15188 -43937 -28470 6710 38820
447 38820 32367 -8401 -43097 -37794 7664 39006 33612 -5899 -42575 -35125 779 36637 36021
460 36021 3487 -37651 -49362 -1357 47316 43735 -5949 -44320 -35270 585 39225 39335 2538
473 2538 -35486 -42350 -3404 38933 46202 4908 -41389 -38591 -705 37273 37915 8284 -27091
486 -27091 -41597 -9446 32204 44586 13389 -28411 -39773 -18385 28860 50187 19821 -30440
498 -30440 -48544 -13295 28576 46613 20567 -27959 -45131 -21027 24637 46707 26503 -24718
$$ packed form
411C8850k3564l2566j8063R780M6203K6763k0635m9437k5536K7420M3719K4102
423D7036k4938m2873k0647J3817M5284K7753j4878n0161l2701K5520M7447K6597
435D7256k3829m4816k1994J5037M4154K4575j3039m2532k8749J5467L5180L2110
447C8820o453m0768l4696N303M5458L1342n394l9511l6676P450L5904L5858o16
460C6021l2534m1138j1711M8005M8673l581m9684l8371R050L5855L8640J10l6797
473B538l8024o864L8946M2337P269m1294m6297K798L7886L7978O42k9631l5375
486b7091j4506L2151M1650J2382l1197m1800j1362K1388M7245K1327l0366n0261
498c0440j8104L5249M1871J8037k6046m8526j7172K4104M5664K2070k0204n1221
$$ plain form
510 -24718 -57910 -22051 34555 48694 12412 -28400 -38415 -23221 17957 43113 24802 -20057
522 -20057 -49056 -27161 18226 47211 24305 -24903 -42934 -24512 14100 36586 28877 -8094
534 -8094 -47048 -36383 10655 46599 32670 -13183 -44206 -38274 10131 48353 34785 -12143
546 -12143 -46343 -31974 7055 43363 38920 -8028 -43800 -36997 8375 43492 38714 -4203 -46707
559 -46707 -33704 11378 40282 30769 -1103 -29737 -38218 -2701 39418 42079 3499 -38225 -37490
572 -37490 -2364 38758 41620 2847 -32223 -38978 -7082 32352 45505 13669 -37821 -46271 -7379
585 -7379 38031 44063 7680 -32687 -46412 -10502 35686 43453 8317 -34566 -39958 -12244 28897
598 28897 42530 10816 -29423 -43334 -14197 26092 41079 15203 -30446 -40700 -14131 21530
$$ packed form
510b4718l3192L5859N6606J4139l6282m0812j0015J5194M1178K5156j8311m4859
522b0057k8999K1895M5387K8985k2906m9208j8031J8422L8612K2486p709l6971
534h094l8954J0665M7038L5944j3929m5853l1023N932M8405L8222j3568m6928
546a2143l4200J4369L9029L6308m443m6948l5772O803M5372L5117m778m2917m2504
559d6707J3003M5082K8904r513l1872k8634q481L5517M2119K661l8580m1724P35
572c7490L5126M1122K862l8773l5070o755L1896L9434J3153l1836n1490q450L8892
585g379M5410O032l6383m0367j3725L5910M6188P767l5136m2883n392K7714M1141
598B8897J3633l1714m0239j3911K9137M0289J4987k5876m5649j0254K6569L5661
$$ plain form
610 21530 34950 17803 -16120 -44659 -26045 20046 44343 22678 -24559 -43713 -22914 19952
622 19952 42214 21091 -16712 -43011 -26813 15935 45688 29731 -21782 -45575 -23837 20908
634 20908 42667 22980 -14232 -40893 -24623 15545 40034 27299 -12861 -35714 -26440 11009
646 11009 39349 27682 -6937 -36211 -26926 7849 36014 31796 -5083 -33187 -29934 3307 34984
659 34984 34276 1744 -37432 -35083 3822 37916 34553 -3500 -33897 -33743 302 34453 33750 1600
673 1600 -35687 -35349 -565 33910 34105 -2493 -31969 -32284 -2987 27393 30789 5614 -29603 -33828
687 -33828 -6779 25186 32504 5295 -24565 -34138 -11346 22157 32994 12474 -25253 -36520
699 -36520 -13056 22003 35912 11138 -21763 -36100 -15090 21619 35749 16166 -23323 -37077
$$ packed form
610B1530J3420j7147l3923k8539J8614M6091K4297k1665m7237j9154K0799M2866
622A9952K2262k1123l7803k6299J6198M2748K9753j5957n1513k3793K1738M4745
634B0908K1759j9687l7212k6661J6270M0168K4489j2735m0160k2853R274L7449
646A1009K8340j1667l4619k9274R285L4775K8165m218l6879k8104L253L3241L1677
659C4984p08l2532l9176K349L8905L4094l363l8053l0397J54L4045L4151p03l2150
673A600l7287L38L4784L4475J95l6598k9476l15K9297L0380L396k5175l5217m225
687c3828K7049L1965P318k7209k9860r573K2792L3503J0837k0520l7727j1267
699c6520K3464L5059J3909k4774l2901j4337K1010L6709J4130j9583l9489j3754
$$ plain form
711 -37077 -13626 22340 36222 12281 -18599 -33556 -14470 19555 33236 17185 -17579 -31549
723 -31549 -14968 16388 33139 16200 -11659 -29251 -17500 12411 30382 22235 -9698 -28800
735 -28800 -19896 8673 32027 22466 -6231 -30374 -22967 8231 30936 25251 -7736 -30400 -23243
748 -23243 5967 30908 23322 -4863 -30967 -24494 6362 28177 23642 -6395 -27862 -23274 2454
761 2454 25946 21422 -1494 -26143 -25092 260 22665 23915 -591 -22847 -25392 -4548 21478
774 21478 23667 4687 -21815 -27870 -6488 20068 27561 5017 -21155 -27441 -7814 20738 26530
787 26530 7692 -20521 -27683 -7009 18680 28016 6949 -18433 -25341 -8074 18248 25242 10075
800 10075 -16089 -24475 -8013 14202 25707 10928 -11680 -23274 -11877 13278 24223 15168
$$ packed form
711c7077K3451L5966J3882k3941l0880j4957J9086L4025J3681j6051l4764j3970
723c1549J6581L1356J6751j6939k7859j7592J1751K9911J7971q147l1933j9102
735b8800Q904K8569K3354r561k8697k4143P407L1198K2705n685l2987k2664P157
748b3243K9210K4941p586k8185k6104O473L0856K1815m535l0037k1467M588K5728
761B454K3492m524k2916k4649J051K5352K2405J250k4506k2256k545K0844K6026
774B1478K189j8980k6502o055K1382K6556P493k2544k6172o286J9627K8552N792
787B6530j8838k8213p162K0674K5689R336k1067k5382o908J7267K6322O994j5167
800A0075k6164q386J6462K2215J1505j4779k2608j1594J1397K5155J0945r055
$$ plain form
812 15168 -9949 -24028 -13625 9497 26645 16451 -7520 -24476 -17156 9744 25764 18506
824 18506 -7673 -25282 -16929 7053 26364 17203 -6994 -24398 -18276 7546 23032 17422 -6777
837 -6777 -22838 -16532 3498 21551 16278 -3376 -20935 -19031 2007 18288 18306 -1506 -19876
850 -19876 -19179 -2802 17807 18895 2355 -18658 -22814 -3789 16691 22544 3498 -19486 -22448
863 -22448 -5647 18593 21836 4751 -17833 -23659 -4612 16776 23565 5294 -17002 -21832 -6219
876 -6219 17162 21108 6609 -13780 -20699 -6038 12621 21412 8847 -11048 -19336 -9698 11955
889 11955 21119 11924 -8763 -21006 -10752 8916 22803 13675 -7970 -20889 -14396 9406 22590
902 22590 15554 -7207 -23218 -14015 7705 24214 14873 -8333 -21831 -15006 8010 20792 14839
$$ packed form
812A5168k5117j4079J0403K3122J7148j0194k3971j6956P320K6900J6020p258
824A8506k6179j7609Q353K3982J9311r161k4197j7404O122K5822J5486n610k4199
837f777j6061O306K0030J8053n273j9654j7559J904K1038J6281J8j9812j8370
850a9876O97J6377K0609J088j6540k1013m156J9025K0480N853j9046k2984k962
863b2448J6801K4240L243j7085k2584n826J9047K1388O789j8271k2296m830J5613
876f219K3381L946j4499k0389o919J4661J8659Q791j2565j9895q288R638K1653
889A1955R164r195k0687j2243J0254J9668J3887r128k1645j2919O493K3802J3184
902B2590p036k2761j6011R203K1720J6509r341k3206j3498O825K3016J2782n953
$$ plain form
915 14839 -6117 -21738 -14796 3864 20439 14862 -4946 -19102 -16693 2997 16551 15632 -1190
928 -1190 -18361 -17461 -2375 17341 17715 614 -17772 -20992 -2306 16706 20118 2073 -19142
941 -19142 -20588 -4229 18208 20495 2607 -18210 -22221 -2776 16924 21579 3758 -18483 -20656
954 -20656 -3737 18318 20107 3497 -14321 -20117 -4525 13872 20949 7688 -13160 -19099 -7740
967 -7740 13652 20639 8981 -10026 -20190 -8301 9719 21827 12523 -9564 -21224 -12424 11397
980 11397 22789 12843 -8798 -22681 -11713 9485 23593 13490 -9977 -21514 -13623 9296
992 9296 22321 13229 -8256 -22709 -12890 6920 21185 13633 -7737 -20621 -14990 5962 18280
1005 18280 13914 -3877 -20571 -16555 1654 19241 16759 -3615 -19832 -19126 1502 18573 17687
$$ packed form
915A4839k0956j5621O942J8660J6575n577j9808j4156K409J9690J3554r19j6822
928a190j7171R00J5086J9716L74j7101j8386l220J8686J9012L412j8045k1215
941a9142j446J6359K2437K287j7888k0817m011J9445J9700M655j7821k2241k173
954b0656J6919K2055J789j6610j7818n796J5592J8397P077j3261k0848n939J1359
967g740K1392O987j1658j9007j0164J1889J8020J2108r304k2087j1660Q800K3821
980A1397J1392r946k1641j3883J0968K1198J4108j0103k3467j1537P891K2919
992I296J3025r092k1485j4453R819J9810J4265p552k1370j2884N631K0952J2318
1005A8280m366j7791j6694M016J8209J7587k482k0374j6217P06K0628J7071q86
$$ plain form
1018 17687 -476 -20459 -19247 -1212 19231 19951 -856 -20333 -21121 465 19395 18815 831
1031 831 -19552 -18881 -1277 19006 19461 591 -16758 -19453 -1916 17133 19908 3620 -16370
1044 -16370 -18177 -4261 15582 20717 5439 -13181 -20152 -5134 14090 21505 9537 -13475 -21175
1057 -21175 -8503 14608 23101 8646 -12280 -22583 -8168 13360 22580 10433 -13195 -21778
1069 -21778 -10291 13093 22926 9280 -11656 -22319 -9063 10958 20478 11066 -10807 -20635 -11746
1082 -11746 9181 20613 10617 -8026 -21334 -12852 6586 19623 13244 -7950 -20347 -15709 5305
1095 5305 20711 14177 -5395 -21901 -16034 4013 20738 16934 -5936 -21348 -17373 4576 21045
1108 21045 15630 -3987 -21123 -15957 3787 19740 16941 -3649 -18665 -16769 2898 19064 16135
$$ packed form
1018A7687j8163j9983J212J8035K0443P20k0807j9477p88K1586J8930n80j7984
1031H31k0383O71J7604K0283M55j8870j7349k695J7537J9049K775j6288j9990
1044a6370j807J3916J9843N135j5278j8620o971J5018J9224P415j1968k3012p700
1057b1175J2672K3111Q493j4455k0926j0303J4415K1528R220j2147k3628q583
1069b1778J1487K3384R833j3646k0936j0663J3256K0021R520r412k1873r828Q889
1082a1746K0927J1432r996j8643j3308Q482J9438J3037o379k1194j2397M638K1014
1095E305J5406o534j9572j6506N867K0047J6725l804k2870j5412L975K1949J6469
1108B1045n415j9617j7136N166J9744J5953k799k0590j5016J896J9667J6166k929
$$ plain form
1121 16135 -637 -17950 -15926 847 17345 18151 660 -15980 -18132 -757 17491 18560 3353
1134 3353 -16482 -18400 -2497 17074 20918 2989 -15388 -20263 -3310 17351 20365 4916 -16718
1147 -16718 -19478 -4039 15937 20905 3773 -14907 -19860 -4593 14668 18876 5457 -14533 -18564
1160 -18564 -6184 12284 18893 5875 -11802 -19546 -7805 10265 17842 8691 -11058 -19081 -10091
1173 -10091 8623 19556 9384 -9387 -21377 -11139 9209 19430 11223 -10103 -20702 -12169
1185 -12169 8660 20715 10513 -8722 -21102 -11717 8682 19324 12124 -8143 -19228 -11863
1197 -11863 6942 19439 11302 -5452 -17762 -11916 5295 17288 13626 -4295 -16132 -13027 3123
1210 3123 17848 14174 -1177 -16603 -14284 2119 16871 16635 -1401 -16052 -15639 1121 17836
$$ packed form
1121A6135j6772j7313K024J6773J6498Q06j7491j6640k152J7375J8248J069j5207
1134C353j9835j918J5903J9571L844j7929j8377m875J6953K0661L014j5449k1634
1147a6718k760J5439J9976M968j7132j8680m953J5267J9261M208j3419j9990m031
1160a8564J2380J8468O609j3018j7677p744J1741J8070P577r151j9749q023Q990
1173a0091J8714J0933j0172j8771j1990J0238K0348J0221q207k1326j0599Q533
1185a2169K0829J2055j0202j9235j2380R385K0399J0642p200k0267j1085P365
1197a1863J8805J2497q137j6754j2310N846J7211J1993l662j7921j1837L105J6150
1210C123J4725l674j5351j5426K319J6403J4752k36j8036j4651M13J6760J6715
$$ plain form
1223 17836 16207 76 -17073 -15548 1142 16502 17082 -561 -15690 -15888 270 16182 15097
1236 15097 803 -15212 -15387 -1106 13288 15718 1351 -13074 -15788 -3653 12391 14775 4269
1249 4269 -12489 -16417 -5376 10536 16666 4868 -11283 -17335 -7008 11038 16588 6570 -11457
1262 -11457 -18085 -6915 10086 17798 5978 -10782 -17581 -7479 10506 16563 7231 -10310 -16574
1275 -16574 -6606 8817 16725 7306 -7837 -15641 -7855 8139 15099 9471 -6289 -14820 -8364 5882
1289 5882 15807 10144 -4021 -14831 -10272 4903 14903 12167 -3388 -14659 -11168 3556 16522
1302 16522 12047 -2501 -15184 -12005 3747 15082 12803 -2875 -14437 -11777 2181 14953 11373
1315 11373 -2234 -13759 -12148 1971 12541 12359 -1314 -12958 -12232 -785 12454 11765 944
$$ packed form
1223A7836j629j6131j7149J525J6690J5360N80j7643j5129j98J6158J5912j085
1236A5097j4294j6015j75J4281J4394K430j4367j4425k714J2135J6044K384j0506
1249D269j6758l928J1041J5912O130j1798j6151o052J0327J8046N550j0018j8027
1262a1457o628J1170J7001P712j1820j6760o799J0102J7985O057r332j7541o264
1275a6574R968J5423P908r419j5143p804P786J5994O960n628j5760q531O456J4246
1289E882R925n663j4165j0810M559J5175J0000k736j5555j1271L491J4724J2966
1302A6522m475j4548j2683L179J5752J1335k279j5678j1562K660J3958J2772l580
1315A1373j3607j1525J611J4119J0570j82j3673j1644P26J1447J3239o89j0821
$$ plain form
1328 944 -12062 -13689 -1606 10236 13259 1560 -11457 -14179 -3974 10877 13565 3094 -11400
1341 -11400 -14897 -3475 9531 14459 3279 -10692 -14405 -4556 10591 13417 4132 -10187 -13929
1354 -13929 -3956 8511 13942 4446 -8146 -12834 -5572 8539 12886 6363 -6666 -12800 -5567 6080
1368 6080 13735 7413 -5249 -12637 -7960 6225 13547 9264 -4724 -13212 -8329 4516 14661 9717
1382 9717 -3738 -13244 -9365 4837 13712 10141 -3782 -13351 -8988 3225 13374 9706 -3058
1395 -3058 -12147 -9878 2888 11522 9504 -2025 -11483 -9528 239 11027 9878 -355 -10782 -11500
1409 -11500 -390 9668 11141 1107 -10783 -11639 -2492 10159 11367 1716 -10333 -13163 -2216
1422 -2216 9397 12465 2119 -10789 -12311 -3182 10083 12168 2513 -9583 -12966 -2706 8430
$$ packed form
1328I44j3006j627J2083J1842L023j1699j3017k722J0205J4851K688j0471j4494
1341a1400l497J1422J3006M928j1180j3971l713R849J5147K826r285j4319l742
1354a3929R973J2467N431r496j2592m688P262J4111M347o523j3029o134P233J1647
1368F080P655o322j2662p388M677J4185P322m283j3988q488M883J2845J0145m944
1382I717j3455r506L879J4202Q875l571j3923r569M363J2213J0149l668j2764
1395c058r089K269J2766Q634k018j1529r458J955R767J0788j149j0233j0427p18
1409a1500J1110J0058J473j0034j1890q56R147J2651J208r651j2049k830J0947
1422b216J1613L068j0346j2908j522R129J3265K085r655j2096l383J0260J1136
$$ plain form
1435 8430 12198 3581 -8526 -11294 -4244 7798 11642 4851 -6430 -11732 -4719 5938 12042 6277
1449 6277 -5544 -11387 -6591 6194 12615 7395 -4626 -12456 -6706 5047 13278 7992 -4774 -12362
1463 -12362 -7959 5706 12825 8293 -4168 -12836 -7304 4429 12677 8140 -4007 -11295 -8519 3863
1477 3863 11276 8192 -2431 -11245 -8442 1637 10821 9178 -1593 -10001 -10161 342 9491 9539 175
1492 175 -10742 -10480 -1548 9948 10560 264 -10463 -12053 -886 9920 11120 780 -11229 -11790
1506 -11790 -1792 10152 11260 770 -9840 -12126 -1452 9464 11087 1696 -9576 -10577 -2535
1519 -2535 8697 10984 2699 -7627 -11495 -2819 7162 11382 4688 -7054 -10690 -5091 6906 11843
1533 11843 5456 -5620 -11731 -5259 6325 12659 6583 -6390 -11633 -6027 6728 12719 6409 -5265
$$ packed form
1435H430L768q617j2107k768P050J2042L844o791j1281n302P013J0657O104n765
1449F277j1821n843M796J2785O421n220j2021p830N750J1753Q231n286j2766p588
1463a2362M403J3665P119m532j2461q668N532J1733Q248m537j2147p288K776J2382
1477C863P413l084j0623q814K803J0079R184j643j0771q408j60J0503R149M8r364
1492A75j0917K62Q932J1496O12j0296j0727j590J1167J0806J200j0340j2009n61
1506a1790R998J1944J108j0490j0610k286J0674J0916J623r391j1272j001Q042
1519b535J1232K287q285j0326l868Q676R981M220o694j1742l636N599J1997M937
1533A1843o387j1076o111O472J1584O334o076j2973n243N606J2755N991o310j1674
$$ plain form
1547 -5265 -12377 -5455 5733 12212 6708 -5612 -11103 -6667 5152 11493 6698 -3782 -11664 -6702
1561 -6702 3678 10614 7323 -3734 -10763 -8704 2497 10626 8181 -1957 -11323 -9036 1081 10512
1575 10512 9301 -2016 -10808 -10218 660 10767 9328 -1090 -11702 -10212 494 10834 10154
1588 10154 -1263 -10398 -10356 535 10309 9486 186 -10223 -9523 -220 9286 9984 690 -8657 -10039
1603 -10039 -1131 8835 10101 2318 -8429 -10126 -2583 8561 11237 3126 -7086 -11072 -3205 8007
1617 8007 11565 4487 -7860 -10914 -3542 7841 12445 4086 -6955 -11703 -3859 7423 11086 4899
1631 4899 -7075 -10868 -4441 6544 11214 4323 -5642 -10980 -4877 5581 10519 5669 -5701 -10513
1645 -10513 -6247 4084 10708 5981 -4103 -11412 -6938 3726 10150 7086 -4258 -11273 -7938 3166
$$ packed form
1547e265p112O922J1188O479n504j2320n491M436J1819O341m795j0480p882M962
1561f702J0380O936l291j1057p029K059J1201Q129k445j0138r366K287J0117R431
1575A0512j211j1317q792N90J0878J0107j439j0418j0612J490J0706J0340o80
1588A0154j1417r135M2J0891R774q23r300j0409P00R303R506O98r294r347j382
1603a0039Q908R966J266p783j0747j697P543J1144K676q111j0212l986P867J1212
1617H007L558p078j2347l054P372J1383M604q359j1041m748P844J1282L663o187
1631D899j1974l793O427J0985M670o891r965n338O103J0458M938m850j1370m812
1645a0513M266J0331O624m727j0084p309M474J0664O424l064j1344p015L335J1104
$$ plain form
1659 3166 11118 7199 -3383 -11858 -8165 2959 10392 7897 -3401 -10660 -8356 2331 10629 7393
1673 7393 -2152 -10737 -7958 1726 9359 8346 -1637 -9221 -8389 747 9427 8652 297 -8795 -8621 8
1689 8 8910 9698 533 -8458 -9354 -815 9373 9796 1588 -8838 -9734 -1025 8835 10887 1480 -8406
1705 -8406 -9928 -1105 8901 9787 2119 -8261 -9382 -1638 7910 10108 1941 -6933 -9450 -2494 7015
1720 7015 9176 3135 -6459 -9350 -3455 5914 9755 3360 -5619 -10202 -4524 5252 9464 4955 -5624
1735 -5624 -10155 -5466 4602 10226 4625 -4914 -10793 -5695 4868 9714 5349 -5330 -10245 -5578
1749 -5578 3990 10280 5002 -4191 -9941 -5771 3840 8898 5954 -3436 -8966 -5797 2530 8998 6255
1764 6255 -1929 -8627 -6666 2118 8449 7833 -1358 -8630 -7084 1245 9035 7919 -151 -8388 -7828
$$ packed form
1659C166P952l919j0582q475L693J1124P433k495j1298p259K304J0687Q298l236
1673G393r545q585K779R684P633j013r983p584Q32R136Q680p75q355r092J74Q629
1689HQ902P88r165q991q96Q539J0188M23q208j0426q96Q709R860K052r407r886
1705h406j522Q823J0006Q86p668j0380j121P744R548K198q167q874k517O956R509
1720G015K161o041r594k891N895R369L841o395q979m583N678R776M212m509j0579
1735e624m531M689J0068N624n601r539n879N098J0563M846m365j0679m915M667
1749e578R568O290n278r193n750M170R611N058k944r390n530L169Q327O468k743
1764F255q184o698J961Q784O331o16r191p272J546Q329P790j116q070q237N60
$$ plain form
1779 -7828 1243 8614 8396 -546 -8426 -7991 696 8959 7905 -7 -8414 -8005 535 7936 8169 58
1795 58 -7328 -7776 -730 7444 7232 1045 -6994 -8059 -1575 6218 8121 1786 -6209 -8303 -2674 5829
1811 5829 8122 2693 -6028 -9101 -3081 5084 8703 3009 -5694 -9111 -3939 5488 8518 3552 -5757
1826 -5757 -9207 -3620 4830 8790 3513 -5236 -8809 -3977 4884 8026 4092 -4264 -8092 -3871 3486
1841 3486 8263 4223 -3448 -7516 -4895 3154 7738 5413 -2463 -7571 -5062 2307 8176 5864 -1426
1856 -1426 -7514 -5961 2377 7897 6636 -1482 -7712 -5707 1422 8375 6327 -1025 -7463 -6245 1757
1871 1757 7403 6650 -976 -6990 -5827 542 7078 6037 -329 -6473 -6490 266 5812 6617 157 -6221
1887 -6221 -6693 -1261 6357 6531 985 -5815 -7879 -1499 5495 7231 1303 -6223 -7653 -2306 5800
$$ packed form
1779g828R071P371k18q942p880M35Q687Q263j054p912q407M09Q540P401K33q111
1795E8p386m48P046Q174k12o187q039j065O484P793J903o335p995k094N629Q503
1811E829K293n429q721l073O020Q165L619n694q703l417N172R427L030m966r309
1826e757l450N587Q450L960n277q749l573M832Q861L142l934q356l828M221P357
1841C486M777m040p671m068K621Q049M584k325p876n108K509P369N869k312p290
1856a426o088J553Q338N520j261q118o230K005P129O953k048p352o438J218Q002
1871A757N646p53p626o014J163O369O536j041o366o144j7O756N546Q05o460o378
1887f221m72N432P618J74n546o800k064O380O994J736n928p526j430N347Q106
$$ plain form
1902 5800 7142 1859 -6128 -8159 -2200 5036 7105 1866 -5382 -7200 -2869 4829 6754 2345 -4522
1917 -4522 -7209 -2562 3519 7297 2813 -3790 -6594 -3734 3791 6763 3602 -3133 -7118 -3540 2890
1932 2890 7581 4384 -2603 -6801 -4393 3315 7471 5092 -2520 -7551 -4234 2465 7649 4818 -2427
1947 -2427 -6836 -4890 2804 7106 5094 -1563 -6726 -4568 1432 6684 4989 -1508 -5973 -5382 1205
1962 1205 6123 5165 -627 -6411 -5497 -140 5987 5561 -134 -5656 -6672 -282 5688 5998 329 -6453
1978 -6453 -6503 -1028 6100 6364 509 -5798 -6849 -911 5411 6446 641 -5872 -6461 -1165 4942 5950
1994 5950 1071 -4578 -6619 -1680 4640 6558 2137 -4313 -5987 -2467 4431 6575 2600 -3480 -6628
2009 -6628 -2316 3497 6741 3255 -3717 -6498 -3144 3684 6978 3524 -3120 -7123 -3336 3410 7465
$$ packed form
1902E800J342n283p987k031N959P236K069n239p248j818M331P698J925m409o867
1917d522k687M647O081L778m484o603k804K860P525K972l161o735l985L578O430
1932B890M691l197o987m198K408P708M156k379p612n031L317O699N184k831p245
1947b427m409J946P694M302k012o657n163K158O000N252j695o497m465N91O587
1962A205M918r58n792n784R14N357O127m26n695n522j016O390N970L10n669o782
1978f453n0N475P128K64n855o307j051N938O322J035n805o513n89N296O107J008
1994E950m879n649k041M939O320J918m421o450j674L520O898K144l975o080l148
2009f628M312N813L244l486o972k781L354O828L294l454o644m003L787O746M055
$$ plain form
2024 7465 3616 -3235 -6314 -3403 3443 6575 3624 -2776 -6695 -3333 2656 6743 4078 -2713 -5893
2039 -5893 -4282 2170 6153 4141 -1487 -6357 -4411 1091 6002 4702 -1076 -6124 -5358 715 6001
2054 6001 5282 -907 -6639 -5512 330 5758 5584 -1075 -6098 -6136 348 5917 5345 -386 -6335 -5492
2070 -5492 -111 5506 5407 -253 -5424 -5908 -87 5457 5396 590 -5347 -5455 -907 4761 5923 1030
2086 1030 -4128 -5980 -1329 4800 6289 2113 -4311 -5976 -1715 4780 6970 2238 -3962 -6449 -1954
2101 -1954 4588 6689 2157 -4460 -6412 -2228 4456 6514 2455 -3650 -6360 -2158 3818 6033 2944
2116 2944 -3624 -5614 -3103 3120 6270 3089 -2796 -6430 -3474 2429 6030 3640 -2817 -6144 -4186
2131 -4186 2252 6458 3759 -2084 -6561 -4564 2075 6192 4571 -2468 -6319 -4750 1441 6342 4277
$$ packed form
2024G465l849o851l079K911O846L132k951o400l919L362N989M087k665o791l180
2039e893J611O452L983k012n628m870J946N502M911j300n778n048P66O073N286
2054F001p19o189n732J127N842N428j74o659n023l8O484N569n72n731n949Q43
2070e492N381N617r9n660n171m84N821N544o1m806n937j08M548N668J162m893
2086A030n158j852M651O129J489m176o424j665M261O495K190m732o200k487M495
2101a954O542K101m532o617j952M184O684K058m059o105k710M202N976K215l089
2116B944o568j990K511O223L150l181n885l634K956N903L601k390o457l327J958
2131d186O438M206k699n843m477J997O639M117j621p039l851J569O191M901k065
$$ plain form
2146 4277 -1528 -6699 -4764 1486 5772 4341 -1911 -5844 -4664 1393 5563 4356 -890 -6041 -4552
2161 -4552 554 5313 4949 -667 -4976 -5213 283 5474 5407 645 -5324 -5217 -371 5330 5935 418
2177 418 -4964 -5800 -434 5396 5830 1149 -5200 -5729 -472 5040 6168 958 -4479 -5790 -1061 4940
2193 4940 5794 1649 -4400 -5484 -1280 3913 5662 1400 -3815 -6130 -1888 3533 5622 2147 -3715
2208 -3715 -5650 -2407 3353 5738 2387 -3380 -6520 -3044 3408 5990 2715 -3794 -6221 -3382 3127
2223 3127 6112 2782 -3283 -6511 -3313 2844 5634 3208 -3027 -5849 -3391 2411 5602 2864 -2118
2238 -2118 -5714 -3560 1992 5037 4163 -1866 -5101 -4086 1321 5693 3999 -710 -5572 -4328 1017
2253 1017 5476 4807 -1057 -5128 -4549 1083 6075 4774 -495 -5676 -4722 840 5573 5039 -542 -4838
$$ packed form
2146D277n805n171J935O250M286j431o252l933J180O057M170j207n246n151J489
2161d552N106M759l64n616m309k37N496N191o7m762n969J07M846N701O05n517
2177D18n382q36N366N830M34m681o349n29N257N512J128n210n437j311M729O001
2193D940Q54m145o049j084M204N193J749m262n215k315M242N421K089l475n862
2208c715j935L243N760K385l351n767l140L476O452K582l275o509k427K839O509
2223C127K985l330o065l228L198O157K790k426o235k822K458N802L191k738m982
2238b118l596K154N552L045q74o029l235J015N407M372j694m709m862J244N345
2253A017M459o69n864m071N79N632M992j301n269n181R54N562M733n34n581m296
$$ plain form
2269 -4838 -4674 308 5481 4790 -84 -4669 -4746 287 4751 5039 321 -4343 -4870 -748 4344 4945 1048
2286 1048 -4448 -5157 -1505 3657 5067 1255 -3952 -5779 -1542 4021 4847 1637 -4120 -5635 -1648
2301 -1648 3748 5503 1420 -4102 -5494 -2189 3805 5248 2086 -4012 -5806 -2149 2897 5428 1710
2316 1710 -2819 -5359 -2517 2900 5233 2689 -2435 -5035 -2670 2399 5356 2932 -2262 -5114 -3180
2331 -3180 2402 5305 3668 -1908 -5225 -3251 2076 5782 3649 -1473 -5236 -3570 2028 5238 3965
2346 3965 -1791 -5036 -3489 1731 5256 3463 -1136 -5007 -3531 1505 4758 3820 -983 -4271 -4008
2361 -4008 325 4633 3814 -146 -4494 -4186 41 4112 4650 -100 -4366 -4466 -667 4279 4574 392
2377 392 -4686 -5005 -692 3890 4936 318 -4305 -4934 -796 4231 4370 464 -4095 -4781 -990 3712
$$ packed form
2269d838J64M982N173o91m874m585p7N033M464K88m718m664n27M122N092O01l897
2286A048n496p09L652N162J410l812n207j827M237N563Q26l210n757j515L987
2301a648N396J755m083n522j392L305N994J443l162o098j794L657N046K531l718
2316A710m529k540K842N417K333k544n124k600K365N069K957k424n194k852J934
2331c180N582K903j637n576l317J974N327L706k133n122l763J666N598L210j273
2346C965n756l245J547N220L525j793m599l871J476N036L253r38m803l288K63
2361d008M333M308q19l960m348L08M227M071N38m750m266j00L799M946K95m182
2377C92n078l19M313M582J046m618m623o29M138N027J39l906m559o86L791M702
$$ plain form
2393 3712 4577 612 -3585 -4713 -1545 3520 4392 1511 -3281 -4606 -1491 2745 4840 1935 -2851
2408 -2851 -4799 -2393 2844 4809 2528 -2748 -4991 -1822 2888 5220 2418 -2206 -4815 -2552 2913
2423 2913 5091 2793 -2397 -4878 -2363 2227 5063 2810 -1783 -4366 -2534 2214 4664 3280 -1560
2438 -1560 -4685 -2838 1235 4464 2867 -1331 -4431 -3450 1268 4085 3393 -1048 -4650 -3956 316 4345
2454 4345 3588 -685 -4641 -4315 384 4036 3967 -574 -4678 -4070 -69 4312 3788 -138 -4131 -4406 88
2471 88 3696 4053 121 -4049 -3907 -400 3544 3939 473 -3552 -4283 -522 3170 4500 1370 -3186
2487 -3186 -4267 -1262 3408 4382 1448 -2972 -4468 -1138 3220 5238 1816 -3013 -4537 -1657 3066
2502 3066 4636 1971 -2778 -4558 -1603 2663 4937 1968 -2450 -4296 -1874 2413 4470 2260 -1861
$$ packed form
2393C712Q65l965m197j128L168N065Q72k881m792j325L115M236K095k905m786
2408b851j948K406N237J965k281n276k243L169M710K332k802m624k609K263N465
2423B913K178k298n190k481K515M590K836k253m593k583J832M748K450j384m840
2438a560l125J847M073L229j597m198l100R81M718K817o92m441l602O94M272M029
2454D345p57m273l956L26M699L652o9m541m104O08M001M381n24l926l993k75M494
2471H8L608L57l932m170J42L507L944L95l466m025p31L761L692J330l130m556
2487c186j081L005M670R74k934m420j496L330M358K018l422m829j524K880M723
2502C066J570k665m749j780K955M266K274k969m418j846K422M287K057k210m121
$$ plain form
2517 -1861 -4160 -2139 1883 4295 2376 -1937 -4066 -2667 1500 4271 3147 -1238 -4310 -3033 749
2532 749 4587 3132 -1543 -4517 -3455 1099 4294 3144 -1017 -4622 -3220 761 4054 3465 -1057
2547 -1057 -4238 -3639 759 3988 3362 -565 -4175 -3363 266 3726 3435 -304 -3445 -3790 100 3225
2563 3225 3511 469 -3395 -3844 -815 3434 4008 656 -3469 -4221 -334 3278 4579 986 -3472 -3832
2579 -3832 -1062 3583 4633 880 -3003 -4070 -673 3227 4356 1185 -2935 -4135 -1087 2896 4159
2594 4159 1273 -2425 -4274 -1367 2619 4088 1926 -2276 -4037 -1985 2292 4261 1950 -2004 -4339
2609 -4339 -2315 1938 4427 2419 -2186 -4455 -2920 1719 4279 2568 -1885 -4516 -2689 1511 4283
2624 4283 2538 -1866 -4201 -3159 1632 4014 2589 -1576 -4542 -2863 1158 4132 2948 -954 -3918
$$ packed form
2517a861k299K021M022K412j919m313k129J399M167K771j124m385l072J277L782
2532G49L838j455m675k974J062M554L195j150m161l605J402L981L293n89m522
2547a057l181N99M398L229o26l927l610Q12L629L460k91l739l141l45L890L125
2563C225K86l042l864m49L029M249N74l352m125p52L887L612J301l593m458l60
2579c832K770M645J050l753l883j067L397L900J129l171m120j200L048L983J263
2594D159k886l698j849K907L986J469k162m202j761K052M277J969k311l954k335
2609d339K024M253K489k008m605k269J535M639K560j711m453k631J827M200K772
2624D283j745m404k335J042M791K382j425m165k966J679M021K974j184l902k964
$$ plain form
2639 -3918 -3301 709 3963 3024 -529 -3862 -3082 197 3653 3752 -350 -3617 -3922 313 3989 3839 111
2656 111 -3740 -3456 -32 3752 4169 180 -3505 -3840 151 3822 3775 413 -3663 -3824 -183 3552 3814
2673 3814 529 -3013 -3931 -413 2953 3754 1091 -2972 -3586 -1002 2979 4086 1208 -2414 -4107 -1272
2689 -1272 2562 4151 1944 -2726 -4062 -1747 2681 4121 1547 -2597 -4631 -1679 2221 4132 2003
2704 2003 -2558 -4289 -2194 2122 4125 1907 -2104 -4212 -2031 2004 3882 2291 -2016 -3833 -2466
2719 -2466 1606 3846 2343 -1333 -4087 -2273 1366 3841 2910 -1007 -3822 -2954 987 4243 3175
2734 3175 -772 -4238 -3069 761 4077 3499 -682 -3677 -3421 834 4182 3449 -305 -3944 -3263 556
2750 556 3809 3613 -190 -3250 -3300 217 3308 3345 87 -3053 -3341 -290 3221 3678 355 -2877 -3669
$$ packed form
2639c918O17M010L254r39l553l333P80L279L456R9m102l267l05M235L676j50l728
2656A11l851K84L424L784M17l989l685l35L991L671m7l362m076j61L641L735K62
2673C814l285l542r18L518L366Q01k663m063o14K584L981J107k878l622j693K835
2689a272L834J589k207m670j336K315M428J440k574m144k034K952L900J911k129
2704B003m561j731K095M316K003k218m011k108K181M035J878j591m307j817J367
2719b466M072K240j503l676k754J814L639K475r31l917k815Q68L941L256j068
2734C175l947l466J169L830L316n78m181k995K56M255L348p33l754l639O81L819
2750E56L253j96l803l060n0L517L091L7l258l140k88L051L511M57l323l232p92
$$ plain form
2767 -3669 -493 3086 3535 728 -3371 -3749 -1010 3041 3780 547 -3241 -4082 -1032 2874 3821 982
2783 982 -3190 -3741 -1456 2769 3914 967 -2527 -4126 -1246 2321 3609 1641 -2612 -3850 -1610
2798 -1610 2100 3652 1496 -1843 -3899 -1820 2021 3644 2190 -1785 -3834 -2087 1448 3835 2336
2813 2336 -1439 -3948 -2201 1646 4057 2593 -1550 -3749 -2352 1438 4222 2519 -1024 -3934 -2560
2828 -2560 1465 3672 2691 -1073 -3293 -2303 883 3607 2411 -451 -3500 -2836 691 3256 3166 -528
2844 -528 -3300 -3269 188 3209 3184 -50 -3308 -3321 62 3018 3331 -157 -3567 -3463 -237 3319 2950
2861 2950 248 -3422 -3492 -513 2867 3357 155 -2931 -3520 -466 2794 2960 646 -2790 -3294 -701
2877 -701 2466 3271 773 -2411 -3396 -1253 2436 3476 1550 -2493 -3529 -1304 2015 3921 1644 -2021
$$ packed form
2767c669L176L579M49k807m099l78K739M051P39l233l788q41L050L906R47k839
2783I82m172n51K285M225J145k947l494j599K880L567J288j968m253j238K240
2798a610L710J552k156l339k056K079L841J623j454l975k049J747L535K387j499
2813B336l775k509J747L847K411j464m143k199J397L790K784j703l543k910J374
2828b560M025K207r81l764k220R90L186K724j196k862l049O64L527K565r0l694
2844e28k772L1L457L021k5l234l258j3L383K956L13l488l410J04L226L556l69
2861B950k702l670p0K979L380M90l202l086n89L054L260J66k314l436n04K593
2877g01L167Q05k498l184r85K143L689J040j926m043j036K225L319J906k277l665
$$ plain form
2893 -2021 -3321 -1672 2451 3576 1932 -1931 -3751 -1457 1865 4004 1802 -1777 -3476 -1650 2242
2908 2242 3360 1965 -1712 -3383 -1648 1311 3325 1959 -972 -3075 -2139 1156 3446 2413 -1131
2923 -1131 -3291 -2244 783 3551 2288 -730 -3179 -2921 494 2915 2630 -830 -3547 -2937 349 3434
2939 3434 2592 -625 -3608 -3094 403 2697 2790 -458 -2979 -2787 -28 3209 2500 185 -2956 -2831 -26
2956 -26 2328 2992 -194 -2600 -2963 -503 2639 2805 647 -2544 -3307 -534 2309 3490 1086 -2480
2972 -2480 -3367 -951 2508 3393 1255 -2326 -3525 -947 1939 3502 1173 -1949 -3346 -1020 2507
2987 2507 3170 1308 -1911 -3140 -1473 2171 3350 1474 -1426 -3003 -1161 1719 2967 1834 -1424
3002 -1424 -3073 -1735 1252 3472 2243 -1228 -3066 -2248 1197 3223 2340 -1274 -3442 -2009 951
$$ packed form
2893b021j300J649M123J125j644l863j820K294L322K139k202l579j699J826L892
2908B242J118j395l677j671J735K959K014j366k931k103R36L295K290j033l544
2923a131k160J047L027K768j263l018k449K58L415K421k85l460k717O10L286L085
2939C434q42l217k983N14L497K294R3l248k521J92K759L237p09k315l141J25K805
2956b6K354O64l186k406l63K460L142J66k158l191p63K773K843J181k404l566
2972b480q87K416L459Q85k138l581j199K578K886J563k329l122j397K326L527
2987B507O63j862l219j229J667L644J179j876k900j577J842K880J248j133l258
3002a424j649J338K987K220j229l471j838Q18L445K026q83l614k168J433K960
$$ plain form
3017 951 3487 2139 -1003 -3569 -2518 953 3031 2108 -779 -3068 -2342 438 3106 2323 -727 -2870
3033 -2870 -2667 791 2560 2419 -422 -2986 -2462 136 2785 2392 86 -2965 -2792 72 2362 3013
3049 3013 10 -2667 -2586 -321 2934 3028 355 -2697 -3178 -58 2803 3239 504 -2344 -2767 -866 2833
3066 2833 2923 703 -2211 -3142 -389 1947 2824 902 -1922 -2792 -1079 2073 3105 1165 -1695 -2976
3082 -2976 -1288 1699 3190 1755 -1612 -3012 -1756 1649 2968 1699 -1486 -3346 -1833 1264 3126
3097 3126 1519 -1691 -3239 -1955 1087 3151 1817 -1173 -3073 -2020 1126 2909 2089 -1336 -2942
3112 -2942 -2049 745 2964 1944 -719 -2882 -2263 566 3031 2247 -490 -2934 -2549 363 2759 2403
3128 2403 -403 -2907 -2242 171 2894 2526 -115 -2555 -2822 199 2745 2818 -79 -2927 -2619 99
$$ packed form
3017I51K536j348l142k566J051L471K078r23k887k289P26K780K668p83l050k143
3033b870K03L458J769j41k841k564N24K598K649l93k306l051J73K864K290O51
3049C013l003k677Q1K265L255R4k673l052m81L120K861M36k735k848m23J901L699
3066B833R0k220k914r31K753K336Q77j922k824q70J713L152J032j940k860j281
3082b976J688K987J491j435l367j400J256L405J319j269l185j860J513L097J862
3097C126j607l210j548J284L042K064j334k990j900J053L146J783q20l425j606
3112b942Q93K794K219j020k663k163O19K829K465p84k737k444L85K912K396l56
3128B403k806k504O65K413K723l68k641k440k67L021K546P3k897k848L08K718
$$ plain form
3144 99 2515 2853 274 -2476 -2785 60 2458 2727 716 -2248 -2464 -285 2289 2764 899 -2062 -2876
3161 -2876 -717 1761 2890 1203 -2068 -2603 -1156 2020 2805 843 -1717 -3286 -1266 1846 3261
3176 3261 1199 -1940 -3043 -1542 1721 3033 1415 -1708 -3304 -1127 1423 2931 1200 -1839 -2945
3191 -2945 -1649 1323 2794 1392 -1416 -3002 -1703 839 2835 1657 -1121 -2799 -1940 998 2947
3206 2947 2059 -797 -2864 -1962 674 2905 2056 -669 -2842 -2141 881 3047 2400 -463 -2945 -2166
3222 -2166 636 2692 2625 -530 -2468 -2424 434 2717 2540 -81 -2602 -2039 253 2672 2586 -393 -2396
3239 -2396 -2638 41 2540 2417 347 -2432 -2419 -409 2237 2618 341 -2300 -2976 -759 2406 2721 678
3256 678 -2465 -2916 -699 2106 2799 458 -2269 -3114 -983 1884 2634 612 -2141 -2895 -872 1804
$$ packed form
3144I9K416L38k579k750l09K845K398K69k011k964k16K179K574M75j865k961q14
3161b876K159K478J129j687l271n35J447L176P85j962k560j569K020L112J415
3176C261k062l139j103J501L263J312j618l123j596K177K550J508j731l039j106
3191b945J296K972J471j402k808j586J299K542J996j178k778j678Q59K938J949
3206B947q88k856k067R02K636K231q49k725k173P01L022K166o47k863k482P79
3222b166K802K056o7l155j938M4K858K283j77k621k521N63K292K419q6k979k003
3239b396k42K679K499j23k070k779J3K010K646L81k277k641o76K217L165L15k043
3256F78l143m51K217K805O93k341k727q45K131K867P50k022k753p54K023K676
$$ plain form
3272 1804 2817 893 -1794 -3056 -862 1643 2433 869 -1919 -2452 -1244 1374 2669 1342 -1261
3287 -1261 -2884 -1475 1226 2789 1807 -1278 -2819 -1776 1349 3071 1639 -1071 -2986 -1704 1201
3302 1201 2823 2044 -1022 -2850 -1776 986 2805 1982 -807 -2574 -1819 819 2531 1890 -586 -2174
3318 -2174 -2114 631 2584 2094 -254 -2601 -2020 270 2508 2086 -108 -2534 -2346 135 2589 2201 -93
3335 -93 -2582 -2610 -163 2503 2571 -91 -2442 -2673 -61 2174 1947 105 -2535 -2443 -237 1879 2375 23
3353 23 -2013 -2624 -309 1700 2587 851 -2007 -2510 -831 1789 2764 957 -1468 -2760 -1030 2100
3369 2100 2789 1295 -1561 -2658 -1344 1746 2987 1164 -1650 -2588 -1126 1783 2897 1075 -1623
3384 -1623 -2666 -855 1565 2895 1357 -1165 -2596 -1153 1235 2535 1703 -1051 -2309 -1625 1031
$$ packed form
3272A804J013j924k687j262K194K505P90j564k788n33J208K618J295j327k603
3287a261j623J409K701J563r82l085j541J043L125J722j432k710j915J282K905
3302A201J622p79l066j828J074K762J819q23k789j767P55K638J712o41k476j588
3318b174O0K745J953m90k348k347N81K290K238m22k194k426J88K481K454l88k294
3335i3k489k8K447K666O8k662k351k31K612K235k27j842k640R2K206K116M96k352
3353B3k036o11K315K009Q87j736k858n03J679K620R75j807k425j292J730L130
3369B100O89j494k856j097J314L090J241j823k814r38J462K909J114j822k698
3384a623j043J811K420J330j538k522j431J443K388J300q32k754j258O84K656
$$ plain form
3399 1031 2790 1635 -832 -2599 -1594 1023 2714 1981 -788 -2383 -2100 771 2626 1900 -347 -2620
3415 -2620 -2114 321 2611 2159 -679 -2463 -2163 458 2802 2147 -594 -2463 -2298 26 2026 2158
3431 2158 -248 -2421 -2201 -65 2270 1920 44 -2382 -2372 -347 1735 2223 428 -1978 -2533 -275
3447 -275 1990 2355 520 -2151 -2459 -510 2057 2411 336 -1814 -2688 -820 2242 2625 550 -1726
3463 -1726 -2393 -734 2043 2502 644 -1626 -2321 -565 1710 2358 1205 -1331 -2556 -792 1273 2640
3479 2640 1237 -1461 -2442 -1171 1349 2621 1315 -1016 -2641 -1421 1129 2720 1548 -965 -2512
3494 -2512 -1927 1152 2476 1757 -901 -2743 -1691 811 2381 1453 -681 -2427 -1684 638 2140 1468
3510 1468 -795 -2415 -1845 688 2163 1683 -461 -2301 -2099 422 2022 1756 -298 -2166 -1985 212
$$ packed form
3399A031J759j155k467j767J005K617J691p33k769j595K83K871J855p26k247k273
3415b620N06K435K290m52k838j784L00K621K344o55k741j869J65K324K000J32
3431B158k406k173K20K136K335l50j876k426J0K025K082M88j795k406n55K258
3447b75K265L65j835k671l08J949K567L54k075k150q74J868L062L83k075k276
3463a726o67J659K777M59j858k270o95J756K275O48j153k536j225J764K065J367
3479B640j403k698r81J271K520J272j306k331j625J220K550J591j172k513j547
3494b512N85L079J324p19k658j842J052K502J570r28k134j746P43K322J502o72
3510A468k263j620N70K533J475m80k144j840K02K521J600k66k054j868J81K197
$$ plain form
3526 212 1988 2078 96 -1968 -2135 219 2062 2104 -208 -2038 -2087 -89 1998 2216 390 -1867 -2463
3543 -2463 -57 2102 2186 414 -1943 -2299 -323 2161 2246 497 -1949 -2158 -361 1562 2053 611 -1477
3560 -1477 -2106 -1023 1676 2190 886 -1317 -2500 -1084 1311 2312 875 -1557 -2597 -1083 1455
3575 1455 2393 1172 -1392 -2323 -1128 1139 2505 1160 -1300 -2265 -1487 1119 2288 1093 -1107 -2490
3591 -2490 -1402 875 2282 1142 -1057 -2372 -1662 698 2091 1616 -762 -2468 -1683 348 2247 1491
3607 1491 -509 -2293 -1731 428 2052 2082 -375 -2358 -1809 290 2323 1949 -202 -2110 -1934 548
3623 548 2051 2265 -74 -1811 -1660 126 2195 2084 -104 -1755 -2099 108 1733 1841 194 -1892
3639 -1892 -1988 -437 1725 2073 432 -1601 -2361 -373 1757 2103 427 -1648 -2332 -860 1885 2275 748
$$ packed form
3526B12J776R0j982k064j67K354J843M2k312j830m9J998K087K18j826k257n96
3543b463K406K159Q4j772k357l56J976K484Q5j749k446k09J797J923M91j442k088
3560a477o29J083K699N14j304k203j183J416K395J001j437k432j040J514K538
3575A455R38j221k564r31J195K267J366j345k460r65P78K606J169j195k200j383
3591b490J088K277J407j140k199j315P10K360J393m75k378j706P85K031J899p56
3607A491k000j784N62K159J624L0k457j983N49K099K033l74k151j908J76K482
3623E48J503K14k339j737J51J786K069j11k188j651l44K207J625J08j647k086
3639a892r6J551K162L48j641k033p60J988K130L46j676k075o84J472K745L90j527
$$ plain form
3656 748 -1638 -2645 -792 1544 2302 699 -1733 -2437 -772 1487 2275 652 -1443 -2405 -930 1053
3672 1053 2132 975 -1365 -1972 -1167 776 2178 1254 -746 -2213 -1343 505 2163 1332 -1122 -2148
3688 -2148 -1462 775 2240 1605 -513 -2232 -1319 614 2158 1662 -375 -2149 -1287 696 2029 1720
3704 1720 -400 -2305 -1557 422 2306 1491 -362 -2081 -1773 226 1878 1656 -68 -2061 -1776 161
3720 161 2056 1969 189 -1931 -1880 129 1739 2037 407 -2040 -1848 -81 1663 2050 407 -1830 -2382
3737 -2382 -441 1521 2049 302 -1878 -2013 -389 1678 1882 318 -1792 -2154 -429 1421 1761 688
3753 688 -1560 -2142 -1001 1373 2019 501 -1362 -2266 -866 1227 2171 1056 -1238 -2141 -978 1100
3769 1100 2182 1227 -1119 -2131 -949 903 2524 1200 -1122 -2021 -1087 1156 2431 1233 -962 -2092
$$ packed form
3656G48k386j007J853K336P58j603k432p04J665K259P88j623k095r62J475J983
3672A053J079j157k340o07Q05J943J402r24k000j467Q70J848J658q31k454j026
3688b148O86K237J465o35k118j719R13J933J544m96k037j774Q62J983J333l09
3704A720k120j905P48J979J884q15j853j719L08J999J652k22j724j993K85J937
3720A61J895q7j780k120N1K009J610K98j630k447J92J767J744L87j643k237n52
3737b382J941J962N28j747k180j35J624K067K04j564k110l62J725J850L40j073
3753F88k248n82J141K374O46j518j863r04J400K093R44j115k294r03J163K078
3769A100J082r55k346j012J182J852J621j324k322q99R34K243J275j198k195j130
$$ plain form
3785 -2092 -1114 957 2078 1169 -747 -1975 -1621 875 1999 1328 -464 -1901 -1487 535 1817 1750 -307
3802 -307 -1973 -1508 305 1887 1686 -120 -2023 -1734 186 1990 1878 -63 -1812 -1837 113 2057 1873
3819 1873 88 -2065 -1719 -155 1789 1851 -134 -1881 -1670 17 1639 1707 142 -1782 -2183 -510 1684
3836 1684 1950 322 -1566 -1997 -454 1251 1781 630 -1514 -1828 -879 1252 2030 375 -1358 -1972 -815
3853 -815 1492 2173 777 -1201 -1904 -675 1563 2192 1001 -1129 -2029 -668 1233 1997 690 -850
3869 -850 -2055 -940 1016 1984 696 -819 -1944 -1060 635 2171 1306 -728 -2081 -1364 549 1989
3885 1989 1386 -481 -1908 -1249 500 1979 1463 -645 -1953 -1679 158 2082 1562 -426 -2004 -1524
3901 -1524 652 1868 1459 -948 -1825 -1639 330 1646 1244 -332 -1927 -1613 25 1696 1723 -67 -1722
$$ packed form
3785b092R78K071J121r09j916j228L54K496J124o71j792j437M14K022J282o7k057
3802c07j666M65J813J582k01j806j903K89J920J804j12j941j749k5J950J944j84
3819A873j785k153L46J564J944O2j985j747K11J687J622O8j565j924m01J673K194
3836A684K66j628j888m31J543J705N30j151k144l14R49K131P78j655j733o14J157
3853h15K307O81j396j978p03J229K238O29j191k130r00J361J901P64j307j540
3869h50j205J115J956R68j288j515j125Q84J695J536q65k034j353P17J913J440
3885A989o03j867j427O59J749J479n16k108j308K74J837J924n20j988j578M80
3901a524K176J216m09k407q77J86J969J316m02j576j595L14J638J671K7j790j655
$$ plain form
3918 -1722 -1416 -29 1637 1333 212 -1638 -1538 -220 1603 1895 310 -1493 -1719 -226 1636 1805
3934 1805 355 -1494 -1942 -154 1293 1922 34 -1510 -1658 -127 1573 1860 615 -1150 -1801 -585
3950 -585 1447 2032 473 -1193 -1784 -1057 1303 1813 885 -976 -1835 -755 1075 1858 1026 -914 -1903
3967 -1903 -1068 839 1870 950 -993 -2037 -1033 890 2032 1164 -563 -1949 -1064 860 1786 1228
3983 1228 -1065 -1922 -978 765 2119 1386 -768 -1930 -1238 537 1356 1154 -458 -1515 -1489 125 1715
4000 1715 1426 -246 -1761 -1478 68 1622 1635 -104 -1386 -1572 24 1700 1687 7 -1690 -1583 -126
4017 -126 1688 1424 -110 -1610 -1625 116 1440 1644 216 -1609 -1398 94 1241 1748 62 -1494 -1582
4034 -1582 -121 1487 1612 322 -1429 -1832 -450 1174 1929 665 -1148 -1765 -548 1276 1951 751
$$ packed form
3918a722L06J387J666l04j121j850J00J318J823K92j585j803k26J493J862J69
3934A805j450j849m48J788J447O29j888j544j48J531J700K87j245j765o51J216
3950e85K032N85j559j666n91P27K360N10r28j861q59J080J830P83q32j940r89
3967a903Q35J907J031r20j943j044J004J923J142q68j727j386Q85J924R26n58
3983A228k293q57R44J743J354p33k154j162O92J775Q19k02j612j057K6J614J590
4000A715k89j672j515K83J546J554J3j739j282j86J596J676j3j680j697J07J457
4017a26J814k64j534j500j5J741J324K04j428j825K11J492J147N07j686j556q8
4034a582J461J608J25j290j751m03J382J624P55j264j813o17J217J824O75j200
$$ plain form
4050 751 -1131 -1668 -692 853 1847 744 -1107 -1650 -1017 982 1996 734 -1517 -1628 -666 1032 1725
4067 1725 619 -766 -2077 -890 809 1557 974 -657 -1825 -925 612 1582 1147 -380 -1657 -1297
4083 -1297 638 1558 1007 -793 -2012 -1235 495 1704 1173 -407 -1680 -1311 574 1796 1211 -330
4099 -330 -1638 -1426 417 1632 1236 -231 -1559 -1194 423 1606 1379 -103 -1179 -1288 -155 1320
4115 1320 1426 82 -1375 -1386 -157 1235 1486 228 -1443 -1481 -349 1430 1642 514 -1161 -1616 -399
4132 -399 1059 1754 280 -1267 -1586 -533 1327 1778 505 -1244 -1694 -211 970 1413 331 -1185
4148 -1185 -1455 -545 1227 1425 450 -981 -1600 -593 858 1352 603 -1053 -1898 -1033 813 1745 836 -687
4166 -687 -1502 -1019 663 1788 934 -526 -1909 -1076 622 1504 829 -529 -1686 -876 736 1943 1198
$$ packed form
4050G51j882n37R76J545R94j103j851n43O33J999J014j262k251j11R62J698O93
4067A725j106j385j311J187J699P48n83j631j168R00J537R70m35j527j277L60
4083a297J935R20n51j800j219P77J730J209n31j580j273L69J885J222n85j541
4099c30j308K12J843J215l96j467j328L65J617J183k27j482j076j09J133J475
4115A320J06j344j457j1J229J392K51j258j671l8J132J779K12j128j675m55J217
4132c99J458O95j474j547l19J053J860M51j273j749m50J483J181M43j082j516
4148a185k70R10J772J98r75j431o19J007J451M94p49j656q45Q65J846R32r09j523
4166f87q15M83J682J125q54j460j383Q33J698Q82o75j358j157Q10J612J207p45
$$ plain form
4183 1198 -627 -1409 -1297 605 1926 1483 -471 -1665 -1109 253 1512 1185 -295 -1354 -1453 308 1332
4200 1332 1192 -306 -1529 -1387 -38 1624 1335 -196 -1448 -1353 83 1587 1421 -188 -1259 -1479 -174
4217 -174 1263 1048 148 -1326 -1550 -88 1251 1360 -35 -1240 -1713 -400 1143 1509 320 -936 -1691
4234 -1691 -108 1109 1508 448 -1194 -1391 -426 1118 1631 380 -906 -1781 -694 962 1745 627
4250 627 -993 -1596 -865 1022 1512 901 -790 -1485 -866 768 1771 670 -1018 -1585 -715 918 1475
4267 1475 721 -509 -1490 -599 377 1493 1126 -549 -1531 -1150 823 1742 1110 -148 -1510 -1126 418
4284 418 1425 1603 -330 -1448 -1236 333 1825 1185 -401 -1696 -1133 266 1513 1089 -476 -1582
4300 -1582 -1142 159 1199 1412 -61 -1598 -1143 -27 1310 1116 -91 -1223 -1450 -95 1347 1047
$$ packed form
4183A198j825p82J12J902J321m43j954j194N56J362J259l27j480j059r9J761J024
4200A332j40j498j223J42J349J662k89j531j252R5J436J504j66j609j071k20J305
4217a74J437k15r00j474k24J462J339J09j395j205m73J313J543L66j189j256p55
4234a691J583J217L99j060j642j97R65J544N13j251j286q75J087J656P83j118
4250F27j620o03P31J887M90o11j691o95O19J634J003j101j688n67Q70J633N57
4267A475p54j230r81Q91R76J116l67j675r82L81J973R19o32j258j362L84J544
4284D18J007J78j933j118K12J569J492o40j586j295N63J399J247m24j565j106
4300a582M40J301J040K13j473j537M55J116J337j94j207j132k27J355J442l00
$$ plain form
4316 1047 236 -1390 -1334 -414 1426 1439 50 -1159 -1684 -225 1105 1441 612 -959 -1535 -497 1083
4333 1083 1490 594 -830 -1428 -338 1175 1886 579 -1210 -1646 -503 1137 1468 642 -824 -1629 -597
4350 -597 963 1499 758 -561 -1474 -696 746 1853 855 -465 -1368 -779 650 1573 888 -550 -1469 -985
4368 -985 458 1751 1052 -284 -1644 -997 506 1590 936 -692 -1477 -1134 513 1493 789 -610 -1412
4385 -1412 -1121 361 1648 900 -625 -1368 -1245 264 1498 1370 -141 -1274 -1246 -124 1273 1098 -76
4402 -76 -1201 -1295 -162 1211 1427 182 -1096 -1350 -39 1123 1544 310 -1078 -1201 -27 1316 1420
4419 1420 181 -1178 -1157 1 1145 1502 177 -1246 -1474 -59 1073 1501 425 -1163 -1374 -403 973
4436 973 1695 555 -854 -1563 -461 876 1486 877 -842 -1252 -503 996 1655 634 -905 -1682 -665
$$ packed form
4316A047q11j626N6R20J840J3j389j209n25J459J330L36q29j571n76J038J580
4333A083M07q96j424n98J090J513P11j307j789m36J143J640L31q26j466q05J032
4350e97J560N36p41j319r13P78J442J107r98j320r03N89J429R23o85j438r19M84
4368i85J443J293o99j336j360O47J503J084o54j628p85L43J647R80p04j399q02
4385a412K91J482J287p48j525p43J23J509J234j28j511j133K8J122J397j75j174
4402g6j125r4J133J373K16j245j278k54J311J162M21j234j388j23J174J343J04
4419A420j239j359K1J158J144L57j325j423k28J415J132M28j076j588k11R71J376
4436I73P22j140j409p09J102J337O10o09j719m10P49J499O59j021j539p77J017
$$ plain form
4453 -665 802 1332 723 -787 -1503 -1055 650 1505 487 -802 -1628 -481 679 1532 648 -567 -1640
4470 -1640 -920 456 1273 921 -464 -1352 -864 302 1259 1231 -384 -1481 -1094 53 1221 918 -202
4487 -202 -1517 -1398 375 1290 1235 -114 -1215 -1089 236 1565 1092 -125 -1492 -977 223 1310 1172
4504 1172 -216 -1092 -1243 33 1123 1259 100 -1350 -1312 -21 1042 1424 223 -977 -1365 -256 1010
4521 1010 1491 152 -1017 -1158 -263 962 1356 371 -1280 -1668 -174 1066 1274 263 -933 -1618 -195
4538 -195 978 1505 552 -937 -1521 -372 927 1338 696 -924 -1494 -372 1001 1435 714 -553 -1557
4555 -1557 -495 652 1108 629 -544 -1265 -996 399 1222 877 -472 -1267 -1141 518 1532 762 -595
4572 -595 -1129 -1036 450 1409 1123 -370 -1514 -817 192 964 1216 -349 -1360 -620 216 1382 1037 -145
$$ packed form
4453f65J467N30o09j510p16M48J705Q55j018j289q26J147J160Q53q84j215j073
4470a640P20J376Q17l52j385q88M88J166R57k8j615j097L87J147J168l03j120
4487b02j315J19J773R15n5j349j101J26J325J329m73j217j367N15J200J087j38
4504A172j388q76j51J276J090J36j159j450L8J291J063L82j201j200l88J109J266
4521A010M81j339j169j41Q95J225L94r85j651l88J494J240K08j011j196o85J423
4538a95J173N27r53j489n84J149J299M11o42j620n70J122J373M34p21j267j004
4555a557J062J147M56m79j173p21K69J395Q23l45j349p95J26J659J014p70j357
4572e95n34R3J486R59k86j493j144O97J009P72K52j565j011P40Q36J166l45j182
$$ plain form
4590 -145 -1048 -1080 125 1028 998 -152 -1151 -924 13 1127 962 -221 -1222 -1142 -40 1000 1508 184
4608 184 -1073 -1246 -220 1228 1261 274 -1046 -1405 -88 998 1404 166 -855 -1465 -352 900 1257
4625 1257 189 -798 -1445 -369 627 1184 30 -934 -1353 -570 655 1175 460 -825 -1341 -708 655 1599
4643 1599 719 -770 -1345 -494 667 1523 644 -533 -1415 -905 558 1310 624 -570 -1327 -817 536 1437
4661 1437 827 -557 -1467 -720 371 1575 848 -605 -1230 -725 519 1272 898 -302 -1323 -758 439
4678 439 1466 913 -245 -1062 -1092 233 1041 1090 -36 -896 -1013 36 1199 1073 -253 -1100 -1281 145
4696 145 1130 1246 -84 -1209 -1185 -223 1252 1013 397 -1236 -961 -20 1055 1130 -68 -986 -1136 -335 986
4715 986 1101 287 -893 -1177 -198 610 1300 345 -991 -1344 -342 915 1174 509 -851 -1333 -532 790
$$ packed form
4590a45r03l2J205R03l0j150r99K27R37J114j65j183j001Q0J102J040N08j324
4608A84j257j73J026J448L3r87j320l59J317J086M06j238j021o10J113J252L57
4625A257j068r87o47J076R96N57j154r64m19P83J225N20p15j285n16O33J363R44
4643A599q80j489n75Q51J161Q56q79j177q82N10J463P52o86j194p57N10J353R01
4661A437o10j384r10P47J091J204p27j453o25N05J244P53l74j200j021N65J197
4678D39J027n53j158q17l0J325Q08M9j126q60j17J049J163j26j326q47j81J426
4696A45R85J16j330j125K4R62J475k39o16j633K75R41J075P5j198r18j50Q01J321
4715I86J15q14j180k84R79Q08O90r55j336l53J002J257K59o65j360m82Q01J322
$$ plain form
4733 790 1586 414 -783 -1227 -419 981 1456 394 -766 -1676 -659 697 1150 833 -726 -1135 -626
4750 -626 554 1330 823 -551 -1276 -628 528 1227 863 -870 -1089 -876 522 1393 981 -393 -1412 -831
4768 -831 361 1137 912 -502 -1329 -1044 308 1154 922 -168 -1347 -828 183 1235 1017 -113 -1248
4785 -1248 -1064 207 1000 1014 -98 -1274 -1085 216 913 1181 -98 -1087 -1241 -88 900 1100 19 -1315
4803 -1315 -1309 -486 891 1329 158 -921 -1401 -98 868 1453 267 -899 -1227 -97 1094 1506 231
4820 231 -912 -1212 -211 750 1380 383 -993 -1170 -600 846 1433 482 -762 -1351 -370 966 1217 786
4838 786 -711 -1419 -525 447 1093 635 -424 -1416 -705 838 1249 863 -772 -1391 -789 510 1338 613
4856 613 -675 -1589 -598 596 1295 710 -636 -1212 -860 451 1107 649 -328 -996 -942 538 1171 910 -277
$$ packed form
4733G90P96j172j197m44Q08J400M75j062j160r10J017J356M53l17j559m09N09
4750f26J180P76n07j374p25O48J156O99l64j733k19K13J398Q71m12j374j019N81
4768h31J192P76k25j414q27K85J352Q46k32j090j179N19J011J052k18j130j135
4785a248J84J271P93J4j112j176J89J301O97K68j279r89j54J153R88K00j081j334
4803a315OQ23J377M38j171j079m80J303R66N85j186j166l28J130J191M12j275
4820B31j143l00J001R61O30r97j376j77N70J446N87r51j244n89R81J336K51m31
4838G86j497p08Q94R72O46m58j059r92P11J543M11l86j635o19O02J299Q28p25
4856F13j288r14R91J194O99n85j346n76L52J311O56m58r77o68N4J480O33k61j187
$$ plain form
4875 -277 -1069 -1118 12 1353 805 -83 -1242 -880 113 1207 1198 -276 -775 -1080 -95 1154 1217 126 -969
4894 -969 -1324 47 1292 1127 14 -1120 -975 118 1164 853 333 -1004 -756 12 1007 1112 140 -739
4912 -739 -1123 -416 892 1093 560 -850 -1204 -226 827 1230 504 -663 -1289 -354 546 1227 392 -798
4930 -798 -1255 -543 818 1454 416 -828 -1201 -801 692 1372 563 -647 -1185 -679 547 1308 373 -691
4948 -691 -1360 -721 346 1167 602 -421 -1077 -933 293 1227 558 -261 -1236 -937 384 1216 799 -518
4966 -518 -1094 -953 611 1213 858 -266 -1236 -706 351 1207 930 -457 -1135 -806 194 1256 971 -65
4984 -65 -1080 -981 -66 1207 1049 226 -909 -1038 14 1119 976 253 -999 -1138 -216 857 1396 223
5002 223 -812 -1428 -70 1034 1314 197 -906 -1161 -432 752 1359 176 -1033 -1235 -100 1002 928
$$ packed form
4875b77p92m9J130J341n48q88j159L62R93J094rj474m99l05R85J249O3j091j095
4894i69l55J371J245j65j113j134J45J093J046l11n20j337K48P68R95J05r72q79
4912g39l84P07J308K01n33j410l54R78J053M03p26j167o26R35R00O81q35j190
4930g98m57P12J361O36j038j244l73M00J493O80q09j210n38N06J226P61r35j064
4948f91o69O39J067Q21n65j023o56J44J226R34o69q19r75K99J321Q32m17j317
4966e18n76J41J564O02l55j124r70N30J057Q56k77j387o78L29J000J062k85j036
4984f5j015R9R15J273j58q23j135j29J052J105j43p23j252j39R22J073N39j173
5002B23j035o16J358J104K80j117j103k55P29J184O07j183j209k02J135J102p4
$$ plain form
5019 928 94 -823 -921 -488 723 1124 387 -874 -1213 -443 683 982 560 -478 -1122 -503 679 1275 533
5038 533 -478 -1272 -272 243 1227 622 -448 -1341 -687 487 1187 622 -542 -1415 -596 437 1097 656
5056 656 -759 -1266 -893 432 1080 645 -117 -1121 -467 204 1102 764 -488 -818 -935 221 1119 919
5074 919 45 -1012 -906 -32 1006 842 52 -958 -1009 68 1051 1028 24 -1058 -971 97 1009 1172 247
5093 247 -1112 -1022 -41 986 761 33 -887 -1128 -132 885 1014 150 -828 -895 -28 939 1111 207 -1053
5112 -1053 -1023 -439 758 972 11 -857 -1294 -451 481 1048 513 -447 -1257 -699 692 1125 206 -590 -1278
5131 -1278 -530 597 1258 770 -519 -1352 -675 687 1219 346 -455 -1296 -633 367 1109 715 -224 -856
5149 -856 -539 373 919 920 -527 -982 -659 510 984 697 -252 -898 -919 -3 1318 861 -182 -956 -868 183
$$ packed form
5019I28q34r17r8M33J211M01p37j261l39P70J126K99m22j038o44O19J182N96p42
5038E33j011p94J000N15R84o05j070q93O54J174P00n65j164q73Q19J033O60m41
5056F56j415n07L73J325O48m35p62j004O54O71Q98l38j252l30j17J156Q98k00
5074I19q74j057J06Q74J038j64p90j010n1J077R83k3j004j082Q7J068R12J63r25
5093B47j359R0R81J027k25p28r20k41R96J017J29q64r78o7Q67R67J72r04j260
5112a053L0N84J197K14r61q68m37Q43R32N67n35r60q10N58J391M33r19p96o88
5131a278P48J127O61m88j289q33O77J362N32q73q01q41O63J000P42l94r39o32
5149h56L17R12N46Jj447m55L23J169M74k87r49o46k1R16J321m57j043p74Q8J051
$$ plain form
5169 183 1158 866 -171 -1093 -813 155 979 1030 -239 -1070 -771 10 1080 866 -88 -1015 -956 73 957
5188 957 1160 -90 -883 -1149 -279 641 1061 162 -831 -1239 -243 808 1101 179 -948 -1308 -138 801 1047
5207 1047 268 -987 -1196 -268 613 1106 360 -792 -982 -311 676 1364 469 -703 -1131 -299 655 1161 293
5226 293 -635 -1061 -447 750 1165 622 -611 -1108 -492 454 1023 743 -392 -1102 -646 319 1054 553 -426
5245 -426 -1387 -675 699 937 750 -339 -1168 -858 298 1147 849 -322 -1128 -955 119 907 1093 -24
5263 -24 -1376 -608 -94 951 808 -239 -854 -992 234 1000 1018 -154 -759 -870 -73 932 860 34 -919
5282 -919 -895 35 1031 1107 29 -915 -1061 -133 772 1015 91 -936 -1131 -341 979 1047 187 -968 -975 -171
5302 -171 835 1055 270 -800 -832 -391 413 1176 644 -554 -891 -542 683 996 247 -561 -1152 -178 541
$$ packed form
5169A83R75k92j037r22K80R68Q24N1j269q31K99P81J070k14r54r27N9J029Q84
5188I57K03j250p93k66Q70R20M20q99r93m08R96J051K93r22j127l60J170R39K46
5207A047p79j255k09R28Q81M93p46j152j90O71R87O88q95j172m28Q32R54N06q68
5226B93r28m26O14J197M15n43j233m97O16R46N69k80j135p10M56R65P35n01r79
5245d26r61P12J374K38j87j089q29L10J156Q49k98j171q06J73J074P88J86j117
5263b4j352P68N14J045j43j047o15j38J226P66J8j172o05j11P97J005p2q26r53
5282i19K4R30R96P6j078r44j46R28R05K43r24j027j95P90J320O8q60j155pQ04
5302a71J006K20p85j070l2M41Q04P63n32j198l37L49J225L13p49q08n91R74P19
$$ plain form
5321 541 984 626 -428 -930 -517 515 1053 583 -582 -1100 -560 511 1354 663 -727 -779 -638 394
5339 394 1016 743 -299 -1305 -879 286 1082 773 -249 -1108 -669 199 877 810 -161 -1049 -790 261 1097
5358 1097 488 -165 -1036 -802 16 1148 841 -463 -1046 -741 122 793 969 -117 -837 -871 199 591 848
5377 848 -138 -1084 -1088 -49 654 870 83 -709 -879 -30 700 1257 219 -757 -754 -380 963 924 191 -665 -1116
5398 -1116 -215 609 1087 267 -690 -933 -474 919 883 365 -211 -1090 -250 591 985 149 -740 -1070 -430 652
5418 652 1037 347 -456 -815 -257 821 895 682 -456 -902 -627 521 1044 588 -489 -937 -526 589 885
5437 885 658 -548 -1041 -738 403 948 527 -258 -1026 -776 408 768 861 -339 -1089 -914 420 769 728
5456 728 -232 -1200 -780 231 879 780 177 -752 -674 90 836 792 22 -1120 -733 34 721 691 48 -828 -685
$$ packed form
5321E41M43l58j054n02M13J032N38m70j165n18N40J071Q43o91j390n2J41J032
5339C94O22k73j042j006M26J165P96l09j022q59M39Q68O78o7r71q88K59J051Q36
5358A097o09o53q71K34Q18J132l07j304n83L05Q63O71J76j086p20l4J070L92K57
5377H48r86r46mJ039P03K16p87p92j70Q49P30N57j038r76LL74J343l9p33q56m51
5398a116R01Q24M78q20r57k43M59J393l6n18n76q79Q40Q41L94q36q89l30O40J082
5418F52L85o90q03l59N58J078P4k13j138m46K75J148N23m56j077m48M11J115K96
5437H85k27j206m93L03J141N45m21p85p68K50J184L60R3j200p50J75J334L49m1
5456G28r60r68M20J011O48r9o03r29P8P64P46m4p70j142L87P67O87l0o43q76J43
$$ plain form
5477 -685 -192 935 818 139 -972 -627 -253 830 1054 181 -812 -1198 -85 874 1015 35 -1071 -1001 -198
5496 -198 805 1072 26 -696 -887 -293 573 1051 390 -394 -749 -401 408 833 330 -767 -1008 -422 403
5515 403 791 399 -561 -942 -514 502 971 422 -476 -774 -703 222 676 498 -477 -1049 -556 663 988 408
5535 408 -230 -1015 -523 459 653 652 -427 -754 -482 249 1155 752 -144 -1009 -970 405 814 745 51 -581 -527
5556 -527 137 954 676 118 -889 -704 61 833 772 157 -819 -793 20 745 689 30 -859 -839 85 1001 929
5577 929 -86 -358 -764 -116 653 827 126 -740 -739 -102 540 894 336 -627 -1020 -552 520 873 335 -783
5597 -783 -755 -578 513 697 113 -742 -814 -369 516 929 551 -539 -1091 -394 546 760 344 -528 -1050 -467
5617 -467 293 956 416 -465 -962 -658 230 887 346 -410 -808 -463 244 695 390 -504 -1093 -624 516 1107
$$ packed form
5477f85M93J127j17o79j111L45L74J083K24q73r93l86J113R59J41r80j106P0Q03
5496a98J003K67j046p22j91N94Q66M78o61p84l55L48Q09M25n03j097k41N86Q25
5515D03L88l92r60l81M28J016M69n49q98k98P1R25M54j78r75n72M93J219L25n80
5535D08o38p85M92R82J94jj079l27K72P31R06m03q96q65L9J375M09o9o94o32N4
5556e27O64Q17k78n58j007J85P65P72o1o15r76K6Q13P25n6o59q89K0R24R16p2
5577I29j015k72m06O48P69J74p01q66JO37O42L54n58r63l93M68J072L53n38j118
5597g83K8J77J091J84n84q55p2M45Q85M13l78j090n52O97R40K14m16q72n22N83
5617d67P60O63n40q81m97L04Q88O57n41p56l98L45P07M51l05q94n89M69J140N91
$$ plain form
5637 1107 580 -155 -1100 -743 430 887 762 -59 -1147 -580 68 907 637 -184 -778 -581 77 697 819
5656 819 -71 -1056 -1028 65 787 593 -56 -891 -837 -82 455 544 -178 -687 -914 -268 439 1028 -184 -401
5676 -401 -907 -320 630 884 291 -905 -906 -387 456 873 94 -765 -1007 -130 767 915 301 -631 -1051 -129
5696 -129 363 872 300 -474 -904 -316 607 824 243 -740 -685 -566 622 1199 475 -98 -1027 -305 504 1082
5716 1082 548 21 -949 -424 286 930 664 -360 -849 -462 372 922 650 -621 -976 -763 496 710 688
5735 688 -370 -995 -506 151 1228 693 -271 -811 -699 226 915 714 -408 -653 -596 102 919 897 25 -959
5755 -959 -696 -4 883 981 -122 -1063 -925 197 802 920 145 -964 -887 66 658 907 5 -883 -1010 -147
5775 -147 914 829 123 -575 -870 21 613 868 282 -541 -925 -427 823 1123 362 -615 -772 -243 531 672
$$ packed form
5637A107n27p35r45L57J173M57j25q21j088N67O48Q39k70q21n94J97O58O20J22
5656H19q90r85K8J093P22j94o49q35N4P55N37Q9p22n09k27O46P07N89j212k17
5676d01n06N87R50K54n93j196jN19Q43M17p79q59k42Q77Q97J48o14r32m20R22
5696a29M92N09n72p74m30N88R23K17n81r83N5J19J188N77p24n73r29P22Q09N78
5716A082n34n27r70N25P10O44k66j024m89L87Q34N50k72j271l55K13J259K14k2
5735F88j058o25M89O57J077n35r64n40J12R25O89k01j122k45N7O98Q17k2q72r84
5755i59K63O92Q87R8j103r41J38J122O05J18p75j109P7R53N92K49r02q88j27Q63
5775a47J061q5p06o98k95Q91N92K55n86q23l84M98J250L00p61r77j57N29P74J41
$$ plain form
5795 672 309 -556 -859 -546 317 910 244 -552 -898 -445 693 1016 456 -401 -941 -680 350 665 412
5814 412 -240 -718 -495 362 1104 531 -350 -936 -620 431 738 675 -475 -825 -701 337 860 590 -29
5833 -29 -760 -652 168 851 661 -280 -894 -656 136 806 600 109 -996 -934 56 933 571 -270 -557 -559 -146
5854 -146 1002 878 69 -922 -727 356 603 568 18 -456 -588 -125 765 594 386 -712 -891 93 756
5873 756 732 135 -536 -1168 -135 202 1094 190 -444 -883 -265 634 929 397 -628 -885 -260 653 856 405
5893 405 -514 -896 -287 405 750 335 -440 -1041 -417 258 894 487 -321 -580 -605 318 861 730 -433 -805
5913 -805 -541 647 839 422 -224 -665 -904 394 734 610 -187 -694 -551 99 712 597 -6 -975 -867
5932 -867 120 752 659 -245 -822 -724 250 456 664 101 -754 -603 236 753 716 140 -731 -944 295 684 579
$$ packed form
5795F72l63q65l03L13Q63N93o66p96l46M53J138L23n60q57n40K61J030L15k53
5814D12o52m78K23Q57P42n73q81n86L16J051L07o3j150l50J24J038N23k70o19
5833b9p31J08Q20O83j90r41o14K38P92O70k06m91j105O2R90Q77l62q41k87kM13
5854a46J148j24q09r91J95J083K47l5n50m74j32M63Q90j71k08j098j79R84O63
5873G56k4n97o71o32J033L37Q92r04o34m39O18Q99K95n32j025k57O25R13K03m51
5893D05r19l82O09O92L45m15p75o01O24O75O36m07q08k59k5R23N43j31j163l72
5913h05K64J188J92m17o46m41k39J298L40j24p97n07J43O50O13j15o03r69J08
5932h67R87O32r3r04n77R8R74K06K08n63q55J51Q39N17l7n76q71k13J239L89j05
$$ plain form
5953 579 209 -774 -1055 59 625 859 94 -548 -645 -6 758 854 206 -745 -717 -342 631 1067 419 -569 -761
5974 -761 -385 538 793 468 -547 -831 -495 555 658 340 -479 -891 -468 464 750 371 -590 -825 -418
5993 -418 297 755 281 -181 -691 -548 379 794 368 -356 -929 -473 420 880 504 -343 -876 -630 230 876
6013 876 536 -543 -977 -354 173 892 751 -388 -1035 -446 133 615 901 -310 -520 -732 22 710 443
6032 443 -111 -610 -766 223 851 612 -84 -750 -907 59 575 532 34 -757 -801 178 645 796 203 -869
6052 -869 -821 -139 842 792 233 -323 -761 -296 530 959 348 -843 -748 -321 614 642 67 -469 -908 -354 329
6073 329 945 53 -440 -918 -222 447 772 248 -703 -837 -465 583 721 383 -295 -923 -435 406 683 512
6093 512 -653 -1004 -252 445 712 410 -275 -597 -428 166 981 390 -557 -628 -463 340 889 651 -179 -840
$$ packed form
5953E79l70r83k81J114N66K34p65o42r7O39P64R6o48r51K8L75R73M36o48r88j92
5974g61L76R23K55l25j015k84L36J050J03l18q19m12M23R32K86l79r61k35M07
5993d18P15M58m74m62n10J43R27M15m26p24n73M56Q93M60l76q47n33K46Q60O46
6013H76l40j079m34O23N27P19j41j139o47N89N79M82K86j211k10k12P54O88k67
6032D43n54m99j56R89O28k39o96o66j57R66N16m3m98p91m4R79M67J51n93j072
6052h69M8O82R81n0n59n56m38M65Q26M29o11j191R5M27R35K8n75n36m39N54O83
6073C29O16q92m93m78O96O69L25n24r51j34L72J048J38l38o78o28M88Q41K77j71
6093E12j165l51P52O97K67l02o85l22J69N94Q15n91r47p1J65Q03N49k38q30o61
$$ plain form
6113 -840 -392 251 749 841 10 -733 -512 336 806 513 124 -851 -543 357 776 672 -105 -704 -713 195 622
6134 622 427 -33 -785 -711 146 875 505 -145 -638 -625 -31 660 648 -12 -787 -692 202 598 573 94 -719 -847
6156 -847 -105 536 615 100 -762 -702 -164 487 481 202 -613 -753 -262 400 810 61 -556 -841 -334 421 910
6177 910 99 -571 -956 -590 512 630 386 -187 -699 -432 274 753 247 -474 -728 -672 87 621 595 -454
6197 -454 -915 -417 372 840 369 -176 -963 -310 321 682 799 -290 -618 -464 220 935 449 -179 -601 -763
6217 -763 447 818 419 -269 -693 -430 -50 842 680 -159 -763 -925 3 600 700 110 -862 -621 -58 918
6237 918 531 98 -611 -789 121 766 775 -39 -565 -736 36 849 578 161 -734 -791 -203 625 767 108 -360
6258 -360 -590 -181 550 784 290 -495 -833 -435 538 878 107 -429 -666 -488 474 931 455 -412 -904 -436
$$ packed form
6113h40M48O43M98R2q31p43K21Q48M70k93l89r75L08R00M19j04p77n99rR08M27
6134F22j95m60p52P4Q57P29l70o50m93J3N94O91j2o60p75R5Q94L96k5m79q13j28
6156h47P42O41P9n15q62O0N38O51ok79q15j40M91O62M10p49o17k85N07P55M89
6177I10q11o70l85L66J102J18k44n73n12K67P06M79n06p21k54N6P59N34k6j049
6197d54m61M98P89M68m71n45p87O53O31L61J17j089l28J54O84P15m86o28m22j62
6217g63J210L71l99o88m24K63L80Q92j62q39o04j62R28N97J00n90r72K41N63R76
6237I18l87m33p09j78R10O45Rq14n26j71P72Q13k71m17q95n7N88Q28J42o59m68
6258c60k30M09P31K34m94p85l38L98R73L40p71n36k37J78R62M57m76q67m92M68
$$ plain form
6278 -436 291 862 159 -282 -809 -314 391 1128 648 -661 -875 -323 452 865 340 -318 -677 -465 155 845
6298 845 493 -112 -917 -559 543 670 325 -132 -658 -682 140 791 353 -377 -641 -568 156 909 732 -466
6318 -466 -773 -731 8 635 425 -433 -895 -549 124 778 483 30 -640 -625 82 485 627 -104 -609 -661 58
6339 58 502 571 256 -794 -664 -5 402 898 136 -726 -507 -158 575 517 228 -405 -811 -180 344 732 207
6360 207 -448 -618 -481 583 723 164 -364 -696 -486 317 806 -2 -228 -696 -398 419 729 462 -145 -711
6380 -711 -449 470 759 450 -504 -557 -449 342 946 401 -314 -758 -395 307 714 321 -65 -723 -849 281
6400 281 626 391 -80 -643 -653 161 769 575 49 -301 -744 173 676 409 -361 -733 -565 132 845 687
6420 687 131 -441 -693 -236 601 538 -36 -688 -458 -182 740 448 -41 -411 -565 -83 478 705 68 -679
$$ packed form
6278d36P27N71p03m41n27M95P05P37m80j309k14N52P75M13n25o58l59K12O20O90
6298H45l52o05q05L58J102J27l45m57n26k4Q22O51m38p30k64P3P24P53j77j198
6318d66l07M2P39O27k10q58m62L46O73O54k95m53o70J5P07M03J42p31n05n2P19
6339E8M44O9l15j050J30O59M07M96p62q62K19L49P33n8k89o33m06O31N24L88n25
6360B07o55j70J37J064J40n59n28l32K10Q03M89q08k26m68K98Q17L10k67o07n66
6380g11K62R19K89l09r54n3J08P91O04n45p15m44L63P02M07l93l86o58j26J130
6400B81L45k35m71n63j0Q14O08j94n26l50m43R17N03k67p70l72J68O97P13j58
6420F87n56n72k52M57Q37o3n74o52K30K76R22k92m89l70j54M82N61K27o37p47
$$ plain form
6440 -679 -632 23 475 674 59 -341 -463 -224 570 691 304 -558 -496 37 344 838 262 -630 -693 -28 585
6461 585 661 54 -480 -829 -217 280 691 413 -438 -505 -459 256 769 334 -434 -727 -633 513 622 418 -48
6482 -48 -782 -503 27 825 310 -372 -595 -370 358 632 479 -120 -884 -688 147 593 609 -311 -742 -490 253
6503 253 540 416 -281 -660 -255 183 613 537 16 -300 -247 27 507 723 -323 -676 -303 63 497 751
6523 751 153 -407 -595 -122 383 644 286 -454 -561 -190 384 649 4 -418 -875 -137 348 553 249 -485
6543 -485 -433 -194 453 499 89 -288 -254 -123 362 748 470 -363 -799 -475 304 554 430 -322 -696 -533 236
6564 236 571 376 -280 -568 -579 370 961 322 -398 -699 -353 102 722 293 -519 -455 -309 355 584 368 -89
6585 -89 -732 -636 87 563 537 -48 -555 -511 295 616 573 212 -503 -606 178 498 551 -330 -598 -335 -168 740
$$ packed form
6440f79M7O55M52J99o15m00j22K39P94J21l87q62O2N33L07M94n76q92o3O65O13
6461E85P6o07n34l49O12M97M11k78q51o7M6P15N13m35p68k93R4J146J09k04m66
6482d8p34K79N30P98n15o82k23K25P28K74j53n99p64J96Q35M46J6r20m31K52P43
6503B53K87j24o97l79M05M38M30p6n21l16N3K74M80K16j046l53L73L66M34K54
6523G51n98n60j88M73N05K61l58p40j07L71N74K65o45m22m57P38M85K05l04p34
6543d85N2K39O47M6m10l77L4J31M85L86k78q33m36L24P79K50j24p52l74J63P69
6564B36L35j95o56k88j1R49N91o39p20l01L46M55O20m29q12O4J46O64K29k16m57
6585h9o43R6P23M76k6n85n07M4Q06L21m3l61p15j03P84L20N3q81k68K63J67R08
$$ plain form
6607 740 478 130 -616 -345 128 763 488 -38 -594 -325 12 510 727 196 -291 -434 -28 664 478 -116
6627 -116 -518 -654 -175 337 507 159 -434 -765 -323 236 430 147 -503 -818 -203 491 721 436 -470 -533
6647 -533 -197 535 680 312 -421 -655 -156 404 583 308 -178 -616 -148 352 642 79 -337 -625 -372 125
6667 125 666 404 -303 -494 -164 505 740 484 -377 -479 -384 -13 505 334 -203 -645 -538 -34 647 506
6687 506 -233 -627 -290 203 647 239 -397 -740 -399 215 353 533 13 -588 -556 -52 459 472 -311 -414 -406
6708 -406 20 285 400 -42 -551 -460 -209 345 612 110 -386 -526 -68 502 435 141 -335 -659 -87 173 544
6729 544 208 -413 -516 -173 311 305 12 -299 -460 -345 296 557 190 -454 -507 -489 390 612 423 -416 -683
6750 -683 -236 49 611 33 -278 -702 -253 354 619 146 -268 -667 -417 235 673 185 -453 -643 -380 234
$$ packed form
6607G40k62l48p46K71M73O35k75n26n56K69L37M98K17n31m87j43M06O92j86n94
6627a16m02j36M79N12J70l48n93l31M42N59J94k83o50l15O15O94K30k85r06o3
6647e33L36P32J45l68p33k34M99N60J79k75m86m38M68N00K90n63m16k88K53M97
6667A25N41k62p07j91L30O69K35k56q61j02R5L71N18j71n37m42J07N04O81j41
6687E06p39l94L37M93M44m08o36l43L41O14J38J80n20o01L2N04N11J3p83j03Q
6708d06M26K65J15m42n09R1K51N54K67n02m96j40M58N70o7k94m76l24N72K60L71
6729E44l36o21j03L43M84ok93l11j61J15O41K61l67o44n3J8Q79K22j89q39k67
6750f83M47K85N62n78l11m24M49O07K65m73m14l99K50O52M38m88o38j90K63O14
$$ plain form
6770 234 387 369 -223 -418 -465 99 573 313 -251 -566 -252 185 514 408 148 -454 -515 -75 283 236 -133
6791 -133 -409 -479 26 332 512 -78 -389 -273 -46 764 515 -69 -499 -504 -69 497 320 497 -489 -542 -27
6812 -27 344 757 134 -697 -626 -52 440 381 21 -423 -781 -25 538 498 2 -304 -584 -216 301 536 138
6833 138 -33 -283 -296 182 530 510 -124 -401 -33 341 603 148 -95 -559 -195 194 457 288 -119 -433 -628
6854 -628 356 480 698 -80 -167 -328 432 699 161 -173 -567 -227 375 632 575 -10 -518 -486 205 481 493
6875 493 18 -463 -230 195 555 431 -108 -700 -391 332 199 353 47 -364 -429 199 543 370 84 -459
6895 -459 -543 -35 311 328 214 -458 -620 -209 204 395 69 -554 -457 -108 451 498 -125 -400 -590 -70 274
6916 274 430 164 -398 -414 -85 408 517 430 -169 -467 -270 441 589 216 -191 -536 -255 631 365 146 -35
$$ packed form
6770B34J53j8n92j95m7N64M74k60n64l15L14M37L29j06k60o02o1M40L58m7l69
6791a33k76p0N05L06J80n90l11J16K27Q10k49n84m30nM35N66j77J77r86n3N15
6812b7L71M13o23q31P1N74M92n9l60m44l58P56N63m0m96l06k80L68N17K35l98
6833A38j71k50j3M78L48k0o34k77L68L74K62m55k43m64L64L89K63j69m07l14j95
6854f28R84J24K18p78q7j61P60K67n38l34l94L40O02K57n7n85n08L2O91K76J2
6875D93m75m81K33M25L60j24n39n92L09P23j33J54l06m11o5O28L44j73k86n43
6895d59q4N08L46J7j14o72j62M11M13J91l26o23R7L49N59M7o23k75j90N20L44
6916B74J56k66n62j6L29M93J09q7n99k98J97P11J48l73m07l45K81Q86k66k19j81
$$ plain form
6937 -35 -416 -214 65 475 217 -235 -511 -461 498 508 214 -121 -437 -103 -28 437 187 -224 -444 -614 35
6958 35 585 246 39 -428 -162 -73 204 404 -104 -466 -396 55 633 338 -94 -357 -439 67 325 348 -19 -432
6980 -432 -361 33 671 542 -39 -467 -470 -92 536 375 -24 -344 -332 74 536 469 -81 -432 -513 15 352 305
7002 305 67 -318 -396 79 427 395 202 -272 -457 70 413 383 252 -235 -306 -135 283 704 396 -416 -670
7023 -670 65 132 531 114 -40 -400 -247 334 102 145 -83 -512 -79 265 315 211 -92 -288 -363 321 296 244
7045 244 -282 -561 -302 347 157 415 -258 -398 -42 231 391 478 -195 -471 -462 -62 632 339 -117 -165 -302
7066 -302 -13 312 216 7 -376 -373 102 626 267 -262 -397 -252 220 446 327 -99 -505 -264 -70 227 332
7087 332 64 -293 -379 139 337 474 59 -458 -285 119 486 495 -113 -410 -198 -175 292 350 42 -227 -539 68
$$ packed form
6937c5l81K02K79M10k58m52k76N0R59J0k94l35l16L34P5M65k50m11k20j70O49
6958C5N50l39k07m67K66Q9K77K00n08l62P0M51N78k95m32k63q2N06K58K3l67m13
6980d32P1L94O38j29n81m28lL78O28j61l99l20J2M06M62o7n50l51q1N28L37m7
7002C05k38l85p8M75L48l2j93m74j85N27L43l0j31m87p1J71M18M21l08q12k54
7023f70P35O7L99m17j54l60J53N81k32M3k28m29M33L44N0j04l03j96p5O84k5n2
7045B44n26k79K59O49j90K58o73j40L56K73J60Q7o73k76RM00O94k93m56m8j37
7066c02K89L25r6k09l83LM75N24l59n29j35J45M72K26j19m26m06K41J94K97J05
7087C32k68l57q6N18J98J37m15n17J73M04L67Ro08k97K12K3M67N8l08k69l12O07
$$ plain form
7109 68 318 409 119 -282 -221 -40 481 382 4 -290 -203 -251 375 251 471 -126 -335 -200 175 563 89 -467
7131 -467 -247 -152 328 573 46 -309 -481 -248 187 247 -3 -343 -601 -364 -32 144 251 -294 -462 -202 40
7152 40 172 152 -304 -491 -213 66 485 383 -189 -375 -281 101 674 387 -76 -169 -424 193 644 435 -139
7173 -139 -409 -169 113 213 23 35 -386 -130 39 422 287 98 -509 -365 28 428 511 -205 -274 -403 -55
7194 -55 374 330 326 -372 -604 -212 330 343 19 -288 -369 133 455 137 201 -481 -217 -97 53 289 58 -281
7216 -281 -136 -5 127 300 470 -295 -104 -216 236 226 127 -2 -152 -292 269 263 237 -126 -485 -192 547 412
7238 412 102 58 -354 -187 274 516 276 -99 -595 -186 257 430 83 -209 -417 -270 7 282 289 -76 -180
7259 -180 -269 -79 494 222 -188 -199 -187 261 284 28 88 -216 -205 76 275 311 -258 -306 -545 38 182 355 -167
$$ packed form
7109F8K50R1k90m01O1J81N21r9l78k94Q7m8O26j24K20n97k09J35L75L88m74n56
7131d67K20R5M80K45n27l55j72K33M35O0k50l40k58K37L32J76J07n45j68K60K42
7152D0J32k0m56j87K78K79M19j02n72j86R4L82N73k87m63r3k55O17M51k09n74
7173a39k70K40K82J00j90J2m21K56J69L83j35j89o07J44L93M00Q3p16o9j29L48
7194e5M29m4mo98k32L92N42J3l24l07q1N02L22l18O4o82K64J20J50K36k31l39
7216b81J45J31J32J73J70p65J91j12M52j0r9j29j50j40N61ok6l63l59K93P39j35
7238D12l10m4m12J67M61K42k40l75m96M09M43J73l47k92k08J47K77K75Pl65j04
7259a80q9J90N73k72m10j1J2M48K3k56O0l04J1K81J99L6n69m8k39N83J44J73n22
$$ plain form
7282 -167 -192 -221 9 450 62 6 -234 -230 62 324 202 9 -368 -211 -175 264 286 64 -219 -243 156 -25 427
7305 427 267 -312 -446 -232 181 405 201 -79 -428 -242 286 492 270 -299 -324 -165 108 315 22 -267
7325 -267 -342 -209 224 368 365 -226 -373 -236 237 121 120 -80 -392 -329 170 487 35 -349 -288 -229 374 457 384
7348 384 -186 -552 -16 198 517 215 115 -452 -350 139 299 154 -125 -326 -245 -22 321 593 -128 -247
7368 -247 -374 313 375 140 -49 -278 -200 -107 445 337 -87 -247 -473 105 219 67 -247 -323 -220 -167 22 259
7390 259 91 -422 -394 216 298 196 -151 -209 -396 -90 226 127 -84 -278 -168 -4 51 249 -106 -269 -213 102
7412 102 193 209 311 -140 -456 -99 204 441 226 -67 -397 -51 307 267 -27 -129 -289 -255 124 -9 298
7433 298 -98 -108 -52 -10 314 271 -320 -509 -37 217 211 222 -195 -119 -251 -301 215 160 -118 -322 -56 126 308
$$ packed form
7282a67k5k9K30M41l88n6k40MK92K62j22j93l77J57L6M39K2k22k83k4L99j81M52
7305D27j60n79j34K14M13K24k04k80l49J86N28K06k22n69k5J59K73K07k93k89
7325b67p5J33M33J44ln91j47J37M73j16jk00l12O3M99L17m52l84O1N9O03Q3p3
7348C84n70l66N36K14L19l02j00n67J02M89J60j45k79k01Q1K23L43K72p21j19
7368b47j27O87O2k35j89k29P8R3N52j08m24j60k26N78J14j52l14p6J03N3J89K37
7390B59j68n13K8O10Q2j02l47n8j87L06L16r9k11j94J10J64N5J98l55j63N6L15
7412A02R1J6J02m51l16L57L03K37k15k93l30L46L58m0k94j02j60L4L79j33L07
7433B98l96j0N6M2L24m3n91j89M72K54oJ1m17P6j32n0N16n5k78k04K66J82J82
$$ plain form
7456 308 126 -477 -194 -256 -83 256 48 -25 -92 -85 54 351 -43 -19 -264 -137 52 173 516 176 -101 -257
7478 -257 71 400 161 156 -290 -438 -74 441 486 200 -268 -218 14 165 259 -90 -163 -245 -224 150 165 -42 -112
7501 -112 -45 -42 21 320 19 -190 -360 130 234 270 164 -322 -275 54 96 395 35 -16 -495 1 -27 323 353
7524 353 -19 -154 -142 82 168 214 0 -425 -129 20 58 229 -295 -205 -309 108 450 75 -481 -121 -240 183
7546 183 341 271 190 -418 0 175 440 213 -160 -241 -31 -8 218 519 -166 -149 -472 228 409 196 -16 -489
7568 -489 94 279 264 258 -107 -311 9 -4 93 188 -34 -236 -152 -29 270 175 144 -218 -187 44 292 138 378
7591 378 -131 -384 -189 160 303 26 -169 -463 -156 171 335 77 17 -188 2 167 336 311 -6 -457 -220
7612 -220 98 392 103 101 -341 -223 329 272 153 -200 -230 -290 169 288 97 -144 -356 -78 210 234 152 -41
$$ packed form
7456C08j82o03K83o2J73L39k08p3o7PJ39K97l94K4k45J27J89J21L43l40k77j56
7478b57L28L29k39nm46j48L64N15M5k86m68N0K32J51R4l49p3q2K1L74J5k07p0
7501a12O7LO3K99l01k09j70M90J04L6j06m86M7L29M2K99l60n1m79M96k8L50L0
7524C53l72j35J2K24Q6M6k14m25K96J49L8J71n24R0j04M17L42l75n56L60j19M23
7546A83J58p0q1o08M18J75K65k27l73q1K10K3K26L01o85J7l23P00J81k13k12m73
7568d89N83J85j5ol65k04L20j3R7R5k22k02Q4J23K99r5l1l62L1K31K48j54K40
7591C78n09k53J95L49J43k77j95k94L07L27J64k58o0k05J90J65J69k5l17m51K37
7612b20L18K94k89km42J18N52n7j19l53l0o0M59J19j91k41k12K78K88K4q2j93
$$ plain form
7634 -41 -169 -102 -46 123 192 -187 -622 -85 124 257 -116 -119 -392 27 224 402 347 -230 -137 -77 127 446 132
7657 132 -80 -264 -309 89 125 211 -46 -282 -166 116 169 321 -130 -315 -360 -61 -18 29 -226 -216 -317 -28 461
7680 461 331 86 -205 -295 -173 210 267 -88 37 -323 -1 162 43 241 -89 -159 62 -21 189 -1 -290
7701 -290 -168 -148 44 60 145 -72 -210 -230 313 172 28 14 -298 -214 82 271 199 -149 -293 -86 -82 -6 122
7724 122 -273 -236 -282 92 177 17 -183 -61 -148 -176 239 -119 121 -203 -187 -21 251 152 -264 49 -102 65
7746 65 106 -247 -80 126 -90 -6 188 204 -59 -221 -55 -16 153 71 12 -287 -303 60 -24 152 -67 -165 -217 243
7770 243 37 39 -82 -341 -77 -118 174 169 -101 47 -33 -47 295 221 -116 -91 -131 63 49 264 168 -84 -177 -26
7794 -26 135 188 179 -231 -247 273 350 279 -150 -209 -184 -229 324 259 -37 -33 41 -95 -54 68 54 21 -212 -165 181 104
$$ packed form
7634d1j28O7N6J69O9l79m35N37K09J33l73lk73M19J97J78n5n77R3O0K04L19l14
7657A32k12j84m5L98L6Q6k57k36J16K82N3J52m51j85m5K99M3M7k55J0j01K89M89
7680D61j30k45k91r0J22L83N7l55J25l60L22J63j19J98l30p0K21q3K10j90k89
7701b90J22K0J92J6Q5k17j38k0N43j41j44j4l12Q4K96J89p2l48j44K07MP6J28
7724A22l95L7m6L74Q5j60k00J22q7k8M15l58K40l24J6J66K72r9m16L13j51J67
7746F5M1l53J67K06k16Q4J94J6k63j62J66L9J69q2n9k99j6L63q4J76k19r8n2M60
7770B43k06Kj21k59K64m1K92nk70J48q0j4L42p4l37K5m0J94j4K15r6k52r3J51
7794b6J61N3rm10j6N20P7p1m29n9K5m5N53o5k96MP4j36M1J22j4l3k33M7L46p7
$$ plain form
7820 104 345 -127 -262 43 208 5 -220 9 -119 66 213 116 -103 -302 -376 -362 85 198 -71 -112 -48 -245
7842 -245 264 226 52 53 -200 29 123 200 -79 67 -133 91 139 36 -9 -130 -396 -129 184 26 224 -22
7864 -22 -183 -449 -215 110 267 -214 -35 -282 196 264 126 209 -104 -57 -154 209 4 -129 27 -154 -120 338
7886 338 155 -38 -172 -238 -140 202 257 -28 -248 -375 -142 243 63 -159 2 -113 -28 259 177 -21 -401 -111
7908 -111 -160 133 199 -88 -269 -249 -218 194 161 41 -139 -321 -195 -7 223 -121 -127 -55 -107 382 445 37 -17 -298
7932 -298 -67 -48 271 -20 -217 -428 -76 155 272 44 -238 -186 -78 47 82 161 -157 -109 -251 -44 136 159
7954 159 -169 -364 -148 -23 115 50 38 -294 -160 80 108 205 136 -86 -286 46 195 0 17 -57 88 -29
7976 -29 136 167 -7 -15 -99 -21 43 105 241 -117 -107 -220 -33 150 54 -43 -144 56 260 -11 126 -344 -212 -38
$$ packed form
7820A04K41m72j35L05J65k03k25K29j28J85J47r7k19j99p4J4M47J13k69m1O4j97
7842b45N09l8j74Jk53K29R4P7k79J46k00K24M8j03m5j21k66K67L13j58J98k46
7864b2j61k66K34L25J57m81J79k47M78O8j38Q3l13M7r7L63k05j33J56j81L4M58
7886C38j83j93j34o6R8L42N5k85k20j27K33L85j80k22J61j15Q5K87q2j98l80K90
7908a11m9K93O6k87j81K0L1M12l3j20j80j82J26J88K30l44oP2n2M89O3m08n4k81
7932b98K31J9L19k91j97k11L52K31J17k28k82N2J08J25L5P9l18M8j42K07J80K3
7954A59l28j95K16J25J38o5j2l32J34K40K8R7o9k22k00L32J49j95J7p4J45j17
7976b9J65L1j74qq4P8O4O2J36l58J0j13J87J83r6r7j01K00K04k71J37m70J32J74
$$ plain form
8000 -38 149 407 -116 -12 -305 -32 239 118 -125 -208 -290 72 93 109 -66 38 116 -141 369 249 261 -330
8022 -330 -98 -73 40 30 181 -423 -47 -79 191 79 162 -17 -68 -57 30 300 -152 -80 61 41 170 178 -38 -10
8046 -10 -333 -202 6 31 -111 -18 -277 -270 98 178 -131 24 -207 31 92 319 190 -11 -127 -24 36 159 95
8069 95 -1 -105 26 90 373 65 -148 -93 -102 -116 381 162 -34 -331 -401 154 233 65 75 -189 -283 -3 -89 15
8093 15 14 -244 -279 29 96 91 -89 -37 -220 59 16 -109 89 -276 -128 410 199 312 344 144 -97 -201 -4
8116 -4 97 -27 -181 -105 -73 75 -92 426 -232 -79 -4 350 271 247 -117 32 -103 22 62 37 -343 10 -69
8139 -69 33 432 283 -53 -133 -46 134 234 13 99 129 -99 -148 -17 241 -155 -169 -218 246 282 -80 -4 -87 153
8163 153 -64 67 -62 46 -297 -153 20 -41 107 -102 -245 -100 182 234 107 -26 -386 -229 154 147 11
$$ packed form
8000c8J87K58n23J04k93K73K71j21k43q3q2L62K1J6j75J04P8k57N10j20J2n91
8022c30K32K5J13j0J51o04L76l2K70j12Q3j79n1J1Q7K70m52P2J41k0J29Qk16K8
8046a0l23J31K08K5j42R3k59PL68Q0l09J55k31K38O1K27j29k01j16J03O0J23o4
8069I5r6j04J31O4K83l08k13N5rj4M97k19j96k97p0N55P9j68J0k64r4K80q6J04
8093A5jk58l5L08O7nj80N2j83K79m3j25J98l65J48N38k11J13L2k00k41j04J97
8116dJ01j24j54P6L2J48j67N18o58J53P5L54p9k4l64J49j35J25M0k5l80L53p9
8139f9J02L99j49l36q0Q7J80J00k21Q6L0k28m9J31K58l96j4m9M64L6l62P6q3K40
8163A53k17J31j29J08l43J44J73o1J48k09j43J45K82N2j27j33l60J57L83pj36
$$ plain form
8184 11 23 -108 138 162 -39 15 -158
$$ packed form
8184A1J2j31K46K4k01N4j73
8191a58
$$ Imaginary data points
##PAGE= N=2
##DATA TABLE= (X++(I..I)), XYDATA
$$ plain form
0 0 0 0 0 0 0 0 0 0 0 0 -8 8 -8 8 -16 16 -24 24 -32 40 -48 56 -72 80 -96 112 -130 152 -176 200 -230 262
32 262 -299 339 -383 430 -484 542 -605 676 -755 837 -929 1029 -1138 1258 -1386 1529 -1686
49 -1686 1855 -2043 2250 -2479 2731 -3018 3337 -3697 4112 -4592 5154 -5823 6638 -7650 8953
64 8953 -10697 13163 -16951 23553 -38427 145793 -141699 -328763 51574 65387 44081 87466
76 87466 77401 -148139 -101906 -78822 103234 255314 53842 -281454 -167150 136560 92669
87 92669 42626 51387 -62213 -176669 -34187 108634 141239 53159 -137976 -165271 -11062
98 -11062 116417 82940 98858 -92990 -227936 -35021 182779 98585 -26061 -21916 -147792
109 -147792 -96418 111895 161229 22423 -65690 -154492 -119837 157693 204226 -55234 -130664
$$ packed form
0@%%%%%%%%%%qJ6j6J6k4L2m0M8n6P2q8J04j28J52j76K08k42K82l28L76m30M92
32B62n61O38p22Q13r14J026j147J281j431J592j766J958k167K396k644K915l215
49a686L541l898M293m729N210n749O355p034P809q704R746j0977J2461j4288J6603
64H953j9650K3860l0114M0504o1980J84220k87492j87064L80337J3813k1306M3385
76H7466j0065k25540M6233K3084J82056J52080k01472l35296J14304L03710m3891
87I2669n0043Q761j13600j14456J42482J42821L2605q8080j91135k7295J54209
98a1062J27479l3477J5918j91848j34946J92915K17800q4194j24646M145j25876
109a47792N1374K08313M9334j38806q8113q8802L4655K77530M6533k59460p5430
$$ plain form
120 -130664 -9087 -65361 -11375 173328 112247 -135380 -139198 -9491 51338 132051 58789
131 58789 -79653 -111030 -23013 18820 104603 128444 -70327 -161790 -33889 88732 78580
142 78580 61633 -16589 -109062 -80642 31234 118743 118945 -43069 -185166 -47751 115489
153 115489 83586 4981 13527 -75878 -114490 32711 123287 77737 -30355 -111061 -105728 67505
165 67505 138291 7410 -51877 -29142 -62260 -39970 97572 101924 -30300 -92219 -69569 -11554
177 -11554 97339 92064 -36031 -94548 -49883 610 50209 92845 170 -86022 -74628 -13797
189 -13797 65722 99916 14979 -116600 -81839 25528 69562 61510 3888 -70861 -69843 350
201 350 49304 68456 39246 -69700 -107326 10762 83353 51309 908 -33569 -67365 -26272
$$ packed form
120a30664J21577n6274N3986J84703o1081k47627l818J29707O0829Q0713p3262
131E8789j38442l1377Q8017M1833Q5783K3841j98771r1463J27901J22621j0152
142G8580j6947p8222r2473K8420J11876Q7509K02j62014j42097J37415J63240
153A15489l1903p8605Q546q9405l8612J47201R0576m5550j08092q0706N333J73233
165F7505P0786j30881n9287K2735l3118K2290J37542M352j32224o1919K2650N8015
177a1554J08893n275j28095n8517M4665N0493M9599M2636r2675q6192J1394O0831
189a3797P9519L4194q4937j31579L4761J07367M4034q052n7622p4749J018P0193
201C50M8954J9152k9210j08946l7626J18088P2591l2044n0401l4477l3796M1093
$$ plain form
213 -26272 59166 60714 29908 -29966 -81104 -40900 65279 85738 7578 -35715 -56558 -40793
225 -40793 38973 86179 31962 -43037 -63967 -35607 33468 87813 32321 -48061 -58935 -29242
237 -29242 27912 69317 43732 -43102 -64216 -22285 17551 61211 43326 -28074 -68583 -28546
249 -28546 21963 44024 45042 -12576 -64068 -41489 11216 47898 47398 -1778 -67295 -56481 20353
262 20353 48790 37772 658 -51291 -59821 -1907 59536 46357 -641 -56425 -62104 9498
274 9498 58140 38549 -10483 -37281 -46465 -13098 50360 50418 -1141 -43210 -46159 -5280 42055
287 42055 48334 896 -33361 -34438 -20284 29259 55180 20530 -34962 -46452 -13958 24345
299 24345 57035 25674 -31279 -47538 -20985 26699 52986 34212 -28605 -55463 -17966 26062
$$ packed form
213b6272Q5438J548l0806n9874n1138M0204J06179K0459p8160m3293k0843J5765
225d0793P9766M7206n4217p4999k0930K8360O9075N4345n5492q0382j0874K9693
237b9242N7154M1405k5585q6834k1114M1931L9836M3660j7885p1400m0509M0037
249b8546N0509K2061J018n7618n1492K2579N2705L6682n00m9176o5517J0814P6834
262B0353K8437j1018l7114n1949q530N7914O1443j3179m6998n5784n679P1602
274I498M8642j9591m9032k6798r184L3367O3458N8n1559m2069k949M0879M7335
287D2055O279m7438l4257j077J4154M9543K5921l4650n5492j1490L2494L8303
299B4345L2690l1361n6953j6259K6553M7684K6287j8774o2817k6858L7497M4028
$$ plain form
311 26062 51485 31191 -24147 -53644 -23729 30935 44158 25442 -16402 -48442 -24216 19155
323 19155 43129 25738 -10915 -43127 -35108 17883 39313 24807 -6820 -36670 -36184 -535 41715
336 41715 34606 -3816 -39448 -44553 795 41819 37666 -4018 -40687 -40333 -8884 41341 44296
349 44296 -2907 -43018 -43398 -1745 36110 41908 738 -40274 -37238 -8161 33357 41244 5966
362 5966 -34608 -39028 -4411 25040 37510 14793 -25868 -38052 -16091 24726 41084 20588
374 20588 -20978 -44735 -16221 22504 42753 25818 -18132 -43383 -26675 24795 47776 26794
386 26794 -16979 -47953 -24182 21969 48828 27861 -19018 -43870 -27409 22562 45263 24435
398 24435 -13705 -39861 -25598 10346 42006 31865 -12017 -39038 -32086 10161 38943 28114
$$ packed form
311B6062K5423k0294n5338k9497K9915N4664J3223j8716m1844l2040K4226M3371
323A9155K3974j7391l6653l2212Q019N2991K1430j4506l1627k9850M86L5649M2250
336D1715p109l8422l5632n105M5348M1024m153m1684l6669L54L1449N0225K955
349D4296m7203m0111l80M1653L7855N798m1170m1012L036K9077M1518P887l5278
362E966m0574m420L4617K9451J2470k2717m0661j2184K1961M0817J6358k0496
374B0588m1566k3757K8514L8725K0249j6935m3950k5251J6708N1470K2981k0982
386B6794m3773l0974K3771M6151K6859k0967m6879k4852J6461M9971K2701k0828
398B4435l8140k6156J4263L5944L1660j0141m3882k7021O952M2247K8782j0829
$$ plain form
410 28114 -6799 -34574 -30126 -5240 32846 40909 1367 -40831 -44440 222 39410 37783 -1006
423 -1006 -41514 -38122 -5567 33635 41337 4930 -38457 -49072 -4634 40352 41461 1784 -41144
436 -41144 -39528 -5894 33916 39960 5801 -32397 -42818 -7742 29492 39132 15007 -28395 -43152
449 -43152 -16825 29956 45125 15507 -24903 -44141 -15948 26031 42782 21854 -19662 -41555
461 -41555 -28805 22638 56327 26529 -28013 -49865 -15870 26607 44665 24643 -20783 -42239
473 -42239 -25460 20547 48181 28665 -18160 -50000 -24437 23667 44686 23973 -17409 -37812
485 -37812 -29468 10906 43551 30771 -10800 -43835 -31379 5913 39546 39232 -7028 -46731 -40615
498 -40615 8790 43915 33357 -4904 -45135 -38871 3021 39508 38560 -1639 -42385 -49542 765
$$ packed form
410B8114l4913k7775M448K4886L8086Q063l9542m2198l609M4662L9188j627l8789
423a006m0508L392L2555L9202P702l6407m3387j0615M4438M4986J109l9677m2928
436d1144J616L3634L9810O044l4159l8198j0421L5076L7234R640k4125m3402j4757
449d3152K6327M6781J5169k9618m0410j9238K8193M1979J6751k0928m1516k1893
461d1555J2750N1443L3689k9798n4542k1852L3995M2477J8058k0022m5426k1456
473d2239J6779M6007K7634j9516m6825l1840K5563M8104K1019k0713m1382k0403
485c7812Q344M0374L2645j2780m1571l3035J2456L7292L3633l14m6260l9703O116
498d0615M9405L5125j0558l8261m0231O264M1892L6487r48m0199m0746p157N0307
$$ plain form
511 765 51642 39020 -12141 -45716 -31284 1705 32572 38673 1936 -37300 -43247 -4377 38615
524 38615 41932 3927 -41688 -39114 -488 33382 37046 7834 -26344 -43935 -14958 34612 47864
537 47864 13955 -34135 -43418 -13729 32311 51171 14832 -33131 -46425 -10649 32248 44615
549 44615 19876 -29244 -46510 -15856 31031 47992 17525 -26057 -48428 -16467 33857 43325
561 43325 13547 -23958 -35871 -21051 16387 45603 25426 -20424 -46649 -23898 20836 43454
573 43454 25553 -21327 -43651 -25539 13781 41762 29013 -11956 -49425 -35252 16835 47043
585 47043 29503 -18722 -45233 -32195 11641 46702 29828 -15787 -46289 -29425 11850 39122
597 39122 31729 -11489 -41729 -32082 8025 39947 30673 -5854 -41845 -32775 9155 35823 29975
$$ packed form
511G65N0877j2622n1161l3575J4432L2989L0867O101l6737l9236n947L8870M2992
524C8615L317l8005m5615K574L8626L3870L664k9212l4178j7591K8977M9570J3252
537D7864l3909m8090r283K9689M6040J8860l6339m7963j3294L5776M2897J2367
549D4615k4739m9120j7266L0654M6887J6961l0467m3582k2371L1961N0324R468
561D3325k9778l7505j1913J4820L7438K9216k0177m5850k6225K2751M4734K2618
573D3454j7901m6880k2324J8112L9320K7981j2749m0969l7469J4173N2087L0208
585D7043j7540m8225k6511J3038M3836L5061j6874m5615l0502J6864M1275K7272
597C9122p393m3218l0240R647M0107L1922r274l6527l5991R070M1930K6668n848
$$ plain form
610 29975 -2580 -30511 -35723 -4546 38359 40097 2590 -39340 -37860 1611 37218 39479 1315
623 1315 -33618 -36556 -4479 35793 42200 9051 -38024 -41993 -454 38278 40672 2358 -31700
636 -31700 -36415 -5652 33677 37939 8001 -30275 -36196 -7459 27055 39142 9417 -26596 -37429
649 -37429 -11781 25568 36213 14084 -24448 -38080 -14931 20202 37985 16769 -20189 -41892
661 -41892 -22093 23183 40809 17570 -24841 -40760 -18153 18462 39239 18138 -19761 -41186
673 -41186 -22574 19650 38756 20198 -21729 -39012 -18713 15352 34889 19199 -13101 -35619
685 -35619 -23581 13227 33778 23132 -11458 -33163 -22698 7569 33502 25717 -5547 -33318
697 -33318 -27949 7829 33933 29410 -5682 -32514 -26730 4195 35068 29656 -2299 -33115 -30040
$$ packed form
610B9975l2555k7931n212L1177M2905J738l7507m1930J480L9471L5607K261l8164
623A315l4933k938L2077M0272O407l3149m7075l969M1539L8732K394l8314l4058
636c1700m715L0763L9329M262k9938l8276n921K8737L4514J2087k9725l6013j0833
649c7429K5648L7349J0645k2129l8532j3632K3149L5133J7783k1216l6958k1703
661d1892J9799M5276J7626k3239m2411j5919K2607L6615K0777k1101l7899k1425
673d1186J8612M2224J9106j8558m1927j7283K0299L4065J9537j5690l2300k2518
685c5619J2038L6808K0551j0646l4590k1705J0465L0267K5933p785l1264k7771
697c3318N369L5778K6104m523l5092k6832N784L0925L0873n412l1955l0816L075
$$ plain form
710 -30040 6702 34437 30067 -4952 -30976 -25845 2746 32156 28307 -328 -28971 -27869 2252
723 2252 28007 29087 251 -26012 -26195 -3703 24863 27808 5509 -23737 -30256 -5655 21173
736 21173 30091 7501 -22805 -31249 -10678 22549 30088 9253 -22904 -33346 -9406 19805 30569
749 30569 9256 -21639 -31969 -12554 21149 29660 9597 -20912 -30975 -10121 16679 28408
761 28408 10282 -16421 -28083 -14816 15347 27558 13638 -13710 -27877 -13919 10338 27882
773 27882 16327 -9710 -26192 -19065 9713 27858 20419 -8026 -27700 -17623 7472 28844
785 28844 20689 -6335 -26318 -20309 8740 27374 21525 -5700 -26473 -17870 6156 26542 19951
798 19951 -4017 -22988 -19927 5637 22717 20340 -1462 -21742 -19227 -158 21637 21039 1204
$$ packed form
710c0040L6742K7735m370l5019k6024N131K8591K9410l849k8635k8643J102L0121
723B252K5755J080k8836k6263j83K2492K8566K945k2299k9246o519K4601K6828
736B1173Q918k2590l0306q444K0571L3227P539k0835l2157j0442K3940K9211J0764
749C0569k1313l0895j0330J9415L3703Q511k0063l0509j0063K0854K6800J1729
761B8408j8126k6703j1662J3267L0163J2211j3920k7348j4167J3958K4257J7544
773B7882j1555k6037j6482P127K8778J8145p439k8445j9674J0077K5095K1372
785B8844q155k7024j9983O009K9049J8634n849k7225k0773Q603K4026K0386o591
798A9951k3968j8971L061K5564J7080k377k1802k0280K515J9069K1795n98j9835
$$ plain form
811 1204 -19713 -23281 -1638 19044 23191 3472 -20540 -23877 -6313 19622 24266 4426 -19707
824 -19707 -26547 -5689 17742 24353 5213 -20271 -24846 -7614 18187 23051 4780 -17601 -24523
837 -24523 -6235 14396 22074 6955 -15593 -21548 -9872 13108 21340 9185 -11566 -22728 -10321
850 -10321 9840 21841 12569 -9416 -21420 -14250 9480 23179 15337 -7131 -24121 -14055 8496
863 8496 24858 16641 -7558 -22257 -16060 8333 24256 16918 -5543 -23107 -14686 6476 23260
876 23260 16744 -5322 -19255 -15737 5254 19850 16471 -1483 -19000 -15735 753 18693 18338
889 18338 -92 -16844 -19565 -938 17412 19391 2910 -18569 -20166 -4106 17357 21010 2923
902 2923 -17445 -23253 -4160 17261 21504 3849 -19792 -21865 -5056 16616 20223 3189 -16009
$$ packed form
811A204k0917l568K1643K0682M147j9719k4012l337J7564K5935M644j9840k4133
824a9707o840K0858K3431O611j9140k5484m575J7232K5801M864j8271k2381o922
837b4523J8288K0631P678j5119k2548n955J1676K2980Q232j2155k0751j1162J2407
850a0321K0161J2001r272k1985j2004P170K3730J3699p842k2468j6990J0066K2551
863H496J6362q217k4199j4699O197K4393J5923p338k2461j7564Q421K1162J6784
876B3260o516k2066j3933L518K0991J4596l379j7954j7517L265J6488J7940l55
889A8338j8430j6752k721J8627J8350J979j6481k1479j597J6060K1463L653j8087
902B923k0368n808J9093K1421M243j7655k3641k073J6809K1672L607j7034j9198
$$ plain form
915 -16009 -22319 -5753 13802 19754 6196 -15569 -20265 -7726 12338 19239 7092 -10511 -20622
928 -20622 -9468 9153 20323 11655 -10306 -20140 -12560 9025 21881 12808 -7988 -22276 -12492
941 -12492 8962 22746 15002 -8908 -21792 -14154 9420 23640 14378 -6845 -22776 -13747 8908
954 8908 22810 14828 -7755 -19050 -13493 6268 20407 15310 -2721 -19772 -15005 3519 19500
967 19500 17295 -2734 -17518 -17175 1161 17663 17268 1737 -18705 -19309 -1828 18217 20543 321
981 321 -18503 -21128 -2239 18424 19901 2089 -20374 -20601 -2904 17259 20533 1155 -17724
994 -17724 -21403 -3025 16632 18590 3853 -17451 -20369 -4642 14634 19409 3985 -13066 -20508
1007 -20508 -7603 12557 20477 8895 -13919 -21095 -9224 12201 22062 9449 -10838 -22005
$$ packed form
915a6009o310J6566J9555N952j3558k1765m696J2539K0064O901j2147j7603j0111
928b0622J1154J8621J1170q668k1961r834P580K1585J2856r073k0796j4288R784
941a2492K1454J3784p744k3910j2884P638K3574J4220r262k1223j5931R029K2655
954H908J3902p982k2583j1295N557J9761J4139n097j8031j7051M767J8524J5981
967A9500k205k0029j4784L43J8336J6502l95j5531k0442o04J7481K0045K326k0222
981C21j8824k625J8889K0663J477j7812k2463k27J7697K0163L274j9378j8879
994a7724l679J8378J9657J958j4737k1304k918J5727J9276M775j5424j7051p442
1007b0508J2905K0160P920j1582k2814p176J1871K1425R861j2613k0287j1167
$$ plain form
1019 -22005 -10322 11607 22678 12825 -11295 -22492 -11144 12419 23872 10880 -9911 -21927
1031 -21927 -10810 11120 22233 12872 -10317 -20195 -11065 9231 22124 12709 -6888 -20682 -12547
1044 -12547 7636 20086 15199 -6154 -19953 -14803 4569 20293 15412 -2353 -20818 -17717 3199
1057 3199 20322 18468 -3999 -20685 -18584 1890 20785 17281 -1982 -21417 -19198 1670 19523
1070 19523 18948 -3054 -20357 -19088 880 19448 16231 -497 -18876 -18802 -946 16769 18333
1083 18333 174 -17015 -19315 -3387 16357 18589 4068 -16763 -19840 -4405 14631 21482 5047
1096 5047 -14875 -21084 -6154 15928 21440 8034 -15223 -21762 -6069 15141 22917 6580 -13651
1109 -13651 -20886 -6446 15174 21177 8677 -12936 -20381 -7015 12917 21592 7891 -10812 -19421
$$ packed form
1019b2005J1683K1929J1071r853k4120j1197J1348K3563J1453j2992k0791j2016
1031b1927J1117K1930J1113r361k3189r878R130K0296J2893r415j9597j3794Q135
1044a2547K0183J2450m887k1353j3799N150J9372J5724m881j7765j8465L101K0916
1057C199J7123j854k2467j6686K101K0474J8895l504j9263j9435K219K0868J7853
1070A9523n75k2002j7303J269J9968J8568l217j6728j8379P4J7856J7715J564
1083A8333j8159j7189k300J5928J9744K232j4521k0831l077J5435J9036O851j6435
1096E047j9922o209J4930K2082N512j3406k3257o539J5693K1210P776j6337k0231
1109a3651p235J4440K1620O003j2500k1613p445J3366J9932Q675j3701j8703q609
$$ plain form
1122 -19421 -8818 11558 19506 10932 -9566 -19617 -10585 8629 21226 11260 -7841 -20419 -12963
1135 -12963 8198 20502 13234 -8535 -21443 -13756 6564 21814 13307 -7562 -21778 -14995 7128
$$ packed form
1122a9421J0603K0376P948q574k0498j0051R032J9214J2597r966j9101j2578P456
1135a2963K1161J2304p268k1769j2908P687K0320J5250q507k0869j4216O783K2123
$$ [...]
8191c18
##END NTUPLES=NMR FID
##END=
