##TITLE=1H_Pr dep-87
 CDCl3, 8 sc, 
 26.04.2021
##JCAMPDX= 6.0         $$ Bruker NMR JCAMP-DX V2.0
##DATA TYPE= NMR FID
##DATA CLASS= NTUPLES
##ORIGIN= UXNMR, Bruker Analytische Messtechnik GmbH
##OWNER= root
$$ XWIN-NMR		Version 3.5
$$ Mon Apr 26 15:44:44 2021 Russian Standard Time (UT+4h)  she@DPX200
##.OBSERVE FREQUENCY= 200.131506
##.OBSERVE NUCLEUS= ^1H
##.DELAY= (6, 6)
##.ACQUISITION MODE= SIMULTANEOUS
##.ACQUISITION SCHEME= undefined
##.AVERAGES= 8
##.DIGITISER RES= 18
##SPECTROMETER/DATA SYSTEM= spect
##.PULSE SEQUENCE= zg30
##.SOLVENT NAME= CDCl3
##.SHIFT REFERENCE= (INTERNAL, CDCl3, 0, 15.7039)
##AUDIT TRAIL= $$ (NUMBER, WHEN, WHO, WHERE, WHAT)
$$ ##TITLE= Audit trail, XWIN-NMR		Version 3.5
$$ ##JCAMPDX= 5.01
$$ ##ORIGIN= Bruker BioSpin GmbH
$$ ##OWNER= she
$$ F:/spectra/data/she/nmr/H-F/1/audita.txt
$$ ##AUDIT TRAIL=  $$ (NUMBER, WHEN, WHO, WHERE, WHAT)
(   1,<2021-04-26 15:43:18.26 +0400>,<she>,<DPX200>,
      <created by zg, POWCHK disabled, PULCHK disabled
       configuration hash MD5:
       00 E9 B6 7A A2 85 ED C7 34 08 36 98 17 FE 4E 26
       data hash MD5: 16K
       2A 6E DF A1 A0 64 DF 86 73 B8 12 40 97 5D 44 A0>)
$$ ##END=
$$ 
$$ hash MD5
$$ FB 9B 61 5B 35 F3 24 92 52 62 4C 3E 14 A3 00 19
##$RELAX= 
##$RELAX= 
##$RELAX= 
##$RELAX= 
##$RELAX= 
##$RELAX= 
$$ Bruker specific parameters
$$ --------------------------
##$DU= <F:/spectra>
##$EXPNO= 1
##$NAME= <H-F>
##$PROCNO= 1
##$TYPE= <nmr>
##$USER= <she>
##$AMP= (0..31)
100 100 100 100 100 100 100 100 100 100 100 100 100 100 100 100 100 100 
100 100 100 100 100 100 100 100 100 100 100 100 100 100 
##$AQSEQ= 0
##$AQ_mod= 1
##$AUNM= <au_zg>
##$AUTOPOS= <>
##$BF1= 200.13
##$BF2= 200.13
##$BF3= 200.13
##$BF4= 200.13
##$BF5= 200.13
##$BF6= 200.13
##$BF7= 200.13
##$BF8= 200.13
##$BYTORDA= 1
##$CFDGTYP= 0
##$CFRGTYP= 5
##$CHEMSTR= <none>
##$CNST= (0..31)
1 1 145 1 1 1 1 1 1 1 1 1 1 1 1 1 1 1 1 1 1 1 1 1 1 1 1 1 1 1 1 1 
##$CPDPRG= <>
##$CPDPRG1= <>
##$CPDPRG2= <>
##$CPDPRG3= <>
##$CPDPRG4= <mlev>
##$CPDPRG5= <mlev>
##$CPDPRG6= <mlev>
##$CPDPRG7= <mlev>
##$CPDPRG8= <mlev>
##$CPDPRGB= <>
##$CPDPRGT= <>
##$D= (0..31)
0 1.2 0 0 0 0 0 0 0 0.06 0 0.03 0 0 0 0 0.0002 0 0 0 0 0 0 0 0 0 0 0 0 
0 0 0 
##$DATE= 1619437397
##$DBL= (0..7)
120 120 120 120 120 120 120 120 
##$DBP= (0..7)
150 150 150 150 150 150 150 150 
##$DBP07= 0
##$DBPNAM0= <>
##$DBPNAM1= <>
##$DBPNAM2= <>
##$DBPNAM3= <>
##$DBPNAM4= <>
##$DBPNAM5= <>
##$DBPNAM6= <>
##$DBPNAM7= <>
##$DBPOAL= (0..7)
0.5 0.5 0.5 0.5 0.5 0.5 0.5 0.5 
##$DBPOFFS= (0..7)
0 0 0 0 0 0 0 0 
##$DE= 6
##$DECBNUC= <off>
##$DECIM= 32
##$DECNUC= <off>
##$DECSTAT= 4
##$DIGMOD= 1
##$DIGTYP= 9
##$DL= (0..7)
0 120 120 120 120 120 120 120 
##$DP= (0..7)
150 150 150 150 150 150 150 150 
##$DP07= 0
##$DPNAME0= <>
##$DPNAME1= <>
##$DPNAME2= <>
##$DPNAME3= <>
##$DPNAME4= <>
##$DPNAME5= <>
##$DPNAME6= <>
##$DPNAME7= <>
##$DPOAL= (0..7)
0.5 0.5 0.5 0.5 0.5 0.5 0.5 0.5 
##$DPOFFS= (0..7)
0 0 0 0 0 0 0 0 
##$DQDMODE= 0
##$DR= 18
##$DS= 0
##$DSLIST= <SSSSSSSSSSSSSSS>
$$ [...]
##$SUBNAM2= <"">
##$SUBNAM3= <"">
##$SUBNAM4= <"">
##$SUBNAM5= <"">
##$SUBNAM6= <"">
##$SUBNAM7= <"">
##$SUBNAM8= <"">
##$SUBNAM9= <"">
##$SW= 16.9725357007746
##$SWIBOX= (0..15)
0 0 2 0 0 0 0 0 0 0 0 0 0 0 0 0 
##$SW_h= 3396.73913043478
##$TD= 16384
##$TD0= 1
##$TE= 0
##$TE2= 300
##$TE3= 300
##$TEG= 300
##$TL= (0..7)
0 120 120 120 120 120 120 120 
##$TP= (0..7)
150 150 150 150 150 150 150 150 
##$TP07= 0
##$TPNAME0= <>
##$TPNAME1= <>
##$TPNAME2= <>
##$TPNAME3= <>
##$TPNAME4= <>
##$TPNAME5= <>
##$TPNAME6= <>
##$TPNAME7= <>
##$TPOAL= (0..7)
0.5 0.5 0.5 0.5 0.5 0.5 0.5 0.5 
##$TPOFFS= (0..7)
0 0 0 0 0 0 0 0 
##$TUNHIN= 0
##$TUNHOUT= 0
##$TUNXOUT= 0
##$USERA1= <user>
##$USERA2= <user>
##$USERA3= <user>
##$USERA4= <user>
##$USERA5= <user>
##$V9= 5
##$VALIST= <valist>
##$VCLIST= <CCCCCCCCCCCCCCC>
##$VD= 0
##$VDLIST= <DDDDDDDDDDDDDDD>
##$VPLIST= <PPPPPPPPPPPPPPP>
##$VTLIST= <TTTTTTTTTTTTTTT>
##$WBST= 1024
##$WBSW= 4
##$XGAIN= (0..3)
0 0 0 0 
##$XL= 0
##$YL= 0
##$YMAX_a= 214952
##$YMIN_a= -225880
##$ZGOPTNS= <>
##$ZL1= 120
##$ZL2= 120
##$ZL3= 120
##$ZL4= 120
##$ABSF1= 10
##$ABSF2= 0
##$ABSG= 5
##$ABSL= 3
##$ALPHA= 0
##$AQORDER= 0
##$ASSFAC= 0
##$ASSFACI= 0
##$ASSFACX= 0
##$ASSWID= 0
##$AUNMP= <proc_1d>
##$AZFE= 0.1
##$AZFW= 0.1
##$BCFW= 1
##$BC_mod= 2
##$BYTORDP= 1
##$COROFFS= 0
##$CY= 11.3945322036743
##$DATMOD= 1
##$DC= 2
##$DFILT= <>
##$DTYPP= 0
##$F1P= 15.9154993809931
##$F2P= -4.1035820241983
##$FCOR= 0.5
##$FTSIZE= 0
##$FT_mod= 4
##$GAMMA= 1
##$GB= 0.15
##$INTBC= 1
##$INTSCL= 1
##$ISEN= 128
##$LB= 0.24
##$LEV0= 0
##$LPBIN= 0
##$MAXI= 10000
##$MC2= 0
##$MEAN= 0
##$ME_mod= 0
##$MI= 1.114404
##$NCOEF= 0
##$NC_proc= 0
##$NLEV= 6
##$NOISF1= 3.799351
##$NOISF2= 2.8
##$NSP= 1
##$NTH_PI= 0
##$NZP= 0
##$OFFSET= 15.70392
##$PC= 1
##$PHC0= -11116.96
##$PHC1= 7.20095
##$PH_mod= 1
##$PKNL= yes
##$PPARMOD= 0
##$PSCAL= 0
##$PSIGN= 0
##$REVERSE= no
##$SF= 200.130013532006
##$SI= 16384
##$SIGF1= 3
##$SIGF2= 2
##$SINO= 400
##$SIOLD= 16384
##$SREGLST= <1H.CDCl3>
##$SSB= 0
##$STSI= 0
##$STSR= 0
##$SW_p= 3612.71676300578
##$SYMM= 0
##$S_DEV= 0
##$TDeff= 0
##$TDoff= 0
##$TI= <>
##$TILT= no
##$TM1= 0
##$TM2= 0
##$TOPLEV= 0
##$USERP1= <user>
##$USERP2= <user>
##$USERP3= <user>
##$USERP4= <user>
##$USERP5= <user>
##$WDW= 1
##$XDIM= 8192
##$YMAX_p= 0
##$YMIN_p= 0
$$ End of Bruker specific parameters
$$ ---------------------------------
##NTUPLES= NMR FID
##VAR_NAME=  TIME,          FID/REAL,        FID/IMAG
##SYMBOL=    X,             R,               I
##VAR_TYPE=  INDEPENDENT,   DEPENDENT,       DEPENDENT
##VAR_FORM=  AFFN,          ASDF,            ASDF
##VAR_DIM=   8192,          8192,            8192
##UNITS=     SECONDS,       ARBITRARY UNITS, ARBITRARY UNITS
##FACTOR=    0.0002944,     1,               1
##FIRST=     0,             0,               0
##LAST=      2.4114304,     0,               0
##MIN=       0,             -225880,         0
##MAX=       2.4114304,     214952,          0
$$ Real data points
##PAGE= N=1
##DATA TABLE= (X++(R..R)), XYDATA
$$ [...]
1869d69N80R1m21J7n40J066l76M89n57l72K08L06M83n29j91k29O27O7J31l57o71
$$ -469 111 202 -219 -202 -742 324 -52 437 -120 -492 -284 22 505 -24 -215 -444 183 250 381 24 -647
1890f47P69j83O36j98k53m34P60K87n22K63o14O18n28O23k73k62Q9k40N00l11
$$ -647 122 -61 575 377 124 -310 450 737 215 478 -136 482 -46 577 304 42 131 -109 391 80
1910H0K73l03Q4l16K83N10n35J31p88O48j07O76p56n53O03o1P23p44o0m06K93
$$ 80 353 50 134 -182 101 611 76 207 -581 67 -40 636 -120 -673 -70 -131 592 -152 -212 -618 -325
1931c25M87k1k87o97Q46m87P74l83j65J9o5L03j87M01p26K22k34M33J18J61l78
$$ -325 162 141 -146 -843 3 -484 290 -93 -258 -239 -304 -1 -188 213 -513 -291 -525 -92 26 187 -191
1952a91l23N03k76O26m04j86QO8R84n66j50m30J82M21K61l22n09L42P4N57n30
$$ -191 -514 -11 -287 339 -65 -251 -243 -175 809 243 93 -337 -155 266 527 205 -304 38 112 669 139
1973A39J06o56J85N38k32N23o58J43j76L91J93j61j85m51M69j42Q18q04m0l73
$$ 139 245 -411 -226 312 80 603 -55 88 -88 303 496 335 150 -301 168 26 844 40 0 -373
1993c73L52P56n25Q7q73K68J29O72m68l39J60j35Q85o50J95n04J13K29o3J16o96
$$ -373 -21 735 210 297 -576 -308 -179 493 25 -314 -154 -289 596 -54 141 -363 -250 -21 -84 32 -664
2014f64P04m29M30l03L4O6l1L1j72P16o81M07p30L12N36l79M23q58N63j10L89
$$ -664 40 -389 41 -262 -228 -162 -193 -162 -334 382 -299 108 -622 -310 226 -153 270 -588 -25 -135 254
2035B54J68o82P0J05O58n97K90o62M01O5K14J03o67L99k04O62m55J90j93J96J53
$$ 254 422 -260 -190 -85 573 -24 266 -396 5 70 284 387 -280 119 -85 577 122 312 119 315 468
2056D68m43O33o79L70o69M00Q9L9r4m23K16j34P87m41j55l93J60O30k36J16n70
$$ 468 25 658 -21 349 -320 80 169 208 114 -309 -93 -227 560 119 -36 -429 -269 361 125 241 -329
2077c29j23L07M17j89m40j06m0P20l94K44k72l20K90j02M40n80L33n85Q61k93
$$ -329 -452 -145 272 83 -357 -463 -503 217 -177 67 -205 -525 -235 -337 103 -477 -144 -729 132 -161
2097a61L7J81o22O61n46O90n12M13l96m6M71k29K09m30M99n37R65m06l48p4L5
$$ -161 -124 57 -565 96 -450 240 -272 141 -255 -301 170 -59 150 -280 219 -318 647 241 -107 -181 -146
2118a46M73k82J39j57K77l98L73n3k78L00m48N28j23K58n52J50J26m63P40m93
$$ -146 327 45 184 27 304 -94 279 226 -52 248 -200 328 205 463 -89 61 187 -276 464 -29
2138b9N24q56K08K38J54J66o26K00j93L09q7l6K0l52O67k76L78q26J41j44P93
$$ -29 495 -361 -153 85 239 405 -221 -21 -214 95 8 -28 -8 -360 307 31 409 -417 -276 -420 373
2159C73j29m78J16m99P89o71P30n13j01K84j3K43n06L99m51M59k40N19j84m53
$$ 373 244 -234 -118 -617 172 -499 231 -282 -383 -99 -112 131 -375 24 -427 32 -208 311 127 -326
2179c26Q4mM64k95L42l73j52K54J62K61o18J20k44N71K91p26L27m62P60l67M34
$$ -326 -242 -246 218 -77 265 -108 -260 -6 156 417 -201 -81 -325 246 537 -189 138 -324 436 69 503
2200E03p30L37j9J6L57l01J93m81K86k28N45m72J72J70n01L27k37L16k44p9J54
$$ 503 -227 110 91 107 464 163 356 -125 161 -67 478 6 178 348 -153 174 -63 253 9 -70 84
2221H4K17Q5l56k42j13K00L45k22k27m03O45j98N85q62M04l52L69P9k10J05k26
$$ 84 301 386 30 -212 -325 -125 220 -2 -229 -632 13 -185 400 -462 -58 -410 -41 38 -172 -67 -293
2242b93J59J22K44l68n7J11l14M12l04M92q29P36m10L11J78m83K52k68N77p6J38
$$ -293 -134 -12 232 -136 -193 -82 -396 16 -288 204 -625 111 -299 12 190 -293 -41 -309 268 192 330
2263C30o30J04L62k02M64m96J75r9R7J83J88j81n32O90n29N39l03P1k54K14J52
$$ 330 -300 -196 166 -36 428 -68 107 8 105 288 476 295 -237 453 -76 463 160 231 -23 191 343
2284C43m66M63o39K97l93O64K03l51M4p03P59J6J02k11m37J29K00J24k48K0k51
$$ 343 -123 340 -299 -2 -395 269 472 121 165 -538 221 237 339 128 -309 -180 20 144 -104 -84 -335
2305c35L50j17Oj43q4M96m43M03l63K51k21qJ05lK54l65L04n24O62j57k05mk47
$$ -335 15 -102 -96 -239 -323 173 -270 133 -230 21 -200 -208 -103 -106 148 -217 87 -437 225 68 -137 -141 -388
2328c88K51Q9L78l03k2j30K27L24k80Q0m74M06r4J01k03k98L28M1K74j70R7l91
$$ -388 -137 -48 330 27 5 -125 102 426 146 226 -248 158 64 165 -38 -336 -8 33 307 137 234 -157
2350a57K40J66q0P2k95M55o70L30J00J38l09j41L48j62L87l78J45l77L03l4K0
$$ -157 83 249 169 241 -54 401 -269 61 161 299 -10 -151 197 35 422 44 189 -188 115 81 101
2371A01J69m76J85lL08n60K69jQ5J19k84R4k41K29n9J25q0k91p7J93J22J14j78
$$ 101 270 -206 -21 -24 284 -276 -7 -8 77 196 -88 6 -235 -6 -65 60 -20 -311 -388 -195 -73 41 -137
2394a37j75L56o0k87L90m84L86j44nJ41J62l56j15K93o0M82n00l7j10K23M29k88
$$ -137 -312 44 -16 -303 87 -397 -11 -155 -160 -19 143 -213 -328 -35 -95 387 -113 -150 -260 -37 392 104
2416A04N5o45M47R8K86n9m77J52L4N54k48k91j73K46K67l50L24m08L74l69J05
$$ 104 159 -486 -39 59 345 286 -191 -39 -5 549 301 10 -163 83 350 0 324 -84 290 -79 26
2437B6O7K45l60k60M68m54N18l15J10j91J39K99m1k43m61M13J62J8k99J29K6j23
$$ 26 93 338 -22 -282 186 -268 250 -65 45 -146 -7 292 251 8 -453 -40 122 140 -159 -30 -4 -127
2459a27K09j24k8l11J47J27J07k37k8J19j55L24j83L10k68p7J18j41M80k55l5
$$ -127 82 -42 -70 -381 -234 -107 0 -237 -265 -146 -301 23 -160 150 -118 -195 -77 -218 262 7 -28
2480b8j65K24J39n2j98k78M54k51M49l76J14j55N9K21m8L4m14L15p6K66j78p3
$$ -28 -193 31 170 118 -80 -358 96 -155 294 -82 32 -123 -64 157 109 143 -271 44 -32 234 56 -17
2502a7J05N7R2j27P7k83K72J03k66L55n31L96l30K54J64n0j67l40M46o73R02k99
$$ -17 88 145 237 110 187 -96 176 279 13 368 -163 233 -97 157 321 271 104 -236 210 -463 439 140
2524A40m0j12j50L59o8Q5m72J97r1K28j89j17K15n27M77j26M78o27J89j5j95M81
$$ 140 100 -12 -162 197 129 214 -258 -61 -152 76 -113 -230 -15 -542 -65 -191 287 -340 -151 -166 -361 120
2546A20k54J42l70M87k62L37m17j37J95k43M38m0k8k11K69R0O9O2n83K73r3R3
$$ 120 -134 8 -362 125 -137 200 -217 -354 -159 -402 36 -4 -32 -243 26 116 185 247 -336 -63 -156 -63
2568f3K88k83L9n6K92K2j07k43L00j17Q5L8j30J47j08K18l36K86m36J63m2q5L31
$$ -63 225 -58 -19 -75 217 239 132 -111 189 72 157 195 65 212 104 322 -14 272 -164 -1 -43 -128 203
2591B03j58J95l72L26j07P9l5l55L07j20K99j7j01k77N7L25k97L68m93O7P1JK
$$ 203 45 240 -132 194 87 166 131 -224 83 -37 262 245 144 -133 -76 249 -48 320 -173 -106 -35 -34 -32
2614c2L3ll90N18k85O1o4j37J40j56K03K1R5k1J32m51O35j09k20j01o6J47J16
$$ -32 1 -2 -392 126 -159 -98 -162 -299 -159 -315 -112 -91 4 -17 115 -336 299 190 -30 -131 -197 -50 66
2637F6K30k26n8R8J91M8k97l64J57K86m5J14k81LL99k78J29k79J52j78K96K06
$$ 66 296 70 12 110 301 349 52 -312 -155 131 86 200 -81 -78 321 43 172 -107 45 -133 163 369
2659C69l59J02k05L10m80K5L80j13J94k11M69k06K64o28n5K46K10j07o57N05l39
$$ 369 10 112 -93 217 -263 -238 142 29 223 12 481 275 539 -89 -144 102 312 205 -452 53 -286
2680b86L02j12j2J76k17J42k33K04k25L03j45J43j67J33O8l54K94k59K63j50K3
$$ -286 16 -96 -108 68 -149 -7 -240 -36 -261 42 -103 40 -127 6 74 -280 14 -245 18 -132 -109
2701a09J07n3J18n8J06m0R1l16Q3l7j12K91k53K91o6J7o8l3N1K23j76k76K91J44
$$ -109 -2 -55 63 5 111 71 162 -154 -71 -108 -220 71 -182 109 43 60 -8 -41 10 233 57 -219 72 216
2725B16j37o9K01J25l59J18j69M75j18k49j14J02K62k78J22k53M01k06K15l91
$$ 216 79 10 211 336 -23 95 -74 401 283 34 -80 22 284 6 128 -125 276 70 285 -106
2745a06J41J03l15M37m29M43l43o5Nj04M46j22O9n52M06J1j4L2m19J16q1N17m26
$$ -106 35 138 -177 260 -169 274 -69 -134 -129 -233 213 91 160 -392 14 25 11 43 -376 -260 -341 176 -250
2768b50J80O2K3J8l4k9jQO7N0j59pJ4k45K89r0J28m5l5j48L55l1m4M9m54N82j26
$$ -250 -70 -8 15 33 -1 -30 -31 -23 44 94 -65 -72 -58 -303 -14 -104 24 -21 -56 -204 151 120 76 125 -329 253 127
2795A27K48l06k9P3M4J99k20J38j84L79m08L6L64n69L26l42K90L2n8k13p3K15
$$ 127 375 69 40 113 157 356 136 274 90 469 61 97 461 -108 218 -124 166 198 140 -73 -146 69
2817F9P0K21n29K63j09RQ5p6K34o37O28k87K77m20R4Q3j87K21M2l6p7k8n5o1K08
$$ 69 139 360 -169 94 -15 -6 79 3 237 -400 228 -59 218 -202 -108 -25 -212 9 51 15 -62 -90 -145 -206 2
2842Bl50K01M3J87m17L00km6M8k28J37l90M96k86K17N0K60m10R3K38l67L48l69
$$ 2 -348 -147 -104 83 -334 -34 -36 -82 -34 -262 -125 -515 -19 -305 -88 -38 222 -188 -95 143 -224 124 -245
2865b45L73j21K36k6k15J83j88j96K84L6L8k10J60k11O34n23J24k53P7M9K52k5
$$ -245 128 7 243 217 2 185 -3 -199 85 121 159 -51 109 -102 532 9 133 -120 -43 6 258 233
2887B33rQ6m44L41k60J66k00K16k28M0K32l38L67j67l6J20l57M55n39L49k23L59
$$ 233 224 310 -134 207 -53 113 -87 129 -99 -59 173 -165 202 35 -1 119 -238 217 -322 27 -196 163
2909A63l77J01Mj15K44l15R1r6K43O1k4k25M5R7q5P6m4J45k1k09K84m8K03l58
$$ 163 -214 -113 -109 -224 20 -295 -204 -300 -57 4 -20 -245 -200 -103 -188 -112 -156 -11 -32 -241 43 -5 198 -160
2933a60L82m83J58r0L49r3J74j81q4L38l62J76j54l8L72m60M22l28L37l15L13
$$ -160 222 -261 -103 -193 156 63 237 56 -28 310 -52 124 -30 -68 304 -156 266 -62 275 -40 273
2954B73M0l93J04J61J79m10K56l47L55j66J24k9r1oj28J09j19K75l4k83Q1k2K51
$$ 273 313 -80 24 185 364 -46 210 -137 218 52 176 147 56 50 -78 31 -88 187 153 -130 -49 -71 180
2977A80k48J80j79J04j23K64j97l66K50k0n0P2n1M2j53L06k6J45n00M17k6o1J72
$$ 180 -68 112 -67 37 -86 178 -19 -385 -135 -155 -205 -133 -184 -142 -295 11 -15 130 -370 47 21 -40 132
3000A32j89L1k01L52m76M03j27k21K75j22K49k11J15k45J4K26J4K84l13K00n31
$$ 132 -57 -26 -227 125 -351 52 -75 -296 -21 -143 106 -105 10 -235 -221 5 19 303 -10 190 -341
3021c41O21k11Pj76K46l6P4J07k12P6K4J22m9q6M2k07q4K9L03J27k86K8O4p4j06
$$ -341 280 69 76 -100 146 110 184 291 79 155 179 301 252 166 208 1 -83 -54 249 376 90 118 182 108 2
3046BJ26l34L63pk3Om52L04K9P7j86Q1q4J12j99q7K77l42L27k48K78k35P5r0L6
$$ 2 128 -206 157 150 127 133 -319 -15 14 91 -95 -14 -98 14 -185 -272 5 -337 -10 -258 20 -215 -140 -230 -194
3071a94J40l07N01m86J33J8K13o7L7J44n43N24l05J90J64k49L20n90M57j45Lr2
$$ -194 -54 -361 140 -346 -213 -195 18 -49 -12 132 -411 113 -192 -2 162 -87 233 -357 100 -45 -42 -134
3093a34J24L23m66K41j68K90l65L42j61J19j66JK32j03m0j15R8q7R0O2o7K6J24
$$ -134 -10 313 -153 88 -80 210 -155 187 26 145 -21 -20 212 109 69 -46 52 -35 55 117 50 76 200
3116B00j41j50J11k7J16K42k87j89m8L53m59J47K01j44K68j41O1k77L93j82q0
$$ 200 59 -91 20 -7 109 351 64 -125 -173 180 -279 -132 69 -75 193 52 113 -164 229 47 -33
3137c3p3n5L33n58K49Q2Q8k77J60q0qL4N7L09l29J98K3j58j19J8k5J94k88k70
$$ -33 -106 -161 172 -386 -137 -55 33 -244 -84 -164 -172 -138 -81 228 -101 97 120 -38 -157 -139 -164 30 -258 -528
3161e28L73J46p7K83j54j03k16L79j41L10l48PK68m9j5j08k20J08L84l18N8K6
$$ -528 -155 -9 -86 197 43 -60 -276 103 -38 272 -76 -69 199 150 135 27 -193 -85 299 -19 39 65
3183F5o8Q6p2J18Q4q5l85L52M6r8mpK69l32K74j21n07M14r3K03L2p3j72J86m93
$$ 65 -3 83 11 129 213 128 -257 95 141 43 39 32 301 -31 243 122 -385 29 -64 139 171 98 -74 112 -381
3208c81M01J95n17L12l60N41m55N13m28r6J95k12L36k87l2J72J09l5p8K1j3j71
$$ -381 20 215 -302 10 -350 191 -264 249 -179 -275 -80 -292 44 -243 -275 -103 6 -29 -107 -86 -99 -270
3230b70J26J49j7j64K0k40L68j9J91k97r1J93J34K6o1M0j44L42l23K45l38M8J89
$$ -270 -144 5 -12 -176 -156 -396 -28 -47 144 -153 -244 -51 83 109 48 88 -56 286 -37 208 -130 -82 107
3253A07k56L04k6j00o0K84k51n2J51j54K90k36L34k67L2k6P2rk47K78j09nj72
$$ 107 -149 155 129 29 -31 253 2 -50 101 -53 237 1 335 68 100 74 146 137 -110 168 59 54 -118
3276a18L2R6O0N4l41K37m2K73l04j12Q8j04K20l21K29j23j2M2J06P7j64r8M9J58
$$ -118 -86 10 70 124 -217 20 -22 251 -53 -165 -77 -181 39 -282 -53 -176 -188 -146 -40 37 -127 -225 -176 -18
3300a8j81P6k79K99K2Q0J5k34K35k85L25k86K92n5j61K42j26J71j98J9p2K96n3
$$ -18 -199 -123 -402 -103 -81 -1 14 -220 15 -270 55 -231 61 6 -155 87 -39 132 -66 -47 -119 177 124
3323A24j36J30l63L35k48K79j69J56j97K51R2l16J83M1lR1k54J48j49J77l83N28
$$ 124 -12 118 -245 90 -158 121 -48 108 -89 162 254 -62 121 162 159 250 -4 144 -5 172 -211 317
3345C17j45j15j0n03M97j35K16n2Q3j10j04j60K94M2j47o8N6Q9K1j4k90J71J83
$$ 317 172 57 47 -456 41 -94 122 70 153 43 -61 -221 73 115 -32 -100 -44 45 66 52 -238 -67 116
3368A16p0Q7m15K72O1j59J90l49K23P8k3O9k2J5l12K84p9K22l19M8P5p3J19j20
$$ 116 46 133 -282 -10 51 -108 82 -267 -44 34 11 80 58 73 -239 45 -34 188 -131 -83 -8 -81 38 -82
3392h2L10m22J61J7J54j35J02l12J46N6k6J36Km1J13J41k84J18K4k97L42%k7n17
$$ -82 228 -194 -33 -16 138 3 105 -207 -61 -5 -31 105 107 66 179 320 36 154 178 -119 223 223 196 -321
3416c21L54J46j79K5J9K5l18K19L68J51n70J49K34q4j51K62m24P8k80K20J45j32
$$ -321 33 179 0 25 44 69 -249 -30 338 489 -81 68 302 218 67 329 -95 -17 -297 -77 68 -64
3438f4r8Q8J80n6N8l45J17p8L10q2Jj02l0KQ4o8J65L8l83K04J05o3l20K18N3j05
$$ -64 -162 -74 106 50 108 -237 -120 -198 112 30 31 -71 -101 -99 -15 -83 82 120 -263 -59 46 -17 -337 -119 -66 -171
3464a71j36K49K2j15K86j08k43K58k55L13j86L08j35j25k57L53n0J10K63l79L17
$$ -171 -307 -58 -36 -151 135 27 -216 42 -213 100 -86 222 87 -38 -295 58 8 118 381 2 319
3485C19k62p7L06k64j35K02J9k07K18k18J68k39M30q0j30n5j49L41l56O0P6p8
$$ 319 57 -20 286 22 -113 89 108 -99 119 -99 69 -170 260 180 50 -5 -154 187 -169 -109 -33 -111
3507a11P9j3k0J41k8M7kn0K45j42l76J89j81M64l35M5m3L3L28j69j12k04K57j62
$$ -111 -32 -45 -65 76 48 95 93 43 288 146 -230 -41 -222 242 -93 -48 -91 -58 270 101 -11 -215 42 -120
3531a20R3q4L45m45p1K15o8k6L71o8j13j01N2R1j78P0J80l5J22k25r4L5j63K35
$$ -120 -27 -111 234 -211 -282 -67 -135 -161 210 142 29 -72 -20 71 -107 -37 143 108 230 5 -89 -54 -217 18
3555A8Qj38R2r5K42P4M9m87K70Q5j32L5j42M74o14L40j53L20j29J86n03N5K20
$$ 18 26 -112 -20 -115 127 201 250 -237 33 118 -14 21 -121 353 -261 79 -74 246 117 303 -200 -145 75
3578G5m3K87l23n5l8J7J88l72M18k92J56j45J10q8p9LQ9K28l24J40o1K54k29o7
$$ 75 32 319 -4 -59 -97 -80 108 -264 154 -138 18 -127 -17 -105 -184 -181 -92 136 -188 -48 -109 145 -84 -151
3602a51M00l30K34k51K87l97L73k26k72K06j34L80k06J11k10L20j52J60k7j83
$$ -151 249 -81 153 -98 189 -208 165 -61 -333 -127 -261 119 -87 24 -186 134 -18 142 115 -68
3622f8L47l09P6n6J29n3o1j69j50L36J66p2m7j18J96k17J70J67l93K6K49j87j00
$$ -68 279 -30 46 -10 119 66 5 -164 -314 22 188 116 69 -49 147 -70 100 267 -126 -100 149 -38 -138
3645a38J84J42M6j58N1k54J74J58j83l5j20L13l17L56l47N71o07J48J33n04L94
$$ -138 46 188 234 76 127 -127 47 205 22 -13 -133 180 -137 219 -128 443 -164 -16 117 -387 7
3666Gk00L52j45P5k72J05N7l9J52Ok7n6j52L12k09kl61N49j39q4R3n0j3n5ML8
$$ 7 -193 159 14 89 -183 -78 -21 -60 92 98 71 15 -137 175 -34 -36 -397 152 13 -71 22 -28 -41 -96 -92 -54
3692e4J95m30K96O1M9j05j68L2k02N31j08J48m12M32k73qK72k71J66j99J32k20
$$ -54 141 -289 7 68 117 12 -156 -124 -326 205 97 245 -167 265 -8 -16 256 -15 151 -48 84 -136
3714a36J77J48j33K2j75R7k30J08J90m7L0j90K20j7R5n3J02l43M0jL0P6j79J05
$$ -136 41 189 56 78 -97 0 -230 -122 68 21 51 -139 81 64 159 106 208 -135 -95 -96 -66 10 -169 -64
3738f4j76L77k97J78J2j94J87j67J32j81K14P2l31K53j86J76j53Q9k12L66j64
$$ -64 -240 137 -160 18 30 -164 23 -144 -12 -193 21 93 -238 15 -171 5 -148 -59 -271 95 -69
3759f9n6K02j55J92k57M80m78R2J47k52J17N3k83K30J15j28J16o2L47k81j15J19
$$ -69 -125 77 -78 114 -143 337 -141 -49 98 -154 -37 16 -267 -37 78 -50 66 4 351 70 -45 74
3781G4R2j03j10O1L30k58J73l08K08j39j21K36J29l3j16M8j37K25n6J5l05K85
$$ 74 166 63 -47 14 344 86 259 -49 159 20 -101 135 264 231 115 163 26 251 195 210 -95 190
3803A90k47M5m6K37Q3k61J77k89J19k98K79J36l93K36K99j74j42J57l53L15K09
$$ 190 -57 -12 -58 179 262 1 178 -111 8 -290 -11 125 -268 -32 267 93 -49 108 -245 70 279
3824B79n34M83l70K84r8j36j7J72k89R4K7K05m77K25j0J37NQK0K89j25l7J1l24
$$ 279 -255 228 -142 142 44 -92 -109 63 -226 -132 -105 100 -377 -152 -162 -25 -20 -12 8 297 172 135 146 -178
3848a78K57q1K2j67J06j41K05N2J49k50N9q5J3K44j41n2J4j39N56k58j46j40Q7
$$ -178 79 -2 20 -147 -41 -182 23 75 224 -26 33 -52 -39 205 64 12 26 -113 443 185 39 -101 -14
3871a4J58j6k24K91q1j14K31l29K40j92K22r8J50k97J36J63k38j61K47j58n6K13
$$ -14 144 128 -96 195 114 0 231 -98 142 -50 172 74 224 -73 63 226 -12 -173 74 -84 -140 73
3893G3j76r4K3R1j4j74J93P1J16m9j41J71k05K37k46J14K4M8n3l7K35m28J42j04
$$ 73 -103 -197 -174 -83 -97 -271 -78 -7 109 60 -81 90 -115 122 -124 -10 14 62 9 -28 207 -221 -79 -183
3917a83K07p7j34K51R0j98j3J55l37J23P8Q3p2p1L93k53o6K99j94l73J71J55L4
$$ -183 24 -53 -187 64 154 -44 -57 98 -239 -116 -38 45 -27 -98 295 42 -24 275 81 -292 -121 34 68
3940F8J64j16j40p1K2J15p8K32k88J79J41j98OJ43K3l58L79j66K35l19j46K95
$$ 68 232 116 -24 -95 -73 42 -36 196 -92 87 228 30 36 179 202 -156 223 57 292 -27 -173 122
3962A22k19J8K60o4p3K57k68J16j64j67J79j53J22R4j16j90J55J50j56q8K11m8
$$ 122 -97 -79 181 117 44 301 33 149 -15 -182 -3 -156 -34 60 -56 -246 -91 59 -97 -185 26 -22
3984b2p7J89r6p8j65O4L27k05N8L29k18m5J43n19K56J82j31j22k3J42Kj34J22
$$ -22 -99 90 -6 -84 -249 -185 142 -63 -5 324 106 61 204 -315 -59 123 -8 -130 -153 -11 -9 -143 -21
4007b1j40K85n9J70k57k31L61k3l5q0J78k36J38m30L13K69k49%k00L31p6o2j45
$$ -21 -161 124 65 235 -22 -253 108 85 50 -30 148 -88 50 -380 -67 202 -47 -47 -247 84 8 -54 -199
4030a99J51j84O5L10l74K40j9L2k38K81j17k94J92K47N6l74J19J67q9j00m2K37
$$ -199 -48 -232 -167 143 -231 9 -10 22 -216 65 -52 -346 -154 93 149 -225 -106 61 -28 -128 -170 67
4052F7l86pN59j47p9kL6j37J26j4p8n4K47p5Q0j83j71K4K86k20K55n9J20j71J34
$$ 67 -319 -326 233 86 7 5 41 -96 30 16 -62 -116 131 56 136 -47 -218 -194 92 -128 127 68 188 17 151
4077A51j90J26k48J48j31L28k25j31L02j63K06J9k37n6K11k26J46o9lK07o3K79
$$ 151 -39 87 -161 -13 -144 184 -41 -172 130 -33 173 192 -45 -101 110 -116 30 -39 -42 165 102 381
4099C81m24J3QN3K33l22k12N15k91j49MJ83J1j0o7K03j97r6K14J16o5k07J69k06
$$ 381 -43 -30 -22 31 264 -58 -270 245 -46 -195 -191 -8 3 -7 -74 129 -68 -164 50 166 101 -106 63 -143
4123a43K56M1j15P9p9j14J67J2j40Q2n7j0J49J0k45r5L05p9Q1j36L12k73j3J32
$$ -143 113 154 39 118 39 -75 92 104 -36 46 -11 -21 128 138 -107 -202 103 24 105 -31 281 8 -5 127
4147A27k05K04k22P1J7k55J11J24K19J18k77l20L07Kr0K28ol0l42M1K87K3o6P3
$$ 127 -78 126 -96 -25 -8 -263 -152 -28 191 309 32 -288 19 21 -69 159 153 123 -219 -178 109 132 66 139
4171A39%k48K37k97N62p38L09q3J04J41k99K07l30K33j91J56R7K63l14j08Q5n6
$$ 139 139 -109 128 -169 393 -345 -36 -119 -15 126 -173 34 -296 -63 -254 -98 -1 262 -52 -160 -75 -131
4193a31J48j26J6l4pL29l05J34Q3j14Pj71qL90j45j31L05j18k23p1J8r3L86j53
$$ -131 17 -109 -93 -127 -134 195 -110 24 107 -7 0 -171 -179 211 66 -65 240 122 -101 -172 -154 -247 139 -14
4217a4N1k61m1J09O4K22j29O1M4j50J22o5m0M4l6p2L29K7l15O6K5K81k84m3L2
$$ -14 37 -224 -265 -156 -92 130 1 62 106 -44 78 13 -27 17 -19 -91 238 265 -50 16 41 322 38 -5 27
4242B7J69K8j88j09P5j25m4K95n0m0P8j89R6Q7k23K2J63j53J61j24O3l1j34k4
$$ 27 196 224 36 -73 2 -123 -167 128 78 38 116 -73 23 110 -113 -91 72 -81 80 -44 19 -12 -146 -170
4266a70N66l88j14N0pk7J44n0j41J75R9j79J18j82RK06J85j63k16q2J93J07j11
$$ -170 396 8 -106 -56 -63 -90 54 4 -137 38 137 -42 76 -106 -97 109 294 131 -85 -167 26 133 22
4289B2j8j87J03oJ28k64J30K74j46k82K1j5K43J87m99M51m55L00n0K5RQ4%m8K31
$$ 22 4 -183 -80 -86 42 -222 -92 182 36 -246 -225 -240 3 190 -309 142 -313 -13 -63 -38 -29 55 55 7 238
4314B38l61K54q3QJ94l01J34p0n0l1M69k54j36M9J36K0k79J84n6Q6k23J06qk33
$$ 238 -123 131 48 56 250 -51 83 13 -37 -68 401 147 11 60 196 216 -63 121 65 151 -72 34 26 -207
4338b07J58JK64l53K65p6k22k5K85j59O1K5L20l58k14K07N9Nj1J2k3k06JK38j55
$$ -207 -49 -48 216 -137 128 52 -170 -195 90 -69 -8 17 337 -21 -235 -28 31 36 25 37 14 -192 -191 47 -108
4363a08K19l14J93J5R6j17O1j81J64J05N8l88j19L66N4j1j5O5j42Nj34K86J20
$$ -108 111 -203 -10 5 101 -16 45 -136 28 133 191 -197 -316 50 104 93 78 143 1 6 -128 158 278
4386B78k11j73j29L81J3k51K52J30j47O3j5l75K35kJ2J5r9R3J00l09K01p5j05
$$ 278 67 -106 -235 146 159 -92 160 290 143 206 191 -184 51 49 61 76 -23 70 170 -139 62 -13 -118
4409a18K27M5k84J90J84j79J91k60N9l58M00j74M0NR0K8j51J61r3J62k24m9O0
$$ -118 109 154 -130 60 244 65 256 -4 55 -303 97 -77 -37 -32 58 86 -65 96 3 165 -59 -108 -48
4432d8P8j82k4J36J59n7l58L54K1n1m39K82K41j85J75J68l06L0p3J38n1J21rJ35
$$ -48 30 -152 -176 -40 119 62 -296 58 79 28 -411 -129 112 -73 102 270 -36 -6 -79 59 8 129 120 255
4456B55k70Qq4L01j29j56K54mo0l5p2J55j40N8P9j06p6K06m08L81j04J2j18J03
$$ 255 -15 -7 -91 210 81 -75 179 175 115 80 8 163 23 81 160 54 -22 184 -224 157 53 65 -53 50
4480E0K27j1l22j11M7K19q9J03k94J50j86J07J8R0J03l15J46r2K57q7k5Rk4j49
$$ 50 277 266 -56 -167 -120 99 10 113 -181 -31 -217 -110 -92 -2 101 -214 -68 -160 97 10 -15 -6 -30 -179
4504a79J98k00p3K73R6k4K9j12k04J13R5m7m1M4K23j22m1j14J44P6q1R5j81K21
$$ -179 19 -181 -254 19 115 91 120 8 -196 -83 12 -35 -76 -32 191 69 28 -86 58 134 53 148 -33 188
4528A88Q0l75K70k76L38j64O4JJ01l29J20lk15M69l79R4j42L71l17J84j05J38
$$ 188 268 -107 163 -113 225 61 125 126 227 -102 18 15 -200 269 -110 -16 -158 213 -104 80 -25 113
4550A13R0j91N4j37M1J31m51N12k51K66k03j26J62k4j19K32r5p2q7J26K37n05
$$ 113 203 12 66 -71 -30 101 -350 162 -89 177 -26 -152 10 -14 -133 99 4 -68 -155 -29 208 -297
4572b97K78m7K9K7n9n3J53j73J34O7J8N1Jq3j2o9K4m2Ok9k35J00K06J65j11k7
$$ -297 -19 -66 -37 -10 -69 -122 31 -142 -8 59 77 128 129 46 34 -35 -11 -53 -47 -76 -311 -211 -5 160 49 22
4598B2J43j70j47L13M6k08m7J81r6L1j50J83k31M26l11j11J20J07j62K9R9Q0j08
$$ 22 165 -5 -152 161 207 -1 -48 133 37 68 -82 101 -130 296 -15 -126 -6 101 -61 -32 67 147 39
4621C9P3N3mk0j09o9J71k81m7Q2K0j24L32k59J51k03K2K39j31l8kj52L15q5k1
$$ 39 112 165 161 141 32 -37 134 -147 -194 -112 -92 -216 116 -143 8 -195 -173 66 -65 -103 -105 -257 58 -27 -48
4646d8l0Q9m1Jjk13J3O9N74m45m9K86j66p8J20J16j04k26l6K42j63J11J8j24J09
$$ -48 -78 11 -30 -29 -30 -243 -230 -161 413 -32 -81 205 39 -39 81 197 93 -133 -169 73 -90 21 39 -85 24
4671B4K31l20R8m9l9K98k49J10j81jJ44J03l65J98q4J22l64L78j01K06j14R5p4
$$ 24 255 -65 33 -16 -55 243 -6 104 -77 -78 66 169 -196 2 -82 40 -324 54 -47 159 45 140 66
4694F6j56RQ4M2J6K0L6Kk94M6J03q8K7L8o5j46L28K52l05R4j72K57k39J02l5N2
$$ 66 -90 -81 3 45 61 81 117 119 -175 -129 -26 -114 -87 -49 -114 -260 68 320 15 109 -63 194 -45 57 22 74
4720G4j27J28m08K60J84j4J33k51J1J11J94k94J98l68n0L52n5j52J12k5j1R8q1
$$ 74 -53 75 -333 -73 111 97 230 -21 -10 101 295 1 199 -169 -219 133 78 -74 38 13 2 100 19
4743A9q7K09p7q1j93N7K35j12Q9o5k0J0K23j49o4P5k46J12l06K23K20q0j9K47
$$ 19 -68 141 64 -17 -210 -153 82 -30 59 -6 -26 -16 207 58 -6 69 -177 -65 -371 -148 72 -8 -27 220
4767B20j02j60J01P9K47l35P3n7k67M45j71L1j47j5L16j62J26l8k43N8J7J83l2
$$ 220 118 -42 59 138 385 50 123 66 -201 244 73 104 -43 -58 258 96 222 184 -59 -1 16 199 167
4790A67m56K96J28l13k8K00pl0J25r3J20k77L29Q9m65N47k00k26J92J24k39r9
$$ 167 -289 7 135 -178 -206 -6 -13 -43 82 -11 109 -168 161 250 -215 332 132 -94 98 222 -17 -116
4812a16J54J36m7j08K23j64l31j3jL16k64L03q0k73L14L7p3J2J27j18J4q6J80
$$ -116 38 174 127 19 242 78 -253 -266 -267 49 -215 88 8 -265 49 86 13 25 152 34 48 -38 142
4835A42K2k28J22Qk3j61M50l17J19j29k20Q6l1M18j99j26n2J75k69L11k29J36
$$ 142 164 -64 58 66 43 -118 332 15 134 5 -215 -129 -160 258 59 -67 -119 56 -213 98 -131 5
4857EK32j92r3P1o5O5J06M3j66o6P4j00J7j71K93k11o2N7J8j3QJ17J47p1j12j12
$$ 5 237 45 -48 23 -42 23 129 172 6 -60 14 -86 -69 -240 53 -158 -220 -163 -145 -158 -150 -33 114 43 -69 -181
4883a81J53k0J02k99J66J22l5N7N0q6j54L38Kj61n7k9J33P4j86K38k14k72M79
$$ -181 -28 -48 54 -245 -79 43 8 65 115 29 -125 213 215 54 -3 -32 101 175 -11 227 13 -259 220
4906B20k25L9r4L14k24N7p0j67N8J83k76J49K19k86K84k53p6Q4o9K34J12k71o4
$$ 220 -5 34 -60 254 30 87 17 -150 -92 91 -185 -36 183 -103 181 -72 -148 -64 -133 101 213 -58 -122
4929a22J67q8J40J6j61j02K41n4N3j29K34l33K28p9j76J12p5q7K27n5J58l16K31
$$ -122 45 -43 97 113 -48 -150 91 37 90 -39 195 -138 90 11 -165 -53 -128 -215 12 -43 115 -201 30
4952C0k00L32l15M9J01j99J46mJ18j55N0J12J6n1J3j11K06k04J91j76K92j50j80
$$ 30 -170 162 -153 -104 -3 -202 -56 -60 58 -97 -47 65 81 30 43 -68 138 -66 125 -51 241 91 -89
4975h9n4j1K05j02R3R1o5N4q6J29l05l2J36j20j8K06J75l8n7l4J20k10M15p2m07
$$ -89 -143 -154 51 -51 42 133 68 122 36 165 -140 -172 -36 -156 -174 32 207 169 112 78 198 -12 403 331 -76
5000g6P7o9q8K30p6K7K1L3j45j13J55J8N0J1j38l0j00L43j33J1J5o0P2J52j15
$$ -76 1 -68 -156 74 -2 25 46 79 -66 -179 -24 -6 44 55 -83 -113 -213 130 -3 8 23 -37 35 187 72
5025G2Kk36J86OO2q6q8q3l6K22j28r3J95j35K7J0J09k39J52Q3o6l6K31j71J91
$$ 72 74 -162 24 30 92 6 -82 -165 -201 21 -107 -200 -5 -140 -113 -103 6 -233 -81 2 -64 -100 131 -40 151
5050A51j48L23o63L10J82k60J37j7Pr8J67k13P1L68m82J10j59R3j9J05%J4rR8
$$ 151 3 326 -337 -27 155 -105 32 15 22 -76 91 -122 -51 317 -165 -55 -214 -121 -140 -35 -35 -21 -30 68
5074F8j3j12K63k36L44l99m8K89j43J12k48J46Pn2r6l17K59J20K70n29L19N5o8
$$ 68 55 -57 206 -30 314 -85 -133 156 13 125 -123 23 30 -22 -118 -435 -176 -56 214 -315 4 59 -9
5097ij75J24P5j40K58l18K32m2O0m5j69J01j35J86k7O9q3L30m71M47l17M11m65
$$ -9 -184 -60 15 -125 133 -185 47 5 65 20 -149 -48 -183 3 -24 45 -38 292 -179 268 -49 362 -103
5120a03k73M67j68L18k42m3Q1Q8R6k23j11K49K5j65N6l26K88j15K3J32o9L53k39
$$ -103 -376 91 -77 241 -1 -44 37 125 221 -2 -113 136 161 -4 52 -274 14 -101 -78 54 -15 338 99
5143I9Q1j7P5j33p4j9O7j39p8O1p8O4K38l7J2k70L34l86K79m05L24J1q3K4K13
$$ 99 180 163 238 105 31 12 79 -60 -138 -77 -155 -91 147 110 122 -148 186 -200 79 -326 -2 9 -74 -50 163
5168A63m3j94q5K28%J60p3L9k88O9J31j28q9j3J05k4L00l96J63o9K68k52j05k9
$$ 163 120 -74 -159 69 69 229 156 195 -93 -24 107 -21 -110 -123 -18 -42 258 -138 25 -44 224 -28 -133 -162
5192a62J83J0R9k5o0j77K96k3j98j06O1k2L27n8rN6l10J31N6J67k73J80l11J20
$$ -162 21 31 130 105 45 -132 164 141 -57 -163 -102 -124 203 145 136 192 -118 13 69 236 -37 143 -168 -48
5216d8L08k40j18J24J69m7l09M21j15j27q7K5Kr5L47j10l5J46k54R9j3k8J20q7
$$ -48 260 20 -98 26 195 148 -161 260 145 18 -69 -44 -42 -137 210 100 65 211 -43 56 43 15 135 48
5240D8J92o6J21r0k9k20J1R7r4J66jl5p7k36K94k74K57R1k38N0q2J77J1j38P9
$$ 48 240 174 295 205 176 -44 -33 64 -30 136 135 100 23 -213 81 -193 64 155 -83 -33 -115 62 73 -65 14
5265A4N6j34k20o9K87L2J74k63Lm6L60k37J33l02K56q6OM0J12Q9l32K27k21L37
$$ 14 70 -64 -284 -353 -66 -34 140 -123 -120 -166 194 -43 90 -212 44 -42 -36 4 116 205 -127 100 -121 216
5289B16j97p4L98n46K96N2l3J17m95M63j23r1q3j51J20J49p7J63k7j25R6j37k4
$$ 216 19 -55 343 -203 93 145 112 229 -266 197 74 -17 -100 -251 -131 18 -59 104 77 -48 48 -89 -113
5312a13mK4l3L90m03K85N6l08L8J21J38j17k99K41j54M5J0l6R5l84M46o2o9O2
$$ -113 -117 -93 -126 264 -139 146 202 -106 -68 53 191 74 -225 16 -138 -93 -83 -119 -24 -408 38 -24 -93 -31
5336c1J8J48j97J38l2k8o4J20q8pj82K35L7o4L3k13K88j22J17n5j49p8m7J14K32
$$ -31 -13 135 -62 76 44 16 -48 72 -16 -23 -205 30 67 3 36 -177 111 -11 106 51 -98 -176 -223 -109 123
5361A23n5j12q7K9J37J06J81l91K57q1o4j93K26J3k26J66K38k46r0J62j04m6J35
$$ 123 68 -44 -131 -102 35 141 322 -69 188 107 43 -150 76 89 -137 29 267 21 -69 93 -11 -57 78
5384G8Pj61Lk8o5j9mnK41l17J71K30r2q7J00R0j45j24P2K2n4m6K07J15j92o6M5
$$ 78 85 -76 -73 -101 -166 -185 -189 -194 47 -270 -99 131 39 -48 52 142 -3 -127 -55 -33 -87 -133 74 189 -3 -69 -24
5411b4kJ1j7q5J39p4nJ48j67Q6n6L7J13k7p0j47O1pK1j64L70j84L19k81K50j76
$$ -24 -26 -15 -32 -117 22 -52 -57 91 -76 10 -46 -9 104 77 7 -140 -79 -86 -65 -229 141 -43 276 -5 245 69
5437F9L5M3k18K07l34K53R3O1j21l0p5j5Q6k9J03j35K20n6pP6j54Qo7j37J39l0
$$ 69 104 147 -71 136 -198 55 148 209 88 58 -17 -32 54 25 128 -7 213 157 150 226 72 80 13 -124 15 -15
5463a5Q6K64l79kK97k71k4k4j5J19j13J65j91J19Q5l76L48j0m6lj42Q5J03R7j71
$$ -15 71 335 -44 -46 251 -20 -44 -68 -83 36 -77 88 -103 16 101 -275 73 63 17 14 -128 -43 60 157 -14
5488a4J55j05j69M4J96L5l95K33J57K0k22J68J43k58j62J58P3o7K7Mr9mJ3J49
$$ -14 141 36 -133 -89 107 142 -253 -20 137 157 -65 103 246 -12 -174 -16 57 -10 17 21 -78 -82 -69 80
5512H0J22j55p4o8J13Q5j88P8P3j7n0K14l31K60j74J1J9p8K22j96j18L42j15j85
$$ 80 202 47 -27 -95 18 103 -85 -7 66 49 -1 213 -118 142 -32 -21 -2 -80 142 -54 -172 170 55 -130
5536a30N0J04O9J9k63L7P5m0K72j89J20j81R7j86K30J19O3j95l13L37j61k2K42
$$ -130 -80 24 93 112 -151 -114 -39 -79 193 4 124 -57 40 -146 84 203 266 71 -242 95 -66 -88 154
5559A54r9q0K9j03k4K39Q3k88J6Oq5K58j50M1J12l89L14K00q9j44l74M11n2j6
$$ 154 55 -25 4 -99 -123 116 199 -89 -73 -67 -152 106 -44 -3 109 -280 34 234 145 1 -373 38 -14 -30
5583c0R0k47q7L42j27j12K33j61L09k25kJ75j55k9P3k26J8K92m1j32M3J32j73
$$ -30 60 -187 -274 68 -59 -171 62 -99 210 -15 -17 158 3 -26 47 -179 -161 131 90 -42 1 133 -40
5606d0P6m4O5KO7j5j51R0Q2OJ01k63K46j24o1q1l6L61k25J46r9r5Nj50Mj01O1
$$ -40 36 -8 57 59 126 111 -40 50 132 138 239 -24 222 98 37 -44 -80 281 56 202 103 8 13 -137 -133 -234 -173
5633a73K55L3j44k14J47J97J01l93J37J10l49J64J15o6J84o8Mk4m9J65j62L00
$$ -173 82 115 -29 -243 -96 101 202 -191 -54 56 -293 -129 -14 -80 104 36 40 16 -33 132 -30 270
5655B70k88j68J50j31K99j21K05l68K24j56j13j5J83J51O3l68K79k94k4R2P3o9
$$ 270 -18 -186 -36 -167 132 11 216 -152 72 -84 -197 -212 -29 122 185 -183 96 -198 -222 -130 -57 -126
5677a26J73q7O9j57J55J18m0J23N6kk50M2m11N61k46k4K54j34j09K03k82J50J03
$$ -126 47 -40 29 -128 27 145 105 228 284 282 32 74 -337 224 -22 -46 208 74 -35 168 -114 36 139
5700A39k41J74m0j25J97l42L63m5J41j90k72J63J83J02k22J27k48L52k49P0J11
$$ 139 -102 72 32 -93 104 -238 125 80 221 31 -241 -78 105 207 -15 112 -136 216 -33 37 148
5721A48o8k90J62j21J84m4J18J11k77P8J37p8j01J23p8k00Q5K74n8R2k02L6k39
$$ 148 80 -210 -48 -169 15 -29 89 200 -77 1 138 60 -41 82 4 -196 -111 163 105 197 -5 31 -208
5744b08L80j02n6K77m58J51j62K91m34L04QJ30k5l36J99J47j28j22K30P5o7j49
$$ -208 172 70 14 291 -167 -16 -178 113 -321 -17 -9 121 96 -240 -41 106 -22 -144 86 161 94 -55
5766e5j42mK18R0j98M2j40L50p5r7J57k51L28r8j25j47J00Jj75K18j17J75O7j93
$$ -55 -197 -201 17 107 -91 -49 -189 161 86 -11 146 -105 223 125 0 -147 -47 -46 -221 -3 -120 55 122 -71
5790g1Ql0L60k92o6j1n3p2J98j51J59K02j19j05K37j7j68O3j30j48P3P4k19K68
$$ -71 -63 -93 267 -25 -91 -102 -155 -227 -29 -180 -21 181 62 -43 194 177 9 72 -58 -206 -133 -59 -278 -10
5814a0rl9m9N0M22m56j17L90j03m5n26P02k49J26m7J47j89n0L5j16M3J85n3l30
$$ -10 -19 -58 -107 -57 365 -91 -208 182 79 34 -492 210 -39 87 40 187 -2 -52 -17 -133 -90 95 42 -288
5838b88L84J95R0l59l9J48K8j12K4J27q0m56M14m6R8p4o8K79k23k55L45k41K70
$$ -288 96 291 381 22 -17 131 159 47 71 198 118 -338 76 30 128 54 -14 265 42 -213 132 -109 161
5861A61l71K13J40j79J1J75l20kJ86p1R0j50O8Q5m8L8q3n4K4R5r2J4ML54p7Kl04
$$ 161 -210 3 143 -36 -25 150 -170 -172 14 -57 33 -117 -49 36 -12 26 -57 -111 -87 8 -84 -70 -66 288 211 213 -91
5888i1M64k74j95L99k19L0r8j75PL56j2j51J13k09o6K56o4O2j29N3J73m22Q0N1
$$ -91 373 99 -96 303 84 114 16 -159 -152 204 192 41 154 -55 -121 135 71 133 4 57 230 -192 -112 -61
5912f1l9j00K36K1o5N7Lk23K71j94L0J8m8J32r4J15o3l7K08m07J80J50k92K43
$$ -61 -100 -200 36 57 -8 49 52 -171 100 -94 -64 -46 -94 38 -56 59 -4 -41 167 -240 -60 90 -202 41
5936D1K01p3l05L25j58l82L36q0J10m1J72J15j82j60p5J24k18K88j65k27M33J65
$$ 41 242 169 -136 189 31 -351 -15 -95 15 -26 146 261 79 -81 -156 -32 -250 38 -127 -354 79 244
5958B44k48K12j69Qj6M2k23J4N03k56J26j21r7k01J44j9L5o3K35p5J1j86O2K96
$$ 244 -4 208 39 47 31 73 -150 -136 367 111 237 116 19 -182 -38 -57 -22 -85 150 75 86 -100 -38 258
5982B58l32K72l70J96o9l9J01l06N02k35k0L3J40j89J81k86RJ76j32J46m8J9j77
$$ 258 -74 198 -172 24 -45 -84 17 -289 213 -22 -42 -9 131 -58 123 -163 -154 22 -110 36 -12 7 -170
6005a70K12j76rL1J96k56K68j36j02J11p5J34o5N7nj53J52Q2m4j22K9P8q7K23
$$ -170 42 -134 -143 -112 84 -172 96 -40 -142 -31 -106 28 -37 20 15 -138 14 96 52 -70 -41 37 -50 173
6029A73n00J85L0j9J52k47K37J96m60L26p0J59p3j31L44m30O7K77l6p6L6p9m6
$$ 173 -327 -142 -112 -131 21 -226 11 207 -253 73 3 162 89 -42 302 -128 -61 216 180 104 140 61 15
6052A5K0j3J05q9rP8j09j07K35k16J11n3J47l26J71p5L6K94q8o2J05k26j49K44
$$ 15 35 22 127 38 29 107 -2 -109 126 -90 21 -32 115 -211 -40 -115 -79 215 127 65 170 -56 -205 39
6076C9j52J6Rj24L37l27K15L2k21J31l7%k4J20R1j14J40k05Q8Jk4K5j11J23M3
$$ 39 -113 -97 -88 -212 125 -202 13 45 -176 -45 -82 -82 -106 14 105 -9 131 -74 14 15 -9 16 -95 28 71
6101G1J63k52J62j14J10j96J23j63M2K24k73J93j15L9%j99M9J96rk51M36j07K
$$ 71 234 -18 144 30 140 -56 67 -96 -54 170 -103 90 -25 14 14 -185 -136 60 51 -200 236 129 131
6124A31L4m05L65K0j79J82j31N8L2j41q3L4o6K99k09PJ56J4q7m1J66m48J28N2
$$ 131 165 -240 125 145 -34 148 17 75 107 -34 -117 -83 -149 150 -59 -52 104 118 31 -10 156 -292 -164 -112
6148a12J62M7j90J87k85M34l03J40O7k21J54l27J63n0J53N2p6jq2K41j31M2n7
$$ -112 50 97 -93 94 -191 243 -60 80 147 -74 80 -247 -84 -134 19 71 -5 -6 -88 153 22 64 7
6171Gj4K8M9k30J29M1l2j1J28J86k44J12p1l20J75N9J77k48RJ26J41m71R5j0J33
$$ 7 -7 21 70 -160 -31 10 -22 -33 95 281 37 149 78 -242 -67 -8 169 -79 -70 56 197 -274 -179 -189 -56
6196e6K39k72J98q2j44K84Pj14j41J36J59j64Q8m3O1l34J34L5o9j13K59o9J06
$$ -56 183 -89 109 27 -117 167 174 60 -81 55 214 50 138 95 156 -178 -44 -9 -78 -191 68 -1 105
6219A05O1n0k00J00K7l73K45L0J0K2j24L54l93J00n4K09L1m4ok86lJ68J96k42
$$ 105 166 116 -84 16 43 -330 -85 -55 -45 -23 -147 207 -186 -86 -140 69 100 56 50 -236 -239 -71 125 -117
6243a17J13q1k21L55j4Q0j79J89k97K30k7N6J22k58J07Q8j34j37K76j33l4J85
$$ -117 -4 -85 -306 49 35 115 -64 125 -172 58 31 87 209 -49 58 146 12 -125 151 18 -16 169
6265A69j95N3k30M04j89pK60m30K22j22O9J37K6k26J1j5Q0K13k67j28O2J62rK4
$$ 169 -26 27 -203 201 12 5 265 -165 57 -65 4 141 167 -59 -48 -63 17 230 -37 -165 -103 59 50 74
6289G4j14r0K72p3o4P3N8O5o7j59j70L80Rq0l9j73J35k02J96kJ06k87J10L18k81
$$ 74 -40 -130 142 69 5 78 136 201 134 -25 -195 185 194 114 75 -98 37 -165 31 29 135 -152 -42 276 -5
6314eP0j75J68j25J75q2r0J62j19j47J13k63J72L46j82J16k93K54j9OO9k88O7
$$ -5 65 -110 58 -67 108 26 -64 98 -21 -168 -55 -318 -146 200 18 134 -159 95 76 82 151 -137 -70
6337g0J08n5Q5O4j02l03J00J98j24O2K0j30J53k97M19Rj88k6k8M2L9J20m3K9j55
$$ -70 38 -17 68 132 30 -273 -173 25 -99 -37 -17 -147 6 -291 128 137 -51 -77 -105 -63 -24 96 53 82 -73
6362g3j50J66J01j43J01q5J37j0j4P5q3O3R7m13K26K24j62l3k14N19l16J89k07
$$ -73 -223 -57 44 -99 2 -83 54 44 30 105 22 85 182 -231 -5 219 57 24 -190 329 13 202 -5
6385eq7J04j77L38l57J62o4J08L2j66L42l50K97l00P2l0j80K89q5J55j22j3Lp0
$$ -5 -92 12 -165 173 -184 -22 -86 22 54 -112 230 -120 177 -123 -51 -81 -261 28 -57 98 -24 -37 -34 -104
6409a04J25k73J04K12J1j81K7L51l07RJ60j70q0L5O8k05J58R2L2k4j29J66j18
$$ -104 21 -252 -148 64 75 -106 -79 272 -35 -26 134 -36 -116 -81 -13 -218 -60 32 64 40 -89 77 -41
6432d1N6j41K63O2j48N4j47J29k01K25j64j43J79m9J86l0j47J09l73L23K22j57
$$ -41 15 -126 137 199 51 105 -42 87 -114 111 -53 -196 -17 -66 120 90 -57 52 -321 2 224 67
6454F7j13q8J85j10J61p8l4L9J3P4j98M9k04K81Rq1N7K64k86j5j42J94k9j75r1
$$ 67 -46 -134 51 -59 102 24 -10 29 42 116 -82 -33 -237 44 53 -28 29 293 7 -8 -150 44 15 -160 -251
6479b51K24O7j42N0J82K21l59P9n3J24l14J73Q8JN7j96p2J69j71K09o1j2l47M64
$$ -251 -27 40 -102 -52 130 351 -8 71 18 142 -172 1 89 90 147 -49 -121 48 -123 86 25 13 -334 130
6503A30J8k80P3pk9J42j81l3J90J16O3l75j6L60j31P4l15K48p5J57k63M1K80k12
$$ 130 148 -132 -59 -66 -95 47 -134 -167 23 139 202 -173 -189 171 40 114 -201 47 -28 129 -134 -93 187 -25
6527b5K6P0o3k21L06k13R6r5M04n8L1k46K15k46p9k2Q8R8k4J24k66K13L3k06j44
$$ -25 1 71 8 -213 93 -120 -24 -119 285 227 258 12 227 -19 -98 -120 -32 66 42 166 -100 113 146 -60 -204
6552b04J59O0rr9k9O3K3J06l5o1kK81l65J22j91J98l46K88L23m66M9K36l2L1j29
$$ -204 -45 15 6 -93 -122 -59 -36 70 35 -26 -28 253 -112 10 -181 17 -329 -41 282 -184 -135 101 69 100 -29
6577b9j38K95j2j91K23j13l2oJ96j91J26k33N9O7J87j89lPR5R1j03j07j10J64
$$ -29 -167 128 116 -75 148 35 3 -3 193 2 128 -105 -46 21 208 19 16 23 118 209 106 -1 -111 53
6601E3J74l1k44j0P1m6M5j32M31l60q7J16O3J38k14k8K54Q2k15j65j1K33q0k2
$$ 53 227 196 -48 -58 13 -33 12 -120 311 -49 -136 -20 43 181 -33 -61 193 275 60 -105 -116 117 37 15
6625A5q8J2j2j66O2K81K6j42J25k87K06j82J04kR9J40m71O6J80P2J55j84j43L37
$$ 15 -73 -61 -73 -239 -177 104 130 -12 113 -174 32 -150 -46 -48 51 191 -280 -214 -34 38 193 9 -134 203
6649B03l9j36k85J56J58j71N0J52k23J12j68nJ57j16J37r9k3J20JJ42Pk1j00j1
$$ 203 164 28 -257 -101 57 -114 -64 88 -135 -23 -191 -196 -39 -155 -18 -117 -140 -20 -19 123 130 109 9 -2
6673bM7j25O3j65J63j34K46k57J54j74J07j01J23oj7n2K74k34P1L2k33J71P5L3
$$ -2 45 -80 -17 -182 -19 -153 93 -164 -10 -184 -77 -178 -55 -61 -78 -130 144 -90 -19 13 -220 -49 26 59
6697E9j22j03K35j84r2J51N1R6J6k13L55k76r0R0R9j01r6J13J11j93J71M2j84
$$ 59 -63 -166 69 -115 -207 -56 -5 91 107 -106 249 -27 -117 -27 72 -29 -125 -12 99 -94 77 119 -65
6720f5P0J9J71j16P7k88N4L44k27nK9r1q8K59j03j74J86q9M6pN9j45K95j82K08
$$ -65 5 24 195 79 156 -132 -78 266 39 34 63 -28 -116 143 40 -134 52 -37 9 2 61 -84 211 29 237
6745B37k97J46J12k60K40k27r0L94l49N1mJ45k28J54o3l15L68j65J16J29J58j75
$$ 237 -60 86 198 -62 178 -49 -139 255 -94 -43 -47 98 -130 24 -39 -354 14 -151 -35 94 252 77
6767G7k12J53N4k9R5j90j93K97j06J60j03m6R4r2J03n0Mq4K31k44n9J85j39J41
$$ 77 -135 18 72 43 138 -52 -245 52 -54 106 3 -43 51 -41 62 12 16 -68 163 -81 -140 45 -94 47
6791D7l3KR0O3m04K91L2j51r1m6j8L61J08m37K84pj76K13j23J78j17k68J79m7
$$ 47 14 16 106 169 -235 56 88 -63 -154 -200 -218 143 251 -186 98 91 -85 128 5 183 66 -202 -23 -70
6815g0M07k30P3j5j87k00Q8L8K97k72M53l89J33j42j33K07K01l47K00k53n8Q3
$$ -70 337 107 180 165 -22 -222 -134 -96 201 -71 382 -7 126 -16 -149 58 259 -88 112 -141 -199 -116
6837a16J14j91J00M6Rq6J08J40l01K07m4j67P0P1o2k5J5J51m0K28j16o8j88nJ38
$$ -116 -2 -193 -93 -47 -38 -124 -16 124 -177 30 -14 -181 -111 -40 -102 -127 -112 39 -1 227 111 43 -145 -150 -12
6862a2k19K07J85j48M1O1k88K61J5J93m68J39j13p2K63k71L32r4p0m3J14k60J02
$$ -12 -231 -24 161 13 54 115 -173 88 103 296 -172 -33 -146 -218 45 -226 106 12 -58 -101 13 -247 -145
6885a45J65j84L77m31L4K00J46k79R1M5q5L0N4p5oJ24J8K19m79L8J38J97k14r1
$$ -145 20 -164 213 -218 -184 16 162 -117 -26 19 -66 -36 18 -57 -63 61 79 298 -181 -143 -5 192 -22 -113
6909a13Q2p0M87l60p6l8P7m3J03J09l06K32j57j0J23j1J63p5k28K30k25K71m10
$$ -113 -31 -101 386 26 -50 -88 -11 -54 49 158 -148 84 -73 -83 40 29 192 117 -111 119 -106 165 -245
6932b45K07k1J42k22O6l73M34J77l41K44l9j5K81l93L1p2Q8L15m46K84j70o6R3
$$ -245 -38 -59 83 -139 -73 -446 -12 165 -176 68 29 14 295 -98 -67 -139 -51 264 -182 102 -68 -134 -41
6955d1J56m8K13m33N0J40k6J94k25L5N4o0o4j04K04n2J36j99K28k97pq1K97N3
$$ -41 115 67 280 -153 -103 37 11 205 -20 15 69 9 -55 -159 45 -7 129 -70 158 -139 -146 -227 70 123
6979A23K9L2j88n0N9nJ77o0l65R0M3PJ56r8L3k31J77k12J89K18q3L1j60m0K77
$$ 123 152 184 -4 -54 5 0 177 117 -248 -158 -115 -108 48 -50 -17 -248 -71 -283 -94 124 41 72 -88 -128 149
7004A49o8j82J58o0R2k53J86R4j98J5R6j36O6J72J29k09m9k29N6K06oq3jN0J45
$$ 149 81 -101 57 -3 89 -164 22 116 -82 -67 29 -107 -41 131 260 51 2 -227 -171 35 29 -54 -55 -5 140
7029A40n4k35J45K25k90J8k43M06O4k34j03M24m18N3J19k68L33m7M9l3R3q6k40
$$ 140 86 -149 -4 221 -69 -51 -294 112 176 -58 -161 263 -155 -102 17 -251 82 35 84 51 144 58 -182
7052a82Q3P5J13O4n0m2j24K48m11J67o8K11p7k06J80L7J4O9j09j23m5J67q6j30
$$ -182 -99 -24 89 153 103 61 -63 185 -226 -59 -127 84 7 -199 -19 18 32 101 -8 -131 -176 -9 -95 -225
7076b25P3J64Q2J0o1J66j08j73j0L06l58J02q0K17L3K36l75Kl2J54m45L73m0j78
$$ -225 -152 12 94 104 43 209 101 -72 -82 224 -134 -32 -112 105 138 374 -1 1 -31 123 -322 51 11 -167
7100a67K67j4J57k92p5K37J34l20M4J06K37k66k11L54j36j06K14j00J36k08o4
$$ -167 100 86 243 -49 -124 113 247 -73 -29 77 314 48 -163 191 55 -51 163 63 199 -9 -73
7121g3K30K3n0j58k7K27j86K32k96K1j20J68j17M9J05R6l23L71l81O8K19p7j9
$$ -73 157 180 130 -28 -55 172 -14 218 -78 -57 -177 -9 -126 -77 28 124 -199 172 -209 -141 78 1 -18
7144a8J55mk12J5k90L40J31J55k43j86k8K69p0j37m5K67k21J58j35m8K12k79J87
$$ -18 137 133 -79 -64 -354 -14 117 272 29 -157 -185 84 14 -123 -168 99 -122 36 -99 -147 65 -214 -27
7167b7n6O9J4M4P9l0k50J37M7j76K08L4j07J09L9j5j83J08j3J18j33k71J77K02
$$ -27 -83 -14 0 44 123 93 -157 -20 27 -149 59 93 -14 95 134 119 -64 44 31 149 16 -255 -78 124
7191A24J9J8L8k14m5L16k43j17j08K51q9J17o4K9K0k95K58P6j31K50k93O5O8J12
$$ 124 143 161 199 -15 -60 256 13 -104 -212 39 -50 67 3 32 52 -243 15 91 -40 210 -83 -18 50 162
7215A62k39J74k61M0L03k40K92l35J04j36L26j08j3k47K77j15m9LK32j46K43l64
$$ 162 -77 97 -164 -124 179 -61 231 -104 0 -136 190 82 69 -178 99 -16 -65 -62 170 24 267 -97
7237i7K45j07L38n14N1P2K16j4l45M64n28J89j4r8J30J85k55PK03j71J1J46q3
$$ -97 148 41 379 -135 -84 -12 204 190 -155 309 -219 -30 -44 -142 -12 173 -82 -75 128 -43 -32 114 31
7260C1O5j28J10j37K38l16L48j88M3K30m13k3J37o0p6N2p2n9J44K33k0k49J36
$$ 31 96 -32 78 -59 179 -137 211 23 66 296 -117 -140 -3 -63 -139 -87 -159 -218 -74 159 139 -110 26
7283B6PJ49qj25p4j52K83l19M96k72L01n48L00O7q5k93J52R8RJ15k70K08RJ23
$$ 26 33 182 174 49 -25 -177 106 -213 283 11 312 -236 64 131 46 -247 -95 3 12 127 -143 65 74 197
7307A97k84K15o6j23L3R2m4j24n6J70m2qJ86q4j03J79J53l66RJ23n2j45L26p2
$$ 197 -87 128 62 -61 -28 64 20 -104 -160 10 -32 -40 146 62 -41 138 291 -75 -66 57 5 -140 186 114
7331A14q1N7l64L97l4k1P5j56o0N4n1K82l88K27l1OK90k40j56p3L02l09N0J83
$$ 114 33 90 -274 123 89 68 143 -13 -73 -19 -70 212 -176 51 20 26 316 76 -80 -153 149 -160 -110 73
7355G3Ml5Q8j41J05J44l45J32J67j76Jk32M13r7q7L5k24J89j71J97J41k50m2K05
$$ 73 77 42 130 -11 94 238 -107 25 192 16 17 -215 198 101 14 49 -175 14 -157 40 181 -69 -111 94
7379I4l17K80j18P3k11M46j88j18P3J11r4J13j23j84J38J25j15J03j45p9L05j15
$$ 94 -223 57 -61 12 -199 247 59 -59 14 125 31 144 21 -163 -25 100 -15 88 -57 -136 169 54
7401E4k84M11k29J30%k66L27l2j07Jr8j2K18m51J29J70J01O0J5J46n13L25j11
$$ 54 -230 181 -48 82 82 -184 143 111 4 5 -93 -105 113 -338 -209 -39 62 122 137 283 -230 95 -16
7424a6K21k24N8L02n18K28j92K74Q6l45J94j40J85l35M20k27J77k72J67k40K65
$$ -16 205 -19 39 341 -177 51 -141 133 219 -126 68 -72 113 -222 198 -29 148 -124 43 -197 68
7445F8j50K30j49l8j97M47l1l04J75q0J40k39J09p2n5J14J94j21J15k71n7J73
$$ 68 -82 148 -1 -39 -236 211 180 -124 51 -29 111 -128 -19 -91 -146 -32 162 41 156 -115 -172 1
7467AN2lQ8j98J84r0N3J1k44L06j62j12K49k27N2K48l29M8J42j60J59k33K76l00
$$ 1 53 50 138 -60 124 34 87 98 -146 160 -2 -114 135 -92 -40 208 -121 -73 69 -91 68 -165 111 -189
7491a89K10k17L02k0l01K24k15M25j09j03N7jj97J80q9P6m1j23o0J86j26K08j80
$$ -189 21 -196 106 86 -215 9 -206 219 110 7 64 63 -134 46 -43 33 -8 -131 -191 -5 -131 77 -103
7514a03j55J00L8M1L37l99K21j49K9j25J6l7J04M05l87Ro5J40j67L34l32M6L89
$$ -103 -258 -158 -120 -79 258 -141 80 -69 -40 -165 -149 -186 -82 323 -64 -55 -120 20 -147 187 -145 -99 290
7537B90m96L62k8q9q8J48j93j19O1K16j29J63j60J24j61MJ32j13j38J34K2M2J18
$$ 290 -206 156 128 39 -49 99 -94 -213 -152 64 -65 98 -62 62 -99 -95 37 -76 -214 -80 -58 -16 102
7560A02j43pk62M25m5J17j76p2j61J02j07M61l16j32M45j69J06L9m05K01m4M8
$$ 102 -41 -48 -310 115 70 187 11 -61 -222 -120 -227 234 -82 -214 231 62 168 207 -198 3 -41 7
7582GN5k23J60N4j18J70%kj60j3J18Nj76J81k06L91l82J36R8nj69K66k28jK7p
$$ 7 62 -161 -1 53 -65 105 105 103 -57 -70 48 53 -123 58 -148 243 -139 -3 95 90 -79 187 -41 -42 -15 -22
7608b2J10j15J38j15J15j81J43j77Q6J44n21L14Q6o8J21K55k56k76L76l35J40
$$ -22 88 -27 111 -4 111 -70 73 -104 -18 126 -395 -81 5 -63 58 313 57 -219 157 -178 -38
7629c8K30j44j30L02l0l22J33J61p7J26M1j27p8k58o3L50j51L00k83K3Q2j85L64
$$ -38 192 48 -82 220 190 -132 1 162 85 211 252 125 47 -211 -274 76 -75 225 -58 -35 47 -138 226
7652B26l02J85k34J68j67K26k06K25j77K08j25j10K0L4K59k06m2J54k84j61L71
$$ 226 -76 109 -125 43 -124 102 -104 121 -56 152 27 -83 -63 -29 230 24 -18 136 -148 -309 62
7673F2J3l33K90L1q0j59L18k68R3j74K75q7jM4p3P4j76J05Q1k11J57k13K37Q7
$$ 62 75 -258 32 63 -17 -176 142 -126 -33 -207 68 -19 -20 24 -49 25 -151 -46 35 -176 -19 -232 5 92
7697I2n4O0r2N4k5J44k46oJ11q9j23K84j91L51l27j13K38n7L3l59M52kL0J40l68
$$ 92 38 98 6 60 35 179 -67 -73 38 -51 -174 110 -81 270 -57 -170 68 11 44 -315 137 135 165 305 -63
7722f3L06l72J63l85M12o6J02l44R0n3K38N5k62K66j54j2K75j38j56K23j47J1
$$ -63 243 -129 34 -351 61 -5 97 -247 -157 -210 28 83 -179 87 -67 -79 196 58 -98 125 -22 -11
7744a1Q0J25p8j62K3L4p2kj77M31l9j24k10K29j51Q9q1Q8j35J04K1K2J8Rj07K20
$$ -11 69 194 116 -46 -23 11 -61 -63 -240 191 152 28 -182 47 -104 -15 -96 -8 -143 -39 -18 4 22 31 -76 144
7770A44j20j27M3L4J29j05J51j64j49J50J96r2k35K26j06J20l68K59K44n59K83
$$ 144 24 -103 -60 -26 103 -2 149 -15 -164 -14 182 90 -145 81 -25 95 -273 -14 230 -329 -46
7791d6J83L4n05J21N6K77k79Q8J30O5k43J73o1j53K14nj7J68l08K57j16O6j15
$$ -46 137 171 -334 -213 -157 120 -159 -71 59 124 -119 54 -7 -160 54 49 32 200 -108 149 33 99 -16
7814a6JK36l75K9J18k2JJ36l9j64q9J01r6R4j47K04M5J09m3j56L25m72Q3K51j13
$$ -16 -15 221 -154 -125 -7 -29 -28 108 69 -95 -184 -83 -179 -85 -232 -28 17 126 83 -73 252 -220 -137 114 1
7839Al5R1J4K38m80J31l9j6J03P4k34k4J29j25J11N6K75l44L34l4l15J71j53P1
$$ 1 -34 57 71 309 -171 -40 -79 -95 8 82 -152 -176 -47 -172 -61 -5 270 -74 260 226 -89 82 -71 0
7863@R9j25M7n5K54k40r4J01O7k5l7j13K05k59O9kR0M9k03j56L29rq8J59q4p9
$$ 0 99 -26 21 -34 220 -20 -114 -13 54 29 -8 -121 84 -175 -106 -108 -18 31 -172 -328 1 -8 -96 63 -21 -100
7889a00K49k35J6j71M00l24J35j23J37J80l0j08l29L82j8k44L01j30Q6mj08RJ24
$$ -100 149 -86 -70 -241 159 -165 -30 -153 -16 164 134 26 -303 79 61 -183 118 -12 74 70 -38 -29 95
7912I5k2l8k6J6j09Q5j08J90k21L5K7M4m6L9p9O1M1R9M0nO8m11J44On7J75Jj77
$$ 95 73 35 9 25 -84 1 -107 83 -138 -103 -76 -32 -78 -39 -118 -57 -16 83 123 118 186 -225 -81 -75 -132 43 44 -133
7940a33K16r4J2P6k2j27jl6K35q3j87J39l53K98O1j5Q0k11Q0J80J41l99K01o5
$$ -133 83 -11 1 77 55 -72 -73 -109 126 43 -144 -5 -358 -60 1 -14 66 -145 -65 115 256 -143 58 -7
7964gn2K52r7j26kn9J10or4J27K00l50O5m8K5M2RK0R7j00J38K5j07MK40m66J03
$$ -7 -59 193 96 -30 -32 -91 19 13 -81 46 246 -104 -39 -87 -62 -20 -11 9 106 6 144 169 62 66 306 -160 -57
7991e7K30j9l12q0K82o2J16k73K92j32l4O0J2J5j7M9O8j14q3m6o0K33n0q6M9K0
$$ -57 173 154 -158 -238 44 -18 98 -175 117 -15 -49 11 23 38 21 70 138 24 -59 -105 -165 68 18 -68 -19 1
8017AK18j72j48j15L03P8l47J98J3k53L13nj73O0J37l3k26J39j64k2k0K83r5J70
$$ 1 219 47 -101 -216 87 165 -182 16 29 -224 89 84 -89 -29 108 75 -151 -12 -176 -198 -218 65 -30 140
8041A40k15l5%lJ56m5j93K8J68Q0k06J05r9k4K11r1j41O9o1J96l05K38m9K06J8
$$ 140 -75 -110 -110 -113 43 -2 -195 -167 1 81 -125 -20 -119 -143 68 -23 -164 -95 -156 40 -265 -27 -76 130 148
8066A48k75L13o8Q8k56RJ16m6Q1J65k55k3J1j1O3l37L17J01j65Rj06J85q7N4k31
$$ 148 -127 186 118 206 -50 -41 75 29 110 275 20 -3 8 -3 60 -277 40 141 -24 -15 -121 64 -23 31 -200
8091b00J34L13k26p1L11j9j29k08K03k17Q9l1M1P2kj3j33K03l8j47OK30k18K49
$$ -200 -66 247 21 -50 261 242 113 -95 108 -109 -20 -51 -10 62 60 47 -86 117 79 -68 -62 168 -50 199
8115A99k12J05j65J09l11K90l3J15j55J1K37k15j99M53k68J93j59K0J0N8Lj65
$$ 199 -13 92 -73 36 -275 15 -18 97 -58 -47 190 -25 -224 229 -39 154 -5 15 25 83 86 -79
8137g9K30n3j31j27K5K60r4J65k03P5L51m75Q0j1o1P9lJ10j01K70k48j61M65n00
$$ -79 151 98 -33 -160 -135 125 31 196 -7 68 419 -56 24 13 -48 31 28 138 37 307 59 -102 363 -137
8161a37K16k0Q5k95K82m81K83J38j15K10p9M9m21L58o4j25J83m9J05j91o0J38
$$ -137 79 59 144 -151 131 -350 -67 71 -44 166 87 136 -285 73 9 -116 67 18 123 -68 -128 10
8183A0k8J04J63k79j39K39N8j72
$$ 10 -18 86 249 -30 -169 70 128 -44
8191d4
$$ Imaginary data points
##PAGE= N=2
##DATA TABLE= (X++(I..I)), XYDATA
0@%%%%%%%%%%%Qj6J6j6K4l2L8m6N6p2Q4r9J19j36J60j88K16k52K89l29L77m32
$$ 0 0 0 0 0 0 0 0 0 0 0 0 8 -8 8 -8 16 -16 22 -24 32 -40 44 -55 64 -72 88 -100 116 -136 153 -176 201 -231
33b31M92n56O28p06P93q89R93j110J236j372J521j686J865k058K271k503K760
$$ -231 261 -295 333 -373 420 -469 524 -586 650 -722 799 -887 978 -1080 1191 -1312 1448
50A448l043L352l694M071m491M964n495O099o793P600q553R695j1097J2869j5187
$$ 1448 -1595 1757 -1937 2134 -2357 2607 -2888 3211 -3582 4018 -4535 5160 -5937 6932 -8255
65h255J8365k3037L0695m6147J33180k57480k0353L51695j74142p3473J16894
$$ -8255 10110 -12927 17768 -28379 104801 -152679 -173032 178663 4521 -68952 47942
76D7942j3125o4171p006l5848K01899k3598k73926P1408K47237j32140r0328J12602
$$ 47942 34817 -29354 -36360 -72208 129691 106093 -167833 -96425 150812 18672 -71656 40946
88D0946n1747m5729O2963K9884P16o2642n7514R6127M9158r8222N9798j6982j07548
$$ 40946 -10801 -56530 6433 36317 37033 -25609 -83123 13004 62162 -36060 23738 6756 -100792
101a00792J16680Q4897j49653L219Q8864q6627L6760N1872o8382L0318L77r3338
$$ -100792 15888 100785 -48868 -45649 43215 -43412 -6652 45220 -23162 7156 7533 -85805
113h5805J17995Q4478k12388L6584J64024j30229n1470J54722m4242r7477O6044
$$ -85805 32190 116668 -95720 -59136 104888 -25341 -76811 77911 33669 -63808 2236
124B236n363J7833K8713p0520M019N4473n8342J6631R8855j03847o0062R4231
$$ 2236 -3127 14706 43419 -27101 -23082 31391 -26951 -10320 88535 -15312 -75374 18857
136A8857K0902l5580O345j4571k0510J8718P653O4435l8652j28871P4182J26780
$$ 18857 39759 4179 10524 -4047 -24557 -5839 1814 66249 27597 -101274 -27092 99688
148I9688q7509o5235Q1767l6824k7744O0926P715j9480l7498m1215Q2689Q2496
$$ 99688 12179 -53056 28711 -8113 -35857 25069 32784 13304 -24194 -65409 17280 99776
160I9776j36659l5804J18204l2023n9900P0695J1518p0813J4490J1087K5398K0430
$$ 99776 -36883 -72687 45517 13494 -46406 24289 35807 -35006 -20516 -9429 15969 36399
172C6399o2505j3978O0754j0739l6268M9464j7073l4768K3552K654P409J9164
$$ 36399 -26106 -40084 20670 9931 -26337 23127 6054 -28714 -5162 -2508 4901 24065
184B4065l1972l3357M9168N652j0318O427k7181K549K5052j0970n58L8338n5435
$$ 24065 -7907 -41264 7904 13556 3238 9665 -17516 -14967 10085 -885 -1443 36895 -18540
197a8540l0992P1222J5590l8665r569J501m435L4350q319q082R559m3719K750
$$ -18540 -49532 21690 37280 -1385 -10954 -9453 -13888 20462 12143 4061 13620 -30099 -27349
210b7349P0225o95p1767J0203K0719J854K2231j0983k6472n733J1745J5741L0532
$$ -27349 42876 42181 -29586 -19383 1336 3190 25421 14438 -12034 -17767 -6022 9719 40251
223D0251l9644m0146L7949J8813r180J336o959k8956K3655J7568o822J337k3843
$$ 40251 607 -39539 -1590 17223 8043 9379 2420 -26536 -2881 14687 7865 9202 -14641
236a4641l419K5202O523k1893J4945p428k1814K3605Q689p223k345m176j7885
$$ -14641 -18060 7142 13665 -8228 6717 -711 -22525 1080 9769 2546 201 -3975 -21860
249b1860K3291J2421j4672L050j4441o105K0377J7808j9823n040r829n275L7583
$$ -21860 1431 13852 -820 2230 -12211 -18316 2061 19869 46 -4994 -14823 -20098 17485
262A7485M149k7794j3459J2784K933J8687J545k6147k583j22J7230J8629r717
$$ 17485 21634 -6160 -19619 -6835 -3902 14785 16330 -9817 -12400 -12522 4708 23337 13620
275A3620l7311Q348K5457k753O671j0169j6440j928K2330P943j27j8891k2384
$$ 13620 -23691 -15343 10114 7361 14032 3863 -12577 -14505 7825 15768 15641 -3250 -25634
288b5634K6651J6593n305j0753m465j2435J4179K1804j1180r233j3065M808J5744
$$ -25634 1017 17610 12305 1552 -2913 -15348 -1169 20635 9455 222 -12843 -8035 7709
301G709R830j6454p954L851n287J6330L014r975q913M124o55P093R607j5503k312
$$ 7709 17539 1085 -6869 -3018 -8305 8025 11039 1064 -7849 -3725 -4380 2713 12320 -3183 -5495
316e495k786L965R001O151j2510r861M231J47J8962j83j8277j3140J2700J3951
$$ -5495 -8281 -4316 4685 10836 -1674 -11535 -7304 -7157 11805 11622 -6655 -19795 -7095 6856
330F856L883l558k3246R67J2039J5116k41j3829j7303N428K6239j016o382j4781
$$ 6856 10739 7181 -16065 -15098 -3059 12057 11816 -2013 -19316 -13888 12351 11335 4953 -9828
344i828m110R615J7019K43j6488n801k422J8004N753o117j0183k940K441P541
$$ -9828 -13938 -4323 12696 12939 -3549 -9350 -11772 6232 11985 5868 -4315 -7255 -4814 2727
358B727J3765j2523j0462k153J0329O913M3n879r475L635P16J3212p0j1758q677
$$ 2727 16492 3969 -6493 -8646 1683 8596 8639 2760 -6715 -3080 -2364 10848 10778 -980 -9657
373i657N434J1409P34k15j3599m82L659Q185L201n798o966n776J0352L187O257
$$ -9657 -4223 7186 7920 7705 -5894 -6376 -2717 5468 8669 2871 -4095 -9871 481 3668 9925
388I925p442j3050r2J2742R148j0283k614p596J804O919R939o44j7615q000Q843
$$ 9925 2483 -10567 -10659 2083 11231 948 -1666 -9262 -7458 -539 9400 8756 -8859 -16859 -8016
403h016K3860o021j6874o707Q345P921J994M452j3631r324L291K1754L753j7933
$$ -8016 15844 9823 -7051 -13758 -5413 2508 4502 8954 -4677 -14001 -10710 11044 14797 -3136
417c136j0440N100J4693O1r87r804j809K163N557Q244n584p790n153J0466J965
$$ -3136 -13576 -8476 6217 6278 5291 -4513 -6322 -4159 1398 9642 4058 -3732 -8885 1581 3546
432C546L630j586j0915j584Q276Q300q082K393m160o095K965J2791L821j5254
$$ 3546 7176 5590 -5325 -6909 1367 9667 1585 3978 -182 -6277 -3312 9479 13300 -1954
446a954p121K293J7006L19j1021l749K457O59m62J4370n818j6981m010J9659Q218
$$ -1954 -9075 -6782 10224 10543 -478 -4227 -1770 -1111 -1573 12797 6979 -10002 -14012 5647 13865
461A3865j2797m979l439M867K762P536m066p679n202J250J5296K357r776j2661
$$ 13865 1068 -3911 -7350 -2483 279 7815 3749 -3930 -9132 -7882 7414 9771 -5 -12666
475a2666O485N648O129L100j5065p270R194J3026p527K72k372j0586M346J5289
$$ -12666 -6181 -533 5596 8696 -6369 -13639 -4445 8581 1054 1326 -1046 -11632 -7286 8003
489H003M379j8522n247N467J2952j91j0370N57L037j659n272J6312N93j7068m702
$$ 8003 12382 -6140 -11387 -5920 7032 6841 -3529 -2972 65 -1594 -6866 9446 10039 -7029 -11731
504a1731J5466P045j2582K125J308l015m053R641N924p098q233m698J4831O560
$$ -11731 3735 10780 -1802 323 1631 -1384 -5437 4204 10128 3030 -5203 -9901 4930 11490
518A1490n750j1251J707K542K960J0377p377j1577j297J2389Q86J138k111j4307
$$ 11490 5740 -5511 -3804 -1262 1698 12075 4698 -6879 -8176 4213 5099 6237 4126 -10181
532a0181K160J3282P998j3842n427O87N010N497k555q61n565j912p12J4454J753
$$ -10181 -8021 5261 13259 -583 -6010 -5323 -313 5184 2629 1768 -3797 -5709 -6421 8033 9786
547I786j5602n872R896Q264p718L020k480o028q85J0280O158j0408m984k396J0138
$$ 9786 -5816 -11688 -1792 6472 -1246 1774 -706 -6734 -7619 2661 8819 -1589 -6573 -8969 1169
562A169M398k591p118j456K897P19R047m559o838j986O655J084Q50L909j0283
$$ 1169 5567 2976 -4142 -5598 -2701 -1982 7065 2506 -4332 -6318 337 1421 2271 6180 -4103
577d103l344O464R361n438m138k76j724L366K372N993o523p466k263J2539Q165
$$ -4103 -7447 -983 8378 2940 -1198 -1474 -3198 168 2540 8533 2010 -5456 -7719 4820 12985
592A2985j1210p698J247Q309j255M314k250r956k149R112J0710p895p979m536
$$ 12985 1775 -5923 -4676 3633 2378 6692 4442 -5514 -7663 1449 12159 4264 -3715 -8251
606h251Q568O203j233m881n196K159M95P878j139n348m922J522O504K87J202p649
$$ -8251 317 6520 5287 406 -4790 -2631 -2136 5742 4603 -745 -5667 -4145 2359 2646 3848 -3801
622c801j375J766O114m72k610p45n706L457M767M891o899n874N66N645N858m816
$$ -3801 -5176 -3410 2704 2232 -378 -1123 -6829 -3372 1395 6286 -613 -6487 -5921 -276 5582 766
638G66k743l775L246J862N257q64q757j118L863Q188l408k120m506J40M351K967
$$ 766 -1977 -5752 -2506 -644 4613 3749 -5008 -6126 -2263 5925 2517 397 -4109 -3969 382 3349
654C349K603p092k637n06P578K349k229m599m147M566L682N281o335n228j694
$$ 3349 5952 -1140 -3777 -4283 3295 5644 3415 -1184 -5331 -765 2917 8198 1863 -3365 -5059
669e059O554O055l191l769o235L382N089N139m987p339L76K997P655k839l374
$$ -5059 1495 7550 4359 590 -5645 -2263 2826 7965 2978 -4361 -3985 -988 6667 3828 454
684D54m880K425L345K053L83o600k00j04N475M05j006m086k279L817J174L311
$$ 454 -4426 -2001 1344 3397 3780 -2820 -3020 -3124 2351 2756 1750 -2336 -4615 -798 376 3687
700C687l711k169l419L448M698O74k433p789L225L185M922k871l899l086J319
$$ 3687 -24 -2193 -5612 -2164 2534 3208 775 -7014 -3789 -604 4318 1447 -2452 -5538 -4219
715d219P052N26j452p622Q51M119N354j441n900k56j004O186J130k35n582j714
$$ -4219 2833 3359 1907 -5715 -4864 -745 4609 3168 -2732 -2988 -3992 2194 3324 3089 -2493 -4207
731d207L187K931L701n192k094k078M356L153Q65l259n864K888K500N410k998
$$ -4207 -1020 1911 5612 420 -1674 -3752 604 3757 4622 1363 -4501 -1613 887 6297 3299
746C299m263l256L031N804l63j235p003J529K811M416j211m232j530r43O414l90
$$ 3299 -964 -4220 -1189 4615 4252 3017 -3986 -2457 354 4770 3559 -673 -2203 -3146 3268 2878
762B878p45m149p88J698K232K460l416j036l400L327K322J376k513m014Q31P20
$$ 2878 2133 -2016 -2804 -1106 1126 3586 170 -866 -4266 -939 1383 2759 246 -3768 -2937 -2217
778b217O188k015k488m873J432N095J962j135o651M04J398N872N07m314m037q0
$$ -2217 3971 1956 -532 -5405 -3973 1122 3084 1949 -4702 -4298 -2900 2972 3479 -835 -4872 -4952
794d952O655J252j76o277m16K446L206J745l174j543l293M986J979R46l264k751
$$ -4952 1703 2955 2779 -3498 -3914 -1468 1738 3483 309 -1234 -4527 459 2438 3384 120 -2631
810b631J046J689M348k578o75m317J775L441K018o71n510o0O60O043n99l222l295
$$ -2631 -1585 104 4452 1874 1199 -3118 -1343 2098 4116 3445 -2065 -2125 -1465 4578 3979 757 -2538
827b538K71M247P39J210n040j275L23M208K040l447k395j954M642M47J093k447
$$ -2538 -2267 1980 2719 3929 -1111 -2386 -2063 2145 4185 738 -1657 -3611 1031 1478 2571 124
843A24j812p91P45M540r07j711m751K272K329K228n86m309p55k51N424O50j498
$$ 124 -1688 -2479 -1734 2806 1899 188 -4563 -2291 38 2266 1680 -2629 -3384 -3635 1789 2439 941
860I41m820q48M178K944J171o034j367M1N819J278l394k566j087M173L67K473
$$ 941 -3879 -4727 -549 2395 3566 -2468 -3835 -3794 2025 3303 -91 -2657 -3744 429 796 3269
876C269l526k388j04K924L425k848r19k591K913L35J677K3k009j712r75N789k48
$$ 3269 -257 -2645 -2749 175 3600 752 -167 -2758 155 490 2167 2190 181 -1531 -2506 3283 3035
893C035q21m042j82K523K170J599m342q87j484M129K053o65l713k881L879J386
$$ 3035 2214 -1828 -2010 513 2683 4282 -60 -947 -2431 1698 3751 3086 -627 -3508 371 1757
909A757K413m162j567r72L059K614j968r84k606J417j27L948r11l568j238Q32
$$ 1757 4170 8 -1559 -2531 528 3142 1174 190 -2416 -999 -1126 2822 1911 -1657 -2895 -2063
925b063M167j047j07l932O26J004K204J776k846k653k173O407J260j678l730q39
$$ -2063 2104 1057 950 -2982 -2356 -1352 852 2628 -218 -2871 -5044 1363 2623 945 -2785 -3624
941c624K378J602K583l691j050j414L155K102m84k063l273L415O03K232j515j476
$$ -3624 -1246 356 2939 -752 -1802 -3216 -61 2041 1557 -506 -3779 -364 239 2471 956 -520
957e20j357R26K855o08P47k973k71k80L461J732l421j659q55L827K78J435l244
$$ -520 -1877 -951 1904 1296 2043 -930 -1201 -1481 1980 3712 291 -1368 -2223 1604 1882 3317 73
974G3j867Q07J967L343k493k508l036M755K359j173k170k013J457K41L730k316
$$ 73 -1794 -987 980 4323 1830 -678 -3714 1041 3400 2227 57 -1956 -499 -258 3472 1156
990A156j753j625P91L090Q9n41l770J199R4K507J65j562j554j188L119L29J496
$$ 1156 -597 -2222 -1431 1659 1748 1207 -2563 -1364 -1270 1237 1402 -160 -1714 -2902 217 546 2042
1007B042l491j252K83K304K973l018j518j782L102J041J075k061k845J250J007
$$ 2042 -1449 -2701 -2418 -114 2859 -159 -1677 -3459 -357 684 1759 -302 -3147 -1897 -890
1022h90L503j982j345k491K396K333o01K0j988L99r32L533m89o43j785r28K496
$$ -890 2613 631 -714 -3205 -809 1524 923 943 -1045 -646 -1578 1955 1466 823 -962 -1890 606
1039F06P72J743l536k72o23K066K337j098j968l103L325J407K057k874k720M38
$$ 606 1378 3121 -415 -687 -1310 756 3093 1995 27 -3076 249 1656 3713 839 -1881 -1443
1055a443J688L624k380j087k949K070J556R61o64l332P93M46L211j567n03k281
$$ -1443 245 3869 1489 402 -2547 -477 1079 2040 1376 -1956 -1163 -717 2494 927 424 -1857
1071a857L60K013l55J354k214n81j151K535J369q92j222k398J841J080K203k383
$$ -1857 -1497 516 161 1515 -699 -1280 -2431 104 1473 581 -641 -3039 -1198 -118 2085 -298
1087b98j532o57J137L431j425j110k660J651J565J544j013k660N01L15K850o67
$$ -298 -1830 -2487 -1350 2081 656 -454 -3114 -1463 102 1646 633 -2027 -1526 -1211 1639 972
1103I72m06k547O08J423Q97J318k874l55n44K274P34K17j683j957J688O70K256
$$ 972 566 -1981 -1373 50 947 2265 -609 -964 -1508 766 1500 1717 34 -1923 -235 435 2691
1120B691j666j353j669K155K689j016o52l221J413J471K271j522k281p47O53L564
$$ 2691 1025 -328 -1997 158 2847 1831 1179 -2042 -629 842 3113 1591 -690 -1437 -784 2780
1136B780j320p31k208N91J245J025L92k802L54q90K158j8M54j617j247J195N0
$$ 2780 1460 729 -1479 -888 357 1382 1774 -1028 -674 -1564 594 576 1030 -587 -1834 -639 -589
1153e89K591k294l77j539J124J835K40n09l033J001L34K886r94j552j555N29L183
$$ -589 2002 -292 -669 -2208 -1084 751 991 482 -2551 -1550 -1216 1670 676 -876 -2431 -1902 1281
1170A281n46J64l213O90J003J960j50k226k8r67L289k46Oj496o15M95R86J696
$$ 1281 735 899 -2314 -1624 -621 1339 1189 -1037 -1065 -2032 1257 1011 1017 -479 -1094 -599 387 2083
1188B083j901P2j844J376J301P74q39k267Q04K61K953r98j373j705M36K501J93
$$ 2083 182 254 -1590 -214 1087 1861 1022 -1245 -441 -180 2773 1775 402 -1303 -867 1634 1827
1205A827J41l289O24N47K266k77j803p47n33K616m15P76k410j50L97Q28J200j699
$$ 1827 1968 -1321 -697 -150 2116 1839 36 -711 -1244 1372 957 1733 -677 -827 -430 398 1598 -101
1223a01q0j568J488J86J060o38j775M75j03K344j065j79k152P1J992R70L5l015
$$ -101 -181 -1749 -261 -75 985 347 -1428 -953 -1056 1288 223 44 -2108 -2037 -45 925 960 -2055
1241b055N39j16K602J00j436j206l76K418M9Q44k673j03L37J616R21j704R3j492
$$ -2055 -1516 -1632 970 1070 -366 -1572 -1948 470 519 1363 -1310 -1413 -1076 540 1461 -243 -150 -1642
1259a642J841L88O86p05j487N23J4K178j030K57k434Q39J457O78K47k310j6m33
$$ -1642 199 587 1273 568 -919 -396 -382 1796 766 1023 -1411 -572 885 1563 1810 -500 -516 -949
1277i49K797j10o02j898n94K227M98M26k408R0k03J625Q28j146p30j263J732J4
$$ -949 1848 1738 1136 -762 -1356 871 1369 1795 -613 -523 -726 899 1727 581 -149 -1412 320 334
1295C34J153j753k06n09M61J470q30N89k418J000J05J244M92j773o37m94K255
$$ 334 1487 -266 -472 -981 -520 950 120 709 -1709 -709 -604 640 1132 -641 -1278 -1772 483
1312D83K96j91k250m98J821P23R78k591j95m99K045Q39q10j153j274K255J84J136
$$ 483 779 588 -1662 -2160 -339 384 1362 -1229 -1424 -1923 122 961 151 -1002 -2276 -21 163 1299
1330A299j574m41n9M18J508q65J26j396P62L39J188k05j035k98o80K353l89N04
$$ 1299 -275 -716 -775 -357 1151 286 412 -984 -222 117 1305 1100 65 -233 -913 1440 1051 1555
1348A555k269l3P44R25J399k155l62j094K432L24k80j294j218J606L85J157j935
$$ 1555 -714 -747 -3 922 2321 166 -196 -1290 1142 1466 1186 -108 -1326 280 665 1822 -113
1365a13k1o75R40J106m94k01j963J118n1J359n41n78o34j85J312P4L15j934m7
$$ -113 -134 -809 131 1237 743 542 -1421 -303 -354 1005 464 -114 -748 -933 379 453 768 -1166 -1213
1384a213K15J311P21j565l25j126K030K22N35j498j271J327N23J451j728o12r13
$$ -1213 -998 313 1034 -531 -856 -1982 48 270 805 -693 -1964 -637 -114 1337 -391 -1003 -1916
1401a916K096O66n54l48j227J036r6J285j027o7n07J82J007k75P31j504K44j50
$$ -1916 180 846 292 -56 -1283 -247 -343 942 -85 -152 -659 -477 530 255 986 -518 -274 -424
1419d24J334K90o07l28j273J632K59J049j653r60L28Q49J505j834o4j500J831
$$ -424 910 1200 593 265 -1008 624 883 1932 279 -681 -353 496 2001 167 103 -1397 434
1436D34P92mo94j641J265j15J523r64n29p01L15R87n02M86j661P04n66J468J8
$$ 434 1226 1222 528 -1113 152 37 1560 596 67 -634 -319 668 166 652 -1009 -305 -871 597 615
1455F15m50n46r04J097J56R79j100r34k71J165J154r88n08j505J629M43R22j183
$$ 615 165 -381 -1285 -188 -32 947 -153 -1087 -1358 -193 961 -27 -535 -2040 -411 32 954 -229
1473b29p97j39O54J499j147n3j212Q16R88J31j63q40L7k79J446p9j61n59p55J017
$$ -229 -1026 -1165 -511 988 -159 -212 -1424 -608 380 511 348 -492 -455 -734 712 633 472 -87 -842 175
1493A75j31J474j381k53o76J362Q49n80l31j338J175N8J153r80j235J03O23J488
$$ 175 44 1518 137 -116 -792 570 1419 839 508 -830 345 403 1556 576 -659 -556 67 1555
1511A555j002J0j420Q66M01O22k80j389O10o20J488m18j04r87n3J067o07J056
$$ 1555 553 563 -857 9 410 1032 752 -637 -27 -647 841 423 319 -668 -721 346 -261 795
1529G95j343M79r98J256J92K2n44j184P95N9J418j076n24o27P56J230o40j72j410
$$ 795 -548 -69 -1067 189 381 403 -141 -1325 -530 -471 947 -129 -653 -1280 -524 706 66 -106 -1516
1548a516Q85N42P17m91q87J85l61J488k86j13q92L47J89N41M40r41K07r70J186
$$ -1516 -631 -89 628 137 -750 -565 -926 562 276 163 -729 -382 -193 348 788 -153 54 -916 270
1567B70L23J02k35j367J051j50J381q64m00p07P23J086k54L3j706K46P70J011
$$ 270 593 695 460 -907 144 -6 1375 511 111 -596 127 1213 959 992 -714 -468 302 1313
1585A313m82p73n72K4J495k75j21r88K13L62K80K93j177M75q04J094k8N4o77m80
$$ 1313 831 58 -514 -490 1005 730 609 -379 -166 196 476 769 -408 67 -737 357 329 383 -294 -774
1605g74O48l37Q81n04r7r24M53J064J14j57j708P89k23J549p65k56n37l81J572
$$ -774 -126 -463 418 -86 -183 -1107 -654 410 524 367 -1341 -552 -775 774 9 -247 -784 -1165 407
1624D07k32K42j275O1M26P71Q8r67J3k26R76k65N56n94n15N83k52J215r94J8o21
$$ 407 175 417 -858 -797 -371 400 488 -479 -466 -692 284 19 575 -19 -534 49 -203 1012 18 36 -585
1645e85N48K89M50lj126K86j14J332n04m39o97K02R83M8K42j215L21k8J108j85
$$ -585 -37 252 702 699 -427 -141 -255 1077 573 134 -563 -361 622 670 912 -303 18 -10 1098 913
1665I13q35l49k61J340o95O13j143K85k5J60N61l57k89n64O90k05L89n8o70L4
$$ 913 78 -271 -532 808 113 726 -417 -132 -157 3 564 207 -82 -646 44 -161 228 170 -500 -466
1685d66kR28m17J61j126mN23N64M11j375J97l55J220L7j97q72l51R07L32N09r64
$$ -466 -468 460 43 204 -922 -926 -403 161 572 -803 -606 -961 259 296 99 -773 -1124 -217 115 624 -340
1706c40m7j72N41N64p68N0n16P35j30M29j52k07l34O0R30m08K36j043L90L15M41
$$ -340 -387 -559 -18 546 -222 -172 -688 47 -83 346 194 -13 -347 -287 643 235 471 -572 -182 133 574
1727E74L95j050J48m04J310j46k66p80k33O73J69N95j228L7j26R45M6k40l28o72
$$ 574 969 -81 67 -337 973 827 561 -219 -452 221 390 985 -243 -206 -332 613 659 419 91 -581
1747e81Q53l32N74m29l07L1k15Q72l39M5n37j3o7N66J78q67k9l22Q27N6M37j097
$$ -581 272 -60 514 85 -222 -191 -406 466 127 172 -365 -378 -445 121 299 -568 -597 -919 -92 -36 401 -696
1769f96K1J83M88L89j032L01n78J128J48k26l69p56J022r8O86p03j04k76O51K14
$$ -696 -675 -492 -4 385 -647 -346 -924 204 352 126 -243 -999 23 -75 611 -92 -196 -472 179 393
1789C93m24N20r19O81n69R13k52n48J55m06Q73n1N74q49l40K50L18O44r41n1l54
$$ 393 -31 489 -430 251 -318 595 343 -205 -50 -456 417 366 940 91 -249 1 319 963 22 -29 -383
1810c83Q81P1K89q19l24M80j20J038j153Pl58O56K03m1k26o31M89k64M07m38J28
$$ -383 498 569 858 39 -285 195 75 1113 -40 -33 -391 265 468 427 201 -430 59 -205 202 -236 -108
1831a08r0k27O10m73P30p88J43m65P63M37r72L22j048R68J38M89r04l10J47N32
$$ -108 -198 -425 185 -288 442 -346 -203 -668 95 532 -440 -118 -1166 -198 -60 429 -475 -785 -638 -106
1851a06O88r23j39k21O50L19k25M1q81N88LO45l22J22o21L70L02k00N90o29M9
$$ -106 582 -341 -480 -701 -51 268 43 84 -797 -209 -206 439 117 239 -382 -12 290 90 680 51 100
1872A00m50O71M0q9o2p71P43J90L69p16j09k85O77N09o29l7n12P17l6J95l09m00
$$ 100 -350 321 361 272 210 -561 182 372 741 25 -84 -369 308 817 188 151 -361 356 320 515 206 -194
1894a94L82l44P87n49j26l29O07J36o02R05r41K04n98O52P1j64l24j42L46rN59
$$ -194 188 -156 631 82 -44 -373 234 370 -232 673 -268 -64 -662 -10 61 -103 -427 -569 -223 -232 327
1915C27m63j81n55N01O98l02j31o91M71P6K93l49J6j5m5P85o79J43m29N9M68K57
$$ 327 -136 -317 -872 -371 327 25 -106 -797 -326 -250 43 -306 -290 -305 -350 435 -244 -101 -530 -471 -3 254
1937B54o3l95J07m38J047k40o3j60k47L99m79R50q68M44m40M24L45k24J03o50
$$ 254 191 -204 -97 -535 512 272 209 49 -198 201 -278 672 -196 248 -192 232 577 353 456 -194
1957a94K33r1R36n79n35J22J87M36k45J4p80P90k02L55P4q13L94l83O70k66J3
$$ -194 39 -52 884 305 -230 -108 79 515 270 284 -496 294 92 447 521 -292 102 -281 389 123 136
1978A36l47p9J29J70L37m33j73j62M00o5M12k98m41J30m1P03n23l14m6J95M91
$$ 136 -211 -290 -161 9 346 -87 -260 -422 -22 -87 325 27 -414 -284 -325 378 -145 -459 -505 -310 181
1999A81l78J66p15K96K64M33k01l54L0j98Q17m12k2l53K99K74O0K29o90J57j68
$$ 181 -197 -31 -746 -450 -186 247 46 -308 -278 -476 341 -71 -93 -446 -147 127 187 416 -274 -117 -285
2020b85M22o5J47N1l17J13K27L70l67o2p34O24N41j86R6r45O86l84R00k93o54
$$ -285 137 72 219 270 -47 66 293 663 296 234 -500 124 665 479 575 -370 316 -68 832 539 -115
2041a15l5J60O51l57J44p02J46K94k6J61n49K08j48L79j37M3k77q8K73l05O43
$$ -115 -150 10 661 304 448 -254 -108 186 160 321 -228 -20 -168 211 74 117 -160 -248 25 -280 363
2062C63m89J80o24L87M14j86K64r92N35k03P75l56m79j86Q6P60m82M93o40K18
$$ 363 -126 54 -570 -183 231 45 309 -683 -148 -351 424 68 -411 -597 -511 249 -233 260 -380 -162
2082a62k27M63j53m9P8l26N07m40M20j26j40J56O5L00k67J62n76L17r7K35O9k00
$$ -162 -389 74 -79 -128 -50 -376 131 -309 111 -15 -155 1 66 366 99 261 -315 2 -95 140 209 9
2104IJ13j79P11o81L03m39n5L42J13L13p21J15J13N46k69k46J20m80M73k4j87
$$ 9 122 -57 654 -27 276 -163 -218 124 237 550 -171 -56 57 603 334 88 208 -272 201 177 -10
2125a0j01K50j51q5K46l02Q4m37M15PK49j48l20J5j31M74p7J66p89K59K34N9J94
$$ -10 -111 139 -12 -97 149 -153 -69 -506 -91 -84 165 17 -303 -288 -419 55 -22 144 -645 -386 -152 -93 101
2148A01m03n3K08R2Q8j39m3l72N16j5J83o25K99p1M33N1l39o5l63N51mK64k54
$$ 101 -302 -355 -147 -55 33 -106 -149 -521 -5 -20 163 -462 -163 -234 199 250 -89 -154 -517 34 30 294 40
2171D0j22m5q4N33j93M0j98OJ37L62j39l16O3j05O30k84J85o96R2K44l8K43n16
$$ 40 -82 -127 -211 322 129 169 -29 -23 114 476 337 21 84 -21 609 325 510 -186 -94 150 112 355 -161
2194a61K62r2L84j29j14j36j37K03Q4P9n62L62k80J80K80m55L48m23J16k2J20
$$ -161 101 9 393 264 150 14 -123 80 164 243 -319 43 -237 -57 223 -232 116 -307 -191 -213 -93
2215i3K43l82J2l50O74k27K22l72j31J53K95J69o22L58l48M13p2J73k27l03K96
$$ -93 150 -232 -220 -570 104 -123 99 -273 -404 -251 44 213 -409 -51 -399 14 -58 115 -112 -415 -119
2236a19p2O33o69J27k30M10P6j25K44o82M69N9J54mj37l3k58L62j17L01m19k18
$$ -119 -191 442 -227 -100 -330 80 156 31 275 -407 62 121 275 271 134 101 -157 205 88 389 -30 -248
2258b48J91J73K52m11K39o90Q25k5N4k97k98M70n3K42n90L47l35L76j81n5K78
$$ -248 -57 116 368 -43 196 -494 331 306 360 63 -235 235 182 424 -166 181 -154 222 41 -14 264
2279B64m97Q7r6K93J10j23k83q0K96J12R7m00Kj91L36P5j73o0j91N39j34M22q24
$$ 264 -233 -146 -242 51 161 38 -245 -325 -29 83 180 -220 -218 -409 -73 2 -171 -231 -422 117 -17 405 -419
2302d19P5p5J58K50j21N1k04N11l96M76k40m07M85l01M99n27M26l23J10N5J01
$$ -419 -344 -419 -261 -11 -132 -81 -285 226 -170 306 66 -341 144 -157 342 -185 241 -82 28 83 184
2323A84P3m97N26m52M03p3K4k3m10M66M4K78o48J59J49k21M91k47n8m41M49j31
$$ 184 257 -240 286 -166 237 164 188 165 -245 221 265 543 -105 54 203 -18 473 226 168 -273 176 45
2345D5K07m2l14J55j66N35n88J54p6jK10j60Qp1Q4k44L98k43L8k91O0J76k57N95
$$ 45 252 210 -104 51 -115 420 -168 -14 -90 -91 119 -41 -33 -104 -20 -264 134 -109 -71 -362 -302 -126 -383 212
2369B12k51k30k00K28L51k55L0l55N31o0J19l14j7L33l59M16l05J10k21J72P7
$$ 212 -39 -269 -469 -241 110 -145 -115 -470 61 1 120 -194 -211 122 -237 179 -126 -16 -237 -65 12
2390A2r0L1j70N14l69L56l98K25J04j06p3k11O47l80J19l59K81K44j14j85j26
$$ 12 -78 -47 -217 297 -72 284 -114 111 215 109 36 -175 472 92 211 -148 133 377 263 78 -48
2411d8P9r1N77l85j20K47P6jk93J00k46N17j30r8j83jj33j42N23j20J4l69K77
$$ -48 31 -60 517 132 12 259 335 334 41 141 -105 412 282 184 1 0 -133 -275 248 128 142 -227 50
2434E0k24nL86m92J08k33M10j86Q4J04l43J36j04M14l20L0l85N21Q2k47K51o65
$$ 50 -174 -179 207 -285 -177 -410 0 -186 -102 2 -341 -205 -309 105 -215 -185 -570 -49 33 -214 37 -628
2456f28N63l11O40n27r7J88MJ68j43K13l59K45N2Q6J8l50K36k63L94m7K95m17
$$ -628 -65 -376 264 -263 -360 -172 -168 0 -143 70 -289 -44 8 94 112 -238 -2 -265 129 82 377 -40
2478d0L5P0j2K95k56J46j99K20k17L42k05m73N30k32L68m00J51j62J8L32l67J20
$$ -40 -5 65 53 348 92 238 39 259 42 384 179 -294 236 4 372 -28 123 -39 -21 311 -56 64
2500F4l86L64k39L08j37p2Q5j88K93j19J74k53K1K21m94K39lK34l02K43k98J80
$$ 64 -322 42 -197 111 -26 -98 -13 -201 92 -27 147 -106 -85 136 -358 -119 -122 112 -190 53 -245 -65
2522f5J17k85J82j05M28n34r1J09K61Kk75J88j33J87j37L66q5k56J47J5R6k76
$$ -65 52 -233 -51 -156 272 -262 -353 -244 17 19 -256 -68 -201 -14 -151 215 130 -126 21 36 132 -144
2544a44L72m20L51k29O5j9R5ok35L71l80P11m83j5P6o5K96j90J60l4j69J41l7
$$ -144 228 -192 159 -70 -5 -24 71 65 -170 201 -179 532 49 34 110 45 341 151 311 277 108 249 212
2567B12J23l73J92OL34n44j18Q9K24J9k70O1k36O68l33J83j23k01p9J54K63n91
$$ 212 335 -38 154 160 494 -50 -168 -79 145 164 -106 -45 -281 387 54 237 114 -87 -166 -12 251 -340
2589c40L40j59R4p6PK53l38K78l78P5n2K48m2j26K39l82M98k98R9k54L0K54j8
$$ -340 0 -159 -65 -141 -134 119 -219 59 -319 -244 -296 -48 -90 -216 23 -359 139 -159 -60 -314 -284 -30 -48
2612d8Q2l88L69k08L94n5k62N50l83Q8j60K71j47j65n6K53n1k74M49l90J53J17
$$ -48 34 -354 15 -193 201 146 -116 434 51 139 -21 250 103 -62 -118 135 84 -190 259 -131 22 139
2634A39r8K50j30j06m0M18q2k09k64J13M56k63pk54R0k09N37l94K42j77l8Q4j29
$$ 139 41 291 161 55 15 433 351 142 -122 -9 447 184 177 -77 13 -196 341 -53 189 12 -26 58 -71
2657g1K68n17M66m16L55j4q3K33k13Lk66M35j25q8Lm10K82k26L92j43M9p5J21
$$ -71 197 -320 146 -270 85 71 -12 221 8 11 -255 180 55 -33 -30 -440 -158 -384 8 -135 -86 -161 -40
2680d0n3j25N9l64M93Rq2K88n25L12j3K51k82K66k48J69k02PM16j44Rk52K62j46
$$ -40 -93 -218 -159 -523 -30 -21 -103 185 -340 -28 -41 210 -72 194 -54 115 -87 -80 336 192 201 -51 211 65
2704F5K36l9o2j6n3K46m51J73j29J79J59l00J72j97L62k35J14l14K25k09K67P6
$$ 65 301 262 200 184 131 377 -74 99 -30 149 308 8 180 -17 345 110 224 -90 135 -74 193 269
2726B69j52l29L9L43k67P9J34k76L51m63N57j68q4j46L6J8j40K12l62L83k46J32
$$ 269 117 -212 -173 170 -97 -18 116 -160 191 -272 285 117 33 -113 -77 -59 -199 13 -349 34 -212 -80
2748h0N9J56l51j67M37k12L16k07R2k97K71J78l54K67n32L76j56M56m86J64K50
$$ -80 -21 135 -216 -383 54 -158 158 -49 43 -254 17 195 -159 108 -424 -48 -204 252 -234 -70 180
2769A80j99K38n27K15M9J32p9K68j03j14J55k14L25l03K11k02O1J04k0J16j37
$$ 180 -19 219 -308 -93 -44 88 9 277 174 60 215 1 326 23 234 32 93 197 177 293 156
2790A56j4n0J54j21K41l48l00N26j08J84j42p3j27J68M4j50J0P1j30j45J40j4
$$ 156 142 92 246 125 366 18 -282 244 136 320 178 105 -22 146 190 40 50 121 -9 -154 -14 -28
2812b8j28L38k51K46k22R1j78Q0p2k72N26m12K74l49K55l1R0O7n7L6j85K00j9
$$ -28 -156 182 -69 177 -45 46 -132 -52 -124 -396 130 -282 -8 -357 -102 -133 -43 24 -33 3 -182 18 -1
2835aK64l54Q8q6k2J01l16L65J81m48K06j21K56j25K75k73j48M6J45J36j40L50
$$ -1 263 -91 -3 -89 -111 -10 -326 39 220 -228 -22 -143 113 -12 263 -10 -158 -112 33 169 29 379
2857C79m30K13k55J79L17l40mo9K8qM25j53pl49K41J54l36L30l59P8N1J00j62
$$ 379 -51 162 -93 86 403 63 59 -10 18 10 435 282 275 -74 167 321 -15 315 -44 34 85 185 23
2880B3K57k59q2L6k57N16n44K45j59K08L79n51K07j51J23j03J04j66J26Mj95M36
$$ 23 280 21 -61 -25 -282 234 -310 -65 -224 -16 363 -188 19 -132 -9 -112 -8 -174 -48 -44 -239 197
2902A97l28j1k1J45J21K0m08L6L19k86J28l00j6L73q5L72k95J90l9j86R4k29J79
$$ 197 -131 -142 -163 -18 103 123 -285 -249 70 -216 -88 -388 -404 -31 -116 256 -39 151 112 -74 20 -209 -30
2925c0k5k4J55J63m3j5j50O8j88K5M57m75J44j80J14J21P7J72m27K35l05N47m20
$$ -30 -55 -79 76 239 196 181 31 99 -89 -64 393 -82 62 -118 -4 117 194 366 -61 174 -131 416 -4
2948dR9o6M0J51k01K90l43K2q0L3K16l41J12j36L26l51M33j60kj79K1J67k31L08
$$ -4 95 29 69 220 19 309 -34 -12 -92 -59 157 -184 -72 -208 118 -233 200 40 38 -141 -120 47 -184 124
2972A24n99M48MN7Ok37oK0jj75K43J28k59K44r8Q5r1Q3k91M56k0l22K26j18M01
$$ 124 -475 -27 -23 34 40 -197 -203 -183 -184 -359 -116 12 -247 -3 -101 -16 -107 -24 -315 141 121 -201 25 -93 308
2997C08m39J10o5o1j0L39o3j70L52l27O6J17J04l22J89j23N9J56j58K16m51J86
$$ 308 -131 -21 -86 -147 -157 182 119 -51 301 -26 40 157 261 -61 128 5 64 220 62 278 -173 13
3019A3n5K53k51R8J67k36K72j58M5j22J37j44j30Q6n8J25l15K42P2j36M10j68
$$ 13 -42 211 -40 58 225 -11 261 103 148 26 163 19 -111 -25 -83 42 -273 -31 41 -95 315 147
3041A47j37l93M93l53K30k47J98J95l68L71m23R3j58M49j55k28L07k15o4K02J79
$$ 147 10 -383 110 -243 -13 -260 -62 133 -235 136 -287 -194 -352 97 -58 -286 21 -194 -258 -56 123
3062A23j06l4O5j44O5j04N7j74L13k00O8K01l68K55m0M35l88J05j38K03k36q3
$$ 123 17 -17 48 -96 -31 -135 -78 -252 61 -139 -71 130 -238 17 -23 412 24 129 -9 194 -42 -125
3084a25L45j53M1j40K21K3k30m3K7N23o33K68j69K43p1j6j77N8K13j79J52j23
$$ -125 220 67 108 -32 189 212 -18 -61 -34 489 -144 124 -45 198 127 111 -66 -8 205 26 178 55
3106E5R8r8p4J89l9k27J7N7l40L35P9j14r7k3K57l80M00m29M27k19J67j1l98J89
$$ 55 153 55 -19 170 131 -96 -79 -22 -362 -27 52 -62 -159 -182 75 -305 95 -334 93 -126 41 30 -368 -179
3130a79J47q2L0O1O8k76J36r8J94J70k00M2o5P5k5L63m87L17k3J11l53M63k63
$$ -179 -32 -114 -84 -23 45 -231 -95 -193 1 171 -29 13 -52 23 -2 361 -126 191 168 279 -74 389 126
3153A26k39J81j61K08R7N4l67L34j21l4J02k29J59j97K34J39k15P1Ql9j20K84
$$ 126 -113 68 -93 115 212 266 -101 233 112 78 180 -49 110 -87 147 286 71 142 150 111 -9 275
3175B75m01P1J50R4k44o5K30l14K72k81K44K8j19K3J8O2j55K82l69M34k61k5K39
$$ 275 -126 -55 95 189 -55 -120 110 -204 68 -213 31 59 -60 -37 -19 43 -112 170 -199 235 -26 -51 188
3198A88n11K02j57K04J00K1k59m3R9o1L48k54k8K26j51P4k50L35k69J76j50L95
$$ 188 -323 -121 -278 -74 26 47 -212 -255 -156 -217 131 -123 -151 75 -76 -2 -252 83 -186 -10 -160 235
3220B35j83r6K88l07K20l12L91m70M11j61J29J4J63l42m2J58j70L25m1k31N2l6
$$ 235 52 -44 244 -63 157 -155 236 -234 177 16 145 159 322 -20 -62 96 -74 251 210 -21 31 -5
3242eL37l26N6n4J45K8j14k87q9K92j76L79k33QK20k02Q3q8J36j03k6l0k03K12
$$ -5 332 6 62 8 153 181 67 -220 -309 -17 -193 186 -47 -39 181 -21 62 -26 110 7 -19 -49 -252 -40
3266d0p6K33m99N16l5k68K1j68L11j77Q0K0N0k79K39R4k9M4k67J19mJ78j92p4
$$ -40 -116 117 -382 134 99 -169 -148 -316 -5 -182 -102 -82 -32 -311 -72 22 -7 37 -230 -111 -115 63 -129 -203
3290b03L8J83o6o6K86j84qj32L71m02R9k20p3N73j93k44K13p2J52o9P8m3J60j34
$$ -203 -165 18 -48 -114 172 -12 -20 -152 219 -183 -84 -304 -377 196 3 -241 -28 -100 52 -17 61 18 178 44
3314D4j22K07J69k32J17o1r1J28k62L14l03P3J30j86L15n07J79J10J83k71nK55
$$ 44 -78 129 298 66 183 122 31 159 -103 211 -92 -19 111 -75 240 -267 -88 22 205 -66 -71 184
3336A84j83j21J01J31k17J26j46O4lOJ5j04J47o5J43k08k81L40j46K85j89J76
$$ 184 1 -120 -19 112 -105 21 -125 -61 -64 -58 -43 -147 0 -65 78 -130 -411 -71 -217 68 -121 55
3358E5o7l20L50O0l17J62P6k31L50k07J07j99jJ62k78L39l46K20J26O2j48JN9
$$ 55 -12 -332 18 78 -239 -77 -1 -232 118 -89 18 -181 -182 -20 -298 41 -305 -85 41 103 -45 -44 15
3381A5j17K12k27J82K0j59K90n1p1k10K42j71M1L50k79J53k96J76k73J64J18n2
$$ 15 -102 110 -117 65 85 -74 216 165 94 -116 126 -45 -4 346 67 220 -76 100 -173 -9 109 57
3403E7j94K85l52N66l45P6J74j06j24ln8m3l7J95%M3j97N5O4k55K79k03L65l80
$$ 57 -137 148 -204 362 17 93 267 161 37 34 -24 -67 -104 91 91 134 -63 -8 56 -199 80 -123 242 -138
3427a38J37l84M24Q9n2k21nJ64j05N8m7J20O3l3k14J38J43j76O2jJ39k62K16j49
$$ -138 -1 -385 39 128 76 -145 -150 14 -91 -33 -80 40 103 70 -144 -6 137 -39 23 22 161 -101 115 -34
3451c4j16J75M3j24k54K18K77J4j98o1P9k11N91l40J71k24j14L28k07N1K0jo4
$$ -34 -150 25 68 -56 -310 -92 185 199 1 -60 19 -192 399 59 230 6 -108 220 13 64 84 83 19
3474A9J94K7l82J58OK29j86J71k52Q7P6J33j07l89M62l73J53J77j29o0l88M50
$$ 19 213 240 -142 16 22 251 65 236 -16 71 147 280 173 -216 246 -127 26 203 74 14 -374 76
3496G6k90K62k9q1k9J19j07q7R1N4K62n21K84L4j15j5L7L5l24N08j44p9j7p1P8
$$ 76 -214 48 19 -62 -91 28 -79 -166 -75 -21 241 -280 4 38 -77 -92 -55 -20 -344 164 20 -59 -76 -147 -69
3521f9J32j51onP4J14k9j78K83k02J86k59R7k8K16K9k30J48k78J01j65L80k46
$$ -69 63 -88 -94 -99 -25 89 60 -118 165 -37 149 -110 -13 -41 175 204 -26 122 -156 -55 -220 160 -86
3544h6J92j5j27P3m8L35m00J95M7q7O8k42L62m29L84l42K10j23k19K19K8M2l62
$$ -86 106 91 -36 37 -11 324 -76 119 166 79 147 -95 267 -162 222 -120 90 -33 -252 -33 -5 37 -325
3567c25L50l57M49l15J65Qr1J35N7o6K05j86j24r6J41q4J92p3k9KK60k74l93N25
$$ -325 25 -332 117 -198 -33 -25 -116 19 76 10 215 29 -95 -191 -50 -134 58 -15 -44 -42 218 -56 -449 76
3591G6j72J36j35K98l32O2m0r7L56r9o1k87K05J44J96m27J11o0p9L85j76M7J84
$$ 76 -96 40 -95 203 -129 -67 -107 -204 152 53 -8 -295 -90 54 250 -177 -66 -126 -205 180 4 51 235
3614B35l42L7K63r5j98K56j19J80j56j4n5q3L14q6J28k56R0k32K52j32k82L84
$$ 235 -107 -70 193 98 -100 156 37 217 61 47 -8 -91 223 137 265 9 99 -133 119 -13 -295 89
3636H9k26L81k01k15P1L1J30o4L42l86J29q0J06j31lj78J92j89N3R6j8j98J59
$$ 89 -137 244 43 -172 -101 -70 60 -4 338 -48 81 1 107 -24 -27 -205 -13 -202 -149 -53 -71 -269 -110
3659a10l08N11L4P5m79J39M5K04k69M4N6lJ55j45R6r8M5J1K42j17k68M00l5j96
$$ -110 -418 93 127 202 -277 -138 -93 111 -158 -114 -58 -61 94 -51 45 -53 -8 3 245 128 -140 260 225 29
3683B9j04J22j29N1lK3j0j06K37j26K5o5l5K55J48j36k43J05m0K8L37j56j0n30
$$ 29 -75 47 -82 -31 -34 -11 -21 -127 110 -16 9 -56 -91 164 312 176 -67 38 -2 26 363 207 197 -333
3707c33O11k51P1m9n1J10m3r1%K3P0n8n0p5K08j76Q9L3O0j49Q4l3K2r2l6R2J3
$$ -333 278 27 98 49 -2 108 65 -26 -26 -3 67 9 -41 -116 92 -84 5 38 98 -51 33 0 22 -70 -106 -14 -1
3734aK18n22J96R2k02J12J9L65l25L24l58j27J76J23k03o1K69l9M0j97J79k42
$$ -1 217 -305 -109 -17 -219 -107 -88 277 -48 276 -82 -209 -33 90 -113 -174 95 56 96 -101 78 -164
3756a64K81j60oK33j48R7j60L61k30l03K66m2O8r9K14l16J87p9l1p1J28j6l7J81
$$ -164 117 -43 -49 184 36 133 -27 334 104 -199 67 25 93 -6 208 -108 79 0 -31 -102 26 10 -27 154
3780A54l15M2kk3M27l00L60n06J27m2j3J38k44K90k15J27K2j9l2J27r6M2j89N5
$$ 154 -161 -119 -121 -144 283 -17 343 -163 -36 -78 -91 47 -197 93 -122 5 27 8 -24 103 7 49 -140 -85
3804h5Q7k6P8p7o9p0R0j61K85K2p3k5Q2k91L13n4J45k42J68M7j18J53l9M2m08
$$ -85 2 -24 54 -23 -92 -162 -72 -233 52 74 1 -24 58 -233 80 26 171 -71 97 144 26 179 140 182 -226
3829b26J26O8K02k44J50k9o4K10j55Oj51J38M6K40k93J8k3L0N5j35J93O9k68Q
$$ -226 -100 -32 170 -74 76 47 -17 193 38 44 -107 31 77 317 24 42 19 49 104 -31 162 231 -37 -29
3853b9n8L79l91J43J93L1k40LJ12j66R7J33k41R7j3j88J73k5j51J08j06O9j70
$$ -29 -87 292 -99 44 237 268 28 31 143 -23 74 207 -34 63 50 -138 35 10 -141 -33 -139 -70 -240
3876b40R7J83j56N8j5J03m7n3l8J62L5k4r5P2N0j64R0j60L00l36K28Lk1J20j80
$$ -240 -143 40 -116 -58 -73 30 -17 -70 -108 54 89 65 -30 42 92 -72 18 -142 158 -178 50 53 32 152 -28
3901b8Q2J0J6k59l7J42K11Q7j80Q1R4k47K04k62J81k21K29k43K95m9l40J91J64
$$ -28 54 64 80 -179 -216 -74 137 224 44 125 219 -28 176 -86 95 -126 103 -140 155 106 -234 -43 121
3924A21l4l97K73J43J15p4M6l00q7K49j35J45R9O2k13J10j67p2N0qJ99l64O02
$$ 121 87 -310 -37 106 221 147 193 -107 -194 55 -80 65 164 226 13 123 -44 -116 -66 -74 125 -239 363
3947C63l01j38KLJ59j34j53J91Q4k51K12q3j78Q3K9J41p5L46j93k88J56j85L00
$$ 363 62 -76 -74 -71 88 -46 -199 -8 76 -175 37 -46 -224 -141 -112 29 -46 300 107 -181 -25 -210 90
3970I0l24J6P8J16O9k9J83l17J64j96J15N8l9K26j97K70l26J48J87l09M5N9M41
$$ 90 -234 -218 -140 -24 45 16 199 -118 46 -150 -35 23 -16 210 13 283 -43 105 292 -17 28 87 528
3993E28o22l8R2J29J38j92J10j26j3J23N1j61M2J04j23j04J78N0l09J82j83M5
$$ 528 -94 -132 -40 89 227 35 145 19 6 129 180 19 61 165 42 -62 116 166 -143 39 -144 -99
4015i9O5q0J01j6N9k00J85j52K47k20o1K93l02J16j82L13n6L6j18R0J40j60R8
$$ -99 -34 -114 -13 -29 30 -170 15 -137 110 -110 -171 122 -180 -64 -246 67 11 47 -71 19 159 -1 97
4038I7k83j43L97j64L5J26k29j62K23n5rj7K4j44J49R8j66J66O0m4J76m0l7Q7
$$ 97 -186 -329 68 -96 -61 65 -164 -326 -103 -158 -167 -184 -160 -304 -155 -57 -223 -57 3 -41 135 95 58 145
4062A45J2m28L88p8j29j9K45j97N9r5K01K7j39Q6J88k00J61j21j58R1j5o3j06
$$ 145 157 -271 117 39 -90 -109 136 -61 -2 -97 104 131 -8 78 266 66 227 106 -52 39 24 -39 -145
4085a45K78L9Q8m12K57M9j58J97j33k4J22j80Kj55J4K49k08nJ69J55k33J2j30
$$ -145 133 172 260 -152 105 154 -4 193 60 36 158 -22 -20 -175 -161 88 -120 -125 44 199 -34 -22 -152
4108a52M5J57k4l62K89m3K05q6p0m4J57j16J78o4j49K39k12K41j59mO0p5q3J59
$$ -152 -107 50 26 -336 -47 -90 115 29 -41 -85 72 -44 134 70 -79 160 -52 189 30 26 86 11 -72 87
4132H7K19m18J94j01p6R3L5J79m20M54j17j00J48k46L98l04j30K89k9P2m42K64
$$ 87 306 -112 82 -19 -95 -2 33 212 -208 246 129 29 177 -69 329 25 -105 184 155 227 -215 49
4154D9j4p0J67m6j10Q0j66J39K1O9k26l1J79j46J98j63p4P8Q6N1k47l6J9K84k98
$$ 49 35 -35 132 86 -24 56 -110 29 50 119 -107 -138 41 -105 93 -70 -144 -66 20 71 -176 -212 -193 91 -207
4179b07Q6N8o9J94k52N5J29r7M8J32j2J7k78J49R8q5M4P0k55o6L69k74K92l52
$$ -207 -121 -63 -132 62 -190 -135 -6 -103 -55 77 65 82 -196 -47 51 -34 10 80 -175 -241 128 -146 146 -206
4203b06L99l80K4M12l48L33l35J76k69J80J65j45j4m0n5K13j05P2l2p4OK16m94
$$ -206 193 -187 -163 249 -99 234 -101 75 -194 -14 151 6 -8 -48 -103 110 5 77 45 -29 -23 193 -301
4226c01R8K92M4J71k13K09j31J4j62j5r1nO4K58j00j1j21l7l16N30m10K33p7P4
$$ -301 -203 89 133 304 91 300 169 183 21 6 -85 -90 -26 232 132 121 0 -37 -353 177 -233 0 -77 -3
4250cj03P2J14l8m4q0P1j16Q2r4j33K67K31l04J14lq5J24k4n8j37N21m23k05M50
$$ -3 -106 -34 80 42 -2 -82 -11 -127 -45 -139 -272 -5 226 -78 36 33 -52 72 48 -10 -147 374 -49 -254 196
4275A96mk78J11K30k71J35j72K9n0m1K57j94J82Q4l16j1J18K01l11O0o7J30RK83
$$ 196 192 -86 25 255 -16 119 -53 -24 -74 -115 142 -52 130 214 -102 -113 5 206 -105 -45 -112 18 27 310
4299C10j92m19M42k20m7J39j3j60K83j66o1K43j62O2J5k55K32k73N58j51k38J70
$$ 310 118 -301 141 -79 -126 13 0 -160 123 -43 -104 139 -23 39 54 -201 31 -242 316 165 -73 97
4321I7j45m0K12p7k02K28j16J44k96K16L8p4M2j43R9r4J56l38L08q1K1O8J5J93
$$ 97 -48 -88 124 47 -155 73 -43 101 -195 21 59 -15 27 -116 -17 -111 45 -293 15 -66 -45 23 38 231
4345B31k34m6J91m36M12j55K78l35J88j37J1l6J2Q8J0K19l21%n7K65k55J15J31
$$ 231 -3 -49 142 -294 118 -37 241 -94 94 -43 -32 -68 -56 32 42 261 -60 -60 -117 148 -107 8 139
4368A39N6j80r1R1K75j12k68k33K67L20j24J48n96J63J52N6j23m4J96o5j02L42
$$ 139 195 15 -76 15 290 178 -90 -323 -56 264 140 288 -308 -145 7 63 -60 -104 92 27 -75 267
4390B67m9%k63J54m1k39M34l23k0K8J54k12L15l70L78j83p5j94K46O5n2j18o4
$$ 267 218 218 -45 109 68 -171 263 -60 -80 -52 102 -110 205 -165 213 30 -45 -239 7 72 20 -98 -162
4413a62R0J03k84K37q3R3k26J65O1j79J92L3L4l30J96mm0R2N4j10K14k07j71L35
$$ -162 -72 31 -253 -16 -99 -6 -232 -67 -6 -185 7 40 74 -256 -60 -64 -104 -12 42 -68 146 -61 -232 103
4437A03r9k30L23J48k33M2N0J28k94J98p3P8j24K18j16R0k48q6M7K35Q3m30J75
$$ 103 4 -226 97 245 12 54 104 232 -62 136 63 141 17 235 119 209 -39 -125 -78 157 240 -190 -15
4460a5N0J3j34K64k14r0K45j36K7j29o8K73k59J80l7j88j06M45p1pp6j03J46K83
$$ -15 35 48 -86 178 -36 -126 119 -17 10 -119 -187 86 -173 7 -30 -218 -324 121 50 43 -33 -136 10 293
4484B93k75L4l61O1K74j02J64m1O7l30m9K60J20j94p1K2R5j85L89k78R5l79N39
$$ 293 18 52 -309 -248 26 -76 88 47 114 -216 -265 -5 115 -79 -150 -128 -33 -218 171 -107 -12 -391 148
4507A48k37L21j80J04j00q2O7k8K95k29l8k45q4M66k35j14L08l75J81k07K05o1
$$ 148 -89 232 52 156 56 -26 41 13 308 79 41 -204 -288 178 -57 -171 137 -238 -57 -264 -59 -120
4529a20K17P8j34P3k79R5K87k73R3M5j85O0N9lJ01l42K94l2j60O5j69K93j61J55
$$ -120 97 175 41 114 -165 -70 217 -56 37 82 -103 -43 16 13 114 -228 66 34 -126 -61 -230 63 -98 57
4553E7J24k19k64O08j44k32K38j40M3j55J78k87M04k62J88J7q6o0q6K89l43N3
$$ 57 181 -38 -302 306 162 -70 168 28 71 -84 94 -193 211 -51 137 154 68 8 -78 211 -132 -79
4575g9J4m6K95k77R3M6j5p5K31o7l39lK89j13J8R0Q5j26m65O01k85J13R5j81J3
$$ -79 -65 -111 184 -93 0 46 31 -44 187 120 -219 -222 67 -46 -28 62 147 21 -444 157 -128 -15 80 -101 -88
4600h8K6J0P0o5P9j03L19l13J9Q1k37J44k86K69N0p3M6J02l32N74j29j81nj78
$$ -88 -62 -52 18 -47 32 -71 248 -65 -46 35 -202 -58 -344 -75 -25 -98 -52 50 -282 292 163 -18 -23 -201
4624b01MR1J41j20J16p3k0n1J24J66j26j25M6n2OL66J08n05R4J57k78R4k88K71
$$ -201 -197 -106 35 -85 31 -42 -62 -113 11 177 51 -74 -28 -80 -74 292 400 -105 -11 146 -132 -38 -326 -55
4648e5J21nj33K73k09P6k70J78j04n4K66l3J3j20P7J67q3m6j49J71k86L03k06
$$ -55 66 61 -72 201 -8 68 -202 -24 -128 -182 84 51 64 -56 21 188 105 59 -90 81 -205 98 -108
4671a08J66J1K2l00L59p0m7J19j65q8K55lk79J07j10R1Q4K65l00k02L04j09Q0
$$ -108 58 69 91 -209 150 80 33 152 -13 -101 154 151 -128 -21 -131 -40 44 309 9 -193 111 2 82
4694H2j97J41j4lj23K7l8Q0j25K02k14J25K66k75j16pK25j19K08j50J60k80J51
$$ 82 -115 26 12 9 -114 -87 -125 -45 -170 32 -182 -57 209 -66 -182 -189 36 -83 125 -25 135 -145 6
4717Fk2j94J06J00R9k9J47j18k61L93j83J47l60N3K3J9K79k16L4j15P0K36J21
$$ 6 -16 -210 -104 -4 95 66 213 95 -166 227 44 191 -169 -116 -93 -74 205 -11 23 -92 -22 214 335
4740C35j92k83J90j10K03j94K64k40K55j29L8J7k22m6K1J34J08O1k17j94M11m51
$$ 335 143 -140 50 -60 143 -51 213 -27 228 99 137 154 -68 -114 -93 41 149 210 -7 -201 210 -241
4762b41K15j13L35j95j00O5K16m38N0m0J02M97n01K88r0j03J65j54M3j77J20k46
$$ -241 -26 -139 196 1 -99 -34 182 -256 -206 -246 -144 353 -148 140 50 -53 112 -42 1 -176 -56 -302
4784c02M27j24p5lQ9j49J33J33j39j72J3q1K4K30K91l96J68j72J48r5K52l71K29
$$ -302 125 1 -74 -77 12 -137 -4 129 -10 -182 -169 -250 -226 4 295 -101 67 -105 43 -52 200 -171 58
4807E8O0k65K77l74L37k04n7p2K84J35qk07J34j27k4n9l1M9J57k1J45k31p8J29
$$ 58 118 -147 130 -244 93 -111 -168 -240 44 179 171 -36 98 -29 -53 -112 -143 -94 63 42 187 -44 -122 7
4831GN3K63l11K7k76L20M7j54j47K17k6j05L73l07o8J07J07j19N1o8q7j12O1L22
$$ 7 60 323 12 39 -237 83 130 -24 -171 46 20 -85 288 -19 -87 20 127 8 59 -9 -96 -208 -147 175
4855A75k09o1J42J71l35j50r7K27K01r3j7p8k4L81k40m0J17J09k82p9R6j17L19
$$ 175 -34 -95 47 218 -117 -267 -364 -137 64 -29 -46 -124 -148 233 -7 -47 70 179 -103 -182 -86 -203 116
4878A16k13J23q9M0J28k51P7O7R2k11Q5J27k65J28J36J32k48j12j3p2N73j1k63
$$ 116 -97 26 -63 -23 105 -146 -69 -2 90 -121 -36 91 -174 -46 90 222 -26 -138 -151 -223 350 339 76
4901G6r6r5O1K72j03j83P2j26L60j44o7%K42l96J68J2n2R1J31k39m0J52k69M17
$$ 76 -20 -115 -54 218 115 -68 4 -122 238 94 27 27 269 -127 41 53 1 92 223 -16 -56 96 -173 244
4925B44k73q9O3K36k36n0J07J8J07j77j14N2J66k13J61R8j90J47j68J18Q2k39
$$ 244 -29 -118 -55 181 -55 -105 2 20 127 -50 -164 -112 54 -159 2 100 -90 57 -111 7 89 -150
4947a50J91j18K15j11j78K27M9k35j58M18j12J32j02J9p3j14O5L7p0J24J34j84
$$ -150 41 -77 138 27 -151 76 125 -110 -268 150 38 170 68 87 14 -100 -35 2 -68 56 190 6
4969Fl8R6l05J13J28m6Q3o4J54j36k7j1N6P1j56JK23M8l64K89q4o8o6L29p3j72
$$ 6 -32 64 -241 -128 0 -46 37 -27 127 -9 -36 -47 9 80 -76 -75 148 196 -168 121 37 -31 -97 232 159 -13
4995a3j41J42J34k17K10n9j46KK52J69l04j25j2K9k2M4Q5l8J0k5j90R9K26k62
$$ -13 -154 -12 122 -95 115 56 -90 -88 164 333 29 -96 -108 -79 -101 -57 28 -10 0 -25 -215 -116 110 -152
5019a52J42J3j22j80J36J91j37K24j64J91l29M04l65L78j08k74K78j44J86m08
$$ -152 -10 3 -119 -299 -163 28 -109 115 -49 142 -187 217 -148 230 122 -152 126 -18 168 -240
5039b40L17l1k3k56J25J28M8j14L91k83K4k2P9k3m6j24J28K21l28q0J86Q4j11
$$ -240 77 46 23 -233 -108 20 68 -46 345 62 86 64 143 120 74 -50 78 299 -29 -109 77 161 50
5062E0l14K45K26j61M3J63o4m1p3J30l55K16O5n5Lj27q4J32rl9k2mN1l18J19K90
$$ 50 -264 -19 207 46 89 252 188 147 74 204 -151 65 130 75 78 -49 -133 -1 -10 -49 -71 -75 -24 -342 -223 67
5088F7p1p1Q9p8P7l2l81M89j29r4O5Q5lpO5J4j37J47l08K92J26l04N9P3l7n5K3
$$ 67 -4 -75 14 -64 13 -19 -400 89 -40 -134 -69 16 13 6 71 85 -52 95 -213 79 205 -99 -40 33 -4 -59 -36
5115c6J69J29l41K18j28R6j31j03L79l67J28j99L9J92l7l1N0J67m06L29JP0k84
$$ -36 133 262 -79 139 11 107 -24 -127 252 -115 13 -186 -147 45 8 -23 27 194 -212 117 118 188 -96
5138i6L4j54L56l2l01K75p0K53k44O9k37j88K43K04j23q0p3K12%Q3m9M9j47j16
$$ -96 -62 -216 140 108 -193 82 12 265 21 90 -147 -335 -92 112 -11 -91 -164 48 48 131 82 131 -16 -132
5162a32O5K1L8j22K55l63J23l1j03K82l51L17j37K35q6j01N2k8J97j64J29Mk62
$$ -132 -67 -46 -8 -130 125 -238 -115 -146 -249 33 -318 -1 -138 97 11 -90 -38 -66 131 -33 96 100 -162
5185a62J40L51n33M52l67K00J58j53r3r7M35l37o3j66K82j96L12j14j78L08k44
$$ -162 -22 329 -204 248 -119 81 239 86 -7 -104 331 -6 -69 -235 47 -149 163 49 -129 179 -65
5206f5L11oj77L7l29J81nqJ81j24jK1j20K41r2j75L61k50m9K02l59L32j90K66
$$ -65 246 240 63 100 -229 -48 -53 -61 120 -4 -5 16 -104 137 45 -130 231 -19 -68 134 -225 107 -83 183
5230A83o6j82J38k16M30l30R0j70K71p7j50j63L86o5j09K4k64K05P6J39k75J21
$$ 183 117 -65 73 -143 287 -43 47 -123 148 71 -79 -242 144 79 -30 -6 -270 -65 11 150 -125 -4
5252dj8j50M54k73rl4m4J1J1L05k70O1J1j05k0K27q6m0J05k06J37J6n7K66m47
$$ -4 -22 -172 282 9 0 -34 -78 -67 -56 249 -21 40 51 -54 -74 153 67 27 132 -74 63 79 22 288 -159
5277a59K04q7L74j95j19q1N0J79m31L60k81L00j47K83k52O1l5j53k1J67n4l1P5
$$ -159 45 -42 332 137 18 -63 -13 166 -265 95 -186 114 -33 250 -2 59 24 -129 -150 17 -37 -68 7
5300Gj68M5L5N0J19Mk18R5o8K2L25j72lk19J07K07k48J83j91j33J43j70L65j7
$$ 7 -161 -116 -81 -31 88 92 -126 -31 -99 -77 248 76 73 -146 -39 168 -80 103 -88 -221 -78 -248 117 100
5324A00k50p9QJ40p4J88q5L7Rj37J5O3J53r1l44J62K14j30M35m21j21K65k40L57
$$ 100 -150 -229 -221 -81 -155 33 -52 -15 -6 -143 -128 -65 88 -3 -347 -185 29 -101 334 -87 -208 57 -183 174
5348A74j55K48l24J30j42Q4K00j99l1J11q7R5J55l13L94j79m17L79j56K8K32k40
$$ 174 19 267 -57 73 -69 15 215 16 -15 96 9 104 259 -54 340 161 -256 123 -33 -5 227 -13
5370a3p4K2k2Qq5J28J29j49M7J30l7j93j24L32p3k03L9P4j06n1R3M6J21pR4k55
$$ -13 -87 -65 -87 -79 -164 -36 93 -56 -9 121 84 -109 -233 99 26 -177 -138 -64 -170 -221 -128 -82 39 32 126 -129
5396a29K25Q8k22K18n32J90K73J31j81k55L7J76lk22J79J00k3M2m1o5J30j44K57
$$ -129 96 184 -38 180 -352 -162 111 242 61 -194 -157 19 16 -206 -27 73 50 92 51 -14 116 -28 229
5419B29j69j16J13j19j6M6J61l11J84J37p0j33J4M20k08j19J95l36Nk7L17j97
$$ 229 60 -56 57 -62 -78 -32 129 -182 2 139 69 -64 -50 370 162 43 238 -98 -93 -120 197 0
5441@j22K25k37N0pK91j17j85N3m4J31q3J52k64L65m21J73M8j66O1L7K72l42K48
$$ 0 -122 103 -134 -84 -91 200 83 -102 -49 -93 38 -45 107 -157 208 -213 -40 8 -158 -97 -60 212 -130 118
5465A18j36k9P3K3o2j19J79m8n2j58K20Q8P0k58l05P45k92l5J1n8M3o4J95j74
$$ 118 -18 -47 26 49 -13 -132 47 -1 -53 -211 9 97 167 -91 -396 349 57 22 33 -25 18 -46 149 -25
5489b5j29M7M13k41j84j0o3M77j61Pk44K12n1J19j30j15K29k99K87j88J72j74
$$ -25 -154 -107 306 65 -119 -129 -192 285 124 131 -113 99 48 167 37 -78 151 -148 139 -49 123 -51
5511e1m4K06j89K1Q7l6nr2k4L51k31K04j4r4j6L7m7q9j04L38m43L06p0L7J91l17
$$ -51 -95 111 -78 -57 30 -6 -11 -103 -127 224 -7 197 183 89 73 110 63 -26 -130 208 -235 71 1 38 229 -88
5537h8OJ73r9J22j44k8K20j28j8j46K16j5j74l0k6J49M5k3l13M74N0k56K15l63
$$ -88 -82 91 -8 114 -30 -58 162 34 16 -130 86 71 -103 -133 -159 -10 35 12 -301 173 223 -33 182 -181
5561a81M43k80M0N6J49k85L11J07o00K56N0K22k37p5O2K16m40J47J76k95J60%
$$ -181 262 -18 22 78 227 -58 253 360 -240 16 66 288 51 -24 38 254 -186 -39 137 -158 2 2
5583BK26lk01K47k16K38n59J52K01j8mn0k03M74k65l1mq7j62J55M7M10p7j82j36
$$ 2 228 225 24 271 55 293 -266 -114 87 69 65 15 -188 286 21 -10 -14 -101 -263 -108 -61 349 272 90 -46
5608d6J32j59r0nL07o7l37L18l12K08j63K44j12j10K75l19L39k10J80q4j33J65
$$ -46 86 -73 -163 -168 139 72 -265 53 -259 -51 -214 30 -82 -192 83 -236 103 -107 73 -11 -144 21
5630B1j1N9N4l54J94N3mj27J42qrJ85j66j91K38n7p3L50k23j30Q1J16j37J3n9
$$ 21 10 69 123 -231 -37 16 12 -115 27 19 10 195 29 -162 76 19 -54 296 73 -57 24 140 3 16 -43
5655d3j02O7J09r5k4K74n0k73l8L4J22j79M02o1o0J87k61q4K50N7l10J39qK1j28
$$ -43 -145 -78 31 -64 -88 186 136 -137 -175 -141 -19 -198 204 143 83 270 9 -75 175 232 -78 61 53 74 -54
5680e4r1p0K66k45J46j24M4M2J1K9M7l17L37q9l3J87k67N3l1K76m42K85J10j65
$$ -54 -145 -215 51 -194 -48 -172 -128 -86 -75 -46 1 -316 21 -68 -101 86 -181 -128 -159 117 -325 -40 70 -95
5704i5p0j49J23o6L75Kj80Q4J77j36O7l2m09K75o0K37Q5k77M1k32R6R5P6j57L53
$$ -95 -165 -314 -191 -257 118 120 -60 24 201 65 132 100 -309 -34 -94 143 228 -49 -8 -240 -144 -49 27 -130 223
5729B23n04K69K99l39N3L1m6o4K51k26P0rK26n2j67j06J8JL61m35RN53l78O7J26
$$ 223 -281 -12 287 -52 1 32 -14 -78 173 -53 17 8 234 182 15 -91 -73 -72 289 -146 -137 416 38 105 231
5754B31k34L8j8P3J26o1j92l4K28j2q6j34K77j69l42N11l22k4Q1K58j99o4P3r6
$$ 231 -3 35 17 90 216 155 -37 -71 157 145 59 -75 202 33 -309 202 -120 -144 -63 195 -4 -68 5 -91
5778i1q7J11L10k48K21k9k95Oj7j33K03O0Q9J0q5J42l34M2L04j07J56j28r4K78
$$ -91 -178 -67 243 -5 216 187 -108 -102 -119 -252 -49 11 100 110 25 167 -167 -125 179 72 228 100 6 284
5802B84k42L9j16M25l22q2n1J6L2K93k0l34J40r0L3l7kj8k75M88M3o5Q0j74J38
$$ 284 42 81 -35 390 68 -14 -65 -49 -17 276 256 -78 62 -28 5 -32 -34 -52 -327 161 204 139 219 45 183
5827A83l74K75j73Q5J26l18K18Nj75l2K85k09J44p4KJ82l94K48R4r2Rl18M62j53
$$ 183 -191 84 -89 -4 122 -196 22 27 -148 -180 105 -104 40 -34 -32 150 -244 4 98 6 15 -303 159 6
5851Fq3N1LJ6j45J08R6k19j76K85k8J33o9J34l10J1K41K0o2jP9%j45J99l1J25
$$ 6 -77 -26 -23 -7 -152 -44 52 -167 -343 -58 -86 47 -22 112 -198 -187 54 74 12 11 90 90 -55 144 113 238
5877B38L6j55j73N2J19Q8k01Q0J35k10J3p8K28j32K1J02o0k07J47l2l41J83J16
$$ 238 274 119 -54 -2 117 205 4 84 219 9 22 -56 172 40 61 163 103 -104 43 11 -330 -147 -31
$$ [...]
8191G6
##END NTUPLES=NMR FID
##END=
