##TITLE=1H_Pr dep-29
 CDCl3
 8 sc, 
 29.06.2022
##JCAMPDX= 6.0         $$ Bruker NMR JCAMP-DX V2.0
##DATA TYPE= NMR FID
##DATA CLASS= NTUPLES
##ORIGIN= UXNMR, Bruker Analytische Messtechnik GmbH
##OWNER= root
$$ XWIN-NMR		Version 3.5
$$ Wed Jun 29 16:50:30 2022 Russian Standard Time (UT+4h)  she@DPX200
##.OBSERVE FREQUENCY= 200.1313499994
##.OBSERVE NUCLEUS= ^1H
##.DELAY= (6, 6)
##.ACQUISITION MODE= SIMULTANEOUS
##.ACQUISITION SCHEME= undefined
##.AVERAGES= 8
##.DIGITISER RES= 18
##SPECTROMETER/DATA SYSTEM= spect
##.PULSE SEQUENCE= zg30
##.SOLVENT NAME= CDCl3
##.SHIFT REFERENCE= (INTERNAL, CDCl3, 0, 15.7039)
##AUDIT TRAIL= $$ (NUMBER, WHEN, WHO, WHERE, WHAT)
$$ ##TITLE= Audit trail, XWIN-NMR		Version 3.5
$$ ##JCAMPDX= 5.01
$$ ##ORIGIN= Bruker BioSpin GmbH
$$ ##OWNER= she
$$ F:/spectra/data/she/nmr/H-F/1/audita.txt
$$ ##AUDIT TRAIL=  $$ (NUMBER, WHEN, WHO, WHERE, WHAT)
(   1,<2022-06-29 16:46:26.25 +0400>,<she>,<DPX200>,
      <created by zg, POWCHK disabled, PULCHK disabled
       configuration hash MD5:
       00 E9 B6 7A A2 85 ED C7 34 08 36 98 17 FE 4E 26
       data hash MD5: 16K
       A9 38 1C 99 3E 07 8B 32 9D 0A 4E BA 7A 28 25 7E>)
$$ ##END=
$$ 
$$ hash MD5
$$ 74 AC F4 29 3C 16 E2 F0 BF 74 51 9A CE 01 74 F6
##$RELAX= 
##$RELAX= 
##$RELAX= 
##$RELAX= 
##$RELAX= 
##$RELAX= 
$$ Bruker specific parameters
$$ --------------------------
##$DU= <F:/spectra>
##$EXPNO= 1
##$NAME= <H-F>
##$PROCNO= 1
##$TYPE= <nmr>
##$USER= <she>
##$AMP= (0..31)
100 100 100 100 100 100 100 100 100 100 100 100 100 100 100 100 100 100 
100 100 100 100 100 100 100 100 100 100 100 100 100 100 
##$AQSEQ= 0
##$AQ_mod= 1
##$AUNM= <au_zg>
##$AUTOPOS= <>
##$BF1= 200.13
##$BF2= 200.13
##$BF3= 200.13
##$BF4= 200.13
##$BF5= 200.13
##$BF6= 200.13
##$BF7= 200.13
##$BF8= 200.13
##$BYTORDA= 1
##$CFDGTYP= 0
##$CFRGTYP= 5
##$CHEMSTR= <none>
##$CNST= (0..31)
1 1 145 1 1 1 1 1 1 1 1 1 1 1 1 1 1 1 1 1 1 1 1 1 1 1 1 1 1 1 1 1 
##$CPDPRG= <>
##$CPDPRG1= <>
##$CPDPRG2= <>
##$CPDPRG3= <>
##$CPDPRG4= <mlev>
##$CPDPRG5= <mlev>
##$CPDPRG6= <mlev>
##$CPDPRG7= <mlev>
##$CPDPRG8= <mlev>
##$CPDPRGB= <>
##$CPDPRGT= <>
##$D= (0..31)
0 1.2 0 0 0 0 0 0 0 0.06 0 0.03 0 0 0 0 0.0002 0 0 0 0 0 0 0 0 0 0 0 0 
0 0 0 
##$DATE= 1656506785
##$DBL= (0..7)
120 120 120 120 120 120 120 120 
##$DBP= (0..7)
150 150 150 150 150 150 150 150 
##$DBP07= 0
##$DBPNAM0= <>
##$DBPNAM1= <>
##$DBPNAM2= <>
##$DBPNAM3= <>
##$DBPNAM4= <>
##$DBPNAM5= <>
##$DBPNAM6= <>
##$DBPNAM7= <>
##$DBPOAL= (0..7)
0.5 0.5 0.5 0.5 0.5 0.5 0.5 0.5 
##$DBPOFFS= (0..7)
0 0 0 0 0 0 0 0 
##$DE= 6
##$DECBNUC= <off>
##$DECIM= 32
##$DECNUC= <off>
##$DECSTAT= 4
##$DIGMOD= 1
##$DIGTYP= 9
##$DL= (0..7)
0 120 120 120 120 120 120 120 
##$DP= (0..7)
150 150 150 150 150 150 150 150 
##$DP07= 0
##$DPNAME0= <>
##$DPNAME1= <>
##$DPNAME2= <>
##$DPNAME3= <>
##$DPNAME4= <>
##$DPNAME5= <>
##$DPNAME6= <>
##$DPNAME7= <>
##$DPOAL= (0..7)
0.5 0.5 0.5 0.5 0.5 0.5 0.5 0.5 
##$DPOFFS= (0..7)
0 0 0 0 0 0 0 0 
##$DQDMODE= 0
##$DR= 18
##$DS= 0
##$DSLIST= <SSSSSSSSSSSSSSS>
$$ [...]
##$SUBNAM2= <"">
##$SUBNAM3= <"">
##$SUBNAM4= <"">
##$SUBNAM5= <"">
##$SUBNAM6= <"">
##$SUBNAM7= <"">
##$SUBNAM8= <"">
##$SUBNAM9= <"">
##$SW= 18.0517283424941
##$SWIBOX= (0..15)
0 0 2 0 0 0 0 0 0 0 0 0 0 0 0 0 
##$SW_h= 3612.71676300578
##$TD= 16384
##$TD0= 1
##$TE= 0
##$TE2= 300
##$TE3= 300
##$TEG= 300
##$TL= (0..7)
0 120 120 120 120 120 120 120 
##$TP= (0..7)
150 150 150 150 150 150 150 150 
##$TP07= 0
##$TPNAME0= <>
##$TPNAME1= <>
##$TPNAME2= <>
##$TPNAME3= <>
##$TPNAME4= <>
##$TPNAME5= <>
##$TPNAME6= <>
##$TPNAME7= <>
##$TPOAL= (0..7)
0.5 0.5 0.5 0.5 0.5 0.5 0.5 0.5 
##$TPOFFS= (0..7)
0 0 0 0 0 0 0 0 
##$TUNHIN= 0
##$TUNHOUT= 0
##$TUNXOUT= 0
##$USERA1= <user>
##$USERA2= <user>
##$USERA3= <user>
##$USERA4= <user>
##$USERA5= <user>
##$V9= 5
##$VALIST= <valist>
##$VCLIST= <CCCCCCCCCCCCCCC>
##$VD= 0
##$VDLIST= <DDDDDDDDDDDDDDD>
##$VPLIST= <PPPPPPPPPPPPPPP>
##$VTLIST= <TTTTTTTTTTTTTTT>
##$WBST= 1024
##$WBSW= 4
##$XGAIN= (0..3)
0 0 0 0 
##$XL= 0
##$YL= 0
##$YMAX_a= 62362
##$YMIN_a= -113824
##$ZGOPTNS= <>
##$ZL1= 120
##$ZL2= 120
##$ZL3= 120
##$ZL4= 120
##$ABSF1= 10
##$ABSF2= 0
##$ABSG= 5
##$ABSL= 3
##$ALPHA= 0
##$AQORDER= 0
##$ASSFAC= 0
##$ASSFACI= 0
##$ASSFACX= 0
##$ASSWID= 0
##$AUNMP= <proc_1d>
##$AZFE= 0.1
##$AZFW= 0.1
##$BCFW= 1
##$BC_mod= 2
##$BYTORDP= 1
##$COROFFS= 0
##$CY= 11.3945322036743
##$DATMOD= 1
##$DC= 2
##$DFILT= <>
##$DTYPP= 0
##$F1P= 2.36226072786647
##$F2P= -0.459571619588291
##$FCOR= 0.5
##$FTSIZE= 0
##$FT_mod= 4
##$GAMMA= 1
##$GB= 0.15
##$INTBC= 1
##$INTSCL= 1
##$ISEN= 128
##$LB= 0.24
##$LEV0= 0
##$LPBIN= 0
##$MAXI= 10000
##$MC2= 0
##$MEAN= 0
##$ME_mod= 0
##$MI= 1.114404
##$NCOEF= 0
##$NC_proc= 0
##$NLEV= 6
##$NOISF1= 3.799351
##$NOISF2= 2.8
##$NSP= 1
##$NTH_PI= 0
##$NZP= 0
##$OFFSET= 15.70392
##$PC= 1
##$PHC0= -18072.44
##$PHC1= 42.60069
##$PH_mod= 1
##$PKNL= yes
##$PPARMOD= 0
##$PSCAL= 0
##$PSIGN= 0
##$REVERSE= no
##$SF= 200.130013532006
##$SI= 16384
##$SIGF1= 3
##$SIGF2= 2
##$SINO= 400
##$SIOLD= 16384
##$SREGLST= <1H.CDCl3>
##$SSB= 0
##$STSI= 0
##$STSR= 0
##$SW_p= 3612.71676300578
##$SYMM= 0
##$S_DEV= 0
##$TDeff= 0
##$TDoff= 0
##$TI= <>
##$TILT= no
##$TM1= 0
##$TM2= 0
##$TOPLEV= 0
##$USERP1= <user>
##$USERP2= <user>
##$USERP3= <user>
##$USERP4= <user>
##$USERP5= <user>
##$WDW= 1
##$XDIM= 8192
##$YMAX_p= 0
##$YMIN_p= 0
$$ End of Bruker specific parameters
$$ ---------------------------------
##NTUPLES= NMR FID
##VAR_NAME=  TIME,          FID/REAL,        FID/IMAG
##SYMBOL=    X,             R,               I
##VAR_TYPE=  INDEPENDENT,   DEPENDENT,       DEPENDENT
##VAR_FORM=  AFFN,          ASDF,            ASDF
##VAR_DIM=   8192,          8192,            8192
##UNITS=     SECONDS,       ARBITRARY UNITS, ARBITRARY UNITS
##FACTOR=    0.0002768,     1,               1
##FIRST=     0,             0,               0
##LAST=      2.2672688,     0,               0
##MIN=       0,             -113824,         0
##MAX=       2.2672688,     62362,           0
$$ Real data points
##PAGE= N=1
##DATA TABLE= (X++(R..R)), XYDATA
0@%%%%%%%%%%%%%%%Qj6J6j6J6j6K4l2L2m0M8n6O9p7Q8j04J20j36J52j70J94k20
37a16K44k72L04l41L80m20M66n16N72o34O98p69Q48r33J028j132J249j379J523
56H00j688J877k092K344k645L007l454M023m776N829p417J0107j5861N2505p0068
71b7509n8807J23430K3046o9945k9988M0630M853j538L758j7105k6303L1728L7988
84C4238j7928m3923P798L9763M640l4529p818K1204P174j3876k565K71p879Q750
98d680K0523j9620k6071K5817L0795k3172j9549K6510J1286k5875J849K2159j3178
111F794j6104K1535N105l1190m004K9080n877l1586J2001L1005j7336l0706K0053
124a1230L1907j6328k5779J9737K4046j8748j5963K0264J0426j9675o215J7584
$$ plain form
0 0 0 0 0 0 0 0 0 0 0 0 0 0 0 0 0 8 -8 8 -8 8 -8 16 -16 16 -24 24 -32 37 -40 48 -56 64 -72 80 -90 104 -116
37 -116 128 -144 160 -181 199 -221 245 -271 301 -333 365 -404 444 -489 539 -593 656 -723 800
56 800 -888 989 -1103 1241 -1404 1603 -1851 2172 -2604 3225 -4192 5915 -9946 42559 -27509
71 -27509 -86316 37114 60160 -9785 -39773 857 5710 4172 7930 -9175 -35478 -3750 34238
84 34238 16310 -27613 -19815 19948 24588 -9941 -17759 3445 10619 -3257 -5822 -5551 -13430 -4680
98 -4680 15843 -3777 -29848 -4031 26764 3592 -15957 10553 21839 -4036 -2187 19972 6794
111 6794 -9310 12225 17330 -13860 -17864 11216 5339 -26247 -14246 16759 -577 -31283 -11230
124 -11230 20677 4349 -21430 -1693 22353 3605 -12358 7906 18332 -1343 -7558 10026
136A0026k23j7799K544J1914o376o030P826j146j0394O985J5398q337j6087R551
150b148J4074q680r602O392K869q535K588J0246j0501j5429J3666J8834j2216
163A558j8416R704J7199l402p207K610rM00R549L18j6572l077J8285M103k0887
178e844q828J6281O145j3329o388P651L681m026J627K963n209r00J1485M207j1443
193a927n330J1071P985q214p067K501K248J931J656n539p295O157J0642n766j1843
208h790N977J1270n358q277N205O084n769m881M585K599m381j714J306o77n02
223c323J706q8k955J039N853J75m366J848N279o15l845K297M517m008m714M206
239C006K300n723l456L868R51m915j71L204j961k239L206K323l001o16M030J057
$$ plain form
136 10026 9803 -7996 -5452 6462 86 -5944 1882 736 -9658 -2673 12725 4388 -11699 -2148
150 -2148 11926 3246 -6356 36 2905 -5630 -3042 7204 -3297 -18726 -5060 13774 1558
163 1558 -16858 -7154 10045 6643 -564 2046 2037 2437 11986 12304 -4268 -7345 10940 15043 -5844
178 -5844 -14672 1609 7754 -5575 -11963 -4312 -631 -4657 -3030 -67 -5276 -6176 5309 9516 -1927
193 -1927 -7257 3814 11799 3585 -3482 -981 1267 3198 4854 -685 -7980 -1823 8819 3053 -8790
208 -8790 -2813 8457 3099 -5178 27 6111 342 -4539 46 2645 -1736 -3450 -2144 -2821 -3323
223 -3323 -1617 -1705 -4660 -3621 2232 2407 -1959 -111 5168 4553 708 3005 7522 3514 -1200 3006
239 3006 5306 -417 -3873 -5 946 -3969 -4140 -936 -2897 -5136 -1930 393 -2608 -3224 806 1863
255A863k686J478K214k784o36L105L34l767n11L689N9m237M06M094q32k893J050
272e4L188p13l327Q11K341j348j152L55j152k067J491J702k594k756K696K112
288d67k126K89K569j34j685K667L392j715l244K998K830j691k296J53M83j374
304F49k16M19j465k250J061Q14j065q45J504O98k032N18L188l04k472R00K123
321A225j45r21J59M2j525J283K281j506k385J002K704J10j795l64J274m2NM61
339A863r26j229L60O33p21k320P91O79j976k98J541L69j755j29K627J082o47N6
357@P38N40Q62Q48o54r41R0J271k53j701q40J84P2m34k46m45j119J2J950l1j739
378a836l00J853K43p89M6O48m03j89J017l58j90O48k12m16J72J150L08q13j30
$$ plain form
255 1863 -823 655 2869 85 -551 2554 2888 -879 -1390 2299 2358 -1879 -1473 2621 1789 -1104 -54
272 -54 3134 2421 -906 -95 2246 898 -254 101 -1051 -3118 -1627 75 -2519 -5275 -2579 -467
288 -467 -2593 -2304 265 131 -1554 1113 4505 2790 -454 2544 5374 3683 1387 1540 2023 649
304 649 433 852 -613 -2863 -1802 -988 -2053 -2898 -1394 -696 -2728 -2210 978 674 -1798 -898 1225
321 1225 1080 159 318 360 -1165 118 2399 893 -1492 -490 2214 2324 529 165 1439 1397 1402 1863
339 1863 937 -292 68 701 -20 -2340 -1549 -870 -2846 -3144 -1603 -1234 -2989 -3118 -491 591 -56 0
357 0 738 1278 2140 2988 2334 1393 1483 2754 2501 800 -40 144 216 -218 -464 -909 -2028 -2016 -66 -97 -1836
378 -1836 -2136 -283 -40 -829 -783 -135 -538 -727 290 -68 -258 390 178 -238 -66 1084 1392 579 449
397D49R20P91k17r85p47J121M16j211p84n47j83r1j69j33q03J57k4k54J091R69
417b34q25o15J376J477N82n40m32j42R02K130r11l346m45L118J689l166l359J099
435a642L347o4k632j744J210J974j41j277r69J14J886O55j323j482Q31J978J37
452H58j814n81J743J571j131j401J667J444q90j083L96R92K49r24m18J31n28m93
470b12j41qj001r61R49J006j879o38K179K98j678N34K872n19k418J512K856k53
488B498k453p18K074J517p89k067K53J224j156j471J977M52k861l85L191R5l123
505a742q05J613J106j66n96j446k48J817J267l80j358j303O23L773J027m078k368
522c264N246L523m213l364K509K320M42j115k616j049K275K174l390k886J655
$$ plain form
397 449 1369 2160 1943 958 211 1332 1748 537 -247 -794 -977 -1068 -1237 -1370 -2173 -2016 -2040 -2294 -1203 -234
417 -234 -1059 -1674 -298 1179 1761 1221 789 647 1549 3679 2768 -578 -1023 2095 3784 618 -2741 -1642
435 -1642 1705 1641 -991 -2735 -1525 449 308 -969 -1938 -1824 62 717 -606 -2088 -1257 721 858
452 858 -956 -1537 206 1777 646 -755 912 2356 1466 383 779 1771 2020 1096 678 809 281 -212
470 -212 -353 -361 -1362 -2323 -1374 -368 -2247 -2885 -706 -408 -2086 -1552 1320 801 -1617 -105 2751 2498
488 2498 45 -673 1401 2918 2129 62 315 1539 383 -1088 889 1341 -1520 -1905 1286 1381 -1742
505 -1742 -2547 -934 172 6 -590 -2036 -2284 -467 800 420 -938 -2241 -1618 2155 3182 -896 -3264
522 -3264 1982 5505 1292 -2072 437 2757 3199 2084 -532 -1581 694 2868 -522 -3408 -1753
537a753K310K85k486k921J413N356L07n979j164N415K779l744j530J750P17J269
553B024M76k865r64L047J714k121k318L24Q87J492L90l213j042L476L34l820J55
570b024K394k20j692M85M97o67J97J65o96J829Q18k076p80K157J594q61o39M0
588E21n47J136K000j679j779J057J001p69o84p92m79N16Q99n76j852M2Q33M08
606g44L79k49j058J062R36r96l62J503R15r92n96R98J08k48M24m55l06L6N47O76
626A578r43j210k08J557O48j413j899M09J933Q53j894k480N33L168L66k479q97
643b378J554J459m23n37k13L97J584O49j289m63M63M46K57l74n49j1M63j72j391
662e28j23P04n66j87M3n76K05O06k36j219R51J598o73j199J008Q12m28j88L74
$$ plain form
537 -1753 557 842 -1644 -4565 -3152 2204 2511 -3468 -4632 783 3562 -182 -1712 38 755 2024
553 2024 2500 -365 -1329 1718 3432 1311 -1007 -683 204 1696 2086 -1127 -2169 1307 1641 -2179 -2024
570 -2024 370 150 -1542 -1057 -560 -1227 -1030 -865 -1561 268 1086 -990 -1770 387 1981 1120 481 521
588 521 -26 1110 3110 1431 -348 709 1710 941 257 -535 -1014 -498 401 -175 -2027 -1985 -1152 -744
606 -744 -365 -614 -1672 -610 326 -670 -1032 471 1386 394 -202 796 904 656 1080 625 319 355 902 1578
626 1578 635 -575 -783 774 1422 9 -1890 -1481 452 1305 -589 -3069 -2536 632 998 -1481 -2378
643 -2378 -824 635 212 -325 -538 -141 1443 2092 803 340 803 1249 1506 1132 583 572 1035 863 -528
662 -528 -651 53 -513 -700 -657 -1233 -1028 -422 -658 -1877 -926 672 -1 -1200 -192 620 192 4 378
681C78q2M18M76j65q81M27O30n13k48Q04o87o18J78M13m99n55m21P2Q41j85j157
702a374lR33k91o49R61L73j098L29J170L70p70L97L66j51P14M77q16q31L19Q86
722A312n10l12k86n14n9O25j82p95q61M35P41K53o72n55O78L59O3l57O28J4m41
743d36N99M16j76N7j46R6N46L01k74q98m3J159l76q53p5O24m21l04j98M61r39
764h80n59P13L70j3o16l83O76K22J52L14o50N00R30m3k84l17O64L21j64N1j27
785H77k65r7J96k36l23m91M19O8p21k19L09r1r5r3J85J40k28P0r2O38J17j88k75
808c95K28P63M17n79l55L19O79j19j60j94k38K25J34l85k96l42l3J73J46k43o60
829i15j60M37pJ18j55l32L80K66J90P3J18j63K51L52M08k20k86r7L75L39n9n47
$$ plain form
681 378 296 714 1190 1025 144 571 1201 688 440 1244 557 -61 117 530 31 -524 -945 -873 -32 -217 -1374
702 -1374 -1377 -444 -735 -1384 -423 -50 -1148 -819 351 721 -49 348 714 563 1277 1754 938 107 426 1312
722 1312 802 490 204 -310 -369 256 74 -721 -1582 -1147 -406 -153 -825 -1380 -702 -343 -280 -637 -9 5 -436
743 -436 163 579 403 460 314 410 956 1257 983 85 42 1201 825 -28 -103 521 100 -204 -402 59 -880
764 -880 -1439 -726 -356 -369 -985 -1368 -692 -470 -318 -4 -654 -154 776 733 449 132 796 1117 953 1004 877
785 877 612 515 711 475 152 -339 80 148 -573 -792 -483 -574 -669 -762 -577 -437 -665 -595 -687 -49 68 -120 -395
808 -395 -167 596 1013 434 79 398 1077 958 798 604 366 591 725 340 44 -298 -331 -158 -12 -255 -915
829 -915 -1075 -638 -645 -527 -682 -1014 -634 -368 -178 -105 13 -150 101 453 861 641 355 258 633 972 913 366
851C66k69Q5J82J75l50n45l58J91N16o5p94k12L06M98P5k45k38k4N09N90k29j65
873aLK3Q31J72n60Lm1J97L12j44m47j67J80K33o41j99n2l4Q5k85k05J98J18j99
897f20M9k23k0N02J51l14K43P12j6m92K13M82J28N5n59m0L69P5J26m43p14J85
919a51N29J6o92l33nL51P5k07n31p0N63N2L35k80l98L97N00M5Q0k52o7N70M40
942I67j85k54k48O16k68K3j13j78m72K08K20j93q58k70Q04j58k86J03p1j35P1
963f77N14k0n12K56M60p5O7K89J09j55k8O72k97L3J58k02k13J83l27m9L56o13
985g1k38K67O3p23j86J65N28m13N25q10n41J213P60p82o95M72J186j77n6n38k05
1006b56P53J126n47j305N67M16l23k60P9n48L90K41l05n35n2J15q4L66m60k07
$$ plain form
851 366 97 182 364 539 189 -356 -714 -523 -7 -72 -866 -1078 -772 -274 -199 -444 -682 -706 -197 393 164 -1
873 -1 2 25 856 1028 468 471 430 627 939 795 348 181 361 594 -47 -246 -298 -332 -247 -532 -737 -539 -421 -620
897 -620 -571 -794 -814 -312 -161 -475 -232 480 464 -28 185 667 795 850 291 251 620 695 821 378 -336 -151
919 -151 378 394 -298 -631 -636 -285 -210 -417 -948 -1018 -455 -403 -68 -348 -746 -349 151 196 276 24 -43 527 967
942 967 782 528 280 896 628 651 538 360 -112 96 316 123 -735 -1005 -201 -359 -645 -542 -613 -748 -677
963 -677 -163 -183 -695 -439 21 -54 13 302 411 256 228 900 603 636 794 592 379 562 235 186 542 -71
985 -71 -309 -42 21 -702 -888 -723 -195 -608 -83 -893 -1434 -221 539 -243 -938 -466 720 543 487 -51 -256
1006 -256 497 1623 1076 -229 338 754 431 171 250 -298 92 333 28 -507 -559 -444 -528 -162 -622 -829
1026h29L83L30o06K49R79l22j187Q48J037n16n44J038k62l18K91N34p53m32P64
1045F84j6o06k61K86j63o4j2j93q4Rm31J7P03O4p79K93J92n7K07N02m52j01M79
1068B17M05j48o62M11K64K47N05p45j045Q02N00m66m11M36m06o46N23O50r63n26
1088a058L63O83j76o26J23O78Q0k20K3J58J08k09O28K90q71m5O02Mk16L25K02
1109H46k33o10O4J83l84j50k5r5Q3L1l46j92J50j8P01m18n14L62M09P5mJ76p8
1132A3m20Q93K55m16R2M71l37l93J07N39p72l20R67k25m92l73j24JK17Q4k39l42
1154h14J58M8M40j27k75o2P70J38l96J68J48K6O5N32l20n67M37L79k93j04M00
1175G51n92l53M59J63m13k93P3m8l65L91j78k68P3M92l5m13K69K10j17K45K1l0
$$ plain form
1026 -829 -446 -116 -722 -473 506 184 -1003 -155 882 366 -178 860 598 280 571 1105 352 -80 684
1045 684 668 62 -199 87 -76 -140 -152 -345 -429 -420 -851 -834 -131 -67 -846 -553 -361 -418 -211 291 -161 -262 217
1068 217 622 474 -188 223 487 734 1239 494 -551 251 751 285 -126 310 -96 -742 -219 431 -532 -1058
1088 -1058 -695 -12 -188 -814 -691 -13 67 -153 -130 28 136 -73 555 845 -26 -71 531 535 319 644 846
1109 846 613 3 67 250 -134 -284 -309 -404 -321 -290 -636 -828 -678 -696 5 -413 -927 -565 -156 -81 -85 91 13
1132 13 -407 486 741 325 417 888 551 158 265 804 32 -288 679 454 -38 -411 -535 -534 -317 -233 -472 -814
1154 -814 -656 -608 -168 -295 -570 -632 138 276 -120 48 196 222 287 819 499 -68 369 748 455 351 751
1175 751 159 -194 265 428 15 -278 -205 -253 -618 -227 -405 -673 -600 -108 -143 -556 -287 -77 -194 51 72 42
1197D2J59J41Q1L48j63k68q3N69l71j01p1j18l09r3M35m67l72L51L02j98m62R1
1219e57J27k43L58K74q1j52J88P6J07m1M2L07k07M0M55l08k44k53M97L69n65k01
1241a2P4k45K17j6O4n86J5J59J87k69j24J63r7K57J86q1l14%Q96k31j39R4K9J02
1265C29K34J25m1m06j55M88m2m53j36jL0j48K4Q3k44j39O1J82m7m55L59O2m5L67
1289C2J55k58mK6L24%j32J57K18P3k96M03m26k96L15K01l51k19k1J15k79Q1K8
1312a54n18K42K64lj54l36L28Q3P1P1L3M9J53O8J27K98m42J27J48Q7J38l18k07
1335A55k06J74L41l21l75Q6K33k56p6r2j53L3O3J77J00l25j45K84K98J24p9j83
1357a43J16L02K14k9l73l9K50L22j54k74k2l46L86kl64o4k17K6M39k00l56J03
$$ plain form
1197 42 201 342 423 771 608 340 257 826 455 354 283 165 -144 -237 198 -269 -641 -290 12 -186 -648 -557
1219 -557 -430 -673 -315 -41 -122 -274 -86 -10 97 56 98 405 198 238 693 385 141 -112 385 754 189 -12
1241 -12 62 -183 34 18 82 -504 -489 -330 -143 -412 -536 -373 -470 -213 -27 -108 -422 -422 474 243 104 198 227 329
1265 329 563 688 647 241 86 574 532 79 -57 -58 -28 -176 -152 -69 -313 -452 -391 -209 -256 -711 -352 -290 -335 32
1289 32 187 -71 -75 -49 275 275 143 300 518 591 295 698 272 -24 291 492 141 -78 -99 16 -263 -182 -154
1312 -154 -672 -430 -166 -169 -323 -659 -331 -248 -177 -106 -73 -24 129 197 324 622 180 307 455 542 680 362 155
1335 155 -51 123 464 143 -232 -146 87 -169 -245 -337 -490 -457 -394 -217 -117 -442 -587 -303 -5 119 40 -143
1357 -143 -27 275 489 460 87 48 298 620 466 192 170 -176 210 208 -156 -220 -437 -411 28 -172 -528 -425
1379d25k70L48J63l19qJ06K40K68j61QJ63L9J83P8K1k6j62K25p6j17J88m99n2
1402h5J74L39l89k80j88J19J71q9j11j12j05J18K50J64l25J31K77j53L09o7p6
1423G2M7K96k4Pm9j97J37K50n4l76J74n3j42m3J57l28k41K12k6m32P7j48K53O8
1447c63L35j81k17K01L05M6K6J1J62p5J32J40j04k90L8J85R4m7l71k75L65J03
1469B20j65j88k81J39j81K80j3l04M3L6K19K43l59J02m8L31K44l64m3L43k21K49
1491B82M71k99o16L51L35k58l07K86m12M8K41P9m53j3kl54M65J41l37p6O9L87
1513B8j00l6K85j77k73Q01j00l62J67k30J94J18K50j71l67J88j21R8k86J73m11
1534c32K58K22k60o21M85K67m17K9K67k32j41M98J24k03q4J39k5M14j27J17m6
$$ plain form
1379 -425 -695 -347 -184 -503 -511 -405 -165 103 -58 -50 113 152 335 413 434 408 246 471 395 278 466 -33 -85
1402 -85 89 428 39 -241 -429 -310 -139 -228 -339 -451 -556 -438 -188 -24 -349 -218 59 -94 215 148 72
1423 72 119 415 391 398 349 152 289 539 485 109 283 230 88 45 202 -126 -367 -155 -181 -613 -536 -684 -431 -363
1447 -363 -28 -209 -426 -225 80 126 152 163 325 250 382 522 418 128 166 351 445 398 27 -248 117 220
1469 220 55 -133 -414 -275 -456 -176 -189 -493 -450 -414 -195 48 -311 -209 -257 74 318 -46 -89 254 33 282
1491 282 753 454 -162 189 524 266 -41 245 -167 -119 122 201 -252 -265 -267 -621 -156 -15 -352 -428 -359 28
1513 28 -72 -108 177 0 -273 528 428 66 233 3 197 315 565 394 27 215 94 192 -94 79 -332
1534 -332 -74 148 -112 -733 -248 19 -398 -369 -102 -334 -475 23 147 -56 -140 -1 -26 388 261 378 332
1555C32K40j63k57k2K70l06J88J48l04m42j15K94J36k18J10l38K04p5p1k9mK18
1577b04n1J46L73j67l20N92L1k40j12J8J53p3J91K98k52o79L48K39o2o4l09j46
1599b90P8p8L04l46j38J71K83J03m59j50K18k6N06O5j30j56k9K38L33k5l59j18
1621eL66K29m49J33j71k83L2N18k01l64J89k58Q1j55R2k65l10N01L98l34R5O7
1643i4l13J91N07r1k42P6K73j43Q2Q7j39K0J7J8p7j99lJ82k11j0l64K24K09l24
1667c24J66K21j40m57K63L06j61p8O7J33j86L10J77k22j38O49k3k61k8j33J09
1688B50M6J91k80j87J27j15j64K76n70O2J95k40m5J47K2K6kJ91J20l46Q4J13L54
1711B55j66J27R7k70J32PK16k76q1J17p0K01l09J12k42L07k9k86k80R6l4K0J89
$$ plain form
1555 332 572 409 152 130 400 94 282 430 126 -316 -431 -137 -1 -219 -109 -447 -243 -318 -389 -418 -422 -204
1577 -204 -255 -109 264 97 -223 369 400 160 48 66 219 146 337 635 383 -296 52 291 229 165 -144 -290
1599 -290 -212 -290 14 -332 -470 -299 -16 87 -372 -522 -304 -330 176 241 111 -45 -74 164 497 472 113 -5
1621 -5 361 590 141 274 103 -180 -148 370 169 -195 -6 -264 -183 -338 -246 -511 -821 -320 78 -256 -161 -94
1643 -94 -407 -216 291 200 -42 34 307 164 246 333 194 214 231 249 172 -27 -30 152 -59 -69 -433 -209 0 -324
1667 -324 -158 63 -77 -534 -271 35 -126 -204 -137 -4 -190 120 297 75 -63 586 563 302 274 141 250
1688 250 296 487 207 20 147 32 -132 144 -426 -364 -169 -409 -454 -307 -285 -259 -261 -70 50 -296 -212 -99 255
1711 255 89 216 313 43 175 182 398 122 41 158 88 289 -20 92 -150 157 128 -158 -438 -342 -376 -356 -167
1734a67k1j08j88O2L69O8m28K55J34K55j16j2Q8rJ53K58o3m91J27L0O5p1l22k6
1758a58J97k35J27K2k71j07K27nl3K3k03L86j52J63k83K81k84M52J27j33K52k77
1780A16j1J53J56J66m57r3J84p0l0j32j32k5J57j37J17k37j3R8J32n3Nl35J66
1803b75K26m9Q6j1j90L46J13j33n8K85j21J14k2n2l08K9L99k92j89J83j02j09
1825a30R1j81M6j17n4O9k1K17k63J78N0lK29k3o8J4J52O2j31J25j50MK21j65K93
1850D45l65K8j6J08qm19J06k8k01K38p0j32m3J21Q1j23L9m1L82nN8N4J02l46K52
1875B17K01j81j25N4K83j85k6j69J07m10J92K61lk40k45P3K40j9m05p0K7P9K77
1898f7j06j44P4K0L15j86K05p7j13Q7M60k61k16P3K32j9q5J17j96N1N1k74j04
$$ plain form
1734 -167 -188 -296 -484 -422 -53 15 -413 -158 -24 231 115 103 191 182 335 593 530 39 166 196 261 190 -132 -158
1758 -158 39 -196 -69 -47 -318 -425 -198 -203 -236 -213 -416 -30 -182 -19 -302 -21 -305 147 274 141 393 116
1780 116 105 258 414 580 123 30 214 144 114 -18 -150 -175 -18 -155 -38 -275 -288 -190 -58 -111 -106 -441 -275
1803 -275 -49 -98 -12 -23 -213 133 246 113 55 340 219 333 311 259 -49 -20 379 87 -102 81 -21 -130
1825 -130 -39 -220 -174 -291 -345 -276 -297 -80 -343 -165 -115 -118 111 88 20 34 186 248 117 242 92 96 317 152 445
1850 445 80 108 92 200 192 -227 -121 -149 -350 -112 -182 -314 -357 -236 -155 -278 -239 -280 102 97 155 209 311 -35 217
1875 217 418 237 112 166 449 264 238 69 176 -234 -42 219 216 -24 -269 -196 44 25 -380 -450 -423 -344 -67
1898 -67 -173 -317 -243 -223 92 -94 111 34 -79 8 468 207 -9 64 296 277 192 309 113 164 215 -59 -163
1921a63J37l73L4L87r9l92j00K36k5J8L00O6n07J75M12J23J35m55K68m3K26o4
1943B96j46L8K20k39m9J75k09m20L28J52pn18k0Mr0J06M04m05L0N9L2K03R3l1
1967Fj36L07l2J1j60J26j19J36q4L26k77J26Pj44J9k83J57k25l4K36k22l2J22
1990a69j33J86m0Q1jj49M11l15M0k82N48N1k1J1o1j03L46j24l47L47j87K0O1j45
2014B5J97n43M10j69P1j10j77n4K2K09l09L7K3J16J01L7J36P5j00P4J47J58K1
2037C97l59j67M33K8j53p9j0l2K08j94J23k72j46J14O4n7k15j61K89K01j94J10
2059g2k48oK60J77R9k99J41J36L3J4o0o1r2L10r9rj9k04RQ0j00K22k17j86l7J89
2085c9k2n4k18P7j00K96J1k91O05n67K85J90l87M6J62L14j16n6J2n6R9J47O3l76
$$ plain form
1921 -163 -26 -399 -365 22 -77 -469 -569 -333 -358 -340 -40 26 -481 -306 106 229 364 -91 177 134 360 296
1943 296 150 188 408 169 120 295 86 -334 -6 146 139 -379 -399 -395 -485 -379 25 -380 -350 -291 -259 -56 37 6
1967 6 -130 177 145 156 -4 122 3 139 55 381 104 230 237 93 112 -171 -14 -239 -273 -37 -259 -291 -169
1990 -169 -302 -116 -156 -75 -76 -225 186 -129 -89 -371 177 228 207 218 157 54 400 276 -71 276 89 109 170 25
2014 25 222 -321 89 -80 -9 -119 -296 -350 -328 -119 -428 -391 -368 -252 -151 -114 22 97 -3 71 218 376 397
2037 397 38 -129 304 332 179 100 90 58 266 72 195 -77 -223 -109 -45 -102 -317 -478 -189 12 -182 -72
2059 -72 -320 -326 -66 111 210 -89 52 188 221 235 175 114 22 332 233 224 205 1 10 90 -10 212 -5 -191 -228 -39
2085 -39 -61 -115 -333 -256 -356 -60 -49 -340 265 -302 -17 173 -214 -168 -6 308 192 136 148 92 191 338 401 25
2109B5J84k26n2J64r0m6k20Q7J00l33P4j7J23j21J64J04k16L08N2Q5J9j40r6k
2133g0L71K09o51J75O6J95K70l17j36j71J69K03n59J04Qm05L88K67k88j63Q5J4
2155b36k5L26q4Pj16K29J88j16L9k32Q0J10J11N7l98J0K34j38J82M8l71j82L35
2178E8R8j51j08j03M0o0J52l03P4K02K04k51J68j87J41P0o8L35l09k33L37k2J40
2201B24O8o7K25l12Q0q7l35K00k44K99j71Mj84J88k91J8J57p7j05L22j40R5MJ04
2225b5J35o6k00J74M0M3K36r3P7j96L3o6m3M6k6j92q7K31m1p5q4l0j08k8K90j79
2251b34qKJ37L7j93K78k7j52L53K0j55J38j2J22j27L7n4l01J6K68k8j11q5J25
2275D6r1L7Q1l40K6j00L21l3n5j6j04J00J51j22k0N1R8K61j3R3j91K4r6K38k31
$$ plain form
2109 25 209 -17 -69 95 5 -41 -261 -174 -74 -407 -333 -350 -227 -348 -184 -80 -296 12 64 149 168 28 -68 -70
2133 -70 301 510 -141 34 100 295 565 248 112 -59 110 313 -246 -142 -134 -539 -151 116 -172 -335 -250 -236
2155 -236 -261 65 -19 -12 -128 101 289 173 212 -20 60 170 281 338 -60 -50 184 46 228 276 -95 -277 58
2178 58 156 5 -103 -206 -166 -226 -74 -377 -303 -101 103 -148 20 -167 -26 44 -24 311 2 -231 106 84 224
2201 224 292 225 450 138 218 131 -204 -4 -248 51 -120 -116 -300 -112 -403 -385 -228 -305 -410 -88 -228 -133 -129 -25
2225 -25 110 44 -156 18 58 101 337 244 321 125 158 92 49 95 69 -123 -210 21 -20 -95 -179 -209 -317 -345 -55 -234
2251 -234 -242 -240 -103 -66 -259 19 -8 -160 193 213 58 196 184 306 179 216 162 -139 -123 145 117 6 -79 46
2275 46 -45 -8 73 -267 -241 -341 -20 -53 -108 -124 -228 -128 23 -99 -119 -68 30 291 278 371 180 204 108 346 115
2300A15J33p0q4K64k95Kk69J02K4j29K36Pk03n0L4J1j63Kj4K80J11l4j23J33K53
2325B73k1j12K05j96m4L4J12N3k79R9j02l6Q4j17%k9j6K73m32l6R7n8j13J47L8
2350a76J26k4l2J30L3j84L79l6k6m2m0K43k70r1K68k8k71J31j20k39M26l22j37
2373c02L19k30J11q8Q3j64N2K40p7k09R8n3L18j3k5l6P0R6p4J02lN3O2o3P9j55
2399A91k27R5j25J99k11k00J45K2k27J97j53Q0j1m7J26kK7n8L0J28M19j87k09
2422Bn5L8K85l4J54n14L89N0n7nk53n5J42J11k15o5n0o8j58J35l0J15q4K9J54
2447c9N0p3j10j69L65j18M17l36m4K04J43k28n7K00L6k26J72j0m3j97J4J12k99
2470b36p4J2L4J20J7Rk6N8r9J92J37J00l88j08N07k33j20O9J68L2n6P5j07j51
$$ plain form
2300 115 248 178 94 358 63 65 -204 -102 -78 -207 29 36 -167 -217 -183 -172 -335 -333 -347 -67 44 10 -113 20 273
2325 273 252 140 345 149 105 139 251 304 25 124 22 -14 70 -47 -47 -76 -92 181 -251 -287 -190 -248 -361 -214 -176
2350 -176 -50 -74 -106 24 57 -127 252 216 190 148 108 351 81 -10 258 230 -41 90 -30 -269 157 -165 -302
2373 -302 17 -213 -102 -190 -107 -271 -219 21 -56 -265 -167 -220 98 85 60 24 94 190 116 218 215 268 330 267 346 191
2399 191 -36 59 -66 133 -78 -278 -133 -111 -338 -141 -294 -214 -225 -272 -146 -148 -121 -179 -149 -21 398 211 2
2422 2 -53 -15 270 236 390 -124 265 315 258 253 0 -55 87 198 -17 -82 -132 -200 -358 -223 -253 -138 -222 -193 -39
2447 -39 11 -62 -172 -341 24 -94 323 -13 -57 147 290 62 5 205 241 15 187 177 134 -63 -49 63 -236
2470 -236 -310 -298 -264 -144 -127 -118 -144 -86 -185 7 144 244 -144 -252 255 22 -98 -29 139 171 115 190 83 -68
2494f8K50o7j03P5j27J13O6j45M6j35r5j15K80j63p2J79p2O9R7j04r6P6K29p2
2518D6o9Q3J77j99K1L02k53L7J27l2k50J54Nk77L4P2p4K24j99k64J2J71p2J83
2542d1k37Q0K72k24J34k23J94K93j04J26j63k2J98l03L98j6l18J9R3L4k86J06
2564A0L2j19j7J22j44m6m8j16K23J8r8l25K39J97J71q1K08l26P9K18k0J90m13
2587d6L05p1n4J26k20j35R2M9J69l40p9K08k55p0K51m5k13J15M5j5J73j22k41
2610c73M10Q7j18r0J75%K5K5J21k32J96l13M70j74K5k15N9j19K83j82j78J23l35
2633c30L45l5j66Q8j81J44j25j11J81j02L57J78k08J7QP3P2j72J85m9j18K19o5
2656B05j6L0k86j94K17L8n1n5j54j25L61j84jJ30l18L59Om3k01J78J40K39O4l47
$$ plain form
2494 -68 182 115 12 87 -40 73 139 -6 40 -95 -190 -305 -25 -188 -260 -81 -153 -84 13 -91 -187 -111 118 46
2518 46 -23 60 237 38 59 361 108 145 272 240 -10 144 149 -128 -94 -22 -96 128 -71 -335 -323 -152 -224 -41
2542 -41 -278 -198 74 -150 -16 -239 -45 248 144 270 107 85 283 -20 378 362 44 63 156 190 -96 10
2564 10 42 -77 -94 28 -116 -162 -210 -326 -103 -85 -183 -508 -269 -72 99 18 226 -100 -21 197 177 367 -46
2587 -46 259 188 134 260 40 -95 -3 46 215 -125 -204 4 -251 -321 -70 -115 -328 -213 -168 -183 -10 -132 -373
2610 -373 37 124 6 -84 91 91 116 141 262 30 226 -87 383 209 234 19 78 -41 242 60 -118 5 -330
2633 -330 15 -20 -186 -98 -279 -135 -260 -371 -190 -292 65 243 35 52 60 133 205 33 218 169 51 270 205
2656 205 189 219 -67 -261 -44 -6 -57 -112 -266 -391 -30 -214 -215 -85 -403 -44 -38 -81 -282 -104 36 275 339 -8
2680hJ33j49K97k06J36m2j6l6J63n0k84K09n7j33Q5o8k24J84k2m5j14J28k20L40
2704Ap5j50R7P0J2jJ45K58k87N0n5O3q7R1K41l15J0l7Q6K6k50NK19j51j6k2K5
2731d7j95J84o8o6p6K4L98j14o7K7R2k18L17l27L18j22K73k43j76J37J02J12l61
2754i6M48l70K8k3P0p3N6k86Q9qn0J4Q8k06K17K0PJ25k23L5J31J82j08q6L03k88
2780dR8j23J90j59q7K97j95L84m12j5q2rL32k32k61J72pN9j05O4k29K52m7O1L35
2805B77j70k52J99J62j46q8L01l35K86j31K31k06l9J03o5m65M12l20M0J17qJ41
2827D4%j87k82M33k73L47j00M1J2oO1j76j91K87J05q1N9Q6N7k77J42m7l8K9K39
2852B84j75j97j74K74m5j13r4J51l58L68K3k57K41m1J92k00J3N2O9K04k20K05
$$ plain form
2680 -8 125 -24 273 67 203 161 145 109 272 222 -62 147 90 -43 42 -26 -250 -66 -88 -133 -247 -119 -339 1
2704 1 -74 -224 -127 -57 -45 -46 99 357 70 120 65 128 41 132 373 58 68 31 117 143 -107 -102 117 -34 -50 -72 -47
2731 -47 -242 -58 -126 -192 -268 -244 154 40 -27 0 92 -126 191 -136 182 60 333 90 -86 51 153 265 -96
2754 -96 352 -18 10 -13 57 -16 40 -246 -157 -165 -215 -201 -113 -319 -102 -82 -75 50 -173 -138 -7 175 67 -19 284 -4
2780 -4 94 -29 161 2 -85 212 17 401 -11 -26 -108 -117 215 -17 -278 -106 -113 -54 -159 -95 -324 -72 -119 -58 277
2805 277 107 -145 54 216 70 -18 283 -52 234 103 334 128 89 192 127 -338 74 -246 -206 -89 -97 44
2827 44 44 -143 -425 8 -265 82 -18 23 35 29 90 -86 -277 10 115 34 93 179 236 -41 101 54 16 45 284
2852 284 109 -88 -262 12 -33 -146 -240 -89 -447 -79 -56 -313 -72 -113 79 -121 -108 -56 13 217 -3 202
2874B02j77J29N0j72j1L08k89J10k12M6J12j30J44k59j25J37l3J58O9o3j63r6
2896b65K73N9l55K73p4J55q5J49P2j95q2M77j67k71J84O5J04J3j25r9j70p4L60
2919B22k30N7J3k44j39J19Qj2O2M9k93M92j40j13J55j01M72l33Mq5J9K19j51J92
2943B42k18k5O1j3K49j45k22oM27n15K84k64k1K6o5L95l13k9J05P4M3j78K22k3
2967I1L5q8N3Lj78M34k21J0Q2l09K41l5j1j01o9j12K22NJ93l58l1J8L0o7j96P3
2993b86J53k7J69N9j44Kk92L96J18Qj43K10k78L44j76n4N6J51j02J82j58j11j13
3016c6l0J86j12o8m0L1L9N5j77q9J70p3J7K32k29J29k09J62J71j73J74M3O7L4
3040B74j14J4j30J50O1j28m1k17J74l35L0J77j42j3K29j26q8j08K89j89J03LK63
$$ plain form
2874 202 25 154 204 32 21 329 40 150 -62 -16 96 -34 110 -149 -274 -137 -170 -12 57 -6 -169 -265
2896 -265 8 67 -288 -15 -89 66 -19 130 202 7 -75 402 235 -36 148 213 317 330 205 106 -64 -138 222
2919 222 -8 49 62 -182 -321 -202 -194 -206 -144 -95 -388 104 -36 -149 6 -95 377 44 48 -37 -18 201 50 242
2943 242 24 -1 60 47 296 151 -71 -77 350 -165 119 -145 -166 -140 -205 190 -123 -152 -47 27 70 -108 114 91
2967 91 126 38 91 94 -84 350 129 139 221 -88 153 118 107 6 -63 -175 47 52 245 -113 -144 -126 -96 -163 -359 -286
2993 -286 -133 -160 9 68 -76 -74 -366 30 148 156 13 223 -55 289 113 59 115 266 164 346 188 77 -36
3016 -36 -66 120 8 -60 -100 -69 -30 25 -152 -241 -71 -144 -127 105 -124 5 -204 -42 129 -44 130 173 240 274
3040 274 160 174 44 194 255 127 86 -131 43 -292 -262 -85 -227 -240 -11 -137 -225 -333 -44 -233 -130 -127 136
3063A36m3l50K65L0M5N7j34J20o6K57j80J27j52k64R2K3O1p6J03j00J0j66n5l5
3087b95J66l3N2R4k98J87m4N5K55j32J13j01J80q2m4p2j73L42K00j52j62r4J50
3110A12OJ50k35j91k6R2J03J6j86pj28J62q4p5J31L55k72l9j9m8J47l4K13j17
3134B6K11j94j79K32l6J68p0j27J18j68K89n27L36j42j64k5K60k37J66m4r9J82
3156b4J4Q4j73J60K36k08j10l3J18j02K06K33j32j37k58M41k27k86L05j01J53
3177A59j75j5l67N1L28R5k06qP3l70M06M8K0q1O4j15k0J90LM4J78l57l1K96k89
3202g9J94J52k83R1Pj08J54j99J83j10J3j23j27K62J0o1j54k0J62K9J4k49J16
3225a26K36j31J83q3j27L06j98J86o9j95J62K6j20J30j72J09j59J68l3j51%o1
$$ plain form
3063 136 93 -257 8 38 83 140 6 126 60 317 137 264 112 -152 -60 -37 24 -52 51 -49 -39 -205 -260 -295
3087 -295 -129 -162 -110 -16 -314 -127 -171 -116 139 7 120 19 199 117 73 1 -172 170 370 218 56 -38 112
3110 112 118 268 33 -158 -184 -92 11 27 -159 -166 -294 -132 -216 -291 -160 195 -77 -116 -135 -183 -36 -70 143 26
3134 26 237 43 -136 96 60 228 158 31 149 -19 270 -257 79 -63 -227 -252 8 -229 -63 -107 -206 -24
3156 -24 -10 74 -99 61 297 89 -21 -54 64 -38 168 401 269 132 -126 315 88 -198 107 6 159
3177 159 -16 -31 -398 -347 -19 76 -130 -138 -65 -435 -29 19 39 -42 22 -93 -113 77 80 124 302 -55 -86 210 -79
3202 -79 115 267 -16 75 82 -26 128 -71 112 2 15 -108 -235 27 37 -24 -178 -198 -36 -7 7 -242 -126
3225 -126 110 -21 162 79 -48 258 60 246 177 -18 144 170 50 180 8 117 -42 126 93 -58 -58 -119
3247a19J6J65npj41k35K15n5K70j28j56K66O0L7k74J92j14M3J78j8k43L5J31K13
3271C26j79k12Q3r9J88k24N9m0K0%j7J7k35K4J24J33J7j70J72J29RQ5k34j05l6
3296a65J60K05m4q9M5lp6J00q6j02j23M0J39M8j05m8j3J73J74k96r1J42O3j10
3320f2J22k04J84j0Q1j8Q0l3k03n2Q2L36l17K4k7n5Q8L4j55q6P5J9J33O5l87K52
3346c4L4k56K73J51k00j47L14j91J43l21J69k0M0J70K3r2R5n9P9k25K38k37J69
3369A16J7R0l41l6L3p9M46k04j72J8N1J27o8k59J70l1J69P5K3Pj27L8J35p2j82
3394e6J29J79j23KR4j42L2N6j07J42j97J60k02pk4J63l0m38L59J92l75L40k36
3417h9p2K90j03J7J30L1j07j72M50l65J0r5K47q6j17J0o9Q5O4n1p0q8P3K8o0J9
$$ plain form
3247 -119 -103 62 57 50 -91 -326 -111 -166 104 -24 -180 86 146 183 -91 101 -13 30 208 190 -53 -18 113 326
3271 326 147 -65 18 -81 107 -117 -58 -98 -78 -78 -95 -78 -313 -289 -165 -32 -15 -185 -13 116 125 210 -24 -129 -165
3296 -165 -5 200 156 67 112 109 33 133 47 -55 -178 -138 1 49 -56 -104 -117 56 230 -66 -157 -15 48 -62
3320 -62 60 -144 40 30 111 93 173 140 -63 -115 -33 303 -14 10 -17 -72 16 50 -105 -191 -116 -97 36 101 -286 -34
3346 -34 0 -256 17 168 -32 -179 135 -56 87 -234 -65 -85 -45 125 148 56 151 92 171 -54 184 -53 116
3369 116 133 223 -118 -154 -121 -200 246 42 -130 -112 -61 66 -2 -261 -91 -122 47 122 145 152 25 63 198 126 -56
3394 -56 73 252 129 131 225 83 115 171 64 206 9 169 -33 -40 -64 99 69 -369 -10 182 -193 147 -89
3417 -89 -161 129 26 43 173 204 97 -75 375 10 20 -75 172 86 -31 -21 -90 -5 59 8 -62 -150 -77 -49 -109 -90
3443i0j93K58k1J63k3l26M7K82j49J47J0k13R8K87j74P3P3k88L57j24k85K20K8
3466A57j88J79O9k34n9k59K02K7q0j3J12j49j83M03j68J06P6J00j13rJ70J20j55
3489A11oN4Ql5K95m97K11P2k44j2M2r8L4Q1j56m3J46k0j0j7k00L69k17O9p0K14
3515H1j85Q4J13n2J04J3r7p0K88k73k1m7J26J09k16P8P1k32K02r8j21l1M53n50
3539b71K04o7J04J94k10P9k4R0r5oj35L52k85K13l40K27J91o2j51%k18L68P3j79
3563E2k27J0O9J38Q0k11P4r3j64K74q2J4r5K06m1J26q3j95J82J08J31l79K61k55
3587a00L59O3k32j79OJ14N6J07k89K11j51k77K00K27j93k2m4J09k13L48l36j8
3609b54J23J78J26k28K64j99q3l3K99m1n5R1M3l6l53J12J89Q2j90J96j73P6k04
$$ plain form
3443 -90 -283 -25 -46 117 94 -232 -185 97 -52 95 105 -108 -10 277 103 176 249 -39 318 194 -91 129 157
3466 157 -31 148 217 -17 -76 -335 -133 -106 -186 -199 -87 -236 -419 -16 -184 -78 -2 98 -15 -24 146 266 111
3489 111 105 159 167 132 427 -70 141 213 -31 -43 -1 -99 -65 16 -140 -183 -37 -57 -67 -84 -284 85 -132 -63 -133 81
3515 81 -104 -20 93 41 145 158 61 -9 279 6 -15 -62 64 173 -43 35 106 -126 76 -22 -143 -174 279 -271
3539 -271 -67 -134 -30 164 -46 33 9 99 4 -2 -137 215 -70 143 -197 30 221 159 8 8 -210 158 231 52
3563 52 -175 -165 -96 42 122 -89 -15 -108 -272 2 -80 -66 -161 45 4 130 47 -148 34 142 273 -106 155 -100
3587 -100 259 322 90 -89 -83 31 87 194 -95 116 -35 -312 -112 115 -78 -100 -144 -35 -248 100 -236 -254
3609 -254 -131 47 173 -55 209 10 -73 -106 193 152 97 188 231 195 -158 -46 143 225 35 231 58 134 -70
3632g0m1o5J94k52j5J44j71K53k4J51p3j20J12j32k2K41j9j83K24j1j94K1R3J97
3656B38j60O3j53j1JK2j6M7o8j95K10L7M1k14kK24j91J55j33J81m0l8j17K44j87
3681f2L37M2k21J49k93J66mp4j06Q9J2L3O9J8l31J37k1K4j59K04o4j64J82j47
3705a84K57nj1k65J87J23q3j1j22J31P2j4j79L41l2j90K44m42L23l35K38k7Q1
3728I7k96K4P8L1J10n1j27J97l54K20k8n4M25j50j19Q1j7r9K5J10R6j00p0mq9
3753f4J60k4j11j9J46k7J68j16m04j05M76O9j34%j66J21J53j15j7o5n9K18m6j44
3777a05K98l6n6N2J02k01j47J66M9J21j8j46mk06K39o9k31N5J1J43k04O0k4J96
3801D5j92n8K12k45l2J01P3L57j59j95n2M9J06K51j51j27K72m32Q6J01l3q6j17
$$ plain form
3632 -70 -111 -176 18 -234 -249 -105 -276 -23 -47 104 31 -89 23 -109 -131 110 91 -92 132 121 -73 -52 41 238
3656 238 78 141 -12 -23 -22 0 -16 31 -37 -232 -22 15 56 -158 -160 64 -127 28 -105 76 36 -2 -119 125 -62
3681 -62 275 317 96 245 -48 118 114 40 -66 23 35 68 137 155 -176 -39 -60 -36 -195 9 -55 -219 -37 -184
3705 -184 73 68 57 -208 -21 102 19 8 -114 17 89 75 -104 237 205 15 259 -183 140 -195 43 16 97
3728 97 -199 -175 -97 -66 44 -7 -134 63 -291 -71 -99 -153 272 122 3 84 67 -32 -7 103 199 99 29 25 -64
3753 -64 96 72 -39 -58 88 61 229 113 -291 -396 80 149 15 15 -151 -30 123 8 -9 -74 -133 85 39 -105
3777 -105 193 157 101 153 255 54 -93 73 122 243 225 79 75 -131 108 39 -192 -137 -126 17 -187 -127 -151 45
3801 45 -147 -205 7 -238 -270 -169 -96 261 102 -93 -145 -96 10 261 110 -17 255 -177 -91 10 -23 -109 -226
3824b26M29j93k51J04m2o8K92J57l65j02K32p3N6P6Q9j01l3K4K0R8J0j21K3K69
3848C04j78p7q7J20j05J01n0J97j15j89ol4K18j55r7n2J77o5j23j9K6k1K88q7
3872b9J02j9NLn6J3l8J94J43l03l6jl0k8M0K9J15k41K49k3J8k06l0qM5J07k7p5
3900h7O7j0j79J87Q1O3j16j07K14J27j83j62K07j42J34pj02k0%K7M0m2j93L53
3924A50q4P5k39j6J02l15L27q1l5j2M9m4K66m4J06j44j78K70j35J05j20k1K62
3947B44j77L2j16q0J97k55J16j69Q9J62J20k80J14p2P9J83o0k58Q0J87Rk57K10
3970I8k29J39J94j77J58j23N4m6J47j10n9J02k4K1j00j43J47k79K65k58K39j17
3992a01j24J97J2o8R2J19k75N6QJ05p8k2K26n5k50J81mJ79j78oK4k07N6L5%J2
$$ plain form
3824 -226 203 10 -241 -137 -179 -247 45 202 -163 -265 -33 -106 -50 26 115 14 -19 5 25 123 133 12 35 304
3848 304 126 49 -38 82 -23 78 28 225 110 -79 -85 -119 99 -56 -153 -205 -28 -93 -216 -235 -209 -230 58 -29
3872 -29 73 54 59 62 6 19 -19 175 318 15 -21 -22 -52 -80 -40 -11 104 -137 112 89 107 -99 -129 -137 -92 15 -12 -87
3900 -87 -20 -30 -209 -22 59 122 6 -101 113 240 57 -105 102 -40 94 87 -15 -35 -35 -8 32 -10 -203 150
3924 150 66 141 -98 -114 -12 -327 0 -81 -116 -128 -79 -123 143 99 205 61 -117 153 18 123 3 -18 244
3947 244 67 99 -17 -97 100 -155 -39 -208 -119 43 163 -117 -3 -75 4 187 127 -131 -51 136 145 -112 98
3970 98 -131 8 202 25 183 60 114 68 215 105 46 148 124 145 45 -98 49 -230 35 -223 16 -101
3992 -101 -225 -28 -16 -84 8 127 -148 -92 -84 21 -57 -79 147 92 -158 23 19 198 20 14 38 -169 -113 -78 -78 -66
4018f6J79k68J08J34m7j87K81l09r6L15j99M5L30l6l19K92p5p4n6M7JO1J21k23
4042d1kP4j77J11j06J19J53k35N5K0n4O5l39K31O1J43l4l2j14J48J82l69k7L34
4066A66K8M6k54j87K55j30J36j66O6o4O9j47J43r0qq8K09j53R2RO3p4J24l9j06
4091a00L2J35L0j96n5J37J7JR8PQ8o2n2j29K89j94Lk76M38k45J41j35j11q3K03
4116a9J55j87k97K02kOJ93q9l7QJ66l32J50m3LJ49K83m8m9k59J27j5j4m1l8k57
4142b85M61l46K69k33J38j10j24K55l29L38k33J52J34k41M3L12J4k56Q4k03L09
4163A49Lq1P0L8j77k2j62L59K8j41j5l3k06L56K9m9j62L4p0R5M0j36j0N3L1j01
4189h0R6r6N4q1K51lj23J1k60J57N8L0J82k02K57l4k89J27j71J46K6k07K03r9
$$ plain form
4018 -66 113 -155 -47 87 40 -147 134 -175 -271 44 -155 -110 220 184 -135 157 82 8 -48 -1 0 61 182 -41
4042 -41 -43 31 -146 -35 -141 -22 131 -104 -49 -29 -83 -18 -357 -126 -65 78 44 12 -102 46 228 -141 -168 166
4066 166 194 240 -14 -201 54 -76 60 -106 -40 -104 -35 -182 -39 -129 -137 -225 -16 -169 -77 -68 -5 -79 45 6 -100
4091 -100 -68 67 97 -99 -154 -17 0 1 99 106 194 132 80 -49 240 46 49 -227 211 -34 107 -28 -139 -222 -19
4116 -19 136 -51 -348 -146 -148 -142 51 -38 -75 -67 99 -233 -83 -126 -123 26 309 261 212 -47 80 65 51 10 -28 -285
4142 -285 176 -170 99 -134 4 -106 -230 25 -304 34 -199 -47 87 -154 -111 201 215 -41 43 -160 149
4163 149 152 71 141 179 2 -20 -182 177 205 64 49 16 -190 166 195 146 -16 18 -52 43 83 -53 -63 -10 21 -80
4189 -80 16 -80 -26 -107 144 141 18 29 -231 -74 -16 14 196 -6 251 217 -72 55 -116 30 56 -151 52 -47
4213d7P5m8lqO2r0j94L21j16r8N1J43K6j64J72J53j32p5k6L30j65R1k76K27mK2
4239B27j83j19o3J17k01J98R1j80j2J59k95K23P1r5P7m5P9k25O5pJ67M8q7M1J21
4264A72l2k7N0j38n4m8K76j23Qj4P6k62J48j67j56L40m8J64l78M46l67J31J06
4287A03j58r8L83k81J32J24q5m7R0k18K94j82J66k07M1M2j87lJ10k4q8R1Q4j15
4311c3k06Q0J34j3j18J30l49L06K36l48P5j02K04j08L68J2j50m2r9j71K89j2l72
4334b89K50L7l7J2p8J47j29J14M1k09J89j51m7P7q7L09n3j58R3M47n78J3R9R9
4358A11K0J84k32J22j51j82L24j04qj98m6K40j06K4k59K54k06K19m2j8j0k03M90
4381B23k32J65j28P3j24P7L1p2n8O9j45P9L18j54q6J22k17j05K81j5j1L2k43R5
$$ plain form
4213 -47 28 -20 -23 -31 31 -59 -253 68 -48 -146 -95 48 74 -90 82 235 103 28 2 332 167 258 -18 209 205 227
4239 227 44 -75 -138 -21 -222 -24 67 -113 -125 34 -261 -38 33 -62 15 -30 49 -176 -111 -118 49 97 10 51 172
4264 172 140 113 163 25 -29 -77 199 76 84 70 146 -116 32 -135 -291 49 1 165 -213 233 -134 -3 103
4287 103 -55 -153 230 -51 81 205 120 73 163 -55 239 57 223 16 57 99 -88 -91 19 -5 -93 -2 82 -33
4311 -33 -239 -159 -25 -38 -156 -26 -375 -69 167 -181 -106 -208 -4 -112 256 268 118 76 -23 -194 95 83 -289
4334 -289 -39 -2 -39 -27 -105 42 -87 27 68 -141 48 -103 -150 -73 -160 149 96 -62 31 478 -100 -87 12 111
4358 111 131 315 83 205 54 -128 196 92 84 -114 -160 80 -26 -2 -261 -7 -213 6 -36 -54 -64 -267 223
4381 223 -9 156 28 101 -23 54 85 13 -45 24 -121 -42 276 122 36 158 -59 -164 117 102 91 123 -120 -25
4405b5Q5k09J72O0k67J69n7J6k3J27j90P9J53j76Q2L7R9j21J20q3l7K66k92j74
4429a89K96q8k5J03p4J5P6k48k8j50K68j02%R4L4l5j0m1K1j10J32M2l8J63j15
4454iQ8q8K7N5p7O9rN7j25n3m2J12j16J26j35P7rk61K62K08j98N8j41j6l8J17
4480f1K0j23J40J27m5pj8L6M52m08k34Q3P8k1m7k4J88k9n7J33j22L5j04j3r7N6
4506f2n5N2j63K83jK9o2J1nn1J3J66m11K18j7K39j10J71k65O6k0J49k08J13p2
4531Hn1k1nK29m36K8J67J15k56K66p3o2J9Q9P9j90l3J00p1RJ85J9n7O9j22K03
4557B08j45k4m4JK02l79oJ90k4J16j67mj02L2J1L6k1r5J33J30j39m7J59j26J95
4582I0Pl1j93R5J18p5r4J44n5R8K7j77j28K26nk56L70j13k52K24Ro0j98M8L37
$$ plain form
4405 -25 60 -149 23 83 -184 -15 -72 -56 -79 48 -142 -63 90 -86 -4 33 132 11 131 48 11 277 -15 -189
4429 -189 107 19 -6 97 23 38 114 -134 -162 -312 -44 -146 -146 -52 -18 -53 -63 -104 -83 -193 -61 -19 -57 106 -9
4454 -9 79 -9 18 73 -4 65 56 113 -12 -65 -107 5 -111 15 -120 -43 -52 -313 -51 157 -41 17 -124 -140 -178 -61
4480 -61 -41 -164 -24 103 58 51 33 69 521 113 -121 -38 40 19 -28 -52 136 107 50 183 61 96 -8 -21 -118 -62
4506 -62 -117 -65 -228 55 54 83 21 32 27 -24 -11 155 -256 -38 -55 184 74 245 -20 46 26 175 -33 80 8
4531 8 -43 -64 -69 160 -276 -248 -81 34 -222 44 -29 -91 -72 17 96 -94 -127 -27 -98 -89 96 115 58 127 5 208
4557 208 63 39 -5 -4 198 -181 -187 3 -21 95 -72 -76 -178 -146 -135 -99 -120 -215 -82 48 -91 -138 21 -105 90
4582 90 97 66 -127 -32 86 11 -83 61 6 104 131 -46 -174 52 47 -209 161 48 -204 20 29 -31 -229 -181 156
4607A56l33L12Q0j54j57K2J55K6J33o1K0Po8P0j89p3J66r4j68J13K38N8k85j68
4631a94K46j56L05k99J44j58K03k49Q8j6K18J3j30k81L69L2l3J3p5J3j47Q7Q2
4654G5R8j82o4K38k87J61K9k13j0J61K7n1j92%N8J85k3j56J66j30O6l9J76j51
4678e8L9oJ36K78l66K2m2k0J42m6j97J77Oj56J68k5Q1l12J32j5K3p3N9j20K20
4703D7M9j27J81l21L9J00M8j33J08P8J05M2k57J80j38K53l64K48k5l53J62K10
4725A32k04OJ63q8k81M70j99j95L30p2k9L4j10j4j75L23k67L27p5K06l23N5K7
4748D1O9j33R6rj4o2L4Q5j49J6j14j7J79q4J37p2n3R3m32M79Q4k28P2M4j98m6
4774a82J46J41j38Q1j50M19r3P5k40P2L8k13J31k4N2j33L1o4L5q1rk26M32O1o1
$$ plain form
4607 156 -177 135 215 61 -96 -74 81 107 240 179 199 206 138 208 19 -54 112 18 -150 -37 201 259 -26 -194
4631 -194 52 -104 201 -98 46 -112 91 -158 -70 -86 132 145 15 -266 103 135 102 115 40 53 -94 -7 75
4654 75 173 -9 -73 165 -122 39 68 -145 -155 6 33 -18 -210 -210 -152 33 10 -146 20 -110 -44 -83 93 -58
4678 -58 -19 -25 111 389 23 45 3 -17 125 79 -118 59 65 -91 77 52 133 -179 -47 -62 -39 -112 -53 -173 47
4703 47 96 -31 150 -171 -132 -32 16 -117 -9 69 174 216 -41 139 1 254 -110 138 113 -240 -78 132
4725 132 -72 -66 97 9 -272 198 -1 -196 134 62 33 67 -43 -57 -232 91 -176 151 76 282 -41 14 41
4748 41 110 -23 73 64 50 -12 22 107 -42 -26 -140 -157 22 -62 75 3 -50 43 -389 90 174 -54 18 62 -136 -182
4774 -182 -36 105 -33 48 -102 317 224 299 59 131 169 -44 87 63 115 -18 13 -51 -16 -97 -106 -332 100 161 100
4799A00km13L61J6n9j11L45k91n1J74Nm5N7J00k09K5J79J05k31r0K6k03J65r4
4823a41N0J38k16P9j46K64k47J25J64k96L50j64j62M11k70J78k8M1m3J44k53Q
4845a4K6J6P8j07lP8p1J29j91J80k93J32L6ok3j06R3p5n9J04N7o4l2J27n0L49
4871C11m11J80j17J44q0l3m9NJ89o6p6rj33K17J48j67Q8l54J17L6k7PK75k24K
4896b7j30K41j14l17L71J3n9M8R8k88L39j88J84k86L36j57j35O1j9Q2%Jl8k07
4920a91n5L62k09j8k1O3J45j63J52q8L8j9r1Q8R7J59k06K9m1J35K9k85P6po8K23
4946A34j30J77j1l50J04J58l5j73K17j85k24J73J2K50k35rP4m5R2J2K93m99N22
4969C22k85R7m0O0q7l5k2p6J58kj65L1l1p1Q2j77J41J49j11K05k00L1l7o6l1J09
$$ plain form
4799 100 98 -315 46 62 3 -108 237 -54 -105 69 74 29 86 186 -23 2 181 286 55 -35 -9 -212 -47 -141
4823 -141 -91 47 -169 -90 -236 28 -219 -94 70 -226 124 -40 -202 209 -61 117 89 130 87 231 -22 -14
4845 -14 12 28 106 -1 -4 74 3 132 -59 121 -172 -40 -4 -10 -33 -139 -46 -121 -180 -76 -19 -83 -115 12 -38 311
4871 311 -100 80 -37 107 27 -6 -55 -50 139 73 -3 -12 -145 72 220 53 141 -213 -96 -60 -87 -80 195 -29 -27
4896 -27 -157 84 -30 -347 24 37 -22 26 124 -164 175 -13 171 -115 221 64 -71 -10 -29 53 53 54 16 -191
4920 -191 -246 116 -93 -111 -132 -69 76 -87 65 -23 15 -4 -95 -7 90 249 43 72 31 166 195 -90 -14 -21 -89 134
4946 134 4 181 170 -180 -76 82 47 -126 91 -94 -318 -145 -133 117 -118 -127 -53 -98 -6 6 299 -200 322
4969 322 37 134 94 154 67 32 10 -66 92 90 -75 -44 -75 -146 -64 -241 -100 49 -62 143 -57 -26 -63 -129 -160 -51
4995e1K99k56Q5kq2k1J43J03j84J11J0j39p1L0N4j15K02k08J07k75L03o6K7O8
5019G2m07J02K65J28l45J61n6q7L58m5j93j30J42n9k3J74j64K96j63K35j83k4
5041E4k3J90r1k80K93j19k9k22L70l8l3k46J14J01rj30MJ1Nn5P1j04L14j43n7
5066e2j3P9M5j87N5J87q9M9J09j12n6j72O2K08k60L20l33J56p4j77P8N9L7k10
5090b91J81J43r5m1J20K1q8o7K26o6J25j56q2J16j09J40k7j44K97j47j40P3J6
5113Eq5K21o6j28j09m6L61k48qK0j10j69K39K83j31o9J29p8P6j48J50K4n6j25
5137f8N3J99j48o2N6L1Q3l80L23o5J58j63j77P0K23l3P0l20J69j3p0K02l46K13
5161Ej23L1pN1J23j30k7J24n9R1K5j77K0j17K58j58Q0J35k95K73N6r5n6m3l4j36
$$ plain form
4995 -51 248 -8 77 75 -7 -28 115 218 34 145 155 16 -55 -25 29 -86 116 -92 15 -260 43 -23 4 72
5019 72 -335 -233 32 160 -185 -24 -80 -167 191 146 -47 -177 -35 -94 -117 57 -107 189 26 261 78 54
5041 54 31 221 130 -150 143 24 -5 -227 143 105 72 -174 -60 41 32 -98 -94 -83 -78 -133 -62 -166 148 5 -52
5066 -52 -65 14 59 -128 -73 114 25 74 183 71 15 -157 -95 113 -147 173 -160 -4 -78 -255 -177 -118 -81 -291
5090 -291 -110 33 -62 -103 17 38 -50 -117 109 43 168 12 -70 46 -63 77 50 -94 203 56 -84 -11 5
5113 5 -80 141 75 -53 -162 -208 153 -95 -103 -83 -193 -362 -123 160 29 -40 89 11 87 -61 89 113 57 -68
5137 -68 -15 184 36 -26 30 61 144 -236 87 22 180 17 -160 -90 133 100 170 -150 19 6 -64 138 -208 5
5161 5 -118 -87 -94 -43 80 -50 -77 47 -12 79 104 -73 -53 -170 88 -70 10 145 -150 123 179 84 28 -15 -49 -185
5187a85R3L0J58p3N6n3pO1k28Q9R1Qk8j44K69M8j16N2o0J19k55k1J9J88j9k58
5213a66P1N3K08j64j02J0n8K90J7j48J0J26j29j28J61j47K05j20K26j48J20O1
5235B48k06K03k28p2r7N1N2q2K07o8J36r2j20M6j38K23q6J56l66J88J57k48K00
5258F4j82M23k87R7J24k15j6O4p3P8L3j99oJ40N4l00n1L09k14J45k29J21O3j12
5282a69J84r3J83nm6o9p8J83l8j57K8l0J30j02Q1m8J44j10j07K85m8j1N4k00m8
5307h7J51k14Q9P7L5j95J53j1r1J03r2n0Q6o0K58k36O3J0J95j15m7P8r6J93k76
5332g9J04q7j79J64k2J18Q6k34K80j57j16J39l00K38j52L1k3P8K23j5M2q5J52
5355B06l23K65k66K8J98p5J19j5j10N4p1NJ93r7j34nMKj13J40O2k39J48p5QJ12
$$ plain form
5187 -185 -92 -62 96 23 79 26 19 80 -148 -59 32 40 12 -132 137 185 69 121 61 180 -75 -96 -77 111 92 -166
5213 -166 -95 -42 166 2 -100 -90 -148 142 159 11 21 147 18 -110 51 -96 109 -11 215 67 187 248
5235 248 42 245 17 -55 -152 -101 -49 -131 76 8 144 52 -68 -22 -160 63 -23 133 -233 -45 112 -136 64
5258 64 -118 305 18 115 239 24 8 72 -1 77 110 -89 -95 45 99 -201 -252 57 -157 -12 -241 -120 -57 -169
5282 -169 15 -78 105 100 54 -15 -93 90 52 -105 -77 -107 23 -79 2 -46 98 -12 -119 166 118 107 161 -39 -87
5307 -87 64 -150 -61 16 51 -144 9 -2 -93 10 -82 -132 -46 -106 152 -84 -21 -11 184 69 22 100 4 197 -79
5332 -79 25 -62 -241 -77 -99 19 105 -129 151 -6 -122 17 -283 -45 -197 -166 -189 -111 112 97 139 54 206
5355 206 -117 148 -118 -90 108 33 152 137 27 81 10 15 208 111 -23 -28 -24 -22 -135 5 67 -172 -24 -99 -91 21
5381B1k42JM4J96J15j48P4j75J15l7K7M5k2K9Pj61J96j96J02O6J05k29R8P4j43
5406c8j80K51k10K03k76J62J93k6j41L9k54L54j9k52J69q3J13J63l42J54LO0o8
5429b5L0P9k07J58j51Q8oM5r0jP6Nk01J16K7k0J32R7j02M8J4j13Q6Nk91J63R4
5456E6O7j35O1j0m8P9J09l28NK15o6P2J17l40J50j25P2L4n9J05j23k23K38J68
5480I1j15j04K7J2R4J45j52J16j67J86j63OJ78P8q4Kj11n4j31K77lj88J6r3J17
5505b0q4N6O7N6P2k03k7j9J95n3j34qJ14J10j34K4Mr9L04l15NK38j82K07k05k1
5531e2J71j63k7O7Mj0M9L8j86J61j20K06k46j20R9J57JO0j49l8K16n4k21K08P9
5556A30j13J8k73L15j66Q2O9j35K4p6K06k39P1l4q3J58K97l10n9R6p0j56L08m3
$$ plain form
5381 21 -221 -220 -176 20 135 -13 61 -114 1 -36 -9 36 14 43 50 -111 85 -111 -9 57 162 -67 31 105 -38
5406 -38 -218 33 -177 26 -250 -88 105 79 -62 -23 -277 77 58 -194 -25 -108 5 168 -174 -20 -17 43 -25
5429 -25 5 84 -123 35 -116 -28 -34 11 -79 -80 -4 1 -200 -84 -57 -77 55 152 50 98 112 -1 85 90 -201 -38 56
5456 56 123 -12 49 39 -9 70 179 -149 -144 71 5 77 194 -146 4 -121 -49 -15 -74 31 -92 -315 -77 91
5480 91 -24 -128 -101 -89 5 150 -2 114 -53 133 -30 -24 154 232 148 150 39 -15 -146 131 128 -60 -44 -137 -20
5505 -20 -104 -48 19 75 147 -56 -83 -102 93 40 -94 -102 12 122 -12 12 16 -83 221 -94 -89 149 -33 174 -31 -52
5531 -52 119 -44 -71 -4 0 -10 39 77 -109 52 -68 138 -108 -228 -129 28 29 89 -60 -98 118 64 -157 51 130
5556 130 17 35 -238 77 -89 -7 62 -73 -49 -125 81 -158 -87 -121 -204 -46 251 -59 -118 -22 -92 -248 60 17
5580A7j10R1J09j55J67j47K03n7J08n1m33L14m8k74K93m8m03M44J29l29l5j3K81
5603E3j14q2J89n5J5p6J23p1q0N0j5NQ7N7k0k1K1L5J75k65R9k25J39k04MK39L5
5630I8j48p3J23o5N8j21K60r9k38J37jL11l06l2n7J51j97J80K32j5k33J24K7j10
5654FJl5J59j45m5J41k3k54J63J06k97K84n0J10p2q4k9LJ11K20l25K9J74k0q2
5679D6k24K90m4j18J74Prk23J04J23k43K3J2%K6n3J49j14L0K8L98l58j45p2M4
5704a49J73j57O7J99k03J40N8j33j57J43j80L7J81R0L3n1k47J86P1j58J46j49
5726f0j04K60nnk63K07j22K5j20O1J27J54j71o5P8K02l10K64p7j57J40m1L1O9
5750A18l6J6n0r1j28K55j3o4o3J45k65LK23j62K89r6k24M2J29lj21J48q5J83l3
$$ plain form
5580 17 -93 -2 107 -48 119 -28 175 118 226 175 -258 56 8 -266 27 -21 -424 20 149 -180 -215 -228 53
5603 53 -61 -143 46 -9 6 -70 53 -18 -98 -48 -63 -58 29 86 66 45 66 101 276 11 110 -115 24 -180 -176 63 98
5630 98 -50 -123 0 -65 -7 -128 132 33 -205 -68 -69 242 -64 -96 -153 -2 -199 -19 213 198 -35 89 116 6
5654 6 7 -28 131 -14 -59 82 59 -195 -32 74 -223 61 11 121 49 -35 -64 -61 50 270 -55 -26 148 128 46
5679 46 -178 112 68 -50 124 131 122 -101 3 126 -117 -94 -82 -82 -56 -109 40 -74 -44 -16 382 24 -121 -193 -149
5704 -149 24 -133 -66 133 -70 70 128 -5 -162 -19 -199 -162 19 109 142 91 -156 30 101 -57 89 -60
5726 -60 -164 96 91 86 -177 30 -92 -67 -187 -126 1 155 -16 -81 -3 199 -111 153 76 -81 59 18 49 118
5750 118 82 98 48 -43 -171 84 71 7 -56 89 -176 -173 50 -112 177 81 -143 -101 28 25 -96 52 -33 150 117
5775A17k15L01k81j1J00j74J28J70J53k63k25J51K76j55J3j86M9j6Lr1N5J14j56
5798a43lq3J88m7N4Q5j21o9N0R1L6R4N4k68K69k11K25j74k0J14k00pR9J7M2q7
5824a5O6j32K22j98K0J52j42k3j0J6O1j18O9Nk24J62L52j61k7o9Q2Nj04L8L4P6
5850A37k01N8O0q6p3KJ37l0j13K18j12k5j30J90j21J04j53L52m6j10k77L38j0
5873A09o1K08j79j59J00on4l7k2R3j4J39j24%p4j05L2nK41k69R9j09L70j68j3
5898hm7J37k5l9q0R0N2l2J3j34q5K0K08%j65M8k8r9K81M8j12j83J85M1j38N0j54
5925a56K34j4r7N6q0j13K5J16J6Q9j26O9k5j59L20r0l0j38K20l4j56j11J28l3
5949h9p8L90M1j19k84Jn5K76m0k85J71PJ90J48l09L1l5m3J18N4J60k57P2o3j13
$$ plain form
5775 117 -98 203 -78 -89 11 -163 -35 135 288 25 -200 -49 227 72 85 -101 -52 -68 -65 -156 -101 13 -143
5798 -143 -146 -229 -41 -88 -34 51 -70 -139 -89 2 38 132 186 -82 187 -24 201 27 7 121 -79 -86 13 30 72 -15
5824 -15 51 -81 141 -57 -37 115 -27 -50 -60 -44 17 -101 -32 -27 -251 -89 263 102 75 6 88 93 -11 27 61 137
5850 137 -64 -6 54 -32 -105 -103 34 4 -109 109 -3 -28 -158 32 -89 15 -138 214 168 58 -219 119 109
5873 109 48 256 77 -82 18 12 -42 -79 -101 -8 -22 117 -7 -7 -81 -186 -154 -159 82 -187 -88 -197 173 5 -8
5898 -8 -55 82 57 18 -62 28 80 48 61 -73 -158 -138 70 70 -95 -47 -75 -174 107 155 43 -140 45 86 -52 -2 -156
5925 -156 78 64 -33 23 -57 -170 -145 -29 -13 76 -50 19 -6 -165 155 65 35 -103 117 83 -73 -184 -56 -89
5949 -89 -167 223 264 145 -139 -138 -193 83 43 -242 -71 -64 126 274 -35 -4 -39 -82 36 90 250 -7 65 2 -111
5974a11K10j43N5m5m8J41j59M0P6Q7j11N9l5M2k05J48R4m76L13J35n7j24N2L8
5998b4J87l1m8l8j3j3K25n53M03N8k7k09J79j84M0R3j32r8Q4RK9J40k20J93j26
6023g6n6O6n5L32k31J65p6l0L2j32j57J47nLMJ77Mj24lj19J69K5j52J75j92L8
6049g1k4J10j68K38O3k52J41J00k87Pl1L41l68J92l2K0j03Q3Q7R9j4p2J8k14m6
6074a83L83r7j29K56j52o6q7j0N1K46l50J76q4l6o7K29q3mj76o9J06J01k6K69
6098A98k04J6Rj35%K70r5j27J45l7J33q5q9J16k86K39j35P4n9m5mj15J32O0o7
6123i1j6J53j65K03k94M08j30l4N0k12J92k2L8ok74L58o9J25j12j38oP2O3j13
6147b0o8K68k24K8J90k13rj5l9P5J59j13j41j2J82j42m6R9m2KK10nr6J05j30N4
$$ plain form
5974 -111 99 -44 11 -34 -82 59 -100 -60 16 103 -8 51 16 58 -147 1 95 -381 -68 67 10 -114 -62 -24
5998 -24 163 132 84 46 33 20 245 -308 95 153 126 -83 96 -88 -48 45 -87 -185 -101 -92 -63 77 -143 50 -76
6023 -76 -132 -66 -121 211 -20 145 69 39 71 -61 -218 -71 -76 -73 -69 108 112 -12 -15 -134 35 60 -92 83 -109 -71
6049 -71 -95 15 -153 85 148 -104 37 137 -150 -143 -174 167 -201 -9 -41 -21 -124 -41 46 145 131 59 77 -137 -183
6074 -183 200 103 -26 230 78 12 -75 -85 -34 212 -138 38 -46 -82 -149 80 -3 -7 -183 -252 -146 -45 -71 198
6098 198 -6 10 19 -116 -116 154 59 -68 77 40 173 88 -1 115 -171 68 -67 7 -52 -97 -101 -216 -84 -24 -91
6123 -91 -107 46 -119 84 -210 198 68 34 84 -128 64 42 80 74 -200 158 89 214 102 -36 -42 30 93 -20
6147 -20 -88 180 -44 -16 174 -39 -48 -63 -102 -27 132 19 -122 -134 48 -94 -140 -41 -83 -81 129 124 28 133 3 57
6173E7j52L45k60Q4J27j37j67K8nL08j35j41J26r9m2m4R7J72j60Q0P4p6k14K64
6197A30l9J9l0k25J77j04R5k23M47j86k20J65J43j74L1k40L21l4p4j72L02l9l23
6220b53J64P0J62j24R7j69j08K00j71Q5J15q3R6Q6k09lO1m9M0R0m1J79l07K24
6244A52k24J17j77L5Pj2R8o9J2J7J89j15J3j79K62j00M6j02N2M1J10k77J54rr9
6269e8J96j57j08L42j50r1j07J69j93rJ18j47K40j01J32p8N8j63l9J20m8J69j07
6292a2j77K08n8lK29j54K8k41K27o3n4K28l08j34N4K46j66J23pJ39N4l62J96K1
6316A4l27L15J13k10L9J01r6J64n1o9N7L4j7k57L11j78M5O0M2Q4q2rk41K15j15
6341e8j37L42j65k48K82qk38K16p9o9l4J37J1K3J76j40O6Q3k06K36k28J41R3k43
$$ plain form
6173 57 -95 250 -10 74 201 64 -103 -75 -80 228 93 -48 78 -21 -63 -107 -10 162 2 82 156 80 -134 130
6197 130 91 110 80 -145 32 -72 23 -200 247 61 -159 6 149 -25 6 -234 87 53 -21 -193 109 70 -253
6220 -253 -89 -19 143 19 116 -53 -161 39 -132 -47 68 -15 81 167 -42 -45 16 -33 7 97 56 235 -72 152
6244 152 -72 45 -132 -97 -90 -102 -4 -73 -61 -44 145 30 43 -136 126 26 72 -30 22 63 173 -104 50 41 -58
6269 -58 138 -19 -127 215 65 -26 -133 36 -157 -166 -48 -195 45 -56 76 -2 56 -107 -146 -26 -74 95 -12
6292 -12 -189 19 -39 -42 187 33 61 -180 47 -16 -70 158 -150 -284 -230 16 -150 -27 -34 105 159 -203 -7 14
6316 14 -313 2 115 -95 -56 45 -51 113 62 -7 50 84 67 -190 121 -57 -12 48 90 174 92 83 -158 57 -58
6341 -58 -195 147 -18 -266 16 8 -230 -14 -93 -162 -196 -59 -48 -25 151 11 77 160 -46 190 -38 103 196 -47
6365d7J61n2j74J62N5j55j21K44n0Q3l25J38P7J50pk10J21K4M3k19O5r0J99j52
6389h0J84j32J3N0j97R7l3J40P5O2j39p0L3K80m46J75J78j81p8J6p8j81K96O0
6413D4j67K15k37j9J21J08QJ2n7j02J42l0k31J73n7r8K51k18J24R9j67R4k56M0
6437b08K90j59K42j48j03K70k69P0j5q7K67j64k79N46l32N2M0j6j56J53R9L2r0
6460C5J26q0k9J09P0j46Rj56n1K78j11o3j54K17J14l60K53l40J40n5M6J95o9N5
6484C3n0N2k26M31o3j51J13J03j85k61L38j65j16J28j17J31o5n5J43jn7R5k31
6507a76L66j74k59K16J1j76J51j70J71m4N7L5l0k2j00J04j7M4K37k60q8J50Q5
6530A11j72p6M1J94Q4l68J34j87J69q8L7J11j59K69j62J53k41K60k32k4k04M37
$$ plain form
6365 -47 114 62 -112 50 105 -50 -171 73 23 106 -219 -81 -4 146 139 -71 50 74 117 -102 -37 -127 72 -80
6389 -80 104 -28 -15 35 -162 -65 -98 42 117 179 40 -30 3 283 -163 12 190 9 -69 -53 -131 -312 -16 44
6413 44 -123 92 -145 -164 -43 65 73 85 28 -74 68 38 -193 -20 -77 -175 76 -142 -18 81 -86 8 -248 -208
6437 -208 82 -77 165 17 -86 184 -85 -15 -30 -117 150 -14 -293 253 -79 -27 13 -3 -159 -6 93 125 35
6460 35 161 81 52 161 231 85 94 -62 -113 165 54 -9 -163 54 168 -192 61 -279 -139 -194 -148 47 -22 33
6484 33 -17 35 -191 240 177 26 139 242 57 -204 134 -31 -147 -19 -136 -5 -70 -125 18 17 -40 55 -176
6507 -176 190 16 -243 -27 -16 -192 -41 -211 -40 -84 -27 8 -22 -44 -144 -40 -57 -13 224 -36 -124 26 111
6530 111 -61 -137 -96 98 182 -186 -52 -239 -70 -158 -121 -10 -169 100 -62 91 -150 110 -122 -146 -350 87
6552H7M7j07po5Q9j97L95o1k85K57j77K02m38K34rJ81l6j11l6Q0q5J22k8M9j4
6577H7r7l5o5K14r0K9k04j00K41R1j05J4K24k21r2J26PJ64l31L8Q0j13L63l53
6601a28J47q1r9K66k10J57o6r9M7J0N1Mo5j6K08m8mj08M2J8j12M6o6NM4O4J05
6628A12k16K04L9q8J96m8L4j18k18k0J63J02k67O4M7J95j28K31l66J76k2l5J67
6651B04j92J78j64j70J62J59J7j80J23k64J68j56Q1j0K65l12N9J43k34J10n5Q1
6673A3M1k88K58nj35K61j52L20k95M0r3J06p6J8Q6j96J52j28J61N8k5M6k57j35
6697b25K95J0k80R7L9n6K96k62p6l08N23l5J36j03j47K5L09j26j4m44K01J5j17
6720b47K99K3k5j80K15j79N6J88j81P9p8J72n2j47j2J5J2j4O2j05j20L43O0k26
$$ plain form
6552 87 134 27 20 -45 44 -153 242 181 -104 153 -24 178 -260 -26 -35 146 110 -1 -37 43 -42 80 52 101 87
6577 87 -10 -45 -110 104 14 43 -161 -261 -20 71 -34 -20 204 -17 -109 17 24 188 -143 -105 -25 -138 225 -128
6601 -128 19 -62 -161 105 -105 52 -14 -113 -66 -56 -5 -1 -66 -82 126 78 74 -34 8 26 -86 -40 -106 -101 -57 7 112
6628 112 -104 100 139 51 247 199 233 115 -103 -123 40 142 -125 -61 -14 181 53 284 -82 94 72 37 204
6651 204 12 190 26 -144 18 177 194 14 137 -127 41 -115 -34 -44 221 -91 -32 111 -123 -13 -68 13
6673 13 54 -234 24 19 -116 145 -7 313 18 58 -35 71 -5 13 99 -97 55 -73 88 146 121 167 -90 -225
6697 -225 70 80 -200 -103 -64 -120 176 -86 -162 -470 53 18 154 51 -96 -71 238 112 98 -346 -145 -130 -247
6720 -247 52 75 50 -130 85 -94 -38 150 -31 48 -30 142 90 -57 -69 -54 -42 -56 6 -99 -219 124 184 -42
6744d2K72r3n6j00lj3P7R6J6k98j5J93m1Q3k25J68m1j11L54k41q0l0N4J47l2r2
6770e3N5mol9oJ87k69J79k8O0M6p4M7o0r9J76j14M1k71M20j24j58kQ2j72L58l18
6797a46qq6J71J1q7K73k63K30j31J0k24L08K43k27K4M4k55m8K40J45j51j45K26
6820A54o1j87Q8J86j37j89p2J48K35m7n0M8j72k4k0J76o5r3L9p1J37K41k20N4
6844I8L0j10j73K51Np3p3o2K12L5Q9j16l4O9P7j04Nj97J76j68J5nJ42k31K95k60
6870a07JL52p2Mk40J34j87J12P1j79J82J49l03O6j43MQ1K67l42K57K3k56J42L1
6894D7k9k4K1k47L09j98L40k42j89j36K05O1P8M8n9J10p5n8jJ8r5K72j55N4j06
6919e1J52r0Pj3k4k02K65j53Q2J38k76Q2j5J74J32k02j44MK92l8k56L63q9j80
$$ plain form
6744 -42 230 137 81 -19 -22 -35 42 138 154 -144 -159 34 -7 76 -149 19 -22 -133 221 -20 -100 -130 -76 71 39 -53
6770 -53 2 -2 -8 -47 -53 134 -135 44 16 76 122 48 95 35 -64 112 -2 39 -232 188 64 -94 -96 -14 -186 172 -146
6797 -146 -154 -240 -69 -58 -145 128 -135 95 -36 -26 -250 58 301 74 98 142 -113 -161 79 224 73 -72 154
6820 154 93 -94 -6 180 43 -146 -218 -70 165 118 68 116 -56 -80 -100 76 11 -82 -43 -114 23 264 44 98
6844 98 128 18 -155 96 101 28 -45 -107 105 140 229 113 79 148 225 121 126 -71 105 -63 -48 -53 89 -142 153 -107
6870 -107 -106 246 174 178 -62 72 -115 -3 68 -111 71 220 -83 -17 -160 -156 -75 192 -150 107 130 -126 16 47
6894 47 18 -6 15 -232 77 -121 219 -23 -212 -348 -143 -82 -4 44 -15 95 20 -38 -39 -21 -116 156 1 55 -51
6919 -51 101 11 18 5 -19 -221 44 -109 -27 111 -165 -83 -98 76 208 6 -138 -134 158 120 -136 227 138 -42
6943d2K9J05k5j54j59J80J87j09J10l25L13j41p9k0K00pr1Q0q5L51m23r4J20j81
6967b60K88m5K04j92J03k5k27P6J79J23J7k63q9l0P6K79k89n3j23O6K26J10k09
6990e8K70k22j03J73K4k23K97l01K24P2j71K08q4k03j9J48r9rM6o1K62lj28n3
7014a3P8q4oO9O0j55o3J66k28J34O1j96l6J88J13j67q0J48M9J95m24K83k60K12
7038D4J18J27l36o3L8J38n4K01j92j03M5r9J25j57J32J91j73K7k01K59j07J19
7060G9m2j03P2n2K5j80J47J4j97K36LL4j09K05k18K3L58k69j14J53J06r3J9K1
7084A18Jl00oN1J64O5k13j67M31k13j02J37M8J18j79J98Q2k03p2K5J04J4j50n8
7108a07K51p9J06k71K41k63L31k17o5r2L18j22k8O0k45J43J15j63O7k04N9K54
$$ plain form
6943 -42 -13 92 67 -87 -246 -66 121 12 122 -203 110 -31 -110 -130 70 63 -28 52 -33 318 -105 -199 -79 -260
6967 -260 28 -17 187 -5 98 73 -154 -78 101 224 241 -22 -111 -141 -65 214 -75 -128 -251 -185 41 151 -58
6990 -58 212 -10 -113 60 84 -139 158 -143 81 153 -18 190 106 -97 -116 32 -67 -76 -30 -91 171 168 40 -13
7014 -13 65 -19 -25 44 104 -51 -114 52 -176 -42 19 -177 -213 -25 88 -79 -159 -11 38 233 -191 92 -168 44
7038 44 162 289 -47 -110 -72 66 12 213 21 -82 -37 -136 -11 -168 -36 155 -18 9 -192 67 -40 79
7060 79 37 -66 6 -46 -21 -201 -54 -40 -237 -1 2 36 -73 132 -86 -63 295 26 -88 65 171 78 97 118
7084 118 119 -181 -187 -136 28 93 -120 -287 144 -69 -171 -34 14 132 -47 151 233 30 -42 -17 87 101 -49 -107
7108 -107 144 65 171 -100 141 -122 209 -8 -73 -165 153 31 3 63 -182 -39 76 -87 -20 -224 -165 89
7130H9k75J67j7K1nR2p5o1L14k52n9j55J28m8j06Q3M11l02l4N8o5J64j96n8K96
7155A15k18N3L4M9J41j70O5m9r9O3K5J02l39L90k73K0J53k2J45j59O4N2o2k03
7179a23J81q3P6k49J49m7J85k38R0K62j24k02J09P0j9Rq2J57%rq0J23k67l8J35
7204a5K6O1J4l26L51n3j85J99n7K89m71L60m7o3pj55J66j13M4lJ58k12O5j20q7
7229a81J77J7m1O7k55J79K56j03p4O8j20J32k96K48J15j60P8P8j42k89J83J73
7251A10j78M1n9Q0L9R5JJ37j73J76o8j63r1L40l24L2k34J71O3J79j56k95K33r8
7275a42N3m5K5k5Q3J12J33k59J69l8k17J84Q0j04q4J41o6jK94l69K62k62J43o3
7299DK14j2k35n2j9P5J55n9j08n2J92k78K84j2k59L12j80q6p3L47k15O9o0J08
$$ plain form
7130 89 -186 -19 -36 -15 -20 72 -3 -64 250 -2 -61 -216 -88 -136 -242 -159 252 -50 -84 -26 -91 73 -123 -181 115
7155 115 -103 -50 -16 33 174 4 69 20 -79 -16 9 111 -228 162 -111 -91 62 40 185 26 90 142 80 -123
7179 -123 58 -25 51 -198 -49 -96 89 -149 -59 203 79 -123 -14 56 37 46 -36 121 121 112 32 155 -112 -150 -15
7204 -15 11 72 86 -240 111 58 -127 72 15 304 -167 193 146 83 76 -79 87 -26 18 15 173 -39 26 -94 -181
7229 -181 -4 13 -28 39 -216 -37 219 116 42 110 -10 122 -174 74 189 29 107 185 43 -246 -63 110
7251 110 -68 -27 -86 -6 33 128 129 266 93 269 201 38 -53 287 -37 -5 -239 -68 -5 174 18 -277 -44 -142
7275 -142 -89 -134 -109 -134 -51 61 194 -65 104 66 -151 33 113 9 -75 66 0 -1 293 -76 186 -76 67 4
7299 4 218 206 -29 -81 -100 -25 130 71 -37 -89 103 -175 109 97 -162 150 -30 -116 -189 158 -57 12 -48 60
7323F0k77P1J43n1r5K78%j81j41M24j41jk15J71n2j64M1J36J57j09k0j28L49j60
7347I5p4r7k24K77n9J19j08k5J62j08m9J71l5l55N72m46K71oJ64j94j67p5N1R4
7371d6O4Q6m9K8J28j43k64J97j46J32J0j14J74K7n1k02K96k4K7No4j15j19J76
7395A3k44L20J19R9m41K16n0j04j00K54k12J9o1J64J69k50K06k16j30K70j62J63
7417D2O4%k48O0K81j70N4J4j74K64q2j51J45k43J74J61j55o0Q1RJ73k26j93J83
7441Cr3j22K14j31K45j13m0l0M8O5M5J48l25R5Nn1L5r3J19O7K62m58P6K67j62
7466G6m8n6k24L70j13J51l8k73L54k09q0J74j51K55k26N8On2J19j09O7j26J85
7489A10j0j62k0J3K02K01m63J2K01Nqj4j12k39J28L11k6j58R9j14R6j3J03k76
$$ plain form
7323 60 -217 -146 -3 -54 -149 129 129 -52 -193 231 90 89 -126 45 -7 -171 -130 6 163 54 34 -94 255 95
7347 95 21 -76 -300 -23 -82 37 -71 -96 66 -42 -91 80 45 -310 262 -184 87 81 245 51 -116 -191 -140 -46
7371 -46 18 104 55 83 211 68 -196 1 -145 -13 -3 -117 57 84 33 -169 127 103 130 135 71 -44 -163 13
7395 13 -231 89 208 307 -134 82 32 -72 -172 82 -130 -111 -172 -8 161 -89 117 -99 -229 41 -121 42
7417 42 106 106 -142 -82 199 29 83 97 -77 187 105 -46 99 -144 30 191 36 -24 57 66 239 13 -180 3
7441 3 -90 -212 2 -129 116 3 -37 -67 -19 46 91 239 -86 9 14 -37 -2 -95 24 91 353 -105 -29 238 76
7466 76 28 -28 -252 118 5 156 118 -155 199 -10 -90 84 -67 188 -38 20 26 -26 93 -16 51 -75 110
7489 110 100 -62 -82 -69 133 334 -129 -117 84 89 81 67 -45 -284 -156 155 129 -29 70 -44 52 39 142 -134
7513a34l8J53Q8Lj76K7M3q4o6L30j84K24j71K3o1R7J38l54J14O6m0m5OJ74l9j2
7539H2l3N4N8j04j62J16j57r9K94%R4k88K74j12P8k86L41K5J6k87N9J34j93qR0
7564a4j94L88j57R4j24j40L48p1n7M6j23r6J81l2k23K39J14q8J17k41J42k1j01
7587a3K67j57r7j3j0R9p5M1Rj73L68k89j9KJ34q5J16O1j18l4q6j87K74n1J2J51
7613A27k33J5m3K16K6K5L6J0j90P4J44Ko4k41K15j54o3k8M0Kp8L50o2k66L15j19
7639E6J66j47q4Lk7J34J64k45j0m5K2M9J7n1O0q3K4M8j8Rp6l5Q5J14M3k40o6l1
7667a64K16q2J2j46O0PQ3J33k29J56M0j27k3Q5M5p5K08j93J97k53j24K54O1l6
7691A05j01n2J17j01J38Kn0j78J47k1J8k10J95j90K27k8l7M7p7J83m20N69m62
$$ plain form
7513 -134 -172 -19 69 72 -104 -77 -34 -118 -184 146 -38 186 15 38 -23 74 212 -142 -28 38 -2 -47 -41 133 94 82
7539 82 49 103 161 57 -105 11 -146 -245 49 49 143 -145 129 17 95 -191 150 175 191 -96 -37 97 -96 -104 -14
7564 -14 -208 180 23 117 -7 -147 201 130 73 119 -4 -100 81 49 -174 65 179 91 208 -33 109 88 -13
7587 -13 254 97 0 -13 -23 76 1 42 51 -122 246 -43 -62 -60 74 -11 105 166 48 14 -72 -259 15 -36 -24 127
7613 127 -106 -91 -134 82 108 133 169 179 -11 63 207 209 145 -96 119 -35 -98 -126 -86 -84 -162 188 126 -140 175 56
7639 56 222 75 -9 -6 -33 101 265 20 10 -35 -13 36 53 2 62 -21 3 51 33 42 -34 -69 16 130 173 -67 -133 -164
7667 -164 52 -30 -18 -164 -104 -97 -14 119 -110 46 86 -41 -64 21 66 -9 199 6 203 -50 -174 80 141 105
7691 105 4 -48 69 -32 106 108 58 -120 27 6 24 -186 9 -181 46 18 -19 28 -49 134 -286 283 -179
7714a79O2J97J7j39J83k09Q7Q1K3j44q1n8J65j0R1N4j18K5m5j24J60j4N8j69N1
7739c6r2N9L77m92M17o3l54L69j89L59l34j25K14j00K3Rmk10J75J31j92Qn9J72
7763F3O9j06k08R0O2J33j46J5J19m2K1q2K15l49j9Q6J89J3j55k75M62p2k55J45
7787b7lj33K42k57J43N5n3J4j18J48K13j81r7Q9MQ4q3l9j1j53O5n4L07J4p2n1
7813D6j04O4J85k10q6J34J08P1j04p0j45J05R4j05r2Q6qJ70j00K17n13R4L3L17
7837A87k48j1L27j68j07L4N5l0P9j42J04o8pK01r5j02R2j01p6K22l4J50l66R4
7861a0j28L63k51J7K13j58j48K3L5L7MJ88m64Q3L6K77j34Q3J20k40o0R7p6J6P8
7886AK5Pj24n5K31L4l01K30j06M9R9q3j41J76oq1J2M3%J30j45J2j05N7J84l13
$$ plain form
7714 -179 -117 80 97 -42 141 -68 19 100 123 -21 -102 -160 5 -5 86 140 22 47 2 -122 38 24 82 -87 -36
7739 -36 -128 -69 308 -184 233 170 -184 185 -4 355 21 -104 110 10 33 42 38 -172 3 134 -58 -50 -109 63
7763 63 132 26 -182 -92 -30 103 -43 -28 91 49 70 -12 203 -146 -165 -79 110 123 -32 -307 155 83 -172 -27
7787 -27 -30 -163 79 -178 -35 20 -33 -19 -137 11 224 43 -54 35 39 123 40 1 -10 -163 -98 -152 155 169 97 46
7813 46 -58 6 191 -19 -105 29 137 208 104 34 -111 -6 88 -17 -109 -23 -31 139 39 256 -257 -163 -130 187
7837 187 -61 -72 255 87 -20 14 69 39 118 -24 80 12 5 206 111 9 101 0 -76 146 112 262 -104 -10
7861 -10 -138 225 -26 -9 204 46 -102 -79 -44 -7 -3 185 -279 -196 -160 117 -17 66 186 -54 -114 -17 -93 -77 1
7886 1 26 33 -91 -146 85 119 -182 48 -58 -9 90 7 -134 42 36 -45 -33 10 10 140 -5 7 -98 -41 143 -170
7912a70j04K35J65L3k56K23j43L5Q3j58M1R0J3k15K19j70J47n0p6J01j03J28j03
7935c5k60K06J46j07J84m8J03k16L7M4l7k9j2J42O7l00J06k06J82r2j02M0L06
7958A19o8P3k95L59rj67j15M3P5l8J9n9Q7j83M6J79r3J71j44rj9J51j79rJ46l2
7984D9plq1Q5q3Q9n0j13P4k08K85k44M2K28k22K14J8J97m05O0k0J85K2k61K53
8009A04o9l2P5r9K31k04L9l7L4J9j04k2K3K65l53JL5J39k39M57k08q4Oj6j30J10
8035e9N4K98k86J46j39km3n4Lp6K60J0p2Q5j32m4J49J2q1j99K34o6J36on3N8j26
8062GJ90L8k52k7K93k77k9R7M9m5n6K01j47LR0j02k1J5q7K70j96j6K30j73q2q3
8088a10K88j30j78R8R1j79q3K67m4j12J11j11Q1m2O7L75n01L4q3L79k32J50J69
$$ plain form
7912 -170 -274 -39 126 159 -97 126 -17 18 101 -57 -16 74 87 -128 91 -79 68 18 -58 43 -60 68 -35
7935 -35 -295 -89 57 -50 134 86 189 -27 10 54 17 -12 -24 118 185 -115 -9 -215 -33 -125 -227 -187 119
7958 119 51 124 -171 188 179 12 -103 -60 15 -23 -4 -63 24 -159 -113 66 -27 144 0 -9 -28 123 -56 -65 81 49
7984 49 42 39 -42 43 -40 49 -1 -114 -40 -248 37 -207 -165 63 -159 55 73 270 -135 -75 -95 90 112 -149 104
8009 104 35 3 78 -21 210 6 45 8 42 61 -43 -65 -42 223 -130 -129 -94 45 -194 263 55 -29 -23 -39 -169 -59
8035 -59 -5 293 7 153 14 12 -31 -85 -82 -158 102 112 40 125 -7 -51 98 110 29 -170 64 -2 134 128 75 133 7
8062 7 197 235 -17 -44 249 -28 -57 40 89 44 -12 189 42 45 135 33 12 27 -60 210 14 -2 228 55 -27 -110
8088 -110 178 48 -130 -32 59 -120 -203 64 20 -92 19 -92 -11 -53 14 389 -112 -78 -161 218 -14 136 305
8111C05p3l47L55k69O4q4J71k18K73j62Q7j3j14j32J77r3Q0j03J99m7J6l16R4
8134a50L7R8J43j04J12k91J74qn1k4j9Q5q2l3L1Q7n5K05j04K2j27Q0J21m2j22
8159a7K16j1l31J14Q2J16k34N8o8j02K64j51n3j12K9K29j7r9K20k57J03J55j86
8182e2M1j1k3J13k76L50j09Q7j98
$$ plain form
8111 305 232 -115 240 -29 35 -49 122 -96 177 15 102 89 -25 -157 20 -73 7 -96 103 56 72 -244 -150
8134 -150 -113 -15 128 24 136 -155 19 11 -40 -64 -83 2 -80 -113 -82 5 -50 155 51 73 -54 26 147 105 -17
8159 -17 199 188 -143 -29 53 169 -65 -7 -75 -177 87 -64 -117 -229 -200 29 12 -87 133 -124 -21 134 -52
8182 -52 -11 -22 -45 68 -208 142 33 120 -78
8191g8
$$ Imaginary data points
##PAGE= N=2
##DATA TABLE= (X++(I..I)), XYDATA
0@%%%%%%%%%%%%%%%%Qj6J6j6J6k0K8l2L5m3M8n6O7p5Q8j02J14j28J44j62J82k04
38a08K28k54K83l15L51l88M28m74N23n77O37p01P71q48R36j036J145j267J405
57G39j564J751j970K229k548K952l476M191n225O859r837J6981o6169n8737J45751
72C1927L0435q6494l1582O1316J6102j4865j364n241j6303K9190L1043k4720m3985
85b4541J3068L9791j962m0871q359K5656P403j8985n764O182k225M305J5518j3299
99d083k2429K4668L1259k4126k5398K5280J6141k5988m353K4390q103k0552J7235
112C941R866k7085m357L0433o55l0226R095L1594j4347l0910J9215L1340j8643
125I261k9815J7317K4645j9898k1302J8832J2181k0476q365J8956L865j7503K458
$$ plain form
0 0 0 0 0 0 0 0 0 0 0 0 0 0 0 0 0 0 8 -8 8 -8 8 -12 16 -16 19 -24 24 -32 35 -40 48 -54 60 -68 76 -86 96 -108
38 -108 120 -134 149 -166 185 -203 225 -249 274 -303 334 -367 404 -444 492 -544 601 -666 739
57 739 -825 926 -1044 1185 -1363 1589 -1887 2304 -2921 3938 -5899 11082 -55087 -113824 31927
72 31927 62362 -24132 -55714 5602 21704 6839 5475 234 -16069 13121 44164 19444 -24541
85 -24541 -11473 28318 26356 -14515 -22874 2782 10185 -8800 -14564 -8382 -10607 -6302 9216 -4083
99 -4083 -26512 -1844 29415 5289 -20109 5171 21312 -4676 -9029 15361 7258 -13294 3941
112 3941 13807 -13278 -17635 12798 12143 -18083 -8988 22606 8259 -22651 -3436 27904 9261
125 9261 -20554 -3237 21408 1510 -19792 -960 11221 -9255 -17620 1336 5201 -12302 -9844
138i844J6712m063p931Q588L582p975M896J3222q430j6582Q740J4830j0286j3761
152h302O039N305q261q99Q563o904j2972J2746J7904j3157j8259J1996J9074n416
166G457j2365L246M113r51N246J13j3744j807J7200L822k0409o506J9442P462
180A2319j4782o245J0683N355n491j432L192m007k173Q034J457j2193n408J0884
194A93O311r938q188N326N125O58P33l558l795P120J0060n011j0849O603J2110
209A2900n710r995M848O451o305o099M501K965n700k493K426l1q41J088P4j910
225c831N71N128r1m902J217N349j010m677J542M570k811m925M174L590m768k769
241c643M876K732l983q16M230r50k814K941J927l625j945K780M25l790o49J703
$$ plain form
138 -9844 6868 2805 -5126 3462 7044 -931 3965 17187 8757 -7825 915 15745 5459 -8302
152 -8302 -2263 3042 -5219 -6118 2445 -4459 -17431 -4685 13219 62 -18197 -6201 12873 7457
166 7457 -4908 -1662 2451 1500 6746 6859 -6885 -8692 8508 12330 -8079 -14585 4857 12319
180 12319 -2463 -8708 1975 7330 1839 407 3599 -408 -2581 5453 6910 -5283 -10691 193
194 193 6504 -3434 -11622 -6296 -1171 -513 220 -3338 -7133 -13 10047 5036 -5813 790 12900
209 12900 7190 -2805 2043 8494 2189 -3910 591 3556 -2144 -4637 -2211 -2242 -3083 -1995 -1921 -3831
225 -3831 -3260 1868 1777 -3125 -1908 3441 2431 -2246 -704 3866 1055 -3870 304 3894 -874 -3643
241 -3643 1233 3965 -18 -834 3396 2446 -368 2573 4500 875 -1070 1710 2135 -1655 -2304 -601
257f01k213j511K466M10l358L9M249J121l353P74M884q6k758J474L475p00l704
274F08J039K493j391k172K04p39j634Q56J567k549k639K890K560k714j025K423
290b23o3j603J568K681k297l422K723L254k365k275J296J258q10QJ206l49r64
307c77J778J497j166o23R76N03j905m96K406j368l534K49J789o61j700m03O52
324b383r44O04K217p22j895J597L260K93j815J17K074L50m54K45n81j023K2Q48
342A810r93j583M78P50j331p37J698j69j656k69J778O46j471o00Q79K10L55J31
360g4r52n62M38J562L31j574n6J134Q29J32J60lj44J68J735k42k502j68J500j88
380A524j527j068N06o09j137P86l14o38N86L9l12R63J103L19p27N04J190O27j91
$$ plain form
257 -601 -2814 -4325 -1859 -1449 -4807 -4768 -519 602 -2751 -1977 2907 2821 63 1537 5012 4312 608
274 608 1647 4140 2749 577 781 42 -1592 -736 831 -1718 -4357 -1467 1093 -1621 -2646 -223
290 -223 -286 -1889 -321 2360 63 -3359 -636 2618 253 -2022 -726 532 -278 -270 936 587 -377
307 -377 1401 2898 1732 1109 2085 2588 683 187 2593 1225 -2309 -2060 -271 -932 -2632 -3035 -2383
324 -2383 -3327 -2723 -506 -1228 -3123 -1526 1734 2027 212 329 2403 2753 2299 2544 1963 940 962 1810
342 1810 817 -766 -288 462 -869 -1606 92 -77 -1733 -2002 -224 422 -1049 -1649 -770 -560 -205 -74
360 -74 -1026 -1588 -1150 412 743 -831 -887 247 1076 1208 1368 1365 1221 1389 3124 2882 380 212 1712 1524
380 1524 -3 -1071 -565 -1174 -2311 -1525 -1839 -2477 -1891 -1852 -2164 -1201 -98 221 -506 -2 1188 1815 1624
399A624o31j93J010O37j171o30J23m31L98k44n25n36K57J60m28L15M60j042j187
418b034J250J151p91r31n55M25P98J231q84k430N70L920J117k995k281K536L730
435C827l62k986j012K106J801j049j999p45nJ261J21j899j541N73J766m74k153
452b770o30K347J380j325q61J562J867j287j001J108J153J37p33k33L72N9l72
469G73j65M65k47j123Q30P57j565q90J472O13j997m43K225o90l046J268K917j118
487C6k783k83K433J697j159j654Q26J699P3j196J600J214k270k8L236k42l376
504a77p20K348P07j360r91j267n20J822R55j750j806P2Q80K813J06l811j538N024
522G87L177m804k832L310L430o40j889j640L12K862J540k859k508K219K562r57
$$ plain form
399 1624 993 800 1810 2447 1276 646 769 338 736 492 -33 -569 -312 -152 -580 -265 195 -847 -2034
418 -2034 -784 367 -424 -1355 -1910 -1485 -687 544 -340 -2770 -2200 1720 2837 -158 -2439 97 3827
435 3827 3465 479 -533 1573 3374 2325 326 -419 -424 837 958 -941 -2482 -1909 -143 -617 -2770
452 -2770 -3400 -1053 327 -998 -1859 -297 1570 283 -718 390 1543 1680 947 714 1086 1145 773
469 773 608 1073 826 -297 533 1290 -275 -1165 307 920 -1077 -1520 705 15 -3031 -1763 1154 36
487 36 -2747 -3030 -597 1100 -59 -1713 -887 812 885 -311 1289 2503 233 205 3441 3199 -177
504 -177 -897 1451 2158 798 -193 -1460 -1980 -158 797 -953 -2759 -2687 -1807 1006 1112 -2699 -4237 787
522 787 3964 -840 -3672 -362 3068 2428 539 -1101 -789 2073 3613 754 -1754 465 3027 2070
538B070k707j903J878M231q95n851j012N759J688n068j997K480J131r6r2j871
554b255m29L286J564k409j790J291K105J223l88k260n10L572K48l531m07L017
570B327m82k544K54Q89j246m07M19m40N74Q13k015q40K313J228j450q71P54J19
588f05O41J533r33k162J528K034j115o21J06R3M09J169r32j661J97J378j37l02
606F20n98q38L30P07r60q30O79Q08j013j091J327L47l87N08j8l17Q68O19L60m24
626F97n88M46J454N17j565j548R14J701Q5k270k156J227K773l43k836j218J963
643g47J253r47j146J97K50J597j12j343k08O59R78L36o34k31N38M53O3r23K40
662B73J339k13p79K67m33j52O70m85j072M59R31r59j851R39Q49p17n40M10l3L48
$$ plain form
538 2070 -637 -2540 -662 3569 2674 -3177 -4189 1570 3258 -1810 -3807 -1327 -196 -292 -384 -2255
554 -2255 -2684 602 2166 -243 -2033 -742 1363 2586 2198 -62 -572 3000 3248 -283 -690 2327
570 2327 1845 -699 -445 444 -802 -1209 -790 -1230 -656 157 -1858 -2698 -385 843 -607 -1478 -724 -605
588 -605 36 1569 636 -1526 2 2036 921 300 406 499 908 2077 1145 -516 -319 1059 922 620
606 620 22 -816 -486 221 -739 -1569 -890 -82 -1095 -2186 -859 -512 -899 -391 -409 -726 142 761 1121 697
626 697 109 555 2009 2526 961 -587 327 2028 2113 -157 -2313 -1086 1687 1344 -1492 -2710 -747
643 -747 506 -441 -1587 -1390 -1140 457 345 -998 -1206 -547 431 767 133 -98 440 893 956 33 273
662 273 1612 1399 620 887 454 302 972 487 -585 -126 805 -154 -2005 -1066 -217 -934 -1474 -1064 -1097 -749
682g49M61j21o62O41J048m18J03O47j67l00P08K19k80p32Q2O5N33k80r81l44O78
703A51k27q58M92K78j127k8J242r0j108J43P49k91N23P16r57l84R75P71k78n57
723A35K96M2Q4N16L82j240j78N07N76Pj169m86N05M75o83l29j06o6o32N59P83
744b2j014l3K56J12O48M41j97o38N73J014O0p51K6O56j66m70N2L35k81o50M17
765C68K44l49n85o24N24L18k75k37l19J8O84Lr85J56P18M49k00j18K43o2L61M90
787H22k44m27M41K57K79q8n90L48l36n2j51J02m5q78j77J41N2J72k36n70J43O42
809c95J8l63l51O72O64n0l38N8J47P96k75K40j9k98J71K13O4l45o31J59K63r2
831C08j29n00m46L60J49o6j55k47o1Q8J38K44o8n06M81L50N34p1m16K73J90J67
$$ plain form
682 -749 -288 -409 -1071 -430 618 200 303 950 783 483 1191 1410 1130 398 480 545 1078 798 -183 -527 151
703 151 -76 -934 -442 -164 -1291 -1319 -77 -167 -1275 -1132 -383 -674 -151 565 -392 -776 199 970 692 135
723 135 431 473 557 1073 1455 215 37 544 1120 1127 -42 -528 -23 452 -231 -560 -666 -732 -1364 -805 -22
744 -22 -1036 -1069 -813 -701 -53 388 191 -447 126 1140 1200 449 475 1131 965 495 547 882 601 -49 368
765 368 612 263 -322 -946 -422 -104 -379 -616 -935 -917 -233 -230 -1215 -1059 -341 108 -92 -210 33 -29 332 822
787 822 578 151 592 849 1128 1040 450 798 462 410 259 361 316 -562 -739 -598 -546 -374 -610 -1180 -1037 -395
809 -395 -377 -740 -1091 -419 245 195 -143 -85 62 858 583 823 804 506 677 890 954 609 -22 137 400 308
831 308 179 -321 -767 -407 -258 -324 -479 -726 -787 -699 -561 -317 -385 -891 -410 -60 474 403 -13 260 450 617
853F17J43p5l72L25J61L65l27j019K32J44J40j49o87j84K00j26K09j75m73J83
873h68J90M54L6n13K86K09L62L85l58j0K33K69R5k06r0J27J01Q8r0l40k40J66
895B86j96p6k79P5P1q0n02L9J74J00l42j69M85K08k9m62K07P04K35Jk10j77L28
918C91P99l41l17l18J56Q26k80o69m93o9K86K54n47l41j61J75K09l0j62l15J99
939g48L03O01m42l25K23N96L06k20K21k63NL19N14j59o14k23P29j01o57J22J34
960C21m40n2K16j85q91K87M72j43k13N7j0L0k3N51k91J09L25P5k9P9r2M79o5j32
984D35n9O72p9q33q7K87ml66K31n47n43P43O55j175p68O67O74j27n40J19k91M66
1006d70J312r31p71O43P12O0j53j28N3K0N10j06n61K50J56j06M1m77k61J54k4
$$ plain form
853 617 760 685 313 638 799 1164 837 -182 50 194 334 185 -502 -686 -486 -612 -403 -578 -1051 -868
873 -868 -678 -224 -188 -701 -415 -206 156 541 183 173 406 675 770 564 474 601 702 790 700 360 120 286
895 286 90 14 -265 -190 -119 -199 -701 -662 -488 -388 -730 -899 -414 -206 -235 -697 -490 214 449 450 240 63 391
918 391 1190 849 532 214 370 1196 916 247 -246 -315 -29 225 -322 -663 -824 -649 -440 -470 -632 -947 -748
939 -748 -445 156 -286 -611 -388 208 514 294 515 252 257 576 1090 931 317 94 823 722 65 187 321
960 321 -119 -171 45 -140 -1031 -744 -272 -415 -628 -571 -581 -551 -574 -23 -314 -205 120 195 166 245 153 632 567 435
984 435 376 1048 969 136 49 336 332 -34 197 -350 -893 -150 505 -670 -1438 -771 -97 -224 -764 -645 -936 -470
1006 -470 842 -89 -860 -217 495 555 402 274 327 347 857 751 190 440 596 490 531 54 -207 -53 -77
1027g7k14j56P46n85j051M69J167o11o37P61Q6m14K36N15k86m26R75M27q34J74
1047B65K74m9J16N7K1m99M3k08p3K68K00j027k32O40p5J02l6n41r2N13J55m00
1069e78j39L34L37M5L86m83n18R91O65n81m93M62K72n11M90L05q76o31P69M15
1089F61n41o35Q5L92N5n92k18L86k00R0L85J44n27k26Q49K9l24M17L03k24l55
1110d6L60P57n11pJ50j88K5p2k97k24j53N45K5o11m56L28L27j24m59j25p1J5N62
1133b50L52o63O1M96n9k49M54K02j29q2N56P8l87j18J65L13m03M22o63k42R4K06
1155A54R2n50k73p0N56l36j40j17N04l29j90P59k41l91M33N71j95m66O31J66n88
1176b0M85L19k39k92J34N8p8j18P5l40j59J1k0j50j03j31J08r3J33k03K34K17
$$ plain form
1027 -77 -291 -447 299 -286 -1337 -868 299 -312 -949 -188 -102 -516 -280 235 -51 -477 498 925 91 265
1047 265 539 490 606 663 684 185 228 20 -53 215 415 -612 -844 -204 -279 -177 -213 -754 -846 -333 -178 -578
1069 -578 -717 -383 -46 -1 385 -98 -616 375 1040 459 -34 428 700 189 679 984 108 -523 246 661
1089 661 120 -515 -430 -38 17 -575 -793 -407 -607 -517 -132 12 -515 -741 108 137 -187 230 533 309 -46
1110 -46 314 1071 560 553 703 515 540 468 171 -53 -206 339 364 -247 -703 -375 -48 -172 -631 -756 -827 -812 -250
1133 -250 102 -561 -500 -4 -63 -312 142 344 215 133 689 767 380 262 427 740 337 759 96 -146 -52 154
1155 154 246 -304 -577 -647 -91 -427 -567 -684 -180 -509 -699 60 -181 -572 -139 432 237 -229 402 568 -20
1176 -20 465 784 545 253 387 445 367 249 324 -16 -175 -164 -184 -334 -437 -568 -460 -553 -420 -623 -389 -172
1198a72n8K80k4n03L66N32J85l33n6P6J17J40L38m84l92J62N52k91m13J36J27
1219B85n00R3L1j31n71M37L6J38m12n8M36Q0L2J22J52m37j09N66N32k83j59M5
1241C25J33k28L87j57m15R1M93j03m63l44K96j73oK19k67o59L30L56K98m62r9
1262d48N9L17N2q6L61k24k66P96k10k12JL67o5l0L0J25l33l36L61n2l20l4n3l0
1286b30j24mR6k16k61K89M35l35j09O3K99NK56R0l30M5M44K98l76J4j80L23o1
1309D31j46J34k06l0J32m0k46m01J37M1p3o4K1j34j95L28J37j74k96L00L51j54
1331a47K37j25K39J45L3Q4J73k87k12M62N4m03l19J63N9q2Qq0l84o8J46J44r2
1354b52l11J74nK41j5j1k10J5N03K04o3l11J10K57J56K86n98K8l5L60l3l24k09
$$ plain form
1198 -172 -230 50 26 -477 -111 421 606 273 217 293 410 550 888 404 12 174 726 435 22 158 285
1219 285 -215 -122 -91 -222 -793 -356 -320 -182 -594 -652 -216 -136 -104 18 170 -267 -376 190 722 439 280 325
1241 325 458 230 617 460 45 136 629 526 63 -281 15 -158 -164 55 -212 -871 -541 -185 113 -349 -448
1262 -448 -389 -72 -20 -106 255 31 -235 561 351 139 140 507 442 412 442 567 234 -102 259 207 -113 -147 -200 -230
1286 -230 -354 -358 -262 -478 -739 -450 -15 -350 -459 -396 -97 -92 164 254 -76 -31 413 711 335 349 169 492 431
1309 431 285 419 213 183 315 275 29 -372 -235 -194 -267 -331 -310 -444 -639 -311 -174 -348 -644 -344 7 -147
1331 -147 90 -35 204 349 382 466 639 352 140 602 656 253 -66 97 156 74 82 2 -382 -450 -304 -160 -252
1354 -252 -563 -389 -394 -153 -168 -179 -389 -374 129 333 270 -41 69 326 482 768 170 198 163 523 490 166 -43
1377d3J72J76Pj65j29m90L98k59J46J08m84L91k02r5M78k70O3q4J13M03J6q2l0
1400A38j76M05L19j35m45M3J55O4n4k97l0k33L81j2l15j24p1J10J64m06J20k53
1422f52M15K30l24J96j39K32J80M01m51K65m09L76J78r8m3r3k19L41P2l67%j52
1444f1jL2P8j86j22j17L82k14k50J21m2mK58Q6k59K35J00J8ML53l96K17O3L64
1468F59m39k5K26j75j59K35o6m14P8r3P4J30k29k46j40K46J09j36j0J18O4M2K77
1491A26l31r1L11M39m4j22PP2j94J40L12k73n2j0j09j86J61Nl19J07j28k32J4
1514c97J49J3k75O02r5m92q3K80L25K12k35Mj79M96J66k83J62Qj80k3K37l68m3
1537An8N01m42j77M9J00l42M70k73j99o5Q2J41k43L06k2q8L08k95R1K18Q2J65
$$ plain form
1377 -43 129 305 312 147 18 -472 -74 -333 -187 -79 -563 -172 -374 -469 9 -261 -198 -282 -169 234 250 168 138
1400 138 -38 367 686 551 106 149 304 368 314 17 -13 -246 135 123 -192 -316 -387 -277 -113 -519 -399 -652
1422 -652 -237 -7 -331 -135 -274 -42 138 539 88 353 -56 320 498 400 357 264 45 386 458 91 91 -61
1444 -61 -62 -30 48 -138 -260 -377 5 -209 -459 -338 -380 -384 -126 -40 -299 -64 36 54 58 411 15 232 295 659
1468 659 220 195 421 246 87 322 256 -158 -80 -173 -99 31 -198 -444 -584 -338 -229 -365 -375 -257 -193 -151 126
1491 126 -205 -296 15 454 410 288 295 367 173 313 625 352 300 290 181 -5 156 161 -158 -51 -179 -411 -397
1514 -397 -248 -235 -510 92 -3 -495 -578 -298 27 239 4 8 -171 325 491 208 370 378 198 175 412 44 1
1537 1 -57 444 2 -175 -126 -26 -368 102 -171 -370 -435 -353 -212 -455 -149 -171 -259 49 -246 -155 63 145 310
1560C10p2J82N9l84Q3M3O2R3J4l48O6J57q6m04K99k9n73M76Rk58l53K58L15j82
1584b63j66L51M1j4o0N00k20k75R0M97kl5k05Oj27K30J90j56l61RL41l93k41k01
1608d64J20K81j26J07m21j72M78J2J93j24l23K56M45j12j94j8L71k39Q8K97j46
1629C09j47K37O4l48J78k50L9m96N02J86k42o15K21j42J44K89k9l55K6L04j70
1650b95P2J34L9j15L85q6O1K1J53q7J56o6j69r7K78J28n33O2j32j66K22O4m9l63
1674c83k9L47m26j5L41J1l27L70J30j77N0J07K0K52m3M9l31K64K31r8l1k03j01
1697HK90j86j89R8M8j47P5j09j01m07J04K28j8j2J8p7K41l1J67J28m16J11K67
1720I0k5L84j05j54J28m3L04k74oj79K02q1k14o4j41R3JN6r2m16J60J29J52o8
$$ plain form
1560 310 238 420 479 95 178 221 283 376 390 42 108 265 179 -225 74 45 -528 -52 -43 -301 -654 -396 -81 -263
1584 -263 -429 -78 -37 -51 -111 389 169 -106 -16 481 479 444 239 245 118 348 538 382 21 30 371 -22 -263 -464
1608 -464 -344 -63 -189 -82 -503 -675 -197 -185 8 -116 -439 -183 262 150 -44 -62 309 70 158 455 309
1629 309 162 399 463 115 293 43 82 -414 88 274 32 -583 -362 -504 -360 -71 -100 -455 -429 -125 -295
1650 -295 -223 -89 -50 -165 220 134 195 216 369 282 438 372 203 106 384 512 -21 41 -91 -257 -35 29 -20 -383
1674 -383 -412 -65 -491 -506 -165 -154 -481 -111 19 -158 -108 -1 19 271 228 277 -54 210 441 343 312 109 8
1697 8 298 112 -77 21 69 -78 -3 -112 -213 -620 -516 -288 -306 -318 -300 -377 -136 -167 0 128 -288 -177 90
1720 90 65 449 344 190 318 275 579 305 299 120 322 241 27 -37 -178 -85 -84 -28 -120 -536 -376 -247 -95 -163
1744a63j45j4L3P6J64n7k5K97J29l8j50J20QP4j9K54n51R2O7p6J45k30m27J07
1768c29K22j09J43p3l83J51M9L36m73L37Q4m1R4J24k62K16k92N65J90j16k89J52
1790B96%J37Kj25m04J62OJ19j0k42J55k50J68m37K91k60jO7O8j1j16K24N5K13
1814A07J84r3j74J30N9J50j53j2n6P1J41j51J85k64k81L84N3l29j72M4J1Kl66
1837e30L60o1j21J63L13k44k46Q9J23J52J46NK7L6L2L47k16l67K18j19K39J5k58
1860A03J13l65P8K04k95K20k73O3j21Mj03MM5J62Q2P9n0j7M8J08j7J56p0K86j73
1885B71N0r0o1j7o8M71k55k13j05m4P8J75l83j90m0M15J15m04J01j08j5M8L01
1908C2N6j62j99J11M02j96J81j78O7J61O9j15N3k79R2K02m6n7l27K08N0j35j0
$$ plain form
1744 -163 -308 -322 -289 -213 -49 -106 -131 166 295 257 107 227 235 309 290 544 -7 85 152 76 221 -9 -436 -329
1768 -329 -107 -216 -73 -146 -529 -378 -329 7 -466 -129 -45 -86 8 132 -130 86 -206 359 549 433 144 296
1790 296 296 433 435 310 -94 68 74 193 183 -59 96 -154 14 -423 -132 -392 -393 -326 -258 -269 -385 -161 -106 107
1814 107 291 198 24 154 213 363 210 198 142 213 354 203 388 124 -157 227 280 -49 -221 -177 -166 -164 -530
1837 -530 -170 -231 -352 -189 124 -120 -366 -277 -154 -2 144 149 176 212 244 591 375 8 226 107 346 361 103
1860 103 216 -149 -71 133 -162 58 -215 -152 -273 -269 -372 -368 -323 -161 -79 0 -50 -67 -19 89 72 228 158 444 271
1885 271 321 231 170 153 85 556 301 88 -17 -61 17 192 -191 -381 -421 -6 109 -295 -194 -302 -317 -269 32
1908 32 88 -74 -273 -162 240 44 225 47 114 275 344 229 282 3 95 297 251 194 -133 75 125 -10 -20
1931b0k4l23J53L0J57k16j57L12r7J95J37l41QL17K72l50J42O2k64K14K42k98
1953A51q5Q2J14L1l55L06p0m83K40p1j42J25q9K0N6K00Q3o88N48Rp7l3J86j1l0
1978A7K68M7k09J37OJ33O1k31m2q9j13J49l17J21q3Oj20J96k99n2J46K72l48M
2002c40Q3j03L80q3J62j60Q9K61r6K14j77j31KR9K47j50k35J75j8j74J28q1l43
2025b51J34j92K48Mk40N1kp1N7J49r0R5j08K26J02k4k32n4L88J35M4j94Lj11J51
2050B18J06l20j86K78o5K58m77R3jk9P0k19M9M1L4N2p5n9J89j33K06J0j26J9M9
2075a8q2K93mk83K72m6K42p2o2J5k30j02R4k6J51j59p7k5n8J44j08l70J07M97
2099I3m0k13K34k02J45j06R8J62j11j95L10o1KL01j41k56N6K14l10j13J55J7P5
$$ plain form
1931 -20 -44 -367 -214 -184 -27 -243 -400 -88 -185 10 147 -194 -186 131 403 53 195 257 -7 207 449 151
1953 151 66 148 262 293 -62 244 174 -309 -69 -140 -282 -157 -246 -226 -170 30 113 -575 -27 -18 -95 -128 58 47 17
1978 17 285 332 123 260 266 399 460 229 187 98 -15 134 -183 -62 -145 -139 -259 -63 -362 -414 -268 4 -344 -340
2002 -340 -257 -360 20 -63 99 -61 28 289 193 407 230 99 101 200 447 297 62 237 219 45 173 92 -251
2025 -251 -117 -309 -61 -57 -297 -246 -248 -319 -262 -113 -203 -108 -216 10 112 88 -144 -198 190 325 369 175 178 67 218
2050 218 324 4 -182 96 31 289 -188 -95 -96 -125 -55 -274 -225 -184 -150 -98 -173 -232 -43 -176 30 40 -86 -67 -18
2075 -18 -100 193 189 -94 178 132 374 302 240 255 25 -77 17 -9 142 -17 -94 -119 -177 -33 -141 -511 -404 93
2099 93 53 -160 74 -128 17 -89 9 171 60 -135 175 114 116 417 276 20 76 290 -20 -133 22 39 114
2122A14j28j86j0J87j73j31J51p2n1R9K21oo3j06L87l34L34j61N5O1K34K3j24
2145C21j80R4m4n3K13l52l3r8J01j17L3n5Q1k88K55J53m40J74J29k89L60k55J32
2168a58L1L58nk94L09J4k20K28J47o1j80r3J59k26K40J1l54N9J50k5k83l35M11
2191a17j97N7K17l69p1K00J85O9k2O9j3O2n2l4K72j83l4J76r8j5K8p8J10ol57
2216b01L53j47j20Lj25J68l89K61O9N4k57K3L10p0n0n9K37j58J18M0J83j34L90
2239D99m35l6P1K28q6q3r7J12Q3m8J24l79N5k34J41M9l97L73k79J17Jk0J40n4
2263a55K69j39q4j2K94k69L87p3m6p6n7P8J75o5k6l60L73k36K45l17m8r5J42L3
2287f2k92N07l92o9J56J79k35K54k43J31K42l05K40L1P6J63j04m4J9m3J63p6k25
$$ plain form
2122 114 -14 -200 -210 -23 -196 -327 -176 -248 -299 -200 21 15 -48 -154 233 -101 233 72 127 188 422 445 321
2145 321 141 235 191 138 351 -1 -34 -132 -31 -148 -115 -170 -89 -377 -122 31 -409 -235 -106 -395 -35 -290 -158
2168 -158 -127 231 226 -68 241 255 35 263 410 349 169 76 235 9 249 260 -94 -35 115 90 -193 -528 -117
2191 -117 -314 -257 -40 -409 -480 -280 -95 -26 -48 21 8 70 18 -16 256 73 39 215 117 102 130 52 162 156 -201
2216 -201 152 5 -115 -112 -237 -69 -458 -197 -128 -74 -331 -308 2 -68 -118 -177 60 -98 20 60 243 109 499
2239 499 64 28 99 327 241 158 61 173 256 208 332 -47 8 -226 -85 -36 -433 -60 -339 -222 -221 -241 -101 -155
2263 -155 114 -25 -109 -121 173 -96 291 218 172 96 39 117 292 227 201 -159 214 -22 223 -94 -142 -237 -95 -62
2287 -62 -354 153 -239 -308 -152 27 -208 46 -197 -66 176 -129 111 142 218 381 277 233 252 209 372 296 71
2310G1r1j11K51o9O0k69J28k75J71L4Lj11K2J63j36J01r8R3m6J46L15p3j84o6
2334B9r7L11j6j39J22N8j2k6j97J12j30k7OK00k22k09OM7q7O9j1K0j33J44J14
2359f8j48O2J37MJ89j36q8J25K73l7k03J39j03k01K13j04R8j59J27j5L6Qm42J88
2383a05L1oL3k71J58j17Q9M8j37J45P3O7P7K72m01L24l5q7P5o7M7l32K89j69J07
2408A08K14l69J60k76J44J32k88m8j18J26K3m0k71K57J41P7J17j17r0lM00p5j49
2431E5m1L18QO0r0k53KK59k04J44k00j85j11K14P2k12k8l2O6J5L8o2J9L2q9J54
2457e1n4J54l05L11oj65L13k33L21N9r4K6k39P6J5k72L45j17k12L2J20l00J87
2480h9n4j17j0K43l8k6p7o2R5P5K00j15p1j27J33J06K14k96L20j50l5J22l36K59
$$ plain form
2310 71 -20 -131 120 51 111 -158 -30 -305 -134 -100 -97 -208 -186 -23 -159 -58 -156 -63 -109 37 352 279 95 29
2334 29 -68 243 227 88 210 268 256 230 33 145 15 -12 -6 194 -28 -237 -231 -184 -271 -202 -213 -193 -326 -182 -68
2359 -68 -216 -154 -17 -13 176 40 -48 77 350 313 110 249 146 -55 158 54 152 -7 120 105 141 149 -293 -105
2383 -105 -74 -80 -47 -318 -160 -277 -188 -140 -277 -132 -59 8 85 357 -44 280 245 158 233 166 213 -119 170 1 108
2408 108 322 -47 113 -163 -19 113 -175 -223 -341 -215 -192 -232 -503 -246 -105 -28 89 -28 -118 -121 279 204 55
2431 55 14 332 340 400 310 57 59 318 114 258 58 -127 -238 -24 48 -164 -192 -224 -158 -143 -105 -167 -148 -116 -205 -51
2457 -51 -105 49 -256 55 49 -116 197 -36 285 344 250 276 37 113 128 -144 201 84 -128 -96 24 -276 -89
2480 -89 -143 -260 -270 -27 -65 -91 -168 -230 -135 -60 140 25 -46 -173 -40 66 280 -16 304 154 119 241 -95 164
2504A64j9O7N5k74J7k2Q1k13j19j51J94pJ44j33K01k08m6M59k38K33l88J93J11
2527A01L6K57j49j53J71k3M2l94L24lk02l9l4K22n86L33L42l30j07l1j77L46J85
2550A31l38P8K7j92J96L49o4l01Q4j14M23j72QO5r1R5R7k27j20j11L40j81K38
2573B20j59j5j68J9Q2k24J03j98J36j29J79J89j33Q2rJ41K4M7k09J77J9M7k40
2596a9M2pR2L93n92J92k55J92j43J65r1J88l66J57j6j66n3P7J78k35Q3j5m4J45
2620i8K08J28k10l7J20l6L13k41n9K9J54j27Jl6j1j72J65n5k13K6P4j11J58j4
2644d4N0k28j60K38j12J21j8J02j18K30J0J09k72K16p8K58l2O5k41M2nO2k70j55
2668b30J40M0K30j97j36J4J6J42j38o3J02k91K74O9j15N8R8J49l0p8N0k0k10J97
$$ plain form
2504 164 145 212 267 -7 10 -12 69 -144 -263 -414 -220 -227 -83 -216 -15 -223 -269 190 -48 185 -203 -10 101
2527 101 137 394 245 92 263 240 282 -112 212 209 7 -32 -66 156 -430 -97 245 -85 -192 -223 -400 -54 131
2550 131 -207 -129 -102 -294 -98 251 187 -114 -30 -144 279 107 115 180 89 184 281 54 -66 -177 163 -18 220
2573 220 61 46 -122 -103 -21 -245 -142 -340 -204 -333 -154 35 -98 -16 -25 116 140 187 -22 155 174 221 -19
2596 -19 23 16 108 501 -91 101 -154 38 -105 60 -31 157 -209 -52 -68 -234 -287 -210 -32 -267 -184 -199 -243 -98
2620 -98 110 238 28 -9 111 75 388 147 88 117 271 144 145 109 98 -74 91 36 -177 -151 -77 -188 -30 -44
2644 -44 6 -222 -382 -144 -256 -135 -153 -51 -169 61 71 180 -92 124 46 304 272 337 96 138 133 195 -75 -230
2668 -230 -90 -50 180 -17 -153 -139 -123 19 -119 -182 -80 -371 -97 -28 -143 -85 13 162 132 54 104 84 -126 71
2692G1L41l08J17j11J69m5n9j43m7j17K81k34l5L6j20p5P5R8N9j91O7J21O2j12
2716a00L5j21J40J32j88K47r9k32K85k2K88j8l38J68k14J75P3j69J2l21P6J17
2738g4m4j05J15l7J37L6r6O4J05Lj36l1M7J97J19j88j23n4p1M4J54p8J63j06j16
2763g5R7Rr8J42j78j63L20k13k19J58N0K16j91J50j29j49J44J94m8k31J55L3O9
2786D3J00J5j04P3j58J27L3L2J22N9r1k53J73k45R9j77K09k62j36J25J85j2L8
2809en6J44k60J53l6J17p5k67K70L93p9m7k56P4mo8j2k9J22p0P0k14K05p4j79
2834a83J64j31l3j05L4J76J7O4ql5K49j79M3j63M4J15K32k57o3K02j44pL15rk79
2859E9J3p7K58j48j80nr1J04j08Q3L5j60O1p2K40l8K0j3r6J16j8L26k75M2J04
$$ plain form
2692 71 412 104 221 110 279 234 175 32 -15 -132 149 -85 -120 -84 -204 -279 -204 -106 -47 -238 -171 -50 12 -100
2716 -100 -65 -186 -46 86 -102 145 46 -186 99 77 365 347 9 177 -37 138 211 42 54 -267 -191 -74
2738 -74 -118 -223 -108 -145 -8 28 -68 -4 101 104 -32 -63 -16 181 300 112 -11 -65 -136 -92 62 -16 147 41 -75
2763 -75 22 31 -67 75 -103 -266 54 -159 -378 -220 -170 46 -145 5 -124 -273 -129 65 17 -214 -59 -26 43
2786 43 143 158 54 127 -31 96 129 161 283 342 251 -2 171 -74 25 -152 57 -205 -341 -216 -31 -43 -5
2809 -5 -61 83 -177 -24 -60 57 -18 -285 -15 378 299 252 -4 70 66 -2 -14 -43 79 9 79 -135 70 -4 -183
2834 -183 -19 -150 -183 -288 -254 -78 -61 3 -5 -40 209 30 73 -90 -46 69 301 44 -19 183 39 32 347 338 59
2859 59 72 -5 253 105 -75 -80 -171 -67 -175 -92 -57 -217 -156 -228 12 -26 -6 -19 -115 1 -17 309 34 76 180
2884A80L4j12n8J96or3r2R9k33K37l29K42l8r3k01J95j00l1q4J72j97M54r7k1
2908B4j97k6J80M9J52j12L9j1Q6J02o8m9j99pn6L82l29l2J17l7j54n0k31K72L
2933a52K3Q7J37l26o8J95O3K10l24Q4Q3L01j00k02l1J35P6j8j15P7N4jj40j73
2957a25L01j76k74K95q1k98J93k35K15J34j58J47Q1m5K20j50j1j26n7K57j14L1
2979B4R5OM1q1k7O0N9j06j5k7Q6l51J93J17j68J15J04j72j20N1P3l92L51j01K1
3004a64O5r2L50j84j8K78J30m2k72K00q3NJ22j73j2j79J41O9m07L61j21J8L6O8
3028I6o3k70R2K37j64P9N6n30J14L43K43j30o1P3l9J81Rj55j0N3m7M0j39j14K5
3053h1K98j76Oj64N8m9J61N5j74k11rJ85j11J56k58O3j6K26o4Q9K5K14k83K83
$$ plain form
2884 180 214 102 44 240 234 141 49 148 -85 152 -177 65 27 -66 -267 -72 -172 -203 -287 -115 -312 142 45 24
2908 24 -173 -199 -19 30 182 70 109 98 184 286 218 169 -30 -37 -93 289 -40 -72 45 8 -146 -196 -427 -155 -152
2933 -152 -129 -42 95 -231 -299 -104 -41 169 -155 -71 12 313 213 11 -20 115 191 173 58 135 189 188 48 -125
2957 -125 176 0 -274 21 -60 -358 -165 -400 -185 -51 -209 -62 19 -26 194 44 33 -93 -150 107 -7 24
2979 24 119 125 166 85 58 118 177 71 56 29 115 -236 -43 74 -94 21 125 -47 -167 -116 -43 -435 -84 -185 -164
3004 -164 -99 -191 159 -25 -43 235 365 323 51 251 168 173 295 122 110 -69 72 141 -266 95 -26 -8 28 96
3028 96 33 -237 -145 92 -72 7 63 -467 -353 -10 233 103 42 115 76 257 266 111 101 154 107 147 8 -106 -81
3053 -81 217 41 47 -117 -59 -108 53 108 -66 -277 -286 -101 -212 -56 -314 -251 -267 -41 -105 -16 9 223 -60 223
3077B23j43K47j34l8J6p6p8J22j55j49L41l4k18j50J06n0J62J0L7P6k20NJ30l9
3101ij75jK82j22K5L6j09J26n6J57j10J21j88K14j06J96k1l32kQ4qR6l00N5P6
3126g1j03k6J87k43J1K46j84k4J61r4J61J0M7j12J44N3M3j09Rj91K38J52l01N5
3150E9p2J19j54RK3P2k97J56L5R9p6l0Q8l23K02P3k44J13J91k99L21j81O8j8J44
3175G8J81j05l2k0j92j8L25j90J9j34K02j8p5k36J49j29J01J29k60M9j13J11J91
3198A3q0o2k7j4N69k48n7k89L46m5K99q1j72j24j3K0mK9j79J11n9o6KL6o5L94
3224B34m32k8N6k49J44J87J96l2r0N9n4R8n9p3J38J3M9m4j09K81k20q0rR8j17
3249d3RQ5k08n7J58J34l75J80K00k95J81j8k06J37R5o9j19M02k24Q1j57J24J15
$$ plain form
3077 223 80 327 193 155 171 95 17 139 -16 -165 176 142 -76 -226 -120 -170 -8 2 39 115 -105 -100 30 -9
3101 -9 -184 -185 97 -25 0 36 -73 53 -3 154 44 165 -23 191 85 281 260 -72 -74 10 2 98 -202 -147 -71
3126 -71 -174 -200 -13 -256 -245 1 -183 -207 -46 -140 21 31 78 -34 110 163 206 97 106 -85 153 305 4 59
3150 59 -13 106 -48 -39 -16 56 -241 -85 -50 49 -27 -57 31 -292 -90 -17 -261 -148 43 -256 65 -116 -48 -66 78
3175 78 259 154 122 102 -90 -108 217 27 46 -88 114 96 21 -215 -66 -195 -94 35 -225 -176 -289 -178 13
3198 13 -67 -129 -156 -170 399 151 94 -195 151 106 405 324 152 28 15 35 31 60 -119 -8 -67 -133 -131 -95 -160 234
3224 234 -198 -226 -170 -419 -275 -88 108 76 -14 45 -9 89 30 -43 95 108 157 113 4 285 65 -15 -24 74 -43
3249 -43 -34 51 -157 -214 -56 78 -297 -117 83 -212 -31 -49 -255 -118 -23 -92 -211 191 -33 48 -109 15 130
3272A30j02J24p8Jn2N2o7L0J2J4j94J26k19J42J9k06j5J15P9J62j30J2K5K1j00
3297i9R4j09J14L9j13K38L6n9k23K49k0J17j48j97N4J03o6j10L1LR2J0o2k6k41
3322b93J25J12K04k35J07j27J33K0j15J67Kkr8J49L6j58K8M9J08Lj60j1n3L0Q6
3347A07o2k16J10l4K9J08k41l6K45Q8j7k7l44K92j3J8K74k75J9m2L7o0K26j49
3371C7l4K8J91j39Lj02J2J34k53J72k79Q4J4P9j1j22R8r2J9r2K52q1j26L7K10
3396C9m9K27l56K19N0J72q0j3N0k99mJ03O2l3m7j28j45K22k07J81J88l29J8P0
3420h9J61k04JK23j02j41LL40k81K15k2n7J28J20M1n9j99J06K4o7J46j83O3j54
3444A3J76j94j89m4K19Q9l02K16j89J49j54M0L26j76J45j16J21Q6Lq2K7lO0O8
$$ plain form
3272 130 28 152 74 75 23 75 8 38 50 64 -130 -4 -223 -81 -62 -268 -283 -168 -89 73 -57 -45 -20 1 -99
3297 -99 -5 -114 0 39 -74 164 200 141 -82 167 147 264 116 -81 -27 76 10 -100 -69 -66 26 36 -26 -52 -293
3322 -293 -168 -56 148 -87 20 -107 26 46 -69 98 100 98 0 149 185 27 55 104 212 215 55 44 -9 21 107
3347 107 45 -171 -61 -95 -66 42 -199 -235 10 98 81 54 -290 2 -11 7 281 6 25 -17 20 -40 186 37
3371 37 3 31 222 83 86 -16 -4 130 -123 49 -230 -146 -132 -53 -64 -186 -88 -180 -161 -253 -1 -82 -208 -171 39
3396 39 -10 217 -139 80 130 302 222 209 259 -40 -44 59 121 88 41 -87 -232 -10 -217 -36 152 -177 -159 -89
3420 -89 72 -132 -131 92 -10 -151 -148 192 -89 126 104 47 175 295 336 277 78 184 208 141 287 104 167 13
3444 13 189 -5 -194 -238 -19 70 -232 -16 -205 -56 -210 -170 156 -20 125 9 130 216 219 137 164 161 221 289
3468B89k33K64k53j61L67m10N8RJ79O7j49q1k85K32O3J84j56J03l9j54R2O5l33
3491b82R8J44P5K8L8n6J76l5k65K5O9J4k7Q7k98K79j21j55J72R5o7j57l7J54N0
3516Dj62J84k52J56p9l1J2K48j33Q4j57R3K57l60M49k66j8M5J78r2o9j3m8J5j85
3541a40K02j18j42J07l63M96j50N8J42j53M3n6o8J90N5n9k6J2K33l74K46r9q3
3564d7J9P9R5j4j42J10l6j14J25j43oj43K46M0L0j70q9j3J40J26l44J53O2L1J7
3589A2J65j85L6L03k23p1J20k77J52N8k37K11o4P9k3L0M0j52j1R5O5k58O0j14
3613a89J55j79L3L94l23J30K10p4Pj11j13M4J33l2J19j19J3n2J92K4k95P1Kpj62
3638a29L85n58J63k3J50j02kN1o5n5m8K41L8m2j53P6M6K16j2J15l26M92l62J23
$$ plain form
3468 289 56 320 67 -94 273 -137 -79 -70 109 176 27 -54 -339 -107 -44 140 -16 87 48 -106 -14 51 -282
3491 -282 -184 -40 35 63 101 45 221 186 -79 -54 15 29 2 89 -209 70 -51 -206 -34 61 -6 -163 -200 -46 4
3516 4 -158 26 -226 -70 -149 -180 -168 80 -53 31 -126 -33 224 -136 313 47 29 74 252 160 91 78 30 45 -140
3541 -140 62 -56 -198 -91 -454 42 -108 -50 92 -61 -18 -74 -142 48 103 44 18 30 263 -111 135 36 -47
3564 -47 -28 51 146 132 -10 100 64 -50 75 -68 -74 -217 29 69 99 -71 -160 -173 -33 93 -251 -98 -36 -5 12
3589 12 177 -8 28 331 108 37 157 -120 32 90 -147 64 0 79 56 86 126 -26 -37 58 123 -135 -75 -189
3613 -189 -34 -213 -180 214 -109 21 231 157 164 53 -60 -16 117 85 204 85 98 46 238 262 -33 38 40 33 -129
3638 -129 256 -302 -139 -162 -12 -114 -116 -65 -130 -185 -233 8 46 4 -149 -73 -27 189 177 292 -34 458 96 219
3662B19J34j23n2l8Qq1L6k50P5k8J35l5K6j73J04j68O2J00Jp1K18j66N3J30O2
3687A78R1k10k49L40k3j28Jn5n5K35j42L1m6n2J48p9p5J07q8j17K8k2O2J51j44
3712a13J09j14J23M8j99P0J08J34Q7j21j38l4N1J39M5pL6k86J25O5Nk47ok16K63
3737g3M3k31M8J70k56N41l01PM1N8J12k14O3R3O3l09J67K9O2J99n8j03r8L0o4
3762A9j9J12K1k25j24j05L91j49J60q3j11o6J24M2J1j19N7K41K0j75j79J93j39
3785a03R8J35p7j53L25Qm2r9j19R1L5j28L15k73J22j45m3r9J5K30k74J68j29J5
3809a27m8O7J71k3k10L0J65L0m0J41Pl27j3K11j54L2K57l64K71o2J6K2r8j22K85
3834A17kj67o1J66q3O7L9k35J47j59K48J57j62l5L9k1j07J57j51J09j49Q4M6Q9
$$ plain form
3662 219 353 230 178 140 148 67 103 -147 -72 -100 35 0 26 -147 -43 -211 -149 -49 -48 -119 99 -67 -14 116 178
3687 178 269 59 -190 150 127 -1 0 -55 -110 125 -17 14 -32 -84 64 -15 -90 17 -71 -188 -160 -182 -120 31 -113
3712 -113 -4 -118 5 53 -146 -76 32 166 253 132 -6 -40 11 150 195 188 224 -62 63 128 133 -114 -120 -336 -73
3737 -73 -30 -261 -213 -43 -299 242 -59 -52 -11 47 159 -55 8 101 164 -145 22 51 113 312 254 151 53 83 19
3762 19 0 112 133 -92 -216 -321 70 -79 81 -2 -113 -179 -55 -13 -2 -121 -64 177 197 22 -157 36 -103
3785 -103 -5 130 53 -100 225 233 191 92 -27 64 99 -29 286 13 135 -10 -53 -152 -137 93 -181 -13 -142 -127
3809 -127 -175 -108 63 40 -170 -140 25 55 15 156 163 -164 -177 34 -120 -88 169 -195 76 14 30 52 -46 -168 117
3834 117 115 -52 -113 53 -30 37 76 -159 -12 -171 77 234 72 37 76 55 -52 105 -46 63 -86 -2 44 133
3858A33J04k38j19J68n8p6l0n4J83q0R5p9j52K15j63J4j43J04M6N6l0J38K4jL2
3883H9Q1j48J71j29j12J00N1k10J07J5O6k4O9k93J35j07PM0KJ22k82L53k17J23
3907IJ1K2M1p9j13J10L3K0k8r1Q9M3O1qr8M6J01j65J13j82O7P3k34M3j45O3L65
3934A67m50J79%m3j51J07K29j37Q4J36l8j5p9J53J14j12Kl61K45r2j21M33k87
3957c7l1J0p1J96l0Kn1J44j25M4k51K41k66N9J00J64k07L5Q5nO8k8K43k42J64
3982B11j08J1j44J67j90K1p9K37l95N8K70j45L9n4N2j00K2k7J21L2J15j28O8j
4006E3J16k88J60j55J08P9j58J61k8K27j11j47MNO3m2j38J24k29o4K11J87k60
4029a22K35j88kk2N3j10J18p2J23j26J64J13j91M7p4K27p6L3J77k31J46j07k36
$$ plain form
3858 133 237 -1 -120 48 -10 -86 -116 -170 13 -67 28 -51 -203 12 -151 -137 -280 -176 -130 -74 -104 34 58 57 89
3883 89 170 22 193 64 -48 52 103 -107 0 15 81 57 126 -167 -32 -139 -132 -92 -90 32 -250 103 -114 9
3907 9 20 42 83 4 -109 1 34 54 26 -65 24 67 128 120 22 68 169 4 117 -65 2 75 -159 -116 -261 -198 167
3934 167 -283 -104 -104 -147 -298 -191 38 -99 -15 121 83 68 -11 142 256 144 146 -215 30 -62 -183 250 -37
3957 -37 -68 -58 -129 67 37 39 -12 132 7 51 -200 41 -225 -166 -66 98 -109 -74 11 6 74 46 289 47 211
3982 211 103 114 -30 137 -53 -32 -111 126 -269 -211 59 -86 -47 -101 -49 -149 -127 -154 -33 -1 114 -14 54 53
4006 53 169 -119 41 -114 -6 73 -85 76 48 275 164 17 21 26 89 47 -91 33 -196 -260 -49 138 -122
4029 -122 113 -75 -77 -99 -46 -156 -38 -110 13 -113 51 164 -27 20 -54 173 97 130 307 76 222 115 -121
4052a21K85j89O6K9j80J13Om2J52j68%n1j6J76k85K79Q2l74K66J07k7j53N4J84
4076A93k6p3j06J10J3K49p6j9k95Q5K6j22L45l82PL7Q4k43K03p0j2m1j3J93k90
4101b23Q1J23J54m26L08O3M6j45L3Q3k02J22N6K8j08Kj02L6K2J33O9j24n7l2N4
4126fj24l4J37N2Q6Q7n5j07j07J29r0L0K16k33J01n8J09k86r6J78L6K83j1k38
4150aO9Mj20K2K2m6q3K3j50mL06j05j7k21P3J83jJ44j64Q9j27K26k20%J84P1j43
4177A4J23j16Q2j02J0n3Q0j02k9J07Nj97K02k5L2j19PK35k54L3J65j89J21O2l3
4202E9M8j23K61k71K5R2k2n9l9K00m7q0k23L91l50N2k5K33k57K0K14N7l48O1j6
4227a47K65k45J75J8k9O2j94P3J18P9k34K00j53K70j11J0j64K3J10p6k8j31L09
$$ plain form
4052 -121 164 -25 41 70 -110 3 9 -33 119 -49 -49 -100 -116 60 -225 54 136 -238 28 135 108 -45 9 193
4076 193 167 94 -12 98 111 360 284 265 -30 55 81 -41 304 -78 -71 -34 50 -193 10 -60 -72 -113 -126 67 -223
4101 -223 -142 -19 135 -291 17 80 126 -19 14 97 -105 17 73 101 -7 -5 -107 -71 -49 84 153 29 -28 -60 -6
4126 -6 -130 -164 -27 25 111 198 143 36 -71 58 -32 -2 214 -19 82 24 133 -153 -249 -71 -35 248 237 -1
4150 -1 68 72 -48 -26 -4 -50 -133 -110 -260 -264 42 -63 -80 -301 -228 -45 -46 98 -66 23 -104 122 -98 -98 86 157 14
4177 14 137 21 103 1 11 -42 38 -64 -93 14 19 -178 24 -1 31 -88 -81 154 -100 -67 98 -91 30 92 59
4202 59 107 -16 245 -26 -1 91 69 10 -29 171 124 44 -179 212 -138 -86 -111 122 -135 -115 99 156 -192 -131 -147
4227 -147 118 -127 48 66 37 99 -95 -22 96 175 -59 141 -12 258 147 157 -7 16 126 50 22 -109 200
4250B00j69j70J11j49j8L61l30K8J15k33L47k52L86k46K00l73M59k64P7p6l4K77
4272B47k00L46l56mJ34n9j33n8o4JJ8J34l08M5j8L55k73K20p7j1o4O5j82J45K81
4297A84k17J01k22J43jO4M7J93k03k39J88J51j87K22l70K86j89j13M1J94K2J75
4319B70j81l71J76P3j52K34q4l8j09O8j06K79j75J56J56j53L7qk4P3j83J79k5
$$ plain form
4250 200 31 -139 -28 -177 -195 166 -164 -136 -21 -254 93 -159 227 -19 181 -192 267 3 80 4 -30 247
4272 247 47 393 37 33 167 108 -25 -83 -147 -146 -128 6 -302 -257 -275 80 -193 27 -50 -61 -125 -60 -242 -97 184
4297 184 -33 68 -154 -11 -12 52 99 292 89 -150 38 189 2 224 -146 140 -49 -162 -121 73 95 270
4319 270 89 -282 -106 -33 -185 49 -35 -73 -182 -114 -220 59 -116 40 196 43 80 72 48 121 -62 117 92
$$ [...]
8191I8
##END NTUPLES=NMR FID
##END=
