##TITLE=1H_Pr dep 2
 CDCl3, 8 sc, 
 2.08.2021
##JCAMPDX= 6.0         $$ Bruker NMR JCAMP-DX V2.0
##DATA TYPE= NMR FID
##DATA CLASS= NTUPLES
##ORIGIN= UXNMR, Bruker Analytische Messtechnik GmbH
##OWNER= root
$$ XWIN-NMR		Version 3.5
$$ Mon Aug  2 11:38:39 2021 Russian Standard Time (UT+4h)  she@DPX200
##.OBSERVE FREQUENCY= 200.131506
##.OBSERVE NUCLEUS= ^1H
##.DELAY= (6, 6)
##.ACQUISITION MODE= SIMULTANEOUS
##.ACQUISITION SCHEME= undefined
##.AVERAGES= 8
##.DIGITISER RES= 18
##SPECTROMETER/DATA SYSTEM= spect
##.PULSE SEQUENCE= zg30
##.SOLVENT NAME= CDCl3
##.SHIFT REFERENCE= (INTERNAL, CDCl3, 0, 15.7039)
##AUDIT TRAIL= $$ (NUMBER, WHEN, WHO, WHERE, WHAT)
$$ ##TITLE= Audit trail, XWIN-NMR		Version 3.5
$$ ##JCAMPDX= 5.01
$$ ##ORIGIN= Bruker BioSpin GmbH
$$ ##OWNER= she
$$ F:/spectra/data/she/nmr/H-F/1/audita.txt
$$ ##AUDIT TRAIL=  $$ (NUMBER, WHEN, WHO, WHERE, WHAT)
(   1,<2021-08-02 11:37:19.71 +0400>,<she>,<DPX200>,
      <created by zg, POWCHK disabled, PULCHK disabled
       configuration hash MD5:
       00 E9 B6 7A A2 85 ED C7 34 08 36 98 17 FE 4E 26
       data hash MD5: 16K
       00 F8 C4 27 DA B6 A7 26 8C 21 CE 99 27 A9 C2 42>)
$$ ##END=
$$ 
$$ hash MD5
$$ A3 46 04 81 14 2E 00 6A 04 0D 56 FA 7B 9A 56 B4
##$RELAX= 
##$RELAX= 
##$RELAX= 
##$RELAX= 
##$RELAX= 
##$RELAX= 
$$ Bruker specific parameters
$$ --------------------------
##$DU= <F:/spectra>
##$EXPNO= 1
##$NAME= <H-F>
##$PROCNO= 1
##$TYPE= <nmr>
##$USER= <she>
##$AMP= (0..31)
100 100 100 100 100 100 100 100 100 100 100 100 100 100 100 100 100 100 
100 100 100 100 100 100 100 100 100 100 100 100 100 100 
##$AQSEQ= 0
##$AQ_mod= 1
##$AUNM= <au_zg>
##$AUTOPOS= <>
##$BF1= 200.13
##$BF2= 200.13
##$BF3= 200.13
##$BF4= 200.13
##$BF5= 200.13
##$BF6= 200.13
##$BF7= 200.13
##$BF8= 200.13
##$BYTORDA= 1
##$CFDGTYP= 0
##$CFRGTYP= 5
##$CHEMSTR= <none>
##$CNST= (0..31)
1 1 145 1 1 1 1 1 1 1 1 1 1 1 1 1 1 1 1 1 1 1 1 1 1 1 1 1 1 1 1 1 
##$CPDPRG= <>
##$CPDPRG1= <>
##$CPDPRG2= <>
##$CPDPRG3= <>
##$CPDPRG4= <mlev>
##$CPDPRG5= <mlev>
##$CPDPRG6= <mlev>
##$CPDPRG7= <mlev>
##$CPDPRG8= <mlev>
##$CPDPRGB= <>
##$CPDPRGT= <>
##$D= (0..31)
0 1.2 0 0 0 0 0 0 0 0.06 0 0.03 0 0 0 0 0.0002 0 0 0 0 0 0 0 0 0 0 0 0 
0 0 0 
##$DATE= 1627889839
##$DBL= (0..7)
120 120 120 120 120 120 120 120 
##$DBP= (0..7)
150 150 150 150 150 150 150 150 
##$DBP07= 0
##$DBPNAM0= <>
##$DBPNAM1= <>
##$DBPNAM2= <>
##$DBPNAM3= <>
##$DBPNAM4= <>
##$DBPNAM5= <>
##$DBPNAM6= <>
##$DBPNAM7= <>
##$DBPOAL= (0..7)
0.5 0.5 0.5 0.5 0.5 0.5 0.5 0.5 
##$DBPOFFS= (0..7)
0 0 0 0 0 0 0 0 
##$DE= 6
##$DECBNUC= <off>
##$DECIM= 32
##$DECNUC= <off>
##$DECSTAT= 4
##$DIGMOD= 1
##$DIGTYP= 9
##$DL= (0..7)
0 120 120 120 120 120 120 120 
##$DP= (0..7)
150 150 150 150 150 150 150 150 
##$DP07= 0
##$DPNAME0= <>
##$DPNAME1= <>
##$DPNAME2= <>
##$DPNAME3= <>
##$DPNAME4= <>
##$DPNAME5= <>
##$DPNAME6= <>
##$DPNAME7= <>
##$DPOAL= (0..7)
0.5 0.5 0.5 0.5 0.5 0.5 0.5 0.5 
##$DPOFFS= (0..7)
0 0 0 0 0 0 0 0 
##$DQDMODE= 0
##$DR= 18
##$DS= 0
##$DSLIST= <SSSSSSSSSSSSSSS>
$$ [...]
##$SUBNAM2= <"">
##$SUBNAM3= <"">
##$SUBNAM4= <"">
##$SUBNAM5= <"">
##$SUBNAM6= <"">
##$SUBNAM7= <"">
##$SUBNAM8= <"">
##$SUBNAM9= <"">
##$SW= 20.0188882624521
##$SWIBOX= (0..15)
0 0 2 0 0 0 0 0 0 0 0 0 0 0 0 0 
##$SW_h= 4006.41025641026
##$TD= 16384
##$TD0= 1
##$TE= 0
##$TE2= 300
##$TE3= 300
##$TEG= 300
##$TL= (0..7)
0 120 120 120 120 120 120 120 
##$TP= (0..7)
150 150 150 150 150 150 150 150 
##$TP07= 0
##$TPNAME0= <>
##$TPNAME1= <>
##$TPNAME2= <>
##$TPNAME3= <>
##$TPNAME4= <>
##$TPNAME5= <>
##$TPNAME6= <>
##$TPNAME7= <>
##$TPOAL= (0..7)
0.5 0.5 0.5 0.5 0.5 0.5 0.5 0.5 
##$TPOFFS= (0..7)
0 0 0 0 0 0 0 0 
##$TUNHIN= 0
##$TUNHOUT= 0
##$TUNXOUT= 0
##$USERA1= <user>
##$USERA2= <user>
##$USERA3= <user>
##$USERA4= <user>
##$USERA5= <user>
##$V9= 5
##$VALIST= <valist>
##$VCLIST= <CCCCCCCCCCCCCCC>
##$VD= 0
##$VDLIST= <DDDDDDDDDDDDDDD>
##$VPLIST= <PPPPPPPPPPPPPPP>
##$VTLIST= <TTTTTTTTTTTTTTT>
##$WBST= 1024
##$WBSW= 4
##$XGAIN= (0..3)
0 0 0 0 
##$XL= 0
##$YL= 0
##$YMAX_a= 365818
##$YMIN_a= -404602
##$ZGOPTNS= <>
##$ZL1= 120
##$ZL2= 120
##$ZL3= 120
##$ZL4= 120
##$ABSF1= 10
##$ABSF2= 0
##$ABSG= 5
##$ABSL= 3
##$ALPHA= 0
##$AQORDER= 0
##$ASSFAC= 0
##$ASSFACI= 0
##$ASSFACX= 0
##$ASSWID= 0
##$AUNMP= <proc_1d>
##$AZFE= 0.1
##$AZFW= 0.1
##$BCFW= 1
##$BC_mod= 2
##$BYTORDP= 1
##$COROFFS= 0
##$CY= 11.3945322036743
##$DATMOD= 1
##$DC= 2
##$DFILT= <>
##$DTYPP= 0
##$F1P= 2.36226072786647
##$F2P= -0.459571619588291
##$FCOR= 0.5
##$FTSIZE= 0
##$FT_mod= 4
##$GAMMA= 1
##$GB= 0.15
##$INTBC= 1
##$INTSCL= 1
##$ISEN= 128
##$LB= 0.24
##$LEV0= 0
##$LPBIN= 0
##$MAXI= 10000
##$MC2= 0
##$MEAN= 0
##$ME_mod= 0
##$MI= 1.114404
##$NCOEF= 0
##$NC_proc= 0
##$NLEV= 6
##$NOISF1= 3.799351
##$NOISF2= 2.8
##$NSP= 1
##$NTH_PI= 0
##$NZP= 0
##$OFFSET= 15.70392
##$PC= 1
##$PHC0= -12994.85
##$PHC1= 12.00099
##$PH_mod= 1
##$PKNL= yes
##$PPARMOD= 0
##$PSCAL= 0
##$PSIGN= 0
##$REVERSE= no
##$SF= 200.130013532006
##$SI= 16384
##$SIGF1= 3
##$SIGF2= 2
##$SINO= 400
##$SIOLD= 16384
##$SREGLST= <1H.CDCl3>
##$SSB= 0
##$STSI= 0
##$STSR= 0
##$SW_p= 3612.71676300578
##$SYMM= 0
##$S_DEV= 0
##$TDeff= 0
##$TDoff= 0
##$TI= <>
##$TILT= no
##$TM1= 0
##$TM2= 0
##$TOPLEV= 0
##$USERP1= <user>
##$USERP2= <user>
##$USERP3= <user>
##$USERP4= <user>
##$USERP5= <user>
##$WDW= 1
##$XDIM= 8192
##$YMAX_p= 0
##$YMIN_p= 0
$$ End of Bruker specific parameters
$$ ---------------------------------
##NTUPLES= NMR FID
##VAR_NAME=  TIME,          FID/REAL,        FID/IMAG
##SYMBOL=    X,             R,               I
##VAR_TYPE=  INDEPENDENT,   DEPENDENT,       DEPENDENT
##VAR_FORM=  AFFN,          ASDF,            ASDF
##VAR_DIM=   8192,          8192,            8192
##UNITS=     SECONDS,       ARBITRARY UNITS, ARBITRARY UNITS
##FACTOR=    0.0002496,     1,               1
##FIRST=     0,             0,               0
##LAST=      2.0444736,     0,               0
##MIN=       0,             -404602,         0
##MAX=       2.0444736,     365818,          0
$$ Real data points
##PAGE= N=1
##DATA TABLE= (X++(R..R)), XYDATA
0@%%%%%%%%%%qJ6j6K4l2L2m0N6p0P8q8J12j36J60j92K24k56K96l44L97m54N17
32B76n89O69p56Q53r62J077j205J348j502J670j857K060k279K519k780L068l385
49a775L729m106M523m985N497o069O712p436Q261r216J0330j1653J3251j5223
63h160J7744k1084K5741l2747M4597o9742K14633k61227k03758N34066j29704
74A10359k38059J20618n1161j00981L47891r5231m29697K71298M03493l66430
84b7900j93610K94232N109r8629J31577j72988j21333L70187J4885m54039J23473
95a29036L52001k05753j50733J70992q1750j1606K32133j89372k50816L52270
105H8330J48868l86870K553K80380j22657o0597J44933j72198n4890L27404j03666
$$ plain form
0 0 0 0 0 0 0 0 0 0 0 0 -8 8 -8 16 -16 16 -24 32 -38 40 -48 64 -72 88 -104 120 -136 160 -184 213 -241 276
32 276 -313 356 -400 453 -509 568 -637 711 -791 879 -978 1082 -1197 1322 -1458 1610 -1775
49 -1775 1954 -2152 2371 -2614 2883 -3186 3526 -3910 4351 -4865 5465 -6188 7063 -8160
63 -8160 9584 -11500 14241 -18506 26091 -43651 170982 -90245 -294003 240063 110359
74 110359 -127700 -7082 -58243 -159224 188667 93436 -336261 -64963 338530 -27900
84 -27900 -221510 72722 77831 -20798 110779 -62209 -183542 186645 201530 -252509 -129036
95 -129036 222965 17212 -133521 37471 -44279 -55885 176248 -13124 -263940 88330
105 88330 237198 -149672 -147119 133261 10604 -49993 94940 -77258 -132148 195256 91590
116I1590l49413K33187K35320k72485n0564J89519j14666m833J99987j96888j68402
127b07648L34849N2496l49707P2561K37740j37683n2602J08998j24760K805K26822
138A63871j42059k19642K38411J25355k35741o47J32337q3444K8247Q7639j79393
149h5066k0505K57635q0047k32658J55629J27351j54871J1938P0209j19353O1258
160h480J47943j88197j01159K51075R515k22060P7859J15915j11184K4927P1786
171F7940j43039J8142J88711j15379j55931J68003O9559j50992K4692O7143q3774
182d4925M8113Q1508j44246k6110J81210m4840j48821Q9207O3988q4376K7840
193a452K6961q9840N6969R9819j24865n6956J46368p272j09691N2824L1034o0715
$$ plain form
116 91590 -257823 -24636 210684 -61801 -112365 77154 -37512 -42345 157642 -39246 -207648
127 -207648 127201 179697 -170010 -97449 140291 2608 -49994 59004 -65756 -62951 163871
138 163871 21812 -197830 40581 165936 -69805 -70452 61885 -21559 6688 94327 -85066
149 -85066 -105571 152064 72017 -160641 -5012 122339 -32532 -20594 49615 -69738 -8480
160 -8480 139463 -48734 -149893 101182 110697 -111363 -33504 82411 -28773 -3846 67940
171 67940 -75099 -56957 131754 16375 -139556 28447 98006 -52986 -28294 38849 -44925
182 -44925 3188 84696 -59550 -85660 95550 50710 -98111 -8904 55084 -29292 -1452
193 -1452 25509 -64331 -7362 92457 -32408 -89364 57004 49732 -59959 -7135 23899 -36816
205c6816N2684K5331j07147L5665J15113q8244p4212J06539R722p7453M5119J4560
217B0861o6473N5247M9121j02348n498J10099m0692p6184O5888K0227n3815L3449
229I882J5314o0631L1830N4192o6017k5222P1776j1313m7450L7363O295l6547
241b0528L4702J4004n5508J6897M7920m0115k2793M3508q759k6073L2824m922
253A1157l6078L4487K0030m8831M948M1275k6283j7826L0932j0222k1866L1023
265A2746Q26l7706K0954K7955l3393p460L0445j1783j4498J9843n561j9250K0284
278C402Q675k7864N332K4253j4280j1338J5430k217q122R257l273j0246J0977
291a4N744j4608J486J2453o366m846P644l211k692P431l348o871Q016L643r804
$$ plain form
205 -36816 15868 41199 -65948 -30283 84830 -3414 -77626 28913 38635 -38818 6301 20861
217 20861 -45612 9635 58756 -43592 -49090 61009 20317 -55867 10021 30248 -23567 9882
229 9882 25196 -35435 -3605 50587 -15430 -40652 31124 19811 -27639 9724 16019 -20528
241 -20528 14174 28178 -27330 -10433 37487 -2628 -25421 18087 9328 -16745 16079 11157
253 11157 -24921 9566 29596 -19235 -14287 26988 705 -17121 13811 3589 -18277 12746
265 12746 13572 -24134 -3180 24775 -8618 -16078 14367 2584 -11914 7929 2368 -16882 3402
278 3402 12077 -15787 -10455 13798 -482 -11820 3610 1393 -6729 2528 -745 -10991 -14
291 -14 5730 -8878 -7392 5061 -1305 -6151 1493 -1718 -4410 3021 -327 -7198 818 4461 -5343
306e343J031Q151n293k515O644k169l698P041r55o335M795M016o963j169O208
321C446j448m102L545K412l305J513J457k458Q00J581j611j826K000J227k627
336F04k50K397k79r20k13R36O30j347p06J158l13j006L31m12n79L6J364j228j145
355i42K463J45k841J347J517l108m10K172j404k124L131N85l862J959L063m403
371b712J71L809l143k061M459j000n122L643L463o047J125N274m660p76N969m586
387b194l180Q118p27q958N061O419r031L46Q171o906j483J1044o852q293J4166
402E701J327j5501O192J1090j2544n18J2390j1294l388J9091q527j7353J9297
415E963P673k1351M509J4450j4457L5J7063j7101r626K8561m829k8191J9184J5569
$$ plain form
306 -5343 -4312 3839 -1454 -3969 2675 506 -3192 3849 2894 -3441 1354 5370 -1593 -2762 3446
321 3446 1998 -2104 1441 3853 548 2061 3518 1060 1860 3441 1830 4 2004 3231 604
336 604 354 2751 2472 1552 1339 2275 2905 1558 852 2010 1697 691 1022 610 31 67 1431 203 -942
355 -942 1521 1666 -1175 172 1689 -1419 -1829 343 -1061 -3185 -54 531 -3331 -1372 1691 -2712
371 -2712 -2541 1268 -1875 -3936 523 -477 -5599 -1956 1507 -4540 -3415 1859 -2801 -3577 2392 -2194
387 -2194 -5374 2744 2017 -6941 -1880 4539 -4492 -4146 4025 -2881 -4364 6680 -172 -8465 5701
402 5701 7028 -8473 -2281 8809 -3735 -4253 8137 -3157 -6545 12546 4019 -13334 5963
415 5963 13636 -7715 -3206 11244 -3213 -3178 13885 -3216 -12842 15719 10890 -17301 1883 17452
429A7452k3720L055J5665j9463J652K6062k2991j9960L7166K771l6780J5360K0303
442A6572k4080N423J8035k9693O58M0717k4845l4868M0702J4096m0254J1262J9470
455A3195k6922J2486K5388m2164p847N6367j7430m9291L5547K3232l7268J0547
467d160J7189l6297J7647M1492m9977k5686O5477j690n5291K5641K2443l3004
479a6216J9828J7867n3657J4782O4106m7454m6451O2755J2723n0642K1268J4160
491A3069l8941L3666L1335p1804k725Q3669l0881o1779N0254J8144m1617K8709
503A1099O434n7588M0370N7687p8334l0048Q7988q384o1648L6302R446l7102M6564
516B2786J0243q2854L1437Q4950o6482n4773P5098O501m8495L5174n644n0373
$$ plain form
429 17452 -6268 -3213 12452 -7011 -5359 20703 -2288 -22248 14918 17689 -19091 -3731 16572
442 16572 -7508 -2085 15950 -13743 -13085 27632 2787 -32081 8621 22717 -17537 -6275 13195
455 13195 -13727 -1241 24147 -18017 -25864 30503 13073 -36218 -671 22561 -14707 -4160
467 -4160 13029 -23268 -5621 35871 -14106 -39792 25685 23995 -31296 -5655 16788 -16216
479 -16216 3612 21479 -32178 -17396 46710 -744 -47195 15560 28283 -22359 -1091 13069
491 13069 -25872 7794 39129 -32675 -35400 48269 17388 -44391 5863 24007 -17610 11099
503 11099 17533 -40055 315 58002 -20332 -50380 37608 29224 -32424 3878 13324 -23778 22786
516 22786 33029 -49825 -18388 66562 80 -54693 20405 26906 -21589 13585 7941 -42432
528d2432O3630L4398j00744J723J00359l7931o3009N1832L878l3239N0334j2820
540A5979p7345O4908O7428r7591k9703R2670j4693m8999M0862j7029l6216P8247
552C8518J270j09925M4991R8303p5900n1399P1749o878k9747N0194l4591o0272
564f3687R3877L5489j21897P563J04370m1806m7770M6089k1586j5260P6500l7853
576A4029r5027Q8193P3151j09507k5727Q7806k0625k7771M2255m5441k8622J02567
588E5281j0133j20646N2621R4769p2588l8803N5912k1087m804N8903o0520n8449
600f9544J09624K7755j20601J3732Q7531m1274k3601L7783m5859j490R1347n0632
612A4771r5860R1388O3085r7869j3176O3459k9130K05M2745o8358k3710J12075
$$ plain form
528 -42432 21198 55596 -45148 -43425 56934 19003 -44006 7826 11704 -21535 28799 15979
540 15979 -61366 3542 70970 -26621 -56324 36346 21653 -27346 13516 -3513 -39729 38518
552 38518 39788 -70137 -25146 73157 -2743 -54142 17607 10729 -19018 31176 -3415 -63687
564 -63687 30190 65679 -56218 -48655 55715 13909 -33861 12228 -9358 -24618 51882 14029
576 14029 -80998 7195 80346 -29161 -54888 32918 12293 -15478 26777 -18664 -47286 55281
588 55281 45148 -75498 -22877 71892 -696 -39499 16413 -4674 -9478 49425 -11095 -69544
600 -69544 40080 67835 -52766 -39034 48497 7223 -16378 21405 -24454 -25944 65403 14771
612 14771 -81089 10299 73384 -24485 -37661 25798 -3332 -3127 39618 -28740 -52450 59625
624E9625j6503j14019N3068P4091o2139j3697L5612m1149J7387O6969p4587n7894
636g3236J09585K2143j04908J7061O0607l7432M799K6445o3902J0719R3260n3898
648A1243q5439Q0932M6522p5061J752L4160l4942K5688L9359p8742j5815J03478
660E3135j9217r0685M5462M6578m5265P953J6683n0816L1103O3926p4176m6173
672f1492R3086J1105p6040K0931L0760l2597K5041J8113o8950J5890Q3149m9902
684I094o4408O5129K5354n0288J3993J0878l6046L7386L2773p4031q909Q3938
696D4863k1038o2494L8236J9730l1032K3415L161n0493L3739N1563o2142l0621
708d3113O8085o7m7374K3366P065k6890L3584J0494n8727J5938O0115l9427l8693
$$ plain form
624 59625 43122 -70897 -17829 56262 -5877 -19574 16038 -25111 -7724 59245 -15342 -73236
636 -73236 36349 58492 -46416 -29355 31252 -6180 -1381 25064 -38838 -28119 65141 11243
648 11243 -74196 6736 53258 -21803 -20051 14109 -20833 4855 44214 -34528 -50343 53135
660 53135 33918 -56767 -11305 35273 -9992 -2039 14644 -36172 -5069 58857 -15319 -61492
672 -61492 31594 42699 -33341 -12410 18350 -14247 10794 28907 -40043 -24153 58996 9094
684 9094 -55314 9815 35169 -15119 -1126 9752 -26294 11092 43865 -30166 -39075 44863
696 44863 23825 -38669 -433 19297 -11735 11680 14841 -35652 -1913 49650 -12492 -43113
708 -43113 24972 24905 -22469 897 7962 -18928 14656 25150 -33577 -17639 42476 3049 -35644
721c5644M4894O368k9232K1275k441l2370L5827K3521n5969k741N4933j8745l3562
734b3886K7986J513k0103K7111k116m0255K7170L3947m2642j3931M0484p553k1675
747a3950K0872o004j9572L0943N119m2305J4431L5733k7274j6177K6879n647j2890
760i842K0926q123k3490K7356J4326l6104J978K9732j4484j2754J8220p698r623
773i580K1932m109k5660J7829J8365k4248m996K0754q394p272J4105q838j0824
786a0936K0350J708k3464Q714J7494j5201n182J3070o802m287J3640p767j2423
799a1086J6167N478j8033K812J2959q934l531R582p174m469J2814l259j2751R996
813E71O844j1763L26Q634o259j988Q018n476n573R908o8r666M940N973p466j96
$$ plain form
721 -35644 9250 15618 -13614 7661 5220 -27150 8677 32198 -23771 -26512 28421 9676 -23886
734 -23886 4100 5613 -14490 12621 10505 -29750 -2580 31367 -11275 -25206 15278 7725 -13950
747 -13950 6922 918 -18654 12289 17408 -24897 -10466 25267 -2007 -18184 8695 3048 -9842
760 -9842 11084 2961 -20529 6827 21153 -14951 -12973 16759 2275 -10479 7741 43 -9580
773 -9580 12352 8243 -17417 412 18777 -5471 -10467 10287 1893 -5379 8726 -112 -10936
786 -10936 9414 11122 -12342 -3628 13866 -1335 -6517 6553 -249 -4536 9104 1337 -11086
799 -11086 5081 10559 -7474 -4662 8297 -637 -4168 5414 -1760 -6229 6585 3326 -9425 571
813 571 7415 -4348 -4022 4612 -1647 -3635 4383 -1093 -6666 3242 3174 -6492 -1552 4421 -3045 -3241
829c241N621m320j442N870k935m654O134J439o333K081M060m417J8L614k705j132
845b342M130j281l530K999K199l828P44K572k296o4K471j916q94K308k80k041
861a049J755J200k160J95K111j854l84J672p22r39J375K08j167Q63M95j245M3
878C97J299j189o0O59m18m57M81R7n72K00N59p05j16R21m78p09Q42n22k81M08
898C56j26j148P78L19o36k58R17n31r05J279o97r77J781k37j598J293L18j324
916a396M66J082j082j045K291p05k376K788M08k481J223J313k459O35K599k566
932a305q91L788r44l492K925J540l674J441K538m311J211M487l760k801N717n25
948A944m767L480J894m691K260L765o447P95P383m434n475P198J107o756L688
$$ plain form
829 -3241 2380 -1940 -3382 2488 -447 -5101 1033 2472 -3861 -1780 2280 -2137 -2119 1495 -1210 -2342
845 -2342 1788 507 -3023 -24 2175 -1653 -909 1663 -633 -697 1774 -142 -1036 1272 992 -1049
861 -1049 706 1906 -254 -59 2052 198 -186 1486 764 -175 1200 1408 241 1104 1599 354 397
878 397 1696 507 447 1106 688 231 712 809 237 437 996 291 175 1096 618 -91 751 229 -52 356
898 356 230 -918 -140 179 -457 -715 202 -329 -1234 45 -652 -1629 152 -85 -1683 -390 -72 -1396
916 -1396 -930 152 -930 -1975 316 -389 -2765 23 431 -2050 -827 486 -1973 -1338 1261 -1305
932 -1305 -2196 1592 648 -2844 81 1621 -2053 -612 1926 -2385 -1174 3313 -447 -3248 2469 1944
948 1944 -2823 657 2551 -2140 120 3885 -2562 -1767 5616 1182 -4293 2905 4012 -2744 944
963I44K479o393L832N302r099j065J0767m035q119P469J985p111M862K429r815
978e568N075R404j1437m984J3455j879r870O907J741q066P912L675j4523M189
992c969J4924j1801r186J4271n53r408Q029k85j0932J1347P669j9126J26J9789
1006A0895r021j2268J3239n18r306J2263j293j7423J2986J5221k1246n988K1242
1019H783m718j2207J1780k948j0421J7593J568k4768R958K2444j8391j1390J8418
1032E701k486q994J3539o741j6174K2751Q878l0266L015K6520j2898j2562J5209
1045E492n451p352K0362p219k6050K2965J9264l0222n366K5430q757q933J5129
1058I292j2378j0525K9421k204l5753J7240K7299k4931r387K0201r711l830K0951
$$ plain form
963 944 3423 -2970 862 6164 -2935 -4000 6767 2732 -5387 2082 4067 -3044 1818 4247 -5568
978 -5568 -493 8911 -2526 -7510 5945 4066 -5804 1103 2844 -5222 2690 6365 -8158 -3969
992 -3969 10955 -846 -10032 4239 3686 -5722 2307 2022 -8910 2437 10106 -9020 -8894 10895
1006 10895 1874 -10394 2845 2327 -6979 5284 3991 -13432 -446 14775 -6471 -12459 8783
1019 8783 4065 -8142 3638 690 -9731 7862 9430 -15338 -5380 17064 -1327 -12717 5701
1032 5701 3215 -5779 7760 1019 -15155 7596 16474 -13792 -10777 15743 2845 -9717 5492
1045 5492 41 -7311 13051 5832 -20218 2747 22011 -8211 -13577 11853 3096 -5837 9292
1058 9292 -3086 -13611 15810 13606 -22147 -4907 22392 -2539 -11926 8275 -1436 -5266 15685
1071A5685j7662k0413L4959Q895m0007O281K9569j6969p590J5315j5482k626L1008
1084B0963j6716l2706L2182K0969l5645l160K4230j1981j576J6989k3955r137
1096a9543M0851o908m2234K1709K7665k5807m942J6179j6037M492K6799k8251
1108f027k2146M3513O644m2199R507K4933j7600J436J3076k6078L458L9293k3825
1121C985l5314L6732J8529l5054K864J6828j7354J0713J8227l5069o797M7662
1133B5952j0813m1934K3737K1591k3654M221R028k3866J4287K9949l6108k1114
1145b8724M5590M335l7978J1257J5624j6767J2678Q364l5015J0009M1423k6965
1157C831l2766L4643J2963k7595P762O229j9546K0600J7315m1250l818M6766j2726
$$ plain form
1071 15685 -1977 -22390 12569 21464 -18543 -12262 17307 338 -7252 8063 -7419 -10045 20963
1084 20963 4247 -28459 3723 24692 -10953 -14113 10117 -1864 -3440 13549 -10406 -19543
1096 -19543 21308 14400 -27834 -6125 21540 -4267 -9209 6970 -9067 -4575 22224 -6027
1108 -6027 -28173 15340 21984 -20215 -10708 14225 -3375 -1939 11137 -14941 -11483 27810 3985
1121 3985 -31329 5403 23932 -11122 -8258 8570 -8784 1929 20156 -14913 -21710 25952
1133 25952 15139 -26795 -3058 18533 -5121 -900 8128 -15738 -1451 28498 -7610 -28724
1145 -28724 16866 21201 -16777 -5520 10104 -6663 6015 14379 -20636 -10627 30796 3831
1157 3831 -28935 5708 18671 -8924 -1162 5067 -14479 6121 23436 -17814 -21632 25134 12408
1170A2408l5100K1643J1840j7503J2631J214k9161K1101L0093l8589j7576M1593
1182A4594j56k8500J3236L967j4726K1395M238l8350J3535L9126k7393k5693L0127
1195E400M984j8224J2454l487j9505K6523J3847m0301l31M0385j3782k4729J8491
1208A725J992j1127J8688n465k8402K3230K5224l4080j1871L2289l670j7266J3493
1221D760n370j1590K5055J135l4743J2954L1129k2703j6445K1641j642r589J5127
1234I719r040j8105K6242J0547l3693K170K8262j2111j3121J4086n473o608K0004
1247A2879p566k4588K0805J8341k6990n330K1457o938p155J2301j0245q720K3118
1260A1369q47k7275J1944K0232j7323o918J3743o887k877J4825j1074j3909K1489
$$ plain form
1170 12408 -22692 -1049 10791 -6712 5919 7133 -22028 -927 29166 -9423 -26999 14594
1182 14594 14438 -14062 -826 3141 -11585 9810 14048 -24302 -10767 28359 966 -24727 5400
1195 5400 10384 -7840 4614 1127 -18378 8145 21992 -18309 -18640 21745 7963 -16766 1725
1208 1725 3717 -7410 11278 5813 -22589 641 25865 -8215 -20086 12203 8533 -8733 4760
1221 4760 -610 -12200 12855 13990 -20753 -7799 23330 627 -15818 5823 4181 -5408 9719
1234 9719 679 -17426 8816 19363 -14330 -12160 16102 3991 -9130 4956 -517 -7125 12879
1247 12879 5313 -19275 1530 19871 -7119 -12449 9008 2070 -5085 7216 -3029 -11749 11369
1260 11369 10522 -16753 -4809 15423 -1900 -8818 4925 -1962 -4839 9986 -1088 -14997 6492
1273F492O476k4172L382J7684j0674m169R924r156k766J7297p008j7693J5276
1286H93J0981j7492p87J1780p391o96R644j0560n525J7722k305j7359Q905J0898
1300H708j1266n39P451p667M26J1552r493q648J4823K407j4358M159Q464p738
1314a719Q08N924q637m69J2528o587r980J0230M804j0355K102N433o083J589O264
1329E852q050k645J0710k067r488O038M563o745J821L136n598J232O200n472m245
1344d758P800K07o884L318K596m450J812L044n425L20O219l485m267M840J358
1359B245n198K248K176l958J628L424m562o73M939j720l667L480P93l259J797
1374c07J484l134R93K801k432j535L019j39k710J775Q26k081J599R54k275M2K638
$$ plain form
1273 6492 12968 -11204 -7822 9862 -812 -4981 4943 -4213 -6979 10318 3310 -14383 893
1286 893 11874 -5618 -6405 5375 -2016 -2712 6932 -3628 -9153 8569 6264 -11095 -2190 8708
1300 8708 -2558 -3097 4354 -3313 -2887 8665 -828 -9476 5347 7754 -6604 -2445 6019 -1719
1314 -1719 -911 5013 -3624 -4093 8435 1848 -8132 2098 6902 -3453 -1351 4082 -2001 -412 5852
1329 5852 -2198 -4843 5867 3800 -5688 350 4913 -1832 -11 3125 -2473 -1241 4959 -513 -4758
1344 -4758 3042 3249 -3635 -317 2279 -2171 -359 2685 -2740 -2420 3799 314 -3953 887 2245
1359 2245 -2953 -705 1471 -2487 -859 2565 -1997 -2670 2269 549 -3118 362 1155 -2104 -307
1374 -307 1177 -1957 -964 1837 -595 -2130 889 750 -1960 -185 641 -1440 159 1113 -1162 -1120 1518
1391A518j493j641K551k07j357Q57N59j120M33J240j521k17J611q17p21J154J85
1408A014j341J033J32q79K98P61p67m46J049j26o69O45r3p47O45K60p40J57O52
1427H38p59l94Q57k07p75N59L95p11K24L80n92J8L20j39m78M26r7l24K68J89q62
1448h64O15N04j146L36R98j012m98J092o6q15N53L38p89L61P21j462J73J586j105
1467d80n62J258m4j238P28O13j373R50R82j876j29K531j252j121J464k09j210
1484i68J409M64j851Q89K168k728p33L398j281j509J791l81j810K396M51l421
1500a716J418L122k905j447L324q93k065K862q50k966L467J426m951Q65M638l418
1516h9j875L831j547k067M068q92m770M011L288o103k18N062k560k117M011k507
$$ plain form
1391 1518 25 -1616 935 728 -629 228 787 -333 100 1340 -181 -398 1213 396 -325 829 1014
1408 1014 -327 706 838 -41 257 1018 251 -195 854 728 59 704 611 -136 509 769 29 186 838
1427 838 79 -315 542 335 -440 119 514 -197 27 407 -185 -167 153 14 -464 -38 -135 -459 -191 -2 -864
1448 -864 -249 255 -891 -555 443 -569 -1067 25 -41 -856 -303 35 -754 -393 328 -1134 -961 625 -480
1467 -480 -1042 216 172 -1066 -338 275 -1098 -148 834 -1042 -1171 1360 108 -1013 451 242 -968
1484 -968 441 905 -946 -57 2111 -617 -1350 2048 767 -742 1049 668 -1142 1254 1705 -1716
1500 -1716 -298 2824 -81 -1528 1796 903 -1162 1700 850 -2116 1351 2777 -2174 -1309 3329 -89
1516 -89 -1964 1867 320 -1747 2321 1429 -3341 670 3958 -2145 -2363 2699 139 -1978 2033 -474
1532d74k923O061n29p003L889N435o082j341N257l098j244M868l190m544P337
1547B419J899r135J992O976n273j389M855m216j045P395l516q067Q154M830r838
1562c959Q82O345m566m61N671n903l387J1056j970j1257O730P483q647l85N498
1577C130n460Q36Q031p987o367J2939J478j2789L953P588o532J92N229q141O87
1592c213J2179p668j1114J2415N511j2162J668O429o338K564O725j1786k038J6084
1606I256m654j4371R338P414r454J710L979q626M826J0492j3045p640J7417O62
1620G304j4962N912O114p706M853L731j3254L459J6472j1471j2894J4994M896
1633G448j2362L940L259q491Q024P020j6684q34J9055o012j5167J0445N459q878
$$ plain form
1532 -474 -3397 2664 2135 -4868 -979 4456 -1626 -2967 2290 -808 -2052 2816 -374 -4918 2419
1547 2419 4318 -4817 -2825 4151 -1122 -2511 2344 -1872 -2917 4478 962 -7105 1049 5879 -3959
1562 -3959 -3077 3268 -1298 -1759 3912 -1991 -5378 5678 3708 -7549 -819 6664 -1983 -2368 3130
1577 3130 -2330 -1494 6537 -1450 -7817 5122 6600 -6189 -2236 5352 -1180 -988 4241 -3900 -3213
1592 -3213 8966 1298 -9816 2599 8110 -4052 -2384 4045 -2293 271 6996 -4790 -6828 9256
1606 9256 4602 -9769 -431 6983 -2471 -761 3218 -5408 -582 9910 -3135 -10775 6642 7304
1620 7304 -7658 -1746 4368 -3338 1515 5246 -8008 -4549 11923 452 -12442 2552 7448
1633 7448 -4914 -974 2285 -6206 1818 8838 -7846 -8680 10375 4363 -10804 -359 5100 -3778
1647c778N475R68j2127R429J2589j7233p337J9187n11j3985O601K804p014R254
1661D322K211j7311O271J8572j3537j2262J5099K537r451N999j253r821J2919
1674D295P422k0895P0K0793p335j2801R884J028n828R739k930j5086J2530J3650
1688A4536j9099o095J7942k230r789O986k450o378J4313j34k0056Q299J8080j3822
1702A03r969J2918n10n643Q510n640j0402J6185O243k1554J496J8282p297r278
1716f556Q391k946l483J2750n458j6248J4516J1997j8027l977J4339l540m960
1729c202P257o918n268J6463j344j9785Q889J5239j2475n724R794m107j550J0235
1743G504r281r764J7351M361j8714K205J4250p439l823O873p071q96J4036p463
$$ plain form
1647 -3778 1697 2665 -9462 -33 12556 -4677 -12014 7173 6662 -7323 -722 2082 -4932 4322
1661 4322 6533 -10778 -4507 14065 528 -11734 3365 5902 -3549 2450 1197 -8624 4295
1674 4295 11717 -9178 -9108 11685 4350 -8451 1433 2461 -3367 6372 3442 -11644 886 14536
1688 14536 -4563 -10658 7284 5054 -4735 2251 -199 -6577 7736 7602 -12454 -4155 13925 103
1702 103 -9866 3052 2542 -3101 5409 -231 -10633 5552 11795 -9759 -8263 10019 2722 -6556
1716 -6556 1835 -1111 -4594 8156 2698 -13550 966 12963 -5064 -9041 5298 1758 -3202
1729 -3202 4055 -2863 -8131 8332 6988 -12797 -3908 11331 -1144 -6868 2926 -1181 -2731 7504
1743 7504 -1777 -11541 5810 10171 -8543 -6338 7912 473 -3350 3523 -3548 -4444 9592 2129
1757B129j4308J3743R310j5006j455R918m770l14O853r779l778J6243k620j6207
1771a0041Q314J0280r778j529O113o367J585R607r567q024J4679K770j4292K984
1785c266Q467o274N82M592q568O35J2679p205j1254J1151N599j0180Q24N057n383
1800b544K623N568r656k416J3302k987j1695O773N731o956J641K830o680L148
1814a318Q256q825n533J1298P10r452L534L780m913L138K687p968J631R500o001
1829E24p130Q081K214o517K360J829m461L703M106p800j402R108k571o640M794
1844A98K334m540K926J170n509K924N544o378k932O930j29n049K927J123l472
1859a933L268K060o202J197O066l982l651M830K13l407K372N48l434K870K555
$$ plain form
1757 2129 -12179 1564 10874 -4132 -5587 4331 -439 -753 6100 -3679 -7457 8786 6166 -10041
1771 -10041 -1727 8553 -1225 -2754 3359 -3008 -1423 8184 -1383 -9407 5272 8042 -6250 -3266
1785 -3266 5201 -1073 -491 4101 -4467 -3832 8847 1642 -9612 1539 7138 -3042 -2218 2839 -2544
1800 -2544 79 5647 -4009 -6425 6877 3890 -7805 -1032 4699 -2257 -616 2214 -4466 -1318
1814 -1318 6938 -1887 -7420 3878 4588 -4864 -1330 2450 -2463 675 3362 -4606 -2975 6525 524
1829 524 -6606 1475 3689 -2828 -468 1361 -3100 603 4709 -3091 -4493 4615 2044 -4596 198
1844 198 2532 -2008 918 2088 -3421 -497 5047 -1331 -4263 2667 2538 -2511 416 1539 -1933
1859 -1933 1335 3395 -2807 -1610 4456 474 -3177 1653 1866 -1541 831 1379 -2055 815 3370
1874C370n475j50N354j935l214L039L1k535K476K67l656K077L537m210j458M211
1890A729r99k422K196J30k392K338O35l550J174L295k449j428K579n08j634J733
1906D27l15j735J498J715k698l7K279j311j147J607l12j026J595k92j738J348
1922a42J398k038l8J778q67q23J251j99r91Q03O67j589N71J164r54l04N45L4n28
1941b62P71J14r04L88N95j043K50J221q79o07P82J14q28P88J08q42M37N63p00
1960F6RO66n60k58L74J92o38O42O3o17p7O51o67j26N14k78k16L86l7n66N18M41
1982D82p13j63K59n0l30O52k59o15J055l04n32M80M2m34L50L49m96n11O51j03
2002a90n68O19K28o84O55K73r40K33P37p25k61R10l51k96N46Kp45P73L03r20j82
$$ plain form
1874 3370 -2105 -2255 3099 1164 -2050 989 1020 -1515 961 1228 -2428 -351 3186 -1024 -2482 1729
1890 1729 730 -1692 504 634 -1758 580 1215 -2335 -1161 2134 -315 -1743 836 328 -1306 427
1906 427 112 -1623 -125 1590 -1108 -1145 1134 -177 -1324 283 -29 -1055 540 248 -1490 -142
1922 -142 1256 -782 -820 958 91 -732 519 320 -671 132 799 -790 -219 945 -9 -313 232 266 -262
1941 -262 509 623 -281 107 702 -341 -91 1130 251 -356 426 540 -288 500 608 -234 203 766 66
1960 66 75 741 181 -77 297 489 -149 493 556 -61 -138 513 -154 -280 234 -44 -260 126 89 -477 41 482
1982 482 -231 -394 -135 -185 -515 137 -122 -737 318 14 -518 -38 4 -430 -80 269 -227 -738 -87 -190
2002 -190 -758 -139 89 -595 60 333 -607 -374 363 -362 -623 287 -64 -360 186 188 -557 216 519 -401 -583
2023e83J325q35o33J223k84n75J204m12j410J244P44j427L31R21o42l14Q49q28
2041a02m63J415N9j663Q57J262j685M3J195j016j7J248p80j557K371L21k943J179
2059b76J633j648P5J429j744k71K378j188k097K358Q76k796P88J485j703M11J853
2076A563k758j85L193j194k957K414J164k124M77J153k330P15K894k984j938M585
2092A688k2m158J978J712j818L91J748l546P10M207l014l198M215R10l536J491
2108b42J240k667J787K766m844j40N270j894m361L475J558l237J615P87l283K416
2124B46L539n119j753N809o28m407K824P25k529K746Q90n567K070N919m529l979
2140c743N154N47l431K323J28l633M180K364p128O69O733k938m893M116R56l301
$$ plain form
2023 -583 742 -93 -726 497 213 -362 842 430 -980 264 1008 -419 -88 833 191 -123 726 -102
2041 -102 -565 850 909 -754 103 1365 -320 -277 918 -98 -115 1133 353 -1204 1167 1488 -1455 -276
2059 -276 1357 -291 -216 1213 -531 -802 1576 388 -1709 649 1525 -1271 -483 1002 -701 -290 1563
2076 1563 -1195 -1380 1813 619 -2338 76 1240 -884 -407 746 -1584 -869 2025 -959 -2897 1688
2092 1688 1666 -2492 -514 1198 -620 -229 1519 -2027 -1317 2890 -124 -3322 893 1803 -1733 -242
2108 -242 998 -1669 118 2884 -1960 -2100 3170 1276 -3085 390 1948 -1289 326 1113 -2170 246
2124 246 3785 -1334 -3087 2722 2094 -2313 511 1236 -1293 1453 2343 -3224 -1154 4765 236 -3743
2140 -3743 1411 1958 -1473 850 978 -2655 1525 3889 -3239 -2570 4163 1225 -3668 448 1404 -1897
2156a897L526n90n284M601M738p144k063P164j269m183K918n32k825N792m37p710
2172e195L641P070o111l792N800m49k769L825k257m392O946K166q839P21Q011
2187D376l382m260M062j297j352N191k481o686O690N205q750j380P004j987k488
2202a535L477l432j946P743r16r263M647P142o256k967N286k175q11M700m291
2217e97m733Q711K153j0106J722P146l827k223L610l478M1O706m080p424P700
2232A321M683q239r19N608k625k62L460n276j728R178j718r522N084O010n793
2247g38j195L517l464J412N081o123m577R573J045q975J914N830l886J81K154
2262A749n042Q51Q056n194p086P407M077p178N26L192k972J888L342o759j337
$$ plain form
2156 -1897 1629 1039 -4245 356 5094 -2050 -4113 3051 1782 -2401 517 -15 -2840 2952 2515 -5195
2172 -5195 -1554 5516 -595 -4387 1413 964 -1805 2020 -237 -4629 2317 4483 -4356 -3635 4376
2187 4376 994 -3266 796 -501 -1853 3338 857 -5829 861 6066 -2684 -4064 2940 953 -1535
2202 -1535 1942 -1490 -3436 4307 3391 -5872 -1225 5917 -339 -3306 1980 -195 -1006 3694 -597
2217 -597 -5330 3381 5534 -4572 -2850 4296 469 -1754 1856 -1622 -1581 5125 1045 -6379 1321
2232 1321 6004 -2235 -3154 2454 -171 -433 3027 -2249 -3977 5201 3483 -6039 -955 5055 -738
2247 -738 -1933 1584 -1880 -468 4613 -1510 -6087 3486 4531 -4444 -2530 3300 -586 -405 1749
2262 1749 -3293 -2442 5614 420 -6666 741 4818 -2360 -1834 1358 -1614 274 3616 -3143 -4480
2277d480R521k576p626L957M805m734N32J894m274K546N523o875l750Q919N72
2292C954p313K206L169l337K000J927o207J672P515m832o096O551K202m967J316
2307b40J476l571L609K724p162l12Q175k212o399M268J940l002J455N22m405L137
2323CM730o295k902P190k33m940K414P96k473L317O36n786J766O244m259l811
2339c603M476Q76l129K073l49l130L863K151n878j27O081k629l300L131j24j857
2355a475K728k56m103L096L594n024j635M946j006k373J914j71k241L387M53m992
2371c158K050M146l386j850L326p72j421K342q82k872L380J463m219K56L907j882
2387D28j688J964n01j301K691o25l355K759K085l314o13K687o02j353J653q94
$$ plain form
2277 -4480 5041 2465 -5161 -1204 3601 -1133 -601 1293 -2981 -435 5088 -1787 -5537 3382 3954
2292 3954 -3359 -1153 2016 -1321 679 2606 -3601 -1929 5586 754 -5342 1209 3411 -1556 -240
2307 -240 1236 -2335 1274 3998 -3164 -3476 4699 2487 -3912 356 2296 -706 749 1271 -3134 3
2323 3 4733 -1562 -4464 2726 2493 -2447 -33 763 -1710 1607 2243 -3543 -1777 4467 208 -3603
2339 -3603 873 1749 -1380 693 344 -2786 1077 3228 -2650 -2777 3304 675 -2625 506 382 -1475
2355 -1475 1253 997 -3106 -10 3584 -1440 -3075 1871 865 -1508 406 235 -2006 1381 1834 -3158
2371 -3158 -1108 3038 -348 -2198 1128 356 -1065 1277 395 -2477 903 2366 -1853 -1597 2310 428
2387 428 -1260 704 203 -1098 1593 968 -2387 372 2457 -857 -1470 1217 615 -738 915 21
2403B1j512K657K67l034J285K448k294o23J553m95o42J483r21j638K202P53k978
2420a468R39J790j233n77R35n66k81J645o47k218J705J277k042o3J414m70o39
2437d99R62j148j92J497q0j876Q93J102j090k25J046o79k35J182p78q94J267K73
2455E26j342J27J056l93l19O31n94j43R35l92q77R59M58j160J69Q28n46q6O54
2474D91l53m75P18N0p53K77O66n75k56N98l59j96Q38m29o22M99K86m32J49M3M6
2495B11j74L73n04k20L89o2k94O52Q7o49N4M92m96J24L76l92k83N88k48l43O69
2516C50k05l62J37J79L1l20N36n45j13K73n0M3J15O3n07J35M00l95j22M40j01
2537a8l17Q6J75l49M6M65k79j13L04K5j74N76p29j23O24J75o46M36O0l76l4K24
$$ plain form
2403 21 -1491 1166 1433 -1601 -316 2132 -162 -785 768 273 -369 1114 193 -1445 757 1510 -1468
2420 -1468 -529 1261 28 -549 386 -180 -461 1184 537 -1681 24 1301 -741 -804 610 140 -499
2437 -499 463 -685 -877 620 540 -1336 -443 659 -431 -656 390 -289 -524 658 -120 -1014 253 526
2455 526 -816 -689 367 -26 -345 286 -308 -451 484 92 -785 174 632 -528 -359 469 -77 -163 491
2474 491 138 -337 381 431 -322 -45 621 46 -210 388 29 -167 671 242 -380 119 405 -27 122 165 211
2495 211 37 410 -94 -314 75 13 -281 371 458 -191 -137 355 -141 -17 359 -33 -316 272 24 -319 350
2516 350 145 -217 -80 99 130 -190 346 -199 -312 -39 -89 -46 69 132 -375 -240 160 -235 -357 83 -18
2537 -18 -335 -249 -74 -423 -377 88 -191 -304 0 25 -149 427 -302 -425 199 374 -272 164 224 -152 -186 38
2559C8j37J7O94p65j64L92K52q68O75K56n56K22K75m58L3M75m05k00O19j87m30
2580b22L74L22o30K86N37o75m89J056j79r95P86K98o74N32J12o16L51J67m23q61
2600i43J429K03j278P28K23n16M18J13j039K98J122m20j282J285m4j026N95M19
2618B85q17N17M79q83K3J180l22j443J205J56q41O20k27j138J097J181j658p04
2636a290J705mj248J151j18q19J060K12j816M85J949j287j106J657l1j164J212
2653E48j88j403J537Q91k603N97J968j141j031J289k18o11J222l06j876J719J301
2670A695k402l40K280p48q96J361j066j008K363o9k851J396K151k087j005J915
2686F89m68q99J756j062j819K661Q30l435O02K692j448r64J473j210l05K358r20
$$ plain form
2559 38 -99 -82 612 -153 -317 75 327 -541 134 390 -166 56 331 -127 -94 381 -24 -224 395 208 -222
2580 -222 152 474 -156 130 667 -8 -497 559 380 -615 171 469 -205 327 439 -177 174 341 -82 -943
2600 -943 486 689 -589 139 362 -154 264 377 -662 -364 758 338 -944 341 297 -729 -134 285
2618 285 -532 -15 464 -419 -396 784 462 -981 224 380 -461 159 -68 -1206 -109 1072 -586 -1290
2636 -1290 415 411 -837 314 196 -623 437 649 -1167 -682 1267 -20 -1126 531 500 -664 548
2653 548 360 -1043 494 1385 -1218 -621 1347 206 -825 464 246 -365 857 551 -1325 394 1695
2670 1695 -707 -1047 1233 485 -411 950 -116 -1124 1239 1170 -1681 -285 1866 -221 -1226 689
2686 689 221 -678 1078 16 -1803 858 1688 -1747 -1145 1547 99 -865 608 -602 -907 1451 531
2703E31k680K441J585k766l46K198q74m88J414j489j379L714p77l360J454K661
2719A839k223o59J328j054K15K345k057k040L579N84l581P96K358j861j38J219
2735F50j550j69L399j906l264L214K006l810L50J614j252R15J457l001k22L887
2751B318q86l861J949K340k072j7J170j929J012K381k853j682L685L69l607J096
2767e87J848j539O64R77l030K83M480k639l100L169J416k566p9J298j638J210
2783A67K025l506p11M186p56l721K037J476j890J362J90k512J241K985l383j549
2799b359L416M80l008J333P08j424J640N47l206N30L856k386k572L109M49j795
2815f82J140l05j897K491J620m020k79M115j260k633J827J53j102J701J4l052
$$ plain form
2703 531 -2149 292 1877 -889 -1235 963 89 -399 1015 -474 -1853 1861 1084 -2276 -822 1839
2719 1839 -384 -1043 285 -769 -554 1791 -266 -2306 1273 1857 -1724 -928 1430 -431 -569 650
2735 650 -900 -1069 2330 424 -2840 374 2380 -1430 -1080 534 -718 197 1654 -1347 -1569 2318
2751 2318 1432 -2429 -480 1860 -212 -229 941 -988 24 2405 -448 -2130 1555 1924 -1683 -587
2767 -587 1261 -278 386 1363 -1667 -1384 3096 457 -2643 526 1942 -624 -703 595 -1043 167
2783 167 2192 -1314 -2025 2161 1405 -2316 -279 1197 -693 669 859 -1653 -412 2573 -810 -2359
2799 -2359 1057 1537 -1471 -138 570 -854 786 1333 -1873 -1343 2513 127 -2445 664 1113 -682
2815 -682 458 153 -1744 747 2367 -1653 -1932 2183 923 -1710 117 270 -832 869 883 -2169
2831b169J865K862l345j082L118l51j599R47l23j011K599J65l626J259L321k259
2847C71j881K141R2j195J372m84k071K488J024l081j00K912q38j563J231l74q22
2864g78K164p15k538J825K357k708j115K343l67j235J292r51o49K112J44l066
2880a885R99K309j916m72J544p05n19J684j188j592K231J010k713J51J905q73
2896c0o80J276r43m71J833p43j878J633J243j965l05J600p01m12J206j221m12
2913i70J890P9k324R06J654j805K8Q97p06o9J341p54j117J489M77j705K71J261
2931H43q89j50O43p89j47J362k55j775J598M46j287O6Q10n73o8Q25q50o49J575
2950G36j74j549R76Q18r95K66L21p00K78O53p0j255J179L0q10ON95n09J31M73
$$ plain form
2831 -2169 -304 2558 -787 -1869 1249 898 -701 246 -77 -1088 1511 1676 -1950 -691 2630 371
2847 371 -1510 631 723 -472 900 416 -1655 833 1857 -1224 -1324 1588 750 -813 418 44 -778
2864 -778 1386 671 -1867 -42 2315 -393 -1508 835 468 -767 525 -426 -1075 1037 1181 -1885
2880 -1885 -886 1423 -493 -965 579 -126 -645 1039 -149 -1741 490 1500 -1213 -1062 843 -30
2896 -30 -710 566 -377 -848 985 242 -1636 -3 1240 -725 -1030 570 -131 -543 663 -558 -970
2913 -970 920 999 -1325 -419 1235 -570 -542 355 -351 -420 921 167 -950 539 1016 -689 -418 843
2931 843 -46 -196 447 -342 -489 873 618 -1157 441 887 -400 -334 476 -97 -165 660 -190 -839 736
2950 736 562 -987 -11 807 -188 78 399 -301 -23 630 560 -695 484 514 -296 -290 305 -204 -73 400
2970D00o50j3P63m94r16Q45N57r91K09M80m81L46N10r84k8Q67l94m55M92O0q4
2991C9l45N08k98m59Q22l86m88P63J32r13O80M6l99L58K14o74J82M18l2o22N25
3012G1K83m97j24M25n2R2K30n18q9N59j04o45J12M80l68J52n0q2J09K81k03Q0
3034A42Q7l2k42L31k01j41L71J12k96j43L53m7l67m2K61j60J01J32j71j68M11
3055B91j25l24O16k32m36O11l69j41J52Om6j27L40K4l04p1J58k64M41j09l77J38
3077a48L16k90k98L25K60n36M11M3m75N17j97o8O6J62j84k51J74K03n6J72j07
3098C9k52K1M53o75M24J76M9k43J37k05L9J01P8k29J05K12k95J60Oj44L9L30m7
3121B79n40K61J60k13K53Q5l84L40n3j08k3P1o0k01L14m08J78K53l13m7N4M69
$$ plain form
2970 400 -250 -263 500 6 -910 -65 492 -499 -290 190 -291 55 565 -419 -447 420 26 -429 63 123 39
2991 39 -306 202 -96 -555 267 -119 -607 156 288 -625 55 101 -298 60 274 -400 -218 200 168 -454 71
3012 71 354 -143 -267 158 106 198 428 -90 -179 380 276 -369 -257 223 -145 7 -43 -125 -16 265 62 142
3034 142 229 197 -45 286 85 -56 315 427 131 -12 341 294 -73 -115 146 -14 87 219 48 -120 291
3055 291 166 -158 458 226 -210 401 32 -109 43 49 3 -124 216 240 -64 -135 23 -241 200 91 -286 -148
3077 -148 168 -122 -420 -95 165 -371 40 83 -392 125 -72 -140 -74 88 -96 -347 -173 30 -26 146 39
3098 39 -213 -192 261 -414 10 186 235 -8 129 -76 -37 64 142 -87 18 230 -65 95 101 -43 -4 326 279
3121 279 -261 0 160 -53 200 285 -99 241 188 80 57 128 68 -133 181 -227 -49 204 -109 -156 -102 367
3143C67l74l17O85j20k63O5j14j94M63Jn30J47L86m13j2L98j86j18J37j28k93
3164d13L89M88q90n3O22j42k94K67j3k57O16j91n62M50N35q62j13Q40n45l63Q31
3185C40l26o11J215k31j177P62M63m33l38Q53o27l2O22l19r20R60J54p44K19O19
3205D49p19P7M19n73J25O36l98r11J043O37r53j55R62j017M08K76n80r6J024k32
3225D22j144R11O95j101J64L81m53J63O90r71m12J053J93j336K52O76m47K37L87
3244C60p17k71J440o28j240J156N76q31J46Lj29K29N23j160n03J918m92j196P59
3263e7L80n88J56L23j164Q59R53j132p59J336L14j339O45L05o03O09K78j166J36
3282e14J415o75j496J538M20j124N12nn43N82J007j536l49J833p34j078R19J94
$$ plain form
3143 367 -7 -324 361 241 -22 43 -71 -265 198 199 -331 -184 202 -211 -223 175 -11 -129 8 -120 -413
3164 -413 -24 464 -426 -479 143 1 -293 -26 -39 -296 320 129 -433 17 552 -310 -423 417 -128 -491 340
3185 340 14 -597 618 387 -790 -28 435 2 -336 517 -110 -142 480 161 -759 201 355 -389 -170 449
3205 449 -270 -193 226 -347 -222 414 16 -895 148 785 -168 -323 639 -378 30 306 -274 -370 654 422
3225 422 -722 189 884 -217 -53 328 -125 38 728 -243 -655 398 591 -745 -493 183 -264 -27 360
3244 360 -357 -628 812 184 -1056 100 676 -155 -9 -6 -135 94 617 -543 -1046 872 380 -816 -57
3263 -57 323 -265 -109 214 -950 -91 862 -270 -1029 307 621 -718 -73 232 -371 238 516 -650 -514
3282 -514 901 226 -1270 268 688 -436 76 71 -472 110 1117 -419 -768 1065 331 -747 172 366
3300C66o80R21l15j263Q03J373j537p05J691k50p97M07K86o95Q81K88j835P72
3318b89J503j012j353J320L64j035J044l53j252J190O70j617K8J552m98r14M52
3335b00K91m33J052n60j449J150J355j547o30J522n19m57P09m36o55J610L9j975
3353a133P33J250p97m79O21l52L1M35l83p84J064P43j995O15J157p62m18O24k74
3372a04l84J367o09j452J094J308j771L7J044n19j58O55m79r74J757j38j511R72
3390A35Q76j080l52R74o74JR48q46j062J526N47j592M10N19k83j58P17q39l81
3409f14J335j37j391P79Q61j057o1O04o26J40P10p98m11J090j08j100L11Q05j48
3428A84m11M42m43k6P68o38q37J463K63j295KO97m40K40M19j187L23P53j14p00
$$ plain form
3300 366 -314 607 292 -971 -168 1205 -332 -1037 654 404 -393 14 300 -395 486 774 -1061 -289
3318 -289 1214 202 -1151 169 533 -502 542 189 -1063 127 797 -820 -792 760 262 -652 -200
3335 -200 91 -342 710 150 -1299 -149 1206 -341 -971 551 32 -425 284 -152 -807 803 842 -1133
3353 -1133 -400 850 53 -426 195 -157 -126 309 -74 -858 206 949 -1046 -431 726 -36 -454 170 -104
3372 -104 -488 879 270 -1182 -88 1220 -551 -514 530 11 -147 508 29 -945 812 674 -837 135
3390 135 1011 -69 -421 553 -121 -120 828 -18 -1080 446 993 -599 -189 330 47 -111 606 -233 -614
3409 -614 721 584 -807 -28 833 -224 -285 319 -307 -167 543 -255 -666 424 316 -784 -473 332 184
3428 184 -227 215 -228 -254 514 -124 -961 502 765 -530 -528 169 -271 -31 388 -799 -476 277 163 -537
3448e37P28L89r35K88K8k11J53P28p31l83R07j1q14K87K05k19L21p5o19K68P34
3469E01l75l79O04J15q83L19L32k25L23K05o48j39P28k14q42Q94k11p1l2Om31
3490d23N55K42m44k80Q04j21q86L71K16k00N23l79k73K86N16o14j90M62o6n75
3510d76N33J39o98O04Q2k99J22K16k34j84M09j70r5p7Q1l3j49N25m38r0M74j6
3532B26j28r3J02n52M40J18n22K03L91k26J3J09O9n61M06J27jp9K95m76K32J64
3554B57l54R3r5J94j67J6L26m99K82j30M6%J3J68j63J57j74J07P3k35K9N9K32
3577B35k15j40M8K99l36M54m15m2o4N41m23m3K87j95p6J90k06Q8J13l7k2j40L84
3600B85k61k53M15j40J8J78l63L75l39J40p8l35N96k98r0J37J68o82O20j77J3
$$ plain form
3448 -537 191 580 -355 -67 -39 -250 -97 631 -100 -483 424 413 -401 -114 91 -128 193 118 -501 -233 501
3469 501 126 -253 351 466 -417 -98 234 9 332 537 -111 -250 478 264 -578 316 105 34 2 8 -423
3490 -423 132 374 -70 -350 454 333 -553 -182 34 -166 357 -22 -295 -9 507 -107 -297 165 99 -476
3510 -476 57 196 -502 102 184 -115 7 223 -11 -195 214 44 -51 -128 -47 -80 -229 296 -142 -232 242 226
3532 226 98 5 107 -445 -5 113 -409 -206 185 -41 -28 81 150 -411 -5 122 121 42 337 -139 93 257
3554 257 -97 -4 -99 95 -72 -56 270 -229 53 -77 -31 -31 -18 150 -13 144 -30 77 150 -85 -56 3 235
3577 235 20 -120 -72 227 -109 345 -70 -112 -176 365 -58 -101 186 -9 -85 105 -101 -13 100 63 41 -99 285
3600 285 24 -229 186 46 64 242 -121 254 -85 55 -23 -358 238 -60 -150 -13 155 -527 93 -84 -71
3621g1L3N4k46j10O55l37L0P1p6k19N5K60q5o8j9n8L2K20l46J27K89k91l71M94
3645B3j05L1J51J71n42K27l0L13l30J32R7j69J16R7l28K14J70l86R4K42j15k12
3667a39L13j72J2J53N5l46J89j1l12Q1M63l14l0r9L39k72K55K11o53O33l6n29
3689b09O8K69k31J10J00m34N44n0j25j07m3M63m87j11r4J65K05K76l55j81K16
3710a1J61l87M62k31j47J36L3P3l19M46l00K33j52L07m63J04J02k48M66J24n51
3731a62j50L50j9j29K65R9l43o1L60k75L4N24m58p3M10p7n54J80K49J55mN2n07
3754a34q2K73O6l75K78L88p60M19K30m28K19L32o26j67O98K4m79J0L95n25M87
3775B43P3n98K66L39l73m50N30K72n89K32K65m07L07J1l39j18P35l89n04Q27m71
$$ plain form
3621 -71 -38 16 -230 -340 315 -22 8 79 3 -216 -161 99 14 -54 -73 -131 -99 121 -225 -98 191 -100 -471 23
3645 23 -82 -51 100 271 -271 -44 -74 239 -91 41 138 -31 85 182 -146 68 238 -148 -54 188 73 -139
3667 -139 174 2 14 167 222 -124 65 54 -258 -177 286 -28 -58 -157 182 -90 165 376 -277 356 320 -209
3689 -209 -141 128 -103 7 107 -327 217 167 42 -65 -108 355 -132 -243 -337 -172 33 309 -46 -227 -11
3710 -11 150 -237 225 -6 -153 -17 16 89 -230 216 -84 149 -3 304 -159 -55 47 -201 265 389 -162
3731 -162 -312 38 19 -110 155 254 -89 -150 210 -65 -31 493 35 -38 372 295 -259 -79 170 325 321 373 -134
3754 -134 -216 57 123 -252 26 414 -346 73 303 -125 94 426 -200 -367 331 355 -124 -114 281 -244 243
3775 243 316 -282 -16 323 -50 -500 30 302 -287 -55 210 -197 110 121 -218 -336 399 10 -494 333 -138
3796a38p8M65k76k67L12N92j219J68R37n91j59L02J6l15N29o0q18O22N55n95m31
3817d49N41m5k95L21jl77N08L5q29K70R48m20o09M78k76j38M72j3r56R81K52o81
3839b83oP94k49m44P61p18P9M04J00j135O53O64q09l32Q69j78j53J32k99l60R24
3860D14R1j044L76Q48q29J0K64n64K84N61k24n50M94O11j212J65L69Kj21L65n13
3881b03k20J189m34q19M55L81k96k62L63l45J0O43p28k79R77k84o36L68N56n70
3901a34J15K90n04J44N11l62p51Q96j71k67L22J81j94PJ19l08k02Q03j59p84K00
3922b48P39o95j39N33m46K88N10n77j79N01O9n34O8M24l59O2J47m29J82O55m48
3943A24p54Q27J0m72K67J86l23J96O1l95o7Q20l30p29Q65j20l66N09o6j80r0K97
$$ plain form
3796 -138 -216 249 -27 -294 18 610 -609 -441 496 -95 -254 48 64 -251 278 218 -600 22 577 -18 -449
3817 -449 92 47 -248 73 72 -305 203 238 -591 -321 627 207 -402 76 -200 -338 134 121 -835 146 398 -283
3839 -283 -289 505 256 -188 573 -145 -66 338 438 -697 -44 620 -189 -521 348 170 17 149 -150 -510 414
3860 414 505 -539 -163 685 -144 -134 130 -434 -150 411 187 -363 131 742 -470 -305 64 66 -55 310 -203
3881 -203 -423 766 332 -487 -32 349 53 -209 154 -191 -181 462 -266 -545 432 148 -488 -120 436 -134
3901 -134 -19 271 -233 -89 422 60 -691 205 34 -233 89 270 76 83 202 -106 -308 495 336 -448 -248
3922 -248 491 -204 -343 190 -256 32 542 -35 -214 287 356 -178 -110 314 -45 17 164 -265 -83 572 124
3943 124 -630 197 207 -265 2 188 -135 61 122 -273 -340 480 150 -579 286 166 -200 309 243 63 -27 270
3965B70o49l52R39k08k95M82J08n21L99p9o18K59O25m92m16N36L9m30L03P4m90
3986e16Q40j01m38KN71n34k40N20N6k49K71j89m91O64L21o29J6O20m21m84M01
4007a0Q6m23L52K5Rk3K13j83k26M40j79l52L17J20m31N98nn84j11M02J57j08Q
4030I2p0K9K08r3m23K50K40m01L95j27n3O7j58l56J57L40j28k41L45L6j68o4L32
4053B09p9N2P2m07k2L26n6l68R1J16J28m39M40k20j61N10j80JJ43M9k98j59L52
4076A00O2k41J51k45J71L9j03J0O0Nm0Q5L22m73o5L60l20R7K25j42k07J72R0p4
4100C9l00K4j6L05m1J85q2j16R5K14k55J12r2j20K45m39R5K71j11j93J23J91n5
4123G9k64k8K72k23rP8J35j29J43j65L69j82o4j87J61Q9k27L44r0k17Q7M26n40
$$ plain form
3965 270 -379 -731 208 0 -295 187 295 -226 173 94 -524 -265 360 -132 -548 -12 27 -403 -100 -26 -516
3986 -516 324 223 -215 -213 358 -176 -416 104 160 -89 182 -7 -498 166 487 -142 -126 494 73 -411 -10
4007 -10 76 -347 5 30 39 16 229 46 -180 260 81 -271 46 166 -265 333 328 -256 -367 35 192 84 92
4030 92 22 51 259 166 -257 -7 233 -168 227 100 47 114 -44 -400 -243 97 -31 -272 73 109 -59 -123 209
4053 209 130 182 254 -153 -175 151 95 -273 -182 -66 62 -377 63 -157 -318 192 12 13 156 205 -93 -252 100
4076 100 162 -79 72 -173 -2 37 -66 -56 4 9 -31 54 376 -97 -162 198 -122 -25 200 58 -149 23 113 39
4100 39 -261 -237 -253 52 11 196 114 -2 93 307 52 164 72 -48 197 -242 -147 124 13 -180 -57 134 79
4123 79 -185 -213 59 -164 -173 -95 40 -89 54 -111 258 76 12 -175 -14 75 -152 192 102 -115 -28 398 -142
4146a42K23j44p7L9O2J07l96M8K70k23O4K87j47j39J37p8K53j31J3j4j29J10q6
4169i3N9Q0J27l10J07M0j96R4J26j02O9n7N4J71n3j49N8l0Pj40J98P1J28l31K20
4194A48k21J4o8J75R7m8p7l4n2K10J18j99R4k62J16M2j79k4K88j43j7M01l96P5
4218E8j55J14P4l42L80o4j31k26K34Q9j7R0l23L30n0k82J62K74k39j07j26L45
4240H8N2Kk79m9j24L09j47j74K54j01J79K57k62pN1R3k26P0o0k07K02mJ60o10
4264e33O75J8o35N52Kj55L0L2O3K9J98m36j18L83P6j32m5R4r4j17L02j21o8K16
4288B16j40l07O5M36r2L6L6l88K44k2k41J31J47N2k65K42j10j18K47j25k13p5
4310b44M24k23p8K53j6l5n0Q6j40M7P8l57O2L03p1j99K58k15k8j16J43l60P55
$$ plain form
4146 -142 81 -63 -140 -101 -39 68 -328 -280 -10 -233 -169 118 -29 -168 -31 -109 144 13 26 12 -117 -7 -93
4169 -93 -34 46 173 -137 -30 10 -186 -92 34 -68 1 -56 -2 169 116 -33 25 -5 2 -138 60 131 259 -72 148
4194 148 -73 -59 -127 48 145 97 20 -14 -66 144 262 63 157 -105 11 53 -126 -150 138 -5 -22 379 -17 58
4218 58 -97 17 91 -251 129 65 -66 -292 -58 31 14 104 -219 111 61 -221 -59 215 -24 -131 -257 88
4240 88 140 142 -137 -186 -310 -1 -148 -322 -68 -169 10 267 5 -2 49 142 -84 -14 -74 -281 -79 -83 77 -533
4264 -533 142 160 -475 77 79 -76 -46 -14 49 78 276 -160 -278 105 181 49 4 98 4 -113 189 68 0 216
4288 216 76 -231 -166 270 178 214 250 -138 106 84 -157 -26 121 173 -92 150 40 -78 169 44 -169 -244
4310 -244 180 -43 -121 132 116 81 31 117 -23 24 102 -255 -193 110 39 -160 98 -117 -145 -261 -118 -478 277
4333B77l98R3l7L01p0m28K24l1j03J0K91m29L75R0j03mJ94j23k65Q0K7j98M76
4356B49R0n25J3M95k61o5j1J49j11K02k78j00K50J35k10L40n11J78j69L52k18
4377fp4L43k44l90M59R1n52j25P59k57j55N12m39j72O99m03l10K11N70o34k3K06
4399F6j01m7K29k83q2L60r0k70J8M18l66J67j31k97K86O09n21l12M96K11n01J67
4421B6L3p9K38q8k11k56O29N7p26L00K54k72k19M97n90K54J87l94J28P10n01m97
4443e20N61n3j61j0K20j00k70N93j24o31N61J60n55N89k34j50N2L77m77r4P71
4464E05n36k3l1J99k02Q6Q8k98K03L91n18o8O02j20n90N12m5j32K60j40m14L54
4486H3K54k19n65L84J62j92L77Nm76R7K33n86N80J76j49l76K41K03l38M01J25
$$ plain form
4333 277 -121 -28 -65 236 166 -262 -38 -69 -172 -162 129 -300 75 165 62 58 252 129 -136 -56 -29 -227 249
4356 249 339 -186 -173 322 61 -4 -15 134 23 225 -53 -153 97 232 22 362 -149 29 -140 212 -6
4377 -6 -80 263 19 -371 88 179 -373 -498 261 4 -151 361 -78 -250 449 46 -264 -53 517 -117 -140 66
4399 66 -35 -82 147 -136 -218 142 52 -218 -200 218 -148 19 -112 -409 -123 486 -35 -347 149 360 -141 26
4421 26 59 -20 218 130 -81 -337 292 349 -377 -77 177 -95 -314 183 -407 -153 34 -360 -232 478 -23 -520
4443 -520 41 -12 -173 -183 37 -63 -333 260 136 -495 66 226 -329 260 26 -124 -72 305 -172 -266 505
4464 505 -31 -54 -85 114 -88 -2 86 -212 -9 382 -136 -204 398 278 -312 200 155 23 283 143 -271 83
4486 83 337 118 -447 -63 99 -93 284 289 -187 -90 143 -443 137 313 164 -212 29 232 -106 295 420
4507D20q53N12O0k53Q2J5J3k29N20l19j80O9M81n93K26L25k80j63J26L4m24L34
4529g7K58m67J83L02m34R7L01j17m09K50j02J10M18j17l38n1M18j21k87N37p35
4550c81N23ml26J40K12M1m46K78K84m15J16k24J20n0J13R4m48L70K04n69M49N0
4572A31k41k2o8K65j46q5K30l32K64K14l38J75J04j29L12j46K8j78J71k15q0J34
4594D8K53n28J89n1J27j49L09l46J37j96M24n01L46J18Ol16n4J06j72L98n26K38
4616a40K99p2j48K15j26q9O9K9q8J61q5o0j03L63J42m30J27j12j52j31L54j84
4638a61L07o0m5n6k75M84j1l26J52j15M44j78j85j80J91J18j78PL59k88p7L6k05
4661b42K64j54J65r6O7Q6n6l1P7q9q4j05J18M0r9j56K90J62M2M4k26l4R9J63m31
$$ plain form
4507 420 -433 79 139 -114 -32 -17 -4 -233 287 -32 -212 -143 338 -255 -29 296 16 -147 -21 13 -411 -77
4529 -77 181 -286 -103 199 -235 -138 163 46 -363 -113 -215 -105 313 196 -142 -193 225 104 -183 354 -381
4550 -381 142 138 -188 -48 164 205 -241 37 321 -94 22 -202 -82 -132 -19 75 -373 -3 201 -368 81 131
4572 131 -110 -132 -200 65 -81 -166 64 -268 -4 210 -128 47 151 22 334 188 216 38 209 -6 -86 48
4594 48 301 -227 -38 -89 38 -111 198 -148 -11 -207 217 -284 62 180 186 -130 -184 -78 -250 148 -378 -140
4616 -140 159 87 -61 154 28 -61 8 37 -51 110 25 -35 -138 225 367 -63 64 -48 -200 -331 23 -161
4638 -161 146 86 41 -15 -290 194 183 -143 9 -106 338 160 -25 -205 -14 104 -74 -67 292 4 -73 -37 -242
4661 -242 22 -132 33 -63 4 90 34 3 80 -9 -93 -198 -80 -40 -139 -295 -5 157 199 243 17 -17 82 245 -186
4686a86K17p8k23O43n27K32J14l22M67l41J23j76m9r5K19pJK8L6Ok32M0K78m62
4710b94K08j69J06j06M13j02j48kL13k69l4M0J00n6J82o8j13j59K60k67J62p3
4732g6k22J44nJ88n1k55M67j30l98K73L6J97j8K4j36q7k17K67J69j58l6J24m6
4755E4q6J3J26k0j25K76j82j74P2R0k3J02j97j95L39J14j05P7j07j97J59j15J57
4778E3J9l13N59m36Q7J44K3j55j30J88Jj83J47k60L0N37m10k48L38p2J45R0j87
4801c3J9k2j54lM3J68j06N9k60L16l1L24k16k82L01k73n9L03K4l76K52O3%j93
4825a36L17k1j38j68K45J20N0r1k13j19J90qO4n9j32J41L4R9n42L75J29j87p3
4848a23M32m40Q1j22J23L9RMj53L5O0k05J71L38n06J2K52k32m6J49K11j97j64
$$ plain form
4686 -186 31 -47 -270 373 -154 78 192 -130 337 -4 119 -57 -106 -201 18 11 12 40 76 82 -150 -110 168 -294
4710 -294 -86 -255 -149 -255 158 56 -92 -94 219 -50 -84 -44 56 0 182 114 1 -158 102 -165 -3 -76
4732 -76 -298 -154 -159 29 -22 -277 190 60 -338 -65 -29 168 150 174 38 -49 -266 1 170 12 -24 100 54
4755 54 -32 -19 107 87 -38 238 56 -118 -46 44 21 123 -74 -269 70 184 79 156 49 -148 11 -104 53
4778 53 72 -241 318 -118 -31 113 136 -19 -149 39 40 -143 4 -256 -226 311 -99 -347 -9 -81 64 154 -33
4801 -33 -14 -36 -190 -193 -150 18 -88 -29 -289 27 -4 320 104 -178 123 -150 -209 94 118 -258 -6 57 57 -136
4825 -136 181 160 22 -146 99 219 269 178 -35 -154 36 28 92 33 -99 42 76 175 -367 8 137 -50 -123
4848 -123 309 -131 -50 -172 -49 -10 -1 3 -150 -115 -55 -260 -89 249 -257 -245 7 -225 -271 -122 89 -108 -272
4871b72M11j90p9K82l04j8N6L59j86l03M14O6k33K9k85n1L95l11p1M38j24l26
4893c03M28j04K67k20j4k32r6M85j37k45P4K08M7k55K07j24R8j21J40k68L08n8
4915H5j72mL16m16L72j34L2J29n8j6k49L93k00k46J78r4k28L47L50l76j61J65
4937A3J59n17L29O2j71L2k1k31M03N6l7k60M48l9l53J28P9%k11L3P4k63M44N1
4961B08k25K73j98J6k63m4J5K25K91k01k76M31n0m36L46j52m4j14L32k97J35J94
4983A66j81k84N10k36N7o2Jrn3K07n99K93M77l62l2J43M0j53j07L31l78N46k09
5006A06p5j72N99l63k00l9L25l2j01m7Q6mJ12j69j23J2R0k2rJ26j40J26K72m88
5030a30N6K76k77M2j52L11m51M13rm13N30K52o13M1K26j58k13M81l04q2R9K65
$$ plain form
4871 -272 139 -51 -130 152 -152 -170 -114 245 59 -244 170 236 3 32 -253 -304 91 -220 -291 147 23 -303
4893 -303 125 21 288 68 54 -178 -274 211 74 -171 -97 111 158 -97 110 -14 84 -37 103 -165 143 85
4915 85 -87 -91 225 -191 181 47 79 208 150 134 -115 278 78 -168 10 -84 -312 35 385 9 -152 13
4937 13 172 -345 -16 46 -125 -93 -114 -345 58 114 77 -183 265 226 -127 1 80 80 -131 -98 -24 -287 157 208
4961 208 -17 256 58 74 -189 -233 -218 7 298 97 -179 252 202 -234 112 -40 -84 -198 134 -163 -28 166
4983 166 -15 -299 211 -25 32 -30 -29 -38 -91 116 -483 -190 287 -75 -107 36 76 -77 -184 147 -231 315 106
5006 106 31 -141 458 95 -105 -144 181 149 48 1 87 83 195 26 -97 -85 5 -17 -26 100 -40 86 358 -130
5030 -130 -74 202 -75 -33 -185 126 -325 88 79 -334 196 448 -165 -124 102 -56 -269 212 -92 -174 -75 190
5052A90m76L37K40n38J54KO2R9R9j50K00j41j34Kj16M34l54J14r8K40j32J23l72
5075b15L3L47j37j24o3J53l3k1j47PK36J05n1k72J78L51n02K93r0j67K37k8O2
5098A52k30L10k09j98p0N61k09j21Qon0J45l3m46L95k3j2J87k42mm6K03l22J56
5122a04L67k63lj76L36Rn3j86l17L64pM2q7N52m95n4M5qJ58o8M05m90m06N54Q5
5147B00k95R4L91o12J09K92k05l6L5J07k03L43k22o7J6P3j23P3P1r0j24L30r2
5170F5J00J07k89m0K52q5r6L87m58J6J84l10J28K6J62j34k20M00l42J70J45j82
5192a4J38j38j25J72pJ35j97J22j86q6N59n11P0k7O1J80p0K4k87Q6k4K80K03k92
5216F6j25j3J87k07nK47j68O4p1L8j66L17k99j66L07J28R7l7J48k94J5O9k70L71
$$ plain form
5052 190 -286 51 291 -247 -93 -91 -29 70 169 19 219 78 -56 -54 -170 264 -90 24 -74 166 34 157 -215
5075 -215 -182 165 28 -96 -159 -6 -39 -60 -207 -200 36 141 90 -182 -4 347 -155 138 48 -119 118 90 152
5098 152 -78 232 23 -175 -245 316 107 -14 -6 -12 -62 83 50 -396 -1 -24 -36 151 -91 -95 -141 62 -260 -104
5122 -104 263 0 -3 -179 157 166 113 -73 -390 -26 -33 9 -78 474 -21 -75 -30 -38 120 52 457 -33 -439 115 200
5147 200 -95 -1 390 -222 -113 179 -26 -62 -27 80 -123 220 -2 -69 -53 20 -103 -30 41 -49 -173 157 65
5170 65 165 272 -17 -57 195 110 14 401 -57 -41 143 -167 -39 -13 149 15 -205 195 -147 23 168 -14
5192 -14 124 -14 -139 33 26 161 -36 86 -100 -186 373 -138 -68 -95 -34 146 76 100 -187 -101 -125 155 358 66
5216 66 -59 -72 115 -92 -97 150 -18 46 -25 13 -153 164 -135 -301 6 134 231 194 342 48 63 132 -138 233
5240B33m05J01m6J87J24j1j48j05jRJ20j67J31J0j40J13m2J93j79J52L4l61J28
5263g0m8K33p4j90K41k44J35k3R2p7Q9R2q1k22K17k9J73n7m77L80J00k38K20k93
5287a51J51K50m12L60l06k2L40k83p2L74l11j5q1J39J12r8J6o8j48K68k3k7M4
5310C7K2k7J78m31j7J69k92L53J24Jj39L7o0K08k57o2N1l7J05r5L69m24Q0J60
5334E3j24K45l01J3O4q9OJ81J9K4j86m3O0J21j16l9Q3L4p8PK9K4N1k5Ko6oR8j09
5363f8p1K22j31oj27K76n6j8J00j54K48k50J70k47K17j43k3N4r8m0K76m7k41L77
5387B20k55m2N0J90k63k92M76L5m15N28k90j96K62j11KJ65QRn4M2j21mQ2K7k00
5412a47l3J17R7j19J46k02L34l30p8J83J40J12n40K72R5m78M29p6k01R8L39k4
$$ plain form
5240 233 -172 -71 -117 70 194 183 35 -70 -71 -62 58 -109 22 32 -108 5 -37 156 -23 129 163 -198 -70
5263 -70 -118 115 41 -149 92 -152 -17 -40 52 -25 64 156 75 -147 70 41 214 157 -320 60 160 -78 142 -151
5287 -151 0 250 -162 198 -108 -130 210 -73 -145 229 -82 -97 -178 -39 73 -25 -9 -77 -225 43 20 -7 37
5310 37 59 32 210 -221 -238 -69 -361 -8 116 117 -22 15 -45 163 -94 -156 -105 -142 -37 -132 237 -187 -107 53
5334 53 -71 174 -127 -114 -50 -139 -133 48 67 91 -95 -138 -78 43 -73 -112 -29 5 -73 -66 -37 -13 38 13 15 -51 -57 41 -68
5363 -68 -139 83 -48 -54 -181 95 39 21 121 -33 215 -35 135 -112 105 -38 -61 -7 -105 -145 131 84 -157 220
5387 220 -35 -77 -27 163 -100 -392 84 119 -296 232 -58 -254 8 -103 -101 64 72 81 27 69 -52 -56 26 53 -147
5412 -147 -180 -63 34 -85 61 -141 193 -137 -215 -32 108 220 -320 -48 47 -431 -2 -78 -279 -181 158 134
5434A34l9q8p6k97K64l5K47J97j29n18J49J44K46r3m6Kj64N5m6o4Q8J16o4j12
5458a29M9q7J32k97O19l95K17L34o51J41o3K98m12O05k43j78lO0k01M45k6j32
5480H3j44J27Q8n28M72j20j23L48j93k64J39O55n95K2L77j91l23M15k68l1K38
5501A84M1k30J03K26k93j04J98k01n2K30j43l6O4j16j21J26O4j5L7j1m2K5O8P2
5525G4j81J4K27%k06m1p5K51l62n7K29L94k52j76R1M4J9j15J51m4m2K59k3l00
5549a21K74K5l11J31M3o3K16J27m67L96K04l61k57L07K24l94k83L20n8N2q3rK43
5572A55k65J54j82J23J50r7k38J69p6Q6l4K68n75M92J15l20o0P1L41k35j03j33
5594a94P5Q9J23k42K91j90J41n5K8l57K96K26k97J09j24J24l29J99qK43m36K49
$$ plain form
5434 134 95 7 -69 -366 -102 -137 110 307 178 -340 -191 -47 199 106 60 62 -102 -47 -93 -157 -69 47 -17 -129
5458 -129 -80 -167 -35 -332 287 -108 109 443 -208 -67 -130 168 -244 361 118 -60 -63 -3 -204 241 215 83
5480 83 -61 66 154 -374 98 -22 -145 203 10 -254 -115 540 -55 -33 344 153 -170 245 -23 -54 184
5501 184 225 -5 98 324 31 -73 125 -76 -128 102 -41 -77 -13 -129 -250 -124 -60 -75 -38 -49 -91 -66 2 74
5525 74 -107 -93 134 134 -72 -113 -188 63 -299 -356 -127 267 15 -161 -70 -26 -7 -122 29 -15 -57 202 179 -121
5549 -121 153 178 -133 -2 41 -22 194 321 -146 250 454 93 -164 143 367 -27 -310 10 -48 4 -79 -88 155
5572 155 -110 44 -138 -15 135 38 -200 -31 -107 -21 -55 213 -362 130 245 -75 -135 -64 277 42 -61 -194
5594 -194 -119 -30 93 -149 142 -48 93 38 66 -291 5 231 -66 43 -81 43 -286 -87 -95 148 -288 -39
5616c9j69L15J97n70L64J8J5j53K4R5j78K62L3l49n3L43k56j21K70l8j5j35L11
5639A71k75N3O2l47M18K92k95k02K66p9j69J13p9P7J82n6p0K9o0Q8J1j48R8j39
5663e9Q0Q8j59K16j82O6k41K84P7k36j65J23k22K23K02j38J2J40N4j70K4J01L5
5686A53k28k04Q6p1M70k07j56K34N4j44k88J58l5J89K39k90NJ13N4j69K05k57
5708h9O8n4K07k22K62j47P3k95K65J14j10k7l3O8j26j36K25K6o2p4oK49k44J55
5732H7k98L05j42M64k30j07k33l0L05l22K17M95n91J05k67K62O9n6p2J90j78q0
5754a07O2L49m44N4o9K5N5L4K53k21O2j71J29k76K62Lk06P1K04j99J77j24j7j43
5778b37J89p2L32n28J84K65P8m20R6pl0K34k05J75j65J65J41j84k59L14j63kk8
$$ plain form
5616 -39 -208 107 304 -266 98 116 131 -22 2 97 -81 181 214 -135 -188 155 -101 -222 48 10 -5 -140 171
5639 171 -104 -51 11 -336 82 374 79 -123 143 64 -105 8 -71 6 188 132 62 91 31 119 130 -18 80 -59
5663 -59 21 109 -50 166 -16 50 -191 93 170 -66 -231 -108 -330 -107 95 -43 -31 109 163 -7 17 118 153
5686 153 -75 -279 -193 -264 206 -1 -157 77 131 -13 -301 -143 -178 11 250 -40 -35 78 132 -37 168 -89
5708 -89 -21 -75 132 -90 172 25 98 -197 68 182 72 45 12 80 -46 -182 43 69 7 -67 -73 176 -68 87
5732 87 -211 94 -48 416 186 79 -154 -184 121 -201 16 511 -80 25 -242 20 89 33 -39 151 -27 -107
5754 -107 -45 304 -140 -86 -155 -130 -75 -41 212 -9 53 -118 11 -265 -3 0 -206 -135 69 -130 47 -77 -94 -237
5778 -237 -48 -120 212 -316 -132 133 211 -209 -113 -120 -150 84 -121 54 -111 54 195 11 -248 66 -97 -99 -127
5801a27j01J44L7M2K15j22p8j74L62l68K01J45j67K65n10K78M4m1O8q1L36l02
5823F6M6k03J40n4j6J02J8J6k19K33k38J74K23m0r6k15QJ36r1m4k16M76m3q7j23
5848d7J66j48Nm7J90ll22Q4K09j88l54O64j57j83Q6J87o6q6J25p1k21J36J94j07
5872D6q0K36p3j20o9j3J06K4l53L09n6J42k10J07qm5m5p6K67o1k0K5k03L19j43
5897Fm9O6j2k08J39L13k22j23R2N5j43K39o4l27o4M04k87p5M48O1k46q7L3J10
5921E9J00o7k41K60k04m8N50n04J24k9k9j55K82K10n2k59l1L33m40p4R0L10j03
5944H2M8k77K61qJ93n80K09J15k63K30R3k91J95J88j31l4j38J05k26K66l2m3K15
5967A77j48j61Q7m7R3p2n1P3j79J11J10J58p9q2l8mP6j38N9K30J9j20m6R0Mj40
$$ plain form
5801 -127 -228 -84 -47 -5 210 88 10 -164 198 -170 31 176 9 274 -236 42 86 45 113 32 368 66
5823 66 112 -91 49 -5 -21 81 99 115 -104 129 -109 65 288 248 152 -63 -55 81 -10 -54 -270 206 163 76 -47
5848 -47 119 -29 -24 -71 119 116 -206 -122 87 -101 -455 209 52 -131 -45 142 76 -10 115 44 -177 -41 153 46
5872 46 -34 202 129 9 -60 -73 33 57 -296 13 -43 99 -111 -4 -12 -57 -102 -178 89 28 8 33 -170 149 6
5897 6 -43 23 11 -197 -58 255 33 -90 2 57 -86 153 89 -238 -302 102 -185 -260 188 249 3 -84 -51 59
5921 59 159 92 -149 111 -93 -141 409 -95 29 0 -29 -184 98 308 256 -3 -34 299 -141 -215 -125 185 82
5944 82 130 -147 114 106 299 -281 -72 43 -220 10 103 -188 7 195 64 30 -108 -3 -229 37 5 -38 177
5967 177 29 -132 -45 -92 1 -71 -122 -49 -228 -117 -7 151 72 -10 -48 -52 24 -114 -55 175 194 74 28 118 122 -18
5993a8j0J00J96k29Q4k8Kr3l2j85K86O8J75k50Jj25L59m97K91j37J54j71K56k7
6017A70l11J33j58J63j85L80J08n57L66Pn2j69K9j02K30j39mJ40n5J84Pl70K48
6040F3j01nJ15J87j44l24J84L0j10K83m42K51qk60L74k06pj2K74J66n24J86O2
6063C2j62J25Q4j79o1M8o0K4K52k71jK17O5r0p3M9J36J1j85K35l71J34O0r8J57
6088G8K52o31M83l13J23l6K56k85J73q7J27j75m6RK32k38p6J91O7K9o6n9O6j56
6112h2o8M1K9q1K15m3P6k10J51J41m7J42N5k00l6K91k84l57O02k28l17po3Q3J93
6137dl5q9J12j29k01K0L74P4nm85L84j24r9R9L8L2K00l04K58k71N75o97L93P4
6161A90m10M16o2k71k6J46n5K07j13k24K56LJ0J04r8k16q3J79n6J18J22j02n0
$$ plain form
5993 -18 -28 72 268 39 123 95 97 4 -28 -213 73 141 316 66 67 -58 301 -196 95 -42 112 -59 197 170
6017 170 -141 -8 -166 -3 -188 192 300 -257 109 116 64 -105 -76 -178 52 -87 -91 49 -6 178 185 -185 63
6040 63 -38 -43 72 259 115 -209 -25 5 -105 178 -264 -13 -21 -281 93 -113 -120 -132 142 308 -216 -30 32
6063 32 -130 -5 79 -100 -161 -113 -173 -149 103 -168 -169 48 113 23 -50 -1 135 146 -39 196 -175 -41 19 -79 78
6088 78 330 -301 182 -131 -8 -44 212 -73 100 13 140 -35 -81 -72 160 -78 -154 37 104 133 67 8 74 -82
6112 -82 -150 -109 -80 -161 54 11 87 -123 28 169 122 264 319 119 83 374 90 -267 335 107 -210 -217 -280 -197 -4
6137 -4 -39 -128 -16 -145 -346 -326 48 122 117 -368 16 -108 -207 -108 -70 -38 162 -142 116 -155 420 -277 116 190
6161 190 -220 196 134 -137 -163 -17 -72 135 22 -202 54 57 67 171 73 -143 -226 -47 -103 15 137 35 -15
6184a5n2J61Lj97QJ4L18Mk22r7J47k84r5K85K22k98K43j64J16k81J71J28k45J54
6208B4j08K04j58Pk0n6K80m14N0K57K5l52K45J31k83K42k33L42k83OK19j8j58
6231e1JNj03M77l01P0j07J31j62k4j06K94j69j02J90P6k84J18L3K47j35k47r1
6254b40L85j99k45N13K9L7o5l81L10j4k1j43m0J70K08j17q0k26J45O9j91L27l84
6277a53L50j65J66q5k78K24m1K28m34M07k36L6n6J74p1j86K40J7N8k42j78J8M24
6300B17j20m8n0Q8J10P5J7m59j6K14K2j21L18j36k46K47J64k99J48RL2j69k30
6323b33L23j01j18m4J20j0J73p1j39J86k97L39k46K14j42J30k62L6k1P7j4L27
6345B27j39k78K85j05K08J03j12J24l76L31j38J08n1l0j3k25j1O7q8K23J52l02
$$ plain form
6184 -15 -67 94 97 -100 -92 -78 240 244 22 -75 72 -212 -307 -22 200 -98 145 -19 97 -184 -13 115 -130 24
6208 24 -84 120 -38 -31 -51 -107 173 -241 -191 66 91 -261 -16 115 -168 74 -159 183 -100 -94 125 107 -51
6231 -51 -50 -45 -148 329 28 98 -9 122 -40 -64 -170 124 -45 -147 43 119 -165 -47 -14 233 98 -149 -240
6254 -240 145 -54 -299 214 243 280 215 -166 144 130 109 -34 -74 96 304 187 107 -119 26 95 -96 231 -153
6277 -153 197 32 198 113 -165 59 18 246 -188 219 -17 19 -37 137 66 -120 120 137 195 -47 -225 -207 217
6300 217 97 49 -1 87 197 272 289 -170 -186 28 50 -71 247 111 -135 112 276 -23 125 134 166 -3 -233
6323 -233 90 -11 -129 -173 -53 -63 110 39 -100 86 -211 128 -118 96 -46 84 -178 -142 -163 -86 -100 227
6345 227 88 -190 95 -10 198 301 189 313 -63 268 130 238 187 157 144 -81 -92 -25 -113 110 262 -40
6367d0Q3J65j09l12L69P8m3q7r3j90r1L12J0l46M18k02J66o2r8J43k56L01l63
6390b47M00j42j72O7R0J40k14J5N9rk33M3j31J32O5K89m8k16P3j33K77j52l6K6
6414e7Q4k05J41j07R1k7L5r7m7J35M8j05J42k15L70K4k40L0m2J66n85N44M8R3
6438B24k66K69j36l21K72j67J98k0qJ45k47l2J48k13p7L20r0K35P1l80m9M35m18
6461a07L2J83j4j41j35M0P4j03J71j59K25J15j73J57m12M47qk44J32k71K59L0
6483I8KJ23k88J78k74J59M9LK11m68K82j63J73Mj39L77m90K91p0o3J05J9l34J73
6507d2K64J63n37p3L79k60o5L50J30l06N0k00L5q1J22qk9J2J78o7J29k39Q6P4
6531F5o5p0k5k19K73j2J35k08L45j64j41L44j95j74O9K72m86J30J36J06l02L40
$$ plain form
6367 -40 43 208 99 -213 156 234 191 104 11 -179 -270 42 52 -294 124 -78 88 26 -72 71 -185 116 -247
6390 -247 153 11 -161 -94 -4 136 -78 -63 -4 -13 -246 -203 -334 -202 -137 152 104 -112 -39 -172 105 -47 -83 -57
6414 -57 27 -178 -37 -144 -53 -80 -45 -142 -189 -54 -6 -111 31 -184 186 210 -30 0 -42 124 -461 83 131 224
6438 224 -42 227 91 -230 42 -125 73 53 45 190 -57 -89 59 -154 -231 89 -1 234 305 -75 -124 311 -107
6461 -107 -75 108 94 -47 -182 -142 -68 -171 0 -159 66 181 8 165 -247 200 192 -52 80 -191 68 98
6483 98 100 223 -65 113 -161 -2 47 50 261 -207 75 -88 85 89 -50 327 -163 128 58 -5 100 119 -215 -42
6507 -42 222 385 -152 -225 154 -106 -171 179 309 3 53 -147 -112 -193 -71 -79 -108 -96 82 15 144 -95 -9 65
6531 65 0 -70 -95 -314 -41 -53 82 -126 219 55 -86 258 63 -111 -42 230 -256 -126 10 116 -186 154
6553A54m2k86r0Q6O3J89n9P1L8mk44M3N2O9j65M3N2R2k8K3K8mn1r3J05O4k43J34
6581cN7M2R7n8j37km4K00r5O3O6k77l1J14N3J23l92J93k9L97m22J06k39L62R0
6606B34k97K98k7j23l0o1K86k75l65J13m0Q8K53k24J61j6m5lJ20J13j47kn5J87
6630A43P4j94J38j50j97K80Q7j86q6Rq7L47l3k80q6K12J4l1jQ3K7l9q1K14k75
6655i8J85j06k30J20K46j33k82L38k11PL73o57O26l2m38L92Q2j95l4J63j71K65
6677B10m51K19L75m25J44N3q8L4l41K90k24L27n1k27o5K91l8l02K81l5r5O5j00
6700a53K69O2m64J26O9L88j81Q7k13p4j55L20m9k52L68m6o9J33l19K15J72j27
6722A07k25J38J5J48l93K57J93k06O5k6J36k85J73j29J74j21K73m39q2K02J8K0
$$ plain form
6553 154 112 -174 -264 -178 -115 74 15 86 124 120 -124 -81 -29 40 -125 -82 -30 62 34 57 85 81 30 -63 42 106 -137 -3
6581 -3 54 96 193 135 -2 -4 -48 152 57 120 186 -91 -122 -8 45 168 -224 -31 -60 337 -85 21 -218 144 234
6606 234 -63 235 208 85 55 -6 280 5 -360 -247 -287 -199 54 -170 -9 -25 -70 -73 47 160 13 11 -44 143
6630 143 217 23 161 11 -186 94 181 -5 -91 -82 -169 178 145 -135 -221 -9 5 -26 -27 56 83 44 -37 177 -98
6655 -98 87 -19 -249 -129 117 -16 -298 40 -171 -164 209 -448 178 146 -292 100 182 -13 -47 116 -55 210
6677 210 -241 -22 353 -72 72 125 37 71 -270 20 -204 123 72 -155 -220 71 33 -269 12 -23 -118 -53 -153
6700 -153 116 178 -286 -160 -91 297 116 203 -10 -84 -239 81 32 -220 148 102 33 166 -153 62 234 107
6722 107 -118 20 35 183 -210 47 240 34 99 73 209 -76 97 -32 142 21 294 -145 -227 -25 -7 13
6744A3p6J20l61P62m92LJ0J35j44P1qn2K2K90k06q6jp3K67k47Kn7K69l34j2J50
6770c5l4k11L12q1j39j33Q1K0K53K19k03L4j3j31k29L81l78K87l8n8R8j87J36
6793d9Q8k99K5M26m55L37j02j92L10j06J63j94j9J09j28J13J22j91l13M60n3j38
6815h6J17k6J25J28k87J18j98J82l57L12j01K64j28J03k73K06K08k79mj27L33
6836B30k64j2nR4k07J70K02l11M3L22m95L73J27m5k54J93k03J95M0m12K86lq1
6859a7k06R1L8J86pN1j18p5K29l56L67k4l02K09q1J72p4K9j85j67P9J96J50j33
6883E2J09j32j72L17j43K58k02P8j98r6L35j66r7J60k35K71k13j59L02j33J57
6904I3j47R9J4j06R2m8J2j89n1J05K68j82K45m8n0j94j3K63j00R6k08K0J99Q8
$$ plain form
6744 13 -63 57 -304 458 -34 -31 -21 114 -30 41 33 -19 3 293 87 1 0 -73 194 -53 -51 -108 161 -173 -185 -35
6770 -35 -69 -280 32 -49 -188 -321 -240 -220 33 252 49 83 70 -61 -290 91 -287 0 -38 -96 2 -185 -49
6793 -49 39 -260 -235 191 -264 73 -29 -221 89 -17 146 -48 -67 42 -86 27 149 -42 -355 105 52 -86
6815 -86 31 5 130 258 -29 89 -109 73 -284 28 -73 191 63 166 -107 99 307 28 24 -103 230
6836 230 -34 -46 -51 43 -164 6 208 -103 -60 262 -233 140 267 222 -32 161 -42 153 193 -219 67 64 -17
6859 -17 -223 -132 -94 92 85 136 18 -57 172 -184 183 159 -143 66 -15 157 83 112 -73 -240 -161 35 185 52
6883 52 161 29 -143 174 31 289 87 165 -33 -129 206 40 -57 103 -132 139 -74 -233 69 -64 93
6904 93 -54 45 59 -47 45 -3 9 -180 -231 -126 142 -40 205 157 107 -87 -100 163 63 159 -49 -29 170 258
6928B58j80k09J83k07K04k05J75J17m32L2J19L03j30m7J50r1k04M56m18o5k3K33
6950A9J12O5k89LJ01r6O9Q6p1K75k43J9o5J77J6j64j3J49P3j74j79j09L96k00
6974d3r4J92K4l80K85kl2l6j21M05j2k17p1O5K6K05m10L19j08J21j20J66l56J09
6998h5L3K00l19J39J28n40M50P2l8m3J55k0j06j3j65k3L33j48q2J88j16Jp1mj80
7023b54K26j97K22N5K5j26Q3r8Q6J82k07P2k16J40L4o6Jl2J31M0J8k50Q5J44J32
7048B30k22j71K81k9m3m7m4J28k99J41J6k23q1K78J99k15l57O33j21k83J90j10
7070a49J54k65J95J42k39K02mk95J61J53j10n1J19o9l01K76L31k87J62p8j32K06
7092A21L6r3j09J19o5O3j34K47l70J03K97k81j06J25n3L21j78Q5m59J2J99O2J64
$$ plain form
6928 258 78 -131 52 -155 49 -156 19 136 -296 -264 -145 158 28 -19 131 40 -164 292 -126 -191 -214 19
6950 19 131 196 -93 -90 11 -85 -16 70 -1 274 31 50 -15 162 178 14 1 150 223 49 -130 -239 157 -43
6974 -43 -137 55 79 -301 -16 -18 -50 -86 -207 198 186 -31 -102 -37 -11 194 -216 103 -5 116 -4 162 -194 -85
6998 -85 -52 148 -171 -32 96 -444 6 78 40 -3 152 132 26 13 -152 -175 158 10 -72 116 0 1 -70 -74 -254
7023 -254 -28 -225 -3 52 77 -49 34 -64 22 204 -3 69 -147 -7 27 -39 -38 -70 61 101 119 -131 -46 98 230
7048 230 8 -163 118 89 46 -1 -45 83 -216 -75 -59 -282 -363 -85 114 -101 -458 175 54 -229 -39 -149
7070 -149 5 -260 -65 77 -162 40 36 -259 -98 55 -55 -106 13 -56 -357 -81 250 -37 125 47 -85 121
7092 121 157 64 -45 74 9 72 -62 185 -185 -82 215 -66 -172 -47 -100 221 43 128 -331 -319 -120 -58 106
7115A06k88M9M2R5o1j37L4J47j31o7J43Q6j11J04%m5l5K15M7k39J70J3k98J63
7139BR7O2k4j17J0k42L27k91M1J91K37m27R1l0J62j74L0K9r3Q0R7J50k87Q0o6
7164f5P9J55n6K01k63k51J59k06J47K11n9l0qRJ86k69K6J24j09j45QK92j90l2
7188h6J18m4J20k50K6J9j01J20r6K99l22J49J22l19L08k95K23k9O3k4m8k3J24
7211E4j40K24j99L1k3L16l86Q2M3k6l3P0K22k73K2j35L22k77J44L9k43L58j62
7234C0J2R3O7qk21L34l94J1lK21J9l47J03K5k1K2J61j01K59k37J90J13j38j00
7258I0l27M48m0k77K37o2j58K50l04K44l97J76K40k17J32p8j97J73K4K04k1j02
7280C8J70r2j99j35jK0J20P2Kl60L66ON5J69k86Kl6N1J75k29K56k91L42j54k56
$$ plain form
7115 106 -182 -133 -91 4 -57 -194 -160 -13 -144 -211 -68 18 -93 11 11 -34 -69 146 193 -46 124 137 -161 2
7139 2 99 161 137 20 30 -212 115 -176 -135 56 293 -134 -43 -73 89 -85 -55 -26 -119 -39 58 208 -79 1 -65
7164 -65 14 169 113 314 51 -200 -41 -247 -100 111 52 22 14 23 209 -60 -34 90 -19 -164 -156 136 -54 -86
7188 -86 32 -12 108 -142 -116 -97 -198 -78 -174 125 -197 -48 74 -245 63 -232 -9 -38 25 1 -47 -70 54
7211 54 -86 138 -61 -30 -53 263 -123 -41 2 -24 -57 13 235 -38 -16 -151 171 -106 38 77 -166 192 30
7234 30 42 135 202 194 -27 307 -87 -76 -79 142 161 -186 -83 -58 -79 -57 104 3 262 25 215 328 190 90
7258 90 -237 211 171 -106 131 69 -89 161 -143 101 -296 -120 120 -97 35 -43 -240 -67 -43 161 140 38
7280 38 208 116 -83 -218 -219 -199 -79 -7 -5 -365 1 7 62 231 -55 -53 -89 -38 137 -92 164 -127 215 61 -195
7305a95K50J40j38K5K9j4K65j32l10K32j33J0L7%k70m3L61l73K24mo3o0J32J48
7329A18L2o58M83q2J13K38n3o3j20l5j53K34k08K07LJ14j15n2P8n6m5R3n8K77
7353B92l15J68m36K83k69J74J96oJ33m57M21k39J40j58L92l10K1Q5o3M6j66K99
7375B31l07j45j75O42k80kR6N6rN4l57K9K52j77J43J0j21K55k90L7QJ38O3k40
7399h9l77M59k08J20J83n5j08M1K05j24M9k09K64j89J58j67J63Qk10K61m28l8
7421b91J00M7L73l5n9l06J68l1L05k22J41j69r5o7J55J17m9o9Onj74N5jQ5L17
7446B96l16N2k9m7O5j02J04j83J58l36J82J98O9L23j40l70J76j07R3J81n7k99
7468h9J25Q6k79o3j01N7J30J12rK04l89O16m32N1o7K17j88j42L29l62M77l88J80
$$ plain form
7305 -195 55 195 57 82 111 97 362 230 -80 152 19 29 66 66 -204 -247 114 -259 -35 -39 -102 -162 -30 118
7329 118 150 -508 -25 -107 6 244 191 128 8 -27 -180 54 -154 53 56 170 55 3 81 25 -20 73 15 292
7353 292 -23 145 -291 -8 -277 -103 93 87 220 -237 184 -55 85 -73 319 9 30 115 52 98 -68 231
7375 231 -76 -221 -396 246 -34 -36 60 116 107 161 -196 -167 85 -92 51 61 -60 195 -95 -58 -50 88 151 -89
7399 -89 -466 -7 -215 -95 88 33 -75 -34 171 47 96 -113 151 -38 120 -47 116 124 -86 175 -253 -291
7421 -291 -191 -144 229 194 135 -171 -3 -34 271 49 190 21 -74 -141 14 131 82 13 19 14 -160 -105 -106 -21 296
7446 296 -20 32 3 -44 21 -81 23 -160 -2 -338 -156 42 111 434 294 -76 100 -7 86 267 210 -89
7468 -89 36 122 -157 -220 -321 -264 -134 -22 -31 173 -216 400 -32 19 -48 169 -19 -161 168 -194 283 -105 75
7491G5j15j46J98j5J84k84L8J02j09J58l2m58J69K55j2Lj68J44L2m6k42L49k64
7514a84L12j94J08j15j42K70o8Q5j68J30j68K81oj73j03p0K07K05j47k07K13j26
7536f0L10m02K75j78j95J85k4J19p6J4M65o84J77j15R1K66l09K57j62J34j48m
7558f4l5K1k12L64N7j8m08M07J36k00L6O5j62l11L91k66M31j74j55K42j60p6K00
7581A09K69n16K00l74K58O5K54l66J4R3m6P2j71M21j08k16K24o0J24j91n9K0n
7604A1nO9n1k81O29m04O8J75k49o2J6l9J63L4J25J26n92K39p3J05K57j91k44J89
7628A5J61k09J67q0j49J97k13J42P4pj61j21J91j90J38J7J8r3L30j60J19j58q7
7651e9o6K91l04j83N33k37K09L0l37R7J1J75l26J59N6r4r7rJ41L3k73J77j21J97
$$ plain form
7491 75 -40 -186 12 -3 181 -103 -65 37 -72 86 54 -404 -235 20 8 11 -157 -13 19 -27 -269 80 -184
7514 -184 128 -66 42 -73 -215 55 -13 72 -96 34 -134 147 141 -32 -135 -205 2 207 60 -147 66 -60
7536 -60 250 -152 123 -55 -250 -65 -89 30 -46 -32 433 -251 -74 -189 -98 168 -141 116 -46 88 -60 -64
7558 -64 -99 -78 -290 74 131 113 -295 112 248 48 84 149 -13 -324 67 -199 232 58 -97 145 -15 -91 109
7581 109 378 -138 62 -312 -54 11 265 -101 -87 6 -40 32 -139 282 174 -42 182 122 246 55 -4 16 11
7604 11 6 75 24 -257 372 -32 36 211 -38 -100 -84 -123 40 74 199 325 -267 -28 -101 4 261 70 -174 15
7628 15 176 -33 134 54 -95 102 -111 31 105 98 -63 -184 7 -183 -45 -28 -10 -103 227 67 186 28 -59
7651 -59 -125 166 -138 -321 212 -25 184 214 -123 -26 -15 160 -166 -7 49 -45 -142 -151 -10 23 -250 -73 -194 3
7675CN0O0j20k76K71%J04N1k27j27J76O5P1l74K38o1OP4M8o1P2J1R8k64J70j20
7701f2J23k18L58k09j24J52k08O6K56Ok8j48J56nj53J87k59K41j80J88p4j38j84
7724b57K86k69J84K90k66K02j42k39M28l02l0j93N03Rl42M39l26O0K22K9k28R9
7746A57m8J6M6k00r9K27j1l5k85O49k73k11k18L71k13K3r7Q6k2j4k0pJ09J47j01
7771b3l7j61J05J44oQJ4j04p6J99N7J92m80K00j25p0J36K88r3l2k80J32O7K33
7795B88k83P5k79M48n06L20k08M11k11j80j32N31q8m65J67J65j41r9M39q0k29
7816e7J91nj88j69L54K28l43K92l70j54J62P6l77L83m8k9N8L6r6K10J75m18K92
7839B03j32L4K65l62M0J58j46qk5k39J80LJ36k36K43qj43J12j53j28L25j04m7
$$ plain form
7675 3 53 113 -7 -283 -12 -12 92 143 -84 -211 -35 30 101 -273 -35 -96 -90 -16 32 -29 43 54 152 -112 58 -62
7701 -62 61 -157 201 -8 -132 20 -188 -122 134 140 112 -36 120 115 -38 149 -110 131 -49 139 65 -73 -257
7724 -257 29 -240 -56 234 -32 170 28 -211 217 -85 -115 -308 195 204 -138 301 -25 35 257 286 58 157
7746 157 109 125 171 -29 -128 99 88 53 -232 417 144 -67 -285 86 -127 -104 -201 -115 -137 -151 -171 -178 -69 78 -23
7771 -23 -60 -221 -116 28 22 30 44 -60 -136 63 120 312 -168 32 -93 -163 -27 261 168 136 -144 -12 55 288
7795 288 5 80 -199 249 -257 63 -145 266 55 -125 -257 274 186 -279 -112 53 -88 -187 252 172 -57
7816 -57 134 129 -59 -228 126 354 11 303 -67 -221 -59 17 -360 23 -25 -54 4 40 -56 154 329 -89 203
7839 203 71 105 370 8 48 206 60 52 27 -212 -32 -29 107 -129 114 106 -37 75 -78 -206 119 15 -32
7862c2R0j32M1j3o8K7J33j49J03k22J17j22K98ln24O31q1j17J96j72J33n4j02
7885b2J84l27K15M9m2L3k04m6L35M6k56m2K24M1on3j82j63L54r4K1j58K1J67N8
7910A53k49M7K0L39k38m08M34j24k33L11p9j66J23K92m11L16L1n4k8k11K68j43
7932a0Jn6J48k40J23M5K5R2J1L2k7Mm8J32k64m8J47J54k90j73K74j53n4K42l5
7957C2p0J27nJ51k30r8L59k70K12k81P4N8N3j75L10j17l41K66M3k63Q5J34P3j31
7981dj53K99j21q6J73j90K91j84p4J44k89J01L08j26k8p8k8l2K2k1M4o3J88l08
8005b15L94m0k13O8J22j37L5K34l40J10J22j30lr2K9O8p1L1L6Q3j12J12k00L03
8029A94k99N0L5J80m42K42L5r1L11l04Q3k06J92L05k54j17K78k18M0k66L01L2
$$ plain form
7862 -32 58 -74 -33 -46 -114 -87 46 -103 0 -222 -105 -227 71 68 -456 175 94 -23 173 1 134 80 -22
7885 -22 162 -165 50 99 57 90 -114 -160 175 221 -35 -77 147 188 182 129 -53 -216 138 44 65 -93 -72 95 153
7910 153 -96 -49 -29 310 72 -336 98 -26 -259 52 -27 -193 -70 222 -189 127 158 104 76 -135 133 -10
7932 -10 -9 -65 83 -157 -34 11 36 128 139 171 144 148 100 232 -32 -80 67 221 -69 -242 32 -121 -175 67 32
7957 32 -38 89 84 235 5 -93 266 -4 208 -73 1 59 112 -63 247 130 -211 55 98 -165 -80 54 127 -4
7981 -4 -157 142 21 -65 108 -82 209 25 -49 95 -194 -93 215 89 61 -17 -45 -77 -55 -76 -32 -95 93 -215
8005 -215 179 139 -74 -6 116 -21 14 248 -92 18 140 10 7 -85 -56 12 -59 -28 8 91 -21 91 -109 194
8029 194 -105 -55 -20 160 -282 -40 -5 -96 215 -89 -6 -212 -20 285 31 -86 192 -26 14 -252 49 81
8051H1Ok11J26q6K49q9m7j21K5j83J33P5R5o7o3p2p5J57J27k19K45pJ67l00j1
8076f5K32j91r0J27k42J13J13o1r3K02l4k33J40P4o7J27r2N0p8R8r6p3L54l98
8100a83J20N6j54J83kj19L94k05M5l08J41L5J18o4j96m5K50m8J96N2l73J93j34
8123d8l35M07q3Q1K06j59j67l8o6PJ77J00p6q4P6L3O8j25J15j1l2k2J64k3j85
8148b0o7K1J14j7j85L54J43m48j57K30q5l8K73k65P2j09M05j83p1j5J72j70R4
8171D8N6j65j2p4K12n6K6K1j62K18o6J6N1j80M3j50M04k07J17k47
$$ plain form
8051 81 87 -124 2 -84 165 76 29 -92 -67 -250 -117 -42 53 -14 -77 -149 -224 -67 60 -159 86 79 246 -54 -65
8076 -65 167 -24 -114 13 -229 -116 -3 -64 -157 45 11 -222 -82 -8 -75 52 -40 10 -68 30 -66 -139 215 -183
8100 -183 -63 -7 -161 22 20 -99 295 90 135 -173 -32 3 121 57 -139 -184 66 18 214 266 -107 86 -48
8123 -48 -383 24 -59 22 228 69 -98 -136 -202 -195 -18 82 6 -78 -2 31 99 -26 89 78 46 24 188 165 -20
8148 -20 -87 -66 48 31 -154 200 343 -105 -262 -32 -117 -155 118 -147 -75 -184 221 38 -33 -48 124 -46 48
8171 48 104 -61 -73 -147 65 9 35 56 -106 112 46 62 113 -67 -24 -174 230 23 140 -107
8191a07
$$ Imaginary data points
##PAGE= N=2
##DATA TABLE= (X++(I..I)), XYDATA
0@%%%%%%%%%%%oJ4j6J6j6K4l2L2m0M8n6P2q4R3j06J26j49J72j96K22k54K88l24
34a72L67m14M63n17N78o44P16p95Q81r75J077j186J307j443J591j754J932k127
52a115K346k591K864l173L527l936M412m977N662o508P584r004J0967j3861J8543
67A0740k7309M8907j91681k45259N75923p895l79884J29653J09421j33086K26718
78A16248J0673l97908J90154M46651l37609l04561L45092R3381k17877P5029m3027
89b3754j42648K81909Q0218m31917N9001M21854j75636k62272K04603K9173j01346
100f0815J72195q5500k56286K84900K12559l87390p5494L49049p4270j80340J47134
111D5742n9418j11212K66014k0221l55447J76298L05824k68765j46707K45692
$$ plain form
0 0 0 0 0 0 0 0 0 0 0 0 0 -6 8 -8 8 -8 16 -16 16 -24 24 -32 40 -44 49 -57 69 -80 92 -104 118 -136 152 -172
34 -172 195 -219 244 -273 305 -339 377 -418 463 -512 565 -621 686 -757 834 -920 1012 -1115
52 -1115 1231 -1360 1504 -1669 1858 -2078 2334 -2643 3019 -3489 4095 -4909 6058 -7803 10740
67 10740 -16569 32338 -159343 -404602 171321 163426 -216458 -86805 22616 -110470 116248
78 116248 126921 -270987 -80833 365818 28209 -276352 68740 162121 -55756 19273 -23754
89 -23754 -166402 115507 195725 -236192 -177191 244663 69027 -193245 11358 40531 -60815
100 -60815 111380 25880 -230406 54494 267053 -120337 -195831 153218 78948 -101392 45742
111 45742 -13676 -124888 141126 120905 -234542 -58244 247580 -21185 -167892 77800
121G7800l8693j03441J72558r7705j97168K78529J15517l60951J2078L05809j16656
132D7677j48320J36906m0039n9527J89268p3538k37777J98389J78889k52146o2619
143a22837J95327m9004n3901R6880j09125o1712K29830l0395k59179J24015J87611
154A47510j66089n6898J22394p3156o988J43094j30488j33567K29439N7626k47466
165a14589L8882J77658j02749m5730R9037r1656l1550J75296p0586j81011J50127
176C129J18369j68230j9402J16243o1222j1067Q9400j02533n8913J71846r899
187F7721j72164P3497J10721r3199j6663O0489o4372J3723J01715r4786q2958
198i6276J43361K6055j34597L4028P3357o3232J2496M7014q4727M921J18224o3758
$$ plain form
121 77800 39107 -64334 108224 10519 -186649 91880 207397 -153554 -141476 164333 47677
132 47677 -100643 36263 -3776 -63303 125965 52427 -185350 13039 191928 -60218 -122837
143 -122837 72490 23486 -30415 66465 -42660 -104372 125458 95063 -164116 -40101 147510
154 147510 -18579 -75477 46917 -26239 -33227 109867 -20621 -154188 75251 132877 -114589
165 -114589 -75707 101951 -798 -46528 52509 -39147 -70697 104599 34013 -146998 3129
176 3129 121498 -46732 -66134 50109 -11113 -22180 67220 -35313 -94226 77620 67721
187 67721 -104443 -30946 79775 -13424 -30087 30402 -33970 -20247 81468 -13318 -96276
198 -96276 47085 73140 -61457 -27429 45928 -17304 -4808 42206 -42521 -37600 80624 16866
210A6866r9020J03147M2697r8599K0080M8113o0738K2104O1896q2133k7890J12080
222E8603j9018r7855N6922M8764o5134Q306L7313n0870R040O1435n1836m1601
234d5931P2617O231o3150K6104K7927l9989J5705K7509m8251J480N4402l1218
246C436l7637M4440O234l6377K2835J1938l7136K0993L0067m5018q789M7268j7264
259D990l1161L0748M014k7914K2462J2768l6342J0174L4400k9398j8183L3010
271I568k557k3265J6981N295k0645J4464J4398k5667j690K7203j0173j8501J6658
284B069M312j2094O456K136j0512P348Q727j3341k122J4933l823q859Q307M53
298C990n974O104r08q223O506N804r407l67R146l182n183O590n71n924N264J041
$$ plain form
210 16866 -82154 20993 63690 -34909 -14829 33284 -27454 -5350 56546 -25587 -53477 58603
222 58603 39585 -58270 -1348 47416 -17718 -9412 27901 -22969 -13929 47506 -4330 -45931
234 -45931 26686 32917 -30233 -4129 23798 -16191 -486 27023 -21228 -19748 34654 3436
246 3436 -34201 10239 16473 -19904 2931 14869 -22267 -1274 28793 -16225 -25014 22254 4990
259 4990 -26171 4577 8591 -19323 3139 15907 -20435 -10261 24139 -5259 -23442 9568
271 9568 7011 -16254 727 6022 -14623 -159 14239 -11428 -13118 14085 3912 -14589 2069
284 2069 6381 -5713 743 2879 -7633 -285 8442 -4899 -7021 7912 4089 -4770 3537 3990
298 3990 -1984 4120 3212 -5011 1495 7299 -2108 -2475 6671 3489 -1694 4896 4325 -1599 3665 4706
314D706p308L462N252o005k396O512r1o015K930L262l785j46K710k361m63J932
330B196j839k161J871J410k735l97K569R2j608J34K72L64j375j128R80p3j080
347b508O19N70o09J48J276o16j830K108P47l432J126K286k689p69K586p7k453
364c517K096J962l822R85M323l500j785M572j582l397L852Q74m741K265N082n081
380a414j363O702k637l663N827j660n551O526J799q861L104Q712p319l656R184
395E730l528n105R188k450j0132J0909N085j5722K631J3874r554o293J2832m987
409B478q882J5655j898j9245J4231J3094k1632j839J8790j0491p870J7058q810
422F39j4060K3607K583l0105J2757K3063k3036o912K1107j2429p995K4371j2300
$$ plain form
314 4706 -2602 860 6112 107 -2289 4223 4132 -1883 1047 4309 524 378 3088 727 264 2196
330 2196 357 -1804 67 1477 -1258 -1655 914 1006 -602 -468 -196 168 -1207 -2335 -1355 -1428 -2508
347 -2508 -1889 -1319 -1928 -1780 -504 -1120 -2950 -842 -95 -3527 -2401 -115 -2804 -3573 -987 -1064 -3517
364 -3517 -1421 541 -3281 -2296 2027 -1473 -3258 1314 -268 -3665 187 1061 -3680 -1415 3667 -1414
380 -1414 -2777 3925 1288 -2375 3452 1792 -3759 2767 4566 -4295 -1191 7521 202 -3454 5730
395 5730 2202 -2903 6285 3835 -6297 4612 9697 -6025 -3394 10480 926 -5367 7465 2478
409 2478 -6404 9251 7353 -11892 2339 15433 -6199 -8038 10752 261 -7609 9449 639
422 639 -13421 10186 12769 -17336 -4579 18484 -4552 -11464 9643 -2786 -10781 13590 1290
435A290k4577L0964J2585l9549O838L0311k1564p916K3081j8631r877L7009j3122
448F842l9913L4432K5816m2691j267L2684k1031m067K8335k8649j7783N1874n121
461A9461n5510K8189L8418l9193n801K9848k5457q11M2150l5271l5766O0654J2626
474C3537o3192J4752M1352l2015j482K8574l8991k730O2747l2217n8427N8154
486A0062L0803o0190N152L5052l3064R526L8371n4898j8999Q1717j4368p6701
498d7537M3793M1549n0077O554K6412m6306J6474O1049o1704m6505Q7522J0876
510D2100p9157K5147L7170m0777J9755K6592o8607R934Q8450n1306p3488P5124
522A0937L1367o6103J6649K3455m7230L6049M5982q6539j7750J05545k1534q5440
$$ plain form
435 1290 -23287 7677 20262 -19287 -12449 17862 -3702 -11618 11463 -7168 -17045 19964 6842
448 6842 -33071 1361 27177 -15514 -16781 15903 -5128 -9195 19140 -9509 -27292 24582 19461
461 19461 -36049 -7860 30558 -8635 -14436 15412 -10045 -10856 31294 -3977 -39743 20911 33537
474 33537 -29655 -14903 26449 -5566 -7048 21526 -17465 -20195 42552 10335 -48092 10062
486 10062 40865 -19325 -14173 20879 -12185 -2659 35712 -19186 -38185 43532 29164 -47537
498 -47537 -3744 37805 -12272 -5718 20694 -25612 -9138 51911 -9793 -56298 31224 42100
510 42100 -37057 -11910 25260 -15517 4238 30830 -37777 -27843 60607 9301 -64187 10937
522 10937 42304 -23799 -7150 16305 -30925 5124 51106 -35433 -53183 52362 30828 -54612
534e4612M8551L4535m6816K5401J3127o8446L9700P6924q5337n0584J00022O857
546C9322p5195L0960J7752m2694N0128K1632r9146K2595J09324o3918p7572P8561
558A1749K1906n4784L2016j181n9370O6389N1885j13235j4921J19117k7002p9640
570d7071M8768J2771l4724N3028r998r1037O5107Q8579j03949n1079J04517O56
582C5568o1321L5619q763l9822P7734J1125j17377L2411J13223o6918o9177O9626
594A1928P103l3558M3944k8029o3355Q8359M6310j21039o759J09069l0775n8300
606c5102M3960j2383k2994P2746k4250r8927P4073Q3158j00060l8509Q5482j0914
618A6280l4224M0519l5913l6647R4743M435j18718L7260R8555o2484m5040N3557
$$ plain form
534 -54612 -6061 28474 -18342 7059 20186 -48260 -8560 68364 -16973 -67557 32465 39322
546 39322 -35873 -4913 12839 -29855 20273 41905 -57241 -34646 74678 10760 -66812 11749
558 11749 33655 -21129 10887 9706 -49664 16725 68610 -44625 -59546 59571 32569 -47071
570 -47071 1697 14468 -20256 32772 22774 -68263 -3156 85423 -18526 -69605 34912 35568
582 35568 -25753 9866 1103 -38719 39015 50140 -67237 -34826 78397 11479 -57698 11928
594 11928 19031 -14527 29417 1388 -61967 26392 72702 -48337 -55096 53973 23198 -35102
606 -35102 8858 -3525 -26519 46227 21977 -76950 -2877 80281 -19779 -58288 27194 16280
618 16280 -17944 22575 -13338 -49985 44758 49193 -69525 -32265 66290 3806 -41234 12323
630A2323j6259j1179N8585m7200o7258R6836M1824j12448r04Q6580l0869k8752
642a8721L6013l6879j0068Q3497l3243r3829P1316O8622q2611k2247N8540k1324
654i34m909M0970n4796k9713R5784j880j01418L4357P1992m9179j9350L4363l2393
667a7106O572O1264n4523n7851Q7227K9514q8989O711N6214l0036k772K8386m9698
680b5087k558Q0425l4374p7523O0553M6573o1402m604L3012k8184J2956L7947
692C7734n8631k2709Q3020o894p6333L2013M2015l7439K781J9121l9838J5283
704i877N4298n0447m3191O8235J5384o0658J4079K8002k8032J4454K0638m9060
716b6175K503O2619k9066n1505M4400K2876l9553R281J4170k8975J9906K9637
$$ plain form
630 12323 -3936 -15115 43470 -3730 -70988 25848 67672 -44776 -45680 40900 10031 -18721
642 -18721 17292 -19587 -29655 53842 20599 -73230 -1914 66708 -15903 -38150 20390 -934
654 -934 -5843 35127 -19669 -49382 46402 44522 -56896 -22539 49453 274 -19076 15287 -17106
667 -17106 -10534 50730 -3793 -61644 25583 55097 -33892 -27181 29033 -1003 -3775 24611 -25087
680 -25087 -27645 52780 18406 -59117 1436 48009 -13393 -17997 15015 -13169 -213 37734
692 37734 -20897 -43606 39414 32520 -43813 -11800 30215 -7224 -4443 14678 -25160 -9877
704 -9877 44421 -6026 -49217 19018 34402 -26256 -12177 15825 -12207 2247 22885 -26175
716 -26175 -23672 38947 9881 -41624 2776 25652 -13901 -4620 9550 -19425 481 30118
728C0118m7657j3552N7876q703m5894K4947J8554k6490J3990J0207l5835J5381
740g058L9434l7023k5124M4243K736l2512J5841P781k1815J9729J3710l8845M761
753a4142M1329k2026k7349K9043M927k1449J5295K684k4562J8470K0918l3534
765a0396o733L5061r543k2262J8102K094j5325J6194L676k6152J1748K3316k2585
778b805j2130K3859k400j4989J2343q26j3581J5529O689k3506L980K1443j3017
791E89j1616J4922j133r516J1333j865j3874J2636Q971j7770j186J5977o504q542
805g578J0036k148p472J0650Q28j3599P123J0435j1696l157J0594l429n641P284
819B230j487p191Q311K823j0427K881Q194o492k944O979k189l638N385n46n637
$$ plain form
728 30118 -17539 -31091 26785 18082 -27812 -2865 15689 -10801 3189 13396 -22439 -7058
740 -7058 32376 -4647 -29771 14472 17208 -15304 537 8318 -13497 6232 19942 -18903 -14142
753 -14142 27187 5161 -22188 6855 11782 -9667 5628 8312 -16250 2220 23138 -10396
765 -10396 -17129 17932 8389 -13873 4229 6323 -9002 7192 10868 -15284 -3536 19780 -2805
778 -2805 -14935 8924 6524 -8465 3878 3052 -10529 5000 11689 -11817 -7837 13606 589
791 589 -11027 3895 2762 -6754 4579 2714 -11160 1476 10447 -7323 -8509 7468 964 -7578
805 -7578 2458 310 -7162 3488 4316 -9283 -2160 8275 -3421 -6578 4016 587 -5054 2230
819 2230 743 -6448 1863 4686 -5741 -2860 5334 -1158 -4102 2877 688 -2950 2435 1889 -3748
834c748M684L701p033P22N332l696j434M093j701k371L834n5m292K668K774m039
850e61j77L512k230j154K930j063j870K169M90k644R29K043k444m11K212j140
866E91j394J834k39j651J413N80j465K34R24r09n11J124o87r22J142J6j056P33
884b43K98r28J84N62n25l82Q15k34o30N07J80j027R79j0r26R76K32r19j20J087
904a24k08r77J139J6j452J124Q70j641Q48O45q81r0J364q04j175K196j16k428
922a694J797J602k822Q31J975j863l61K559j396k162L682L87m439K006K913l672
938f57J7L406l440l55M818k604m015M806J530n695K017L891m712N34M273m870
954a056j283O931k508o990O262L729p642J185M757n536O81O439o737m056J0906
$$ plain form
834 -3748 936 4637 -2396 -1674 3658 -38 -1472 2621 920 -1451 2383 2328 -1964 704 3478 -561
850 -561 -738 2774 544 -610 2320 1257 -613 1556 2046 -598 331 2374 -70 -481 1731 591
866 591 -803 1031 792 -859 554 1134 -331 -97 827 -82 -593 531 -156 -1078 64 80 -976 -243
884 -243 55 -873 -689 -127 -652 -1034 -219 -453 -1083 -576 -396 -1423 -444 -454 -1380 -404 -172 -1091 -1211 -124
904 -124 -332 -1309 -170 -154 -1606 -482 388 -1253 -405 240 -641 -731 633 -171 -1346 850 734 -1694
922 -1694 103 1705 -1117 -286 1689 -174 -535 2024 628 -1534 2148 2535 -1904 102 3015 -657
938 -657 -640 2766 -674 -1029 3789 1185 -2830 1976 3506 -2189 -172 3719 -993 -459 3814 -1056
954 -1056 -2339 4592 2084 -4906 1356 5085 -2557 -1372 3385 -2151 -1470 4969 -1768 -5824 5082
969E082j674j0277O258N348p734J349N346q162J239J0326q520p733J2868J467
983E183j2166N024O080q391L373O425j1787k2J5605q158j2686J3548M630j2839
997f181M966N115j0455N789J0569j6126l949K0575n005j6643J1534O364j1942
1010e389O731M889j5733P342J7028j7952j1075K2710K78j7685R243M820j2084
1023f877J0981O749k2348M503K4495j4853j7678J9774M295j5132R086J882j6225
1036a1348J5080J3849k8212l025K9998q878k0727J5512L575j2535J3706L81k4438
1049a7062J5751K3872k8240j2984K9607k471j8148J3097j843j3829K1795M740
1061A4285l4153R938L3026k2352j9364K4594r30j3249J6652o958k1922K6996J5740
$$ plain form
969 5082 3408 -6869 -611 4737 -2997 -1648 3698 -4464 -3225 7101 -1419 -9152 3716 5183
983 5183 -6983 -1959 4121 -4270 -897 5528 -6259 -6281 9324 1166 -11520 2028 6658 -6181
997 -6181 -1215 3900 -6555 -766 9803 -6323 -10272 10303 5298 -11345 189 6553 -5389
1010 -5389 1342 6231 -9502 -2160 14868 -3084 -14159 8551 8829 -8856 387 5207 -6877
1023 -6877 4104 10853 -11495 -6992 17503 2650 -15028 4746 9041 -6091 2995 4877 -11348
1036 -11348 3732 17581 -10631 -13656 16342 7464 -13263 2249 5824 -6711 6995 7376 -17062
1049 -17062 -1311 22561 -5679 -18663 10944 8473 -9675 3422 1579 -12250 9545 14285
1061 14285 -19868 -9930 23096 744 -18620 5974 5044 -8205 8447 1489 -20433 6563 22303
1074B2303l8934j201L6293j2333j9966J7756m318j0151K4645o885l3425K5263
1086i53K8108l5511j2209L1648n699j3636J6823j1872j4810L4379J279m3181J5030
1099a0604L6630k5409j6680K2664o293o733K2770j6696k5796L7588J5243m4780
1111a8096J481L5437j5105j2056J6839j4675n859L4970j3747l9720L1795K8331
1123B9595l8111p514K7482j1232l983J9408k3482j4093M3725j720m7575J8405
1135i095L3211k5749q172J7823j5405J999K9097k6561k7252M2936J3285m4382
1147a8265M687K8098j5663j639J4072k5139J69M0017j8999l9131L2580K3769l3214
1160h658k132J8363j5241O851K0426l2286j1765M6305m587m3149J8243K4729k1319
$$ plain form
1074 22303 -16631 -17832 18461 6128 -13838 3918 -400 -10551 14094 7209 -26216 -953
1086 -953 27155 -8356 -20565 11083 5384 -8252 8571 -3301 -18111 16268 17547 -25634 -10604
1099 -10604 26026 617 -16063 6601 308 -6425 16345 -351 -26147 11441 26684 -18096
1111 -18096 -16615 18822 3717 -8339 8500 -6175 -12034 22936 9189 -30531 1264 29595
1123 29595 -8516 -16030 11452 220 -3763 15645 -7837 -21930 21795 20075 -27500 -9095
1135 -9095 24116 -1633 -9805 8018 -7387 -5388 23709 -2852 -30104 12832 26117 -18265
1147 -18265 -13578 14520 -1143 -2782 11290 -13849 -13680 26337 7338 -31793 787 24556 -8658
1160 -8658 -10790 7573 -7668 -817 19609 -12677 -24442 21863 17276 -25873 -7630 17099 -4220
1173d220J200J0359k2428R793L1689l1235k5194M2613Q658l7077Q125J6757j5390
1186f350R412J0744l1648M404M0793k1110l4047L0501J5622k5980N137Q637j8307
1199a2192J5664J8299l4937p759M2400p171l4011J7563J3217j6044R407L501k5134
1212a7197J4851K8333l0443j9169L5184L687k6127R693O145j3772J5881P249l1507
1225a7192N903L4704j9142k4191K3278P287j7025R431R92j8415J8374J5345l1796
1238a2447m388L3161p751k2326J4001L921j1137J3886o5k4172J4640K2978k5131
1251d830j2384K5618j679j4995J0621j634j1471J7635M525k6963O977K5098j5599
1264I19j4154J7129o40r091J1604m001j5146J6915J0805k4099j112K1896p624
$$ plain form
1173 -4220 -3020 7339 -15089 -5296 26393 -4842 -30036 12577 21235 -15842 -7717 9040 -6350
1186 -6350 3062 13806 -17842 -13438 27355 6245 -27802 2699 18321 -7659 -2522 6115 -12192
1199 -12192 3472 21771 -13166 -20925 21475 14304 -19707 -2144 11073 -4971 4436 7937 -17197
1212 -17197 -2346 25987 -4456 -23625 11559 15246 -10881 -1188 4957 -8815 7066 14315 -17192
1225 -17192 -11289 23415 4273 -19918 3360 10647 -6378 3053 4045 -14370 4004 19349 -12447
1238 -12447 -16835 16326 8575 -13751 250 4171 -6966 6920 6855 -17317 -2677 20301 -4830
1251 -4830 -17214 8404 6725 -8270 2351 717 -10754 6881 11406 -15557 -8580 16518 919
1264 919 -13235 3894 3254 -5837 5767 1766 -13380 3535 14340 -9759 -10871 11025 3401
1277C401j1246J1181l084o563J4057k133j8767J2024J4887j7275n891J5812l744
1290B659o532R237n241q537J5374J829j8407N696J4833j1026n763R991l392m039
1304c318R918m915j0973J2861O153j6029J450J2031o680l442P108n412l461J1153
1318F444l106j1972R033P536j1000p99P707m505j903O633n042m980J0066M25j0695
1333f158M056P214o651j500N502m075j254O633l876n651P134K635p945J406N473
1348B943m281o58M344l986j466N995j701n651M366L357n533O11L524l305P6L771
1364B406l569j749N071m36m836K812K590l294K55K547k418l48L178j942k002L220
1380A485J11k983J353J928k503O44J687j868p09K622q10j969K029N55j902N09
$$ plain form
1277 3401 -7845 3336 252 -6311 7746 5613 -13154 -1130 13757 -3518 -9409 6403 2659
1290 2659 -3873 5364 123 -8414 6960 8789 -9618 -3922 10911 -115 -5878 4113 721 -3318
1304 -3318 6600 1685 -9288 3573 9726 -6303 -4853 7178 498 -2944 4164 -1248 -4709 6444
1318 6444 3338 -8634 399 7935 -3065 -3864 3843 -662 -2565 4068 -974 -5954 4112 4537 -6158
1333 -6158 -2102 5112 -1539 -3039 2463 -1612 -2866 3767 -109 -5760 1374 4009 -3936 -2530 2943
1348 2943 -1338 -1996 2348 -1638 -3104 2891 1190 -4461 -95 3262 -2271 -1660 1864 -1441 -1365 2406
1364 2406 -1163 -2912 2159 1723 -3113 -301 2289 -1005 -750 1797 -621 -969 2209 267 -1735 1485
1380 1485 1596 -1387 -34 1894 -609 35 1722 -146 -855 1767 957 -1012 1017 1572 -330 179
1396A79J109j457K39R64j001l88J517m50j296J057M70j130L09M50r78K36Q61o39
1414E2m13O24K44j298N55M57p63J20Q44r31k88J086n11m75M46j1k74rO83p33o4
1435f59O73n90m0O07n14m13N89K26n23J96P55r89O4O24j41m41Q52n29l95P68J57
1456B77r80N55P74r22K14R06j149j49J531j077o63J093M61j374P73N62r17K7J557
1475A499j414q84K260l98j921J497N32j587Q41Q68j796N95J798k188j051L029
1491A680n23k234J739M22k183J468J421k918R0L320k055k507L678m27k504J917
1507C84N34l150K560J923m109o15M895j810l521L646L94l364K985P61m936K832
1523e91M155n333j892N901j286l512L257L1l924M218J380o620K013O711n579k997
$$ plain form
1396 179 1288 -169 70 1034 33 -355 1162 712 -584 473 943 -187 122 572 -406 -170 691 52
1414 52 -361 263 507 -791 -236 221 -542 -422 422 -509 -797 289 -222 -697 -251 -262 -536 -545 138 -595 -659
1435 -659 14 -576 -616 -9 -523 -936 -347 -121 -644 -448 307 -682 -618 6 -135 -576 276 -253 -648 120 277
1456 277 -703 -148 626 -296 -82 824 -325 -474 1057 -20 -683 410 871 -503 270 832 -85 -58 1499
1475 1499 85 -799 1461 1063 -858 639 1171 -416 425 1293 -503 92 1890 -298 -1349 1680
1491 1680 1157 -1077 662 1084 -1099 369 1790 -1128 -1038 2282 227 -2280 1398 971 -1533 384
1507 384 918 -2232 328 2251 -1858 -2473 2422 612 -2909 737 1131 -2233 752 1513 -3423 -591
1523 -591 3564 -1769 -3661 2240 954 -2558 699 730 -3194 1024 2404 -4216 -2203 4508 -1071 -4068
1539d068N853r17l306M189o87n886N956L836q876K90Q682m262m123N040j351l194
1555b824O220j069q648O445O981r214k651R055l087l535N613l326m771R046P30
1570D965j1704M960R820q376m050P787l098k917P646m495p922J1084L938j3286
1584e648J168J0923n851l958O509m571k573J0823m448j2077J0626Q155j2788j441
1598e151R636m407k207P038p542m763J4260r87j5923P373J1105j0177k634P630
1612C251n893l24J0774r166r894J6019M511j6958K954J0936p481o65O393r423
1626d966o48J5779p741j5308J3903R162j4650J53Q330p137K487Q552j2935m265
1640i284J8948k197j8364Q766J0530j0471M62N691r757M270J3302j4211j0454
$$ plain form
1539 -4068 1785 868 -2438 1751 1064 -4822 1134 4970 -3906 -3616 5066 804 -3319 1721 370 -2824
1555 -2824 3396 2327 -6321 124 7105 -2109 -4760 4295 1208 -2327 3286 -40 -4811 4235 4965
1570 4965 -6739 -1779 8041 -335 -4385 3402 304 -2613 5033 538 -7384 3700 7638 -5648
1584 -5648 -4480 6443 592 -3366 3143 -1428 -4001 6822 2374 -9703 923 9078 -3710 -5151
1598 -5151 4485 78 -2129 4909 -2633 -7396 6864 5877 -10046 -2673 8432 -1745 -4379 3251
1612 3251 -2642 -2966 7808 -1358 -11252 4767 9278 -7680 -4726 6210 -1271 -1936 4457 -4966
1626 -4966 -5614 10165 2424 -12884 1019 10181 -4469 -4316 4014 -3123 -636 7916 -5019 -9284
1640 -9284 9664 7467 -10897 -2131 8399 -2072 -1610 4081 -5676 -1406 11896 -2315 -12769
1653a2769J9173L484j7087M058Q589p627L497N127j4067K106J8698j0115j5973
1666a2906J4916P578j3185K046M821q786P244Q853j7348l828K2051m484j7724
1679a0752R567P011q589M367K119j3034P906J5153j6706j0666K0216J667j5476
1692g217N916L870p747R029L510j7831L979K0200j1826j4719J4390M644j0115
1705c917N183K05j0270J1588R006j9995k601K0823m866j3944Q599L270p151Q635
1719D565p53j5097J0235J4658j6769q636J7444J24j0380N931p43p248J2497K243
1733H071j8966N062J8527j1326j0784J1867N76o041P647l633j0876J3916P696
1746A1736j9056r35J7382n445r231P591j648m369J0985l016j5210J1116J2425
$$ plain form
1653 -12769 6404 9888 -7199 -3141 5448 -2179 1318 6445 -7622 -5516 13182 3067 -12906
1666 -12906 2010 9588 -3597 -1551 3270 -5516 1728 10581 -6767 -10595 11456 6972 -10752
1679 -10752 -1185 5826 -2763 1604 3723 -9311 -1405 13748 -2958 -13624 6592 8259 -7217
1692 -7217 -1301 2569 -5178 3851 7361 -10470 -6491 13709 1883 -12836 1554 6198 -3917
1705 -3917 1266 1471 -8799 2789 11795 -8200 -10801 10022 5156 -8788 -189 3081 -4070 4565
1719 4565 3812 -11285 -1050 13608 -3161 -11797 5647 5771 -4609 1322 579 -6669 5828 8071
1733 8071 -10895 -5833 12694 1368 -9416 2451 3027 -3014 4633 1000 -9876 4040 11736
1746 11736 -7320 -8255 9127 3682 -5549 2042 394 -3975 7010 3994 -11216 -100 12325
1759A2325j5280n256J2905j782n579O284m897n813J3646P52j6822N286J3989r313
1773D45o708Q725k659k509Q625n813r668J2744N712j5429P05J1589m690m255N863
1788B677m912k386J1290m165j2187R710Q476j1404k207Q335l586j603O314o547
1802b195m333J1820j48j2846N279Q775p374k013N532m676K01P830n891p778J0738
1817B921L448j1196K110O608m579o69M674n740p91Q898l446r086P461M902p742
1832b227K80M405l762Q02N107o408k573Q719o00q283L733M792m776J05K945m014
1848a755O60N913n225m175O704J636o426J949L118l753J398K549m685jO263l278
1864H92m592M141K238m380R74K233l694J684L330m229j362N324j139m550K899
$$ plain form
1759 12325 -2955 -8211 4694 2912 -2667 3617 -1280 -7093 6553 7305 -9517 -4231 9758 445
1773 445 -6263 2462 -197 -2706 5919 106 -9562 3182 8894 -6535 -5830 5759 1069 -3186 2677
1788 2677 -2235 -4621 6669 2504 -9683 27 8503 -2901 -5108 3227 -359 -1962 4352 -2195
1802 -2195 -6528 5292 5144 -7702 -2423 6352 -1022 -3035 2497 -2179 -1978 5852 -39 -7817 2921
1817 2921 6369 -4827 -2717 3891 -688 -1357 3317 -2423 -3214 5684 2238 -6848 613 5515 -2227
1832 -2227 -1947 2458 -1304 -502 4605 -1803 -4376 4343 3743 -4540 -807 3985 -791 -686 2259 -1755
1848 -1755 -1095 4818 -407 -4582 2122 3758 -2668 -719 2399 -1354 44 2593 -2092 -2093 4170 892
1864 892 -3700 441 2679 -1701 -727 1506 -2188 -504 2826 -1403 -2765 2559 1420 -3130 -231
1879b31J767l041J273J700l651J246L430l242k076M026J24l617K028J171k175
1894a268J457J251l204K23L749j886k496K802L23k036J097Q35k233J172J821k327
1910g20o30K768p25k094J762O04j513Q35P77j918O52J748j548j127J967k24j262
1927f48R82N11j279P18Q64j520j32J616q35q11J299k52q74P80j3p23L85Q43j160
1946b49k11J285n92q01O95L55j099P03K99j022N16P47q67k51Q38m35n71N41L23
1965B04m02p7L95o26K87L27n16k40M46L16r21P43j36r9nL77m37j92N16J04l86
1986c22L75K7n75L46M17o10R0L06j48k29P67m91l59O44k18k34M91J33q81O04L66
2007D99p69l7J056q67N7L95J53o85N39r5o99P99L54q51l7J002l41q95R45J18j126
$$ plain form
1879 -231 1536 -1505 -232 1468 -2183 -937 2493 -749 -2825 1201 1325 -2292 -264 907 -1268
1894 -1268 189 1440 -1764 -1541 2208 322 -2174 628 951 -1085 12 847 -1386 -214 1607 -720
1910 -720 -1350 1418 693 -1401 361 965 -548 287 1064 -854 -202 1546 -2 -1129 838 614 -648
1927 -648 334 845 -434 284 1148 -372 -504 1112 277 -534 765 513 -361 419 406 -317 68 911 -249
1946 -249 -460 825 233 -568 127 482 -617 86 385 -637 -121 626 -241 -492 346 -89 -660 -119 204
1965 204 -198 -275 120 -506 -219 108 -408 -648 -202 114 -807 -64 -200 -299 -304 73 -364 -556 -40 64 -322
1986 -322 53 80 -495 -149 268 -342 -252 54 -94 -323 444 -47 -406 238 20 -214 277 410 -471 133 499
2007 499 -270 -307 749 -118 -61 334 487 -198 341 246 -453 346 700 -151 -188 814 473 -422 523 641 -485
2028d85R84K55j235Q03Q90j274m80J311r7j222J019j40j025J251K74j831O44J734
2046A376j773o24J550n78p12J610p28j640J822R76k674M23J988j266q96J769p86
2063a63j049J861n5k411J725J656k713k04K248j024j015J966j391j320L271j66
2079A216l353J749K422k818k98K181j812KK516j878k433L678J223m418J171K632
2095A780k172n85K514k552k54L606j385l833L511K406m448L33K679k067J1K919
2111B463l280j658N528j010n140K868L116l970O62K030l090P23M127l821l212
2126c664O150M23n367J595K941l145Q62K345m570N62O396m234m788N276K148m766
$$ plain form
2028 -485 499 754 -481 322 1212 -62 -542 769 672 -550 469 329 -696 555 829 -1002 -358 1376
2046 1376 -397 -1021 529 -49 -761 849 121 -1519 303 1279 -1395 -972 1016 -250 -1146 623 -163
2063 -163 -1212 649 594 -1817 -92 1564 -1149 -1353 895 -129 -1144 822 -569 -1889 1382 1216
2079 1216 -2137 -388 2034 -784 -1082 1099 -713 -711 1805 -73 -2506 1172 2395 -2023 -852 1780
2095 1780 -392 -977 1537 -1015 -1269 2337 952 -2881 630 3036 -1412 -1079 1600 -467 -456 2463
2111 2463 -817 -2475 3053 2043 -3097 -229 2887 -1083 -421 1609 -1481 -758 3369 -452 -3664
2126 -3664 2486 2909 -2458 -863 2078 -1067 -205 2140 -2430 -1868 4528 294 -4494 782 2930 -1836
$$ [...]
8191g
##END NTUPLES=NMR FID
##END=
