##TITLE=1H_Pr d2
 CDCl3
 8 sc, 
 5.04.2022
##JCAMPDX= 6.0         $$ Bruker NMR JCAMP-DX V2.0
##DATA TYPE= NMR FID
##DATA CLASS= NTUPLES
##ORIGIN= UXNMR, Bruker Analytische Messtechnik GmbH
##OWNER= root
$$ XWIN-NMR		Version 3.5
$$ Tue Apr  5 13:05:53 2022 Russian Standard Time (UT+4h)  she@DPX200
##.OBSERVE FREQUENCY= 200.131346
##.OBSERVE NUCLEUS= ^1H
##.DELAY= (6, 6)
##.ACQUISITION MODE= SIMULTANEOUS
##.ACQUISITION SCHEME= undefined
##.AVERAGES= 8
##.DIGITISER RES= 18
##SPECTROMETER/DATA SYSTEM= spect
##.PULSE SEQUENCE= zg30
##.SOLVENT NAME= CDCl3
##.SHIFT REFERENCE= (INTERNAL, CDCl3, 0, 15.7039)
##AUDIT TRAIL= $$ (NUMBER, WHEN, WHO, WHERE, WHAT)
$$ ##TITLE= Audit trail, XWIN-NMR		Version 3.5
$$ ##JCAMPDX= 5.01
$$ ##ORIGIN= Bruker BioSpin GmbH
$$ ##OWNER= she
$$ F:/spectra/data/she/nmr/H-F/1/audita.txt
$$ ##AUDIT TRAIL=  $$ (NUMBER, WHEN, WHO, WHERE, WHAT)
(   1,<2022-04-05 13:04:11.68 +0400>,<she>,<DPX200>,
      <created by zg, POWCHK disabled, PULCHK disabled
       configuration hash MD5:
       00 E9 B6 7A A2 85 ED C7 34 08 36 98 17 FE 4E 26
       data hash MD5: 16K
       A0 E7 67 B7 CE A4 30 9E 9C 60 A4 2E EF C4 71 5A>)
$$ ##END=
$$ 
$$ hash MD5
$$ 9C 77 6C BD DF D8 5A A9 85 1A AA 21 8B D5 AE 08
##$RELAX= 
##$RELAX= 
##$RELAX= 
##$RELAX= 
##$RELAX= 
##$RELAX= 
$$ Bruker specific parameters
$$ --------------------------
##$DU= <F:/spectra>
##$EXPNO= 1
##$NAME= <H-F>
##$PROCNO= 1
##$TYPE= <nmr>
##$USER= <she>
##$AMP= (0..31)
100 100 100 100 100 100 100 100 100 100 100 100 100 100 100 100 100 100 
100 100 100 100 100 100 100 100 100 100 100 100 100 100 
##$AQSEQ= 0
##$AQ_mod= 1
##$AUNM= <au_zg>
##$AUTOPOS= <>
##$BF1= 200.13
##$BF2= 200.13
##$BF3= 200.13
##$BF4= 200.13
##$BF5= 200.13
##$BF6= 200.13
##$BF7= 200.13
##$BF8= 200.13
##$BYTORDA= 1
##$CFDGTYP= 0
##$CFRGTYP= 5
##$CHEMSTR= <none>
##$CNST= (0..31)
1 1 145 1 1 1 1 1 1 1 1 1 1 1 1 1 1 1 1 1 1 1 1 1 1 1 1 1 1 1 1 1 
##$CPDPRG= <>
##$CPDPRG1= <>
##$CPDPRG2= <>
##$CPDPRG3= <>
##$CPDPRG4= <mlev>
##$CPDPRG5= <mlev>
##$CPDPRG6= <mlev>
##$CPDPRG7= <mlev>
##$CPDPRG8= <mlev>
##$CPDPRGB= <>
##$CPDPRGT= <>
##$D= (0..31)
0 1.2 0 0 0 0 0 0 0 0.06 0 0.03 0 0 0 0 0.0002 0 0 0 0 0 0 0 0 0 0 0 0 
0 0 0 
##$DATE= 1649149451
##$DBL= (0..7)
120 120 120 120 120 120 120 120 
##$DBP= (0..7)
150 150 150 150 150 150 150 150 
##$DBP07= 0
##$DBPNAM0= <>
##$DBPNAM1= <>
##$DBPNAM2= <>
##$DBPNAM3= <>
##$DBPNAM4= <>
##$DBPNAM5= <>
##$DBPNAM6= <>
##$DBPNAM7= <>
##$DBPOAL= (0..7)
0.5 0.5 0.5 0.5 0.5 0.5 0.5 0.5 
##$DBPOFFS= (0..7)
0 0 0 0 0 0 0 0 
##$DE= 6
##$DECBNUC= <off>
##$DECIM= 32
##$DECNUC= <off>
##$DECSTAT= 4
##$DIGMOD= 1
##$DIGTYP= 9
##$DL= (0..7)
0 120 120 120 120 120 120 120 
##$DP= (0..7)
150 150 150 150 150 150 150 150 
##$DP07= 0
##$DPNAME0= <>
##$DPNAME1= <>
##$DPNAME2= <>
##$DPNAME3= <>
##$DPNAME4= <>
##$DPNAME5= <>
##$DPNAME6= <>
##$DPNAME7= <>
##$DPOAL= (0..7)
0.5 0.5 0.5 0.5 0.5 0.5 0.5 0.5 
##$DPOFFS= (0..7)
0 0 0 0 0 0 0 0 
##$DQDMODE= 0
##$DR= 18
##$DS= 0
##$DSLIST= <SSSSSSSSSSSSSSS>
$$ [...]
##$SUBNAM2= <"">
##$SUBNAM3= <"">
##$SUBNAM4= <"">
##$SUBNAM5= <"">
##$SUBNAM6= <"">
##$SUBNAM7= <"">
##$SUBNAM8= <"">
##$SUBNAM9= <"">
##$SW= 18.0517287032376
##$SWIBOX= (0..15)
0 0 2 0 0 0 0 0 0 0 0 0 0 0 0 0 
##$SW_h= 3612.71676300578
##$TD= 16384
##$TD0= 1
##$TE= 0
##$TE2= 300
##$TE3= 300
##$TEG= 300
##$TL= (0..7)
0 120 120 120 120 120 120 120 
##$TP= (0..7)
150 150 150 150 150 150 150 150 
##$TP07= 0
##$TPNAME0= <>
##$TPNAME1= <>
##$TPNAME2= <>
##$TPNAME3= <>
##$TPNAME4= <>
##$TPNAME5= <>
##$TPNAME6= <>
##$TPNAME7= <>
##$TPOAL= (0..7)
0.5 0.5 0.5 0.5 0.5 0.5 0.5 0.5 
##$TPOFFS= (0..7)
0 0 0 0 0 0 0 0 
##$TUNHIN= 0
##$TUNHOUT= 0
##$TUNXOUT= 0
##$USERA1= <user>
##$USERA2= <user>
##$USERA3= <user>
##$USERA4= <user>
##$USERA5= <user>
##$V9= 5
##$VALIST= <valist>
##$VCLIST= <CCCCCCCCCCCCCCC>
##$VD= 0
##$VDLIST= <DDDDDDDDDDDDDDD>
##$VPLIST= <PPPPPPPPPPPPPPP>
##$VTLIST= <TTTTTTTTTTTTTTT>
##$WBST= 1024
##$WBSW= 4
##$XGAIN= (0..3)
0 0 0 0 
##$XL= 0
##$YL= 0
##$YMAX_a= 62617
##$YMIN_a= -122889
##$ZGOPTNS= <>
##$ZL1= 120
##$ZL2= 120
##$ZL3= 120
##$ZL4= 120
##$ABSF1= 10
##$ABSF2= 0
##$ABSG= 5
##$ABSL= 3
##$ALPHA= 0
##$AQORDER= 0
##$ASSFAC= 0
##$ASSFACI= 0
##$ASSFACX= 0
##$ASSWID= 0
##$AUNMP= <proc_1d>
##$AZFE= 0.1
##$AZFW= 0.1
##$BCFW= 1
##$BC_mod= 2
##$BYTORDP= 1
##$COROFFS= 0
##$CY= 11.3945322036743
##$DATMOD= 1
##$DC= 2
##$DFILT= <>
##$DTYPP= 0
##$F1P= 2.36226072786647
##$F2P= -0.459571619588291
##$FCOR= 0.5
##$FTSIZE= 0
##$FT_mod= 4
##$GAMMA= 1
##$GB= 0.15
##$INTBC= 1
##$INTSCL= 1
##$ISEN= 128
##$LB= 0.24
##$LEV0= 0
##$LPBIN= 0
##$MAXI= 10000
##$MC2= 0
##$MEAN= 0
##$ME_mod= 0
##$MI= 1.114404
##$NCOEF= 0
##$NC_proc= 0
##$NLEV= 6
##$NOISF1= 3.799351
##$NOISF2= 2.8
##$NSP= 1
##$NTH_PI= 0
##$NZP= 0
##$OFFSET= 15.70392
##$PC= 1
##$PHC0= -17668.31
##$PHC1= 9.20078
##$PH_mod= 1
##$PKNL= yes
##$PPARMOD= 0
##$PSCAL= 0
##$PSIGN= 0
##$REVERSE= no
##$SF= 200.130013532006
##$SI= 16384
##$SIGF1= 3
##$SIGF2= 2
##$SINO= 400
##$SIOLD= 16384
##$SREGLST= <1H.CDCl3>
##$SSB= 0
##$STSI= 0
##$STSR= 0
##$SW_p= 3612.71676300578
##$SYMM= 0
##$S_DEV= 0
##$TDeff= 0
##$TDoff= 0
##$TI= <>
##$TILT= no
##$TM1= 0
##$TM2= 0
##$TOPLEV= 0
##$USERP1= <user>
##$USERP2= <user>
##$USERP3= <user>
##$USERP4= <user>
##$USERP5= <user>
##$WDW= 1
##$XDIM= 8192
##$YMAX_p= 0
##$YMIN_p= 0
$$ End of Bruker specific parameters
$$ ---------------------------------
##NTUPLES= NMR FID
##VAR_NAME=  TIME,          FID/REAL,        FID/IMAG
##SYMBOL=    X,             R,               I
##VAR_TYPE=  INDEPENDENT,   DEPENDENT,       DEPENDENT
##VAR_FORM=  AFFN,          ASDF,            ASDF
##VAR_DIM=   8192,          8192,            8192
##UNITS=     SECONDS,       ARBITRARY UNITS, ARBITRARY UNITS
##FACTOR=    0.0002768,     1,               1
##FIRST=     0,             0,               0
##LAST=      2.2672688,     0,               0
##MIN=       0,             -122889,         0
##MAX=       2.2672688,     62617,           0
$$ Real data points
##PAGE= N=1
##DATA TABLE= (X++(R..R)), XYDATA
$$ plain form
0 0 0 0 0 0 0 0 0 0 0 0 0 0 0 0 -8 8 -8 8 -8 16 -16 17 -24 25 -32 39 -42 49 -57 65 -75 86 -98 112 -127 143
36 143 -159 177 -200 224 -249 274 -306 338 -374 413 -458 505 -555 612 -674 742 -817 903 -998
55 -998 1105 -1224 1364 -1525 1714 -1939 2220 -2565 3016 -3626 4504 -5885 8381 -14343 62617
70 62617 1476 -91430 26155 33786 -17654 -33411 16255 24322 3828 15801 12366 -37074 -16780
83 -16780 10715 5481 -13518 -33120 8302 54213 -10365 -43367 4356 17866 -12888 -22721 7890
96 7890 19398 -9231 16392 27059 -30004 -19364 28321 9852 -12486 -3500 19009 15117 -14729
109 -14729 -2926 7827 -13036 -21 8093 -6357 -5831 -7516 6564 11377 -21951 -13280 12512
122 12512 -2268 -8893 415 8877 2039 -12804 10534 14205 -23024 -3071 29177 5992 -13106
$$ packed form
0@%%%%%%%%%%%%%%qJ6j6J6j6K4l2L3m1M9n7P1q1R1j06J22j40J61j84K10k39K70
36A43l02L36l77M24m73N23n80O44p12P87q71R63j060J167j286J416j559J720j901
55i98K103k329K588k889L239l653M159m785N581o642Q130j0389J4266k2724P6960
70F2617o1141r2906J17585P631n1440j5757M9666Q067k0494J1973l435m9440K0294
83a6780K7495n234j8999j9602M1422M5911o4578l3002M7723J3510l0754r833L0611
96G890J1508k8629K5623J0667n7063J0640M7685j8469k2338Q986K2509l892k9846
109a4729J1803J0753k0863J3015Q114j4450N26j685J4080M813l3328Q671K5792
122A2512j4780o625R308Q462o838j4843K3338L671l7229J9953L2248k3185j9098
$$ plain form
135 -13106 -4748 14751 11260 -15153 -2684 13409 -2230 -1588 -781 -5314 1274 -4508 -806 4684
149 4684 -13569 -6847 9432 -508 -6689 -5095 3084 5381 -9623 -153 9556 -4927 4455 9934
163 9934 -5812 -777 5557 3042 3405 -1140 3750 3395 -5303 3070 853 -6295 3415 -1358 -4527
178 -4527 1674 -6943 -3377 3024 -4990 -2000 -1054 -4319 1275 303 2194 606 -6713 7269 8184 -8766
194 -8766 589 9403 3629 2304 -3071 792 5338 -523 2707 -589 -5251 5459 309 -7699 -1339
209 -1339 -2862 1141 1626 -9046 -2803 1846 -2919 590 -2531 -1903 3049 -1432 3176 1804 -5419
224 -5419 7446 7680 -5160 -15 3832 4489 3087 -3395 3673 3094 -5007 2905 -35 -5527 3044
239 3044 -1002 -3132 -1643 -6178 1351 765 -7135 538 238 -2300 499 -3575 3686 4393 -5706 4859
$$ packed form
135a3106Q358J9499l491k6413J2469J6093j5639O42Q07m533O588n782L702N490
149D684j8253O722J6279r940o181J594Q179K297j5004R470R709j4483R382N479
163I934j5746N035O334k515L63m545M890l55q698Q373k217p148R710m773l169
178d527O201q617L566O401q014K990R46l265N594r72J891j588p319J3982R15j6950
194h766R355Q814n774j325n375L863M546n861L230l296m662J0710n150q008O360
209a339j523M003M85j0672O243M649m765L509l121O28M952m481M608j372p223
224e419J2865K34j2840N145L847O57j402o482P068n79q101P912k940n492Q571
239C044m046k130J489m535P529n86p900P673l00k538K799m074P261P07j0099J0565
$$ plain form
255 4859 5347 -4380 3452 4406 1726 2315 -1599 4443 1723 -5163 5350 1415 -5144 2295 -2398 -2889
271 -2889 321 -5695 883 476 -6720 409 -887 -3237 1211 -2843 2167 2038 -5662 5344 3955
286 3955 -4850 4548 3880 125 2180 -1265 5014 2849 -4457 4849 1010 -4468 2889 -2739 -1630
301 -1630 2046 -4709 375 -1254 -6660 1813 -1234 -3722 1354 -2934 2018 1213 -6038 4772 3154
316 3154 -3860 4286 1503 331 3997 -527 3862 1781 -2815 5584 -105 -3637 4446 -1304 -1028
331 -1028 1313 -5843 686 -223 -5215 1385 -2348 -2596 1169 -4356 271 937 -4171 4064 1294 -3732
347 -3732 4729 1353 112 3192 -621 3661 1760 -2203 4948 200 -1211 4249 -3104 -1056 1824
362 1824 -4117 478 -392 -4246 1444 -2279 -2863 210 -4165 902 572 -4115 2656 136 -2805 4084
$$ packed form
255D859M88r727P832R54k680N89l914O042k720o886J0513l935o559P439m693m91
271b889L210o016O578m07p196P129j296k350M448m054N010j29p700J1006j389
286C955q805R398o68l755K055l445O279k165p306R306l839n478P357n628J109
301a630L676o755N084j629n406Q473l047k488N076m288M952q05p251J0810j618
316C154p014Q146k783j172L666m524M389k081m596Q399n689l532Q083n750K76
331a028K341p156O529r09m992O600l733k48L765n525M627O66n108Q235k770n026
347c732Q461l376j241L080l813M282j901l963P151m748j411N460p353K048K880
362A824n941M595q70l854N690l723n84L073m375N067l30m687O771k520k941O889
$$ plain form
378 4084 -632 -133 3805 123 3333 1636 -934 4775 712 -777 3076 -2638 756 3092 -3291
393 -3291 139 -506 -3042 1081 -3032 -3116 633 -2950 510 -734 -4720 2238 649 -1799 2334 -1426
409 -1426 426 4110 -466 1257 1587 803 4450 -122 -823 3265 -581 1437 2344 -4142 -119 894
425 894 -2217 -10 -3353 -2256 1558 -2297 -1880 -1841 -3022 2484 -337 -3368 1611 -319 695 3311
441 3311 -1283 839 2634 1261 3503 -546 -1091 4390 1536 410 140 -3138 2275 2179 -3807 -1314
457 -1314 -1434 -431 1199 -3859 -2398 28 -1811 1266 -1516 -4163 1650 1178 132 1095 -2404 1905
473 1905 4404 -346 574 398 1649 4605 -1160 -986 2704 -582 1344 1125 -3170 77 -95 -1016 775
490 775 -4579 -2529 1288 -1788 -720 -2735 -3065 3973 -206 -2924 1599 -647 1545 3073 -1064 1365
$$ packed form
378D084m716M99L938l682L210j697k570N709m063j489L853n714L394K336o383
393c291L430o45k536M123m113q4L749l583L460j244l986O958j589k448M133l760
409a426J852L684m576J723L30p84L647m572p01M088l846K018R07o486M023J013
425H94l111K207l343J097L814l855M17L9j181N506k821l031M979j930J014K616
441C311m594K122J795j373K242m049n45N481k854j126k70l278N413r6n986K493
457a314j20J003J630n058J461K426j839L077k782k647N813m72j046R63l499M309
473A905K499m750R20j76J251K956n765J74L690l286J926k19m295L247j72r21J791
490G75n354K050L817l076J068k015l30P038m179k718M523k246K192J528m137K429
$$ plain form
506 1365 496 1402 5371 -1402 -1682 3681 1080 2160 -543 -4683 2844 2442 -2920 -1620 -3279 226
522 226 2079 -4323 -1978 -955 -1376 2853 -2340 -3873 2260 -112 2172 1654 -3595 2533 3572 635
538 635 1269 -2305 2261 5967 -2170 -566 1452 -647 2978 -1371 -3190 1221 -2199 -31 857 -4726
554 -4726 -1135 253 -1300 1103 -4514 -2414 4354 -1371 -854 511 -1526 3270 1299 -1163 2806
569 2806 -420 1978 4197 -2142 751 1627 -504 3579 -1458 -3509 2148 -303 -183 -1504 -4865 1696
585 1696 390 -3656 -436 -2805 -137 3216 -3626 -1434 1409 -437 2581 188 -1095 2747 310
600 310 2628 2250 -3334 3190 3594 -1546 1461 -459 -323 2732 -2561 -1500 273 -1951 960 -1778
616 -1778 -2624 978 -2629 -628 1856 -3956 -214 2312 -1886 1031 216 -75 2306 -564 1683 2441
$$ packed form
506A365q69R06L969o773k80N363k601J080k703m140P527m02n362J300j659L505
522B26J853o402K345J023m21M229n193j533O133k372K284n18n249O128J039k937
538F35O34l574M566L706q137J604K018k099L625m349j819M411l420K168Q88n583
554d726L591J388j553K403n617K100O768n725N17J365k037M796j971k462L969
569B806l226K398K219o339K893Q76k131M083n037k051N657k451J20j321l361O561
585A696j306m046L220k369K668L353o842K192K843j846L018k393j283L842k437
600C10K318l78n584O524M04n140L007j920J36L055n293J061J773k224K911k738
616a778q46L602l607K001K484n812L742K526m198K917q15k91K381k870K247P58
$$ plain form
632 2441 -910 3084 1444 -1114 2950 -498 -1115 2790 -1041 -753 -173 -1796 977 -1437 -2753 451
648 451 -2285 -544 596 -3908 106 1487 -2221 580 60 -481 2168 66 1434 1362 -801 3413
664 3413 1431 -1684 2479 959 78 2129 -1875 -195 788 -1586 -11 -1906 -2049 1093 -2292 -1568
680 -1568 489 -2792 17 1088 -2836 203 534 -334 1488 -786 955 1575 -654 2373 1567 -1020
696 -1020 2977 852 -569 1812 -784 -117 996 -1203 182 -790 -1660 775 -2018 -1699 391 -2711
712 -2711 -467 339 -2699 309 480 -1021 1194 -251 214 1702 -224 1999 1109 -523 2828 709
728 709 -635 2506 -70 155 1571 -1246 -97 -161 -1465 483 -1958 -1426 548 -2767 -718 313
744 313 -2793 491 38 -1941 1196 -261 -61 1624 -872 1406 1853 -657 2270 420 -197 2949
$$ packed form
632B441l351L994j640k558M064l448o17L905l831K88N80j623K773k414j316L204
648D51k736J741J140m504M014J381l708K801n20n41K649k102J368p2k163M214
664C413j982l115M163j520q81K051m004J680R83k374J575j895j43L142l385P24
680a568K057l281K809J071l924L039L31q68J822k274J741O20k229L027q06k587
696a020L997k125j421K381k596O67J113k199J385r72q70K435k793L19K090l102
712b711K244Q06l038L008J71j501K215j445M65J488j926K223q90j632L351k119
728G09j344L141k576K25J416k817J149o4j304J948k441N32J974l315K049J031
744C13l106L284m53j979L137j457K00J685k496K278M47k510K927j850o17L146
$$ plain form
760 2949 -207 -133 1734 -1210 927 294 -1939 988 -1308 -1736 585 -2752 -853 385 -2832 -130
776 -130 -285 -2110 1140 -754 -662 1459 -1209 1383 1468 -873 2651 1000 -312 3071 -11 436 2195
793 2195 -1131 767 525 -1469 1579 -1721 -1173 1370 -2539 -670 13 -3393 438 -306 -2276 1382
809 1382 -917 -798 1390 -1543 1443 981 -1232 2751 386 -391 3152 -370 637 2309 -1215 1547
825 1547 625 -1403 1843 -1315 -1078 1150 -2612 -502 -26 -3179 657 -1051 -2438 1081 -1507 -745
841 -745 965 -1810 995 930 -977 2723 -62 -1 3073 -642 477 2192 -754 1866 737 -1069
857 -1069 2184 -1005 -577 1277 -2480 24 96 -2797 532 -1412 -2056 1167 -1789 -938 800 -1568
873 -1568 1383 207 -1202 2572 -157 31 2489 -750 1166 2382 -353 1697 566 -153 2038 -991
$$ packed form
760B949l156P4J867k944K137o33k233K927k296m28K321l337J899J238l217K702
776a30j55j825L250j894R2K121k668K592Q5k341L524j651j312L383l082M47J759
793B195l326J898k42j994L048l300N48K543l909J869O83l406L831p44j970L658
809A382k299J19K188k933K986m62k213L983k365p77L543l522J007J672l524K762
825A547r22k028L246l158K37K228l762K110M76l153L836j708j387L519k588P62
841g45J710k775K805o5j907L700k785O1L074l715J119J715k946K620j129j806
857a069L253l189M28J854l757K504P2k893L329j944o44L223k956Q51J738k368
873a568K951j176j409L774k729J88K458l239J916J216k735K050j131p19K191l029
$$ plain form
889 -991 -508 1223 -1821 777 13 -2793 434 -1225 -1614 818 -2269 -1021 726 -1358 378 -135
905 -135 -1108 2201 -351 -390 2183 -625 1262 1904 -513 1294 784 -61 2052 -849 -613 1403 -1205
922 -1205 421 -430 -2229 841 -583 -1987 89 -1779 -668 476 -1855 -360 -230 -761 1652 -826
938 -826 -330 2073 -301 1361 1665 -777 1291 1619 282 1126 -747 594 1809 -1308 13 441 -1697
955 -1697 569 -1052 -1799 199 -1718 -842 935 -2296 -1018 166 -767 669 -1445 21 2298 -803
971 -803 38 1513 -263 1624 1096 -139 1583 -129 308 2067 -979 0 565 -917 867 -1076 -1938
988 -1938 947 -851 -1304 18 -1968 102 227 -1643 757 -325 -384 1649 -916 80 1632 -802
1004 -802 1713 1626 -661 1398 971 892 1359 -1540 870 1759 -1855 157 61 -1163 527 -1484 -1063 784
$$ packed form
889i91M83J731l044K598p64k806L227j659l89K432l087J248J747k084J736n13
905a35r73L309k552l9K573k808J887O42k417J807n10q45K113k901K36K016k608
922a205J626q51j799L070j424j404K076j868J111J144k331J495J30n31K413k478
938h26M96K403k374J662L04k442K068L28j337Q44j873J341J215l117J321M28k138
955a697K266j621p47J998j917Q76J777l231J278J184r33J436k114J466K277l101
971h03Q41J475j776J887n28j235J722j712M37J759l046R79N65j482J784j943q62
988a938K885j798m53J322j986K070J25j870K400j082n9K033k565R96J552k434
1004h02K515q7k287K059m27p9M67k899K410Q89l614K012r6j224J690k011M21J847
$$ plain form
1022 784 -2145 -506 388 -1607 -100 -719 -186 1906 -1783 -122 2403 -552 226 1146 -139 1802
1038 1802 313 495 2187 -1347 673 1842 -1444 563 -287 -1087 1009 -1213 -1542 575 -1586 -110
1054 -110 -265 -2197 850 -669 -1430 912 -1179 323 1520 -1235 1153 982 -718 1826 591 311
1070 311 1373 -938 1605 1238 -2122 1259 741 -1186 881 -1370 -638 531 -2287 76 35 -2520
1086 -2520 216 -506 -770 871 -1942 662 1747 -1697 651 1159 -469 1463 -226 784 1806 -679
1102 -679 1218 1021 -1474 1573 318 -923 841 -1481 -331 469 -1703 -48 -238 -1618 834 -1701
1118 -1701 -1232 891 -1652 291 620 -1936 1220 877 -900 1256 192 748 1245 -317 1655 901
1134 901 -826 2219 402 -1109 1410 -513 62 490 -1669 341 -430 -1797 353 -1057 -1218 72
$$ packed form
1022G84k929J639Q94j995J507o19N33K092l689J661K525k955P78R20j285J941
1038A802j489J82J692l534K020J169l286K007q50q00K096k222l29K117k161J476
1054a10j55j932L047j519p61K342k091J502J197k755K388j71j700K544j235k80
1070C11J062k311K543l67l360L381n18j927K067k251P32J169k818K363m1k555
1086b520K736p22k64J641k813K604J085l444K348N08j628J932j689J010J022k485
1102f79J897j97k495L047j255j241J764k322J150Q00k172J655j90j380K452k535
1118a701M69K123k543J943L29k556L156l43j777K156j064N56M97j562J972p54
1134I01j727L045j817j511K519j923N75M28k159K010p71j367K150j410j61J290
$$ plain form
1150 72 -1404 363 335 -2048 1332 703 -1082 1276 295 613 1109 7 1474 737 -454 1860 22
1167 22 -640 1263 -368 91 519 -1547 270 -170 -1539 118 -840 -849 157 -1535 153 -411 -1551 1405
1185 1405 -68 -1135 1150 205 153 956 -86 1037 855 -157 1820 357 -43 1245 -457 -118 737
1202 737 -845 314 -19 -1338 296 -812 -1278 -124 -1235 -450 -96 -1342 688 20 -1056 1113
1218 1113 -94 -269 952 226 920 438 -18 1586 58 -121 1444 17 76 926 -517 230 155 -1221
1236 -1221 496 -481 -931 -28 -1213 -657 34 -1349 344 -197 -1415 802 -82 -764 1067 277 674
1253 674 644 -296 1395 600 -128 1534 59 -100 1037 -715 203 279 -1038 561 -329 -1399 198 -911
1271 -911 -684 106 -1528 140 -352 -1452 950 -435 -1020 1009 -87 302 1120 -366 1250 381 -297
$$ packed form
1150G2j476J767k8k383L380o29j785K358r81L18M96j102J467p37j191K314j838
1167B2o62J903j631M59M28k066J817m40j369J657r58rJ006j692J688n64j140K956
1185A405j473j067K285r45n2Q03j042J123j82j012J977j463m00J288j702L39Q55
1202G37j582J159l33j319J634j108m66J154j111P85L54j246K030o68j076K169
1218A113j207j75J221p26O94m82m56J604j528j79J565j427N9Q50j443P47p5j376
1236a221J717r77m50R03j185N56O91j383J693n41j218K217q84o82J831p90L97
1253F74l0r40J691p95p28J662j475j59J137j752R18P6j317J599q90j070J597j109
1271i11K27P90j634J668m92j100K402j385n85K029j096L89Q18j486J616q69o78
$$ plain form
1288 -297 1931 -231 -258 1374 -267 521 443 -923 952 -466 -1082 571 -943 -788 289 -1612 -12
1305 -12 -170 -1368 933 -386 -705 1273 -609 176 899 -813 1158 507 -172 1656 100 306 1805
1322 1805 -604 605 639 -766 911 -215 -817 343 -873 -423 16 -1585 40 -555 -1447 465 -1286
1339 -1286 -833 1084 -878 163 610 -723 1220 307 70 1877 -130 621 1592 -720 877 552 -650
1356 -650 1137 -422 -684 815 -1336 -442 -42 -1345 450 -739 -1453 252 -896 -784 778 -1229
1372 -1229 240 376 -598 1250 74 -171 1556 -110 647 1207 -360 1243 1002 -525 1140 -137
1388 -137 -478 685 -1118 -139 -186 -1424 41 -794 -1205 485 -1230 -739 553 -1084 153 244 -823
1405 -823 671 27 -128 1502 -295 414 1318 -162 1022 303 -264 1047 -35 -165 759 -647 -151
$$ packed form
1288b97K228k162k7J632j641P88p8j366J875j418o16J653j514J55J077j901J600
1305a2j58j198K301j319l19J978j882P85P23j712J971o51o79J828j556K06J499
1322A805k409J209L4j405J677j126o02J160j216M50M39j601J625n95q92J912j751
1339a286M53J917j962J041M47j333J943r13k37J807k007P51R71k312J597l25j202
1356f50J787j559k62J499k151Q94M00j303J795j189p14J705j148J12J562k007
1372a229J469J36r74J848j176k45J727j666P57N60j567J603k41j527J665j277
1388a37l41J163j803R79m7j238J465q35m11J690j715M91J292j637J237R1j067
1405h23J494o44j55J630j797P09R04j480J184p19n67J311j082j30R24j406M96
$$ plain form
1422 -151 -71 -985 288 -520 -1051 333 -941 -786 -92 -1227 35 98 -824 595 71 -73 837 -173
1440 -173 537 775 -156 1006 616 -402 1119 15 156 765 -244 -82 222 -749 206 -407 -769 96
1458 96 -942 -736 41 -1089 -490 108 -877 500 -397 -503 1057 -194 450 1099 122 1073 531 164 1308
1477 1308 56 -495 907 74 -233 299 -545 87 -239 -1047 207 -898 -806 110 -534 -197 -122 -860 338
1496 338 219 -513 325 195 23 802 -76 850 862 37 1007 413 86 1068 -116 -93 751 -695 252 26
1516 26 -473 216 -674 -666 98 -1123 -257 100 -1003 73 -142 -593 618 -366 -151 856 -366 524 506
1535 506 -57 886 86 -180 1411 -31 29 987 -472 374 -12 -837 528 -486 -409 284 -1246 -390 -57
1554 -57 -1027 171 -304 -754 391 -370 -343 683 -341 724 657 -579 1143 168 -48 1351 -115 387
$$ packed form
1422a51Q0r14J273q08n31J384j274J55O94j135J262O3r22J419n24j44R10j010
1440a73P10K38r31J162l90j018J521j104J41O09j009J62L04r71R55o13l62Q65
1458I6j038K06P77j130N99N98r85J377q97j06J560j251O44O49r77R51n42l67J144
1477A308j252n51J402q33l07N32q44O32l26q08J254j105R2R16o44L37P5p38J198
1496C38j19p32Q38j30j72P79q78R26J2q25R70n94l27R82j184K3Q44j446R47k26
1516B6m99O89q90QP64j221Q66L57j103J076k15m51J211r84K15J007j222Q90j8
1535E06n63R43q00k66J591j442O0R58j459Q46l86q25J365j014P7O93j530Q56L33
1554e7r70J198m75m50J145p61K7J026j024J065o7j236J722r75k16J399j466N02
$$ plain form
1572 387 833 -714 306 399 -629 237 -650 -744 309 -1427 -530 21 -1253 30 -290 -1062 492 -492
1590 -492 -234 545 -688 447 637 -218 1095 200 185 1134 -73 271 872 -195 479 526 -384 674 -601
1609 -601 -372 654 -1275 -155 0 -1348 53 -559 -748 399 -477 -214 519 -782 501 328 -623
1626 -623 1082 -207 297 1245 -322 433 948 -106 994 -135 -167 941 -503 25 343 -1219 -220
1643 -220 41 -1175 63 -409 -768 97 -963 -226 53 -1037 614 187 -572 1002 -91 243 1005 -437
1661 -437 779 847 -119 686 259 133 834 -393 188 605 -868 34 88 -845 82 -269 -779 126 -691 26
1681 26 45 -1034 294 -261 -412 747 -211 15 948 -47 515 736 -82 516 262 132 799 -416 200
1700 200 227 -893 209 82 -894 214 -281 -873 137 -768 -276 -144 -906 73 -127 -443 678 -172 20
$$ packed form
1572C87M46j547J020R3j028Q66q87r4J053j736Q97N51j274J283l20p72J554r84
1590d92K58P79j233J135J90q55J313q95j5R49j207L44O01j067O74M7r10J058j275
1609f01K29J026j929J120J55j348J401o12j89J147q76K63P33j301J283j73r51
1626f23J705j289N04R48j567P55N15j054J100j129l2J108j444N28L18j562R99
1643b20K61j216J238m72l59Q65j060P37K79j090J651m27p59J574j093L34P62j442
1661d37J216O8r66Q05m27j26P01j227N81M17j473R02N4r33R27l51n10R05q17P17
1681B6J9j079J328n55j51J159r58K26R33r95N62K21q18N98k54j30O67j215O16
1700B00K7j120J102j27r76J108m95n92J010r05M92J32p62R79k00l16J121q50J92
$$ plain form
1719 20 846 -270 648 823 -280 735 367 -138 653 -7 195 555 -529 345 223 -754 193 -264 -730
1738 -730 129 -432 -586 -166 -860 83 -102 -319 430 -203 -157 424 -64 400 434 -13 746 781 119 852 372
1759 372 131 735 -313 231 133 -906 247 -190 -658 124 -819 -599 -61 -735 -83 -63 -725 361 -213
1778 -213 -335 475 36 -4 762 -85 688 652 -213 967 281 97 955 -398 476 391 -926 518 -37 -897
1798 -897 334 -530 -684 -382 -954 -94 -72 -983 315 -169 -468 673 -689 95 612 -240 750 459 50
1817 50 978 260 -148 684 -138 482 430 -559 692 -154 -878 364 -641 -452 284 -971 -49 -296 -765
1836 -765 656 -264 -450 471 -739 297 599 -483 737 451 -48 832 225 110 785 -154 744 384
1854 384 -688 761 32 -552 616 -486 -429 315 -848 73 -62 -945 182 -561 -638 431 -625 86
$$ packed form
1719B0Q26j116R18J75j103J015l68n05P91o60K02L60j084Q74j22r77R47m57m66
1738g30Q59n61j54M20o94R43j85k17P49o33M6N81m88M64L4m47P59L5o62P33m80
1759C72k41O04j048N44r8j039J153m37m68P82r43K20N38o74O52K0o62J086n74
1778b13j22Q10m39m0P66q47P73l6q65J180o86j84Q58j353Q74q5j317J444n55q60
1798h97J231q64j54L02n72Q60K2r11J298m84k99J141j362P84N17q52R90k91m09
1817E0R28p18m08Q32q22O20n2r89J251q46p24J242j005J89P36j255R22k47m69
1836g65J421r20j86R21j210J036L02j082J220k86m99Q80o07j15O75r39Q98l60
1854C84j072J449p29n84J168j102N7P44j163R21j35q83J127p43p7J069j056P11
$$ plain form
1872 86 425 -520 691 -10 -362 1172 -99 34 747 70 832 332 -422 995 -192 -405 690 -271
1890 -271 -380 373 -648 -216 -413 -727 333 -468 -473 217 -653 126 64 -481 273 -210 -180 863 54 300
1910 300 764 -49 521 381 -222 737 -24 -66 658 -384 -53 75 -779 -27 -451 -652 -33 -804 -436 122
1930 122 -795 -105 36 -406 333 -123 -279 692 -115 298 755 -339 605 395 -11 996 54 112 648 -153
1950 -153 -84 208 -519 -2 -8 -450 182 -567 -266 260 -831 -70 -183 -552 430 -143 -233 764 6 329 358
1971 358 -116 799 588 -54 745 16 163 816 -147 -36 241 -300 101 24 -498 -6 -619 -509 118 -695
1991 -695 -162 -105 -710 -63 20 -710 194 -236 -70 741 -151 638 540 -204 574 248 74 579 -224 11 458
2012 458 -366 103 -70 -700 240 -429 -336 -22 -588 -262 -230 -734 -181 -215 -368 518 -241 -3 564 -133 383
$$ packed form
1872H6L39r45J211p01l52J534j271J33P13o77P62n00p54J417j187k13J095r61
1890b71j09P53j021M32j97l14J060q01nO90q70P79o2n45P54m83L0J043q09K46
1910C00M64q13N70j40o03R59p61m2P24j042L31J28q54P52m24k01O19p71L68N58
1930A22r17O90J41m42P39m56j56R71q07M13M57j094R44k10m06J007r42N8N36q01
1950a53O9K92p27N17om42O32p49L01N26j091P61j13l69R82n73r0R97p58L23K9
1971C58m74R15k11o42P99p29J47O53r63J11K77n41M01p7n22M92o13J10O27q13
1991f95N33N7o05O47Q3p30R04m30J66Q11q92P89r8p44P78l26j74N05q03K35M47
2012D58q24M69j73o30R40o69R3L14n66L26L2n04N53l4j53Q86p59K38N67o97N16
$$ plain form
2033 383 560 -223 408 500 -91 571 16 171 591 -162 279 308 -664 448 -102 -441 140 -726 -320 23
2053 23 -768 -186 -221 -900 604 -349 -322 554 -180 306 502 -110 613 285 25 870 -100 50 704 -143 161
2074 161 175 -486 297 -103 -385 -15 -436 -275 80 -1030 -134 -35 -681 276 -495 1 496 -118 239 54
2094 54 -327 588 274 -54 1091 136 30 644 -304 538 196 -424 472 -233 -287 246 -497 35 -79 -847
2114 -847 125 -103 -599 526 -326 -259 320 -214 108 164 -340 684 -18 15 535 -264 201 409 -398 337
2134 337 16 -63 497 -561 -121 59 -642 -129 158 -931 357 -502 -757 183 -758 -505 263 -515 30
2153 30 34 -201 519 98 111 814 -315 234 824 -227 358 285 -183 386 -311 -95 309 -597 -218 15 -738
2174 -738 76 -316 -432 252 -544 -259 212 -387 287 -135 -111 433 -198 -64 541 -167 363 577 -280 500
$$ packed form
2033C83J77p83O31R2n91O62n55J55M20p53M41K9r72J112n50l39N81q66M06L43
2053B3p91N82l5o79J504r53K7Q76p34M86J96o12P23l28k60Q45r70J50O54q47L04
2074A61J4o61P83m00k82L70m21J61L55j110Q96R9o46R57p71M96M95o14L57j85
2094E4l81R15l14l28J145r55j06O14r48Q42l42o20Q96p05n4N33p43N32j14p68
2114h47R72k28m96J125q52O7N79n34L22N6n04J024p02L3N20p99M65K08q07P35
2134C37l21p9N60j058M40J80p01N13K87j089J288q59k55R40r41K53P68p78N45
2153C0Mk35P20m21J3P03j129N49N90j051N85p3m68N69o97K16M04r06L79K33p53
2174g38Q14l92j16O84p96K85M71n99O74m22K4N44o31J34O05p08N30K14q57P80
$$ plain form
2194 500 309 -34 370 -237 15 319 -274 71 -48 -358 -128 -117 -556 -78 -444 -186 -156 -538 20 50 -293
2215 -293 106 -173 -131 633 93 270 420 57 421 404 68 335 104 -74 535 -134 221 124 -315 3 -185
2236 -185 -210 254 -334 -74 -201 -446 -40 201 -385 -22 -33 -293 402 33 -67 623 140 208 491 180 677
2257 677 187 -81 574 192 140 -13 -132 -113 -145 -278 101 -378 -302 126 -506 -314 32 -401 -63 133 -71
2278 -71 328 -51 -28 354 -7 440 241 -244 577 316 212 538 107 75 185 -383 307 10 -352 48 -437
2299 -437 -327 278 -833 -406 120 -662 -47 157 -400 444 -355 -34 441 -211 405 358 52 574 216 49
2319 49 641 -173 209 273 -287 226 115 -220 346 -391 -246 152 -690 -219 250 -556 104 -62 -281 227 -232
2340 -232 124 310 -75 347 303 -95 571 190 -26 558 -31 276 397 -295 243 7 -14 325 -335 -459 223
$$ packed form
2194E00j91l43M04o07K52L04n93L45j19l10K30J1m39M78l66K58L0l82N58L0l43
2215b93L99k79M2P64n40J77J50l63L64j7l36K67k31j78O09o69L55r7m39L18j88
2236a85k5M64n88K60j27k45M06K41n86L63j1k60O95l69j00O90m83O8K83l11M97
2257F77m90k68O55l82n2j53j19J9l2j33L79m79P6M28o32J92L46m33L38J96k04
2278g1L99l79K3L82l61M47j99m85Q21k61j04L26m31l2J10n68O90k97l62M00m85
2299d37J10O05j111M27N26p82O15K04n57Q44p99L21M75o52O16m7l06N22l58j67
2319D9N92q14L82O4n60N13j11l35N66p37J45L98q42M71M69q06O60j66k19N08m59
2340b32L56J86l85M22m4l98O66l81k16N84n89L07J21o92N38k36k1L39o60j24O82
$$ plain form
2361 223 -789 -194 -130 -612 116 -104 -388 115 -416 45 364 -128 453 460 124 481 27 57 699 -100 341
2382 341 277 -390 403 -7 -42 434 -238 -194 236 -586 -246 -15 -676 76 -494 -264 -26 -319 -93 178 -474
2403 -474 208 16 -144 338 34 67 581 158 403 355 -23 513 127 -46 41 -233 -16 50 -535 24 -124
2424 -124 -444 64 -370 -403 120 -396 113 -29 -513 63 53 -49 468 -132 224 494 219 71 225 38 389
2445 389 244 11 262 -43 -7 180 -366 143 -143 -422 129 -291 -351 214 -269 -415 -149 -355 255 -262 -318
2466 -318 534 68 26 579 -38 338 429 58 291 208 2 447 14 290 64 -80 -45 28 -196 68 -162 -311
2488 -311 103 -377 -190 186 -386 -277 -229 -119 202 139 -9 358 287 84 496 -39 293 -20 193 509 -8
2509 -8 14 405 -255 37 68 -65 356 -193 -178 -32 -285 -320 -13 -477 55 95 -145 383 -122 -393 400 -187
$$ packed form
2361B23j012N95O4m82P28k20k84N03n31M61L19m92N81Pl36L57m54L0O42p99M41
2382C41o4o67P93m10l5M76o72M4M30q22L40K31o61P52n70K30K38k93K26K71o52
2403d74O82j92j60M82l04L3N14m23K45m8l78N36l86j73Q7k74K17O6n85N59j48
2424a24l20N08m34l3N23n16N09j42m84N76j0j02N17o00L56K70k75j48J54j87L51
2445C89j45k33K51l05L6J87n46N09k86k79N51m20o0N65m83j46K66k06O10n17n6
2466c18Q52m66m2N53o17L76R1l71K33q3k06M45m33K76k26j44L5P3k24K64k30j49
2488c11M14m80J87L76n72J09M8J10L21o3j48L67p1k03M12n35L32l13K13L16n17
2509hK2L91o60K92L1j33M21n49J5J46k53l5L07m64N32M0k40N28n05k71P93n87
$$ plain form
2531 -187 293 417 63 414 238 -17 252 12 -58 383 38 126 0 -487 -52 120 -481 79 -208 -359 207
2552 207 -410 -231 -92 -362 -71 -60 32 438 -155 322 332 -377 378 120 -14 345 218 2 229 -44 355
2573 355 218 -282 -5 -62 -330 333 -117 -468 245 -717 -62 -312 -606 39 -268 -205 453 -246 120 314 -460
2594 -460 351 265 -126 634 147 203 414 15 418 195 -222 223 -160 -392 284 -400 -178 28 -325 -21 -220
2615 -220 -458 52 -264 -189 258 -225 -157 215 21 370 127 -142 499 117 150 461 -346 266 216 -275 339
2636 339 -143 -161 34 -400 -237 130 -45 64 -218 -691 238 -139 -6 56 -247 186 187 -116 154 2 147
2657 147 596 2 242 336 -291 429 51 -371 457 -29 179 190 -217 -166 -87 -497 48 -538 -569 186 -217 -200
2679 -200 -184 -604 265 -36 -385 190 7 77 429 -260 12 363 54 524 126 -222 449 57 -109 -11 -119
$$ packed form
2531a87M80J24l54L51j76k55K69k40p0M41l45Q8j26m87M35J72o01N60k87j51N66
2552B07o17J79J39k70K91J1R2M06n93M77J0p09P55k58j34L59j27k16K27k73L99
2573C55j37n00K77n7k68O63m50l51P13r62O55k50k94O45l07O3O58o99L66J94p74
2594d60Q11q6l91P60m87N6K11l99M03k23m17M45l83k32O76o84K22K06l53L04j99
2615b20k38N10l16P5M47m83O8L72j94L49k43k69O41l82L3L11q07O12n0m91O14
2636C39m82j8J95m34J63L67j75J09k82m73R29l77J33O2l03M33Jl03K70j52J45
2657A47M49n94K40R4o27P20l78m22Q28m86K08J1m07N1P9m10N45n86l1P55m03J7
2679b00J6m20Q69l01l49N75j83P0L52o89K72L51l09M70l98l48O71l92j66R8j08
$$ plain form
2700 -119 67 -212 -85 228 243 -240 86 -511 -121 61 -269 82 -150 -368 251 -222 -31 118 147 243 326
2721 326 30 488 189 126 578 164 -77 244 189 -88 -33 -99 96 -116 -403 -206 -214 -355 39 -258 13 -104
2743 -104 -307 83 -36 -18 251 -122 34 365 -61 158 142 22 394 -74 -72 202 134 275 -77 -155 -73 -1 -66
2766 -66 122 -250 -271 30 -171 -400 20 -213 20 -229 -153 13 -13 -49 82 -36 262 -243 -21 150 193 51
2788 51 288 -31 -168 249 -223 -14 84 -77 59 -266 -237 -33 -471 -241 85 -148 160 -2 -180 179 -17
2809 -17 -61 178 116 315 525 31 179 54 58 409 83 -240 160 -177 209 45 -374 278 -32 -353 -14 -345
2831 -345 -382 114 -402 -43 -271 -311 -68 -132 -153 287 -562 51 329 -352 285 56 9 247 -128 114 342 -362
2853 -362 222 192 -83 291 -427 -214 134 -111 119 279 -384 283 -36 -179 -92 -451 -86 138 -108 129 333
$$ packed form
2700a19J86k79J27L13J5m83L26n97L90J82l30L51k32k18O19m73J91J49K9R6Q3
2721C26k96M58k99o3M52m14k41L21n5k77N5o6J95k12k87J97qj41L94k97K71j17
2743a04k03L90j19J8K69l73J56L31m26K19j6j20L72m68KK74o8J41l52p8Q2P2o5
2766f6J88l72k1L01k01k29M20k33K33k49P6J66k6l6J31j18K98n05K22J71M3j42
2788E1K37l19j37M17m72K09R8j61J36l25K9K04m38K30L26k33L08j62j78L59j96
2809a7m4K39o2J99K10m94J48j25ML51l26l23M00l37L86j64m19O52l10l21L39l31
2831c45l7M96n16L59k28m0K43o4k1M40q49O13K78o81O37k29m7K38l75K42K28p04
2853c62N84l0k75L74p18K13L48k45K30J60o63O67l19j43Q7l59L65K24k46K37K04
$$ plain form
2874 333 -159 432 61 298 356 8 199 199 -254 356 97 -392 56 -311 -192 168 -242 -149 79 -454 -96
2895 -96 -114 -241 40 -285 -54 70 -376 77 23 -372 91 90 226 253 -25 465 260 -144 326 -58 -285 158
2917 158 -65 -118 128 -218 -22 -291 -326 29 -293 -443 -5 -296 -309 -82 -436 -42 -135 -93 400 45 52 422
2939 422 -414 353 293 -146 391 222 -185 125 -120 -32 67 -209 -64 -234 -612 78 -125 -302 27 -182 -374
2960 -374 108 -393 195 304 -254 374 193 2 402 -33 393 236 119 296 -9 -43 204 88 51 -13 -35
2981 -35 -71 -263 -487 -276 -117 -326 -19 -180 -265 176 -254 -7 -37 -181 54 59 -45 297 -191 174 189 188 217
3004 217 139 28 212 -53 45 390 -160 103 -45 -191 42 -10 -40 120 -22 -170 -118 -312 -100 -222 -30 29
3026 29 -41 116 211 100 129 289 54 52 595 95 322 273 173 164 210 224 197 -319 -18 234 -394 9 -450 -228
$$ packed form
2874C33m92N91l71K37N8l48J91%m53O10k59m89M48l67J19L60m10R3K28n33L58
2895i6j8j27K81l25K31J24m46M53n4l95M63jJ36K7k78M90k05m04M70l84k27M43
2917A58k23n3K46l46J96k69l5L55l22j50M38k91j3K27l54L94r3M2M93l55PL70
2939D22q36P67o0m39N37j69m07L10k45Q8R9k76J45j70l78O90k03j77L29k09j92
2960c74M82n01N88J09n58O28j81j91M00m35M26j57j17J77l05l4K47j16l7o4k2
2981c5l6j92k24K11J59k09L07j61q5M41m30K47l0j44K35Nj04L42m88L65J5jK9
3004B17p8j11J84k65R8L45n50K63j48j46K33n2l0J60j42j48N2j94K12j22J92N9
3026B9p0J57R5j11K9J60k35kN43n00K27m9j00rM6J4k7n16L01K52o28M03m59K22
$$ plain form
3050 -228 48 -176 -205 -243 -107 232 -47 -196 -4 -143 90 169 -94 291 355 189 438 5 -167 378 266
3071 266 -44 138 -288 -123 -211 -102 -96 -170 29 97 -164 -322 -7 -316 -167 -66 -158 285 -71 132 383 -198
3093 -198 110 464 -121 79 152 237 355 -189 148 441 -319 279 100 -9 159 -312 -275 -82 -437 -242 -257
3114 -257 -323 51 -352 -226 190 -123 172 202 -16 118 -217 -34 542 -53 -15 441 -191 248 184 -190 67
3135 67 -38 -75 291 -334 -428 -18 -304 26 -114 -183 -56 -118 -375 213 -60 -22 179 -280 191 71 -171 527
3157 527 164 13 580 -9 37 65 -57 15 39 -64 296 -66 -33 -167 -292 112 -249 -430 -149 -168 -406 4
3179 4 -90 76 178 -95 -201 -80 -11 131 30 178 313 29 210 98 -142 245 -92 -54 -184 -168 51 -75
3201 -75 -355 156 -277 -356 -131 -197 -66 7 -166 -1 -242 -420 16 28 144 282 6 191 504 69 121 249
$$ packed form
3050b28K76k24k9l8J36L39k79j49J92j39K33P9k63L85O4j66K49m33j72N45j12
3071B66l10J82m26J65q8J09Op4J99O8k61j58L15l09J49J01r2M43l56K03K51n81
3093a98L08L54n85K00P3Q5J18n44L37K93p60N98j79j09J68m71L7J93l55J95j5
3114b57o6L74m03J26M16l13K95L0k18J34l35J83N76n95L8M56o32M39o4l74K57
3135F7j05l7L66o25r4M10k86L30j40o9J27o2k57N88k73L8K01m59M71j20k42O98
3157E27l63j51N67n89M6K8j22P2K4j03L60l62L3j34j25M04l61j81K81j9k38M10
3179Dr4J66J02k73j06J21O9J42j01J48J35k84J81j12k40L87l37L8j30J6K19j26
3201g5k80N11m33p9K25o6J31P3j73J65k41j78M36J2J16J38k76J85L13m35N2J28
$$ plain form
3223 249 -55 316 24 -344 188 -69 -87 84 -11 -101 -23 -186 20 -108 -156 116 -124 -78 -30 42 -31 -2 -152
3246 -152 49 27 105 360 44 247 322 43 295 26 66 69 164 190 -67 -207 41 -115 -255 -196 -94 -310 4
3269 4 -26 -260 -7 -365 -54 9 89 -25 17 45 36 -59 192 2 -64 242 52 -20 165 -55 315 -19 -116 -335
3293 -335 -160 -59 -87 -102 -162 108 -310 -345 -240 54 304 -16 -303 145 150 -33 129 -118 245 176 -175 113
3315 113 -102 -40 182 341 182 62 122 -251 16 -127 -130 -185 -235 175 -189 -389 47 -313 41 30 -336 236
3337 236 38 -31 82 12 69 338 -165 239 270 138 78 152 -142 325 -202 -34 314 -362 272 -23 -159 241
3359 241 -22 -105 -38 -439 170 89 -117 11 -194 -90 158 -87 8 160 -135 28 102 82 308 50 56 232 37
3382 37 -51 127 -87 -77 -56 -176 106 89 -126 265 -272 -79 -236 -451 -113 -170 -119 131 -151 96 -4 -1 343
$$ packed form
3223B49l04L71k92l68N32k57j8J71r5r0P8j63K06j28m8K72k40M6M8P2p3K9j50
3246a52K01k2P8K55l16K03P5k79K52k69M0LR5K6k57j40K48j56j40N9J02k16L14
3269Dl0k34K53l58L11O3Q0j14M2K8rr5K51j90o6L06j90p2J85k20L70l34r7k19
3293c35J75J01k8j5o0K70m18l5J05K94K50l20k87M48Nj83J62k47L63o9l51K88
3315A13k15O2K22J59j59j20O0l73K67j43ln5n0M10l64k00M36l60L54j1l66N72
3337B36j98o9J13p0N7K69n03M04L1j32o0P4k94M67n27J68L48o76O34k95j36M00
3359B41k63q3O7m01O09q1k06J28k05J04K48k45R5J52k95J63P4k0K26k58OJ76j95
3382C7q8J78k14J0K1j20K82j7k15L91n37J93j57k15L38n7N1K50k82K47j00LL44
$$ plain form
3405 343 -145 -107 204 -86 155 129 -118 315 267 -20 131 -65 -141 -94 -330 37 -36 -198 53 60 -166 207 -178
3428 -178 -78 123 -115 157 -13 -170 276 373 -191 166 258 187 293 -5 416 103 -201 143 -26 207 153
3449 153 29 219 -34 -62 -19 -124 -89 101 -38 -150 11 -198 59 -36 -140 205 -170 -110 302 197 69 205
3471 205 0 110 55 107 154 183 -1 309 -269 -132 -86 -69 91 -213 -38 -200 -150 -136 125 -184 25 -80 -196
3494 -196 27 106 116 222 32 143 96 -14 331 272 279 122 -139 -20 247 -207 -244 -47 -28 -114 -47 -184 19
3517 19 69 -114 -195 -40 -36 -6 -42 48 -139 62 41 111 -17 22 99 161 390 -70 169 66 -64 18 15 75 143 -50
3543 -50 -146 55 -106 -166 -193 -237 -4 -167 -149 212 -154 -119 -16 -72 382 65 -82 139 168 -17 39 -249 -75
3566 -75 210 -33 26 104 112 103 -2 312 232 -137 102 -150 -396 90 -201 66 73 -90 205 -13 -99 71 52 -87
$$ packed form
3405C43m88L8L11k90K41k6k47M33m8k87J51j96p6M7k36L67p3j62K51Pk26L73l85
3428a78J00K01k38K72j70j57M46R7n64L57R2p1J06k98M21l13l04L44j69K33n4
3449A53j24J90k53k8M3j05L5J90j39j12J61k09K57r5j04L45l75O0M12j05j28J36
3471B05k05J10n5N2M7K9j84L10n78J37M6J7J60l04J75j62N0J4K61l09K09j05j16
3494a96K23P9J0J06j90J11m7j10L45n9Pj57k61J19K67m54l7J97J9q6O7j37K03
3517A9N0j83q1J55ML0l6R0j87K01k1P0j28L9P7O2K29m60K39j03j30Q2lO0O8j93
3543e0r6K01j61o0k7m4K33j63J8L61l66L5J03n6M54l17j47K21K9j85N6k88J74
3566g5K85k43N9P8Qrj05L14q0l69K39k52k46M86k91K67Pj63K95k18q6J70j9j39
$$ plain form
3590 -87 221 -88 118 202 4 404 160 -74 455 103 122 173 -68 -20 -123 -191 -110 -152 -189 119 -246 -6 78
3613 78 -150 19 -52 201 82 -91 -45 36 8 -59 55 15 225 -7 -23 330 150 -103 -83 -303 -64 -83 -167 -9
3637 -9 -13 -103 18 -441 -191 -77 -222 -17 207 -273 107 -21 -183 136 48 55 -21 -7 165 49 218 141 -55 203
3661 203 -20 -161 151 -87 45 -104 59 -216 103 -152 -156 46 -292 -21 -129 -38 196 -59 80 -7 -50 190
3683 190 141 -170 336 -18 -87 149 -338 -8 270 -35 507 158 -263 94 -47 -57 92 -43 -9 93 -173
3704 -173 -36 -309 -107 -78 -373 130 -2 -195 -193 -22 193 106 34 85 173 -57 -95 117 -177 158 -84 108 317
3727 317 -223 -185 129 -93 -225 37 -219 -7 -9 -98 -30 -50 12 -95 38 -59 145 -74 141 -38 -190 40 -117
3750 -117 146 -256 -264 8 -194 -99 355 -180 -97 142 -76 99 137 -28 119 144 -159 -70 -103 -52 -12 3 -162 -41
$$ packed form
3590h7L08l09K06Q4j98M00k44k34N29l52J9N1k41M8j03o8Q1m2l7L08l65K40Q4
3613G8k28J69p1K53j19j73M6Q1k8o7J14m0K10k32j6L53j80k53K0k20K39j9q4J58
3637imr0J21m59K50J14j45K05K24m80L80j28j62L19q8Pp6J4J72j16J69p7j96K58
3661B03k23j41L12k38J32j49J63k75L19k55mK02l38K71j08R1K34k55J39q7m3K40
3683A90m9l11N06l54o9K36m87L30K78l05N42l49m21L57j41j0J49j35L4J02k66
3704a73J37k73K02K9k95N03j32j93KJ71K15q7p2N1Q8k30l8K12k94L35k42J92K09
3727C17n40L8L14k22j32K62k56K12kq9O8k0O2j07J33r7K04k19K15j79j52K30j57
3750a17K63m02qK72k02R5M54n35Q3K39k18J75L8j65J47K5l03Q9l3N1M0J5j65J21
$$ plain form
3774 -41 15 -62 -100 -161 -55 6 139 385 251 101 134 -118 63 -149 101 -81 -181 8 56 -272 33 -67 -246
3797 -246 64 -192 26 -193 -138 -124 70 -188 4 -105 -50 -30 -185 -112 -16 104 125 65 -57 123 1 -50 164
3820 164 -170 66 79 -70 -256 -87 -70 -13 -42 96 28 -289 -128 -50 3 -23 155 -167 309 18 110 114 -137 -52
3844 -52 141 -99 348 112 168 136 -18 -305 -138 -159 -100 27 -142 -172 -93 -191 -116 -199 -227 -196 -65 115 -432 -242
3868 -242 93 108 -36 262 15 279 112 101 171 524 -144 154 136 283 236 -74 -65 -305 -190 -95 -236 -212 -55
3891 -55 -135 -179 10 -6 40 148 -29 260 -188 -48 196 -91 -72 210 -243 273 305 102 2 -70 177 39 -77
3914 -77 114 -3 -52 -103 -63 -124 -29 -232 65 59 -264 182 -206 -144 160 -147 -99 136 -232 66 112 -12 109 -304
3938 -304 102 109 14 0 114 -98 67 154 -8 6 -329 54 194 -31 -164 -170 -165 29 11 -106 -123 -94 23 201
$$ packed form
3774d1N6p7l8o1J06O1J33K46j34j50L3k52J81k12K50j82j00J89M8l28L05j00j79
3797b46L10k56K18k19N5J4J94k58J92j09N5K0j55P3R6J20K1o0j22J80j22n1K14
3820A64l34K36J3j49j86J69J7N7k9J38o8l17J61P8N3k6J78l22M76k91R2Mk51Q5
3844e2J93k40M47k36N6l2j54k87J67k1N9J27j69l0P9r8P5q3k8L1J31J80n47J90
3868b42L35J5j44K98k47K64j67j1P0L53o68K98j8J47m7l10Rk40J15R5j41K4J57
3891e5q0m4J89j6M6J08j77K89m48J40K44k87J9K82m53N16L2k03j00p2K47j38j16
3914g7J91j17m9n1M0o1R5k03K97ol23M46l88O2L04l07M8K35l68K98M6j24J21m13
3938c04M06Pr5j4J14k12J65Q7j62J4l35L83J40k25j33oNJ94j8j17j7K9J17J78
$$ plain form
3962 201 133 50 43 140 150 121 58 54 35 336 211 -59 -117 -349 188 -72 -88 46 -103 -209 -341 -318 -245 25 -308
3987 -308 170 -126 -110 -114 19 272 -4 -87 -149 310 -80 47 285 38 -12 -43 -253 5 -117 84 39 -112 57
4010 57 148 -169 38 -169 -144 -221 -113 -206 73 178 -12 77 -74 26 186 186 41 93 -97 203 51 -4 132
4033 132 0 293 61 -26 57 56 64 4 -32 14 -70 -362 225 -140 -422 -238 -15 8 -182 35 20 -185 101 201
4057 201 178 -117 117 184 -70 183 -20 -17 -66 -227 -5 -60 73 -47 -133 -65 -187 -154 -262 115 -264 65 160
4080 160 -269 150 -269 -2 -258 2 52 166 63 201 -126 -41 -58 7 -155 116 -58 -9 199 137 143 -98 -137
4103 -137 -86 -15 102 -250 -167 133 -301 -124 -59 -240 72 303 -46 -170 35 -3 -227 -57 49 196 -64 -125
4125 -125 29 -153 -97 93 101 347 -62 52 168 29 95 -151 -164 -78 31 -289 -76 -166 -116 -198 -207 168 52 73
$$ packed form
3962B01o8q3pR7J0k9o3mj9L01j25k70n8k32N37k60j6J34j49j06j32K3P3K70l33
3987c08M78k96J6mJ33K53k76q3o2M59l90J27K38k47n0l1k10K58j22K01m5j51J69
4010E7R1l17K07k07K5p7J08r3K79J05j90Q9j51J00J60%j45N2j90L00j52n5J36
4033A32j32K93k32q7Q3jQo0l6M6q4k92N87l65k82J84K23K3j90K17j5k05K86J00
4057B01k3k95K34O7k54K53k03Lm9j61K22n5J33j20q6O8j22L3j08L77l79L29R5
4080A60m29M19m19K67k56K60N0J14j03J38l27Q5j7O5j62K71j74M9K08o2Ok41l9
4103a37N1P1J17l52Q3L00m34J77O5j81L12K31l49j24K05l8k24J70J06J47k60o1
4125a25J54j82N6J90QK46m09J14J16j39O6k46j3Q6J09l20K13r0N0q2rL75j16K1
$$ plain form
4149 73 321 -8 147 235 146 213 174 -42 -96 60 260 143 -226 -11 22 33 -75 -128 -118 25 -234 123 230
4172 230 -77 197 -108 -146 267 -243 -296 114 -125 -5 36 201 77 120 123 37 175 116 130 -147 104 174 -218
4195 -218 57 66 -194 -101 -75 -3 -41 23 66 -119 -127 -101 -5 -270 134 -283 -39 -58 -46 66 -83 63 187 122 118 115
4221 115 36 71 290 -58 132 184 -13 49 97 7 -265 136 -120 -77 136 31 243 -156 -14 -85 -92 -23 -101 225
4245 225 58 -218 118 45 -50 45 235 36 -177 46 15 85 28 124 -69 12 -244 -222 81 -55 -240 -42 -119
4268 -119 -71 130 92 -37 73 -54 23 -32 137 -212 271 128 162 112 -46 44 122 179 192 20 1 -18 -172 -102
4292 -102 -27 108 197 -95 -20 123 124 -202 -33 -38 -277 155 236 220 165 -4 183 138 145 66 239 27 -99 -23 -68
4317 -68 141 174 146 -87 -37 -49 -163 109 62 -72 -130 -10 80 26 230 134 39 69 109 65 -65 4 -44 217 -55
$$ packed form
4149G3K48l29J55Q8q9O7l9k16n4J56K00j17l69K15L3J1j08n3J0J43k59L57J07
4172B30l07K74l05l8M13n10n3M10k39J20M1J65j24M3Lq6J38n9J4k77K51P0l92
4195b18K75Rk60R3K6P2l8O4M3j85qK6R6k65M04m17K44j9J2J12j49J46J24o5ml
4221A15p9L5K19l48J90N2j97O2M8r0k72M01k56M3K13j05K12l99J42p1pO9p8L26
4245B25j67k76L36p3r5R5J90j99k13K23l1P0n7R6j93Q1k56K2L03j36j85J98p7
4268a19M8K01l8j29J10j27P7n5J69l49M83j43L4n0j58R0P8N7J3j72j9j9j54P0
4292a02P5J35Q9k92P5J43Jl26J69nk39M32Q1j6n5j69J87m5Pp9J73k12j26P6m5
4317f8K09L3k8k33N0j2j14K72m7j34n8J20R0n4K04r6r5L0M0m4j30O9m8K61k72
$$ plain form
4342 -55 -83 119 108 -58 -117 -196 69 52 -197 247 66 -223 7 43 -127 221 14 -146 -187 -106 -105 -181 -40 20
4366 20 -195 -91 4 -80 22 -61 -36 228 211 14 64 40 -98 -116 -161 13 -134 84 -170 -332 -37 38 -268 -92
4390 -92 -170 -29 54 20 129 129 -172 -50 340 -76 130 103 -21 1 55 246 76 -34 -70 110 76 163 3 33
4414 33 33 -85 224 -111 -170 363 -25 -227 96 -215 -62 130 -124 250 -14 -192 15 130 -21 -3 -55 42
4436 42 4 -97 156 109 -82 46 105 -257 167 115 154 -108 -21 -87 -150 -212 -104 45 187 -6 -199 119 -95
4459 -95 -85 -56 190 39 -79 -374 188 39 -107 31 49 -59 -86 158 194 47 -87 254 -143 274 -63 175
4481 175 -168 4 -45 -171 -182 -61 2 149 103 -184 -193 185 178 18 -114 177 -11 24 -26 -68 -64 -139 -37 226 35
4506 35 -83 -10 31 -127 -165 -115 222 -170 -192 -212 27 -146 -1 -43 86 -184 -31 9 35 205 -161 134 142 -96
$$ packed form
4342e5k8K02j1j66n9p9K65j7k49M44j81k89K30L6j70L48k07j60m1Q1Jp6J41O0
4366B0k15J04R5q4J02q3K5K64j7j97N0k4j38j8m5J74j47K18k54j62K95P5l06J76
4390i2p8J41Q3l4J09%l01J22L90m16K06k7j24K2N4J91j70j10l6J80l4Q7j60L0
4414C3%j18L09l35n9N33l88k02L23l11J53J92k54L74k64j78K07J15j51J8n2R7
4436D2l8j01K53m7j91J28N9l62M24n2L9k62Q7o6o3o2J08J49J42j93j93L18k14
4459i5J0K9K46j51j18k95N62j49j46J38J8j08k7K44L6j47j34L41l97M17l37K38
4481A75l43J72m9j26j1J21O3J47m6k87rL78pj60j32K91j88L5n0m2Mp5J02K63j91
4506C5j18P3M1j58l8N0L37l92k2k0K39j73J45m2J29k70J53M0K6J70l66K95Qk38
$$ plain form
4530 -96 3 -97 26 -41 145 58 -135 253 -145 -57 -123 -29 13 29 -164 -99 -143 286 -35 -85 84 -170 182 -250
4554 -250 24 -64 93 -133 154 164 -31 188 43 -25 8 65 -52 1 -126 -19 -46 -63 133 -23 -156 129 -328
4577 -328 -107 105 42 -104 159 -64 150 60 -87 273 157 57 133 158 196 113 56 185 57 204 71 -12 -192
4600 -192 20 130 78 -82 -26 79 -19 145 -74 -6 -209 -61 -60 44 -108 20 120 82 17 -67 17 163 -55
4623 -55 -22 166 -187 337 53 -289 141 151 -61 -10 149 -104 -119 -100 -61 -287 240 45 -213 6 128 -122
4645 -122 49 -92 -182 205 -70 -159 -20 -36 9 16 -66 116 160 66 -47 181 112 58 -59 -135 12 63 85 36 -146
4670 -146 33 -6 -168 -118 -34 11 -195 -132 188 -101 -185 206 105 73 -96 3 51 81 -33 175 20 -37 363 -127
4694 -127 -49 14 116 -326 -62 -181 53 156 -24 -36 14 -103 -158 -120 35 -18 280 -62 367 185 -96 -5 -125
$$ packed form
4530i6R9j00J23o7J86q7j93L88l98Q8o6R4M2J6j93O5m4M29l21n0J69k54L52m32
4554b50K74q8J57k26K87J0j95K19j45o8L3N7j17N3j27J07k7j7J96j56j33K85m57
4577c28K21K12o3j46K63k23K14r0j47L60j16j00P6K5L8q3n7J29j28J47j33q3j80
4600a92K12J10n2j60N6J05r8J64k19O8k03J48JJ04j52J28J00l8o5q4Q4J46k18
4623e5L3J88l53N24k84l42M30J0k12N1J59k53j5J9L9k26N27j95k58K19J22k50
4645a22J71j41r0L87k75q9J39j6M5Pq2J82M4r4j13K28o9n4j17p6J47N1K2m9j82
4670a46J79l9j62N0Q4M5k06O3L20k89q4L91j01l2j69R9M8L0j14K08j55n7M00m90
4694a27P8O3J02m42K64j19K34J03j80j2N0j17n5L8J55n3K98l42M29j82k81R1j20
$$ plain form
4717 -125 122 -50 -62 -84 117 3 -41 129 9 -91 263 137 -107 -76 30 -110 131 -176 -144 -178 -165 -63
4739 -63 -182 -77 -189 -60 36 -140 -57 -33 -64 8 286 221 277 -88 279 43 76 51 38 -77 -159 -55 -127 -118 124
4764 124 41 -135 86 -42 138 -128 -135 -78 -16 58 -54 76 -104 -16 -77 72 -140 187 -116 89 183 59 -17
4787 -17 -174 -250 -104 15 -45 141 -64 46 71 1 11 73 -85 105 106 179 213 -115 -110 -117 -296 -2 50 49 157 121
4813 121 -120 -111 11 116 116 -132 -15 -61 40 -52 -212 -196 -40 -419 13 -13 25 96 157 111 -126 188 -65 -51
4837 -51 -67 147 -155 -45 -78 13 -108 -49 177 86 -37 -129 -41 141 -179 -111 -12 119 -310 -81 130 16 4 -130
4861 -130 -170 35 68 -205 -141 -230 54 -64 74 -210 -24 82 -100 94 65 -311 52 42 29 30 -23 -210 156
4884 156 -255 -129 60 -122 28 -165 -115 60 -89 94 92 -240 231 58 197 87 88 152 36 -176 -97 -79 251
$$ packed form
4717a25K47j72j2k2K01j14m4J70j20j00L54j26k44L1J06j40K41l07L2l4J3J02
4739f3j19J05j12J29R6j76Q3K4l1P2K78o5N6l65L67k36L3k5j3j15q2J04p2RK42
4764A24q3j76K21j28J80k66pN7O2P4j12J30j80Q8o1J49k12L27l03K05R4j24p6
4787a7j57p6J46J19o0J86k05J10K5p0J0O2j58J90JP3L4l28Npj79K94N2jJ08l6
4813A21k41RJ22J05%k48J17m6J01r2j60J6J56l79M32k6L8P1O1m6k37L14k53J4
4837e1j6K14l02J10l3R1j21N9K26r1j23r2Q8J82l20O8R9J31m29K29K11j14j2j34
4861a30m0K05L3k73O4q9K84j18J38k84J86J06j82J94k9l76L63j0j3Jn3j87L66
4884A56m11J26J89j82J50j93N0J75j49J83kl32M71j73J39j10JO4j16k12P9J8L30
$$ plain form
4907 251 -49 -40 145 17 -47 -330 152 196 106 149 -191 -165 -77 -294 12 -138 -104 37 -185 -80 -92 235 -208
4930 -208 158 -162 26 -21 -56 84 71 89 238 -33 -49 -25 -128 -59 -120 -336 -89 -177 -98 -211 -43 -112 92 -18
4954 -18 44 95 -81 -256 -14 -121 -87 -21 160 30 -17 254 71 200 116 148 148 11 -60 -95 -212 -14 -117 -111 8
4979 8 -34 136 92 123 -118 24 -58 -151 -44 94 103 68 36 -195 201 216 234 85 19 -112 36 -23 -53 -28 119 -463
5005 -463 165 -240 -93 -133 108 -102 128 -113 -100 -46 -239 -107 -106 313 160 275 -165 0 25 289 -146 36
5027 36 245 197 -129 124 77 34 -193 17 -31 -312 138 -25 128 37 348 92 148 398 131 -142 -273 -61
5049 -61 -280 -158 -11 58 185 69 13 197 250 29 35 129 -38 50 331 -71 189 59 3 34 63 -49 63 -268
5073 -268 7 205 478 135 -258 112 13 -190 35 -11 -51 -169 65 22 -46 5 -8 -187 -24 -7 118 151 -67
$$ packed form
4907B51l00RJ85j28o4k83M82M4r0M3l40K6Q8k17L06j50L4J41k22J05j2L27m43
4930b08L66l20J88m7l5J40j3J8J49k71j6K4j03O9o1k16K47q8P9j13J68o9K04j10
4954a8O2N1j76j75K42j07L4O6J81j30m7K71j83J29q4L2%j37p1l5j17J98j03OJ19
4979Hm2J70m4L1k41J42q2r3J07J38Rl5l2k31L96J5J8j49o6j31J48n9l0K5J47n82
5005d63O28m05J47m0K41k10K30k41J3N4j93J32JM19j53J15m40J65K5K64m35J82
5027C6K09m8l26K53m7m3k27K10m8k81M50j63J53r1L11k56N6K50k67k73j31K12
5049f1k19J22J47O9J27j16n6J84N3k21OR4j67Q8K81m02K60j30n6L1K9j12J12l31
5073b68K75J98K73l43l93L70r9k03K25m6m0j18K34m3o8N1j3j79J63J7J25L3k18
$$ plain form
5096 -67 38 -162 46 -145 -164 -79 47 -53 -27 110 -200 138 28 288 257 -12 20 -124 -155 -158 -220 214 -90
5119 -90 -263 2 88 114 168 -68 117 62 -209 6 -27 6 91 163 -99 282 28 -156 -216 -37 114 -101 169
5142 169 -18 10 -112 247 43 13 -271 -107 -30 -157 284 151 -325 -197 428 -94 -128 62 -17 -5 -310 -92
5164 -92 -86 61 -11 -123 -33 -131 162 124 105 126 -85 86 -42 29 230 -65 17 -98 196 97 41 152 -188 -61
5188 -61 -118 -1 167 128 -224 -167 -95 -125 136 -136 76 -45 -65 65 -129 144 128 256 -15 53 90 -50 109
5211 109 72 166 35 159 -1 -187 -75 85 58 190 -20 82 136 28 209 -241 -50 -245 24 60 -12 1
5233 1 52 -23 69 -22 115 400 -205 -69 14 -24 229 56 161 -54 65 63 77 -18 -107 -104 -161 -26 -36 -126 -21 154
5259 154 -42 102 -76 -29 -129 -141 -226 60 172 -76 -118 104 69 0 -56 153 96 44 -162 17 80 79 -32 -33 -137
$$ packed form
5096f7J05k00K08j91j9Q5J26j00K6J37l10L38j10K60l1k69L2j44l1lo2M34l04
5119i0j73K65Q6K6N4k36J85n5k71K15l3L3Q5P2k62L81k54j84o0J79J51k15K70
5142A69j87K8j22L59k04l0k84J64P7j27M41j33m76J28O25n22l4J90p9J2l05K18
5164i2OJ47p2j12R0r8K93l8j9K1k11J71j28P1K01k95Q2j15K94r9n6J11l40J27
5188f1n7J17J68l9l52N7P2l0K61k72K12j21k0J30j94K73j6J28k71O8L7j40J59
5211A09l7R4j31J24j60j86J12J60k7J32k10J02N4j08J81m50J91j95K69L6p2J3
5233AN1p5R2r1J37K85o05J36Q3l8K53j73J05k15J19kJ4r5q9Ln7J35j0r0J05J75
5259A54j96J44j78M7j00j2q5K86J12k48m2K22l5o9n6K09n7n2k06J79O3jj11jj04
$$ plain form
5284 -137 54 68 316 140 141 88 -89 -135 39 141 7 190 -120 192 -281 -134 -41 296 -151 -13 -82 -39 223
5307 223 -83 34 -68 110 147 136 -13 217 -195 51 112 83 -27 23 -189 -72 -77 40 176 88 174 -46 -171
5330 -171 -242 -44 -2 326 -35 286 -71 -178 169 -35 192 -190 -68 217 52 -232 44 207 30 155 394
5351 394 108 154 -84 81 -182 64 -104 71 107 131 -164 31 182 41 105 -51 57 -50 49 167 -51 261
5373 261 -213 19 39 -141 37 10 24 -13 203 -78 -237 -100 -153 -110 28 -145 -141 -27 152 8 130 -79 -158
5396 -158 9 -188 71 -132 -150 29 -109 -123 -94 -193 -23 -55 -7 177 53 -183 88 -43 90 184 -79 -46 -17
5419 -17 -124 12 58 -71 16 -100 -97 -68 74 88 -69 -27 -74 -179 -139 -212 54 -1 -16 15 91 134 -89 21 93 -6
5445 -6 -35 -14 85 71 102 115 71 122 63 147 161 -210 -248 7 -123 -69 145 -14 142 210 -42 120 261 -118 -125 135
$$ packed form
5284a37J91J4K48j76Jn3j77m6J74J02j34J83l10L12m73J47R3L37m47J38o9M3K62
5307B23l06J17j02J78L7j1j49K30m12K46O1k9j10N0k12J17nJ17J36q8Q6k20j25
5330a71p1J98M2L28l61L21l57j07L47k04K27l82J22K85j65k84K76J63j77J25K39
5351C94k86M6k38J65k63K46j68J75L6K4k95J95J51j41O4j56J08j07R9J18k18L12
5373B61m74K32K0j80J78k7J4l7K16k81j59J37n3M3J38j73MJ14J79j44J22k09p9
5396a58J67j97K59k03j8J79j38j4K9r9J70l2M8J84j24k36K71j31J33R4k63L3K9
5419a7j07J36M6j29Q7j16LK9J42J4j57M2m7j05M0p3K66n5j5L1P6M3k23J10P2r9
5445fk9K1R9j4L1J3m4N1n9Q4J4l71l8K55j30N4K14j59J56O8k52J62J41l79pK60
$$ plain form
5471 135 5 54 127 25 -113 -87 146 9 -22 -125 -114 -12 21 -184 17 108 232 -46 210 -105 165 150 -132
5494 -132 45 123 232 -16 -115 131 33 281 200 24 48 -43 -133 22 -46 -151 -16 -54 -204 190 -75 135 -195
5517 -195 -151 -47 81 -22 159 129 150 -129 108 34 11 -9 -89 -131 -24 23 45 20 -87 -187 -186 -177 -65 -89 0 -234
5543 -234 119 -32 -38 148 52 -65 -99 207 -54 107 56 157 -78 -44 253 -184 -120 118 -180 -131 -227 137 -131
5566 -131 -227 32 -95 80 -130 5 25 192 -124 77 28 -59 -85 -19 -17 -220 -108 -59 248 12 178 10 -47
5589 -47 283 137 -167 46 -43 -58 -35 132 224 207 123 -75 165 211 98 124 -252 179 98 -93 -84 -286 -202 -61
5613 -61 -15 -20 -83 -17 63 101 89 -84 2 126 -98 -63 39 -41 -287 77 89 66 -29 -54 -157 -56 6 26 -98 -8
5639 -8 -191 21 13 -21 -199 220 73 -36 -55 15 135 -13 -47 -118 212 -183 229 54 -70 30 -116 183 -187
$$ packed form
5471A35j30M9P3j02j38K6K33j37l1j03J1J02L3k05K01R1J24k78K56l15K70j5k82
5494a32J77P8J09k48r9K46r8K48q1j76K4r1r0J55o8j05J35l8j50L94k65K10l30
5517a95M4J04J28j03J81l0K1k79K37p4k3k0q0m2J07M7K2k5j07j00JRJ12k4Q9k34
5543b34L53j51oJ86r6j17l4L06k61J61n1J01k35L4K97m37O4K38k98M9r6L64k68
5566a31r6K59j27J75k10J35K0J67l16K01m9q7k6O6Kk03J12M9L07k36J66j68n7
5589d7L30j46l04K13q9j5K3J67R2j7q4j98K40M6j13K6l76M31q1j91Rk02Q4J41
5613f1M6no3O6Q0L8j2j73Q6J24k24L5J02q0k46L64J2k3r5k5j03J01O2K0j24R0
5639hj83K12ql4j78M19j47j09j9P0J20j48l4p1L30l95M12j75j24J00j46K99l70
$$ plain form
5662 -187 78 17 -244 166 -46 140 -82 46 283 -14 139 50 -88 -88 -102 -2 18 49 -31 -24 185 -237 159
5685 159 -151 -91 -115 83 8 135 168 -7 19 -27 -46 -61 3 -154 -31 148 17 -241 90 -325 -89 -18 -42 1
5709 1 111 59 47 -32 -44 157 -133 204 108 -149 49 32 -313 3 46 -105 -48 104 -17 -184 -128 127 201 -143
5733 -143 -97 5 -9 -208 -181 -167 38 -65 49 -8 -29 59 29 86 3 182 81 -117 10 206 30 -112 -255
5756 -255 179 194 38 -130 23 -175 36 90 0 126 -43 -20 -9 -249 -37 50 13 277 48 -83 -42 -192 46
5779 46 -42 167 -20 4 231 -179 287 -103 -73 -179 72 -106 -72 30 -202 -202 -14 -188 145 -88 36 15 196
5802 196 -159 69 226 82 -90 32 96 -51 -17 95 303 -24 -224 184 119 -195 -45 -22 104 48 197 -75
5824 -75 86 -137 201 64 -10 -1 -191 -14 112 158 297 323 298 -20 41 -70 108 -219 -200 -97 212 27 -29
$$ packed form
5662a87K65o1k61M10k12J86k22J28K37k97J53q9j38%j4J00K0L1q0PK09m22L96
5685A59l10O0k4J98p5J27L3j75K6m6j9j5O4j57J23J79j31k58L31m15K36P1k4M3
5709AJ10n2j2p9j2K01k90L37r6k57J98j7l45L16M3j51N7J52j21j67N6K55P4l44
5733a43M6J02j4j99K7J4K05j03J14n7k1Q8l0N7q3J79j01j98J27J96j76j42j43
5756b55M34J5j56j68J53j98K11N4r0J26j69K3J1k40K12Q7l7K64k29j31M1j50K38
5779D6q8K09j87K4K27m10M66l90L0j06K51j78L4J02k32%J88j74L33k33J24k1J81
5802A96l55K28J57j44j72J22O4j47L4J12K08l27k00M08o5l14J50K3J26n6J49k72
5824g5J61k23L38j37p4Rj90J77J26M6J39K6k5l18O1j11J78l27J9J03L09j85n6
$$ plain form
5847 -29 189 -103 -12 -122 64 -35 172 -46 -21 114 -92 -131 20 55 -86 16 -5 -57 117 -78 76 -22 17
5870 17 7 4 -187 -168 117 259 158 -18 201 -71 -33 117 -43 83 231 147 -32 127 -85 37 76 20 150
5893 150 -116 -41 -172 -76 67 -46 -201 128 13 -175 -124 101 -73 -68 84 120 79 176 1 42 119 -152 21
5916 21 2 -33 72 -121 -7 -122 -35 74 263 147 66 -61 -48 33 14 -206 88 -271 230 10 -221 -14 -97
5939 -97 259 -262 -268 232 -33 81 -5 120 7 21 188 -21 -171 37 -111 -47 -162 -45 -243 98 219 65
5961 65 21 64 113 -22 63 143 78 71 -6 90 -86 -50 10 83 -215 37 -20 38 155 -251 -66 116 131 -118 -101 -156
5987 -156 -219 23 -266 11 -10 104 77 -298 5 80 -112 127 -9 -22 207 -66 283 -71 15 112 -290 -91
6009 -91 240 -24 -29 136 62 114 118 -36 127 -87 -5 159 -311 -135 90 135 261 -208 -12 165 20 -320 -103
$$ packed form
5847b9K18k92R1j10J86r9K07k18K5J35k06l9J51L5j41J02k1n2J74j95J54r8L9
5870A7j0lj91J9K85J42j01j76K19k72L8J50j60J26J48q4j79J59k12J22L9n6J30
5893A50k66P5j31R6J43j13j55L29j15j88N1K25j74NJ52L6m1R7j75M1P7k71J73
5916B1j9l5J05j93J14j15Q7J09J89j16q1j27J3Q1j9k20K94l59N01k20k31K07q3
5939i7L56n21oN00k65J14q6J25j13J4J67k09j50K08j48O4j15J17j98L41J21j54
5961F5m4M3M9j35Q5Q0o5pp7R6j76L6O0P3k98K52n7N8J17m06J85J82J5k49J7n5
5987a56o3K42k89K77k1J14k7l75L03P5j92K39j36j3K29k73L49l54Q6R7m02J99
6009i1L31k64nJ65p4N2Mj54J63k14Q2J64m70J76K25M5J26m69J96J77j45l40K17
$$ plain form
6032 -103 17 -3 61 -154 -84 133 39 -78 -48 -260 -11 -45 198 91 -167 54 -196 122 165 91 -114 47 78
6055 78 81 -196 54 77 -68 -194 128 224 143 -123 6 163 45 -36 -164 -37 57 -144 43 -63 -128 -226 113
6078 113 110 -40 182 -37 -177 122 210 -17 272 285 190 -63 9 14 -69 -181 26 -175 -5 -146 76 98 61 83
6102 83 -30 508 246 -47 -49 -269 -154 -142 93 38 55 153 -33 157 8 21 105 59 103 285 -37 -51 -42 -264 140
6127 140 -363 115 31 -106 -10 -85 48 -58 -163 75 80 -231 -292 -46 -148 123 324 -287 -212 136 -82 -88 -152
6150 -152 -71 -27 -17 324 -194 516 -109 -101 31 219 59 -155 85 -148 -65 18 -85 50 0 -37 228 0 -163
6173 -163 -77 -113 166 -301 18 268 -175 29 -29 204 0 -73 -21 -117 41 100 73 -249 -25 9 -21 47 158 164
6197 164 -115 -42 169 185 10 -31 -14 -23 193 -29 245 -108 84 31 -24 -10 91 152 -210 19 168 82 215 116
$$ packed form
6032a03J20k0O4k15P0K17r4j17L0k12K49l4K43j07k58K21k50L18M3p4k05J61L1
6055G8Lk77K50K3j45j26L22R6q1k66J29J57j18q1j28J27R4k01J87j06o5r8L39
6078A13lj50K22k19j40K99Q8k27K89J3r5k53P2Nq3j12K07k01J70j41K22K2l7K2
6102H3j13N38k62k93kk20J15J2K35n5J7R8j86J90j49J3Q4m6M4J82l22j4Rk22M04
6127A40n03M78q4j37R6p5J33j06j05K38Nl11o1K46j02K71K01o11P5L48k18oo4
6150a52Q1M4J0L41n18P10o25QJ32J88j60k14K40k33Q3Q3j03J35n0l7K65k28j63
6173a63Q6l6K79m67L19K50m43K04n8K33k04p3N2r6J58N9k7l22K24L4l0O8J11O
6197A64k79P3K11J6j75m1J7rK16k22K74l53J92n3n5J4J01O1l62K29J49q6J33r9
$$ plain form
6221 116 -73 -177 153 -19 -135 -149 389 -14 124 -52 -104 117 178 -4 501 77 -84 73 -83 81 -172
6242 -172 140 -240 116 -169 261 -90 82 -57 177 11 -24 -8 211 -57 251 -151 -74 -190 -17 57 11 -126
6264 -126 -18 102 33 1 -295 37 -48 232 83 117 -66 373 101 -11 -56 8 119 -185 5 22 198 103 3
6287 3 -192 167 -128 69 -118 -70 -32 -21 454 313 74 -151 -7 -49 120 -16 -109 205 -69 3 -26 -117 -69 -98
6311 -98 140 -70 84 57 177 83 -187 -347 -86 22 8 -64 -4 -38 115 116 104 94 53 234 84 -192 -55 -109
6335 -109 137 90 -71 98 165 26 51 428 -98 -8 28 -20 -124 -75 130 19 60 -52 -33 -248 291 15 -91
6358 -91 -29 -141 11 9 80 -67 118 297 -2 136 -178 131 -23 -14 170 -36 66 -34 40 -27 4 84 -83 -15
6382 -15 132 -111 -38 12 76 347 -98 -110 49 -123 114 161 -22 189 21 -210 -89 -104 -195 -171 -105 316 -237
$$ packed form
6221A16j89j04L30j72j16j4N38m03J38j76n2K21O1j82N05m24j61J57j56J64k53
6242a72L12l80L56k85M30l51J72j39K34j66l5J6K19k68L08m02P7j16J73P4m6j37
6264a26J08J20o9l2k96L32q5K80j49L4j83M39k72j12m5O4J11l04J90J7J76r5j00
6287Cj95L59k95J97j87M8L8J1M75j41k39k25J44m2J69j36r3L14k74P2k9r1M8k9
6311i8K38k10J54k7J20r4k70j60K61J08j4p2O0l4J53Jj2j0m1J81j50k76J37n4
6335a09K46m7j61J69O7j39K5L77n26R0L6m8j04M9K05j11M1j12J9k15N39k76j06
6358i1O2j12J52kP1j47J85J79k99J38l14L09j54RJ84k06J02j00P4o7L1Q0j67O8
6382a5J47k43P3N0O4K71m45j2J59j72K37M7j83K11j68k31J21j5r1K4O6M21n53
$$ plain form
6405 -237 -17 28 34 53 37 55 4 -47 18 -220 -29 103 207 173 124 61 -65 154 245 34 -72 -60 56 32 74
6430 74 98 32 76 -65 -29 4 24 54 82 -81 85 110 -14 -4 -117 14 90 -49 -88 -59 -99 68 97 91 18 65 42
6457 42 32 106 149 76 15 -240 4 -172 25 34 -159 -51 -140 71 -141 339 -45 -164 -269 -110 16 34 44 208
6481 208 143 -203 208 -13 24 134 -25 -101 -198 -116 -65 -110 75 188 156 -220 -237 -17 91 12 66 -47 300 55
6505 55 73 -52 -112 -13 235 59 -125 137 -3 -77 38 -46 95 147 -61 24 -12 -50 -130 -5 128 -40 -133 218
6529 218 190 -33 278 -11 -120 63 134 149 107 -4 -235 -195 78 -30 226 45 -192 -227 -24 130 139 -107 -58
6552 -58 45 -108 191 45 -50 129 134 40 113 159 162 217 294 0 78 -258 93 119 -30 -114 122 -40 -102 -65 44
6577 44 118 -18 -9 -56 -49 267 152 60 -47 -30 -153 -57 -82 -96 141 164 67 -18 -107 226 82 -98 160 -15 -53 -324
$$ packed form
6405b37K20M5OJ9j6J8n1n1O5k38J91J32J04l4m9o3j26K19R1k11j06J2J16k4M2
6430G4K4o6M4j41L6L3K0L0K8j63J66K5j24J0j13J31P6j39l9K9m0J67K9op3M7k3
6457D2j0P4M3p3o1k55K44j76J97Rj93J08q9K11k12M80l84j19j05J59J26J8J0J64
6481B08o5l46M11k21L7J10j59p6r7Q2N1m5J85J13l2l76j7K20J08p9N4j13L47k45
6505E5J8j25o0R9K48j76j84K62j40p4J15q4J41N2k08Q5l6l8q0J25J33j68r3L51
6529B18k8k23L11k89j09J83P1J5m2j11k31M0K73j08K56j81k37l5K03J54Rk46M9
6552e8J03j53K99j46r5J79Nr4P3M6LN5P7k94P8l36L51K6j49q4K36j62o2L7J09
6577D4P4j36Rm7PL16j15r2j07J7j23R6k5j4K37K3r7q5q9L33j44j80K58j75l8k71
$$ plain form
6603 -324 54 83 -189 -45 -126 -64 -225 -152 -30 61 -80 -276 -67 114 97 81 81 5 53 235 -136 -28 -36 -1 -71
6628 -71 -127 139 -206 -25 146 0 -55 50 -23 39 -66 10 -6 -146 -202 -90 135 129 -171 -16 28 -332 63 -96
6652 -96 175 147 -209 -121 -46 -109 -152 -53 -132 -7 -76 238 -168 -98 -223 -146 -3 -170 51 315 -151 165 28 -99
6676 -99 70 -47 -57 15 -26 146 -153 -29 -81 -207 -70 57 -117 -76 -94 -151 -186 -130 -18 -114 48 -12 98 116
6700 116 -173 -163 -141 109 15 21 -66 207 -83 -30 6 109 -28 295 -53 -3 142 82 168 157 1 45 254 -178
6724 -178 187 -27 -108 -172 -48 75 -27 63 -16 -85 -191 -167 38 20 -132 -6 100 241 -320 -125 -70 119 87
6747 87 -27 37 71 -72 81 -43 -21 -225 -8 45 -103 -79 -103 -85 215 126 -9 -30 84 92 -15 39 -90 128
6771 128 -55 -35 -125 -169 127 -134 118 -221 -127 53 -52 225 31 152 -45 11 348 -86 -5 16 -217 -34
$$ packed form
6603c24L78K9k72J44q1O2j61P3J22R1j41j96K09J81j7j6%p6M8J82l71J08qL5p0
6628g1n6K66l45J81J71j46n5J05p3O2j05P6j6j40n6J12K25ol00J55M4l60L95j59
6652i6K71k8l56Q8P5o3m3R9p9J25o9L14m06P0j25P7J43j67K21K64m66L16j37j27
6676i9J69j17j0P2m1J72k99J24n2j26J37J27j74M1j8n7l5N6J12r6J62o0J10J8
6700A16k89J0K2K50r4Oq7K73k90N3L6J03j37L23l48N0J45o0Q6j1j56M4K09m32
6724a78L65k14q1o4J24J23j02R0p9o9j06K4K05j8j52J26J06J41n61J95N5J89l2
6747H7j14O4L4j43J53j24K2k04K17N3j48K4k4J8L00q9j35k1J14Qj07N4j29K18
6771A28j83K0r0m4K96k61K52l39R4J80j05K77j94J21j97N6L37m34Q1K1k33J83
$$ plain form
6793 -34 -109 -18 -86 88 63 -104 -8 123 75 20 17 153 128 -123 -54 -184 92 -142 -30 -165 -11 142 73 -28
6817 -28 98 -152 -153 96 -34 142 78 -166 -81 -85 70 87 18 -147 40 101 111 -99 103 280 -258 0 -81 265
6841 265 112 -30 19 -25 188 -33 -4 36 303 -285 -159 -32 135 41 -91 109 -42 -108 11 -31 64 -71 -112
6864 -112 91 171 -55 -92 -103 -112 -153 -122 -157 -11 -55 -203 22 -312 59 170 130 198 66 -54 -194 11 -84 -62
6888 -62 -54 -154 -29 66 -36 -223 -34 -84 120 3 3 -209 -54 100 -89 104 234 65 66 -146 108 54 93 -170
6912 -170 -51 -131 101 77 -348 29 -76 0 -15 -12 56 -194 -52 98 75 -153 -74 -106 133 113 -218 100 40 -37
6936 -37 168 41 -110 -132 -151 47 155 49 -210 273 -196 205 -3 83 -13 -128 107 108 -225 88 -88 -55 -112
6959 -112 -304 -125 56 -204 -110 -79 -74 14 112 -31 -78 35 37 -101 158 98 -1 30 62 94 81 -272 -1 34 128 -73
$$ packed form
6793c4p5R1o8J74k5j67R6J31m8n5lJ36k5k51O9j30K76k34J12j35J54J53o9j01
6817b8J26k50jK49j30J76o4k44Q5mJ55J7o9j65J87O1J0k10K02J77n38K58q1L46
6841B65j53j42M9m4K13k21K9M0K67n88J26J27J67r4j32K00j51o6J19m2R5j35m1
6864a12K03Q0k26l7j1rm1L1l5J46m4j48K25l34L71J11m0O8j32j20j40K05r5K2
6888f2Qj00J25R5j02j87J89n0K04j17%k12J55J54j89J93J30j69Jk12K54n4L9k63
6912a70J19q0K32k4m25L77j05P6j5LO8k50J42J50k3k28P9l2K39k0l31L18o0p7
6936c7K05j27j51k2j9J98J08j06k59M83m69M01k08Q6r6j15K35Jl33L13j76L3n7
6959a12j92J79J81k60R4L1NQ8R8j43m7J13Kj38K59o0r9L1L2L2j3l53K71L5R4k01
$$ plain form
6985 -73 68 -46 -5 -142 -209 200 27 -70 -25 27 -213 -13 215 51 98 -30 -163 -235 -23 -16 -294 1 -193
7008 -193 -89 11 28 -9 -95 -20 -90 14 -149 158 -13 17 41 72 -128 115 -68 185 199 142 -232 -82 83
7031 83 94 106 -109 -26 99 166 243 160 244 -69 -39 -90 -213 139 -232 100 -116 192 -128 -119 -64 -167 -5 5 185
7056 185 200 15 -46 -221 -90 -45 -197 -215 -39 60 82 -8 -109 29 110 -29 -189 40 -41 -216 41 125 -99
7079 -99 -80 48 -33 -91 257 0 35 -48 -135 150 194 -190 95 -109 -96 -187 -33 -127 -95 -46 -310 41 131 -210 -63
7104 -63 -42 -7 -175 -56 146 -74 -130 -50 -83 138 -68 272 179 226 -238 129 121 -114 -144 26 -128 82 27 74
7128 74 -28 0 -12 -95 -86 -187 98 -91 113 -146 252 -185 288 90 -125 54 -152 -179 41 -64 55 13 58
7151 58 214 20 -25 219 72 -151 79 -41 174 159 -73 63 -45 -218 135 -76 215 197 -146 -14 -26 -84
$$ packed form
6985g3J41j14M1j37o7M09j73r7M5N2k40K00K28j64M7j28j33p2K12Pk78K95j94
7008a93J04J00J7l7q6P5p0J04j63L07j71L0K4L1k00K43j83K53J4n7l74J50J65
7031H3J1J2k15Q3J25O7P7q3Q4l13L0n1j23L52l71L32k16L08l20RN5j03J62J0J80
7056A85J5j85o1j75J31M5j52j8J76R9K2r0j01J38Q1j39j60K29q1j75K57Q4k24
7079i9J9J28q1n8L48k57L5q3q7K85M4l84K85k04J3r1J54r4L2M9k64L51R0l41J47
7104f3K1L5j68J19K02k20n6Q0l3K21k06L40r3M7m64L67qk35l0J70j54K10n5M7
7128G4j02K8j2q3Rj01K85j89K04k59L98m37M73j98k15J79k06k7K20j05J19m2M5
7151E8J56j94m5K44j47k23K30j20K15j5k32J36j08j73L53k11K91j8l43J32j2n8
$$ plain form
7173 -84 -164 -103 64 2 190 23 166 -21 -92 -86 46 -123 -95 -30 2 -191 -130 81 -18 144 72 -171 46 78 -101
7198 -101 550 134 87 115 -2 205 -169 -1 -31 95 -53 -25 -122 -65 17 -109 74 -109 -195 -143 -38 84 53
7221 53 71 27 -283 37 -8 -167 -22 -47 276 -94 -47 -121 -252 51 -115 -141 85 23 -221 -208 315 -47 -62 -85
7245 -85 -211 32 113 72 0 14 -209 -65 187 -62 -84 26 12 -69 -186 79 143 -81 -133 -147 -78 129 140 -4
7269 -4 -331 -63 231 112 0 128 12 202 -132 19 232 -110 -57 26 173 -68 -68 2 -114 28 218 -198
7291 -198 62 74 88 -55 -104 -62 -198 56 -46 68 -94 -161 -132 -131 16 140 119 -5 178 76 -23 -42 -96 83
7315 83 -85 146 -93 -48 26 -43 -204 -163 279 -12 -91 -16 -55 147 -234 345 -138 -83 28 -225 -159 -131 -153 99
7339 99 -11 -8 19 76 55 69 -111 108 244 26 24 86 11 -175 207 90 198 -4 236 -62 93 86 66 -3 116
$$ packed form
7173h4q0O1J67o2J88j67J43j87p1OJ32j69K8O5L2j93O1K11r9J62p2k43K17L2j79
7198a01O51m16m7K8j17K07l74J68l0J26j48K8r7N7Q2j26J83j83q6N2J05J22l1
7221E3J8m4l10L20m5j59J45k5L23l70M7p4j31L03j66k6K26o2k44J3N23l62j5k3
7245h5j26K43Q1m1p2J4k23J44K52k49k2J10j4q1j17K65O4k24n2j4O9K07J1j44
7269dl27K68K94j19j12J28j16J90l34J51K13l42N3Q3J47k41%P0j16J42J90m16
7291a98K60J2J4j43m9M2j36K54j02J14j62o7K9JJ47J24k1j24J83j02r9j9n4J79
7315H3j68K31k39M5P4o9j61M1M42k91p9P5l9K02l81N79m83N5J11k53O6K8k2K52
7339I9j10LK7N7k1J4j80K19J36k18kO2p5j86L82j17J08k02K40k98J55pk0o9J19
$$ plain form
7364 116 -92 116 14 75 -91 -103 -44 184 -283 -17 8 38 -176 41 14 89 -105 -271 -236 -101 -106 -84 -19 -176
7388 -176 43 126 39 -21 235 -149 122 -432 -30 -55 -136 -54 -37 453 -82 9 82 214 26 9 96 53 -119 -6
7412 -6 32 -249 168 -123 -13 -430 94 202 -109 -136 -19 -242 -74 -179 -39 -35 51 -57 108 83 -75 324 -63
7435 -63 -71 -22 -191 -401 28 -40 65 63 -70 -126 174 -61 -80 323 147 7 -44 -205 -219 -288 -95 -3 -121 -197 150
7460 150 339 -93 62 -155 190 163 -226 1 42 -191 12 -234 185 -170 -2 -9 147 -15 9 272 -148 -181
7482 -181 196 -62 -485 225 56 -259 -89 162 102 77 156 37 -297 -118 1 48 101 -45 43 -193 -69 98
7504 98 248 -6 -216 99 -211 23 77 -119 16 -102 161 -122 -33 -30 188 106 -316 74 -127 -116 58 103 93
7527 93 -20 -140 346 -135 -193 -57 -113 -88 -21 11 -144 98 -258 -272 78 29 -14 -42 71 157 158 26 -163 -317
$$ packed form
7364A16k08K08j02O1j66j2N9K28m67K66K5L0k14K17k7P5j94j66L5J35nK2O5j57
7388a76K19Q3q7o0K56l84K71n54M02k5q1Q2J7M90n35R1P3J32j88j7Q7m3j72J13
7412fL8k81M17k91J10m17N24J08l11k7J17k23J68j05J40MQ6j08J65k5j58L99l87
7435f3qM9j69k10M29o8J05kj33n6L00k35j9M03j76j40n1j61j4o9J93R2j18p6L47
7460A50J89m32J55k17L45k7l89K27M1k33K03k46M19l55J68pJ56j62K4K63m20l3
7482a81L77k58m23P10j69l15J70K51o0k5P9j19l34J79J19M7N3j46Q8k36J24J67
7504I8J50k54k10L15l10K34N4j96J35j18K63k83Q9LK18q2m22L90k01J1J74M5j0
7527I3j13j20M86m81n8J36n6K5O7L2j55K42l56j4L50m9m3k8J13Q6Jj32j89j54
$$ plain form
7551 -317 89 -89 16 33 -131 -141 -168 49 121 -162 41 4 235 93 60 -13 98 -151 135 -129 3 45 61
7574 61 125 68 145 -53 79 -190 -192 94 108 -37 -4 93 48 94 191 -58 -10 -74 65 53 -156 -132 -138 29 -64 76
7600 76 -89 170 315 41 133 -252 -51 75 -68 -99 -82 204 -133 -48 -59 82 129 -135 110 141 343 304 132
7623 132 55 -15 4 161 41 38 -102 -78 -24 14 159 -66 89 -43 -20 -125 22 -177 -51 -105 -179 23 -174 104
7647 104 -358 -3 -131 -131 230 -103 13 111 163 -127 -40 -271 -20 -197 35 -1 -172 -298 -40 122 142 -172
7669 -172 108 34 -176 -51 57 171 185 -2 73 -44 -124 48 -22 172 -61 -54 -201 -207 56 38 -236 44 30 50
7693 50 -120 -34 -81 41 -168 -125 85 56 135 216 96 177 -350 -483 63 159 92 11 -7 117 226 -144 -30 12
7717 12 -16 -224 -329 -135 205 64 152 19 34 211 -19 -94 93 -75 152 113 8 -131 -122 -138 -117 -81 -71 18
$$ packed form
7551c17M06j78J05J7j64j0k7K17P2k83K03l7K31j42l3p3J11k49K86k64J32M2J6
7574F1O4n7P7j98J32k69kK86J4j45L3R7m5M6R7k49M8o4J39j2k09K4oJ67r3J40
7600G6j65K59J45k74R2l85K01J26j43l1J7K86l37Q5j1J41M7k64K45L1K02l9j72
7623A32p7p0J9J57j20lj40K4N4L8J45k25J55j32K3j05J47j99J26n4p4K02j97K78
7647A04m62L55j28%L61l33J16R8N2k90Q7k31K51j77K32l6j71j26K58J62K0l14
7669a72K80p4k10J25J08J14J4j87P5j17q0J72p0J94k33Pj47oK63j8k74K80j4K0
7693E0j70Q6m7J22k09M3K10k9P9Q1j20Q1n27j33N46R6o7q1j8J24J09l70J14M2
7717A2k8k08j05J94L40j41Q8j33J5J77k30p5J87j68K27l9j05j39Rj6K1L6J0Q9
$$ plain form
7741 18 -205 87 -86 58 -109 25 -48 18 -78 -145 153 102 -140 -68 -213 86 -70 -55 -63 -8 -3 163 24 138
7765 138 131 -262 44 3 23 142 150 -53 -55 49 -19 4 117 -110 110 223 42 -115 -11 98 40 -46 -97 -194 -2
7790 -2 -92 168 -70 -155 66 88 -162 -41 -34 -33 -117 -119 -213 -32 -180 -31 -70 25 236 109 -4 9 -61 56 -13 -115
7816 -115 -59 99 29 136 -66 89 117 197 85 346 -259 116 3 -100 0 -83 90 -15 -54 200 95 65
7838 65 -53 -368 -50 172 84 -94 183 26 -108 -12 96 6 -135 -298 79 132 173 -275 -151 34 183 208
7860 208 81 -242 94 -101 -114 -24 -106 81 -80 202 -143 -163 -70 44 28 -2 -72 2 -33 -37 65 -7 202 271 15
7885 15 -73 -55 -2 -119 147 54 96 -18 -74 33 -71 -37 -62 188 22 -81 141 64 220 119 101 -75 -108 127
7909 127 68 283 165 -170 -88 -157 -135 -4 104 93 -52 -21 51 -8 -14 162 135 -239 -101 34 27 179 -218 15
$$ packed form
7741A8k23K92j73J44j67J34p3O6r6o7K98n1k42P2j45K99j56J5qN5NJ66j39J14
7765A38pl93L06m1K0J19Qk03kJ04o8K3J13k27K20J13j81j57J04J09n8q6n1r7J92
7790br0K60k38q5K21K2k50J21PJq4kr4J81j48J49l9R5K11j27j13J3p0J17o9j02
7816a15N6J58p0J07k02J55K8Q0j12K61o05L75j13j03J00q3J73j05l9K54j05l0
7838F5j18l15L18K22q8j78K77j57j34R6J08r0j41j63L77N3M1m48J24J85J49K5
7860B08j27l23L36j95j3R0q2J87j61K82l45k0R3J14j6l0p0P4l5mJ02p2K09O9k56
7885A5q8J8N3j17K66r3M2j14n6J07j04L4k5K50j66j03K22p7J56j01j8j76l3K35
7909A27n9K15j18l35Q2o9K2J31J08j1j45L1P2n9oJ76k7l74J38J35pJ52l97K33
$$ plain form
7933 15 289 101 170 -202 80 199 88 210 -114 -141 132 14 -153 109 88 243 -82 -185 25 -12 210 -35
7955 -35 257 -142 -27 136 -69 193 220 75 -129 -29 -81 -45 180 122 36 -7 56 95 106 258 -67 195 87
7978 87 -96 245 94 259 153 73 46 -94 -43 55 14 13 28 123 31 -152 51 -74 82 103 55 -42 -62 -161 -49
8003 -49 49 32 41 193 -91 -140 -137 -3 215 13 -235 3 -169 -33 -49 -197 68 -60 -175 137 212 169 86 50
8027 50 -145 -106 -70 198 77 -27 5 43 -70 10 126 -173 46 153 83 -57 -57 -13 216 -84 305 -140 -95 -30
8051 -30 -92 81 34 -38 -51 70 110 36 296 144 -93 -10 -208 88 -11 -50 -12 42 -57 226 58 67 103 173 215 266
8077 266 -26 100 119 -215 21 61 131 74 -177 -114 -10 0 -100 102 276 -55 213 -177 103 -77 -104 -72 152
8100 152 222 -96 -215 -69 159 -77 56 24 14 7 -63 -14 233 -284 64 -88 101 -48 -240 12 -94 200
$$ packed form
7933A5K74j88O9l72K82J19j11J22l24k7K73j18j67K62k1J55l25j03K10l7K22k45
7955c5K92l99J15J63k05K62K7j45k04J00n2L6K25n8q6m3O3L9J1J52l25K62j08
7978H7j83L41j51J65j06q0k7j40N1R8m1jJ5R5r2j83K03j25J56K1m8r7k0r9J12
8003d9R8j7RJ52k84m9LJ34K18k02k48K38j72J36j6j48K65j28j15L12P5m3q3l6
8027E0j95L9L6K68j21j04L2L8j13Q0J16k99K19J07p0j40%M4K29l00L89m45M5O5
8051c0o2J73m7p2j3J21M0p4K60j52k37Q3j98K96r9l9L8N4r9K83j68RL6P0M2N1
8077B66k92J26J9l34K36M0P0n7k51O3J04J0j00K02J74l31K68l90K80j80k7L2K24
8100A52P0l18j19J46K28k36J33l2j0pp0M9K47n17L48j52J89j49j92K52j06K94
$$ plain form
8122 200 -48 63 24 95 41 115 30 -85 224 -160 -153 13 294 45 -121 -49 -58 -17 -178 37 -56 -168 99 107 25
8147 25 37 140 130 -124 -211 -173 229 23 270 15 123 -32 -180 -88 -25 110 -167 121 89 -94 -47 -36 -24 -64
8171 -64 155 -197 82 165 -405 -132 155 76 -85 266 -145 -164 67 -138 38 86 -11 -25 57 -26
$$ packed form
8122B00k48J11l9P1n4P4q5j15L09l84PJ66K81k49j66P2rM1j61K15r3j12K67Qq2
8147B5J2J03j0k54q7L8M02k06K47k55J08j55j48R2O3J35k77K88l2j83M7J1J2m0
8171f4K19l52K79Q3n70K73K87p9j61L51m11j9K31k05J76M8r7j4Q2q3
8191b6
$$ Imaginary data points
##PAGE= N=2
##DATA TABLE= (X++(I..I)), XYDATA
$$ plain form
0 0 0 0 0 0 0 0 0 0 0 0 0 0 0 0 0 0 0 0 8 -8 8 -8 8 -8 15 -16 16 -17 24 -24 29 -32 37 -40 47 -52 58 -65 72 -81
40 -81 91 -100 111 -122 136 -149 164 -181 199 -220 241 -267 295 -327 360 -399 446 -499 560 -634
60 -634 725 -840 986 -1185 1466 -1897 2624 -4086 8102 -40176 -122889 14880 54833 -18282
74 -18282 -27523 25100 37475 2615 -1676 7301 -29778 -14211 27812 12465 -7789 -13736 11451
87 11451 46857 -11928 -55456 2918 24193 -13273 -21982 6782 21356 -9987 -5921 15358 -29473
100 -29473 -27900 30787 14138 -18099 -2406 17297 12877 -14739 -8088 15560 -2310 299 16257
113 16257 -1327 -3268 2378 5455 10543 -16021 -15390 16995 2427 -12899 -320 4086 -1744 -14397
127 -14397 -1437 11456 -19695 -10334 27139 2756 -21385 -3993 13771 10855 -12648 -5030 19048
$$ packed form
0@%%%%%%%%%%%%%%%%%%Qj6J6j6J6j6K3l1L2l3M1m8N3o1O9p7Q7r9J10j23J37j53
40h1J72j91K11k33K58k85L13l45L80m19M61n08N62o22O87p59Q45r45J059j194
60f34J359j565J826k171K651l363M521o710J2188m8278q2713J37769L9953p3115
74a8282r241N2623J2375l4860m291Q977l7079J5567M2023j5347k0254n947K5187
87A1451L5406n8785m3528N8374K1275l7466q709K8764J4574l1343M066K1279m4831
100b9473J573N8687j6649l2237J5693J9703m420k7616O651K3648j7870K609J5958
113A6257j7584j941N646L077N088k6564O31L2385j4568j5326J2579M406n830j2653
127a4397J2960J2893l1151R361L7473k4383k4141J7392J7764k916k3503P618K4078
$$ plain form
140 19048 2503 -4438 5072 -450 3817 3324 -466 6542 -6147 -6614 12362 1224 -10343 -4297
154 -4297 788 2804 -9368 -6884 8119 -5024 -5115 6739 -7809 -6686 6408 1638 671 -182 1605
169 1605 5643 -2318 2824 6799 -2583 4630 5434 -2918 3944 -457 -2568 6193 -1858 -4103 1077
184 1077 -3974 -685 -138 -3251 -1796 -7528 323 6286 -11031 -5155 9380 436 -2930 -2615 -300
199 -300 6472 1130 788 3280 -2040 6003 5998 -5014 2059 3990 1685 3577 -5721 -3315 5131 -2135
215 -2135 -2272 -1681 -4683 897 -2261 -2994 128 -6954 742 5650 -8006 -3490 5030 2256 1598 -2608
231 -2608 1575 6039 -2767 2245 5634 -2548 4731 4603 -2468 1705 -1303 1278 4012 -6036 -1395
246 -1395 2359 -4377 -1728 -3400 -1269 2654 -7680 -1870 4802 -6712 -1490 4334 -1719 -64 -948
$$ packed form
140A9048j6545o941R510n522M267m93l790P008j2689m67J8976j1138j1567O046
154d297N085K016j2172K484J5003j3143r1J1854j4548J123J3094m770r67q53J787
169A605M038p961N142L975r382P213Q04q352O862m401k111Q761q051k245N180
184A077n051L289N47l113J455n732P851N963j7317N876J4535q944l366L15K315
199c00O772n342l42K492n320Q043nj1012P073J931k305J892r298K406Q446p266
215b135j37N91l002N580l158p33L122p082P696M908j3656M516Q520k774o58m206
231b608M183M464q806N012L389q182P279j28p071M173l008K581K734j0048M641
246a395L754o736K649j672K131L923j0334N810O672j1514N222N824o053J655q84
$$ plain form
261 -948 2024 4239 -3331 4251 6521 -3886 3024 3384 -1576 3916 -483 629 4334 -4890 -738
276 -738 2195 -4114 158 -2118 -2533 1168 -7057 -890 3777 -7447 -292 3964 -3558 -94 -800 2067
292 2067 4247 -3821 3053 5292 -3443 3937 3175 -886 5448 -604 -558 3228 -4606 1538 2495 -4835
308 -4835 718 -1510 -2212 927 -6873 -150 3312 -6938 -262 1555 -4000 1722 -891 -357 2929
323 2929 -3259 3748 3828 -3354 5144 3456 -1380 4207 -1423 783 4497 -2882 1547 2057 -3238 1553
339 1553 -2683 -2364 1640 -5230 -412 1432 -6748 826 1096 -4355 1217 -1161 -185 1926 -3071 2875
355 2875 3245 -2142 4584 841 -1396 5146 -461 1026 4111 -2113 2048 1428 -3004 1387 -1281 -1084
371 -1084 1837 -4939 -657 691 -5481 799 -637 -4653 1557 -1585 -966 1245 -2852 2440 2017 -2027
$$ packed form
261i48K972K215p570P582K270j0407O910L60m960N492m399J112L705r224M152
276g38K933o309M272k276m15L701q225O167M667j1224P155M256p522L464p06K867
292B067K180q068O874K239q735P380p62m061O334o052M6L786p834O144R57p330
308d835N553k228p02L139p800O723L462j0250O676J817n555N722k613N34L286
323B929o188P007Q0p182Q498j688m836N587n630K206L714p379M429N10n295M791
339A553m236L19M004o870M818J844q180P574K70n451N572k378R76K111m997N946
355B875L70n387O726l743k237O542n607J487L085o224M161o20m432M391k668J97
371a084K921o776M282J348o172O280j436m016O210l142O19K211m097N292m23m044
$$ plain form
387 -2027 3324 741 257 5382 -609 265 3697 -886 1778 715 -2288 2243 -208 -741 477 -4782
403 -4782 99 1425 -4366 -772 -1530 -2936 1818 -1915 -2850 1044 -664 1940 389 -2708 3267 1485
419 1485 569 3734 -1429 618 4743 175 1109 696 -882 3437 -57 -2425 46 -2119 1145 243
435 243 -5038 -393 -148 -2537 869 -2932 -2786 1553 -803 426 -480 -2353 3969 2284 -1079 1107
451 1107 -369 2840 4523 -1740 -52 2871 1018 2533 -1246 -2247 2043 -386 -329 -658 -4694 159
467 159 1180 -3116 -1220 -2903 -1268 2942 -2575 -2481 244 -8 3175 -471 -2436 3849 1533 800
483 800 3159 -1068 1072 3222 564 1899 -985 -1372 4014 -400 -2175 -852 -2711 2555 160 -5561
499 -5561 -665 -560 -1634 983 -2838 -1772 732 -336 2638 -1139 -3296 4156 2398 333 1255 -2119
$$ packed form
387b027N351k583m84N125n991Q74L432m583K664j063l003M531k451n33J218n259
403d782M881J326n791L594p58j406M754l733r35L894j708K604j551l097N975j782
419A485r16L165n163K047M125m568R34m13j578M319l494k368K471k165L264r02
435B43n281M645K45k389L406l801J46M339k356J229r06j873O322j685l363K186
451A107j476L209J683o263J688K923j853J515l779j001M290k429N7l29m036M853
467A59J021m296J896j683J635M210n517R4K725k52L183l646j965O285k316p33
483H00K359m227K140K150k658J335k884l87N386m414j775J323j859N266k395n721
499e561M896J05j074K617l821J066K504j068K974l777k157P452j758k065R22l374
$$ plain form
515 -2119 3646 5545 -1671 -247 788 1700 3672 -2707 -2354 1991 -1059 1332 -1781 -5628 1407 407
531 407 -1983 -282 -4641 -828 3424 -2195 -1464 -1369 597 5370 -1340 -2391 3709 621 2505 1797
547 1797 -2489 3259 2000 323 3077 -2416 -871 3277 -970 -145 -2442 -3368 3774 -1154 -4451 -15
563 -15 -2374 190 586 -3976 502 -249 -934 3080 -1856 -1321 3618 175 2645 1182 -2646 4139 2852
580 2852 -321 956 -1721 2344 3436 -3358 -187 46 -1224 2445 -3131 -3986 1633 -1557 -716 -608
596 -608 -4005 592 -79 -726 1266 -3139 1002 4779 -2335 -68 2024 62 3927 257 -941 3169
612 3169 380 1364 1115 -2136 1626 -268 -1879 2033 -3106 -2294 2566 -2603 -1876 -143 -2658 99
628 99 -1241 -1377 1518 -1991 735 2178 -2100 1821 1239 -1177 3637 1305 -769 2268 447 1788
$$ packed form
515b119N765J899p216J424J035R12J972o379L53M345l050K391l113l847P035j000
531D07k390J701m359L813M252n619P31R5J966M773o710j051O100l088J884p08
547A797m286N748j259j677K754n493J545M148m247Q25k297r26P142m928l297M436
563a5k359K564L96m562M478p51o85M014m936N35M939l443K470j463l828O785j287
580B852l173J277k677M065J092o794L171K33j270L669n576q55N619l190Q41J08
596f08l397M597o71o47J992m405M141L777p114K267K092j962L865l670j198M110
612C169k789R84k49l251L762j894j611L912n139Q12M860n169P27J733k515K757
628I9j340j36K895l509K726J443m278L921n82k416M814k332k074L037j821J341
$$ plain form
644 1788 1022 -1901 1590 489 -1006 1602 -2906 -1346 1909 -2951 -1833 -61 -2346 168 -1035
659 -1035 -1676 333 -1984 739 1303 -2595 1306 2321 -330 2213 372 411 3137 321 799 1360 -778
676 -778 2391 254 -1610 1685 -1127 -1109 1432 -2684 -1191 258 -1804 -393 -1488 -1587 660 -1662
692 -1662 -180 1218 -1755 1124 1365 -1506 1762 1127 -61 2446 581 956 1529 -266 1765 720
708 720 -952 1774 -962 -828 1197 -2111 -992 768 -2550 -881 -916 -2006 228 -1373 -760 488
724 488 -2193 759 1030 -1447 1793 1221 -30 2466 99 396 2189 70 1426 711 -740 2049
740 2049 -300 -1191 1214 -2098 -799 1076 -2766 -464 -81 -1995 129 -1713 -886 852 -2054 189
756 189 646 -1727 1816 719 -807 2522 248 593 2455 -550 1694 1660 -858 1957 205 -613 1993
$$ packed form
644A788p66k923L491j101j495K608m508J560L255m860J118J772k285K514j203
659a035o41K009k317K723N64l898L901J015k651K543j841L9K726k816M78N61k138
676g78L169k137j864L295k812J8K541m116J493J449k062J411j095r9K247k322
692a662J482J398k973K879K41k871L268o35j188K507j865L75N73j795K031j045
708G20j672K726k736J34K025l308J119J760l318J669l5j090K234j601O13J248
724D88k681K952K71k477L240n72j251K496k367K97J793k119J356p15j451K789
740B049k349q91K405l312J299J875l842K302L83j914K124j842Q27J738k906K243
756A89M57k373L543j097j526L329k274L45J862l005K244l4k518K815j752q18K606
$$ plain form
773 1993 -1812 -745 616 -2473 114 -412 -2519 474 -1433 -1307 784 -2597 255 1032 -2292 1269
789 1269 266 -981 2364 -257 201 2458 -641 1997 1161 -733 2715 125 -875 2030 -1479 24
805 24 1349 -2458 356 -344 -2472 551 -2020 -1565 848 -2671 82 379 -2482 1488 -128 -1307
821 -1307 2092 -374 334 2209 -536 1903 1375 -702 2466 -168 -254 2375 -1260 379 1282 -2042
837 -2042 772 -385 -2423 575 -1829 -1283 535 -2555 209 34 -2600 1524 -717 -1519 2209 -620
853 -620 424 2156 -1021 1834 1206 -459 2527 -167 377 2935 -1143 549 1143 -1814 1267 -550
869 -550 -2249 1182 -1516 -840 -19 -2926 310 -357 -2344 1021 -1153 -1287 2052 -823 26 1438 -661
886 -661 1894 692 -309 2353 276 618 2091 -1271 1086 1139 -1064 1143 -384 -1543 1276 -1418
$$ packed form
773A993l805J067J361l089K587n26k107K993j907J26K091l381K852P77l324L561
789A269j003j247L345k621M58K257l099K638q36j894L448k590j000K905l509J503
805B4J325l807K814p00k128L023k571M55K413l519K753K97k861L970j616j179
821a307L399k466P08J875k745K439n28k077L168k634q6K629l635J639R03l324
837b042K814j157k038K998k404N46J818l090K764j75k634M124k241q02L728k829
853f20J044J732l177K855o28j665K986k694N44K558m078J692N94k957L081j817
869e50j699L431k698O76Q21k907L236o67j987L365k174j34L339k875Q49J412k099
886f61K555j202j001K662k077L42J473l362K357N3k203K207j527j159K819k694
$$ plain form
902 -1418 -1252 -308 -2030 534 -482 -2622 1153 -914 -1221 1326 -1069 -179 1128 -361 1783 242
918 242 -573 2511 545 320 1697 -762 1466 1338 -1466 897 -35 -852 904 -1450 -1201 375 -1491
935 -1491 258 -796 -2270 713 -797 -1018 822 -1529 -392 1599 -452 513 267 416 2484 -57
951 -57 154 2059 -74 953 1197 -764 1154 222 -476 1535 -948 -1304 635 -723 -687 -1632 -1824 1383
969 1383 -980 -2223 707 -992 -438 824 -1028 444 499 -341 2199 203 -37 2141 329 1186 1006
986 1006 -998 1875 1289 -1174 647 -433 -535 821 -1985 -611 -213 -1690 407 -1177 -1872 696
1002 696 -1310 -677 1082 -1606 -134 1071 -112 930 -575 405 3014 -627 261 2213 -64 979
1018 979 498 -434 1480 -724 -905 1360 -1202 -630 -39 -1398 637 -1677 -2265 1906 -817 -1870 751
$$ packed form
902a418J66R44j722K564j016k140L775k067l07K547k395Q90J307j489K144j541
918B42q15L084j966k25J377k459K228j28k804K363r32q17J756k354K49J576j866
935a491J749j054j474K983j510k21J840k351J137J991k051R65k46J49K068k541
951e7K11J905k133J027K44j961J918r32o98K011k483l56J939j358L6r45j92L207
969A383k363j243K930j699N54J262j852J472N5q40K540j996k40K178j812Q57j80
986A006k004K873n86k463J821j080j02J356k806J374L98j477K097j584o95K568
1002F96k006O33J759k688J472J205j183J042j505R80K609l641Q88J952k277J043
1018I79m81r32J914k204j81K265k562N72N91j359K035k314n88M171k723j053K621
$$ plain form
1035 751 -1062 462 189 -623 1446 -323 91 2600 -503 372 1885 -439 1864 866 -1062 1698
1051 1698 11 -150 972 -1576 454 412 -2153 332 -770 -1612 847 -1929 -1042 867 -1975 82
1067 82 655 -1107 1155 -559 252 2090 -1471 936 2459 -787 1142 698 -71 1684 -622 38 1991
1084 1991 -1392 140 554 -1287 338 -1386 -1087 1166 -2459 -1576 1029 -1801 -128 -170 -1231 1139
1100 1139 -674 -177 1926 -1200 826 1911 -1041 1139 815 -229 2184 -195 26 1433 -1322 824
1116 824 204 -1683 1084 -857 -1014 588 -2039 -876 602 -1816 -368 -60 -1083 571 -819 192
1132 192 994 -1652 1140 1640 -1238 1565 1065 -25 1705 -141 365 1235 -1277 810 642 -675 732
1149 732 -832 -626 538 -1978 -390 605 -2241 -129 -181 -1402 -68 -559 -143 665 -1265 1216 917
$$ packed form
1035G51j813J524k73q12K069j769M14K509l103Q75J513k324K303r98j928K760
1051A698j687j61J122k548K030m2k565K485j102q42K459k776Q87J909k842K057
1067H2N73j762K262j714Q11J838l561K407J523l246J929m44p69J755k306O60J953
1084A991l383J532M14j841J625j724K99K253l625Q83K605k830J673m2j061K370
1100A139j813M97K103l126K026J085k952K180l24j044K413k379K21J407k755K146
1116H24o20j887K767j941j57J602k627J163J478k418J448L08j023J654j390J011
1132A92Q02k646K792N00k878K803n00j090J730j846N06Q70k512K087j68j317J407
1149G32j564K06J164k516J588R95k846K112n2j221J334m91M16Q08j930K481k99
$$ plain form
1166 917 -1109 1628 545 -164 1534 -335 679 1562 -638 758 807 -622 517 -580 -275 199 -1944
1183 -1944 85 -6 -2139 1 -143 -1507 194 -653 -333 368 -975 574 513 -918 1294 560 -302
1200 -302 1369 29 642 1318 -289 776 809 -827 567 -132 -284 496 -1041 -216 258 -1763 -52
1217 -52 -137 -1604 144 -379 -383 0 -1064 421 707 -1012 1108 821 -506 1274 387 239 1362 -219
1235 -219 631 828 -496 797 165 -460 508 -905 10 438 -1535 -12 -181 -1554 41 -495 -985 38
1253 38 -788 214 216 -987 1108 571 -673 1257 259 -4 1538 -43 739 1479 -507 922 398 -577
1271 -577 750 -351 -292 488 -1578 -36 -213 -1667 181 -363 -1360 301 -969 -437 430 -1235 842
1288 842 235 -630 1324 138 191 1557 -159 1139 1031 -606 1318 556 -281 1072 -708 -120 522
$$ packed form
1166I17k026K737j083p09J698j869J014Q83k200J396M9j429J139j097L05M74k143
1183a944K029r1k133K140j44j364J701q47L20P01j343J549o1j431K212p34q62
1200c02J671j340O13O76j607J065L3j636J394o99j52P80j537Q25M74k021J711
1217e2q5j467J748n23mL83j064J485K86j719K120k87j327J780q87j48J123j581
1235b19Q50J97j324J293o32o25R68j413R15M28j973J523j69j373J595n36m90J023
1253C8q26J002Kj203K095n37j244J930r98k63J542j581P82P40j986J429n24r75
1271e77J327j101N9P80k066J542j77j454J848n44r97J661j270N32Q67j665K077
1288H42o07q65J954j186N3J366j716J298j08j637J924p62q37J353j780N88O42
$$ plain form
1305 522 -1351 459 27 -1577 468 -719 -1435 275 -1300 -150 418 -1441 889 89 -1009 1140
1321 1140 -130 -201 1479 -441 701 1351 -239 1531 399 -463 1175 -446 -25 679 -1437 45
1337 45 -332 -1515 737 -790 -1076 497 -1206 -274 -180 -1388 279 -427 -835 1348 -419 9 1511
1354 1511 -596 844 895 -663 1529 377 45 1304 -338 610 757 -1274 517 -36 -1164 616
1370 616 -971 -970 146 -1237 -202 -57 -1143 468 -479 -660 1001 -645 265 1132 -785 892 896 -164
1388 -164 1573 176 64 1295 -81 591 650 -916 705 251 -1054 379 -849 -691 114 -1098 -313
1405 -313 -373 -1452 629 -418 -888 621 -812 34 1097 -1043 770 634 -150 1121 456 377 1026 -88
1423 -88 373 635 -488 691 -121 -786 360 -551 -601 595 -1260 -90 -120 -1108 -263 -468 -602 223 -593
$$ packed form
1305E22j873J810m32j604K045j187p16J710j575J150N68j859K330q00j098K149
1321A140j270p1J680j920J142O50j590J770j132q62J638j621M21P04k116J482
1337D5l77j183K252j527k86J573j703R32R4j208J667p06m08K183j767M28J502
1354A511k107J440N1j558K192j152l32J259j642R48J47k031J791n53j128J780
1370F16j587JJ116j383J035J45j086J611r47j81J661j646R10Q67j917J677Mj060
1388a64J737j397j12J231j376O72N9j566J621m54j305J433j228J58Q05j212P85
1405c13o0j079K081j047m70J509j433Q46J063k140J813j36p84J271o65p9O49j114
1423h8M61K62j123J179q12o65J146r11n0J196j855J170l0r88Q45k05j34Q25q16
$$ plain form
1442 -593 -164 755 -573 283 724 -156 960 74 56 1002 -129 295 630 -118 873 -108 -486 884 -552
1461 -552 -551 91 -989 -358 -241 -1093 208 -636 -985 451 -551 -234 55 -685 830 803 -582 1120 693
1480 693 150 938 514 532 661 -227 599 451 -481 876 -205 -557 284 -907 -471 117 -958 -200 -404
1499 -404 -727 -171 -754 -601 257 -748 182 607 -466 507 584 -112 1101 221 114 1238 41 498 485
1518 485 -119 886 -252 -633 987 -680 -314 296 -1173 -166 -438 -1225 144 -894 -629 294 -473
1535 -473 60 -97 -864 873 429 -479 1046 30 190 885 -175 816 826 -603 959 -92 -173 543
1553 543 -663 -71 194 -1201 67 1 -1175 139 -880 -278 184 -1272 -169 507 -901 886 -118
1570 -118 -397 1337 -254 369 886 -140 765 550 -136 1217 -147 -221 1220 -415 -155 467 -832 228
$$ packed form
1442e93M29R19j328Q56M41q80J116q86j8R46j131M24L35p48R91r81l78J370j436
1461e52JO42j080O31J17q52J301q44l49J436j002L17K89p40J515k7j385J702m27
1480F93n43P88m24J8J29q88Q26j48r32J357j081l52Q41j191M36N88j075P58k04
1499d04l23N56n83J53Q58j005R30M25j073R73P7o96J213q80j07J124j197M57j3
1518D85o04J005j138l81J620j667L66O10j469J007k72p87J369j038K65R23p67
1535d73N33j57p67J737m44r08J525j016J60O95j060R91J0j429J562j051q1P16
1553E43j206N92K65j395J268o6j176J314j019O02M62j456J103O76j408J787j004
1570a18k79J734j591O23N17j026R05k15o86J353j364p4J441j635K60O22j299J060
$$ plain form
1588 228 -273 -869 234 -987 -686 -25 -974 -75 60 -667 911 -105 -727 1222 92 116 925 -192
1606 -192 894 246 155 1172 -185 80 1192 -762 55 451 -1029 204 -286 -967 472 -764 -285
1623 -285 27 -1242 -73 -226 -974 442 -269 -173 1008 -215 140 720 -52 785 234 57 1240 -47
1641 -47 262 1079 -422 322 723 -500 458 -305 -527 274 -798 -274 156 -1236 137 -224 -797 350
1659 350 -607 -208 578 -465 134 496 57 954 346 187 997 -137 34 1004 -396 389 370 -445 231
1678 231 -220 -340 191 -809 -302 189 -978 229 -567 -887 324 -335 -438 298 -309 -144 434 -216 471
1697 471 648 253 980 18 356 967 -311 333 462 -409 406 -16 -758 46 -527 -53 -48 -583 -109 -312
1717 -312 -730 174 -542 -671 440 -493 -65 295 -382 208 214 45 678 -77 289 928 -155 661 686 -461
$$ packed form
1588B28n01n96J103j221L01O61r49Q99J35p27J578j016o22J949j130K4Q09j117
1606a92J086o48r1J017j357K65J112j954Q17L96j480J233m90o81J439j236M79
1623b85L12j269J169j53p48J416p11R6J181j223L55N80p72Q37n51j77J183j287
1641d7L09Q17j501P44M01j223R58p63k22Q01j072N24M30j392J373l61n73J147
1659C50r57L99P86j043N99L62m39Q97o08j59Q10j134J71R70j400P85j9q15O76
1678B31m51j20N31j000N07M91j167J207p96l20J211o59j03P36o07J65N78o50O87
1697D71J77l95P27r62L38O11j278O44J29q71Q15m22p42Q04n73M74Nn35M74k03
1717c12m18R04p16j29J111r33M28L60o77N90Oj69O33p55L66O39j083Q16K5j147
$$ plain form
1737 -461 512 414 -265 86 -320 -354 -136 -700 28 -77 -936 187 -581 -582 197 -556 -224 342 -364 271 241
1758 241 -120 585 151 275 876 -313 375 766 -304 760 318 -232 377 19 -183 206 -995 -206 -152
1777 -152 -1218 205 -328 -721 302 -678 -319 474 -485 135 385 -434 397 29 23 1065 -312 691 1005
1796 1005 -340 886 344 -379 690 23 -204 342 -682 49 6 -787 13 -281 -902 250 -731 -405
1814 -405 225 -1057 148 54 -456 604 143 185 863 -223 622 579 -412 693 385 -330 717 -241 -235 431
1834 431 -675 -10 217 -1023 256 -356 -690 408 -495 -433 171 -1000 290 -109 -370 534 136 64 922
1853 922 -316 680 931 -547 862 310 17 800 -153 -178 442 -635 385 -61 -937 142 -484 -506 176
1872 176 -818 -274 79 -873 176 -257 -556 755 -363 -9 440 -94 726 390 -128 1098 671 -33 897
$$ packed form
1737d61R73r8o79L51m06l4K18n64P28j05q59J123p68jP79p53L32N66p06O35l0
1758B41l61P05m34J24O01j189O88L91j070J064m42n50O09l58k02L89j201P89N4
1777a52j066J423n33l93J023r80L59P93r59O20K50q19Q31l68oJ042j377J003L14
1796A005j345J226n42p23J069o67k27N46j024P31m3p93Q00k94o21J152r81L26
1814d05O30j282J205r4n10J060m61M2O78j086Q45m3r91J105l08p15J047r58OO66
1834D31j106O65K27j240J279o12l34J098r03O2O04j171J290l99k61R04l98p2Q58
1853I22j238R96K51j478J409n52k93P83r53k5O20j077J020m46q76J079o26k2O82
1872A76r94N44L53r52J049m33k99J311j118L54M49n34Q20l36n18J226m27p04R30
$$ plain form
1891 897 -59 61 392 -469 266 -94 -647 242 -549 -623 232 -945 18 -176 -1153 37 -69 -543 561
1910 561 -422 -3 678 -528 550 419 17 554 251 -194 946 -169 71 439 -407 456 334 -648 408
1929 408 -503 -440 184 -689 62 -39 -898 56 -233 -448 95 -636 -52 539 -308 233 470 -293 606 179
1949 179 42 775 112 419 364 -299 482 272 -421 436 -194 -263 212 -564 -118 -44 -750 -218 -128 -513 105
1970 105 -380 -16 306 -366 266 296 -241 593 433 64 529 36 154 801 -87 279 122 -183 376 -277
1990 -277 -202 294 -760 -205 197 -764 -308 -114 -438 -61 -558 -189 124 -551 -72 278 -118 238 -84 -28
2010 -28 543 -9 216 739 70 283 340 -33 273 -231 -417 406 -245 -118 180 -743 -180 -131 -910 100 -225
2031 -225 -347 107 -451 -67 278 -122 383 17 -172 591 -75 77 453 -130 345 531 -357 507 275 239
$$ packed form
1891H97r56J20L31q61P35l60n53Q89p91p4Q55j177R63j94r77J190j06m74J104
1910E61r83M19O81j206J078j31m02N37l03m45J140j115K40L68q46Q63j22r82J056
1929D08r11O3O24q73P51j01q59R54k89k15N43p31N84N91q47N41K37p63Q99m27
1949A79j37P33o63L07n5o63P81k10o93Q57o30o9M75p76M46P4p06N32R0l85O18
1970A05m85L64L22o72O32L0n37Q34j60l69M65m93J18O47q88L66j57l05N59o53
1990b77P5M96j054N55M02r61M56J94l24L77m97L69L13o75M79L50l96L56l22N6
2010b8N71n52K25N23o69K13N7l73L06n04j86Q23o51J27K98r23N63M9p79J010l25
2031b25j22M54n58L84L45m00N05l66j89P63o66J52L76n83M75J86q88Q64k32l6
$$ plain form
2051 239 415 -345 -219 176 -856 -122 3 -903 142 -372 -689 -16 -558 -59 385 -308 298 158 7
2070 7 999 69 112 1053 -207 334 698 -433 747 486 -253 343 -404 135 368 -666 41 -16 -793 284
2090 284 -436 -463 163 -591 112 84 -849 208 63 -331 357 24 -78 648 -71 595 545 -220 683 107 -12
2111 -12 696 -96 122 425 -788 274 -74 -792 337 -231 -626 210 -422 -23 -156 -744 396 -149 -399
2130 -399 584 -259 96 768 -293 679 375 -67 673 77 149 489 33 411 497 -357 305 -261 -558 321
2150 321 -646 -505 174 -385 137 -217 -745 306 -250 -417 316 -437 87 524 -97 604 271 -322 867
2169 867 -18 287 338 -158 278 211 -292 366 -82 -442 81 -418 -461 90 -836 -1 -18 -322 335 -249 -529
2190 -529 469 -77 30 382 -109 279 79 -218 590 291 323 733 46 336 320 -69 383 14 -306 286 -377
$$ packed form
2051B39J76p60J26L95j032P34J25r06J045n14l17O73n42M99M44o93O06j40j51
2070GR92r30M3R41j260N41L64j131J180k61p39N96p47N39K33j034P07n7p77J077
2090B84p20k7O26p54P03k8r33J057j45l94O88l33j02P26p19O66n0p65R03n76j19
2111a2P08p92K18L03j213J062l48p18J129n68l95Q36o32L99j33n88J140n45k50
2130c99R83q43L55O72j061R72l04m42P40n96P2L40m56L78Q6q54O62n66k97Q79
2150C21r67J41O79n59N22l54n28J051n56j67P33p53N24M37o21P01l33n93J189
2169H67q85L05N1m96M36o7n03O58m48l60N23m99m3N51r26Q35j7l04O57n84k80
2190e29R98n46J07L52m91L88k00k97Q08k99L2M10o87K90j6l89M52l69l20N92o63
$$ plain form
2211 -377 -211 -213 -426 -94 -93 -459 99 -476 -219 191 -263 -218 50 -112 255 225 -97 238 48 458 665 -181
2233 -181 187 334 -382 447 378 -58 210 -38 -116 162 -257 -485 -157 -383 -105 -341 -305 163 -582 -61 46
2254 46 -135 143 88 33 630 432 183 874 138 122 465 190 372 259 -322 356 -350 73 175 -616 -220
2275 -220 -15 -584 -140 -248 -416 349 -143 -320 355 -182 97 222 -141 75 67 -6 492 211 152 613 -87
2296 -87 243 557 -283 -18 38 -114 448 -391 -207 -269 -354 -96 -474 -514 91 -243 -197 143 -439 -161 93 -255
2318 -255 535 130 -146 893 147 65 571 -74 503 250 -398 297 -110 -89 602 -146 -93 60 -529 -105 -238
2339 -238 -220 -86 -349 -360 -112 -693 -19 -4 -500 300 -493 -136 392 -119 320 422 6 458 232 15 647
2360 647 -373 99 457 -118 250 147 -404 53 -129 -362 196 -669 -217 -123 -751 72 -38 -602 254 -118
$$ packed form
2211c77J66kk13L32Jl66N58n75K57M10m54M5K68j62L67l0l22L35j90M10K07q46
2233a81L68J47p16Q29o9m36K68k48p8K78m19k28L28k26K78k36L6M68p45N21J07
2254D6j81K78n5n5N97j98k49O91p36j6L43k75J82j13n81O78p06M23J02p91L96
2275b20K05n69M44j08j68P65m92j77O75n37K79J25l63K16qp3M98k81n9M61p00
2296h7L30L14q40K65N6j52N62q39J84o2q5K58l78m0O05l34M6L40n82K78K54l48
2318b55P90m05k76J039p46q2N06o45N77k53o48O95m07K1O91p48N3J53n89M24j33
2339b38J8J34k63j1K48n81O74J5m96Q00p93L57N28n11M39J02m16M52k26k17O32
2360F47j020M72L58n75L68j03n51M57j82k33N58q65M52R4o28Q23j10n64Q56l72
$$ plain form
2380 -118 -16 168 -248 540 320 37 519 220 97 688 -91 299 179 -162 233 217 -440 159 -143 -90 -29
2401 -29 -546 -168 31 -917 153 60 -576 268 -78 -83 166 -334 137 323 173 409 142 167 628 132 302
2422 302 514 -297 488 141 -186 153 -129 -428 -13 -475 1 -161 -536 120 -195 -486 243 -165 -113 313
2442 313 -379 178 114 -102 625 301 270 403 153 437 416 7 217 225 -47 293 -153 88 -66 -278 78 -58
2464 -58 -293 -176 -198 -508 91 -334 -124 -182 -244 316 80 -110 348 -33 184 340 104 492 259 -207 239
2485 239 67 -216 272 144 -124 -59 -200 -208 -113 -404 -460 -160 -200 247 -220 8 -33 -530 -104 184 -319 227
2507 227 234 -85 208 74 -110 511 58 301 437 -99 285 -48 -192 383 -101 -233 -81 -481 -29 -189 -506
2528 -506 -127 -138 -323 -154 -259 55 -12 -206 -67 189 -221 295 9 -95 307 2 272 277 146 92 2 -125
$$ packed form
2380a18J02J84m16P88k20k83M82k99j23N91p79L90j20l41L95j6o57N99l02N3O1
2401b9n17L78J99r48J070r3o36Q44l46nK49n00M71J86j50K36k67K5M61m96J70
2422C02K12q11P85l47l27L39k82k99M15m62M76j62l75O56l15k91P29m08N2M26
2442C13o92N57o4k16P27l24l1J33k50K84k1m09K10Qk72L40m46K41j54k12L56j36
2464e8k35J17k2l10N99m25K10n8o2N60k36j90M58l81K17J56k36L88k33m66M46
2485B39j72k83M88j28k68O5j41qR5k91n6L00m0M47m67K28m1m97M26K88n03N46
2507B27Pl19K93j34j84O21m53K43J36n36L84l33j44N75m84j32J52m00M52j60l17
2528e06L79j1j85J69j05L14o7j94J39K56m10N16k86j04M02l05K70Nj31n4r0j27
$$ plain form
2550 -125 169 -268 -267 248 -325 -117 202 -361 21 -339 -626 135 -330 -191 -191 -163 32 19 11 29 45 -28 330 33
2574 33 -30 366 -134 189 231 -105 290 -264 13 45 -454 -71 0 -618 175 -98 -336 296 -546 -276 82 -340
2596 -340 6 186 -9 371 -63 -113 368 -84 220 360 -31 562 150 58 313 -58 -191 271 -370 79 -6
2617 -6 -365 372 -277 -318 -52 -706 -325 29 -333 -226 10 -67 381 -59 452 641 -153 388 186 105 525 164
2639 164 149 645 115 192 333 -268 150 185 -352 267 -199 -401 40 -468 -211 -123 -360 116 31 -341 422 -38
2661 -38 137 232 15 307 432 -368 388 68 -140 262 -9 65 155 -195 323 166 -215 81 -203 -27 140
2682 140 -465 -34 -92 -89 85 -266 -161 72 -225 47 48 -12 115 321 107 424 -29 -279 547 75 199 397
2704 397 -73 201 58 100 166 -98 -206 -159 -372 -293 -337 -248 17 -218 -297 98 -93 146 -62 -161 -78 57 -48
$$ packed form
2550a25K94m37JN15n73K08L19n63L82l60k87P61m65J39%K8J95j3qJ8J6p3L58k97
2574C3o3L96n00L23M2l36L95n54K77L2m99L83P1o18P93k73k38O32q42K70L58m22
2596c40L46J80j95L80m34n0M81m52L04J40l91N93m12r2K55l71j33M62o41M49q5
2617fl59P37o49m1K66o54L81L54l62J07K36p7M48m40N11J89p94N41k02q1M20l61
2639A64j5M96n30P7J41o01M18L5n37O19m66k02M41n08K57Q8k37M76q5l72P63m60
2661c8J75R5k17K92J25q00P56l20k08M02k71P4R0l50N18j57l81K96k84J76J67
2682A40o05M31n8LJ74l51J05K33k97K72Jo0J27K06k14L17m53k50Q26m72J24J98
2704C97m70K74j43M2O6k64j08M7k13P9m4Q9K65k35p9L95j91K39k08r9Q3J35j05
$$ plain form
2727 -48 171 200 208 299 166 41 410 39 274 -93 -194 276 -270 72 148 -213 -158 -125 -455 -239 -305 -200 -100
2750 -100 -226 41 136 -77 66 344 -205 136 347 45 394 78 84 464 106 238 142 -206 353 -41 -139 33
2772 33 -352 -163 -156 -393 -54 -148 -343 -44 -288 66 -18 -129 -44 -140 179 276 204 -202 278 119 16 372 16
2795 16 239 225 -80 319 152 77 330 -80 167 117 -287 -108 240 -598 222 -182 -315 -7 -385 -146 38
2816 38 -147 140 61 -166 58 -63 50 346 -58 141 1 -59 287 -59 -230 321 20 -190 285 -261 46
2837 46 -402 -546 93 -147 -466 184 -308 -191 -200 -242 17 -91 -73 427 -268 87 310 164 214 201 -221 405
2859 405 -75 -271 365 -209 -67 191 -299 115 175 -600 290 -136 -170 294 -136 -176 2 -420 246 -42 -277
2880 -277 334 -157 128 366 -247 439 348 32 345 -73 139 263 -164 134 84 -349 124 -269 2 46 -397
$$ packed form
2727d8K19K9QR1j33j25L69l71K35l67j01M70n46L42P6l61N5L3l30K16o6J05J00
2750a00j26K67R5k13J43K78n49L41K11l02L49l16OL80l58J32r6l48N59l94r8J72
2772C3l85J89Pk37L39r4j95K99k44L54q4j11Q5r6L19R7p2m06M80j59j03L56l56
2795A6K23j4l05L99j67p5K53m10K47n0m04J79L48q38Q20m04j33L08l78K39J84
2816C8j85K87p9k27K24j21J13K96m04J99j40o0L46l46j71N51l01k10M75n46L07
2837D6m48j44O39k40l19O50m92J17rm2K59j08J8N00o95L55K23j46N0j3m22O26
2859D05m80j96O36n74J42K58m90M14O0p75Q90m26l4M64m30m0J78m22O66k88k35
2880b77O11m91K85K38o13O86r1l16L13m18K12J24m27K98n0m33M73l93K71M4m43
$$ plain form
2901 -397 -139 -55 -364 -44 40 -114 145 -270 15 115 -348 -38 218 -170 211 -43 6 532 106 71 285
2922 285 -138 162 -92 -172 165 133 -18 195 -264 -249 161 -279 -61 -141 -408 -6 -407 -208 72 -265 153
2943 153 91 -103 376 74 -81 357 221 84 341 -77 177 242 -526 185 -218 -255 311 -407 -118 32 -421
2964 -421 -14 -55 -499 101 -264 1 75 -243 114 192 -83 222 33 28 328 100 39 355 40 -19 237 -33
2986 -33 152 -276 -503 115 -16 -103 -197 -339 -89 -63 -106 -42 -404 -327 -34 -249 -235 16 -321 305 159 -225 267
3009 267 240 331 291 114 109 288 224 301 -76 -126 356 -48 -94 16 -478 -149 -44 -464 157 -316 -420 86 -324
3032 -324 154 64 -99 -19 208 -275 -10 82 251 214 -1 288 353 -53 -23 368 -34 244 -200 -317 242 11
3054 11 -177 195 -245 -227 -112 -373 -3 -411 -24 284 -147 408 325 -358 158 112 -92 33 94 158 0 5 137
$$ packed form
2901c97K58Q4l09L20Q4j54K59m15K85J00m63L10K56l88L81k54M9N26m26l5K14
2922B85m23L00k54q0L37l2j51K13m59J5M10m40K18q0k67M02m01J99K80l37M18
2943A53o2j94M79l02j55M38j36j37K57m18K54O5p68P11m03l7N66p18K89J50m53
2964d21M07m1m44O00l65K65P4l18L57P8k75L05j89nL00k28o1L16l15n9K56k70
2986c3J85m28k27O18j31q7r4j42K50K6m3O4l62P7K93k15J4K51l37O26j46l84M92
3009B67k7R1m0j77nJ79o4P7l77n0M82m04m6J10m94L29J05m20O21m73j04N06m10
3032c24M78r0j63Q0K27m83K65R2J69l7k15K89O5m06L0L91m02K78m44j17N59k31
3054A1j88L72m40J8J15k61L70m08L87L08m31N55q3o83N16m6k04J25O1O4j58NJ32
$$ plain form
3077 137 -30 -106 112 -203 -174 45 -220 -179 72 -462 -134 -239 -135 82 -168 -231 269 -487 41 71 -286 34
3099 34 -72 32 403 59 -33 251 0 194 -6 -163 284 3 76 334 -85 143 -144 -288 245 91 -187
3120 -187 270 -238 76 96 -78 71 208 2 13 20 -270 275 64 213 325 -129 364 85 -77 427 137
3141 137 -23 218 -98 1 100 -341 294 -291 99 -161 -419 -3 -75 -447 63 69 -180 260 -28 -80 73 40
3163 40 259 276 -186 295 63 -163 105 16 60 313 -115 137 -21 -373 56 -52 -240 -54 -221 -36 -169
3184 -169 -10 65 -149 43 175 -22 -138 323 -94 287 241 58 31 319 -100 434 101 107 247 62 243 85
3206 85 -280 95 51 -124 -191 -191 76 -58 -240 95 -233 -110 -12 -120 -109 18 31 217 261 -193 127 21 -93
3229 -93 346 -39 177 325 -66 81 -11 -131 -193 138 16 -53 -63 -61 -12 -128 -55 74 -98 88 86 -76 -156 -122
$$ packed form
3077A37j67p6K18l15K9K19k65M1K51n34L28j05J04K17k50o3N00p56N28L0l57L20
3099C4j06J04L71l44r2K84k51J94k00j57M47k81P3K58m19K28k87j44N33j54k78
3120a87M57n08L14K0j74J49J37k06J1Pk90N45k11J49J12m54M93k79j62N04k90
3141A37j60K41l16R9R9m41O35n85L90k60k58M16p2l72N10Ok49M40k88n2J53l3
3163D0K19J7m62M81k32k26K68q9M4K53m28K52j58l52M29j08j88J86j67J85j33
3184a69J59P5k14J92J32j97j16M61m17L81m6j83k7K88m19N34l33OJ40j85J81j58
3206H5l65L75m4j75o7%K67j34j82L35l28J23R8j08J1J27J3J86M4m54L20j06j14
3229i3M39l85K16J48l91J47r2j20o2L31j22o9j0KM9j16P3J29j72J86kj62q0L4
$$ plain form
3253 -122 -131 151 74 -52 206 -15 373 175 59 108 60 -9 197 -73 49 9 -100 -132 187 -133 -173 -38 170
3276 170 -190 -123 259 -3 -44 222 -164 107 -65 -373 -15 99 79 130 61 -147 360 -21 -6 45 122 -110 29
3299 29 26 -381 -157 78 22 -451 -213 -240 -348 -232 -40 38 51 -82 -100 -167 -191 136 220 148 216 -3 159 -51
3323 -51 -111 181 337 -63 -15 -30 -70 286 -187 -43 26 -298 -119 -82 53 110 19 -156 -284 -248 61 443 -47
3346 -47 -42 -35 102 286 -127 -8 200 -53 341 99 -42 158 192 -147 286 137 -100 63 -265 -164 97 -346
3368 -346 -33 -75 -204 -102 -219 -32 -33 -413 29 -176 -72 229 -95 -161 493 -96 64 244 232 30 139 103
3390 103 8 117 -42 51 -157 76 117 -107 -230 -153 -152 -10 -162 -197 -141 -144 111 -38 -255 -194 -36 186 158 -12
3414 -12 353 100 -12 73 -90 10 15 27 98 -5 -102 357 -33 -136 171 -113 -450 -253 -296 -237 -49 -238 -36
$$ packed form
3253a22rK82p7j26K58k21L88j98j16M9m8o9K06k70J22m0j09l2L19l20m0J35K08
3276A70l60O7L82k62m1K66l86K71j72l08L58J14k0N1o9k08N07l81J5N1P7k32J39
3299B9lm07K24K35n6m73K38k7j08J16J92P8J3j33j8o7k4L27Q4p2O8k19J62k10
3323e1o0K92J56m00M8j5m0L56m73J44O9l24J79L7J35N7r1j75j28L6L09L82m90
3346d7NPJ37J84m13J19K08k53L94k42j41K00L4l39M33j49k37J63l28J01K61m43
3368c46L13m2j29J02j17J87jl80M42k05J04L01l24o6O54n89J60J80j2k02J09l6
3390A03r5J09j59R3k08K33M1k24j23P7JJ42j52l5N6lK55j49k17O1J58K22k8j70
3414a2L65k53j12Q5j63J00NJ2P1j03r7M59l90j03L07k84l37J97m3N9J88j89K02
$$ [...]
8191A09
##END NTUPLES=NMR FID
##END=
