##TITLE=1H_Pr d-2
 DMSO+CDCl3,8 sc, 
 19.12.2019
##JCAMPDX= 6.0         $$ Bruker NMR JCAMP-DX V2.0
##DATA TYPE= NMR FID
##DATA CLASS= NTUPLES
##ORIGIN= UXNMR, Bruker Analytische Messtechnik GmbH
##OWNER= root
$$ XWIN-NMR		Version 3.5
$$ Thu Dec 19 15:04:55 2019 Russian Standard Time (UT+4h)  she@DPX200
##.OBSERVE FREQUENCY= 200.1315
##.OBSERVE NUCLEUS= ^1H
##.DELAY= (6, 6)
##.ACQUISITION MODE= SIMULTANEOUS
##.ACQUISITION SCHEME= undefined
##.AVERAGES= 8
##.DIGITISER RES= 18
##SPECTROMETER/DATA SYSTEM= spect
##.PULSE SEQUENCE= zg30
##.SOLVENT NAME= CDCl3
##.SHIFT REFERENCE= (INTERNAL, CDCl3, 0, 15.7039)
##AUDIT TRAIL= $$ (NUMBER, WHEN, WHO, WHERE, WHAT)
$$ ##TITLE= Audit trail, XWIN-NMR		Version 3.5
$$ ##JCAMPDX= 5.01
$$ ##ORIGIN= Bruker BioSpin GmbH
$$ ##OWNER= she
$$ F:/spectra/data/she/nmr/H-F/1/audita.txt
$$ ##AUDIT TRAIL=  $$ (NUMBER, WHEN, WHO, WHERE, WHAT)
(   1,<2019-12-19 14:49:14.93 +0400>,<she>,<DPX200>,
      <created by zg, POWCHK disabled, PULCHK disabled
       configuration hash MD5:
       00 E9 B6 7A A2 85 ED C7 34 08 36 98 17 FE 4E 26
       data hash MD5: 16K
       35 38 7B D4 EE A5 4D EF 04 72 3D 0B C0 56 17 FC>)
$$ ##END=
$$ 
$$ hash MD5
$$ 89 FE C7 EB A3 5D DB 92 08 7E 80 34 D2 60 45 48
##$RELAX= 
##$RELAX= 
##$RELAX= 
##$RELAX= 
##$RELAX= 
##$RELAX= 
$$ Bruker specific parameters
$$ --------------------------
##$DU= <F:/spectra>
##$EXPNO= 1
##$NAME= <H-F>
##$PROCNO= 1
##$TYPE= <nmr>
##$USER= <she>
##$AMP= (0..31)
100 100 100 100 100 100 100 100 100 100 100 100 100 100 100 100 100 100 
100 100 100 100 100 100 100 100 100 100 100 100 100 100 
##$AQSEQ= 0
##$AQ_mod= 1
##$AUNM= <au_zg>
##$AUTOPOS= <>
##$BF1= 200.13
##$BF2= 200.13
##$BF3= 200.13
##$BF4= 200.13
##$BF5= 200.13
##$BF6= 200.13
##$BF7= 200.13
##$BF8= 200.13
##$BYTORDA= 1
##$CFDGTYP= 0
##$CFRGTYP= 5
##$CHEMSTR= <none>
##$CNST= (0..31)
1 1 145 1 1 1 1 1 1 1 1 1 1 1 1 1 1 1 1 1 1 1 1 1 1 1 1 1 1 1 1 1 
##$CPDPRG= <>
##$CPDPRG1= <>
##$CPDPRG2= <>
##$CPDPRG3= <>
##$CPDPRG4= <mlev>
##$CPDPRG5= <mlev>
##$CPDPRG6= <mlev>
##$CPDPRG7= <mlev>
##$CPDPRG8= <mlev>
##$CPDPRGB= <>
##$CPDPRGT= <>
##$D= (0..31)
0 1.2 0 0 0 0 0 0 0 0.06 0 0.03 0 0 0 0 0.0002 0 0 0 0 0 0 0 0 0 0 0 0 
0 0 0 
##$DATE= 1576752554
##$DBL= (0..7)
120 120 120 120 120 120 120 120 
##$DBP= (0..7)
150 150 150 150 150 150 150 150 
##$DBP07= 0
##$DBPNAM0= <>
##$DBPNAM1= <>
##$DBPNAM2= <>
##$DBPNAM3= <>
##$DBPNAM4= <>
##$DBPNAM5= <>
##$DBPNAM6= <>
##$DBPNAM7= <>
##$DBPOAL= (0..7)
0.5 0.5 0.5 0.5 0.5 0.5 0.5 0.5 
##$DBPOFFS= (0..7)
0 0 0 0 0 0 0 0 
##$DE= 6
##$DECBNUC= <off>
##$DECIM= 24
##$DECNUC= <off>
##$DECSTAT= 4
##$DIGMOD= 1
##$DIGTYP= 9
##$DL= (0..7)
0 120 120 120 120 120 120 120 
##$DP= (0..7)
150 150 150 150 150 150 150 150 
##$DP07= 0
##$DPNAME0= <>
##$DPNAME1= <>
##$DPNAME2= <>
##$DPNAME3= <>
##$DPNAME4= <>
##$DPNAME5= <>
##$DPNAME6= <>
##$DPNAME7= <>
##$DPOAL= (0..7)
0.5 0.5 0.5 0.5 0.5 0.5 0.5 0.5 
##$DPOFFS= (0..7)
0 0 0 0 0 0 0 0 
##$DQDMODE= 0
##$DR= 18
##$DS= 0
##$DSLIST= <SSSSSSSSSSSSSSS>
$$ [...]
##$SUBNAM2= <"">
##$SUBNAM3= <"">
##$SUBNAM4= <"">
##$SUBNAM5= <"">
##$SUBNAM6= <"">
##$SUBNAM7= <"">
##$SUBNAM8= <"">
##$SUBNAM9= <"">
##$SW= 24.9337058887773
##$SWIBOX= (0..15)
0 0 2 0 0 0 0 0 0 0 0 0 0 0 0 0 
##$SW_h= 4990.01996007984
##$TD= 16384
##$TD0= 1
##$TE= 0
##$TE2= 300
##$TE3= 300
##$TEG= 300
##$TL= (0..7)
0 120 120 120 120 120 120 120 
##$TP= (0..7)
150 150 150 150 150 150 150 150 
##$TP07= 0
##$TPNAME0= <>
##$TPNAME1= <>
##$TPNAME2= <>
##$TPNAME3= <>
##$TPNAME4= <>
##$TPNAME5= <>
##$TPNAME6= <>
##$TPNAME7= <>
##$TPOAL= (0..7)
0.5 0.5 0.5 0.5 0.5 0.5 0.5 0.5 
##$TPOFFS= (0..7)
0 0 0 0 0 0 0 0 
##$TUNHIN= 0
##$TUNHOUT= 0
##$TUNXOUT= 0
##$USERA1= <user>
##$USERA2= <user>
##$USERA3= <user>
##$USERA4= <user>
##$USERA5= <user>
##$V9= 5
##$VALIST= <valist>
##$VCLIST= <CCCCCCCCCCCCCCC>
##$VD= 0
##$VDLIST= <DDDDDDDDDDDDDDD>
##$VPLIST= <PPPPPPPPPPPPPPP>
##$VTLIST= <TTTTTTTTTTTTTTT>
##$WBST= 1024
##$WBSW= 4
##$XGAIN= (0..3)
0 0 0 0 
##$XL= 0
##$YL= 0
##$YMAX_a= 208751
##$YMIN_a= -123503
##$ZGOPTNS= <>
##$ZL1= 120
##$ZL2= 120
##$ZL3= 120
##$ZL4= 120
##$ABSF1= 10
##$ABSF2= 0
##$ABSG= 5
##$ABSL= 3
##$ALPHA= 0
##$AQORDER= 0
##$ASSFAC= 0
##$ASSFACI= 0
##$ASSFACX= 0
##$ASSWID= 0
##$AUNMP= <proc_1d>
##$AZFE= 0.1
##$AZFW= 0.1
##$BCFW= 1
##$BC_mod= 2
##$BYTORDP= 1
##$COROFFS= 0
##$CY= 11.3945322036743
##$DATMOD= 1
##$DC= 2
##$DFILT= <>
##$DTYPP= 0
##$F1P= 16.9975609425685
##$F2P= -3.02152046262296
##$FCOR= 0.5
##$FTSIZE= 0
##$FT_mod= 4
##$GAMMA= 1
##$GB= 0.15
##$INTBC= 1
##$INTSCL= 1
##$ISEN= 128
##$LB= 0.24
##$LEV0= 0
##$LPBIN= 0
##$MAXI= 10000
##$MC2= 0
##$MEAN= 0
##$ME_mod= 0
##$MI= 1.114404
##$NCOEF= 0
##$NC_proc= 0
##$NLEV= 6
##$NOISF1= 3.799351
##$NOISF2= 2.8
##$NSP= 1
##$NTH_PI= 0
##$NZP= 0
##$OFFSET= 15.70392
##$PC= 1
##$PHC0= -10147.1
##$PHC1= 15.0008
##$PH_mod= 1
##$PKNL= yes
##$PPARMOD= 0
##$PSCAL= 0
##$PSIGN= 0
##$REVERSE= no
##$SF= 200.130013532006
##$SI= 16384
##$SIGF1= 3
##$SIGF2= 2
##$SINO= 400
##$SIOLD= 16384
##$SREGLST= <1H.CDCl3>
##$SSB= 0
##$STSI= 0
##$STSR= 0
##$SW_p= 3612.71676300578
##$SYMM= 0
##$S_DEV= 0
##$TDeff= 0
##$TDoff= 0
##$TI= <>
##$TILT= no
##$TM1= 0
##$TM2= 0
##$TOPLEV= 0
##$USERP1= <user>
##$USERP2= <user>
##$USERP3= <user>
##$USERP4= <user>
##$USERP5= <user>
##$WDW= 1
##$XDIM= 8192
##$YMAX_p= 0
##$YMIN_p= 0
$$ End of Bruker specific parameters
$$ ---------------------------------
##NTUPLES= NMR FID
##VAR_NAME=  TIME,          FID/REAL,        FID/IMAG
##SYMBOL=    X,             R,               I
##VAR_TYPE=  INDEPENDENT,   DEPENDENT,       DEPENDENT
##VAR_FORM=  AFFN,          ASDF,            ASDF
##VAR_DIM=   8192,          8192,            8192
##UNITS=     SECONDS,       ARBITRARY UNITS, ARBITRARY UNITS
##FACTOR=    0.0002004,     1,               1
##FIRST=     0,             0,               0
##LAST=      1.6414764,     0,               0
##MIN=       0,             -123503,         0
##MAX=       1.6414764,     208751,          0
$$ Real data points
##PAGE= N=1
##DATA TABLE= (X++(R..R)), XYDATA
$$ [...]
1879a57l5p6j5j68L98k60j64R7L58k09k44M37j6m47K95j44J70N3k0P2K34k71J88
1902G6j26m8L79k79J15N6j13l4j20J65j08j01N11j06r1M8m9k75J78j09L30k53
1924D6J31m2rk0n5M28n12J29L3Oq0K05j39o4K96j45k26j63K07K6K25l32M91k57
1948A79p8J17J60l10O9p8K38j1m46P3L40j71j7j45n3J87Mk5nr2N0K02j70j03K31
1973A46M7j42l7o9j14r7L77j57J02O2l04K34p9j27K50k09j93Q7K14J47j32M9p1
1996a6j69j95J60Rk65Q2J86L23l49R6j79L43l45J36K64k72L17k72m3q8K05j31
2018b03J51j1r3J85J47j06l52K8l7J29l3J53O5l2K9j13J5J16j75L50J6l06J56
2041G9l9Rm4J01j6Q8j01J59l3q7k66Q8P5M8m5J57j03K17q1JKj03j28J04N8K2J13
$$ y = [-157, -192, -268, -283, -451, -53, -313, -477, -380, -22, -231, -475, -38, -54, -501, -206, -350, -180, -127, -147, -75, 159, -112, 76, -50, -98, 281, 2, 117, 173, 60, 26, -94, 71, -37, -138, 373, 267, 176, 224, 175, -100, 78, -31, 299, 46, 177, 135, 126, 106, 51, 479, -33, 96, 129, 135, 55, 260, 121, 57, 353, 208, -18, -181, 26, 52, 277, -55, 436, 179, 101, 218, 378, 68, 137, 59, 297, 286, -160, -87, 253, 82, 65, -80, -133, 54, 58, 33, 28, -64, -14, 188, 18, -85, 146, 193, 51, 14, -55, -169, -266, 111, -46, 56, 118, -186, 48, -31, -158, 92, -117, -310, -223, -9, 138, 6, 55, -16, -185, -380, -220, -211, -476, -394, -208, 115, -234, -138, -317, 26, -319, -183, 81, -191, 126, -146, -189, -277, -72, -203, -52, -63, -156, 29, 176, 70, -282, -254, -291, -162, -195, -42, 23, -9, 20, -93, -78, 38, -137, 213, 229, -77, 79, 40, 49, 5, 106, 90, 178, 77, 236, 203, 116, -150, -62, 13, 61, 16, 173, 70, 287, 206, 207, 209, 106, -22, 82, 140, 162, 275]
2068B75mN8l58J53M8k86J81j49L14P9j87o2K28J9j24J09m51J83j57J94K09l5P4
2091C11j1k11O8k66K96l10qJ97J61j54K8N4Q7j08j22Q3J79l92n3J05j35J03q1
2114a79K10l28J27m12K84L17j75N8k59k5L69j56L1j71K18k55K53o3K09m33L45
2135c5k61M87k25P0l04rJ81L8J72Rj21p0l74P7K05K03k74J21J97qj03j47J23%
2159d8rK2j42M19j25l6R8k96p8M26k51o9p3K16M5M0J65m38n6M70k88jK74l23R5
2184C7J18R1k18j65M74n6k79P8J66l44J90P5l1J88J77l17MK14m44K76j45P9rk7
2208A32j22j20K79k38K00j83K25k58J16J08k94K07k17RM33j23l16j13M7J66L9
2229b3j14L4j53L56N7k53n7K75k98n5Qk7j09K71qn0k06M09n7j1j39o1J62k20J80
$$ y = [275, 271, 329, -29, 124, 172, -114, 67, -82, 232, 311, 124, 62, 290, 309, 185, 294, -157, 26, -131, 63, 272, 237, 311, 300, 89, 157, -109, 187, -123, -131, 66, 227, 73, 101, 155, 242, 134, 12, 95, 274, -118, -171, -66, -201, -98, -179, 31, -297, -170, -582, -298, 19, -156, -98, -357, -382, -13, -169, -138, -309, -91, -346, -93, -156, 53, -380, -35, -296, 191, -34, 36, -268, -277, -96, -58, 114, 123, 2, -68, -442, -365, -160, 43, -231, -110, 87, 79, -24, -171, -48, -48, -57, -35, -177, 242, 117, 81, 179, -117, -195, 231, -20, -89, -162, 54, 99, 139, 304, -134, -190, 280, -8, -9, 265, -58, 37, 155, 246, 28, -137, 337, 281, 2, 80, 246, -98, 92, 167, 136, 324, 501, 184, 188, 402, -42, 234, 89, 168, 159, 132, 10, -110, 169, -69, 131, -52, 173, -85, 31, 139, -155, 52, -165, -156, 277, 154, -162, -275, -228, -62, -23, -137, -103, -256, 100, 157, -96, -153, 122, -176, -231, -223, -250, -359, -88, -96, -146, -352, 57, 0, -11, -150, -211, -49, -269, -89]
2254h9k33J91NQ1j77J25j5J49j20k71K82l48L59k1j02K06j07n9J35k15p6K08Q5
2277gj83J26p0M50j99k30J94l50K14K76j48j84J18j27K34k0j22L08l00q6K13k73
2299a66K34R3k62L27l16J93j40K37q1k63M68k86j57L57k11j3p9M9M2M15m02l0
2321IJ56k1j70L9O3L24k05k57L80l75J60M2j93K37j5j91M0r7J99p1m3J07j58L67
2345C27m14M71k9j13J5j61k24R1J14J98k02o1j11j22L00J54k72m6j1k4M7p3j27
2368b73L33r3L06k93N1j33J10p6O9j40P3q2J80k70k02K99J86Qk96K52l8k05j00
2391c34L13j06R7j51J07m4j97L96k7l74J50l7M48k50k65K57jJ44m71MK79K34k71
2414i9q6K34N8N5l75M5J81L2l2O7k7j38J36l3K10k94M4m6ok3j37L28k37L71Q3
$$ y = [-89, -322, -131, -126, -45, -222, -97, -112, 37, -83, -354, -72, -420, -61, -82, -184, 22, -85, -144, -9, -224, -300, -92, -7, -190, -64, -134, 316, 117, -113, 81, -269, -55, 221, 73, -111, 7, -120, 114, 94, -28, 280, -20, -106, 107, -166, 68, 161, -101, 226, -90, 103, -37, 200, 119, -144, 324, 38, -119, 238, 27, 14, -65, -16, 26, 441, 39, 9, 165, 144, -26, 13, 76, 400, 195, -62, 318, -57, 103, 145, -48, 189, 174, -17, 23, -74, 125, 54, 11, 118, -40, 327, -87, 384, 355, 242, 257, 96, -128, -37, 77, 275, 73, 12, -99, -221, 79, 233, -39, -85, -96, -120, -73, -146, -273, 60, -33, 273, -20, 31, -102, 8, -68, 1, -139, -66, -148, 32, -238, -440, -141, 45, 53, -243, 9, -29, -234, -334, -21, -127, -30, -181, -74, -118, -315, 81, 54, -320, -170, -207, 241, -9, -274, -17, -18, 126, -345, -341, -62, 172, -99, -185, 49, 107, 162, -213, -168, 13, 45, 13, 80, 53, -85, 51, 18, 228, -66, -22, -68, -74, -97, -234, 94, -143, 228, 311]
2439C11l87L36mj8l36K82R4m4P6q4q6k79M00p5k00p4N0K16j38J91j79j56L7M08
2463C41k93j5P2J13j52j36j52J24L24j55j28K4J38k28J53R1q3l0r1P5j03K78j93
2486b6p2J54j14j67L91j24k34J6L5O0L6K70m37K91q0k52o4K96k42Q3N07m28K0
2509h1J57q6k21k1K44j07J50k71j7J14j32J04o9J01J25j33J39k80J54J16J6J88
2531A90l26qK87J8j4n1l19J09J50J03l80K88j24R2K20j28k12m46L70M21k53j96
2553b09O4J49k7K49j68j50J65K28l97J99MN4j73j75P9J17L84m11K38M3j13K5l7
2576A38k22K52j43m9L2j57L94j52m4p5J35J38j01K0j4r4J16m1n6m0k58O34k97
2599A16l9Q1K1m06J13J55m12K37M16k98l40N70l63K61m20M38k61Q7J48j77j82
$$ y = [311, -76, 260, 256, 238, -98, 184, 278, 234, 310, 226, 140, -139, 261, 186, -14, -88, -38, 178, 40, 231, 52, -104, -67, 341, 48, 33, 105, 218, 66, -70, -222, -98, 226, 71, -57, -33, 105, -123, 30, 121, 38, 8, -83, -8, -111, 167, -26, -98, 56, -58, -225, 166, 42, -192, -176, -141, -81, -45, 225, -212, 79, -1, -253, -317, -21, -263, -180, 327, -101, -81, 76, -10, -231, -252, -8, -115, 35, -236, -253, -139, -271, -167, -236, -135, -10, -143, -4, -284, -130, -14, 2, 190, -136, -144, 143, 161, 147, 96, -223, -114, 36, 139, -241, 47, -77, 15, 235, 107, -105, -551, -181, 240, -13, -209, -145, 4, -23, 226, 58, -92, 73, 301, -96, 103, 107, 161, -12, -187, -108, 9, 393, -18, 220, 263, 150, 175, 138, -84, 168, 25, -24, 8, -149, 245, 93, 49, -26, 109, 247, 146, 166, 152, 58, 174, 133, 77, 37, -221, 413, 116, 77, 158, 179, -227, -114, 41, -371, -134, 282, -16, -356, 214, -149, 112, -308, 130, -131, -44, 104, -73, -255]
2620b55N7K22J40P9o20J87J39j36K97k2j39K2P4N0l07p0J23M29l81J36l45J44
2642a76M8O3k58L55j46L7L9j81J25J82l36K01k25M6M36k16p0j35R4rK70M8k21
2665b9J23j09j39L57l85j10L03q7k06K68k03J90J87j79k5r4R4J43k24m3N63l71
2687B4j02J5N0J66l70K49J31Jj29j04L83o0j68p9L94p21P6N04j58JJ72q5j95J10
2711A05k74J38J00K37k08r5J98r4J22n7J16n55K29Q5K9j7R5p8jK38k73j5O0mJ7
2736I8l39L04J43J9l72L09q4J66r7l46O9M1J92j44J72j47J99k83K11k39M47l53
2758c4nL8Q7k39J44K03l13K9J36j54J74n6l89M87l95N65l73K17j56j31P3o0N1
2781a01N6R5k81J28j31N0J83q1j65K60k48J21L54o6j76j80J21K20j53R3n6K1l48
$$ y = [-255, -198, 24, 164, 243, -377, -190, -51, -187, 110, 88, -51, -29, 45, 95, -212, -282, -159, 270, -111, 25, -320, -176, -128, -65, -323, 32, -114, -77, -38, -219, -94, 88, -248, -47, -272, -226, 210, -6, -76, -211, -117, -126, 144, 192, -29, 94, -15, -154, 203, -182, -292, 11, -76, -282, -14, -217, -27, 160, -19, -44, -138, -44, 99, -125, -168, 395, 24, -78, -63, -13, 153, -217, 32, 163, 164, 35, -69, 314, 254, 86, 7, 401, -320, -244, 260, 102, 103, 275, 190, -5, 105, -169, -31, 69, 306, 98, 3, 201, 107, 229, 172, 288, -267, -38, 47, 76, 59, 154, 76, 75, 313, 40, 25, 85, 81, 98, -241, 63, 206, 225, -147, 162, 78, 244, 147, -199, -130, -89, 103, -41, 131, -16, 183, -100, 111, -128, 319, -34, -39, -1, 86, -153, -9, 194, -119, -90, 46, -108, 66, 10, -379, 108, -287, 278, -95, 122, -34, -165, -92, -152, -101, -45, 50, -231, -103, -234, -184, -1, -82, -247, 13, -235, -114, 240, 174, -2, -182, -61, 159, 6, 99, 43, 64, -284]
2804b84M96l32k5r6LK45k5J6K96l19j60J66J86k33J55P8KmN2R5l15P1J85l40j51
2829b38K21K35j68p1j34M41r0k43K22j10J06j76K36n55K53j8K03k59N4J86r5K35
2851B35j84K28q7j27j69K73l83L36p7O9j18k2J68j33NJ43j93L1J87l0q1j52p7
2874a58J78l00L42j84K14J4q2l0j62K40N5n0j41j12j28L31j75r7j59L76m10O1
2896c77n2M64j03n8J05j62%j72J03L45l75L78l72M7m7K57Q9L9k26k3R7J32M1l40
2920b10K09L4j92L03P4m98M92l0k79J45k41J98J26kJ6m2k10K0o8K20n9Kk8qJ56
2945A28k37J78j20J0N0O9j30K27q8j63J37M54l81K3k21K66L7J62m24j2k8K9j84
2968b18R2q5K61K20l01J28j86K40o5O2O0k66O1J87k24J37j36M4K58k22J55m2o5
$$ y = [-284, 212, -120, -145, -241, -238, 7, -18, -2, 294, -25, -185, -19, 167, -66, 89, 167, 169, 165, 217, 312, -3, 68, 253, -87, -238, -17, 218, 50, -21, -155, 286, 196, -47, 175, 65, 171, -5, 231, -324, -71, -89, 114, -145, -91, 95, 0, 235, 51, 279, 192, 65, -104, 169, -214, 122, 45, 114, -4, -26, 142, 9, 14, 157, -36, -5, 182, 152, 71, -81, -158, 20, -280, 62, -122, 92, 106, 24, -6, -168, 72, 127, 77, -64, -176, -304, 27, -148, -245, -404, -28, -438, -377, -429, 35, -68, -126, -21, -183, -183, -355, -252, 93, -282, 96, -276, -229, -276, -19, 70, 109, -117, -140, -43, 89, 130, -210, -1, 33, -159, 144, 218, -280, 212, 182, -97, 48, -193, 5, 131, 129, 145, 103, -107, -87, -155, 65, 6, 8, -20, -28, 128, -109, 69, -51, -41, 9, 78, -52, 175, 87, -76, 61, 515, 134, 157, -64, 202, 239, 401, -23, -35, -63, -34, -218, -126, -211, 50, 270, -31, 97, -89, 151, 86, 148, 208, -58, 3, 190, -34, 103, -33, 11, 269, 47, 202, 160, 95]
2991I5M3k02J46n7J1J50j74j01J67l24j66N39l35K30j96O9K28j35J79r8l47J73
3013a05J52R9m0k22J76l70J85K34j29P9j64L9j15m6P8P2l62K12M08k21j51J36
3035e5k14M59k40q6K82j15j35o8L35l26K33l63M05J32l32J29K08j44j41O9M9k26
3057a44L35l58K3K21M4K3j55R2OQ5j03q4J99M4j34jR7k53K01J63k27J49k47J8
3081fL8j83K62q5j00J69M3l62K48K28j05l14L95j82J84j14j31k26K45L3K10k30
3103A7L6j2k04K12N5j45Q6Nk6J26j90K4J03R4j9j91J56Pl1J28l87M16j08j88j1
3128d7J27k0K21l50K3P3Rm34K37q2J91k7J63qm3j22J46j42k24L91m27K14N6j50
3152b25K74m77L10q3K62r4n5j36J88j33K81k5j90j10M8L05j22j27L40k47L4J61
$$ y = [95, 138, -64, 82, 25, 36, 186, 12, -89, 78, -246, -412, 127, -208, 22, -174, -105, 123, -12, 167, 69, -278, -105, 47, 146, 106, -116, 60, -310, -125, 109, -20, 59, -105, -66, -181, -227, -149, -77, -439, -227, 181, -40, -191, -55, -269, 190, -50, -136, 146, 31, -104, -172, 163, -163, 70, -293, 112, 244, -88, 41, 249, 105, -36, 33, 82, -144, 191, -167, -144, 77, 121, 144, -11, 81, 87, 172, 69, -15, 184, 228, 94, 93, 190, -63, 138, 301, 74, 223, -24, -6, 32, -151, 111, 26, -74, 95, 138, -224, 24, 252, 147, -167, 228, 46, 230, 116, -15, -241, 4, 37, 247, 17, 53, 41, -163, 49, 104, -41, 45, 50, 24, 150, -40, -16, 87, 181, 162, -29, 127, 134, 103, 231, -156, 260, 152, -36, -47, 80, 60, 281, -69, -46, 27, 36, -398, -161, -243, -52, -79, 84, 76, 33, -89, 57, -85, -309, 82, -345, -131, -75, -225, 49, -428, -118, -201, 61, -33, -88, -224, -36, -169, 112, 87, -103, -213, -165, 140, 18, -109, 231, -16, 18, 179]
3174A79m25L36o9L0J14mN4r8j10j72L62m2k09k08l5M17j97j98M06k16j34M00k94
3197a13J39j04K05k41J00l61M27L02k82o9K30m19N18k76n0K47%J24l08o27O86
3218A28J28l22J85j62J61j30q7K44k24L54k33k8K02j46N6j49L4N9j29K72j85N7
3240H5OM9j11l01N04j22m2j28J69j33K15p3pj90K4J77r9J62j73j01K23k42J27
3263A9n5O8j98N7r7K68j1m8L8q8J25J6P3j46n1J37j91j43L64k63J13K0j28L2M
3288h5j8O3J95J6L7k91j56J42j44J95j95K16J58k05R9k74nK10L90m6l70O2N2j44
3312i8n7J54J26l88J70l1Jj20L55K28k46l4J63k43j96j4K36K84l02K3K27l37K09
3335A10j07N9r8j50J29L95J1k88J9n5J77k88o3J77M1p8J52l02K23K72j53j52Q8
$$ y = [179, -246, 90, 21, 51, 165, 161, 215, 117, 7, -165, 197, 155, -54, -262, -297, 120, -77, -275, 131, -85, -219, 181, -113, 26, -78, 127, -114, -14, -375, 52, 354, 72, 3, 233, -186, 332, 56, 6, 253, 253, 377, 69, -558, 128, 256, -66, 119, -43, 118, -12, -99, 145, -79, 275, 42, 14, 216, 70, 126, -23, 11, 70, -59, 213, 28, 85, 91, 140, 29, -272, 232, 110, 68, -60, 109, -24, 191, 118, 111, -79, -55, 122, 23, 185, 12, -89, 134, -108, 19, -36, 32, -166, -109, -206, 62, 51, 3, 41, -47, 78, 94, 167, 21, -30, 107, -84, -227, 137, -126, -13, 7, -121, -89, -85, -103, -40, 155, 171, 208, -83, -239, -97, -241, -46, -241, -25, 133, -72, 27, -247, -252, -42, 348, 302, -68, -6, 46, -98, -155, -1, 125, -263, -93, -124, -123, -243, 112, 340, 94, 60, 223, -20, -216, -230, 6, 290, -12, 11, 238, -99, 110, 3, 62, -36, -186, -57, 338, 349, 61, 80, 25, 202, -86, -149, 28, 69, -9, 143, -159, 64, 336, 183, 31, 119]
3358A19L1k96M12j72j67J89j27n2J17R8m57L50J71p1p6l6J5Q0j72J07k79J57J11
3381E2J08J16j37j29k78J78p6m4K76j49j29J78mn7J22m09M26J49J45o10O3l9Q4
3404a64K14q4j07p3j61R4J54J3O3j10J90j70K95k99m5K22k06J37o2K42L0M7k82
3427f2K52k94K11j39k95K81j04o9J72lr5M9L91m27M38l29j33J54p0P8J03j07k98
3450b96M46o8k82M00m11j70M40k5k03K22M5J4j78K91o3j80Q8N2l68j19M26MJ86
3473B51k09p8J98J1k18J43K5j73m1P6J41j66l1M4n3L22k38J7oJ78j78j34K72l98
3497b45L17j11j1J90J87j03j48k50J31J29K37j24O9J77o98K80l4j33j89L37k47
3518b39L76j45J11J69n4j57mK01r8l8P7j81p4l06M27j84K31p1j20L5k21K67j20
$$ y = [119, 150, -146, 266, 94, -73, 116, -11, -63, 54, 152, -305, 45, 216, 145, 69, 33, 48, 128, -44, 63, -216, -59, 52, 160, 276, 139, 10, -268, -90, -166, -210, 66, -83, -212, -34, -38, -95, 27, -382, 44, 193, 338, -272, -209, -248, -164, 50, -34, -141, -214, -375, -281, -127, -114, -51, -161, 29, -141, 154, -145, -190, 32, -174, -37, -99, 143, 173, 220, -62, 190, -104, 107, -32, -327, -46, -150, -219, -47, -50, -145, -96, 295, -132, 306, -23, -156, -2, -72, 6, 109, 2, -296, 150, 82, -200, 200, -211, -381, 59, 34, -169, 53, 98, 112, -66, 225, 162, -18, 70, 122, -246, -365, 61, 65, 251, 42, -36, 162, 173, -45, 98, 123, -50, -91, -15, 126, -40, -71, -27, -80, 242, 4, 21, 15, 193, 15, -119, 153, -245, 72, -39, -50, 140, 327, 224, 76, -174, -43, 86, 323, 199, 268, 445, -253, 27, -7, -140, -329, 8, -239, 137, -8, 103, 272, 218, 61, 57, 258, 160, 122, 199, 18, -56, -362, 65, -119, 112, 41, -79, -44, -265, 2, -118]
3541a18O7P3r1J49J17l22l8J24j50J88p0j7j05K22j74J61k1J88O2k60O7k25L43
3564A70k2L4m20K32j26Q1P3q6P6k21K09j48j79K46n1L38k09J39Q6N0k23q6j66
3587b03L43j95o7J69j9o9R2j36j37M08k26op2J68j69L47j1m30L21p6J37j51N7
3610G5k2J48l15K77j14j05K25J77j95k21R8J18n2NJ09j76o3J57R8k42j45K4L88
3633B49k03j30O9o0L7J85p2n5q8K03l76J86j34K77n8n7L5j70J32P9J60K9k89J1
3657d0K17m0lj5m03J62l6M4K6j18K26j63K4J64k34J4N3K4P3J73m02J59j16J80
3681c1P2j98K27j43O3m0j20J19M6L11m02j08K13p3j83L37j25l91N07j53Rj45K49
3704D1l4j5q8J88N3Qj23K05k40J14p4n0L7k10K14j57L9J32P6l09O9M17l78K60
$$ y = [-118, -51, 22, -69, 80, 197, -125, -163, -39, -189, -1, -71, -88, -193, 29, -145, 16, -5, 183, 245, -15, 52, -173, 170, 148, 182, -238, -6, -132, -51, 22, -64, 12, -209, 0, -148, -327, -81, -132, 206, -3, 136, 222, 272, 49, -37, -203, 140, -55, -122, 47, 28, -41, 51, -85, -222, 186, -40, -46, -118, 50, -119, 228, 217, -213, 108, 32, 169, 18, 75, 53, 201, -114, 163, 49, -56, 169, 346, 151, -70, 28, 146, 94, 99, 208, 32, -31, 126, 224, -18, -163, -139, 249, 46, -84, -15, -75, -38, 147, 75, 20, -68, 135, -241, -55, -189, 88, 30, -27, 8, -162, -30, 49, 209, 238, -51, -40, 177, 137, 134, 119, -284, -122, -158, -114, -88, -206, 20, -143, -119, 45, -189, -175, -122, -98, -25, 148, -254, -95, -211, -31, 41, -157, 70, -73, -10, -50, -170, -51, -5, 306, -96, -204, 9, -64, -247, 90, -35, -426, 81, -72, -63, -208, 41, 7, -8, -96, 92, 145, 153, 30, 235, -5, 109, 35, -15, 22, -188, 26, -131, -92, 40, 116, -193, -124, 293, -85, 175]
3728A75k50J5L0J53K08K38l24j89j05L24p3j36m4j19L71j09p1k22J93n6l09L32
3750C2Kq1r7R8K73m4j60l15L55L51n29Rr0M84j0j75k18J58J07j36j83K16n4K71
3774B64j33l50J69J66R4k04J63j42p4K1o3MN1L06l17j8N3K9k88M93P9n54J66J56
3798G1l5j55L41k94j2q6j1oJ20q0k6K01pR3j09k73J52p0J43r5j46M47k47q6N36
3823C66j63k00j73K19L18l30P0m5K0J1j68J73j79j64N13l80J14r7J82n3k97M72
3845B09k78J31k18R3m3J98J69m51M41k07j37J03k09L68j10j07Q2kK47j43K9r0
3867G5N5M78l79j70J07K03k75O2k0L9l49L00m8r7J1M1O0rp1M2l5L8j08R7k16M87
3893C18l34RJ66l48L52k61O21o41k39J60K23j64k06K34K30j23p9Q1j26Q4j54M53
$$ y = [175, -75, -60, -30, 123, 331, 569, 245, 56, -49, 275, 202, 66, 22, -97, 274, 165, 94, -128, 65, 9, -300, 32, 34, -47, -144, -46, 227, 183, 23, -292, 63, 414, -115, -106, -196, 288, 278, 103, -115, 43, 150, 14, -169, 47, -7, 264, 131, -219, -50, 116, 210, 6, 169, 27, -47, -26, -89, -85, -34, 272, -45, -63, -10, 19, -269, 224, 303, -251, -85, 71, 36, -119, 222, -72, -84, -170, -181, -187, -67, -147, -173, 28, 21, 114, 5, -268, -116, -186, -43, -138, -284, 163, -84, -170, 366, 203, 3, -170, 49, 367, 37, 107, 62, 82, 93, -75, 98, -81, -245, 268, -112, 2, -95, 87, 34, -263, 209, -69, 62, -156, -63, -106, 92, 261, -190, 251, 44, -93, 10, -199, 169, 59, -48, 34, 32, 279, 136, 165, 75, 130, 608, 229, 59, 166, 369, 94, 156, 136, 175, -174, 126, 78, -19, -8, 33, 93, 84, 13, 55, 20, 58, -50, 47, -169, 318, -16, -7, 159, -189, 163, -98, 523, -118, -357, -197, 26, -138, -344, -110, 120, -3, -82, -1, -127, -43, -197, 256]
3915B56k65o8mP9j31K9r6M64Rl92P5p4L51o35M88k41K99j03k54K19j78N2K91k35
3939f4Q0M3j98L14j18k45J90r0k9rJ83l41J13K2j30M78L0k56L3n1K56j32j66j31
3963b18J41N1m1J53k57J02N3n7N2j1o5K69m63M63l88K14J20n6kj69n2L07K2n00
3987c32L57J74lj84j47O97l28l12K91m07K40j86J25k24R2J38K41j56p4L66m15
4008d7J7J27n3J27L3o9K99m66K09j42l5n3K24k89J22j97M80l07l69K42j4J59R7
4031I5q8k0p1K15M7l34L02J48l95J54J26j44k00K49J64l89N6j7K52l35O3L51n61
4054c32j1L66k32K27j11k38K43j17j3K70j92O3j31J21J89k67K7J06K44j44j15
4075d7l43K21J52K15m64L96l34J55J6j73K74j37j47Mj22M76j22l7k78K97j48R6
$$ y = [256, -9, -77, -81, -2, -133, -104, -200, 264, 273, -119, -44, -118, 233, -402, 86, -155, 144, 41, -213, 6, -172, -120, 171, -64, 16, 59, -139, 175, 57, -188, 2, -88, -117, -126, 57, -284, -171, -149, -279, 199, 229, -27, 6, -45, 211, 79, -87, -218, -77, -26, -67, 86, -171, -69, -16, -73, -21, -32, -97, 172, -291, 172, -216, -2, 118, 62, 60, -109, -161, 146, 168, -332, 25, 199, 196, 12, -135, 562, 234, -78, 213, -194, 46, -140, -15, -239, -147, -9, 232, 76, 2, 368, -47, -30, 97, 44, 171, 204, 135, 434, -32, 177, 35, 0, -53, 171, -118, 4, -193, 287, -20, -389, -147, -161, -2, 95, 7, -13, -84, 131, 178, -156, 146, 294, -101, 53, 179, 35, -165, 84, 248, -141, -85, -102, 150, -185, -122, 229, -332, -343, 23, -209, 18, -93, -331, -88, -205, -218, 52, -140, -77, -208, -87, 102, -165, -138, -32, 212, 68, -47, -390, -169, -17, 198, -266, 130, -204, -49, -33, -206, 68, -69, -216, -212, -334, 142, 20, -17, -295, 2, -146, -50]
4097e0P5J8L2j9j20l6J64j50L88k26l12K95k94K54J90l15KO3L4J11K27k80q5K50
4121B16j60m0O3j30J67l87M84m13K44O1k84L40j36k00L13p7N8j08J93J30l43O4
4143E5R7n5L00k49LO2p5j95j36L18l9L5k86k0L45j35O0mj20J46m47L92j69K40
4167A23J6j69k1J59O5m81L62J8j70P6m2k24L55j12O6K6j62p1J90r7L93j7m37O0
4191i4J62j43J2M7k7Q4O1j48J17q3J3L3j17R6kM6l86N47j73k77K90r7J5M3l55
4216c36K75N9K24l48K07j68J05j61K31j15P8o1k94K08K00j96K75l4p7j39m6J52
4238C9J36P1j12l18K6J57q7J99k10k51M63q0j28J85j52L48k51k2Q1J10j77M2j09
4261d0m9j3P7K75J05m06J14j08J43N9j05K58k66q0l0N48n19O2L0J09J1J1j24J25
$$ y = [-50, 25, 43, 75, 56, -64, -100, 64, -86, 302, 76, -236, 59, -235, 19, 209, -106, -104, -41, -7, 104, 331, 51, -34, 216, 56, 16, 79, -51, 116, -271, 213, -200, 44, 105, -179, 161, 25, -175, 138, 61, 119, 11, 204, 334, -9, 55, 152, 97, 397, 148, 151, 213, 138, -57, -193, 125, 86, 121, -165, -185, 160, 25, 85, 81, -39, 107, -340, 52, -117, 123, 139, -30, -51, 108, 173, -308, 54, 72, -98, -22, -64, -288, 67, -45, 21, 47, -115, -186, 4, -93, 300, 283, -154, -94, 68, -75, -63, -16, -43, 41, 102, -46, 71, -12, 1, 34, -83, 13, 11, 57, -329, 218, 45, -232, 58, -39, -24, 19, -336, -61, -2, 222, -126, 81, -87, 18, -143, 88, -27, 51, -10, -304, -96, 104, -92, 183, 149, 72, -67, -113, 39, 175, 246, 134, -184, -158, -1, -88, 111, -99, -350, 113, 33, -95, 90, -62, 286, 35, 13, 94, 204, 27, 69, -40, -89, -102, -25, 250, 355, -51, 63, -45, 98, 157, 52, 310, 44, -36, -66, 482, -37, 25, 55, 164, 175, 186, 62, 187]
4285A87k34K43j37p1K03j97K16k29J87L3k35q4N6j78K84J30o9k61M3K11j12J8
4307DJ41j22R8M2r4j21p9J88J1pj29K9j3j31K07q8K85m77P6L78k78L12l08L60
4331B84n96K71O3J5p2j97J19j16L37r6pj31K7j08M06j42j57L8J22j03J5KJ61Q3
4355B18k63L7J68l24QM06j14l83J69J59o8M78m36j12K29l93K68L77n32rJ8L41
4377B42j59k29K92O2j55k5nK23k03N8j7k36M86j43J98o1k74j05P4J42k07J70m9
4400G9k9%R4j44k8Ml7K81k95J91j81K88k01J31j67K98q8j93J38k8j93j82L74m1
4424G1q9j35N05l61Q2oj2j74L1L54j92k2k67L09j31l28ON76m68p8J39K41J60m73
4448b62K92R4j60o7m0K75l14J45l8K46m55n2N09k80J37n6J38k75L47j19n6o4k4
$$ y = [187, -47, 196, 59, -12, 191, -6, 210, -19, 168, 201, -34, -118, -62, -240, 44, 174, 105, -156, -113, 98, -14, 4, 145, 23, 121, 163, 69, -52, -131, 57, 68, 61, -68, -39, -52, -183, 24, -64, 221, -256, -180, 198, -80, 232, -76, 284, -312, -41, 22, 37, -35, -232, -113, -229, 108, 12, 5, -126, -99, -207, 199, 57, -100, -62, 60, -43, -28, -26, 135, 218, -45, -8, 160, -164, -156, 250, 136, -247, -78, 81, 13, 491, 55, -57, 172, -221, 47, 424, -108, -117, -99, 242, 83, -146, 146, 208, 53, 28, 23, 246, 43, 101, 84, -152, 334, 191, 389, 328, 54, -51, 23, 165, -42, 128, 79, 50, 50, 144, 0, -28, -24, -61, 220, -75, 116, -65, 223, 22, 153, -14, 284, 196, 3, 141, 113, -80, -262, 112, 71, -18, -153, 352, -9, 73, 67, 55, -119, -88, 266, 74, 52, -215, 94, -37, -365, -359, 217, -251, -329, -190, 51, 211, -262, 30, 124, -36, -103, -143, 132, -182, -37, -75, 171, -284, -336, 173, -107, 30, -26, 112, -163, 184, 65, 9, -55, -79]
4471g9k52N54j78r9R9N9l8j97J36r4J92j61J42k81O8J46K17l70N9L31k39J28k54
4494a11j46L56J75r1O4m89K20J13N1k23L05N7l82p9J95M5J41j42R1j6j54j18j10
4517b48L81J6l00K02k65j00L84l4k55J34K23J22k22L4N5q2j92P9j64L39k73O0
4539a06j00O6K92m95O29l41L11k52j00L7J89p1k46J46P5qJ57k80K54O4m05L19
4561A35l52M08%l17K66j95P5K9J03j24j13L28l74j17K56o7K02l01P0K2N7q6K37
4584A42m33J77J02L2L8l02J37L26r4L2j28j34J31k8J4k36N3K0J82P7j34K3k96
4607b99L18k12J41q6K33J69l10k06K07j7jk13L82k53J97R1j67j65J5L01J2r1n1
4630eo2j46JJ53R5j52J55K20l59J17j38K26O0Pn5k47J62r7PJ97j40R4R2j76j15
$$ y = [-79, -331, 223, 45, -54, 45, 104, 66, -131, 5, -89, 103, -58, 84, -197, -129, 17, 234, -136, -77, 254, 15, 143, -111, -257, 99, 274, 183, 247, -242, -22, 91, 142, -81, 224, 281, -101, -180, 15, 60, 201, 59, 150, 134, -20, -138, -248, 133, 149, -151, 51, -214, -314, 70, 36, -219, -85, 138, 260, 38, 72, 127, 45, -147, -68, -232, 107, -166, -106, -206, -140, 152, -343, 286, -55, 256, 4, -96, -59, 130, 59, -187, -41, 34, 26, 183, -97, 157, 221, -184, 135, -217, 191, 191, -126, 140, -55, 20, 49, 152, 28, -85, 243, -131, -248, 8, -59, 143, -158, -88, -66, -9, -95, 142, -291, -114, -12, 20, 58, -244, -107, 219, 125, 157, 29, -105, 26, -2, 12, -224, -171, -151, 31, 108, -26, -3, -299, 19, -193, -52, -138, 95, 264, -46, -252, -45, -62, -63, -276, 106, -147, 50, 141, -26, -191, -176, 125, 137, 46, -5, -67, -213, -212, -59, 36, -116, 39, 259, -100, 17, -121, 105, 165, 172, 117, -130, 32, -65, -58, 139, -1, 93, 185, 9, -106]
4655a06K46j29K13m93N55l20K27k54K14j30q9J91r3k35K99j14p3J35r2Q4k93K60
4677CJ8J3O2j52J58M2Ok52kJ17j58J50P0j61k91M18N5j56k7K5l82Q29n7n19J75
4702a6n3J07k3k1p0J03k03K94q0k49K09J86k19L7j88r6K37k0j8n7L6K56l24L22
4726A50%j0k04J33k35pL78k9K5j24n49J36M30N7l75J32j43L14J09j24j47K30k53
4749a06J60k61N27r0k37J54j59kj2L35k90J48M6L2l95J38J3j56L44j2J6j64k3
4772FK35k34K61j8m61N67m86J57L23m43J84l16N27m53M72m32J57J17j98K81k67
4793b1k64J83J98J19j97j58L04j70K71m60j37M27j4J95m51K28j7J65j03k71J23
4814e0N2M08l68K27k66q9k00J65M2R0K59l7m06J15N5M7K14k70p9K42j16J28j56
$$ y = [-106, 140, 11, 224, -269, 286, -34, 193, -61, 153, 23, -66, 125, 32, -203, 96, -18, -91, 44, -48, 36, -257, 3, 21, 34, 96, -56, 102, 144, 150, -102, -104, 13, -145, 5, 75, -86, -377, 41, 96, -60, -87, -62, -444, 385, 328, -191, -16, -69, 38, 15, -6, -76, 27, -176, 118, 38, -211, -2, 184, -35, 2, -186, -282, -45, -65, -83, -140, -104, 152, -172, 150, 150, 140, -64, 69, -166, -173, 205, 176, 201, 77, -472, -336, 94, 151, -224, -92, -235, 79, 188, 64, -83, 147, -106, 54, -207, 320, 230, -7, 147, -12, -14, -26, 309, 19, 167, 213, 245, -150, -12, 1, -155, 189, 177, 193, 29, 6, 241, 7, 268, 250, -211, 356, -130, 27, 350, -93, 91, -225, 302, -151, 321, -111, 46, 163, -35, 246, -21, -285, -102, 96, 215, 18, -140, 164, -6, 265, -195, -332, 95, 81, 276, -175, 53, 36, 201, 98, -173, -50, 2, 410, 42, 269, 3, -86, -286, -121, -79, 11, 270, 233, -173, -58, -3, 44, 258, -12, -91, 151, 35, 163, 7]
4837Gk55J92J88k02N1q4n6M65m08J77k75K16K36k22p0j73J63Q3P2o6K70n46L54
4860A17j44j83M31k66J41r0J54j41l5n1L38m67K37k94K47O5k0j98J82n3O5j35
4882a00J8L06j95k0J72n35N08k03K3K11m77M09n6no8K3j42Q8j7K2L1J41k41N3
4906e4n8J39j17J05j1J4j1K82p6k00R4j60J02j82k5M41j22j86k2L02l37K85q9
4929A14r2n7L38m8k54J74j77J09j84l3J46j93M42n05J51J52m25L45k29N0j44L23
4951CJ59k9k80L78p6k08j90M42j58J57r0j7O3j88l1J32q7K03k96M6J4o2l3K07
4975E9k04M7L24m91L64J06n8j69Q8m5K19m7J59n06j74K53mm8L89l47N1J91Rj89
4999b3q5O7P5J1o5j59K27O8m51J69N6J37J42k10J42o3Q8l86J61L38l94J85k59
$$ y = [7, -248, -56, 132, -70, -19, -103, -159, 306, -102, 75, -200, 16, 252, 30, -40, -213, -50, 33, 105, 39, 309, -237, 117, -27, -210, 221, -45, 96, 6, 160, 19, -16, -67, 271, -196, 41, -253, -6, 59, 39, -159, 23, -30, 35, -100, -82, 224, 29, 9, 181, -354, 154, -49, -26, 185, -292, 117, 61, 56, -12, 11, -131, -43, -60, -38, -7, 134, -107, -54, -112, 27, -90, 15, 4, 18, 7, 289, 213, 13, 107, -53, 49, -133, -158, 283, 161, -25, -47, 255, -82, 203, 114, 22, -35, 303, 255, 1, 175, -2, 107, -77, -110, 36, -157, 285, -220, -69, 83, -342, 3, -226, -176, -320, 3, 162, 133, -147, 231, 155, -53, -243, 199, 41, 198, 108, 91, 154, -34, -65, 67, -20, 183, -113, -67, -53, -115, -148, 59, -145, -98, 226, -265, 99, 205, 147, -22, 66, 21, 240, 193, 352, -154, -328, -75, -79, -127, 262, -85, -34, 157, 166, -23, -108, -41, 34, 45, -20, -179, 48, 116, -335, -166, -110, 27, 169, -41, 101, 38, 126, -260, -99, 239, -155, 30, -229]
5022b29L69J3%j20k35J13N8P8m8K37r3j62K05j17J5j50l7J50j26l6K31k71JJ77
5046B3K25q6k43J21LL18j89k49J97p5Pp9k3M0J18mO0l35J66p6K75j51o6R8j47
5071g2J50J98j48J17m42J12L57N2o8j38j84Q5n12K32N5l8R1J16q0p7o6L67j24
5094a7p5K61m6n2j28M6J40q2O2N6k75L23j48k41r0L84j42o8l9M9J84m2j09J27
5118G8j68M13n42K55J2N8j81M4P2q9j07K04r2L03k83n6j9K17k84J16n4K7L9r2
5142a29L2K98j97j5j48J00K80l76J25j72J63nJ76J10k54j27oJ91r9J91j59K08
5164A87J00j34k74K31k37Q1J90j81j68L93l25Q2k3J7P9q4O3j22J54k18L50j68
5186gL67m72K07J7j55J69l06K11Q0J18r7k25r9M34l08o8J33L60l49j20J11k23
$$ y = [-229, 140, 153, 153, 33, -202, -89, -31, 47, -1, 236, 143, -19, 186, 69, 84, -66, -103, 47, -79, -115, 116, -155, -154, 23, 248, 162, -81, 40, 43, 361, 172, -77, 120, 45, 52, -27, -50, -10, 108, 104, 164, -171, -5, -81, 194, 43, -23, 75, -72, 78, 276, 128, 245, -197, -85, 272, 324, 256, 118, -66, 19, -493, -261, -206, -244, -153, -37, -117, -194, -260, 107, -17, -92, 169, 123, 71, -57, -11, 129, 47, 109, 165, -110, 213, 65, -176, -266, 118, -24, -92, -131, -82, 102, 60, -49, 78, -90, 323, -219, 36, 48, 106, -75, -31, 41, -48, -155, 49, -43, 260, -23, -79, -98, 119, -165, -49, -103, -76, -37, -129, -97, 201, 4, -11, -159, -59, 221, -155, -30, -202, -39, -44, 132, 242, -12, -139, -145, 46, -53, 138, -21, 187, 287, 153, -121, 110, -127, -46, 144, -37, -205, 188, -137, -55, -78, -61, 18, -66, -3, -125, 29, -189, 161, -7, 360, -112, 95, 112, -43, 126, -180, 31, 111, 229, 132, -93, -192, 242, -66, -134, -1, 359, 10, -110, 1, -222]
5208b22L33J87l14j27M4K22m7qJ22k31Q9q3J42o9j19K29J28m61K38k81K04n9J36
5231E3m68N54k78J96l30L26k5k8n4q0P9L6jk52M30l75L84j79m5J13j88J52k11
5254a91j41M22j14L06k31l2L5j14J33K23k90q4J55o5K10j46R3J21j45k12J23k
5276E4R9j14Q3J23J3n08K91nJ31j09J23l30Q0K73K3k75j5J5j26J82n8K83l83J39
5300a1j26K05M1l8k00L69k48J73j44k12L28l04P9L6L30K0n43K22J55Kj49k3j06
5323a44L38k49K99p6j03L1j0j8J41l22m3O5j03Q7L55l27J31Q3L1l79J59K85j59
5346G2j28J50j45J50q0q5J93j37L68n32n6M86l72R7j9j23K3%P7j5J79N6k42j19
5370b02q5K80q8J61O9O5l09kl6K33o2M2K6j17N1k47J52O5J17k44L29j40M5K1j49
$$ y = [-222, 111, 298, -16, -143, -99, 123, 76, 68, 190, -41, 48, -35, 107, 38, -81, 148, 276, -185, 53, -228, -24, -83, 53, -415, 139, -139, 57, -273, 53, 28, 0, -54, -134, -55, -19, -20, -272, 158, -217, 167, -12, -57, 56, -132, 20, -191, -332, 90, -24, 282, 51, 19, 54, -60, 73, 296, 6, -78, 77, 12, 222, 76, 169, 290, 145, -67, 56, 54, 153, 39, 122, 245, 258, -250, 41, 36, 167, 58, 181, -149, -69, 204, 227, -48, -63, -48, -174, 8, -50, 233, -150, -11, -137, 68, 109, 71, -129, 240, -8, 165, 21, -191, 137, -167, -88, -52, 278, 298, -245, -23, 132, 134, -15, -38, -144, 194, -55, 244, 168, 65, 96, 86, 68, 209, -113, -156, -91, -194, -107, 248, -79, 52, 135, 166, -213, -54, 231, 72, -56, 94, -51, 99, 19, -66, 127, -10, 358, -174, -230, 256, -116, -19, -38, -161, -138, -138, -61, -76, 103, 159, -83, -202, -287, -7, -95, 66, 135, 200, -109, -111, -147, 86, 24, 66, 92, -25, 26, -221, -69, -4, 113, -131, 198, 58, 103, 124, -25]
5395b5L71j86l21J24P7P4M1k9j91J54R1J4j27j38Q3j11N5J24J9q8l38M27k67L49
5419A82k06O6J3r1j23K25L8k55J19L11l20J52L9k23P1K58l92K80J02n0J73m19
5441e0K98l22J76J69n2k13J91kj52j2J1K8k98J51K01j63p8K9J64k5p3K98j83j95
5465a02j65M35l62J98j54K08J60m15J49R7j78K07n9P9N0l07L34k39K28j89K00
5486A75m7P5k17M7j30J28k12o5L23l9l30N5K90n85O82j07qk3r7P3j57N12k98k83
5510b38M00j67j17K28R5l99M8M9P6j91J35JL21j03l70N42m00k4L61k18r9j37J59
5533d8L5J02k94L13o6j78K07k18L38k11j13K65J1ll59j34K72M2J19J54k13J18
5555A39j11j69K69m1l02K1J80J25n3r1J28k71P8J57j91j22L58k50L59k97K38M5
$$ y = [-25, 346, 160, -161, -37, 40, 114, 155, 126, -65, 89, 180, 194, 67, -71, 12, -99, -44, 80, 99, 11, -327, 100, -167, 182, -24, 42, 55, -36, -159, 66, 104, -151, -32, 279, -41, 111, 150, -73, -2, 256, -136, 144, 246, 196, 369, -50, 248, -74, 102, 271, 219, 6, 197, 195, 43, 31, 42, 70, -228, -77, 124, -39, -117, -88, 76, 51, -22, 276, 93, -102, -267, 168, -194, 4, -150, 58, 218, -197, -48, 49, -129, 78, 19, 98, 148, -159, 175, -64, 164, -25, 175, 128, 203, -14, 33, -97, 31, -181, -246, 77, 38, -292, -237, 53, -532, 150, 43, 35, 12, -85, -12, -169, 343, 45, -238, 162, -5, -122, 106, 201, -198, -150, -101, -25, -216, -81, -80, 241, 138, -232, 310, -90, -114, 247, 29, -70, -207, -48, -13, 89, -205, 108, 42, -136, 71, -147, 191, -20, -133, 132, 143, 140, -219, -353, -81, -39, 80, 234, 21, 139, 28, -141, 128, 87, -215, -194, -14, 111, 58, -33, 95, -176, -98, 59, -132, -254, 104, -146, 213, -84, 154, 199]
5577A99m62L41L0K0j27K74l12K47m03L5M99j94P3k08k20K27J38j67j66K97k69
5598a48J45J18k8o7j74J53j29k16J99n5J76l1N0J66M7j71K1m4P7q5k52J90j07
5621a65Q8j02Q7P4K15k35l3R2k28j7K60J39n18M22kj14j75J2R1R2J60m6n25M81
5645E3j71J12j68K87p9Mj61n9J66J12K29l68M3n0J63K58j66k66p9J58j09K37J48
5668B94j51q6oJ73m41M62m23K70j10J89Qk99M65k70K0l12M54J07l07L0r9M1K08
5691B17m29M03k60K4J20j3j13K06j19kl19J73L74k00q7N5j49j59L16j66M59l94
5713f3qK78k73l2J37l6j50M03k70L71j2k62j42P7j82K21p7l51K77K97k75J75J13
5736B16l83K3K06j55O4p1J99Kn8j13l2P3J83j84o6J48p8r5J22j36J21j18P0P5
$$ y = [199, -263, 78, 108, 128, 1, 275, -37, 210, -193, -158, 341, 147, 220, 12, -208, 19, 157, -10, -176, 121, -148, -3, 115, 87, 20, -154, -1, -130, -346, -147, -202, -26, -57, -7, 159, 206, 35, 56, 12, 89, 4, -248, -58, -165, -77, -179, -92, -18, 197, -38, -71, 21, -207, -224, 36, 175, -343, 79, 77, -37, -212, -200, -109, -17, 143, 97, -428, 53, -118, -6, -174, 113, 34, 38, -123, -182, -16, 96, 325, -43, 0, -50, 113, 371, 205, -61, -140, 18, -91, 146, 294, 143, 57, 51, 224, -217, 245, -178, 92, -18, 171, 179, -120, 345, 75, 95, -217, 237, 344, 37, 67, -32, 9, 217, -212, 191, -69, -45, 75, 62, -51, 155, 36, 34, -285, -112, 262, 62, -25, 30, -119, -278, 38, -128, 331, -63, -71, 207, -66, -98, 39, 3, -147, 256, -14, 357, 345, 83, -59, 18, -164, 57, -20, -371, -94, 203, -72, 103, 216, -167, -144, 62, -93, -29, -100, 99, 101, 43, -70, -102, -29, 154, -30, -96, 52, -26, -121, 1, -135, -14, -132, -62, 13]
5760A3N7n6q6K00k90J39J49j70K98l14r8J01J88k46J75k45L58j87o0J32n3J5j42
5783a22L78k54J70l18K26L7k10J96J69l51J31k20J27J45M5k03J88m4M9l52j52
5804c65M62J62n7k80l4J59r2j08M5K13O6q6j55qK42k84N9l6J22j76J71o0K4Q7
5828G1J2J53l32N5P1O1j06M99l67p7J0j0J33j27j79K9J40l73O06k96PJ49k51J07
5852a5J83j56J5o2OJ2J62j11n7K7J67l24K1K36k35K74k41Q6k36L08O9k42J26l8
5876b5k18J11K54k68L28j34k54J33J48q1j39J33K10m9j12q3k4n3j31l4K96r0J24
5899D2r5j77r3K39L8K26j69J21m11M64k99P2j24K93k49J29Q0p3j3Q7m3k37K55
5922F3q3J8J45j02j93J50J13p1j65k9P1J84Q2Q1q6r9j06jm4K20o6j11rl7J48Q7
$$ y = [13, 70, 14, -72, 128, -162, -23, 126, -44, 254, -60, -158, -57, 131, -115, 60, -185, 173, -14, -74, 58, 5, 20, -122, 256, 2, 172, -146, 80, 117, -93, 103, 272, -79, 52, -168, -41, 104, 149, -54, 134, 90, 139, -213, -365, 97, 259, 202, -78, -112, 47, -45, -153, -108, 105, 171, 85, -70, -78, 164, -120, -61, -97, 25, -151, 20, -40, -16, 71, 83, 236, -96, -41, 30, 91, -15, 484, 117, 40, 50, 40, 173, 46, -133, -104, 36, -337, 269, -27, -20, 129, -122, -15, 168, 12, 27, -35, -29, -17, 145, 34, -23, 4, 171, -153, -132, 104, -131, 143, -98, -12, -248, 60, 129, -113, 13, -25, -243, -132, 122, -146, 182, 48, -206, -73, 75, -6, -145, -12, 198, 149, 37, -46, -70, -123, -254, -288, 8, -82, 42, -53, -230, -323, -84, -46, 180, 11, 132, -279, 185, -114, -42, -166, 127, -122, 7, 87, 14, 1, 88, 45, -192, 63, -20, -2, 143, 41, -152, -2, 111, 40, -125, -154, -83, 101, 183, 264, 178, 79, -27, -28, -72, 148, 82, -29, -38, -75, 73, 160]
5948A60j99K49j90L01k84L9l8M1k6j68K13J58k00j62N05l35p0L83j78k14J75j20
5970D0j1k48K22J9k03J08N5L78k00m20O7L7L23J06J4l18K42k43k4k49N08k91J00
5993A2j46O7l4m0J63L4j51k17N89j93J10j68m9p9K89J66n39J49j22J62Q8l34J72
6016g1J6j86N3L18k18K7J9M2Q5l9j0O4K46k99L3m2k02k94K39J25K38%j72L81m13
6041f0l6q8K75k1R9n8k56J74J44%j42R6k60j85K97L10l71K13Q5j29Q6j03k52K50
6065F8j28j4J15j82K26j54q8J09o5K51k26pJ1M4M2J80l03N20j32J47m40j40L29
6088A63j26K58k55n5K1m5k01K01K65j50j57K75j66j64n1L69j87o1K75m37J32j2
6110a08J76J7j95j10M4mL49k61K29j16j41J81j42l51M38l55N39m11Q7J70L3k39
$$ y = [160, -39, 210, 20, 321, 37, 76, 38, 79, 53, -115, 98, 256, 56, -106, 399, 64, -6, 377, 199, -15, 160, 40, 29, -219, 3, 22, -181, -73, -18, 360, 160, -260, -193, -156, 167, 273, 287, -31, 211, -32, -56, -305, 203, -88, 12, -134, -67, -101, -141, 22, 56, -95, -312, 277, 84, 194, 26, -23, -102, 187, 353, -186, -37, -159, 3, 91, -243, -71, -55, -241, -188, 130, -88, -61, -42, 0, 85, 46, 36, 100, 346, 47, 80, 38, -164, -458, -219, -94, 144, 144, -28, 353, -60, -96, -184, 91, 70, 169, 111, -145, 29, 173, 173, 31, 127, -133, -318, -21, 289, -82, 131, 216, 87, 173, 70, -182, 68, -60, -74, 41, -141, 85, -69, -157, -48, -113, 138, -88, -95, -84, -40, 2, 182, -121, 399, 267, 414, -26, -166, 163, 37, 295, 40, -15, 6, -39, -240, -39, 226, 76, -81, 194, 28, -136, -187, 182, -5, -66, 209, -228, -96, -108, 68, 85, -110, -220, -176, -180, 169, -92, 137, 21, -120, 61, -81, -432, 6, -349, 190, -221, -134, 36, 69, -170]
6132a70J74Mo3Nj57P1K9J75J20lj90K18l09J54k41N5l7J08L0q3K24p1K10l00J2
6157c5L93m03K9K8K30n7o6j91J14o8K8p2J51j26J16J7k18L16k10q2K59j81j4O1
6181A9l47N76j99N9k20J48j73K88m43K15N85m57J34j82k05L30j89J38j55L2J7
6202b9m7M6o4j24N92m95L4j90O0O25l11j16J96J68m91J52L8O0p9j64K28p9L7J09
6226A56o1J10j30M4k12j7O9k08M73j66o0N7l2J92n3q4k18mJ81J10j52j0n7l5J86
6251G9j02K18j74j06K73p7J06l55l8M24n8k37K14p0O4k62N6N1o4K84k03j53J67
6274C7k98PJ47L99l16k1j31J44j20K69j43l28J39q8J90r3K30k2O4NK67k87j66
6297a15J73k15K10J08k50L15j77Q7l95Q9m7L42k22m3J21k27M71l31K41k6j09K45
$$ y = [-170, 4, 8, -55, -50, -207, -136, -107, 68, 188, 185, -5, 213, -96, 58, -183, -128, -165, -57, -27, -110, 114, 43, 253, -47, -35, 358, -45, -16, 12, 242, 185, 119, -72, 42, -26, 2, -70, 81, -45, 71, 88, -130, 186, -24, -106, 153, -28, -42, 19, -328, 248, 49, 108, -112, 36, -137, 151, -292, -77, 508, 51, 185, 3, -202, 128, -61, 77, -78, -46, -29, -76, -30, -94, -218, 374, -121, -87, -277, -217, 408, 97, -19, 177, 345, -146, 6, 44, 104, 25, -139, 89, 10, 47, 156, 95, 205, 75, 119, -93, -110, -41, -249, 224, 58, -2, 55, 23, 215, 162, 78, -140, -144, 37, 147, -5, -15, -72, -107, 79, -23, 195, 21, -85, 188, 111, 217, -138, -176, 248, 190, -47, 167, 97, 161, -101, -45, 6, -58, 226, 23, -130, 37, -261, -254, -107, 292, -24, -45, -176, -32, -152, 117, -26, -354, -215, -303, -113, -206, 24, 2, 66, 71, 338, 51, -115, 58, -157, 53, 161, -89, 226, 49, 136, -259, -170, -217, 125, -97, -140, -19, -246, 225, -106, 135, 109, 0, 245]
6319B45m60N5L07K64k20j69LL7j43k31M17k76M03j44k73L34k19J72p1P9J84m50
6341a56J87K9r6Q4m5m49M71K36j83j75J51k03L24k12j44j33M88K5k32K57k54J9
6363a1n3j59K65P4j52K57m36J14n8J47J13k7j01o4O6L85l83L1j19l8M72k80p2
6386b9k42J10K27o5o6K7j51n7N6K48r6J16j0m6j8p2J39j19O0k46K32n1J02k06
6410a57Q6p7J32l79L10K90l88M6J71j10j25J96J40l62L91j62j31K53r6j79K45
6431I4j77n5NJ14j04L39k93j02L0m5N5J12K4j94K93L6m8l7p4L8k22M43l36J08
6455DQ4n3k96O4K37k4p5k0M54p3k58K34j07l04J43j33N0J24j3l1P6j48J56J18
6479B09j42l7k4j03K62j95j72J92n9o2K01O9j93K89k46j91L85k42j92M96j55p9
$$ y = [245, -215, -160, 147, 411, 191, 22, 25, 62, -81, -312, 105, -171, 232, 88, -185, 149, -70, 102, 31, 110, 294, -156, 31, 60, -36, 48, 3, -446, 25, 261, 78, -97, 54, -149, 175, -37, -181, -314, 174, 199, -33, 224, -30, -11, -64, -223, 42, 116, -36, 221, -215, -101, -159, -12, 101, 74, -27, -91, -25, 360, -23, 8, -111, -149, 323, 43, -29, -271, -161, 66, 1, -65, -38, -189, -246, -190, 58, -38, 78, 68, 22, 4, -68, 71, -48, 12, -234, -2, -53, 49, -157, -71, -148, -16, -395, -85, 205, -183, -137, 34, -76, -201, -5, 135, -227, 164, 2, -129, 124, 28, -151, 94, -83, -138, -133, -19, -123, 216, -77, -179, -149, -194, -139, -27, -3, -197, 96, 132, 84, 47, -27, 11, -211, 232, -104, 4, 88, 35, -261, -197, 40, 16, -59, -79, 375, 302, 44, 278, 171, -133, 10, -123, -73, 51, 38, 7, 83, -65, 91, 209, 67, 30, 6, -97, 165, -30, -202, -10, -69, -131, 70, 139, -54, 235, -11, -202, 183, -59, -251, 245, 90, 11]
6501A1j18J2K25j74p5M1K42l61L68l49K35J75j18l63M59j88J15j01m78M67k74
6522b49L89j22L67m25J16k43j11L70n5j03l1M9j9J35N6l88N5N6M10l19J96j36
6544bK42j50o8J07r5Q8k70J35j5R5q3J5k55K00q8j10M57k57M5k51J92J25K19%
6568B76k30J73k05P9m07L3N32m24j43J38J96j38J91n9J44l5J9l76j06M58r4J8
6590D0j15j24N05l12j5K01j67j61N4N6L7j08N9J19Q3l20M32m04O7Q0K0k8k66L51
6614H4N6J25j74m8r4K92k13k5R0j18K11k06J31m9m0N6J75l61K00q3P1n9J1K16
6638B48m10J91j92L10k93M22k80k8l8J28O6l44K15J70j20k14P0Rj63N35l94J78
6660F6m3k47L90l48K09k4r4K89k6n9N5j04j44K23J4p9P0o2k99J35j4J72j90mK6
$$ y = [11, -107, -95, 130, -44, -119, -78, 164, -197, 171, -178, 57, 232, 114, -249, 210, 22, 137, 36, -442, 25, -249, 140, 18, 385, -40, 76, -167, -278, 92, 37, -66, -97, -48, -67, 68, 124, -264, -209, -153, 257, -62, 134, -2, 240, 90, 22, 129, 34, 122, -148, -13, -28, 67, -16, -1, -256, -56, -144, -254, 203, -54, -9, -260, -68, 57, 276, 276, 46, 219, 14, 93, -314, -281, 251, -173, -316, -178, 18, -120, 71, 12, 156, 121, 140, -236, -342, 116, 22, 40, -75, -199, 306, -6, -21, 180, 13, -148, -94, -38, -1, -109, -50, 69, 152, -168, 264, -140, -73, 7, 27, -1, -267, 84, 140, 265, 91, 43, -51, 241, 28, 3, 93, -25, 186, -20, 111, 62, 22, 78, 253, -108, 92, 9, 80, 21, 32, 248, -162, 29, -163, 147, -146, 276, -4, -32, -70, 58, 124, -220, -5, 165, 45, -169, -99, -90, -253, 282, -112, 66, 23, -224, 166, -182, 27, 3, -91, 198, 172, 113, 168, 64, -80, 143, 157, 78, 148, 86, -213, -78, -92, 80, -110, -114, -88]
6685h8K9J77j15k05K91q8j13J03k60L19n9J20l8R9r7o6pL3J41l83M18k10k03J47
6709e5J67j05J88k23J05J45j23j31M5j46j6Q3J08k00J34K49l43k1k7K11j49J80
6731G6n0j15L75l52K82K3j85K8p9R2J62Qk30j51L24l87O6N3K4K22l3M7k74j8J48
6756E6m03N28k48OO9q6K43k00j4J39Lj6j5K57m59K50O6k31j08K4L42k26K55k23
6780IL4J45k07p1J81k24J87j59K76m4j08q3J02J36r5m32L13N6l0Q4R3j03J76n89
6804c53M44j97L8Q5r5RNP2P0N4k56M3J21M0l02J73K5k2j98K75j51K09o1Ok70J93
6830d3N6j47k37K96K07l35M68k01k42K73m0J02J16m75J81p8J76j35N6lk28M61
6852B28l52L55j42k28J88j93L4Q4r9M14J68o48L92l97L13j41nJ99%l22O3K67N3
$$ y = [-88, -59, 118, 3, -202, 89, 1, -112, -9, -269, 50, -9, 111, 73, 172, 75, 9, 2, 35, 176, -207, 211, 1, -202, -55, 112, 7, 195, -28, 77, 222, 99, -32, 13, -133, -149, -66, 42, -158, -24, 225, -118, -139, -166, 45, -104, 76, 26, -89, 286, -66, 216, 239, 54, 82, 3, 95, 257, 265, 35, -116, 208, -179, -113, -60, -36, 186, 153, 200, -74, -92, 56, -347, 181, -67, -61, 8, -78, 165, -35, -49, 90, 93, 77, 62, 319, -140, 110, 176, -55, -163, -139, 203, -23, 232, 9, 43, 188, -19, -90, 91, -133, 54, -105, 171, 127, 19, -64, 38, 174, 79, -353, -40, 16, -14, 70, 163, 60, 236, -353, 91, -106, -68, 17, -78, -69, -64, 8, 78, 132, -124, -81, 40, 80, -222, -49, -24, -46, -244, 31, -120, 89, 28, 34, -236, -43, 13, -134, -371, -75, 132, -203, 265, 64, -178, 95, 55, 157, 273, -202, -21, -99, 77, -58, -2, -5, -233, 228, -124, 231, 89, -139, 49, -144, -110, -26, -125, 289, 457, -191, 201, -196, 117, -24, -29, 170, 170, -152, -89, 178, 231]
6875B31j16j99j92J87O1j5K1J46l7o8L3j38k89O55l80p8L42m02J54J49k2P6m3
6898G6k62K17k99J23K94k09L3k36K07J98J3J71l34k71L93l80M27j44j39K54pR4
6920B19j45P8j03k27J20L70n21J11k38N44J7k82J04k49K93j92J64j20J12k04J66
6941A7j53l1K17P1j10j09L51l94PK1K29j22Q3jO4j12K62j73j55J25j07k76M66
6964A70o2rk36j01J3L7K15m4PK13k82J85j7J03k73k5K85j22Nj69P1K92k13r5J31
6989G9J29l23L17q8j05O1l62M39N1k57O3j4k8K49m92L32J7K18o19M10L5p2O8j89
7013h1J07o4J98j9k19L0m9P0K01l86J59q9M33k47J29l40m1J35l5q9K94k3J18k66
7037g4j52O2M01j90l51N05j16R8l38K53q6K5K48l49jL6nn4P8k84RK1L93k23K4
$$ y = [231, 115, -84, -276, -89, -28, -43, -22, 124, 87, 19, 52, -86, -375, 280, -100, -178, 164, -238, -84, 65, 43, 119, 76, -186, 31, -268, -145, 149, -60, -27, -263, -56, 142, 155, 326, -8, -279, 114, -266, 161, 17, -122, 132, 125, 219, 74, 152, 49, -178, -58, 312, -209, -98, -336, 208, 225, -57, 47, -202, 91, -101, 63, -57, 55, -149, 17, -136, -167, 50, 121, 11, -98, 253, -141, -134, -113, 116, -6, 77, 76, 140, 28, 290, 117, -38, 87, -20, -296, 170, 108, 99, -137, -238, -225, -188, 27, -17, -10, 203, -79, 106, 89, 192, -81, -106, 179, 57, 62, -107, -36, 256, 43, -52, 79, 208, -115, 202, 114, 9, 70, -292, 147, 198, -59, 4, -10, -38, 211, -281, 51, 68, 286, -333, 77, 112, 40, 108, -81, 26, -38, 160, 141, -78, -48, -97, -27, 174, -212, -53, -142, 291, 44, 173, -167, -208, -73, -108, -197, 97, 74, 192, -74, -226, -164, 237, 47, -304, 201, 85, 183, -155, 98, 12, 37, 285, -64, -65, -29, -34, -88, -10, -294, -285, -264, 129, -94, -70]
7062g0J44m04L36K46N2l33M6l70L07j9M23j48j35k29J27L10l36K11l47nJ58J9
7084a7K3kq2K61j33m12K53L38j69J2J29k05q8j9K69m38K97L08m95J14N4Q3o0J0
7108C1n7k20L23m8J3p4K41j18N9r5j7j26J47R8K47m73J59P1J18k21J17o4K8j11
7132B8j5j88L60j9l79L41l77M31k42K05l1Q5j08l48L10j6n21N54L1j03P7J23q0
7155A18j20jK09l83K95j62j1r2L87l17j59K20j8j68J90O6J7R7O1n96K44K96l03
7178a30M24j53m73K90J99k89K31j37j47J49K00n01K91J60j29l11M01j57j86L00
7198C2K0l55K65n9M36l83k76M13k11m5J3J68p1Qj35M1N9N7Q7M7J06m21L62j27
7222C1J74L1j50j28K97k7m09R0J87r9j95L53k60Q0j21M24k52R1K33o01K74j44
$$ y = [-70, 74, -330, 6, 252, 304, -29, 17, -353, -46, -65, 358, 210, 75, -154, -27, 283, -53, 158, -189, -194, -36, -17, 6, 4, -78, 183, 50, -362, -109, 229, 60, 72, 201, -4, -92, -111, 158, -280, 17, 325, -170, -56, -2, 81, 21, 31, -26, -246, 77, 29, 42, -32, 209, 91, 150, 55, 38, -88, 59, 157, 404, -69, 90, 161, 279, 58, 175, 111, 139, 28, 13, -175, 185, 166, -213, 128, -249, 182, -60, 145, 114, 199, 91, -257, 53, 37, -484, 70, 101, -2, 75, 198, 118, -2, -3, 206, -177, 118, -44, -55, -147, 240, -77, -236, -16, -34, -202, -12, 54, 71, 168, 229, -367, -123, 173, -130, 294, 141, -332, -42, 157, -132, 99, -38, -185, -36, 164, -337, -46, 114, -15, -326, 75, -82, -268, 32, 52, -303, -38, -97, 339, -44, -320, 93, -118, -163, -150, 18, -53, -45, -180, -139, -80, -23, 64, 111, 217, -204, 158, 31, 205, 236, 86, -42, 255, 228, -181, -91, 96, -3, -198, 155, -105, -25, -146, 278, 26, 117, 350, -251, 23, -121]
7244a21R9J78j93N0j62K11N1j74j94J44O7J44q4J50j96J50m19J85J13l8J9J19
7266I9j07J60k64n9K50q6j42J19J80k92K04j05j99J33J57j32J71k28K44mM8k64
7288a17J14M2n5J48j85l6J62o6J15nO5l10L27N1k74J60J59j78j02n8M1K26l83
7311a59M4J51K23k57J55k63l3J72o2N0p1L64l34R7j59J08Q3j87L62l06J08k32
7333a46J16J7J81m3k66J60k93K53J6n4K9k67R4L00k50J94k24J41J6L0l5L9R0k76
7357a78K15k19J97k46M56j25k32J66Pr4m4Q6P7j65J13k64M00n09L91K00m46K71
7379E7l02KJ18J29KJ32j53L8M9j74p4L76p4J31o14O53m01k41O24l0m72K76n9q7
7403i4J48K50j50k23N7J63k13K64J73k70j20J98p4J52%m32K85k22K32l96L46j44
$$ y = [-121, -22, 156, -37, 13, -149, 62, 113, -61, -255, -111, -44, 100, 16, 166, -30, 120, -299, -114, -1, -39, -20, 99, -8, 152, -112, -171, 79, -7, -149, -30, 150, -142, 62, -43, -242, -109, 48, -84, 87, -141, 103, 99, 147, -117, -3, 39, -16, 132, -53, -89, 73, 7, 122, 117, 182, -128, 199, 250, -24, 136, 295, 117, 15, -43, -2, 224, -159, -115, 36, 259, 2, 157, -106, -139, 33, -29, 21, -50, 314, -20, 77, -82, 26, 109, -78, 284, -22, 86, -146, -30, -13, 168, 125, -141, 19, -274, -21, -5, -59, -30, -297, -203, 97, -153, 41, -183, -42, -26, 4, -31, 8, 98, -178, 37, -182, 15, -231, 225, 100, -132, 34, 41, -53, -97, -11, 66, -99, 14, -250, 150, -359, 32, 232, -214, 57, -245, -243, -125, 4, 6, 138, -15, 23, 72, -102, -176, 200, 126, 257, -357, 296, -105, -346, 278, 248, -224, 52, -7, -94, 54, 304, 154, -69, -12, 151, -62, 202, 375, 105, -15, 183, 109, 261, 261, -171, 114, -108, 124, -272, 74, -70]
7425g0N4J32j84R9j36J98p5K1j9q7J99J25m42K06k65J64K63m94L19j23J34N6k9
7448D6k80K65j09oJ13M4j86O7J56r1r7L24m25J70k5q4k0R0O6p4O8O8L5j69K14
7473A60k06P9Nj52K67k03L57n78M8K92k65L97m55J24J0k2J08q6pJ78j79K46J18
7496B36k50O2k22qK12k91K85o8N1N1k99J30K19K7J72m05M6M27n73L13q2O3N4j60
7520a0J12j9nK62k65Jj97J50l27O27k26jJ40k43J37l62L80l50J51kl74N60K2l77
7544b16R8J89N0k09L38k97K40k77J36np6q6K0p7QL3nJ02o9K73k36n7L1J18j05
7569g9j77L10J9j52J87k43K76k02o2j83L58r0J90j19k61K14K01k19K03k15l44
7590c88M58k21J5J7L13k36K80l07J7RQ6j72n4K15j14J01L14m56M9Ol0M01l43K64
$$ y = [-70, -16, 116, -68, 31, -105, 93, 18, 39, 20, -67, 132, 257, -185, 21, -244, -80, 183, -311, 8, -115, 19, 75, 46, -234, 31, -78, -84, 29, 73, -113, -46, 110, 19, -78, 246, -179, -9, -34, -118, -138, -48, 18, -56, 12, 80, 115, -54, 160, -46, 33, 38, -114, 153, -50, 307, -271, -223, 69, -196, 201, -254, -130, -120, -142, -34, -120, -127, 51, -128, 118, 236, -14, 48, -174, -182, 30, -261, 24, -44, 7, 58, -241, -111, 108, 135, 307, -98, -52, 375, -198, 115, 33, 96, 150, -10, 102, 83, 78, 340, 75, 76, -121, 29, -298, 329, 103, 102, 242, -1, 136, -226, 154, -196, -45, -47, -421, 139, 161, -216, -118, 71, 121, -88, 250, -47, 193, -84, 52, 47, -29, -115, -95, -172, -164, -131, -136, -34, -103, 170, -66, -123, -92, 26, -79, -256, 54, 73, -79, 108, -135, 141, -61, -123, -306, 52, -38, 152, 33, -228, -14, 187, -32, 171, -44, -388, 70, -151, -136, -119, 194, -42, 238, -69, -52, -43, 43, -129, -183, 32, -82, 19, 333, -123, -74, -68, -98, 303, -40, 224]
7614B24m05J90j59J66J07k69K20k86O6M75k59KP7k93mJ90L7j86K7J36p7K05j58
7637B6J21J01k47k15j96K80K71j58Q8r6k53M72J30l04N0j10K16l19K76j50l1L97
7659C49n35K59K29l33K18l34J53j11M6o1k4K00q0m5m7Q8q4R1O0k7J24k18J51r8
7683b9K40n03K17m7j22J21K32j77J60n2m4noR3J58l00K77j62j67L05m87J41J51
7706fN9J43k18k22K49J78l25k1P5K10K23o16K81j6J68l72L22k51J09Kk9P1r9R2
7730Gjl7L7O7j58P7K14l54K44k42K17J28m16J34L8L1J87k42K2K5J92k78L19p2
7754A39k44K73k36J57j76R4J23j05k3p3K95j95K88l99rM58l63J45j56k32M66l76
7776a49n1L0K72j3J3k13k1J56j94M0P7M7m2N6L44l98p4N1q6J15J72r1j36r2J35
$$ y = [224, -181, 9, -150, 16, 123, -146, 74, -212, -146, 329, 70, 72, 149, -144, -148, 42, 79, -107, -80, 56, -21, 184, 26, 147, 248, 1, -214, -410, -130, 141, -17, 71, -25, -278, 194, 324, 20, 70, -40, 176, -143, 133, -17, -48, 349, -186, 73, 302, -31, 187, -147, 6, -105, -59, -120, -144, 56, -24, -69, -116, -28, -112, -21, 39, 12, 136, -82, 69, -29, 211, -292, -75, -122, -244, -123, 109, -68, 92, 40, -4, -9, -15, 78, 236, -64, 213, 51, -116, 189, -298, -157, -6, 53, 196, -22, -244, 5, 183, -142, -163, -88, 122, 345, -271, 10, -6, 162, -210, 112, -139, -30, -28, -57, 14, -85, 7, 6, -31, 6, 73, -85, -8, 206, -148, 96, -146, 71, 199, -217, -83, -45, -14, 173, -69, -47, -22, 170, -108, 211, 139, -105, 168, -68, 89, -87, 7, 130, 25, 2, -71, 224, 29, 317, -82, -91, 367, 4, 149, -7, -239, 227, -149, -200, -170, 102, 89, 102, -111, -132, 24, -170, -130, -53, -6, -48, 8, 352, -46, -120, -69, -155, -40, 132, 41, -95, -187, -52]
7801e2J02N3j30j4J54p9k37J33K50j05k83Q2k2J09o5L18j46M8J4k84l2K58J52
7824B24j7m40K32j22J41l7l6K48j95J24j54k45J63L64l70J26J98k45L7k67L24
7845E3q0k2NJ68P2j64k6Lk5J06k85K86k14J59m3N8J32m05L91j58K80k44M3k33
7869a43K91j78k07J32K33j19N2m5k33M67m44K81R8k55l2L18j72l9M1j57J72K14
7891B75Oj42j41J00k77J92P0j70P6K94j71j28j4l8J3O0j31L11R7j87l1P9Kn%p7
7917F3q3qj32j72J91J51N4m03K87j1O2J83j4k25PK77k35k57M03l45L33M1j53j36
7941a22L87l79Q5M4J32n7N6k31J6o0J59R2j27L31m98L51l16N5R2l83L81k9L3j02
7965i0K6J05k41m8L0L6M35j33k62m2K02j12L04k56K63n2k38K42l04N0j90K40K4
$$ y = [-52, 50, 103, -27, -41, 113, 34, -203, -70, 180, 75, -208, -126, -148, -39, -104, 214, 68, 116, 130, -154, -186, 72, 224, 207, -233, -1, -123, 18, -19, -55, 193, -2, 122, -32, -277, -114, 250, -120, 6, 204, -41, -4, -271, 53, -27, -49, -44, 124, 196, 32, 6, 9, -16, 90, -195, 91, -123, 36, -7, 51, 183, -222, 169, 11, 291, 47, 90, -143, 148, -30, -237, -105, 128, 9, 61, 16, -217, 250, -194, 87, 185, -70, -102, 216, 44, 5, 46, -111, 61, 275, 281, 139, -2, 98, -179, 13, 83, -87, -11, 283, 112, -16, -30, -68, -55, 5, -126, 185, 282, 95, 64, 143, 145, 140, 140, 63, -20, -28, -160, -332, -141, 10, 64, -339, -52, -63, -1, 182, 168, -57, -50, 227, -8, -265, 138, -207, 126, 167, 14, -122, 265, -114, -29, 15, 147, 90, 146, -85, -69, -129, 30, 122, -5, 326, -172, 179, -137, -82, 10, -373, 8, -21, 12, -90, -64, 41, -200, -248, -218, -182, 253, 120, -142, -184, 18, -94, 210, -46, 217, 165, -73, 169, -135, -85, -275, -35, -11]
7988a1j15J40L18p6k96j77K99l43K61q9j09K71n4j33q1K11k4J20n07M85r1K14
8010B13k41Q6R6J66m24J30R6j45J31k72J18J17k63K93l81M15j20q8Mj47L90J8
8032A92J6o6k62J52o5J89M7k06J52j73kj5J24M2o4l33N43j27K81n28R2K26k29
8055a4j34J24J8J62J58l33k04J89J20j79P9l9K04k40J1O8k60L34J31k89K40K7
8077A73q7P6j24k2J43l55K23rr8j29L96j47j23oo3J25pl9j18o9J99M9J13n0M7
8102I8k01N2pm6j2r3P1m6K09J12k01Q4j9j29J05J42k52J2J70nn3J32k71K19r9
8127b8j06L13j57P5J43l10K69r6J6m0J55k57j14Q7M62m50r5L84l38P1M6J30j06
8150E4J50j54j56L5L9q2j88N13l90P0K78j79K8l6K3l61J20K85j82J14N8j06P3
$$ y = [-11, -126, 14, 332, 256, -40, -217, 82, -261, 0, -89, -198, 73, 19, -114, -195, 16, -8, 112, -395, 90, -1, 213, -28, 58, 154, 320, -104, 26, 122, -23, 108, -164, -46, 71, -192, 101, -280, 135, 15, -73, -69, -216, 174, 192, 208, 142, -120, 32, -33, 156, 203, -3, 149, -24, -26, -41, 83, 125, 61, -272, 271, 144, 425, -103, -11, 215, -14, -148, -24, -6, 156, 314, -19, -223, -34, 86, -93, -14, -53, 151, -89, -78, -10, -270, 64, 195, -94, 146, 173, 86, 162, 38, 16, 159, -196, 27, 18, -80, -209, 187, 40, -83, -89, -152, -27, -34, -73, -191, -260, -61, -12, 101, 51, 98, -103, -51, -58, -104, -116, -209, -138, -184, 25, 137, -64, 20, 1, -128, -23, 119, -133, -121, 49, 44, -9, 123, -148, 71, -28, -134, 179, 22, 97, 240, -70, 199, 103, 119, 79, 234, -23, -137, -50, 412, -38, -133, 251, -87, -16, 30, 160, 54, 204, 50, -106, -71, -32, -114, -302, 211, -179, -109, 169, -10, 18, -18, 5, -356, -236, 49, -133, -19, 39, -67, 6]
8173FJ84k62J78j97R8M24n21q3M01k38j33J91j42J43r5J57P0k72
$$ y = [6, 190, -72, 106, -91, 7, 431, -90, -173, 228, -10, -143, 48, -94, 49, -46, 111, 181, -91]
8191i1
$$ Imaginary data points
##PAGE= N=2
##DATA TABLE= (X++(I..I)), XYDATA
0@%%%%%%%qJ6j6J6j9K7l2M0m9N7p2Q8j04J20j37J61j85K10k42K78l18L62m10M61
31B44n17N81o50P24q09R02j000J109j230J362j510J672j851K052k276K527k812
48a482L138l516L961m491N136n945O990q400J0422j3583J9270l2698J20512J09437
62B08751k11836j01138M6499J21501J6835l9715n0400j6980l319M0815M7250J021
74E9284o9607m3842L7051P1895k80o3153l5960M6943O0440n273o2305l1691K8029
87h469M3745R744k2571l2886j5956J9131M4338J7081m1117n8077J959O0741L9663
100E7326l0531m6391Q84L1928J2735j0630q110l537r909l772J6349J2440j8349
113D33k5115J2503L4214l114m4742k3971L2777M3851o461m7998k3320L2612L9952
$$ y = [0, 0, 0, 0, 0, 0, 0, 0, -8, 8, -8, 8, -11, 16, -16, 24, -25, 32, -40, 48, -56, 64, -73, 88, -97, 113, -129, 149, -169, 193, -217, 244, -273, 308, -342, 382, -427, 475, -525, 584, -646, 716, -794, 878, -973, 1079, -1197, 1330, -1482, 1656, -1860, 2101, -2390, 2746, -3199, 3791, -4609, 5813, -7770, 11500, -21198, 99314, 208751, -3085, -104223, -57724, 63777, 80612, 40897, -9503, -26483, -29802, 11013, 58263, 59284, -10323, -54165, -17114, 54781, 54501, -8652, -44612, 2331, 62771, 57498, -4807, -36498, -8469, 35276, 45020, 22449, -10437, -26393, -7262, 37076, 54157, 13040, -45037, -43078, 17663, 57326, 26795, -19596, -18712, 13216, 25951, 15321, 7211, 3674, -6235, -10007, 6342, 18782, 433, -24682, -12179, 22035, 18921, -25821, -49792, -17015, 26836, 20375, -27623, -50943, -18331, 21621]
126B1621m178k9687r181J2838M243m650P608J1528j1292k4434L094L0637J1157
139A9304k8267k3018J4761K6330k543k3672q681J7737J7100o368j8090n397J1969
152h835J4772L004j0894j4628k008J5115J6068j643j8789j5358N539J9941J0097
165A2381r847j6470k919J0476J1742K349p589q560k289Q020J1334J879j2325q428
179a0246J0863J5354l411j6538m986J2862J1394l875j1902n488M481P506N267
192A1281p34o876p247K65R807R699k023j2597r228P776J6900K203j5396j0961
206g131P839J3421J96j0767o024N131O461j963m333j346J760J920N22l64k928
221B394j408J801K940J215p32k557o24J959J927j08k203k898m81L210J732k924
$$ y = [21621, 17443, -12244, -21425, -8587, -4344, -8994, -1386, 10142, -1150, -25584, -22490, 8147, 19304, -8963, -31981, -17220, 9110, 6567, -17105, -25786, -8049, 9051, 2683, -15407, -20804, -8835, 5937, 8941, -1953, -16581, -18589, -3474, 12594, 10951, -7838, -23196, -17657, 2284, 12381, 2534, -13936, -16855, -6379, 5363, 7712, 123, -8437, -10726, -2706, 8628, 10507, -1818, -10246, 617, 15971, 12560, -3978, -8964, 3898, 15292, 11417, -485, -5973, -1492, 6014, 11281, 10547, 3671, -3576, -3311, 6496, 16195, 14172, 1575, -7653, 123, 17023, 19226, 3830, -7131, 708, 14129, 14325, 3558, -2466, 2665, 9126, 7163, 2830, 1484, 3244, 5164, 5686, 5322, 2394, 986, 2787, 5727, 6942, 6210, 3653, 3029, 4988, 6915, 6807, 4604, 1706, 1225, 4435, 6167, 3243]
237C243k414O49J424O99j652l980j627M846M477k236p413k246O348O162j099p356
253b175l622K050M796L451o93o439m819M008O665N90o594n215J446N838K995l039
269g57m862r70M277L855r62n097j625L155L764n27k363j065o40K111K500J93m082
286c095l880J286M875K728k783m898j001L790M483N06m757n343Q30P398L759l921
302b3n040P28M677K588k154m087j018L027L289M03k640l062J162L862J612l168
318A56k562jJ421K760J556k422l149M96K924J767j450k492r70J715J759R51l37
335B122k486k296J890L358o63l317j209K857K319J15k264k368L28L047J921j885
351A469m057r45L818L837j398m074r46K114J355P0j701j595N96K555O77j734j393
$$ y = [3243, 829, 1478, 2902, 3601, 1949, -2031, -3658, 1188, 5665, 3429, -3984, -6230, 118, 6280, 5181, -2175, -5797, -3747, 1049, 4500, 3807, -2632, -7451, -3443, 3222, 3812, -2782, -7997, -6551, -713, 2282, -757, -5619, -6589, -2312, 1543, 581, -4516, -6141, -2986, 778, 251, -2112, -3177, -3817, -1706, 794, 987, -3095, -6975, -5689, -814, 1914, -869, -5767, -6768, -2978, 1505, 2011, -2746, -8089, -7259, 139, 3898, -23, -5063, -4335, 342, 2930, 776, -3311, -4329, -1302, 1987, 2390, -250, -3312, -2150, 1712, 3324, 156, -2406, -2407, -986, 1774, 3330, 908, -2241, -1745, 1179, 2946, 1496, -996, -1966, -251, 1508, 2459, 2122, -364, -2660, -770, 2588, 1925, -1392, -2601, 256, 2575, 2690, 426, -1942, -1614, 1433, 3354, 1469, -2588, -3533, 285, 4122, 2724, -1350, -2296, -182, 1173, 1243, -458, -2053, -1457, 1098, 1775, 41, -1352]
368a352Q4J254L17m48q56Lo68K75K190Q38k443l077J793K827J07j603j165R0Q77
387i57J344K09j329j674L8J979M28j201j148J256J113J62p32j876r95J807J969
404C93m22k612l76K468J962r48j771m40P58kn2N33K99n24K67J274q53j275L78
423i43M75M9J72k01J61m5K38P53R99r15k076l30K465J571k09r20j308j43K039
442A832J051k175j319L79J914O52j028n34Q02N35o24p55K36L48K8J003L51p56
460A940j026J038P07n89m13k9j8o7m45M26p1m75r2j85K08m98O4O30m31q12J037
481H99M86r88j97J135N79r84q96k7J089L49o27q45J23QM48J39r12j524K96J351
501i8J0q27o24P94M37j39o34o55N18J58M62j36k87k98J042L08j458j043O79N06
$$ y = [-1352, -1268, -14, 303, -145, -1001, -998, -1666, -1391, 799, 1637, -806, -3883, -2090, 737, 844, -759, -1924, -1834, -957, 387, 596, -733, -2407, -2369, -390, 38, -1163, -2311, -1055, 58, 220, -512, -2388, -3383, -1576, 393, -29, -2641, -3017, -549, 1413, 465, -1306, -1746, -988, -990, -1042, -509, -210, -734, -467, 807, -46, -1321, -943, -468, -419, -247, -448, -287, -332, -94, 659, 1658, 743, -1333, -1663, 802, 2373, 2164, 1244, -64, -207, 1832, 2883, 708, -611, -232, 1682, 2334, 1306, 772, 1574, 2109, 1485, 730, 966, 1314, 1342, 2345, 2696, 1940, 914, 1952, 2659, 2070, 1657, 1628, 1610, 1543, 1098, 1524, 1453, 978, 886, 701, 909, 411, 475, 1105, 674, -138, 899, 1385, 397, 200, 1335, 1914, 930, 34, 7, 1096, 1445, 818, -27, 96, 104, 552, 691, -221, -1745, -1449, -98, -88, -915, -1539, -745, -308, -447, -1081, -1736, -1218, -1060, -598, -734, -1021, -1319, -277, 31, -1427, -2470, -1791, -1285]
521a285j70k13M93j79n45q4K5L45j34p62K96M42K0M12M46j024l86P00O32j013
541a984n59J317N74k33r25o94K37R73K98l6j200o57P85K057L21j955p99N21J209
560g50N28M19j31j292j02J789M83p67j014k47R66P64J6j006J32l19N34R26m75
579D54r80l58J510N57L60n99p74l21R93J374l56j354r78Q35J973M68k321m41O45
598F87M29j96l73k50k92Q22K46n30l83k60O20O28L9o24K21o10O3R59O87o55j647
619d19K46J021J62n93p88k58J39R69M77j437j082M76J433Q13j019j525M12J356
637C83L96m28j58q22o78Q89R44m59j488p34P79J361k02j097k84m48Q55J152o62
656g01j259j59J211Q09j95l10l34k33k24N88O36k99j014o94J474J054p94j515
$$ y = [-1285, -1455, -1668, -1175, -1354, -1899, -1983, -1958, -1613, -1747, -2509, -2213, -1771, -1751, -1339, -893, -1917, -2303, -1603, -971, -1984, -2543, -1226, -652, -885, -1810, -2504, -2267, -1294, -996, -1032, -2232, -2889, -2104, -47, 274, -1681, -2480, -1959, -750, -222, 197, 66, -1226, -1328, 461, 944, 177, -837, -1084, -118, 646, 662, -344, -212, -531, 3, 929, 454, -526, -884, 626, 1183, 1543, 944, 170, -151, 842, 2216, 1860, 506, -472, 363, 2336, 2804, 483, 42, 687, 1116, 920, 547, 297, 5, 827, 1073, 543, 160, -100, 520, 1148, 1187, 563, 784, 174, 237, 1196, 1883, 1228, -419, -173, 848, 1010, 417, -371, -629, -490, 479, 956, -481, -1563, -1087, 346, 1159, 140, -1385, -973, 383, 779, 351, 193, -629, -1307, -418, 526, 67, -1421, -2155, -1376, -15, -217, -1314, -1598, -2046, -1191, -39, -701, -1960, -2119, -908, -99, -294, -604, -938, -1171, -1395, -807, -171, -470, -1484, -2178, -704, 350, -444, -1959]
674a959o87O58P25Q72l17j014JJ177O28l05p76n7L29N19j42n7M32J10o31J49L57
695A2l95j51K10j73M94O30l89m06J99O90K34q07k27N17N48M15n97j5N77j38l37
716H91J31j11j56j4L73k08J54n08K34l39J79R9J8k76J02L15R40n88q32L28J014
737A746n32n07N0J77J39n4j12l27K69r2k30J5M0k74K58R0J62j5j11k00o66P39
759E65Q24n92l49p16J64P46J26o34n41K16n0L23n6l12o0K26Mp43M87P11m88n41
781f90L33M34k49l39R7K72K25l65n29K77j85L31Q4J34n42l86L52P6N3K58L0k60
803e89n52P66J89m8k5n4p2m7m8L05M79k75k76l8m5K26N4M8%o32K61J39J46L52
827B64l9k2k68j55L78L19M07n72j68M59l69K95J73R5n31J51M49m5k49j36N94k40
$$ y = [-1959, -2646, -1988, -1263, -391, -708, -1722, -1721, -544, 84, -221, -997, -1054, -725, -206, -348, -405, 27, 137, -494, -345, 12, -383, -534, -324, -497, -3, 627, 238, -168, 31, 721, 955, 148, -79, 438, 986, 1401, 804, 789, 1366, 1228, 891, 1022, 911, 755, 741, 1114, 906, 1060, 552, 786, 447, 626, 725, 743, 467, 569, 884, 1824, 1236, 404, 732, 1746, 1214, 707, 757, 934, 1073, 1019, 907, 580, 849, 757, 527, 542, 582, 308, 566, 656, 818, 803, 692, 492, -174, 565, 1389, 797, 448, -268, -104, 642, 768, 134, -407, -191, -241, 82, 26, -286, -346, -120, -116, -859, -372, 339, -149, -690, -357, 77, -172, -511, -414, -142, 83, -282, -811, -534, -719, -388, -304, -170, -712, -1098, -746, -670, -617, -359, -329, -589, -1141, -375, -186, -234, -259, -313, -385, -432, -480, -175, 304, 29, -247, -285, -330, -104, -50, -2, -2, -634, -373, -234, -88, 264, 225, 203, -65, -220, 158, 477, 884, 312, 144, 603, 234, 529, 702, 797, 266, 417, 866, 821, 572, 436, 1030, 790]
849G90j91l2K66j91O8rP52m84n16J56O62j17m52J58J27k78J03L3K65p9n66J91
871F56N57m88l96J22K88k34j30L93m35j78M48J49k45j00k53P1J11P6J03j99m3
892B73m49J42M02l37L50l09l08k29q6M06o9k23O9l0J96n01L96p7J48l81k30L72
914d75K6j04j10K81j10n50P22P2r9j47J67k10k34k9J89O13l82m33L57l8n49L66
936f77N87L4p16o0J42q8M65J81j03l81l10N24N7M33l10k5k10Q3K5M57M11l20l16
959a17jj85P2M74K48k80j79k63O49Q8jj80J98k74q2J80K80n4k26J43L90l56j43
982C81K64m5J17K2o1o5k23p2M95J96l54p4M48n34J43L83l18l26k46L13J10j19
1004D35R6l53o4K3R7k72K29j09m22K72O39j45n15J45p4J31Q3k45o2k31P7j43K62
$$ y = [790, 599, 567, 833, 642, 710, 701, 1453, 969, 453, 609, 1271, 1154, 702, 860, 987, 709, 812, 845, 1110, 1031, 465, 656, 1213, 725, 329, 451, 739, 505, 375, 768, 333, 155, 603, 752, 507, 407, 154, 225, 336, 412, 515, 316, 273, -176, -34, 368, 31, 381, 72, -236, -465, -551, -145, -214, -437, -368, -398, -202, -703, -307, -384, -236, -617, -847, -475, -449, -553, -663, -382, -492, -1042, -320, -248, -347, -494, -327, -537, -771, -800, -611, 2, -380, -813, -456, -494, -1043, -677, -90, -56, -772, -832, -690, -778, -313, -132, -235, -616, -926, -402, -345, 88, -222, -247, -457, -374, -349, 108, 519, 199, -117, -118, -303, -231, 243, 491, 211, 32, -231, 418, 506, 505, 325, 523, 249, 167, 347, 627, 573, 347, 490, 880, 524, 381, 645, 600, 717, 739, 678, 613, 390, 318, 813, 1009, 655, 581, 1029, 495, 638, 1021, 703, 377, 131, 444, 554, 435, 531, 178, 114, 137, 234, -38, 191, 82, -340, -68, 571, 426, -89, 56, -18, 113, 196, -49, -111, -342, -265, -408, -146]
1027a46j21k03J77J62k92L4P0j17n4L7J61o73N49j37K71k39J40l4J08j55l3j0
1049e05K3p6m03K49K4l03J59L71m73K06k00K81P6l34M56n03M77k25lL18P9k07
1071e13k19M18l68m7M58k20nk03L08j56Q6K92k34k34M3J63N26K15m80j15K73K94
1093B82j93K97k98K24j33j71J49J61k77L22k8k94J27M24n00K09q4k0L03m50M56
1114E06l5J3j5R4j70j15J48J58m04M26l52Q8K49m63q5K33o2k1l1J34K1l52L28
1137B93J64m16M45l56q4M1K67p7j17j13K88j35K52m82MM8J34O0j42J2j07l10O1
1160b70J39J0l60K57K03j40J69m38L65j80j69M32j80j69j83L14N0j53l77K58j7
1181d39k05L4J34J79j76J08k40M11N7l28J7J09K64o4j06l57o0L05L18m05k47K17
$$ y = [-146, -267, -470, -293, -131, -423, -389, -319, -436, -490, -453, -292, -965, -416, -553, -282, -521, -381, -415, -307, -462, -495, -505, -482, -558, -961, -712, -688, -991, -832, -461, -934, -728, -928, -647, -571, -905, -449, -952, -475, -700, -703, -385, -306, -513, -732, -314, -682, -729, -271, -491, -496, -699, -391, -547, -461, -169, -403, -637, -594, -431, 95, 310, -170, -285, -12, 282, 89, 386, 88, 312, 179, 8, 157, 318, 41, 363, 335, 41, 168, 592, 92, 301, 217, 197, 500, 50, 506, 471, 484, 469, 563, 393, 278, 426, 584, 180, 606, 254, 342, 591, 128, 43, 276, 214, 193, 162, 296, 317, -35, 293, 457, 41, 486, 130, 46, 87, 354, 277, 160, 47, 335, 200, 452, -30, -26, 22, 156, 216, 74, 86, -21, -331, -270, -131, -121, -481, -224, -21, -161, 8, -430, -65, -245, -414, 18, -162, -331, -514, -200, -150, -303, -680, -422, -439, -644, -610, -476, -297, -473, -365, -605, -194, -137, -465, -448, -339, -75, -139, -245, -602, -662, -357, -39, -444, -691, -474]
1203d74k49N22l44q4M02j55L2M20Q2k76J54q1J5k50L11J69k51M92m25k00K91J40
1225B41R5j63j57J7j12M42M5m4k99m8n2K37Q1L65l28k14J97K9K9L00j52J90m56
1248B43J07J81j77l79N66J25l93k0O1N3kQ7j36j68J26J38L94m86K27k00k13M6
1270A80k92M85J86k80m77M84P9m08j51L53k43n4j12M8K07j45N9j65j29J59L4J27
1292e5K3l15j35M56j2j15L3k43k8J8J61J10m14L41p8J56l43l80P6K90K57o8m5
1315c10n8k16J12K10k33K03m3K76m95j59J58o2K63n14L67j0J78k16K28p9j47J36
1337d11m2K46P2o1L24n89K91NJ37J48k21J96r6J59m09K30J13j80n3J43J09r5K29
1360B45k45K62j07n4J18K96j87j14k16M8J13L83k71J84k4J6J67l35P1m9K75k79
$$ y = [-474, -723, -201, -545, -629, -227, -382, -350, 70, 152, -124, 30, -51, -36, -286, 25, 194, -57, 435, 10, -190, 101, 241, 336, 173, 16, 33, -79, 363, 408, 364, 65, 17, -35, 202, 283, 648, 320, 106, 303, 332, 361, 661, 509, 699, 243, 350, 531, 354, -25, 541, 666, 273, 253, 314, 367, 365, 452, 316, 148, 274, 412, 806, 320, 547, 347, 134, 180, -112, 373, 559, 279, -198, 286, 365, -43, -194, 159, -84, -138, -250, -202, 5, -140, -81, -246, -375, -216, -182, -55, -32, -347, -482, -26, -38, -153, -120, -363, -391, -373, -212, -102, -516, -175, -253, -97, -440, -820, -744, -454, -197, -265, -310, -368, -584, -472, -262, -495, -292, -335, -59, -554, -713, -555, -617, -354, -868, -501, -511, -333, -549, -321, -400, -547, -411, -453, -207, -135, -196, 128, -461, -170, -165, -28, 120, -101, 95, -1, 158, -251, -21, 92, -88, -141, 2, 111, 16, 245, 0, 262, 155, 101, 219, 515, 328, 214, -2, 46, 159, 542, 271, 455, 431, 447, 614, 279, 350, 301, 576, 297]
1382B97rK12k19L61j64j52N2L00n25K74%j38j56K80k02ON4k17j33M97l24n2M00
1405D42k06j4j81J08P4k70M2L6K1nJ2j34j48L11M9l25j88K40K5l77J00n0n1M06
1429h3j57j12M1K34m46L18j58M3j2J16j04O4j98p2M09k52m8J38m11K00m1Q0K0
1452d31J5j28J40j13k7J26K13l6m4o8J02J01n24O53q5P3k69K48r0l70L54J28j10
1475a42k20J93j46p0K50K24j27R7J42m80L57LL4m8j19J36l8M78m65p6P1R3j27
1498B0J7Q4K31j85n8K13n0l61J67R7K14k00QJ21R2k32J67J02l39L08l37L06K83
1521F68l99Q0q6m6j91k3J25K90l49j7L17l31J0K7R6m4J81M8l98Q8K58l62j45L45
1545A42j70k22M52k09k1P5OJ35n55O56k91n8k01J74J20k19J92L5j14j69R5j8j09
$$ y = [297, 288, 500, 281, 642, 478, 326, 378, 678, 153, 427, 427, 289, 133, 413, 211, 217, 271, 54, -79, 418, 94, 42, 442, 236, 222, 41, 149, 223, -47, -5, 31, 52, 47, 59, -75, -223, 88, 137, -188, -376, -136, -111, -488, -388, -438, -489, -83, -240, -352, -311, -77, -523, -205, -363, -320, -332, -216, -320, -256, -454, -526, -117, -369, -417, -279, -690, -490, -531, -451, -431, -416, -544, -404, -517, -544, -418, -205, -241, -285, -353, -251, -150, -674, -21, -106, -33, -302, -54, -144, -514, -160, -32, -142, -362, -169, -315, -385, -135, 89, -38, 59, 201, -279, 78, 81, 115, 67, -52, 84, 46, 524, 59, -17, 54, 147, 20, 37, 121, 352, 167, 109, 322, 272, -89, 78, 175, 389, 189, 197, 318, 410, 178, 345, 447, 108, 416, 79, 385, 668, 269, 349, 263, 217, 26, 3, 128, 418, 69, 52, 369, 38, 48, 75, 171, 127, 308, 356, -42, 46, 304, -58, -203, 142, -28, -250, 202, -7, -28, 47, 53, 188, -367, 289, -2, -60, -261, -87, 33, -186, 6, 41, -73, -242, -147, -165, -274]
1568b74m4K38Q6k78k24M30l14j8L41j19L8m3j07L62m60m7J1L68k17q8M56k95P
1591a91M2J9l16o5N32l9k21K72o1Q7n6K6k18R5j39J37k46M39l27J59J48M2k68
1614a49M27m69J74J31k1j16K98K00l29Q0p2j59J53qpJ11k33J40J6J80j03L40l17
1637B67p6m8q4K47J94J8k87k15O6O5L92k56P8N0m8l18L02L5j68j93M54j36k9k02
1661A08O1j29K51r9n7L92j90n98K94K19l12j76L80l62J62j79K28l69K48N2L01
1682B25j5q3n3j37J19k57P9k28J05J1OR4j70l2%l0K72j4j57j84K10m5o3M9mJ6
1708b86K51J02j62k1J9k25qK46m24K77j3R7k07J63J37j61l45K08K27qj20p0l0
1731c53N9K54j13J28M9k43J56l8J35J80q2j14P9k03n1L00l32K95k31M2M04k55
$$ y = [-274, -318, -80, 6, -272, -496, -66, -380, -398, -57, -176, -138, -181, -288, 74, -386, -433, -422, -54, -271, -359, 97, -198, -191, -149, -130, -446, -511, 21, -18, -239, 33, -28, 59, 3, 29, -189, -94, -233, -96, -342, 97, -230, -71, 77, 119, -149, 278, -191, -17, 114, 93, -23, 275, 475, 146, 226, 154, -5, 148, 140, 133, 244, 11, 151, 167, 347, 244, 584, 267, 191, 143, 59, 306, 500, 518, 231, 16, 82, 147, 539, 283, 361, 411, 363, 45, 347, 382, 214, 21, 475, 339, 310, 108, 169, 40, 291, 192, 135, 527, 337, -261, 33, 252, -60, -236, 144, -218, -56, -235, -7, -376, -128, -76, 225, 210, 127, 74, -63, 56, -201, -122, -350, -245, -234, -228, -134, -304, -336, -336, -366, -94, -108, -265, -449, -239, -284, -347, -298, -302, -286, -35, 67, -95, -116, -97, -322, -330, -84, -508, -231, -244, -147, -354, -191, -54, -215, -560, -352, -125, -133, -253, -323, -353, -294, -40, -153, -25, 24, -219, -63, -101, 34, 214, 132, 18, 97, -106, -157, 143, -189, 106, -125, -83, 321, 66]
1753F6P6q6l7K69j14P5j27J75J26j08j10Kp8K27r3l51K64k1k26K32N8K22k67n1
1777A23K74j64J4j58J13K18j75m4j09j19K43L7K84k36k62NJ70J21j02N1j97J6
1799A03J97m26J4L81j37l07M12j38j28J41p9k07j26P31m47j43R1j4J52j92K6M9
1821d7m6k01L0Q6J19k58K69n0k9j66K53R1q4lj14J02N2m23o6K94l7N4l5O9o7m9
1847b56K67k36k70O6M90m08k81M83j34p9K35o1Q1Q9m1J37r1j74j03K61J77k03
1869e1J98q8J1k13j69L15L0j61J90J70L15n27K33l29MJ96R2J09o5J8p8j35K8J66
1893B59K04l59l66L77j34J03j86L94o4j30mP2K43k63j02L12J67r7m32o2K93k3
1915B02J08j95j63K69j23K21K7j26k17K44j3p3M0r4P4K0k32L02j26q9J95l09L39
$$ y = [66, 142, 56, 19, 288, 174, 249, 122, 297, 423, 315, 205, 207, 129, 356, 263, -88, 176, 155, -71, 161, 219, 441, 174, 123, 397, 233, 247, 89, 202, 420, 245, 201, 92, -27, 216, 253, 537, 301, 39, 44, 214, 335, 233, 284, 87, 103, 300, -126, -112, 269, 132, -175, 237, 99, -29, 112, 33, -174, -300, 431, -16, -159, -68, -82, 70, -122, -96, -47, -93, -294, -264, -178, -59, -317, -48, -98, -127, -293, -40, 51, -33, -36, -150, -48, 4, -419, -485, -191, -228, -174, -209, -140, -207, -256, 11, -225, -495, -429, 61, -347, -628, -145, -279, -358, -123, -184, -103, -14, -55, 82, -9, -183, -286, -25, 152, -51, 147, 59, 70, -143, -312, 3, 33, -128, 62, 232, 547, 20, 253, -76, -72, 124, 216, 325, 260, 278, 200, 65, 93, 259, 463, 104, -262, 115, -19, 84, -102, 292, 228, 98, 94, 166, 409, 146, 44, 356, 523, 426, -6, -68, 225, 202, 310, 115, -48, 221, 98, 319, 346, 220, 3, 247, 234, 161, 201, 107, 181, 201, -31, 271, 145, 56, 251, -58, 281]
1938B81m5j70m14J88J50K2o6J22l74K24J34%r5K32l9o31O06m19K55m00j6L07K02
1961E4j72k82N58l48j36K57oP8r1K3j11p9j93J1J5L08Pl07J48N37k08j27J3P8
1985B7K3k43J11j38l0N5j92J17L00j19mLJ52j59r1L81j86O7q4O5N6l30M11pj00
2010H5j44M44k64L78m08k3J26N5k94J50j14L60m0k50L84j61k60K26k10j35J92
2031I7j80R6M1j93J13M81o30M71k09j42K54l62L78k3L3M4o03N46L38n19J6M68
2053E15n32K91j78o9J46Np6R8j90J59k46P1J12m7j44k24N30k33k82M12N4j05l19
2076b52Q9L37m29L52m00K47k48J98K88j85l2J51k36j82M69j48j96j8k06K2L78
2097al90P4Q6J29O1j93J74j9Q0j26J8Q2k05L0M6R1J24j64j23P6j61K40J94k57
$$ y = [281, 236, 66, -348, -160, -10, 12, -54, 68, -306, -82, 52, 52, -43, 189, 150, -481, 125, -294, -39, -439, -455, -148, 54, -118, -400, 158, -190, -326, -69, -75, 3, -88, -65, -176, -255, -448, -437, -422, -114, -107, -414, -266, 271, 63, -64, -51, 27, 50, -193, -82, -220, -250, -195, -387, -270, 30, -89, -93, -90, 62, -97, -188, 193, 7, 74, -10, 55, 111, -219, 192, 185, 85, -59, 385, 121, 499, 91, 68, 194, 249, -45, 105, -9, 351, 311, 61, 445, 284, 24, 250, 40, -95, 97, -83, 13, 54, -139, -26, 455, -175, 296, 87, -55, 199, -163, 215, 192, 225, 269, -334, 212, 550, 31, 47, 515, -17, 274, 96, 27, 173, 178, 102, 200, 10, 169, -77, -6, 106, 59, -85, -309, 221, -12, -294, 118, 172, 67, -252, -163, 174, -255, 97, -303, -56, -304, -106, 182, -3, -35, 116, -120, -302, 167, 19, -177, -195, -401, -379, -1, -391, -317, -231, -102, -41, -234, -60, -79, 1, -125, -107, -25, -230, -200, -154, -63, 61, -103, -226, -150, -311, -71, 123, -134]
2121a34j63L42k26K85k67K59j58j74M21k67j3R2J59j27k25J96K16l3j73J78j81
2142GJ00R8j65K0L4l4K17K4j43J49l84K87j9K54m03K93l08J7L2L4K52n6j91j3
2166A02L3j20J55K19n37M47j61l18L40m6k6R1M5l11K48N2M0Q9m41K23k76K81j55
2189b6o4L6j62L2j06M08J1Qj46M4J90J56n17K01k89o5J90O2j54J71J09J01l08
2212a18nj50N03l24l1k40K57k01n6L91m09L88nj75K64k63MN3J12l88L28k81K81
2235f5j68N2m9P4J70l41L21m2R8k79K13k38J11J07m5J26J6l97K45J7pN7M1oK3
2260C4l34L14k5N5J29j83k55K35K22l23L95j35m6k93L12J28l19L07l92N06l17
2281A5q7j16M14l11J36K24j88j8o5L17l90L1M57k85k14lJ73J69q4J24k15j16N1
$$ y = [-134, -297, 45, -181, 104, -163, 96, -62, -236, 185, -82, -95, -3, 156, 29, -196, 0, 216, 183, 10, 188, 7, 107, 205, 40, 60, 94, 60, 277, 301, 158, 307, -77, 210, 191, 445, 42, 335, 27, 44, 76, 110, 362, 306, 115, 102, 135, 15, 170, 389, -148, 299, 138, -180, 160, 114, 88, 179, 224, -87, 161, 213, 253, 342, -99, 124, -152, 129, -26, -90, -54, -216, -184, -290, 118, 129, 137, -9, 35, 225, 381, -136, 65, -224, -289, -99, -37, -191, -20, 89, 190, -118, -123, -273, 230, -94, -125, -365, -108, -309, -365, 26, -383, 5, 0, -175, 89, -174, -170, -117, -5, -393, -65, -346, -65, -233, -181, -230, -156, 14, -327, -6, -48, 50, -229, -16, -254, -143, -36, -81, 45, 61, -336, -91, -74, -81, -24, 17, 11, 34, -300, 14, -11, 44, 173, -10, -265, -30, 192, -131, 264, 129, 83, -210, 102, 230, -89, 218, -174, 332, 15, -72, -188, 226, -85, 51, 275, 87, 69, 4, 321, -69, -38, 419, 134, -80, -83, 90, 259, 175, 299, 84, -32, 19]
2304A9j55K52k15L65m5j17O9j88N2Q6m1K73k83k8K15k30K29l73Q2J51j4l38J90
2327d4k9j38J26l8k33K13N4J1m9J13j17J17Q5k76L3m3K34j50o6M1J19l98L37J20
2351B2k10J04R8n3l56L00j60K29Q7j70j37O6p4L52j30%m7N0lk93O13l90k50J39
2375b13K24P0pm48L41j22N9rP0j74K54k40J39J48j26k9J04J6k14L81l71K7j19
2398b39L38k01M86j64p1k47K08J93km6k78J40K75k29M1N5j71j80N46m78j03L12
2420A85l19L49j75o4QJ38J57l89J76p5K23k85K09j44J33o6l0Lj93K38J25L2j88
2443D8j02r1N02r5k0j81L65k98p4j57k1l4J23P8jr1K26k12J03J74l50n4J17Lj69
2468b11Q6r0J57J7N8k61J31j62L04k7o0K01l80J80k94l1N65k81q5m0J13R4J18
$$ y = [19, -136, 116, -99, 266, 221, 104, 173, -15, 37, 123, 82, 355, 72, 44, 259, 29, 258, -115, -33, 118, 104, -234, -44, -73, -211, -85, -123, -356, -143, -89, -78, -127, -14, -131, -14, 71, -205, -172, -215, 19, -131, -197, -156, -37, -435, -98, 22, -188, -84, 14, -39, -395, -95, -255, -26, 61, -109, -246, -180, -254, 98, -32, -32, -79, -29, -32, -325, 288, -102, -352, -213, 11, 81, 74, -374, -33, -155, -96, -105, -35, -209, 45, -195, -56, 92, -34, -63, 41, 57, -157, 224, -147, -120, -239, 99, -102, 384, 220, 149, -98, 110, 303, 301, 255, -23, 117, 392, 163, 204, 259, 88, -92, 454, -24, -127, 185, -134, 215, 40, -24, -16, 122, 279, -110, 66, -9, 214, -71, 138, -6, 127, 61, 31, 34, -159, 79, 204, 236, 48, -54, -145, 357, 262, 242, 61, 426, 128, 54, -103, -124, -158, -35, 43, 42, -49, 177, -35, 68, 242, -108, -162, -45, -42, -211, -125, -215, -58, -41, 17, -244, -113, -275, 29, 2, -58, 143, -237, -57, -351, -382, 183, -98, -183, -223, -110, -16, 102]
2491A02m43K06J08p0K18k08M0k11J41j42J83j42J46P1l45J00PK54k0k15K17n8
2513f1K32J7m54L75j44N0J99k18JL07p5m32J79o3K91k68L81j57k69J50j3J30k75
2536a17K11jJ30j53L08m04L61m4j38k17L17j6J96m12l2J72j29j59J49K5j76L34
2558B05j87N8o0Q7o0k04K23j0j45J56K2j09J21M7k05J00K0l94QM55j28J05j90
2581h5N6j00J41p8o7j56J69L26j76j58K46k64j38J99j22M7K69l44P8J54L05n06
2603b04J03J2KJ08J17m36k3J82M5j19J76j53L46j25j90p6J77j09j15K18j34P9
2625a19o4M83l39l34M11k0n2O6k54N8J53N1K0PK1l76K76J57k33k61M82j95l23
2648c85K21K34N1k8p1j29J74r0N8M8L58l25M7l30K41k97M95l17r2K92k2J58l57
$$ y = [102, -341, -135, -27, -97, 121, -87, -47, -258, -117, -259, -76, -218, -72, -1, -346, -246, -239, 15, -5, -220, -3, -61, 171, 188, -266, 109, -35, 15, 214, -4, -3, 304, 229, -203, -24, -87, 204, -64, 317, 160, -109, 41, 28, 158, -117, 94, 93, 223, 70, 378, -26, 335, 291, 153, -64, 253, 237, 433, 21, -11, 161, 32, -127, 22, 47, -129, 205, 18, 76, 16, 103, 43, -161, 62, 52, -93, 63, 85, -24, 97, 144, -61, 39, 59, -335, -327, 128, 0, 105, -85, -29, -129, 12, -66, -133, -289, -120, 206, 30, -128, 118, -146, -284, -85, -207, -160, 109, -235, -157, -3, 302, -204, -101, -89, -87, 21, 138, -298, -321, -139, -94, -213, -37, -190, 156, 31, -159, -235, -58, -167, -282, -64, -198, -119, -183, 300, -39, -373, 38, 18, -34, 32, -222, -164, -11, 40, 60, 67, 88, -288, -12, 145, -88, -349, 133, -62, -385, -164, 70, 121, 93, 22, -107, 67, -23, 35, 83, 441, 116, 163, -167, 74, -223, 272, -45, -137, 155, 133, 291, -66]
2671f6L4Q6R1j02k2J08J76j17l25L91j87k41O12k36k42J81j32M2J52l58J23J90
2693A58J17K2o19L00J19J9l32L48J5L09j25j89o2kO3k34K89j16k68K87q0m4j12
2716a37L13M9l66KL18l4j96J58k68LJ40J99o28P1L83p9j23J16%M9l82M05j79R3
2740i3K98m15L02j65j47O9k26J47L8M1J96j7k19L43l02k3K03m1J39l4m61M25L1
2763H9K57n10J96k14O5K07k43j61K22j28K17K01j08j53Ql88M90l1Q1j22K10l30
2785a45J49K27Pl95K32l09K78j72K18pj79J86k9J01l96L77j5J10j63J72l56P6
2807c3J93j13q3o9M08k75k91M81m8j44K80m21j42K74l6J69k49L23j96j00p2p1
2829b15J13J72Oj60Q0o1J70r3J63k28L88j72j39k1mR6k10R8k23k12N37l59K36
$$ y = [-66, -32, 54, 145, 43, 21, 129, 305, 188, -137, 254, 67, -174, 438, 202, -40, 141, 9, 51, 203, -155, -32, 158, 275, 297, -322, -22, 97, 116, -216, 132, 147, 456, 331, 142, 80, 78, 141, -93, 196, 80, -188, 99, 19, -25, -137, 176, 225, -141, -139, 179, 145, -51, 107, -161, -158, -18, 181, -447, -376, 7, -72, -195, -79, -79, -30, -412, -7, -186, -93, 205, -210, 92, -73, -220, -151, -377, -230, -192, -151, 45, 28, -191, 152, -150, -173, 30, -11, 128, 94, -367, 58, 89, 346, -164, 32, -182, -117, 90, -153, -314, -92, -220, -3, 198, 90, -63, -55, -443, 47, 16, 97, -25, 185, -145, 4, 231, 238, -157, 75, -234, 44, -128, 90, 83, -96, 90, 61, 162, -234, 143, 128, 238, 75, 247, -109, -33, 160, 47, -36, -105, 303, 28, -263, 218, 170, 26, 306, -115, -257, 17, -19, 150, -99, 224, 28, -72, -144, -215, -102, 70, 76, -84, -4, -65, 105, 12, 175, -53, 335, 163, 24, 3, -1, 95, -115, -17, -240, -452, 85, -274, -38]
2852c8k19J03J78Jl73J46K38n1J9J72k31k30k8M59j83k44J03J06J08o5j01j8L34
2875A86l47j0O8n4KJ53j19K64r9n4L6k66J38J27k45J84J50j51P7J86j5l92N08
2898C27j75J14m73J52K00J36k33M2j13J8q0r4L47k96J7L05m1J8N9j67k89M21K5
2921B20l98J52M0N11q17N04j12p6o3N2j54J70k7M59l13j69J72J5j09K30k3m32
2943a68L11M8Kk7r9kJ62j83J66k66Q7p1k44M51r5k29J11J30j52K52k4j87K98n37
2967b66K26J14l64K18J98m3j02P9j97P9j39K11n5j22J29k08J82K27r7k45J8J54
2989co5K02k79L64N6k02q7k63L8M01m98J5m4J86j56K47J00j98L5K44k28K81k84
3012a38R9J39l79L30k2n9L05m13N6p7k31L31m7K54o7J0j90Mj68L89J45l44j2L69
$$ y = [-38, -257, -154, 24, 25, -348, -202, 36, -15, 4, 176, -55, -285, -313, 146, -37, -281, -178, -72, 36, -29, -130, -148, 186, -161, -171, -103, -157, -155, -2, -121, 143, 44, -10, 26, -240, -102, 25, -220, -36, 114, -37, 40, 226, 211, -181, 327, 152, 266, -207, -55, 145, 281, 48, 90, -23, -5, -85, -179, 168, -128, -111, 194, 153, 171, 230, 63, -226, 195, 220, -178, -26, 14, 525, -292, 212, 100, 24, -39, 13, -141, 29, 2, 461, 148, -21, 151, 166, 57, 287, 264, -168, 143, 191, 193, 166, 67, 65, 227, 44, 210, -56, 31, -40, -284, 167, 72, -157, -46, 84, -68, 184, 160, -27, 271, -266, -40, 74, -290, -72, 126, 83, -19, 60, -137, -58, -197, 14, -41, -163, -34, -242, -60, 167, 70, -175, -157, -3, -68, 134, -145, 219, 275, 73, -14, -277, -239, 162, -336, -321, -365, -179, -335, -88, 12, -186, -151, 93, -135, 146, -138, -39, 100, -279, 51, 29, -30, 275, -138, -82, -159, -390, -59, -106, 148, 81, 91, -99, -95, -263, 126, 271, -73, -85, 284]
3036B84k55O7l9k19K29J35l21n0L09j54J06J7q9k0mj14R1j34K95l65L57q8J03
3059A41p5n9k03j6K14J75j57j83L61j90j01J15J76l0k90K78J39m47M69n48K77
3080D6j00N9m28N81j64k24J03R3J55j07K52P0o64K26r0J92j31j00K6K68J20k69
3102h6J31j83K14j51N9qk32K69k02PK70j31r1J97k03N9m6j76K71J81q7K6J47k64
3126b9k62J29R2J0l4l2o1M28k27O0j31j99M85j06j70Q2j4K30n05K69j08J21j20
3149i2J06k44R1M66m03K94o62L53J7K51l10Q0J79O4m09J49L14l72J95R0j73j32
3171a48K44l0j01K4r6P0j90M77j80J9j41n6K29j83K88N5k1k73L20k59O6j97K06
3194A23J1j1j67K26k32k8J79o2l39N74j91m37L33l2K49j27o4j4L25j74J5k57k6
$$ y = [284, 29, 96, 57, -162, 67, 202, -119, -169, 140, -14, 92, 109, 20, 0, -4, -118, -27, -161, 134, -231, 126, 38, 141, 66, 7, -196, -212, 2, 177, 20, -163, 198, 8, -93, 22, 198, 168, -122, 156, 295, -152, 317, -231, 46, -54, 5, -423, 158, -6, -230, -127, -34, 121, 14, 266, 336, -328, -102, -192, 0, -131, -231, -205, 63, 183, -86, 45, -138, 76, -75, -16, -24, -256, 13, -189, -182, 88, -43, -134, 63, -140, -81, -127, -303, -32, 149, 62, 88, 235, -29, -291, -162, -70, -60, -94, -126, -187, 241, 14, 74, -57, -256, 229, 123, -47, 35, 21, 251, -254, 15, -93, 28, -92, 14, -230, -139, 327, -76, 218, -444, -91, -74, 177, -133, -53, 126, 190, -219, -70, 244, -128, 67, 157, -16, -148, 96, 66, -35, -11, -107, -37, -227, 250, 70, 89, -52, -108, 121, -62, 226, 281, 260, -13, 307, 48, 114, -83, 123, 134, 123, -44, 182, -50, -78, 101, 39, -300, 274, 83, -354, -21, -53, 196, 69, 5, -9, 316, 142, 157, -100, -126]
3217a26O2J24J60l77R2j29L21N4k64K41m24L87m03L58j77j29K95l94L10k9M4n7
3239f1o8J17K76j56P5m98L27R8j79q0N8j52j75L95j94P9j78L55r6K23j73M2l8
3262ck50J38J96J15r1J56l98K41j20l43K72K46k82L22l31J37r6j93N11j73k30
3283a76J20Q1R5k87qL77k34j58K10J93l23K42M51l57j78J89j66j04K40j90k77
3304b60M70k04J79k32J12P1j31j12J58J84k06n2o0J17j13K70L1J36l73L52k58
3325G9j33L21m12L82n03L87r6m71N93J83m35K9K75k68J01O2J50k44QJ45M2l41
3347a46r0K07j41J45O0J20k44j3%J77m5l3k31K54k35L23R9k83j61Q4j3R0L25m99
3371b50L79r1j65K34k77p0K45k18J58J87l99J71J26o5n8j12J38n9J28j54q9p6
$$ y = [-126, -64, 60, 220, -157, -65, -194, 127, 181, -83, 158, -266, 121, -282, 76, -101, -230, 65, -329, -19, -48, -4, -61, -129, -12, 264, 108, 183, -315, 12, 110, -69, -149, -91, -243, -418, -23, -217, -138, -316, 39, -57, 166, -7, 35, -3, -253, -115, 81, 196, 105, 261, -137, 104, -16, -359, -87, 159, -123, 199, -132, 5, -91, -284, 227, 54, -176, -56, 25, 120, -167, -175, 202, -32, -190, 20, 213, -110, 132, 583, 226, 48, 237, 71, -33, 207, 17, -260, 210, 6, 185, -47, 65, 136, 5, -107, 51, 235, 29, -23, -83, 34, -79, 191, 222, 358, -15, 337, 79, -54, 267, -145, 237, -266, 121, 25, -446, 147, 330, -105, -76, 199, -69, 32, 94, 244, 0, 8, 153, 195, -146, -236, -29, -170, -25, 35, 155, -89, -102, -102, 75, 30, -3, -234, 20, -215, 108, 207, -76, -237, -153, -166, -76, 249, -250, 129, 38, -127, 107, -170, -240, 5, -213, -55, 132, -267, -96, 30, -35, -93, -205, -67, -126, 2, -152, -241, -317]
3393c17L53Q0l31M7J10j4j48n2K1R3M5L4J90Qo4l47R1K79Rk03R3K56n01L70j65
3418f3n7J22j73L31J2j50O7n9J90q6m2k35L28m07K63J97j83qqR6n5l9m3O7J4r7
3444a8n4J21O3L2k65K00k5J56J01l06L8m4p7Q0M0J30om2P3k64O7J61m7K08l99
3469g7J3K09J05M3j53j27J16j36j38K08m6j70Ln9L09J14k94J08oO1l08K69J6j01
3493d1l99K96K24J26l65R3k4J40p7j25K83l05J50j12L40k96N4J63l56J63j72M46
3515B06N3j06k73K86m19L31j65k8j5j04R5J88q6m9j84K48L34j7j94j58M6O9R7
3538A55j0l93L76k37R7j51M20k30k72K01J29K23n02k3L70M0j51J43k37J48k15
3559a19r4K49l1N5K6j39j54L11q6lj84L31n3k44J09l7K48M4l77K01K33J91p32
$$ y = [-317, 36, 116, -215, -168, -58, -72, -220, -272, -251, -158, -113, -79, 111, 119, 55, -292, -201, 78, 87, -116, -23, 233, -268, 102, -63, -120, 2, -171, 160, 172, 22, 89, 30, 220, 134, 92, -143, 185, -222, 41, 238, 55, 47, 39, 135, 80, 41, -2, 65, 79, -18, -72, 49, 112, 144, -121, 79, 54, 210, 311, 5, 43, -1, -78, 2, 42, 172, 166, 124, 197, -67, 0, 161, 114, 322, -77, -64, 145, 250, 293, 140, 13, 129, -7, -145, 63, 17, -153, -150, -209, 100, 214, -80, 28, 22, 83, -225, 44, 60, -41, -440, -144, 80, 206, -159, -66, -90, 50, -27, -152, 131, -174, -24, -136, 204, -92, -38, 125, -231, -68, -240, 206, 259, 153, -120, 166, -253, 78, -87, -115, -130, -234, -139, 49, -37, -86, -270, -22, 312, 295, 101, -57, -11, 58, 155, 145, -248, 128, -109, -12, -163, 257, 27, -245, -44, 85, 308, -194, -217, 153, 193, 42, 185, -52, 96, -119, -213, 36, 5, 60, 86, -53, -207, 104, 18, 15, -169, 162, 109, -135, -26, -63, 185, 229, -148, 53, 286, 477, -255]
3582b55L06J32k5o5L8p0p6J61J65l10r4K76l42J58k72L13J82j69p9J11p8J22k20
3605i1r0J31k7J65l34K06L15k27j69K39j18K1o2N4o3K3M3rNk30J42K17k6%j59
3630d4K78k16o0L71o00O4K71L2k13J4j67K37k7j83K09k10O7r5r4J64J83K43l77
3653a53j11j0P8k6K65q7j8J65j97K02j55K92j2k09j57k29L18K65l48L13J4M8l08
3676f0J88j46N5j36L17l34K05KJ12q9no9P6j02k3J41m3k41J84J25k72j53L63K8
3700A23j70L7O7o4o9K36Q8j68K45l63O4L78l71j9j6j6j6J13K14p7k01K3J4p4J92
3725A70j60q4J67R9k94J83k9j72L16Qj2l8n9j40P3k50PJ85j1j67L42Oo4P6l25
3750a73J59j56J51J69m90J05K25k56P4K80l11L96o3k67R8L1j27k8jlJ31j61Q5
$$ y = [-255, 51, 183, 158, 93, 131, 61, -15, 146, 311, 1, -93, 183, -159, -1, -273, 40, 222, 53, -26, 85, 7, 129, -91, -181, -50, -77, 88, -246, -40, 275, 48, -121, 118, 0, 21, -41, 13, -50, -27, 16, 7, 12, -218, -76, 141, 115, 115, -44, 234, 18, -42, 329, -271, -207, 64, 96, -117, -103, -270, -33, -60, -243, -34, -244, -177, -272, -366, -202, -19, 224, -153, -264, -274, -196, -222, 43, -44, -62, 103, -94, 108, -47, 245, 233, 24, -133, -362, -44, 221, -127, 186, 200, 248, -60, 128, -18, 37, -99, 218, -116, 89, 91, 203, 114, 109, 40, 116, 14, -9, 132, 89, -152, 32, 157, -115, -268, 95, 123, -47, -10, 57, -7, -76, 160, 248, 80, 325, -38, 26, 404, 33, 14, -2, -18, -34, 79, 293, 216, 15, 38, 52, -22, 170, 10, -74, 93, 192, -102, 81, 52, -120, 196, 204, 192, 154, 95, -45, 28, -222, -215, -30, -41, -208, 134, 140, 76, 152, -173, -14, -170, -19, 150, -340, -235, -10, -266, -192, 88, -223, 173, 110, -157, -59, -28, -155, -183, -184, -187, -56, -217, -132]
3773a32J55N6n5n0j80K74r7j93K29J46k39R4Q3k77K55k17J77m8j49K20k63L43
3795A32J32j09k09J93j09k9j65K68k31L73k16Q3Q4j11j76J86m1P7m9r9J31J68
3817B83Kj35p5l4J33Q6j86J12J19k20j8o0J77j80R6j21j41M31k71K76l41J89k70
3840a48P9o2M70l37J19l0j78q5M08j06J30l09j6N3J20L1r0L69o41M81j09N1l9
3863A61j74J00n4KM7k29J49J46j80q4M39l80O2J27j90J3K51r1J18q5l50KL64m59
3887b95L35k5k20L68j34K43k51l9j47L6J49K18k29j4k83O2N0K19j88K34j58J6
3909e3j92mJ32j9L18k76K97l37J43K18n0j26r2J71m07O06j08l79J93M9j17k6j90
3932b49M0o2M2J82k33K52j5j89O13l59J23m1J94l84L04j90p3L95j72J60m01M00
$$ y = [-132, 23, 79, 24, -26, -206, 68, -29, -222, 7, 153, -86, 8, 91, -186, 69, -148, 29, -19, -168, 52, -211, 132, 264, 155, -54, 139, 30, 1, -164, 104, -127, 246, 30, 113, 197, 86, -90, 96, 55, 132, 83, -16, 115, 283, 285, 150, 75, 41, 174, 260, 74, 186, 305, 85, 67, 7, 184, 4, 100, -21, -162, 269, -2, 274, -67, 122, -148, -69, -131, 339, 2, 121, 91, -87, -172, 236, 130, 260, -49, -65, -12, 108, 139, 49, 418, -223, 258, 149, 200, 161, -13, 87, 33, 35, 82, -147, 2, 148, -32, -116, 323, -57, 5, 132, -58, -45, 206, 115, 233, 148, -202, -200, 164, -295, 40, 15, -205, 163, 29, 272, 21, -18, -165, -129, 20, 238, 9, -5, -288, -226, -176, 43, -145, 89, -69, -53, -245, -249, -117, -136, 182, -94, 203, -134, 9, 227, 177, 51, -41, 130, -277, 329, 221, -158, 35, 84, -33, -59, -249, -209, -271, -229, -47, -280, -28, -43, -232, 381, 22, 145, 104, 298, -86, 218, 28, -45, 350, 178, 338, -63, 337]
3954C37l49J50j65k46M97J03k94j19J03p8L12l25J58j11j02K20n7m1K68j99r2
3975c0Q1k7m5J30k2J92m63K32kj20K12j72K22k36M0J96k30j94L55P6k74K1J25
3998F7r1J43o3k05m7K1J88k59p2J86J98Mj62K13j64n1l6J81k67m3K50j40k24M12
4022C9j58K15J61m83K17j45K32k67J84J10K2j03j72J46O1l00M1J50j54k7L93M5
4044B07k63J25l02M25k66J00j26l06J90L86l68K41j12j34K63j41J03J36k84L18
4064A92j08k7k71R0L73k35j06J21J87k73N7K54m97J7J16Q3N2mJ19L1j09j33J80
4087A09%P5J07l55J60J87r2k90K45L52o19K38p6N1k85M26j68Q3j12P1J37j27R7
4110B14k27R1J09j34P9r2Q8J1K5j44P7J43l57J07J58R1l03K74j71q1ml1j7o7J92
$$ y = [337, -12, 138, -27, -273, 224, 327, 33, -86, 17, -61, 251, -74, 84, -27, -129, 91, 34, -7, 261, 62, -30, 51, 24, -21, 109, 87, 279, -184, 48, 46, -74, 138, -34, 188, -48, -8, 188, -42, -236, 119, 195, -79, -58, 67, -24, 119, 56, -149, -196, -175, 13, -246, -318, -132, 66, 70, -92, 121, -43, -94, -130, 51, -216, -259, -9, -149, -373, 39, -119, 96, 257, -226, -9, -154, 78, -189, -5, 105, 127, 24, -148, -2, 59, -241, -200, -50, -204, -231, 162, 207, -56, 69, -233, 192, -74, 26, -100, -406, -216, 170, -198, 43, -69, -203, 60, -81, 22, 158, -126, 192, 84, 57, -214, -124, 249, 14, -92, 29, 216, -57, 0, 254, -243, -226, -110, -27, 25, 21, 140, 171, 62, -71, 109, 109, 184, 291, -64, 96, 283, 191, -99, 146, 498, -121, 117, 41, 92, -193, 233, 65, 148, 36, 107, 244, 117, 214, -13, 78, 187, 53, 132, 40, 128, 139, 164, 20, 97, 240, -117, -10, 148, 239, -64, 210, 39, -42, -46, -77, -94, -161, 31]
4135C1j86J01Q7J6J01j92K94l0k30L1N3R7l51J8j21K37l49L92n6M4l0l4j6j15
4159b08L89m63J06K16j94j60L53J8n01P7K66K24l22J43lj74J44j13Pq0J54J12
4181iL4j32R0J03r8L1j4J2J45k14k3J24j25M43k61j38K63l17k3L17l01L1O4j14
4205a12K14J2j81O2j69R2P8K95Q3l67lK22J7m5j43m10L63j93J75J04jj06N0j13
4229g6K39j86l53N68K8k9j52J11j32l04K51qK29k76L87L7m50pq7M18m05L25k9
4252I9q8J14m9r6K72k82j30J52J72k97r3J86J27L5l62J63k5J02l07N32j79J67
4274B13J7l16M6j2m8K94m44K40oJ56l24K10M6m7r5p9K46k79L91n4m27L42k94J03
4298a21KM6K6j5J31j38Pj54M9Q2R7j57L57l23J87l9j12J38j49q9K41j80l4n4J26
$$ y = [31, -155, -54, 33, 49, 150, -42, 252, 222, -8, 23, 76, 173, -178, -160, -281, -44, -393, -1, -57, -13, -43, -77, -93, -208, 181, -282, -176, 40, -154, -314, 39, 57, -444, -367, -101, 123, -199, -56, -59, -233, -89, -202, -195, -275, -121, -9, 25, -107, -17, 86, -12, 19, 5, 17, 162, -52, -75, 49, -76, 367, 106, -32, 231, -86, -109, 208, -93, -62, 2, -112, 102, 114, -67, -5, -174, -82, -4, 291, 374, 7, 4, 226, 243, 198, 55, -355, 8, -185, -10, 94, 93, -13, 37, -76, 163, -23, -376, 192, 220, 191, 39, 150, 18, -286, -35, -43, 186, -90, 297, 334, -116, -123, -210, 208, -197, 128, 99, 11, 125, 76, -20, 252, -30, -160, -8, 164, -133, -226, -40, 87, 122, -240, -77, -102, 0, -307, 225, 46, 213, 230, -86, -40, -52, -100, 194, -250, -10, -16, 140, -184, 26, 72, 25, -70, -149, 97, -182, 209, 155, -272, 70, -224, -121, -119, -73, -47, -62, 69, -69, -62, -216, -167, -85, 12, -145, 212, -111, 76, 37, -75, 63, -86, -175, 66, -114, -148, -202, -76]
4323g6J14o3K69j29j63j02K26m8K88l88m3K33j34N2q7k99J53K77k88J00j30k2
4345b60L17q1q3J98Q5Ll06J42K11l44J31RJ34o1j83M33o14L42P4m86K35R3N6j38
4369i3K67p9J66l24R4j26r8K50J6l46L29J47n5j82J50j62n5L30j05q7R5n1k42
4392a61J48J10r1K9J13o3j76l54K84J26L48l66OM21l75J20q4r1k96M51J34m85
4414b52K13j17O8NR7M4q5m4qJ17L9r9oq1J50q1Pj27P9l9K65k02RQ9oj44J45J23
4442A59O9j48j86pK13l33K04J59j65J45j18j73L06J9k67K35l57K98P1L5j81J54
4464A32PJ23l75K90j90R7k70j57N28m56K35o9Q3j88L09k08K48j03J81j17k42p3
4486b15M68j43J8k5L2N6J74m64K67m8K59l95J3k7M9J85j1k69J70j60J87j3j63
$$ y = [-76, 38, -25, 244, 115, -48, -150, 76, 28, 316, -72, -115, 118, -16, 36, -51, -350, -197, 80, -208, -108, -238, -260, 57, -24, -107, 91, 176, 179, -127, 15, 226, -118, 13, 22, 156, 95, -88, 345, -269, 73, 147, -339, -104, -11, 45, -93, 174, 95, 261, -63, 31, -95, -193, 57, 73, -273, 56, 203, 148, -34, 116, -46, -101, 229, 124, 37, 132, 81, -161, -13, 97, 6, 35, 148, 85, -91, -445, -161, -35, 313, -53, -47, 374, -1, 119, 35, -56, -352, 99, 233, -252, -39, -156, -88, -83, 14, 58, -27, -71, -79, 38, 77, -22, -28, -109, 41, -40, -33, -160, -81, -120, 145, -57, -48, 41, 35, -109, 36, 159, 228, 80, -106, -113, 100, -233, -29, 130, -35, 110, -8, -181, 125, 144, -123, 112, -245, 53, 124, 159, -22, 132, 139, 262, -113, 177, -13, 84, -186, -343, 185, -271, -36, -105, -22, -210, 99, -109, 139, 36, 217, 100, -142, -215, 253, 110, 128, 103, 135, 191, 365, -99, 168, 120, 379, -16, -3, -30, 19, 204, 193, -76, 94, -66, 121, 108, -55]
4509e5p5K08J2O8j86M7q3M40k75j49o8M1M3J36K29n77L78j87L95j21j4k71R3k13
4533a84J07K46j22K22l5k84k82J20k0M26k2l24l31K86L65j94K29r6l75J62L17
4554B11l46J82p6K09l99J56o6L98k67l86J85R6J3J36K0j33J80M5k74l9m4p0N11
4577B42l09J4l4O5k3j74J41N9j21M22k98j96J52K0J73l09K26m6n5J43j05l23K69
4600f7j02K51q0j19K32r7J15o4O9k27l9J82n5R4M4l3k0k8K8M5M9L0k24qK06k67
4626h5j3q0K4J13k2J48J17j48q9L92k53j86J79j1p5L47l23J22J35j31j00J41J1
4649B13n07N03j20l6j50Q2j84L02j0j67q1J11J65o9P6L09l17k00l75K61K62p4
4671fp2J03m8N24n70M0p5r0K40L8k79J02M3J04l14K26K00o6k04m0L61j96k33J48
$$ y = [-55, -130, 78, 90, 158, -28, 19, -64, 376, 101, -48, -116, -75, -32, 104, 333, -244, 134, -53, 342, 221, 207, -64, 29, -184, -77, 169, 47, 269, 234, -50, -332, -212, -232, 194, 172, -152, -483, -197, 168, -26, 203, 107, -268, -106, 211, -135, 47, -29, 180, -219, -63, -129, 269, 2, -384, -199, -103, -90, 46, 66, -67, 113, 158, -116, -155, -199, -269, 242, -67, -53, -87, -22, -45, -219, -78, -19, -140, 282, -16, -212, -60, -40, 133, -176, 50, 4, -51, 92, -13, -336, -67, -169, 82, 2, -117, 115, 18, 133, 69, 138, -89, -128, 54, -1, 93, 137, 104, 84, 56, 84, 129, 178, 208, -16, -24, 182, -85, -98, -178, -154, -41, -63, 85, 202, 54, -35, 357, 104, -82, 97, 86, 11, 358, 35, 157, 292, 161, 61, 202, 213, -294, 209, 89, 53, -97, -15, -199, 103, 93, -74, -155, -44, 121, 52, 128, 437, 120, -80, -455, -194, 68, -6, -78, 25, -23, 501, -69, -29, -104, -194, 46, 84, -195, -93, -50, 54, -260, -34, 166, 100, -104, -144, 217, 21, -212, -64]
4695f4J35j56q9J69j96L64k41J33k8l2j17j13L16J32J58m20K72n23L27P3K30j26
4717B04k94j26L07j61k0K39m35N67j31j50J75q2M1k29J90J57j08K9j80k18N28
4738C03m27J47P0r9j05J46o4j51K08Lk16K36k0J94K1j09l72J89K63l03N2J57j91
4761f8J33k4l81L87K00k28L77k3l79J01j95M90m34Q3P1k62M08o0l84J96j8j3j09
4784a32K78l29L17J34k90j42M38k49J03j70P9n9J75m51K78K28j73J07n09M06l43
4805c04K56o1J16j94K23Nj91J80r9j92K9M0O4J53j20J02K6q3J33j75l6J15k23
4828b36J45J96j74p9LQ4NL74m60J04J26k31J74n4J5j22M5j5J51r5j24K83l9J83
4852B59k50l00L5k0L30Op6q4j29L59J6J54l63Pj5J04j47J43p4J65o7j47J30j06
$$ y = [-64, 71, -85, -174, -5, -201, 163, -78, 55, 27, -5, -122, -235, 81, 213, 371, -49, 223, -300, 27, 100, 330, 204, -90, -216, 91, -70, -90, 149, -286, 281, 150, 0, 175, 93, 134, -95, 95, 252, 144, 173, -7, -225, 303, -124, 23, 93, -6, -111, 35, -29, -180, 28, 31, -185, 51, 31, 225, 246, 137, -235, -46, 217, -86, -34, 123, -68, 65, 41, -340, 47, 247, 19, 396, 373, -6, 95, -100, 390, -44, 39, 110, -152, 256, 196, -188, 8, -10, -23, -132, 146, -183, 134, 268, -22, -164, 274, 25, 128, -42, 37, -22, 153, -298, -20, 208, 35, 142, -367, 39, -304, -48, -109, 7, -187, 36, 41, -150, 30, -69, -261, -232, -192, -128, 25, -95, 7, 33, -50, 83, -92, -128, -13, -236, -91, 105, -69, -148, -145, -61, -56, 318, -142, -38, 88, -143, 31, -23, -8, -130, -85, -100, 51, -44, -168, 115, 76, 259, 9, -291, -256, -276, 54, 60, -16, -100, -229, 130, 146, 300, -63, -56, -71, 33, -114, 29, -45, 120, 53, -94, 36, -70]
4876g0J31p7Jl7K26j46oj33J72r5K8J82j87R9m73L08J14n6m2J09M71n26o1Q0J41
4901A53j84n6j92J18J90j38J43J14j17o5l22J81M16k87m9K68l29N3K54l37r9J96
4923h9K15l46L85j91j9j55K18J02j33k30L13q0p1M22l87J60mj58j19K46l78K54
4945d5M6L15l92p7N9J45m29L82m3K70l04K0J85j31j83L37l9p8j33K76k28J43j18
4968b2M8m9P5J78j43j04P9o4M6J64m65M19j69j68J06j14J85k26L86m2j96O5J31
4991A20J48j67k26P2Q8Lp8K0J15q8j54j43K54J26kJ3j2p4j06R9O6l25L42J9j44
5016c4Q8j15L58j44j96j4k00J04J56J16l38N4l1M89l83K08p5lJ06L85n61Q1k6
5039B5O1m2m8l40K35k1L40l08K27l26J66j96M30m6j53M3j4j95r3K56N9l26J34
$$ y = [-70, 61, -16, -15, -52, 174, 28, 22, -111, 61, -34, -6, 176, -11, 88, -385, -77, 37, -19, -61, 48, 519, -7, -68, 12, 153, -31, -87, -279, -161, 29, -109, 34, 148, 31, -34, -356, -175, 241, -46, -95, 173, -156, -103, 151, -186, -285, -89, 126, -220, 165, -26, -45, -200, 18, 120, -13, -243, 70, -10, -81, 341, -46, 114, 110, -48, -167, 79, -299, -45, 1, 316, -76, -153, -94, 51, -378, 4, -39, 231, -73, -53, 132, 1, -182, 155, 116, 38, -95, 181, -47, 96, -22, 26, -23, 52, 230, 87, -17, 62, -2, 44, 208, -257, 162, -7, -175, -69, -183, 2, -224, 162, 120, -76, -11, 120, 268, 101, -125, -53, 35, 38, -40, -20, 95, 7, -147, -290, -36, 90, 88, 101, 89, 15, -91, 8, 74, -251, 91, 110, -34, 54, -61, 297, 153, -43, -57, -257, -153, 3, 119, -219, -165, -196, 293, -90, 118, 43, 40, 146, 531, -30, 51, 25, 86, 44, -4, -344, -109, -130, 210, -98, 129, -197, -31, -227, 203, 157, 4, 47, 33, -162, -255, 1, 60, -266, -132]
5062a32k72K29L38k49n7r4J66j11k5J7p1K32j93J65k60M10j51j09N5J89J10Mj89
5085Bj26l48K75R5J97J5k00J26k53J69k83N22j57J01j66K45k20K38j84k2P1j20
5107b3J98k93n6K67L31k27j41J69m47K16K2j08J95r0K73j00j88O8l3K66k10Nj65
5130g1K00j81L7J07J83m07n5K47k5K32m7l05q4J52o6K96l95J95M6K89m09L15j16
5153A38l4oK8j81Q2j26o5K1K11P6qj54p9Q3j42J86Q0J18m70K13q9K72k96K20j90
5178a12N6J46o4oO3N0j52L0M4k94J60J21J9j53r5O7K36N0l00J96k39N9J70O4N
5203A21k52k05J26J50R0j55J03p5L3L95l64L19n25J85J17j03j0J49j65J56N3m1
5225A02j24J90m15L74l52J42K8J39p8m3J35j44M7p9J63k38K25J47j56M4j67K46
$$ y = [-132, -404, -175, 163, -86, -143, -237, -71, -182, -207, -190, -261, -29, -222, -57, -317, 93, -58, -167, -112, 77, 187, 191, 2, -124, -472, -197, -102, 95, 110, -90, 36, -217, -48, -331, 191, 34, 135, -31, 214, -6, 232, 48, 26, 97, -23, 175, -118, -174, 93, 424, 197, 56, 225, -222, -6, 16, -92, 103, 13, 286, 186, -2, 66, 33, 299, 89, 94, -71, 129, -52, -15, 92, 275, -132, -187, 60, 35, 267, 220, -85, -169, -17, -83, 213, -182, 13, 59, 348, -61, 254, 138, 104, 98, 126, -55, 27, -99, -164, -143, 68, 144, 136, -18, -97, -14, -156, 30, 110, 228, -242, -29, -118, 154, -142, 78, -112, -56, 90, 26, 20, 83, 133, -19, 11, 55, -239, -79, 42, 61, -92, -187, -120, 116, 166, -134, 62, -177, -118, 52, 116, 121, -131, -336, -210, -60, 30, -125, -22, -97, -64, 331, -33, 286, -239, -54, 63, -40, -50, 99, -66, 90, 143, 102, -22, 168, -247, 127, -225, -83, -55, 84, 6, -37, 98, -46, 1, -78, 85, -153, 72, 219, 63, 107, -60, 186]
5247A86J70o1l66J45q0K37k53K31j45l79K68J61j9l49J35J71q5O4n9K88J40k79
5269A21j3j10K41l64J64K68j6k34j76J13k9q9J64j91K69j57K34j27ll3k61N58
5291C29k55J80j45o3J35j26j39J14l68J37K62j39r6o5L70k6k10J63j11pJ4k1N3
5314a4j56J22k4k06J65l6M92n16L12J51k07k61r7O35n46KN3K18N4n57K83J74j05
5337f4L02m6k32O3o9J2k35K77J62l63J04m2P4J29k33K85j72r4J30j64Q6R5r2J60
5361G3RJ03j76j48J18R0k45J40O2k98M25J7l10J0O9K36j46K31Lm29L22j50J02
5384A08k9r9j08jj26K87p9j99N13j5j07j89J55k46N7J05o5L0O2j23K83j2k74K20
5408A48k33M23l82R0O4n7j32j31J70J33r2L3m9j4l13J10K42J54j86K89j00J34
$$ y = [186, 356, 295, -71, 74, -6, 231, -22, 209, 64, -315, -47, 114, 95, -254, -119, 52, -33, 31, -28, 260, 400, 121, 108, -2, 239, -125, 39, 307, 291, 57, -119, -6, -35, -124, 40, -151, 118, -39, 195, 68, 65, 32, -229, 329, 74, 254, 109, 46, 181, 55, -84, 30, -338, -201, 61, -78, -174, -239, 131, 105, -105, 58, -53, -60, -46, -67, -14, -170, -48, -72, -278, -113, -149, 343, -173, 139, 290, 83, -178, -275, 360, -186, -184, -131, 87, 141, -416, -133, 41, -64, 238, 192, -40, 23, -46, -34, -269, 8, 170, -193, -89, -131, -57, 72, -161, 124, -48, -142, -12, -176, -90, 5, -87, 73, 82, 185, 9, -139, -21, 69, -176, -36, 26, -272, 153, 170, -140, -130, -61, 175, 29, 260, 263, -166, 156, 6, 108, 79, -20, -128, -129, -255, 32, -47, -246, 267, 252, 145, -44, 111, -135, -78, 27, -38, -8, 54, -69, 214, 202, -72, 148, -85, 338, -44, 46, 110, 53, -79, -210, -40, 93, 1, 34, -15, -29, -342, -232, 10, 164, -22, 267, 167, 301]
5430C01m01M0J7K65m3k96K45k01J05O1j08L24n32K13j2l07N04l73K37k54L48j97
5452f4k13K36N8k02J94k17K77j16j96J66r2J5O0P0j08q2J79J4n5o4K57l44K30
5475Cj0N4k33o6l9M21k87N9j20K45k1j25K44o54M09o4J26K37k86r6J90j80K90
5498I7l08R0L4J18J40j78J15j12k02r5J95J69p1J31k26M4j51K33RkP1O6R3n71
5522c11L30O2p1J09k46L40j74k18P5nN0j52M13m3O6l01K81j88qJ41j82Q8n0p2
5546f6oM33k84N6j31L72k13k17P3J19kk5k68R9J77j78QK84k8j53J40k23J60p7
5570E0J23k51k25K18J67k14P3J04j42L5r0K11J50o5k73J65j96J72P3J26P6l96
5592a09K45k65J44LJ61j68q9J59QQ0k27k4J7J88k63K28n5n2J04j10L9j03j64K01
$$ y = [301, -100, -60, -43, 222, 179, -117, 128, -73, 32, 93, -15, 309, -223, -10, -22, -329, 175, -198, 39, -215, 133, -64, -277, -41, 17, -185, 9, -208, 69, -47, -243, -77, -169, -154, -94, -24, -132, -214, -35, -21, -76, -140, 117, -227, 3, -7, 47, -186, -252, -291, 130, -157, -98, -218, 27, 6, -119, 125, -529, -120, -184, -58, 179, -107, -203, -13, -193, 97, -211, -121, -87, 31, 171, -7, 108, -4, -206, -301, -106, 63, -8, 123, -103, -59, -210, 23, 32, 30, 101, 167, 260, -311, 19, 81, 10, 119, -127, 213, 39, -179, -104, -109, -59, -211, 202, 159, 225, -76, 205, 17, 9, 150, -32, 56, 6, -66, -72, 361, 77, 133, 2, 374, 161, -56, 17, 136, 134, 109, -159, -60, 117, -61, -53, 231, 203, 50, 190, -33, 127, 50, 173, -78, -303, -85, 82, -132, -59, 45, -97, -62, -152, 59, 209, 144, -129, 36, -160, 12, 85, 211, 287, -109, 136, -129, 15, 18, 179, 11, -78, 81, 89, 169, -58, -82, -65, 123, -140, 88, 33, -19, 85, -25, 14, -89, -253, -52]
5616e2j22J61J07j69L0K57l38l5L71n37M21kK4j52K39l93M35k72J25j9l71K37
5638e5J13n8j5m3L21q4l4Kj87J30r3MJ40m1m3J05k43m5L45r8j94J28J87m4j56
5663D2K0k14N9J68M6m7K7j95j68L64L3J0k4K03o7m56O6L47l0J6l04o3L35j10j95
5688a37K44J10j45j12j03J03J21j33J40n6j71N3l9R6JJ03o4O9j46K13k76J10n0
5711f9j71K91rJ82k25j42k67L75q8J79k00K30j96L85o41L32k2N3k37L35l55r9
5733c59M66j70j17K81l1k5J06j19K72j46K6k15j63K1pK11J39M7r2q9M9K96n79
5756a98K59J16j43q3Q4j6j29J06J90j86j30K58J1j24L9j19J42J06j34J89k05k5
5778HQ5J35kk39J14J95l80l7j50K32k9J29J30j30j96L10k20j6j28O1K12J4P0j53
$$ y = [-52, -174, -13, 94, -75, -45, 212, -126, -161, 210, -327, 94, 92, 116, -36, 203, -190, 245, -27, 98, 79, -292, -55, 58, 0, -15, -58, 263, 179, 145, 147, -40, 90, -3, 1, 141, 100, 57, 162, -81, -126, 219, 121, -73, 55, 242, 198, 42, 62, -152, -93, 75, 121, 74, 101, -94, -262, 102, 135, 145, 121, 324, 257, -199, -133, 214, 184, 200, -104, -167, 168, 58, -137, 107, 217, 72, -40, -143, -40, 81, -52, 88, 32, -139, -86, -125, -29, -28, 75, 11, 80, -66, 147, -129, -19, -69, -240, 51, 42, 224, -1, -143, -410, -35, -123, 56, -144, 86, -110, 275, -366, -34, -56, -3, -240, 95, -260, -359, 107, -63, -180, 101, 70, 45, 151, 32, 304, 158, 184, -31, -194, -173, -180, 31, 170, 217, 125, 36, 85, 381, -198, 61, 177, 34, -49, 35, 19, -110, -4, 186, 0, -130, 128, 139, 15, 54, -65, 77, 183, 49, 238, 33, 8, 93, 228, 226, -13, 101, 296, -84, -121, -271, -39, -68, 61, 191, 61, -135, 175, -45, -61, -189, -128, 84, 98, 168, 15]
5802A5l63M04K60m91J86j9Q8n9J06k02j0K09l06K66l7j4p0J84kk18r7K41J48k23
5826dj44M0L11k95M8J43R3l64K78Q8j33j39K74m1mj60j05J74q1P8l82M73J99l88
5850d1J77m22J40J57K28m62J90o5K6J13j23J80k38J48J54k11l0Q4P0j80M9J43
5872H7O1k10L7l1M18j78j51k29K58J06l48K14N1l05J24K15R3n30O42j75j80K09
5894A78m4l1k84K69j84M4l2K90n16L10q0M28k86j91J56J10q9k52M24l89J10p2
5916a31J74o4M27m28p5j41N32j6l30K00j03o1l01K93j12P2j41K37o6M9l70M22
5938F7k56K44k70K23j01K49P6m70L6J53l1j59K02P7K40l30K89j04j47n2J76j4
5960I8k27J08k83L15j72J32O0P0j50Q0J6j7j34K32k86K90j66J06m55M00l11p5
$$ y = [15, -348, 56, 316, -175, 11, -8, 80, 21, 127, -75, -85, 124, -182, 84, 47, 33, -37, 147, 145, -73, -170, 71, 219, -4, -148, -108, 203, -92, -44, 99, 192, -172, 106, 194, 61, -78, 196, 155, 151, -9, -114, 60, -21, 57, -325, 148, 347, -41, 136, -286, -146, 11, 239, -223, -33, -98, -72, 41, -82, 98, -140, 8, 162, -49, -79, 5, 75, -105, -56, 87, 148, -62, -25, -56, 362, 184, 33, -196, 62, 168, -180, 34, 85, -220, -96, 119, 212, -318, 324, 149, -31, 178, 134, 103, -181, 88, -96, -52, -84, 206, -310, 0, -80, 348, 62, -129, 27, 137, 48, -204, 220, -169, -59, -131, 43, -21, 406, -22, -97, -238, 294, 278, -52, 148, 45, -16, -317, -24, -136, -64, -205, 32, -34, 15, -355, 67, -189, 55, -215, 8, -93, 156, 232, -238, -202, -49, -80, -239, -37, 40, 280, -50, 239, 135, -12, -64, 112, 98, -129, -21, -304, 11, -161, -29, 31, 101, -49, 31, 47, 30, -104, 128, -158, 132, -34, 72, -383, 17, -294, -369]
5982c69M44J99k88j05Q2l2Oj86M05k39K47l11L21m48K61L6j15r7J19K9J88j74
6004b7j45J23K78l73J69o3p0J92j47K8kj28L50l39J43K21q0j46j05j80pL78m6
6027B4K33k63J45j73M10m92J4M7j25K00J38l34N10m39N9J8r5O6k55M24l5n3q6
6050f2%j38M92l46K47m28J22l5n2J40J65L09l85J03l47N3J00K21o1j00P3k16J20
6073b5L8l6L99j04n24K90J84j79j72L33j62k2P3j59p0L2J91P1k47J78q2j07N4
6096d6P4O8pj23K1N2N3K7k66o9Q5K25j94M43j50%j34p7j79P3K50k69M74l31J03
6121A03m7j85J03M1J20m3J75o3o6j58k13K74j20J88j53l1j34O7J01J25r7J74L4
6144A95j05j00P9R8n3j07O1n4L2k11K85K52l31N0J1j68K44%k62j33M59j85J28
$$ y = [-369, 75, 274, -14, -119, -37, -69, -63, -249, 156, -83, 164, -147, 174, -274, -13, 23, -92, -189, -70, -41, 147, -27, -172, -49, 229, -144, 25, -38, -108, 84, -63, -35, -37, -165, 185, -154, -11, 210, 130, -16, -121, -301, -308, 70, 24, 257, -6, 139, -34, 376, -116, -102, -55, -180, 20, 158, -176, 334, -105, -46, -28, -123, -57, -312, 112, 77, 24, -62, -62, -200, 292, -54, 193, -235, -113, -148, -200, -60, 105, 414, 29, 132, -215, -162, -62, 159, 98, -2, 71, -145, -25, 13, -23, 376, 272, -252, 38, 222, 43, -129, 204, 42, 20, 93, -66, -136, -104, 87, 158, -89, 89, 7, -100, -46, 28, 96, 89, -34, -13, 39, 92, 119, -147, -216, -131, 94, -100, 343, 193, 193, 59, -18, -197, -124, 126, -143, 331, 0, 103, 56, -129, -26, 15, 135, 92, 267, 204, 138, -20, -233, 41, -79, 109, -44, -75, -209, -142, -41, 84, -13, 161, 195, 90, -10, 69, 167, 114, 7, 68, 14, 46, -165, 120, 372, 41, 91, 102, -66, 178, 178, -84, -217, 242, 57, 185]
6167A85j31J08o2j5k05n7N23l79j10J27O1M4o4J29l63L0K38J27l6q2K35k67j0
6190B6k4J0Jl35K77R4k32K33p1q8K48p6L3J54m23O8J31J05j51j15L24r6k19K89
6214A63k63J62q5K04k2l79L48M4l3R5l70K4L0J5R4p7Qq2J73OO7j52K92m06j07
6239b51P31o02J92K11j47j63J3j56P4N21k74j81j79J28j54L40k03k7J05j92J90
$$ y = [185, 54, 162, 100, 85, -120, -177, 346, -33, -143, -16, 45, 89, 25, 154, -209, -179, 59, 186, 150, 68, 303, 36, 26, 2, 12, 13, -322, -45, 49, -183, 50, -21, -109, 139, 63, 96, 250, -173, -105, 26, 131, -20, -135, 189, 93, -126, 163, -100, 62, -23, 181, 159, -220, 128, 172, 139, 234, -136, -112, -82, -67, 27, -50, -42, -124, 49, 55, 122, -30, 262, -144, -251, 480, -122, 70, 281, 134, -29, -16, -172, -98, 423, 149, -32, -211, -83, -237, 103, -100, -127, -22, -214, -24]
$$ [...]
8191d0
##END NTUPLES=NMR FID
##END=
